{
    "name": "CORE-ATL-0",
    "ipaddress": "10.0.1.31",
    "port": "79999",
    "ostype": "cisco-ios",
    "current_state": 0,
    "deleted" : false,
    "online" : true,
    "actions" : {
        "reload" : {"action": "next_state"},
        "reset" : {"action": "reset_state"},
        "enable" : {"action": "turn_on"},
        "disable" : {"action": "turn_off"}
    },
    "config": "Building configuration...\r\n\r\nCurrent configuration : 6625 bytes\r\n!\r\n! Last configuration change at 00:54:40 UTC Wed Sep 1 2021 by ec2-user\r\n! NVRAM config last updated at 00:54:40 UTC Wed Sep 1 2021 by ec2-user\r\n!\r\nversion 15.5\r\nservice tcp-keepalives-out\r\nservice timestamps debug datetime msec\r\nservice timestamps log datetime msec\r\nservice password-encryption\r\nservice compress-config\r\nno platform punt-keepalive disable-kernel-core\r\nplatform console virtual\r\n!\r\nhostname CORE-ATL-0\r\n!\r\nboot-start-marker\r\nboot system :\r\nboot-end-marker\r\n!\r\n!\r\nlogging persistent size 1000000 filesize 8192 immediate\r\n!\r\nno aaa new-model\r\n!\r\n!\r\n!\r\n!\r\n!\r\n!\r\n!\r\n!\r\n!\r\n!\r\n!\r\n\r\n\r\n\r\n!\r\n!\r\n!\r\nlogin on-success log\r\n!\r\n!\r\n!\r\n!\r\n!\r\n!\r\n!\r\nsubscriber templating\r\n!\r\nmultilink bundle-name authenticated\r\n!\r\ncrypto pki trustpoint TP-self-signed-2651541731\r\n enrollment selfsigned\r\n subject-name cn=IOS-Self-Signed-Certificate-2651541731\r\n revocation-check none\r\n rsakeypair TP-self-signed-2651541731\r\n!\r\n!\r\ncrypto pki certificate chain TP-self-signed-2651541731\r\n certificate self-signed 01\r\n  3082022B 30820194 A0030201 02020101 300D0609 2A864886 F70D0101 05050030 \r\n  31312F30 2D060355 04031326 494F532D 53656C66 2D536967 6E65642D 43657274 \r\n  69666963 6174652D 32363531 35343137 3331301E 170D3138 30383239 31373033 \r\n  34385A17 0D323030 31303130 30303030 305A3031 312F302D 06035504 03132649 \r\n  4F532D53 656C662D 5369676E 65642D43 65727469 66696361 74652D32 36353135 \r\n  34313733 3130819F 300D0609 2A864886 F70D0101 01050003 818D0030 81890281 \r\n  8100B9C2 0B7AF6F6 BCDBAB55 7D9A0AFE D3214BC6 94F6DE34 5B68FD6E E145987F \r\n  81962C78 753604F1 0BEEA83A 3FBD3FBF 7A08C80B F40F0FB3 072E6C3F FD00EFAF \r\n  17A3E0E1 DFBEBB4D D8A2263A EB8E76FF 2BAF0244 6E112FF2 C04D6B74 B092AEDF \r\n  A77CB023 7225D7C9 336BEED7 CC57B5D8 50B14AEF B969883B D6DC982E B5EF2D20 \r\n  0F230203 010001A3 53305130 0F060355 1D130101 FF040530 030101FF 301F0603 \r\n  551D2304 18301680 14339D5C 1D5A36EA 18E3D524 A591C436 192E40D5 D7301D06 \r\n  03551D0E 04160414 339D5C1D 5A36EA18 E3D524A5 91C43619 2E40D5D7 300D0609 \r\n  2A864886 F70D0101 05050003 81810082 A6B69F88 4291F345 AB0C706D FB685C3B \r\n  BA29E96E B0777142 88A347A5 DDEAE3EE 941EE91F 1E538C0E DDA713ED A6486807 \r\n  6A9EE56C 8B8FBE33 9D57A5A8 33C4CE9B 2B678A44 341A0F40 AD30ED07 15BA63E4 \r\n  36690634 84F9EFEA 230B43D9 15E10002 0C43FC50 CB2FD50C A8A6516F 7F397E61 \r\n  F2A0CBC2 A48E898E 19EE590F 99912D\r\n  \tquit\r\nlicense udi pid CSR1000V sn 92QN4DDHCQA\r\n!\r\n!\r\nusername ec2-user privilege 15 secret 5 $1$NyT6$rLraHjnLXEDSjLIGmffux.\r\nusername cisco privilege 15 password 7 030752180500\r\n!\r\nredundancy\r\n!\r\n!\r\n!\r\n!\r\n!\r\n!\r\nip tcp window-size 8192\r\n! \r\n!\r\n!\r\n!\r\n!\r\n!\r\n!\r\n!\r\n!\r\n!\r\n!\r\n!\r\n!\r\n!\r\n!\r\ninterface Loopback101\r\n description THIS IS A TEST LOOPBACK\r\n no ip address\r\n!\r\ninterface Loopback102\r\n description THIS IS A TEST LOOPBACK\r\n no ip address\r\n!\r\ninterface VirtualPortGroup0\r\n ip address 192.168.35.101 255.255.255.0\r\n ip nat inside\r\n!\r\ninterface GigabitEthernet1\r\n ip address dhcp\r\n ip nat outside\r\n negotiation auto\r\n!\r\ninterface GigabitEthernet1.1\r\n description reserved for dev1\r\n!\r\ninterface GigabitEthernet1.2\r\n description reserved for dev2\r\n!\r\ninterface GigabitEthernet1.3\r\n description reserved for dev3\r\n encapsulation dot1Q 3 second-dot1q 10-200\r\n ip address 30.0.144.0 255.255.255.254\r\n!\r\ninterface GigabitEthernet1.4\r\n description reserved!\r\n encapsulation dot1Q 4 second-dot1q 100-200\r\n ip address 40.2.142.40 255.255.255.254\r\n!\r\ninterface GigabitEthernet1.7\r\n description Test\r\n encapsulation dot1Q 7 second-dot1q 10-200\r\n ip address 1.1.1.1 255.255.255.0\r\n!\r\ninterface GigabitEthernet1.12\r\n description TEST\r\n encapsulation dot1Q 12 second-dot1q 100-200\r\n ip address 40.0.142.40 255.255.255.0\r\n!\r\ninterface GigabitEthernet1.16\r\n description Port Turn Up Request from Itential\r\n encapsulation dot1Q 16 second-dot1q 10-200\r\n ip address 40.0.144.62 255.255.255.254\r\n!\r\ninterface GigabitEthernet1.17\r\n description Port Turn Up Request from Itential\r\n encapsulation dot1Q 17 second-dot1q 10-200\r\n ip address 40.0.144.68 255.255.255.254\r\n!\r\ninterface GigabitEthernet1.18\r\n description Port Turn Up Request from Itential\r\n encapsulation dot1Q 18 second-dot1q 10-200\r\n ip address 40.0.144.70 255.255.255.254\r\n!\r\ninterface GigabitEthernet1.19\r\n description Port Turn Up Request from Itential\r\n encapsulation dot1Q 19 second-dot1q 10-200\r\n ip address 40.0.144.80 255.255.255.254\r\n!\r\ninterface GigabitEthernet1.20\r\n description Port Turn Up Request from Itential\r\n encapsulation dot1Q 20 second-dot1q 10-200\r\n ip address 40.0.144.90 255.255.255.254\r\n!\r\ninterface GigabitEthernet1.21\r\n description Port Turn Up Request from Itential\r\n encapsulation dot1Q 21 second-dot1q 10-200\r\n ip address 40.0.144.92 255.255.255.254\r\n!\r\ninterface GigabitEthernet1.22\r\n description Port Turn Up Request from Itential\r\n encapsulation dot1Q 22 second-dot1q 10-200\r\n ip address 40.0.144.122 255.255.255.254\r\n!\r\ninterface GigabitEthernet1.24\r\n description Port Turn Up Request from Itential\r\n encapsulation dot1Q 24 second-dot1q 10-200\r\n ip address 40.0.144.126 255.255.255.254\r\n!\r\ninterface GigabitEthernet1.25\r\n description Port Turn Up Request from Itential\r\n encapsulation dot1Q 25 second-dot1q 10-200\r\n ip address 40.0.144.134 255.255.255.254\r\n!\r\ninterface GigabitEthernet1.26\r\n description Port Turn Up Request from Itential\r\n encapsulation dot1Q 26 second-dot1q 10-200\r\n ip address 40.0.144.138 255.255.255.254\r\n!\r\ninterface GigabitEthernet1.27\r\n description Port Turn Up Request from Itential\r\n encapsulation dot1Q 27 second-dot1q 10-200\r\n ip address 40.0.144.140 255.255.255.254\r\n!\r\ninterface GigabitEthernet1.100\r\n description lab\r\n!\r\ninterface GigabitEthernet1.518\r\n description Port Turn Up Request from Itential\r\n encapsulation dot1Q 518 second-dot1q 10-200\r\n ip address 30.0.148.0 255.255.255.254\r\n!\r\n!\r\nvirtual-service csr_mgmt\r\n ip shared host-interface GigabitEthernet1\r\n activate\r\n!\r\nip forward-protocol nd\r\n!\r\nno ip http server\r\nip http authentication local\r\nip http secure-server\r\nip ssh rsa keypair-name ssh-key\r\nip ssh version 2\r\nip ssh pubkey-chain\r\n  username ec2-user\r\n   key-hash ssh-rsa AB6694819452140F2AABB48553919F78 ec2-user\r\n!\r\nip access-list standard GQ_NAT_ACL\r\n permit 192.168.36.0 0.0.0.255\r\nip access-list standard GS_NAT_ACL\r\n permit 192.168.35.0 0.0.0.255\r\n!\r\nip access-list extended ALLOW-FROM-CORPIT-TO-ANY\r\n permit ip 10.10.10.0 0.0.0.255 any\r\n deny   ip any any\r\nip access-list extended ALLOW_CORPIT\r\n!\r\naccess-list 4 permit 144.133.188.232\r\naccess-list 4 permit 144.133.188.237\r\naccess-list 4 permit 144.133.188.239\r\naccess-list 4 permit 144.133.188.231\r\naccess-list 4 permit 192.168.10.200\r\naccess-list 4 permit 14.126.166.12\r\naccess-list 4 permit 10.126.166.15\r\naccess-list 4 permit 10.126.166.12\r\n!\r\nsnmp-server location itential-snmk\r\n!\r\n!\r\ncontrol-plane\r\n!\r\nbanner motd ^Ces^C\r\n!\r\nline con 0\r\n stopbits 1\r\nline vty 0 4\r\n login local\r\n transport input ssh\r\n!\r\nntp server pool.ntp.org minpoll 10\r\nntp server ntp.itential.io\r\n!\r\nend",
    "states" : [
        {
            "show ver": "Cisco IOS XE Software, Version 03.16.04a.S - Extended Support Release\r\nCisco IOS Software, CSR1000V Software (X86_64_LINUX_IOSD-UNIVERSALK9-M), Version 15.5(3)S4a, RELEASE SOFTWARE (fc1)\r\nTechnical Support: http:\/\/www.cisco.com\/techsupport\r\nCopyright (c) 1986-2016 by Cisco Systems, Inc.\r\nCompiled Tue 04-Oct-16 07:07 by mcpre\r\n\r\n\r\nCisco IOS-XE software, Copyright (c) 2005-2016 by cisco Systems, Inc.\r\nAll rights reserved.  Certain components of Cisco IOS-XE software are\r\nlicensed under the GNU General Public License (\"GPL\") Version 2.0.  The\r\nsoftware code licensed under GPL Version 2.0 is free software that comes\r\nwith ABSOLUTELY NO WARRANTY.  You can redistribute and\/or modify such\r\nGPL code under the terms of GPL Version 2.0.  For more details, see the\r\ndocumentation or \"License Notice\" file accompanying the IOS-XE software,\r\nor the applicable URL provided on the flyer accompanying the IOS-XE\r\nsoftware.\r\n\r\n\r\nROM: IOS-XE ROMMON\r\n\r\nCORE-ATL-0 uptime is 1 year, 17 weeks, 0 minutes\r\nUptime for this control processor is 1 year, 17 weeks, 6 minutes\r\nSystem returned to ROM by reload\r\nSystem restarted at 17:50:07 UTC Mon May 11 2020\r\nSystem image file is \"bootflash:packages.conf\"\r\nLast reload reason: <NULL>\r\n\r\n\r\n\r\nThis product contains cryptographic features and is subject to United\r\nStates and local country laws governing import, export, transfer and\r\nuse. Delivery of Cisco cryptographic products does not imply\r\nthird-party authority to import, export, distribute or use encryption.\r\nImporters, exporters, distributors and users are responsible for\r\ncompliance with U.S. and local country laws. By using this product you\r\nagree to comply with applicable laws and regulations. If you are unable\r\nto comply with U.S. and local laws, return this product immediately.\r\n\r\nA summary of U.S. laws governing Cisco cryptographic products may be found at:\r\nhttp:\/\/www.cisco.com\/wwl\/export\/crypto\/tool\/stqrg.html\r\n\r\nIf you require further assistance please contact us by sending email to\r\nexport@cisco.com.\r\n\r\nLicense Level: security\r\nLicense Type: Default. No valid license found.\r\nNext reload license Level: security\r\n\r\ncisco CSR1000V (VXE) processor (revision VXE) with 1672614K\/6147K bytes of memory.\r\nProcessor board ID 92QN4DDHCQA\r\n1 Gigabit Ethernet interface\r\n32768K bytes of non-volatile configuration memory.\r\n3603668K bytes of physical memory.\r\n7774207K bytes of virtual hard disk at bootflash:.\r\n\r\nConfiguration register is 0x2102",
            "show running config" : "Building configuration...\r\n\r\nCurrent configuration : 6625 bytes\r\n!\r\n! Last configuration change at 00:54:40 UTC Wed Sep 1 2021 by ec2-user\r\n! NVRAM config last updated at 00:54:40 UTC Wed Sep 1 2021 by ec2-user\r\n!\r\nversion 15.5\r\nservice tcp-keepalives-out\r\nservice timestamps debug datetime msec\r\nservice timestamps log datetime msec\r\nservice password-encryption\r\nservice compress-config\r\nno platform punt-keepalive disable-kernel-core\r\nplatform console virtual\r\n!\r\nhostname CORE-ATL-0\r\n!\r\nboot-start-marker\r\nboot system :\r\nboot-end-marker\r\n!\r\n!\r\nlogging persistent size 1000000 filesize 8192 immediate\r\n!\r\nno aaa new-model\r\n!\r\n!\r\n!\r\n!\r\n!\r\n!\r\n!\r\n!\r\n!\r\n!\r\n!\r\n\r\n\r\n\r\n!\r\n!\r\n!\r\nlogin on-success log\r\n!\r\n!\r\n!\r\n!\r\n!\r\n!\r\n!\r\nsubscriber templating\r\n!\r\nmultilink bundle-name authenticated\r\n!\r\ncrypto pki trustpoint TP-self-signed-2651541731\r\n enrollment selfsigned\r\n subject-name cn=IOS-Self-Signed-Certificate-2651541731\r\n revocation-check none\r\n rsakeypair TP-self-signed-2651541731\r\n!\r\n!\r\ncrypto pki certificate chain TP-self-signed-2651541731\r\n certificate self-signed 01\r\n  3082022B 30820194 A0030201 02020101 300D0609 2A864886 F70D0101 05050030 \r\n  31312F30 2D060355 04031326 494F532D 53656C66 2D536967 6E65642D 43657274 \r\n  69666963 6174652D 32363531 35343137 3331301E 170D3138 30383239 31373033 \r\n  34385A17 0D323030 31303130 30303030 305A3031 312F302D 06035504 03132649 \r\n  4F532D53 656C662D 5369676E 65642D43 65727469 66696361 74652D32 36353135 \r\n  34313733 3130819F 300D0609 2A864886 F70D0101 01050003 818D0030 81890281 \r\n  8100B9C2 0B7AF6F6 BCDBAB55 7D9A0AFE D3214BC6 94F6DE34 5B68FD6E E145987F \r\n  81962C78 753604F1 0BEEA83A 3FBD3FBF 7A08C80B F40F0FB3 072E6C3F FD00EFAF \r\n  17A3E0E1 DFBEBB4D D8A2263A EB8E76FF 2BAF0244 6E112FF2 C04D6B74 B092AEDF \r\n  A77CB023 7225D7C9 336BEED7 CC57B5D8 50B14AEF B969883B D6DC982E B5EF2D20 \r\n  0F230203 010001A3 53305130 0F060355 1D130101 FF040530 030101FF 301F0603 \r\n  551D2304 18301680 14339D5C 1D5A36EA 18E3D524 A591C436 192E40D5 D7301D06 \r\n  03551D0E 04160414 339D5C1D 5A36EA18 E3D524A5 91C43619 2E40D5D7 300D0609 \r\n  2A864886 F70D0101 05050003 81810082 A6B69F88 4291F345 AB0C706D FB685C3B \r\n  BA29E96E B0777142 88A347A5 DDEAE3EE 941EE91F 1E538C0E DDA713ED A6486807 \r\n  6A9EE56C 8B8FBE33 9D57A5A8 33C4CE9B 2B678A44 341A0F40 AD30ED07 15BA63E4 \r\n  36690634 84F9EFEA 230B43D9 15E10002 0C43FC50 CB2FD50C A8A6516F 7F397E61 \r\n  F2A0CBC2 A48E898E 19EE590F 99912D\r\n  \tquit\r\nlicense udi pid CSR1000V sn 92QN4DDHCQA\r\n!\r\n!\r\nusername ec2-user privilege 15 secret 5 $1$NyT6$rLraHjnLXEDSjLIGmffux.\r\nusername cisco privilege 15 password 7 030752180500\r\n!\r\nredundancy\r\n!\r\n!\r\n!\r\n!\r\n!\r\n!\r\nip tcp window-size 8192\r\n! \r\n!\r\n!\r\n!\r\n!\r\n!\r\n!\r\n!\r\n!\r\n!\r\n!\r\n!\r\n!\r\n!\r\n!\r\ninterface Loopback101\r\n description THIS IS A TEST LOOPBACK\r\n no ip address\r\n!\r\ninterface Loopback102\r\n description THIS IS A TEST LOOPBACK\r\n no ip address\r\n!\r\ninterface VirtualPortGroup0\r\n ip address 192.168.35.101 255.255.255.0\r\n ip nat inside\r\n!\r\ninterface GigabitEthernet1\r\n ip address dhcp\r\n ip nat outside\r\n negotiation auto\r\n!\r\ninterface GigabitEthernet1.1\r\n description reserved for dev1\r\n!\r\ninterface GigabitEthernet1.2\r\n description reserved for dev2\r\n!\r\ninterface GigabitEthernet1.3\r\n description reserved for dev3\r\n encapsulation dot1Q 3 second-dot1q 10-200\r\n ip address 30.0.144.0 255.255.255.254\r\n!\r\ninterface GigabitEthernet1.4\r\n description reserved!\r\n encapsulation dot1Q 4 second-dot1q 100-200\r\n ip address 40.2.142.40 255.255.255.254\r\n!\r\ninterface GigabitEthernet1.7\r\n description Test\r\n encapsulation dot1Q 7 second-dot1q 10-200\r\n ip address 1.1.1.1 255.255.255.0\r\n!\r\ninterface GigabitEthernet1.12\r\n description TEST\r\n encapsulation dot1Q 12 second-dot1q 100-200\r\n ip address 40.0.142.40 255.255.255.0\r\n!\r\ninterface GigabitEthernet1.16\r\n description Port Turn Up Request from Itential\r\n encapsulation dot1Q 16 second-dot1q 10-200\r\n ip address 40.0.144.62 255.255.255.254\r\n!\r\ninterface GigabitEthernet1.17\r\n description Port Turn Up Request from Itential\r\n encapsulation dot1Q 17 second-dot1q 10-200\r\n ip address 40.0.144.68 255.255.255.254\r\n!\r\ninterface GigabitEthernet1.18\r\n description Port Turn Up Request from Itential\r\n encapsulation dot1Q 18 second-dot1q 10-200\r\n ip address 40.0.144.70 255.255.255.254\r\n!\r\ninterface GigabitEthernet1.19\r\n description Port Turn Up Request from Itential\r\n encapsulation dot1Q 19 second-dot1q 10-200\r\n ip address 40.0.144.80 255.255.255.254\r\n!\r\ninterface GigabitEthernet1.20\r\n description Port Turn Up Request from Itential\r\n encapsulation dot1Q 20 second-dot1q 10-200\r\n ip address 40.0.144.90 255.255.255.254\r\n!\r\ninterface GigabitEthernet1.21\r\n description Port Turn Up Request from Itential\r\n encapsulation dot1Q 21 second-dot1q 10-200\r\n ip address 40.0.144.92 255.255.255.254\r\n!\r\ninterface GigabitEthernet1.22\r\n description Port Turn Up Request from Itential\r\n encapsulation dot1Q 22 second-dot1q 10-200\r\n ip address 40.0.144.122 255.255.255.254\r\n!\r\ninterface GigabitEthernet1.24\r\n description Port Turn Up Request from Itential\r\n encapsulation dot1Q 24 second-dot1q 10-200\r\n ip address 40.0.144.126 255.255.255.254\r\n!\r\ninterface GigabitEthernet1.25\r\n description Port Turn Up Request from Itential\r\n encapsulation dot1Q 25 second-dot1q 10-200\r\n ip address 40.0.144.134 255.255.255.254\r\n!\r\ninterface GigabitEthernet1.26\r\n description Port Turn Up Request from Itential\r\n encapsulation dot1Q 26 second-dot1q 10-200\r\n ip address 40.0.144.138 255.255.255.254\r\n!\r\ninterface GigabitEthernet1.27\r\n description Port Turn Up Request from Itential\r\n encapsulation dot1Q 27 second-dot1q 10-200\r\n ip address 40.0.144.140 255.255.255.254\r\n!\r\ninterface GigabitEthernet1.100\r\n description lab\r\n!\r\ninterface GigabitEthernet1.518\r\n description Port Turn Up Request from Itential\r\n encapsulation dot1Q 518 second-dot1q 10-200\r\n ip address 30.0.148.0 255.255.255.254\r\n!\r\n!\r\nvirtual-service csr_mgmt\r\n ip shared host-interface GigabitEthernet1\r\n activate\r\n!\r\nip forward-protocol nd\r\n!\r\nno ip http server\r\nip http authentication local\r\nip http secure-server\r\nip ssh rsa keypair-name ssh-key\r\nip ssh version 2\r\nip ssh pubkey-chain\r\n  username ec2-user\r\n   key-hash ssh-rsa AB6694819452140F2AABB48553919F78 ec2-user\r\n!\r\nip access-list standard GQ_NAT_ACL\r\n permit 192.168.36.0 0.0.0.255\r\nip access-list standard GS_NAT_ACL\r\n permit 192.168.35.0 0.0.0.255\r\n!\r\nip access-list extended ALLOW-FROM-CORPIT-TO-ANY\r\n permit ip 10.10.10.0 0.0.0.255 any\r\n deny   ip any any\r\nip access-list extended ALLOW_CORPIT\r\n!\r\naccess-list 4 permit 144.133.188.232\r\naccess-list 4 permit 144.133.188.237\r\naccess-list 4 permit 144.133.188.239\r\naccess-list 4 permit 144.133.188.231\r\naccess-list 4 permit 192.168.10.200\r\naccess-list 4 permit 14.126.166.12\r\naccess-list 4 permit 10.126.166.15\r\naccess-list 4 permit 10.126.166.12\r\n!\r\nsnmp-server location itential-snmk\r\n!\r\n!\r\ncontrol-plane\r\n!\r\nbanner motd ^Ces^C\r\n!\r\nline con 0\r\n stopbits 1\r\nline vty 0 4\r\n login local\r\n transport input ssh\r\n!\r\nntp server pool.ntp.org minpoll 10\r\nntp server ntp.itential.io\r\n!\r\nend",
            "show ip int br" : "Interface              IP-Address      OK? Method Status                Protocol\r\nGigabitEthernet1       10.11.1.222     YES DHCP   up                    up      \r\nGigabitEthernet1.1     unassigned      YES manual up                    up      \r\nGigabitEthernet1.2     unassigned      YES manual up                    up      \r\nGigabitEthernet1.3     30.0.144.0      YES manual up                    up      \r\nGigabitEthernet1.4     40.2.142.40     YES manual up                    up      \r\nGigabitEthernet1.5     unassigned      YES manual deleted               down    \r\nGigabitEthernet1.6     unassigned      YES manual deleted               down    \r\nGigabitEthernet1.7     1.1.1.1         YES manual up                    up      \r\nGigabitEthernet1.8     unassigned      YES manual deleted               down    \r\nGigabitEthernet1.9     unassigned      YES manual deleted               down    \r\nGigabitEthernet1.10    unassigned      YES manual deleted               down    \r\nGigabitEthernet1.11    unassigned      YES manual deleted               down    \r\nGigabitEthernet1.12    40.0.142.40     YES manual up                    up      \r\nGigabitEthernet1.13    unassigned      YES manual deleted               down    \r\nGigabitEthernet1.14    unassigned      YES manual deleted               down    \r\nGigabitEthernet1.15    unassigned      YES manual deleted               down    \r\nGigabitEthernet1.16    40.0.144.62     YES manual up                    up      \r\nGigabitEthernet1.17    40.0.144.68     YES manual up                    up      \r\nGigabitEthernet1.18    40.0.144.70     YES manual up                    up      \r\nGigabitEthernet1.19    40.0.144.80     YES manual up                    up      \r\nGigabitEthernet1.20    40.0.144.90     YES manual up                    up      \r\nGigabitEthernet1.21    40.0.144.92     YES manual up                    up      \r\nGigabitEthernet1.22    40.0.144.122    YES manual up                    up      \r\nGigabitEthernet1.23    unassigned      YES manual deleted               down    \r\nGigabitEthernet1.24    40.0.144.126    YES manual up                    up      \r\nGigabitEthernet1.25    40.0.144.134    YES manual up                    up      \r\nGigabitEthernet1.26    40.0.144.138    YES manual up                    up      \r\nGigabitEthernet1.27    40.0.144.140    YES manual up                    up      \r\nGigabitEthernet1.28    unassigned      YES manual deleted               down    \r\nGigabitEthernet1.29    unassigned      YES manual deleted               down    \r\nGigabitEthernet1.31    unassigned      YES manual deleted               down    \r\nGigabitEthernet1.32    unassigned      YES manual deleted               down    \r\nGigabitEthernet1.33    unassigned      YES manual deleted               down    \r\nGigabitEthernet1.34    unassigned      YES manual deleted               down    \r\nGigabitEthernet1.35    unassigned      YES manual deleted               down    \r\nGigabitEthernet1.36    unassigned      YES manual deleted               down    \r\nGigabitEthernet1.37    unassigned      YES manual deleted               down    \r\nGigabitEthernet1.38    unassigned      YES manual deleted               down    \r\nGigabitEthernet1.39    unassigned      YES manual deleted               down    \r\nGigabitEthernet1.40    unassigned      YES manual deleted               down    \r\nGigabitEthernet1.41    unassigned      YES manual deleted               down    \r\nGigabitEthernet1.42    unassigned      YES manual deleted               down    \r\nGigabitEthernet1.43    unassigned      YES manual deleted               down    \r\nGigabitEthernet1.44    unassigned      YES manual deleted               down    \r\nGigabitEthernet1.45    unassigned      YES manual deleted               down    \r\nGigabitEthernet1.46    unassigned      YES manual deleted               down    \r\nGigabitEthernet1.47    unassigned      YES manual deleted               down    \r\nGigabitEthernet1.48    unassigned      YES manual deleted               down    \r\nGigabitEthernet1.49    unassigned      YES manual deleted               down    \r\nGigabitEthernet1.50    unassigned      YES manual deleted               down    \r\nGigabitEthernet1.51    unassigned      YES manual deleted               down    \r\nGigabitEthernet1.52    unassigned      YES manual deleted               down    \r\nGigabitEthernet1.53    unassigned      YES manual deleted               down    \r\nGigabitEthernet1.54    unassigned      YES manual deleted               down    \r\nGigabitEthernet1.55    unassigned      YES manual deleted               down    \r\nGigabitEthernet1.56    unassigned      YES manual deleted               down    \r\nGigabitEthernet1.57    unassigned      YES manual deleted               down    \r\nGigabitEthernet1.58    unassigned      YES manual deleted               down    \r\nGigabitEthernet1.59    unassigned      YES manual deleted               down    \r\nGigabitEthernet1.61    unassigned      YES manual deleted               down    \r\nGigabitEthernet1.63    unassigned      YES manual deleted               down    \r\nGigabitEthernet1.64    unassigned      YES manual deleted               down    \r\nGigabitEthernet1.65    unassigned      YES manual deleted               down    \r\nGigabitEthernet1.66    unassigned      YES manual deleted               down    \r\nGigabitEthernet1.67    unassigned      YES manual deleted               down    \r\nGigabitEthernet1.68    unassigned      YES manual deleted               down    \r\nGigabitEthernet1.69    unassigned      YES manual deleted               down    \r\nGigabitEthernet1.70    unassigned      YES manual deleted               down    \r\nGigabitEthernet1.73    unassigned      YES manual deleted               down    \r\nGigabitEthernet1.74    unassigned      YES manual deleted               down    \r\nGigabitEthernet1.75    unassigned      YES manual deleted               down    \r\nGigabitEthernet1.76    unassigned      YES manual deleted               down    \r\nGigabitEthernet1.77    unassigned      YES manual deleted               down    \r\nGigabitEthernet1.78    unassigned      YES manual deleted               down    \r\nGigabitEthernet1.84    unassigned      YES manual deleted               down    \r\nGigabitEthernet1.85    unassigned      YES manual deleted               down    \r\nGigabitEthernet1.86    unassigned      YES manual deleted               down    \r\nGigabitEthernet1.87    unassigned      YES manual deleted               down    \r\nGigabitEthernet1.88    unassigned      YES manual deleted               down    \r\nGigabitEthernet1.95    unassigned      YES manual deleted               down    \r\nGigabitEthernet1.100   unassigned      YES manual up                    up      \r\nGigabitEthernet1.518   30.0.148.0      YES manual up                    up      \r\nLoopback101            unassigned      YES unset  up                    up      \r\nLoopback102            unassigned      YES unset  up                    up      \r\nVirtualPortGroup0      192.168.35.101  YES manual down                  down",
            "show license" : "Index 1 Feature: security\nIndex 2 Feature: internal_service",
            "show clock" : "17:50:57.029 UTC Tue Sep 7 2021",
            "show ntp status" : "Clock is synchronized, stratum 4, reference is 4.53.160.75    \r\nnominal freq is 250.0000 Hz, actual freq is 249.9993 Hz, precision is 2**10\r\nntp uptime is 4181760600 (1\/100 of seconds), resolution is 4016\r\nreference time is E4E22279.404189E8 (17:40:09.251 UTC Tue Sep 7 2021)\r\nclock offset is 1.5660 msec, root delay is 53.47 msec\r\nroot dispersion is 116.11 msec, peer dispersion is 20.62 msec\r\nloopfilter state is 'CTRL' (Normal Controlled Loop), drift is 0.000002619 s\/s\r\nsystem poll interval is 1024, last update was 648 sec ago.",
            "show memory statistics" : "                Head    Total(b)     Used(b)     Free(b)   Lowest(b)  Largest(b)\r\nProcessor  7F6A6B8F0010   1712527552   238609640   1473917912   1440257872   921904364\r\n lsmpi_io  7F6A2F2EE1A8     6295128     6294304         824         824         412",
            "show logging" : "Syslog logging: enabled (0 messages dropped, 2 messages rate-limited, 0 flushes, 0 overruns, xml disabled, filtering disabled)\r\n\r\nNo Active Message Discriminator.\r\n\r\n\r\n\r\nNo Inactive Message Discriminator.\r\n\r\n\r\n    Console logging: level debugging, 4103 messages logged, xml disabled,\r\n                     filtering disabled\r\n    Monitor logging: level debugging, 0 messages logged, xml disabled,\r\n                     filtering disabled\r\n    Buffer logging:  level debugging, 4103 messages logged, xml disabled,\r\n                    filtering disabled\r\n    Exception Logging: size (4096 bytes)\r\n    Count and timestamp logging messages: disabled\r\n    Persistent logging: enabled, url bootflash:\/syslog, disk space 1000000 bytes, file size 8192 bytes, batch size 4096 bytes, threshold capacity 0  , immediate  \r\n\r\nNo active filter modules.\r\n\r\n    Trap logging: level informational, 4105 message lines logged\r\n        Logging Source-Interface:       VRF Name:\r\n\r\nLog Buffer (4096 bytes):\r\n1.119)\r\nSep  7 11:11:09.071: %SEC_LOGIN-5-LOGIN_SUCCESS: Login Success [user: ec2-user] [Source: 10.11.1.119] [localport: 22] at 11:11:09 UTC Tue Sep 7 2021\r\nSep  7 11:11:40.157: %SYS-6-LOGOUT: User ec2-user has exited tty session 1(10.11.1.119)\r\nSep  7 13:13:01.578: %SEC_LOGIN-5-LOGIN_SUCCESS: Login Success [user: ec2-user] [Source: 10.11.1.119] [localport: 22] at 13:13:01 UTC Tue Sep 7 2021\r\nSep  7 13:13:32.159: %SYS-6-LOGOUT: User ec2-user has exited tty session 1(10.11.1.119)\r\nSep  7 13:17:03.385: %SEC_LOGIN-5-LOGIN_SUCCESS: Login Success [user: ec2-user] [Source: 10.11.1.119] [localport: 22] at 13:17:03 UTC Tue Sep 7 2021\r\nSep  7 13:17:49.159: %SYS-6-LOGOUT: User ec2-user has exited tty session 1(10.11.1.119)\r\nSep  7 13:21:52.411: %SEC_LOGIN-5-LOGIN_SUCCESS: Login Success [user: ec2-user] [Source: 10.11.1.119] [localport: 22] at 13:21:52 UTC Tue Sep 7 2021\r\nSep  7 13:22:23.159: %SYS-6-LOGOUT: User ec2-user has exited tty session 1(10.11.1.119)\r\nSep  7 13:22:25.214: %SEC_LOGIN-5-LOGIN_SUCCESS: Login Success [user: ec2-user] [Source: 10.11.1.119] [localport: 22] at 13:22:25 UTC Tue Sep 7 2021\r\nSep  7 13:22:56.158: %SYS-6-LOGOUT: User ec2-user has exited tty session 1(10.11.1.119)\r\nSep  7 14:12:29.946: %SEC_LOGIN-5-LOGIN_SUCCESS: Login Success [user: ec2-user] [Source: 10.11.1.119] [localport: 22] at 14:12:29 UTC Tue Sep 7 2021\r\nSep  7 14:13:16.159: %SYS-6-LOGOUT: User ec2-user has exited tty session 1(10.11.1.119)\r\nSep  7 14:20:45.025: %SEC_LOGIN-5-LOGIN_SUCCESS: Login Success [user: ec2-user] [Source: 10.11.1.119] [localport: 22] at 14:20:45 UTC Tue Sep 7 2021\r\nSep  7 14:21:16.159: %SYS-6-LOGOUT: User ec2-user has exited tty session 1(10.11.1.119)\r\nSep  7 14:21:17.867: %SEC_LOGIN-5-LOGIN_SUCCESS: Login Success [user: ec2-user] [Source: 10.11.1.119] [localport: 22] at 14:21:17 UTC Tue Sep 7 2021\r\nSep  7 14:21:49.159: %SYS-6-LOGOUT: User ec2-user has exited tty session 1(10.11.1.119)\r\nSep  7 14:29:02.582: %SEC_LOGIN-5-LOGIN_SUCCESS: Login Success [user: ec2-user] [Source: 10.11.1.119] [localport: 22] at 14:29:02 UTC Tue Sep 7 2021\r\nSep  7 14:29:57.158: %SYS-6-LOGOUT: User ec2-user has exited tty session 1(10.11.1.119)\r\nSep  7 14:34:51.970: %SEC_LOGIN-5-LOGIN_SUCCESS: Login Success [user: ec2-user] [Source: 10.11.1.119] [localport: 22] at 14:34:51 UTC Tue Sep 7 2021\r\nSep  7 14:35:23.158: %SYS-6-LOGOUT: User ec2-user has exited tty session 1(10.11.1.119)\r\nSep  7 14:35:49.048: %SEC_LOGIN-5-LOGIN_SUCCESS: Login Success [user: ec2-user] [Source: 10.11.1.119] [localport: 22] at 14:35:49 UTC Tue Sep 7 2021\r\nSep  7 14:36:20.159: %SYS-6-LOGOUT: User ec2-user has exited tty session 1(10.11.1.119)\r\nSep  7 15:04:22.348: %SEC_LOGIN-5-LOGIN_SUCCESS: Login Success [user: ec2-user] [Source: 10.11.1.119] [localport: 22] at 15:04:22 UTC Tue Sep 7 2021\r\nSep  7 15:04:23.048: %SEC_LOGIN-5-LOGIN_SUCCESS: Login Success [user: ec2-user] [Source: 10.11.1.119] [localport: 22] at 15:04:23 UTC Tue Sep 7 2021\r\nSep  7 15:04:53.159: %SYS-6-LOGOUT: User ec2-user has exited tty session 1(10.11.1.119)\r\nSep  7 16:34:19.443: %SEC_LOGIN-5-LOGIN_SUCCESS: Login Success [user: ec2-user] [Source: 10.11.1.119] [localport: 22] at 16:34:19 UTC Tue Sep 7 2021\r\nSep  7 16:34:50.160: %SYS-6-LOGOUT: User ec2-user has exited tty session 1(10.11.1.119)\r\nSep  7 16:34:55.192: %SEC_LOGIN-5-LOGIN_SUCCESS: Login Success [user: ec2-user] [Source: 10.11.1.119] [localport: 22] at 16:34:55 UTC Tue Sep 7 2021\r\nSep  7 16:35:26.155: %SYS-6-LOGOUT: User ec2-user has exited tty session 1(10.11.1.119)\r\nSep  7 16:38:38.109: %SEC_LOGIN-5-LOGIN_SUCCESS: Login Success [user: ec2-user] [Source: 10.11.1.119] [localport: 22] at 16:38:38 UTC Tue Sep 7 2021\r\nSep  7 16:39:09.157: %SYS-6-LOGOUT: User ec2-user has exited tty session 1(10.11.1.119)\r\nSep  7 16:39:14.494: %SEC_LOGIN-5-LOGIN_SUCCESS: Login Success [user: ec2-user] [Source: 10.11.1.119] [localport: 22] at 16:39:14 UTC Tue Sep 7 2021\r\nSep  7 16:39:45.156: %SYS-6-LOGOUT: User ec2-user has exited tty session 1(10.11.1.119)\r\nSep  7 17:50:52.667: %SEC_LOGIN-5-LOGIN_SUCCESS: Login Success [user: ec2-user] [Source: 10.11.1.119] [localport: 22] at 17:50:52 UTC Tue Sep 7 2021"
        },
        {
            "show ver": "Cisco IOS XE Software, Version 03.17.04a.S - Extended Support Release\r\nCisco IOS Software, CSR1000V Software (X86_64_LINUX_IOSD-UNIVERSALK9-M), Version 15.5(3)S4a, RELEASE SOFTWARE (fc1)\r\nTechnical Support: http:\/\/www.cisco.com\/techsupport\r\nCopyright (c) 1986-2016 by Cisco Systems, Inc.\r\nCompiled Tue 04-Oct-16 07:07 by mcpre\r\n\r\n\r\nCisco IOS-XE software, Copyright (c) 2005-2016 by cisco Systems, Inc.\r\nAll rights reserved.  Certain components of Cisco IOS-XE software are\r\nlicensed under the GNU General Public License (\"GPL\") Version 2.0.  The\r\nsoftware code licensed under GPL Version 2.0 is free software that comes\r\nwith ABSOLUTELY NO WARRANTY.  You can redistribute and\/or modify such\r\nGPL code under the terms of GPL Version 2.0.  For more details, see the\r\ndocumentation or \"License Notice\" file accompanying the IOS-XE software,\r\nor the applicable URL provided on the flyer accompanying the IOS-XE\r\nsoftware.\r\n\r\n\r\nROM: IOS-XE ROMMON\r\n\r\nCORE-ATL-0 uptime is 1 year, 17 weeks, 0 minutes\r\nUptime for this control processor is 1 year, 17 weeks, 6 minutes\r\nSystem returned to ROM by reload\r\nSystem restarted at 17:50:07 UTC Mon May 11 2020\r\nSystem image file is \"bootflash:packages.conf\"\r\nLast reload reason: <NULL>\r\n\r\n\r\n\r\nThis product contains cryptographic features and is subject to United\r\nStates and local country laws governing import, export, transfer and\r\nuse. Delivery of Cisco cryptographic products does not imply\r\nthird-party authority to import, export, distribute or use encryption.\r\nImporters, exporters, distributors and users are responsible for\r\ncompliance with U.S. and local country laws. By using this product you\r\nagree to comply with applicable laws and regulations. If you are unable\r\nto comply with U.S. and local laws, return this product immediately.\r\n\r\nA summary of U.S. laws governing Cisco cryptographic products may be found at:\r\nhttp:\/\/www.cisco.com\/wwl\/export\/crypto\/tool\/stqrg.html\r\n\r\nIf you require further assistance please contact us by sending email to\r\nexport@cisco.com.\r\n\r\nLicense Level: security\r\nLicense Type: Default. No valid license found.\r\nNext reload license Level: security\r\n\r\ncisco CSR1000V (VXE) processor (revision VXE) with 1672614K\/6147K bytes of memory.\r\nProcessor board ID 92QN4DDHCQA\r\n1 Gigabit Ethernet interface\r\n32768K bytes of non-volatile configuration memory.\r\n3603668K bytes of physical memory.\r\n7774207K bytes of virtual hard disk at bootflash:.\r\n\r\nConfiguration register is 0x2102",
            "show running config" : "Building configuration...\r\n\r\nCurrent configuration : 6625 bytes\r\n!\r\n! Last configuration change at 00:54:40 UTC Wed Sep 1 2021 by ec2-user\r\n! NVRAM config last updated at 00:54:40 UTC Wed Sep 1 2021 by ec2-user\r\n!\r\nversion 15.5\r\nservice tcp-keepalives-out\r\nservice timestamps debug datetime msec\r\nservice timestamps log datetime msec\r\nservice password-encryption\r\nservice compress-config\r\nno platform punt-keepalive disable-kernel-core\r\nplatform console virtual\r\n!\r\nhostname CORE-ATL-0\r\n!\r\nboot-start-marker\r\nboot system :\r\nboot-end-marker\r\n!\r\n!\r\nlogging persistent size 1000000 filesize 8192 immediate\r\n!\r\nno aaa new-model\r\n!\r\n!\r\n!\r\n!\r\n!\r\n!\r\n!\r\n!\r\n!\r\n!\r\n!\r\n\r\n\r\n\r\n!\r\n!\r\n!\r\nlogin on-success log\r\n!\r\n!\r\n!\r\n!\r\n!\r\n!\r\n!\r\nsubscriber templating\r\n!\r\nmultilink bundle-name authenticated\r\n!\r\ncrypto pki trustpoint TP-self-signed-2651541731\r\n enrollment selfsigned\r\n subject-name cn=IOS-Self-Signed-Certificate-2651541731\r\n revocation-check none\r\n rsakeypair TP-self-signed-2651541731\r\n!\r\n!\r\ncrypto pki certificate chain TP-self-signed-2651541731\r\n certificate self-signed 01\r\n  3082022B 30820194 A0030201 02020101 300D0609 2A864886 F70D0101 05050030 \r\n  31312F30 2D060355 04031326 494F532D 53656C66 2D536967 6E65642D 43657274 \r\n  69666963 6174652D 32363531 35343137 3331301E 170D3138 30383239 31373033 \r\n  34385A17 0D323030 31303130 30303030 305A3031 312F302D 06035504 03132649 \r\n  4F532D53 656C662D 5369676E 65642D43 65727469 66696361 74652D32 36353135 \r\n  34313733 3130819F 300D0609 2A864886 F70D0101 01050003 818D0030 81890281 \r\n  8100B9C2 0B7AF6F6 BCDBAB55 7D9A0AFE D3214BC6 94F6DE34 5B68FD6E E145987F \r\n  81962C78 753604F1 0BEEA83A 3FBD3FBF 7A08C80B F40F0FB3 072E6C3F FD00EFAF \r\n  17A3E0E1 DFBEBB4D D8A2263A EB8E76FF 2BAF0244 6E112FF2 C04D6B74 B092AEDF \r\n  A77CB023 7225D7C9 336BEED7 CC57B5D8 50B14AEF B969883B D6DC982E B5EF2D20 \r\n  0F230203 010001A3 53305130 0F060355 1D130101 FF040530 030101FF 301F0603 \r\n  551D2304 18301680 14339D5C 1D5A36EA 18E3D524 A591C436 192E40D5 D7301D06 \r\n  03551D0E 04160414 339D5C1D 5A36EA18 E3D524A5 91C43619 2E40D5D7 300D0609 \r\n  2A864886 F70D0101 05050003 81810082 A6B69F88 4291F345 AB0C706D FB685C3B \r\n  BA29E96E B0777142 88A347A5 DDEAE3EE 941EE91F 1E538C0E DDA713ED A6486807 \r\n  6A9EE56C 8B8FBE33 9D57A5A8 33C4CE9B 2B678A44 341A0F40 AD30ED07 15BA63E4 \r\n  36690634 84F9EFEA 230B43D9 15E10002 0C43FC50 CB2FD50C A8A6516F 7F397E61 \r\n  F2A0CBC2 A48E898E 19EE590F 99912D\r\n  \tquit\r\nlicense udi pid CSR1000V sn 92QN4DDHCQA\r\n!\r\n!\r\nusername ec2-user privilege 15 secret 5 $1$NyT6$rLraHjnLXEDSjLIGmffux.\r\nusername cisco privilege 15 password 7 030752180500\r\n!\r\nredundancy\r\n!\r\n!\r\n!\r\n!\r\n!\r\n!\r\nip tcp window-size 8192\r\n! \r\n!\r\n!\r\n!\r\n!\r\n!\r\n!\r\n!\r\n!\r\n!\r\n!\r\n!\r\n!\r\n!\r\n!\r\ninterface Loopback101\r\n description THIS IS A TEST LOOPBACK\r\n no ip address\r\n!\r\ninterface Loopback102\r\n description THIS IS A TEST LOOPBACK\r\n no ip address\r\n!\r\ninterface VirtualPortGroup0\r\n ip address 192.168.35.101 255.255.255.0\r\n ip nat inside\r\n!\r\ninterface GigabitEthernet1\r\n ip address dhcp\r\n ip nat outside\r\n negotiation auto\r\n!\r\ninterface GigabitEthernet1.1\r\n description reserved for dev1\r\n!\r\ninterface GigabitEthernet1.2\r\n description reserved for dev2\r\n!\r\ninterface GigabitEthernet1.3\r\n description reserved for dev3\r\n encapsulation dot1Q 3 second-dot1q 10-200\r\n ip address 30.0.144.0 255.255.255.254\r\n!\r\ninterface GigabitEthernet1.4\r\n description reserved!\r\n encapsulation dot1Q 4 second-dot1q 100-200\r\n ip address 40.2.142.40 255.255.255.254\r\n!\r\ninterface GigabitEthernet1.7\r\n description Test\r\n encapsulation dot1Q 7 second-dot1q 10-200\r\n ip address 1.1.1.1 255.255.255.0\r\n!\r\ninterface GigabitEthernet1.12\r\n description TEST\r\n encapsulation dot1Q 12 second-dot1q 100-200\r\n ip address 40.0.142.40 255.255.255.0\r\n!\r\ninterface GigabitEthernet1.16\r\n description Port Turn Up Request from Itential\r\n encapsulation dot1Q 16 second-dot1q 10-200\r\n ip address 40.0.144.62 255.255.255.254\r\n!\r\ninterface GigabitEthernet1.17\r\n description Port Turn Up Request from Itential\r\n encapsulation dot1Q 17 second-dot1q 10-200\r\n ip address 40.0.144.68 255.255.255.254\r\n!\r\ninterface GigabitEthernet1.18\r\n description Port Turn Up Request from Itential\r\n encapsulation dot1Q 18 second-dot1q 10-200\r\n ip address 40.0.144.70 255.255.255.254\r\n!\r\ninterface GigabitEthernet1.19\r\n description Port Turn Up Request from Itential\r\n encapsulation dot1Q 19 second-dot1q 10-200\r\n ip address 40.0.144.80 255.255.255.254\r\n!\r\ninterface GigabitEthernet1.20\r\n description Port Turn Up Request from Itential\r\n encapsulation dot1Q 20 second-dot1q 10-200\r\n ip address 40.0.144.90 255.255.255.254\r\n!\r\ninterface GigabitEthernet1.21\r\n description Port Turn Up Request from Itential\r\n encapsulation dot1Q 21 second-dot1q 10-200\r\n ip address 40.0.144.92 255.255.255.254\r\n!\r\ninterface GigabitEthernet1.22\r\n description Port Turn Up Request from Itential\r\n encapsulation dot1Q 22 second-dot1q 10-200\r\n ip address 40.0.144.122 255.255.255.254\r\n!\r\ninterface GigabitEthernet1.24\r\n description Port Turn Up Request from Itential\r\n encapsulation dot1Q 24 second-dot1q 10-200\r\n ip address 40.0.144.126 255.255.255.254\r\n!\r\ninterface GigabitEthernet1.25\r\n description Port Turn Up Request from Itential\r\n encapsulation dot1Q 25 second-dot1q 10-200\r\n ip address 40.0.144.134 255.255.255.254\r\n!\r\ninterface GigabitEthernet1.26\r\n description Port Turn Up Request from Itential\r\n encapsulation dot1Q 26 second-dot1q 10-200\r\n ip address 40.0.144.138 255.255.255.254\r\n!\r\ninterface GigabitEthernet1.27\r\n description Port Turn Up Request from Itential\r\n encapsulation dot1Q 27 second-dot1q 10-200\r\n ip address 40.0.144.140 255.255.255.254\r\n!\r\ninterface GigabitEthernet1.100\r\n description lab\r\n!\r\ninterface GigabitEthernet1.518\r\n description Port Turn Up Request from Itential\r\n encapsulation dot1Q 518 second-dot1q 10-200\r\n ip address 30.0.148.0 255.255.255.254\r\n!\r\n!\r\nvirtual-service csr_mgmt\r\n ip shared host-interface GigabitEthernet1\r\n activate\r\n!\r\nip forward-protocol nd\r\n!\r\nno ip http server\r\nip http authentication local\r\nip http secure-server\r\nip ssh rsa keypair-name ssh-key\r\nip ssh version 2\r\nip ssh pubkey-chain\r\n  username ec2-user\r\n   key-hash ssh-rsa AB6694819452140F2AABB48553919F78 ec2-user\r\n!\r\nip access-list standard GQ_NAT_ACL\r\n permit 192.168.36.0 0.0.0.255\r\nip access-list standard GS_NAT_ACL\r\n permit 192.168.35.0 0.0.0.255\r\n!\r\nip access-list extended ALLOW-FROM-CORPIT-TO-ANY\r\n permit ip 10.10.10.0 0.0.0.255 any\r\n deny   ip any any\r\nip access-list extended ALLOW_CORPIT\r\n!\r\naccess-list 4 permit 144.133.188.232\r\naccess-list 4 permit 144.133.188.237\r\naccess-list 4 permit 144.133.188.239\r\naccess-list 4 permit 144.133.188.231\r\naccess-list 4 permit 192.168.10.200\r\naccess-list 4 permit 14.126.166.12\r\naccess-list 4 permit 10.126.166.15\r\naccess-list 4 permit 10.126.166.12\r\n!\r\nsnmp-server location itential-snmk\r\n!\r\n!\r\ncontrol-plane\r\n!\r\nbanner motd ^Ces^C\r\n!\r\nline con 0\r\n stopbits 1\r\nline vty 0 4\r\n login local\r\n transport input ssh\r\n!\r\nntp server pool.ntp.org minpoll 10\r\nntp server ntp.itential.io\r\n!\r\nend",
            "show ip int br" : "Interface              IP-Address      OK? Method Status                Protocol\r\nGigabitEthernet1       10.11.1.222     YES DHCP   up                    up      \r\nGigabitEthernet1.1     unassigned      YES manual up                    up      \r\nGigabitEthernet1.2     unassigned      YES manual up                    up      \r\nGigabitEthernet1.3     30.0.144.0      YES manual up                    up      \r\nGigabitEthernet1.4     40.2.142.40     YES manual up                    up      \r\nGigabitEthernet1.5     unassigned      YES manual deleted               down    \r\nGigabitEthernet1.6     unassigned      YES manual deleted               down    \r\nGigabitEthernet1.7     1.1.1.1         YES manual up                    up      \r\nGigabitEthernet1.8     unassigned      YES manual deleted               down    \r\nGigabitEthernet1.9     unassigned      YES manual deleted               down    \r\nGigabitEthernet1.10    unassigned      YES manual deleted               down    \r\nGigabitEthernet1.11    unassigned      YES manual deleted               down    \r\nGigabitEthernet1.12    40.0.142.40     YES manual up                    up      \r\nGigabitEthernet1.13    unassigned      YES manual deleted               down    \r\nGigabitEthernet1.14    unassigned      YES manual deleted               down    \r\nGigabitEthernet1.15    unassigned      YES manual deleted               down    \r\nGigabitEthernet1.16    40.0.144.62     YES manual up                    up      \r\nGigabitEthernet1.17    40.0.144.68     YES manual up                    up      \r\nGigabitEthernet1.18    40.0.144.70     YES manual up                    up      \r\nGigabitEthernet1.19    40.0.144.80     YES manual up                    up      \r\nGigabitEthernet1.20    40.0.144.90     YES manual up                    up      \r\nGigabitEthernet1.21    40.0.144.92     YES manual up                    up      \r\nGigabitEthernet1.22    40.0.144.122    YES manual up                    up      \r\nGigabitEthernet1.23    unassigned      YES manual deleted               down    \r\nGigabitEthernet1.24    40.0.144.126    YES manual up                    up      \r\nGigabitEthernet1.25    40.0.144.134    YES manual up                    up      \r\nGigabitEthernet1.26    40.0.144.138    YES manual up                    up      \r\nGigabitEthernet1.27    40.0.144.140    YES manual up                    up      \r\nGigabitEthernet1.28    unassigned      YES manual deleted               down    \r\nGigabitEthernet1.29    unassigned      YES manual deleted               down    \r\nGigabitEthernet1.31    unassigned      YES manual deleted               down    \r\nGigabitEthernet1.32    unassigned      YES manual deleted               down    \r\nGigabitEthernet1.33    unassigned      YES manual deleted               down    \r\nGigabitEthernet1.34    unassigned      YES manual deleted               down    \r\nGigabitEthernet1.35    unassigned      YES manual deleted               down    \r\nGigabitEthernet1.36    unassigned      YES manual deleted               down    \r\nGigabitEthernet1.37    unassigned      YES manual deleted               down    \r\nGigabitEthernet1.38    unassigned      YES manual deleted               down    \r\nGigabitEthernet1.39    unassigned      YES manual deleted               down    \r\nGigabitEthernet1.40    unassigned      YES manual deleted               down    \r\nGigabitEthernet1.41    unassigned      YES manual deleted               down    \r\nGigabitEthernet1.42    unassigned      YES manual deleted               down    \r\nGigabitEthernet1.43    unassigned      YES manual deleted               down    \r\nGigabitEthernet1.44    unassigned      YES manual deleted               down    \r\nGigabitEthernet1.45    unassigned      YES manual deleted               down    \r\nGigabitEthernet1.46    unassigned      YES manual deleted               down    \r\nGigabitEthernet1.47    unassigned      YES manual deleted               down    \r\nGigabitEthernet1.48    unassigned      YES manual deleted               down    \r\nGigabitEthernet1.49    unassigned      YES manual deleted               down    \r\nGigabitEthernet1.50    unassigned      YES manual deleted               down    \r\nGigabitEthernet1.51    unassigned      YES manual deleted               down    \r\nGigabitEthernet1.52    unassigned      YES manual deleted               down    \r\nGigabitEthernet1.53    unassigned      YES manual deleted               down    \r\nGigabitEthernet1.54    unassigned      YES manual deleted               down    \r\nGigabitEthernet1.55    unassigned      YES manual deleted               down    \r\nGigabitEthernet1.56    unassigned      YES manual deleted               down    \r\nGigabitEthernet1.57    unassigned      YES manual deleted               down    \r\nGigabitEthernet1.58    unassigned      YES manual deleted               down    \r\nGigabitEthernet1.59    unassigned      YES manual deleted               down    \r\nGigabitEthernet1.61    unassigned      YES manual deleted               down    \r\nGigabitEthernet1.63    unassigned      YES manual deleted               down    \r\nGigabitEthernet1.64    unassigned      YES manual deleted               down    \r\nGigabitEthernet1.65    unassigned      YES manual deleted               down    \r\nGigabitEthernet1.66    unassigned      YES manual deleted               down    \r\nGigabitEthernet1.67    unassigned      YES manual deleted               down    \r\nGigabitEthernet1.68    unassigned      YES manual deleted               down    \r\nGigabitEthernet1.69    unassigned      YES manual deleted               down    \r\nGigabitEthernet1.70    unassigned      YES manual deleted               down    \r\nGigabitEthernet1.73    unassigned      YES manual deleted               down    \r\nGigabitEthernet1.74    unassigned      YES manual deleted               down    \r\nGigabitEthernet1.75    unassigned      YES manual deleted               down    \r\nGigabitEthernet1.76    unassigned      YES manual deleted               down    \r\nGigabitEthernet1.77    unassigned      YES manual deleted               down    \r\nGigabitEthernet1.78    unassigned      YES manual deleted               down    \r\nGigabitEthernet1.84    unassigned      YES manual deleted               down    \r\nGigabitEthernet1.85    unassigned      YES manual deleted               down    \r\nGigabitEthernet1.86    unassigned      YES manual deleted               down    \r\nGigabitEthernet1.87    unassigned      YES manual deleted               down    \r\nGigabitEthernet1.88    unassigned      YES manual deleted               down    \r\nGigabitEthernet1.95    unassigned      YES manual deleted               down    \r\nGigabitEthernet1.100   unassigned      YES manual up                    up      \r\nGigabitEthernet1.518   30.0.148.0      YES manual up                    up      \r\nLoopback101            unassigned      YES unset  up                    up      \r\nLoopback102            unassigned      YES unset  up                    up      \r\nVirtualPortGroup0      192.168.35.101  YES manual down                  down",
            "show license" : "Index 1 Feature: security\nIndex 2 Feature: internal_service",
            "show clock" : "17:50:57.029 UTC Tue Sep 7 2021",
            "show ntp status" : "Clock is synchronized, stratum 4, reference is 4.53.160.75    \r\nnominal freq is 250.0000 Hz, actual freq is 249.9993 Hz, precision is 2**10\r\nntp uptime is 4181760600 (1\/100 of seconds), resolution is 4016\r\nreference time is E4E22279.404189E8 (17:40:09.251 UTC Tue Sep 7 2021)\r\nclock offset is 1.5660 msec, root delay is 53.47 msec\r\nroot dispersion is 116.11 msec, peer dispersion is 20.62 msec\r\nloopfilter state is 'CTRL' (Normal Controlled Loop), drift is 0.000002619 s\/s\r\nsystem poll interval is 1024, last update was 648 sec ago.",
            "show memory statistics" : "                Head    Total(b)     Used(b)     Free(b)   Lowest(b)  Largest(b)\r\nProcessor  7F6A6B8F0010   1712527552   238609640   1473917912   1440257872   921904364\r\n lsmpi_io  7F6A2F2EE1A8     6295128     6294304         824         824         412",
            "show logging" : "Syslog logging: enabled (0 messages dropped, 2 messages rate-limited, 0 flushes, 0 overruns, xml disabled, filtering disabled)\r\n\r\nNo Active Message Discriminator.\r\n\r\n\r\n\r\nNo Inactive Message Discriminator.\r\n\r\n\r\n    Console logging: level debugging, 4103 messages logged, xml disabled,\r\n                     filtering disabled\r\n    Monitor logging: level debugging, 0 messages logged, xml disabled,\r\n                     filtering disabled\r\n    Buffer logging:  level debugging, 4103 messages logged, xml disabled,\r\n                    filtering disabled\r\n    Exception Logging: size (4096 bytes)\r\n    Count and timestamp logging messages: disabled\r\n    Persistent logging: enabled, url bootflash:\/syslog, disk space 1000000 bytes, file size 8192 bytes, batch size 4096 bytes, threshold capacity 0  , immediate  \r\n\r\nNo active filter modules.\r\n\r\n    Trap logging: level informational, 4105 message lines logged\r\n        Logging Source-Interface:       VRF Name:\r\n\r\nLog Buffer (4096 bytes):\r\n1.119)\r\nSep  7 11:11:09.071: %SEC_LOGIN-5-LOGIN_SUCCESS: Login Success [user: ec2-user] [Source: 10.11.1.119] [localport: 22] at 11:11:09 UTC Tue Sep 7 2021\r\nSep  7 11:11:40.157: %SYS-6-LOGOUT: User ec2-user has exited tty session 1(10.11.1.119)\r\nSep  7 13:13:01.578: %SEC_LOGIN-5-LOGIN_SUCCESS: Login Success [user: ec2-user] [Source: 10.11.1.119] [localport: 22] at 13:13:01 UTC Tue Sep 7 2021\r\nSep  7 13:13:32.159: %SYS-6-LOGOUT: User ec2-user has exited tty session 1(10.11.1.119)\r\nSep  7 13:17:03.385: %SEC_LOGIN-5-LOGIN_SUCCESS: Login Success [user: ec2-user] [Source: 10.11.1.119] [localport: 22] at 13:17:03 UTC Tue Sep 7 2021\r\nSep  7 13:17:49.159: %SYS-6-LOGOUT: User ec2-user has exited tty session 1(10.11.1.119)\r\nSep  7 13:21:52.411: %SEC_LOGIN-5-LOGIN_SUCCESS: Login Success [user: ec2-user] [Source: 10.11.1.119] [localport: 22] at 13:21:52 UTC Tue Sep 7 2021\r\nSep  7 13:22:23.159: %SYS-6-LOGOUT: User ec2-user has exited tty session 1(10.11.1.119)\r\nSep  7 13:22:25.214: %SEC_LOGIN-5-LOGIN_SUCCESS: Login Success [user: ec2-user] [Source: 10.11.1.119] [localport: 22] at 13:22:25 UTC Tue Sep 7 2021\r\nSep  7 13:22:56.158: %SYS-6-LOGOUT: User ec2-user has exited tty session 1(10.11.1.119)\r\nSep  7 14:12:29.946: %SEC_LOGIN-5-LOGIN_SUCCESS: Login Success [user: ec2-user] [Source: 10.11.1.119] [localport: 22] at 14:12:29 UTC Tue Sep 7 2021\r\nSep  7 14:13:16.159: %SYS-6-LOGOUT: User ec2-user has exited tty session 1(10.11.1.119)\r\nSep  7 14:20:45.025: %SEC_LOGIN-5-LOGIN_SUCCESS: Login Success [user: ec2-user] [Source: 10.11.1.119] [localport: 22] at 14:20:45 UTC Tue Sep 7 2021\r\nSep  7 14:21:16.159: %SYS-6-LOGOUT: User ec2-user has exited tty session 1(10.11.1.119)\r\nSep  7 14:21:17.867: %SEC_LOGIN-5-LOGIN_SUCCESS: Login Success [user: ec2-user] [Source: 10.11.1.119] [localport: 22] at 14:21:17 UTC Tue Sep 7 2021\r\nSep  7 14:21:49.159: %SYS-6-LOGOUT: User ec2-user has exited tty session 1(10.11.1.119)\r\nSep  7 14:29:02.582: %SEC_LOGIN-5-LOGIN_SUCCESS: Login Success [user: ec2-user] [Source: 10.11.1.119] [localport: 22] at 14:29:02 UTC Tue Sep 7 2021\r\nSep  7 14:29:57.158: %SYS-6-LOGOUT: User ec2-user has exited tty session 1(10.11.1.119)\r\nSep  7 14:34:51.970: %SEC_LOGIN-5-LOGIN_SUCCESS: Login Success [user: ec2-user] [Source: 10.11.1.119] [localport: 22] at 14:34:51 UTC Tue Sep 7 2021\r\nSep  7 14:35:23.158: %SYS-6-LOGOUT: User ec2-user has exited tty session 1(10.11.1.119)\r\nSep  7 14:35:49.048: %SEC_LOGIN-5-LOGIN_SUCCESS: Login Success [user: ec2-user] [Source: 10.11.1.119] [localport: 22] at 14:35:49 UTC Tue Sep 7 2021\r\nSep  7 14:36:20.159: %SYS-6-LOGOUT: User ec2-user has exited tty session 1(10.11.1.119)\r\nSep  7 15:04:22.348: %SEC_LOGIN-5-LOGIN_SUCCESS: Login Success [user: ec2-user] [Source: 10.11.1.119] [localport: 22] at 15:04:22 UTC Tue Sep 7 2021\r\nSep  7 15:04:23.048: %SEC_LOGIN-5-LOGIN_SUCCESS: Login Success [user: ec2-user] [Source: 10.11.1.119] [localport: 22] at 15:04:23 UTC Tue Sep 7 2021\r\nSep  7 15:04:53.159: %SYS-6-LOGOUT: User ec2-user has exited tty session 1(10.11.1.119)\r\nSep  7 16:34:19.443: %SEC_LOGIN-5-LOGIN_SUCCESS: Login Success [user: ec2-user] [Source: 10.11.1.119] [localport: 22] at 16:34:19 UTC Tue Sep 7 2021\r\nSep  7 16:34:50.160: %SYS-6-LOGOUT: User ec2-user has exited tty session 1(10.11.1.119)\r\nSep  7 16:34:55.192: %SEC_LOGIN-5-LOGIN_SUCCESS: Login Success [user: ec2-user] [Source: 10.11.1.119] [localport: 22] at 16:34:55 UTC Tue Sep 7 2021\r\nSep  7 16:35:26.155: %SYS-6-LOGOUT: User ec2-user has exited tty session 1(10.11.1.119)\r\nSep  7 16:38:38.109: %SEC_LOGIN-5-LOGIN_SUCCESS: Login Success [user: ec2-user] [Source: 10.11.1.119] [localport: 22] at 16:38:38 UTC Tue Sep 7 2021\r\nSep  7 16:39:09.157: %SYS-6-LOGOUT: User ec2-user has exited tty session 1(10.11.1.119)\r\nSep  7 16:39:14.494: %SEC_LOGIN-5-LOGIN_SUCCESS: Login Success [user: ec2-user] [Source: 10.11.1.119] [localport: 22] at 16:39:14 UTC Tue Sep 7 2021\r\nSep  7 16:39:45.156: %SYS-6-LOGOUT: User ec2-user has exited tty session 1(10.11.1.119)\r\nSep  7 17:50:52.667: %SEC_LOGIN-5-LOGIN_SUCCESS: Login Success [user: ec2-user] [Source: 10.11.1.119] [localport: 22] at 17:50:52 UTC Tue Sep 7 2021"
        }
    ]
  }