{
    "name": "ZRK001",
    "ipaddress": "192.168.1.1",
    "port": "20",
    "ostype": "dungeon-os",
    "current_state": 0,
    "deleted" : false,
    "online" : true,
    "actions" : {
        "move" : {"action": "next_state"},
        "restart" : {"action": "reset_state"},
        "sync" : {"action": "overwrite_config", "value":"inventory"}
    },
    "config" : "You are empty handed",
    "states" : [
        {
            "look" : "You are standing in an open field west of a white house, wih a boarded front door.\nThere is a small mailbox here.",
            "examine mailbox" : "The small mailbox is closed.",
            "inventory" : "You are empty-handed"
        },
        {
            "look" : "This is a forest, with trees in all directions. To the east, there appears to be sunlight.",
            "examine mailbox" : "You can't see any mailbox here.",
            "inventory" : "You are carrying:\n  A leaflet",
            "read leaflet" : "ZORK is a game of adventure, danger, and low cunning. In it you will explore some of the most amazing territory ever seen by mortals. No computer should be without one!"
        },
        {
            "look" : "You are in a clearing, with a forest surrounding you on all sides.  A path leads south.\nOn the ground is a pile of leaves.",
            "examine leaves" : "There's nothing special about the pile of leaves.",
            "inventory" : "You are carrying:\n  A leaflet"
        }
    ]
  }