{
  "id": "1284392014819",
  "type": "wanUtilization",
  "enabled": true,
  "alertCondition": {
    "duration": 60,
    "window": 600,
    "bit_rate_bps": 10000,
    "interface": "wan1"
  },
  "recipients": {
    "emails": [
      "admin@example.org"
    ],
    "httpServerIds": [
      "aHR0cHM6Ly93d3cuZXhhbXBsZS5jb20vcGF0aA=="
    ]
  },
  "networkTags": [
    "tag1",
    "tag2"
  ],
  "description": "WAN 1 high utilization"
}