{
  "$id": "schema.json",
  "type": "object",
  "schema": "http://json-schema.org/draft-07/schema#",
  "translate": false,
  "dynamicfields": true,
  "properties": {
    "ph_request_type": {
      "type": "string",
      "description": "type of request (internal to adapter)",
      "default": "getNetworkConnectionStats",
      "enum": [
        "getNetworkConnectionStats",
        "getNetworkDevicesConnectionStats",
        "getNetworkDeviceConnectionStats",
        "getNetworkDeviceConnectionStatsV1",
        "getNetworkClientsConnectionStats",
        "getNetworkClientConnectionStats",
        "getNetworkLatencyStats",
        "getNetworkDevicesLatencyStats",
        "getNetworkDeviceLatencyStats",
        "getNetworkDeviceLatencyStatsV1",
        "getNetworkClientsLatencyStats",
        "getNetworkClientLatencyStats",
        "getNetworkFailedConnections"
      ],
      "external_name": "ph_request_type"
    }
  },
  "definitions": {}
}