{
  "actions": [
    {
      "name": "listUserAccessDevicesAndItsTrustedAccessConnections",
      "protocol": "REST",
      "method": "GET",
      "entitypath": "{base_path}/{version}/networks/{pathv1}/sm/userAccessDevices?{query}",
      "requestSchema": "schema.json",
      "responseSchema": "schema.json",
      "timeout": 0,
      "sendEmpty": false,
      "sendGetBody": false,
      "requestDatatype": "JSON",
      "responseDatatype": "JSON",
      "headers": {},
      "responseObjects": [
        {
          "type": "default",
          "key": "",
          "mockFile": "mockdatafiles/listUserAccessDevicesAndItsTrustedAccessConnections-default.json"
        }
      ]
    },
    {
      "name": "deleteAUserAccessDevice",
      "protocol": "REST",
      "method": "DELETE",
      "entitypath": "{base_path}/{version}/networks/{pathv1}/sm/userAccessDevices/{pathv2}?{query}",
      "requestSchema": "schema.json",
      "responseSchema": "schema.json",
      "timeout": 0,
      "sendEmpty": false,
      "requestDatatype": "JSON",
      "responseDatatype": "JSON",
      "headers": {},
      "responseObjects": [
        {
          "type": "default",
          "key": "",
          "mockFile": ""
        }
      ]
    }
  ]
}