[
  {
    "mac": "00:11:22:33:44:55",
    "name": "My AP",
    "network": {
      "id": "N_24329156"
    },
    "productType": "switch",
    "serial": "Q234-ABCD-5678",
    "status": "online",
    "tags": [
      "tag1",
      "tag2"
    ]
  }
]