[
  {
    "application": "Gmail",
    "destination": null,
    "protocol": "TCP",
    "port": 443,
    "sent": 138,
    "recv": 61,
    "numClients": 7,
    "activeTime": 77000,
    "flows": 300
  }
]