[
  {
    "id": "1234",
    "organizationWide": false,
    "networkId": "N_1234",
    "type": "delete",
    "mac": "00:77:00:77:00:77",
    "datasets": "['usage', 'events']",
    "status": "Completed",
    "createdAt": 1524692227,
    "completedAt": 1524702227
  }
]