{
  "floorPlanId": "string",
  "imageUrl": "string",
  "imageUrlExpiresAt": "string",
  "imageExtension": "string",
  "imageMd5": "string",
  "name": "string",
  "devices": [
    {
      "name": "string",
      "lat": 7,
      "lng": 5,
      "serial": "string",
      "mac": "string",
      "model": "string",
      "address": "string",
      "notes": "string",
      "lanIp": "string",
      "tags": "string",
      "networkId": "string",
      "beaconIdParams": {
        "uuid": "string",
        "major": 3,
        "minor": 4
      },
      "firmware": "string",
      "floorPlanId": "string"
    },
    {
      "name": "string",
      "lat": 5,
      "lng": 6,
      "serial": "string",
      "mac": "string",
      "model": "string",
      "address": "string",
      "notes": "string",
      "lanIp": "string",
      "tags": "string",
      "networkId": "string",
      "beaconIdParams": {
        "uuid": "string",
        "major": 2,
        "minor": 2
      },
      "firmware": "string",
      "floorPlanId": "string"
    },
    {
      "name": "string",
      "lat": 10,
      "lng": 1,
      "serial": "string",
      "mac": "string",
      "model": "string",
      "address": "string",
      "notes": "string",
      "lanIp": "string",
      "tags": "string",
      "networkId": "string",
      "beaconIdParams": {
        "uuid": "string",
        "major": 3,
        "minor": 4
      },
      "firmware": "string",
      "floorPlanId": "string"
    },
    {
      "name": "string",
      "lat": 9,
      "lng": 1,
      "serial": "string",
      "mac": "string",
      "model": "string",
      "address": "string",
      "notes": "string",
      "lanIp": "string",
      "tags": "string",
      "networkId": "string",
      "beaconIdParams": {
        "uuid": "string",
        "major": 7,
        "minor": 7
      },
      "firmware": "string",
      "floorPlanId": "string"
    },
    {
      "name": "string",
      "lat": 3,
      "lng": 8,
      "serial": "string",
      "mac": "string",
      "model": "string",
      "address": "string",
      "notes": "string",
      "lanIp": "string",
      "tags": "string",
      "networkId": "string",
      "beaconIdParams": {
        "uuid": "string",
        "major": 7,
        "minor": 7
      },
      "firmware": "string",
      "floorPlanId": "string"
    },
    {
      "name": "string",
      "lat": 10,
      "lng": 1,
      "serial": "string",
      "mac": "string",
      "model": "string",
      "address": "string",
      "notes": "string",
      "lanIp": "string",
      "tags": "string",
      "networkId": "string",
      "beaconIdParams": {
        "uuid": "string",
        "major": 6,
        "minor": 6
      },
      "firmware": "string",
      "floorPlanId": "string"
    },
    {
      "name": "string",
      "lat": 9,
      "lng": 4,
      "serial": "string",
      "mac": "string",
      "model": "string",
      "address": "string",
      "notes": "string",
      "lanIp": "string",
      "tags": "string",
      "networkId": "string",
      "beaconIdParams": {
        "uuid": "string",
        "major": 2,
        "minor": 3
      },
      "firmware": "string",
      "floorPlanId": "string"
    },
    {
      "name": "string",
      "lat": 1,
      "lng": 8,
      "serial": "string",
      "mac": "string",
      "model": "string",
      "address": "string",
      "notes": "string",
      "lanIp": "string",
      "tags": "string",
      "networkId": "string",
      "beaconIdParams": {
        "uuid": "string",
        "major": 6,
        "minor": 3
      },
      "firmware": "string",
      "floorPlanId": "string"
    },
    {
      "name": "string",
      "lat": 1,
      "lng": 10,
      "serial": "string",
      "mac": "string",
      "model": "string",
      "address": "string",
      "notes": "string",
      "lanIp": "string",
      "tags": "string",
      "networkId": "string",
      "beaconIdParams": {
        "uuid": "string",
        "major": 10,
        "minor": 1
      },
      "firmware": "string",
      "floorPlanId": "string"
    },
    {
      "name": "string",
      "lat": 10,
      "lng": 3,
      "serial": "string",
      "mac": "string",
      "model": "string",
      "address": "string",
      "notes": "string",
      "lanIp": "string",
      "tags": "string",
      "networkId": "string",
      "beaconIdParams": {
        "uuid": "string",
        "major": 10,
        "minor": 7
      },
      "firmware": "string",
      "floorPlanId": "string"
    }
  ],
  "width": 3,
  "height": 7,
  "center": {
    "lat": 6,
    "lng": 6
  },
  "bottomLeftCorner": {
    "lat": 2,
    "lng": 4
  },
  "bottomRightCorner": {
    "lat": 9,
    "lng": 5
  },
  "topLeftCorner": {
    "lat": 1,
    "lng": 7
  },
  "topRightCorner": {
    "lat": 3,
    "lng": 6
  }
}