{
  "whitelistedRules": [
    {
      "ruleId": "meraki:intrusion/snort/GID/01/SID/688",
      "message": "SQL sa login failed"
    },
    {
      "ruleId": "meraki:intrusion/snort/GID/01/SID/5805",
      "message": "MALWARE-OTHER Trackware myway speedbar runtime detection - switch engines"
    }
  ]
}