{
  "lat": 37.4180951010362,
  "lng": -122.098531723022,
  "address": "",
  "serial": "Q3AL-NE8E-R4K6",
  "mac": "f8:9e: 28:da: 62:d6",
  "lanIp": "172.000.0.5",
  "tags": [
    "recently-added"
  ],
  "url": "https: //meraki.com/Network/n/9rbT9dYb/manage/nodes/new_list/273358173922006",
  "networkId": "L_627126248111357524",
  "name": null,
  "details": [],
  "model": "MR44",
  "firmware": "wireless-29-5-1",
  "floorPlanId": null
}