{
  "product": "switch",
  "status": "pending",
  "upgradeBatchId": "23456",
  "time": "2020-10-21T02:00:00Z",
  "toVersion": {
    "id": "7857",
    "firmware": "switch-15-5-2",
    "shortName": "MS 25.5.2",
    "releaseType": "stable",
    "releaseDate": "2020-03-28T17:22:52Z"
  },
  "reasons": [
    {
      "category": "performance",
      "comment": "Network was slower with the upgrade"
    }
  ]
}