{
  "actions": [
    {
      "name": "getOrganizationSamlRoles",
      "protocol": "REST",
      "method": "GET",
      "entitypath": "{base_path}/{version}/organizations/{pathv1}/samlRoles?{query}",
      "requestSchema": "schema.json",
      "responseSchema": "schema.json",
      "timeout": 0,
      "sendEmpty": false,
      "sendGetBody": false,
      "requestDatatype": "JSON",
      "responseDatatype": "JSON",
      "headers": {},
      "responseObjects": [
        {
          "type": "default",
          "key": "",
          "mockFile": "mockdatafiles/getOrganizationSamlRoles-default.json"
        }
      ]
    },
    {
      "name": "createOrganizationSamlRole",
      "protocol": "REST",
      "method": "POST",
      "entitypath": "{base_path}/{version}/organizations/{pathv1}/samlRoles?{query}",
      "requestSchema": "schema.json",
      "responseSchema": "schema.json",
      "timeout": 0,
      "sendEmpty": false,
      "sendGetBody": false,
      "requestDatatype": "JSON",
      "responseDatatype": "JSON",
      "headers": {},
      "responseObjects": [
        {
          "type": "default",
          "key": "",
          "mockFile": "mockdatafiles/createOrganizationSamlRole-default.json"
        }
      ]
    },
    {
      "name": "getOrganizationSamlRole",
      "protocol": "REST",
      "method": "GET",
      "entitypath": "{base_path}/{version}/organizations/{pathv1}/samlRoles/{pathv2}?{query}",
      "requestSchema": "schema.json",
      "responseSchema": "schema.json",
      "timeout": 0,
      "sendEmpty": false,
      "sendGetBody": false,
      "requestDatatype": "JSON",
      "responseDatatype": "JSON",
      "headers": {},
      "responseObjects": [
        {
          "type": "default",
          "key": "",
          "mockFile": "mockdatafiles/getOrganizationSamlRole-default.json"
        }
      ]
    },
    {
      "name": "updateOrganizationSamlRole",
      "protocol": "REST",
      "method": "PUT",
      "entitypath": "{base_path}/{version}/organizations/{pathv1}/samlRoles/{pathv2}?{query}",
      "requestSchema": "schema.json",
      "responseSchema": "schema.json",
      "timeout": 0,
      "sendEmpty": false,
      "sendGetBody": false,
      "requestDatatype": "JSON",
      "responseDatatype": "JSON",
      "headers": {},
      "responseObjects": [
        {
          "type": "default",
          "key": "",
          "mockFile": "mockdatafiles/updateOrganizationSamlRole-default.json"
        }
      ]
    },
    {
      "name": "deleteOrganizationSamlRole",
      "protocol": "REST",
      "method": "DELETE",
      "entitypath": "{base_path}/{version}/organizations/{pathv1}/samlRoles/{pathv2}?{query}",
      "requestSchema": "schema.json",
      "responseSchema": "schema.json",
      "timeout": 0,
      "sendEmpty": false,
      "sendGetBody": false,
      "requestDatatype": "JSON",
      "responseDatatype": "JSON",
      "headers": {},
      "responseObjects": [
        {
          "type": "default",
          "key": "",
          "mockFile": ""
        }
      ]
    }
  ]
}