[
  {
    "ts": 1518365681,
    "application": "Google",
    "destination": "www.google.com",
    "protocol": "UDP",
    "port": 443,
    "recv": 383,
    "sent": 56,
    "numFlows": 5,
    "activeSeconds": 240
  }
]