{
  "id": "TEdJIEN1c3RvbWVy",
  "role": "myrole",
  "orgAccess": "none",
  "networks": [
    {
      "id": "N_1234",
      "access": "full"
    }
  ],
  "tags": [
    {
      "tag": "west",
      "access": "read-only"
    }
  ]
}