[
  {
    "payloadTemplateId": "wpt_343",
    "type": "custom",
    "name": "Weeb Hooks",
    "body": "{\"event_type\":\"{{alertTypeId}}\",\"client_payload\":{\"text\":\"{{alertData}}\"}}",
    "headers": {
      "Content-Type": "application/json",
      "Accept": "application/some.url",
      "Authorization": "Bearer {{sharedSecret}}"
    }
  }
]