{
  "actions": [
    {
      "name": "getNetworkSwitchStacks",
      "protocol": "REST",
      "method": "GET",
      "entitypath": {
        "v0": "{base_path}/{version}/networks/{pathv1}/switchStacks?{query}",
        "v1": "{base_path}/{version}/networks/{pathv1}/switch/stacks?{query}"
      },
      "requestSchema": "schema.json",
      "responseSchema": "schema.json",
      "timeout": 0,
      "sendEmpty": false,
      "sendGetBody": false,
      "requestDatatype": "JSON",
      "responseDatatype": "JSON",
      "headers": {},
      "responseObjects": [
        {
          "type": "default",
          "key": "",
          "mockFile": "mockdatafiles/getNetworkSwitchStacks-default.json"
        }
      ]
    },
    {
      "name": "createNetworkSwitchStack",
      "protocol": "REST",
      "method": "POST",
      "entitypath": {
        "v0": "{base_path}/{version}/networks/{pathv1}/switchStacks?{query}",
        "v1": "{base_path}/{version}/networks/{pathv1}/switch/stacks?{query}"
      },
      "requestSchema": "schema.json",
      "responseSchema": "schema.json",
      "timeout": 0,
      "sendEmpty": false,
      "sendGetBody": false,
      "requestDatatype": "JSON",
      "responseDatatype": "JSON",
      "headers": {},
      "responseObjects": [
        {
          "type": "default",
          "key": "",
          "mockFile": "mockdatafiles/createNetworkSwitchStack-default.json"
        }
      ]
    },
    {
      "name": "getNetworkSwitchStack",
      "protocol": "REST",
      "method": "GET",
      "entitypath": {
        "v0": "{base_path}/{version}/networks/{pathv1}/switchStacks/{pathv2}?{query}",
        "v1": "{base_path}/{version}/networks/{pathv1}/switch/stacks/{pathv2}?{query}"
      },
      "requestSchema": "schema.json",
      "responseSchema": "schema.json",
      "timeout": 0,
      "sendEmpty": false,
      "sendGetBody": false,
      "requestDatatype": "JSON",
      "responseDatatype": "JSON",
      "headers": {},
      "responseObjects": [
        {
          "type": "default",
          "key": "",
          "mockFile": "mockdatafiles/getNetworkSwitchStack-default.json"
        }
      ]
    },
    {
      "name": "deleteNetworkSwitchStack",
      "protocol": "REST",
      "method": "DELETE",
      "entitypath": {
        "v0": "{base_path}/{version}/networks/{pathv1}/switchStacks/{pathv2}?{query}",
        "v1": "{base_path}/{version}/networks/{pathv1}/switch/stacks/{pathv2}?{query}"
      },
      "requestSchema": "schema.json",
      "responseSchema": "schema.json",
      "timeout": 0,
      "sendEmpty": false,
      "sendGetBody": false,
      "requestDatatype": "JSON",
      "responseDatatype": "JSON",
      "headers": {},
      "responseObjects": [
        {
          "type": "default",
          "key": "",
          "mockFile": ""
        }
      ]
    },
    {
      "name": "addNetworkSwitchStack",
      "protocol": "REST",
      "method": "POST",
      "entitypath": {
        "v0": "{base_path}/{version}/networks/{pathv1}/switchStacks/{pathv2}/add?{query}",
        "v1": "{base_path}/{version}/networks/{pathv1}/switch/stacks/{pathv2}/add?{query}"
      },
      "requestSchema": "schema.json",
      "responseSchema": "schema.json",
      "timeout": 0,
      "sendEmpty": false,
      "sendGetBody": false,
      "requestDatatype": "JSON",
      "responseDatatype": "JSON",
      "headers": {},
      "responseObjects": [
        {
          "type": "default",
          "key": "",
          "mockFile": "mockdatafiles/addNetworkSwitchStack-default.json"
        }
      ]
    },
    {
      "name": "removeNetworkSwitchStack",
      "protocol": "REST",
      "method": "POST",
      "entitypath": {
        "v0": "{base_path}/{version}/networks/{pathv1}/switchStacks/{pathv2}/remove?{query}",
        "v1": "{base_path}/{version}/networks/{pathv1}/switch/stacks/{pathv2}/remove?{query}"
      },
      "requestSchema": "schema.json",
      "responseSchema": "schema.json",
      "timeout": 0,
      "sendEmpty": false,
      "sendGetBody": false,
      "requestDatatype": "JSON",
      "responseDatatype": "JSON",
      "headers": {},
      "responseObjects": [
        {
          "type": "default",
          "key": "",
          "mockFile": "mockdatafiles/removeNetworkSwitchStack-default.json"
        }
      ]
    }
  ]
}