{
  "actions": [
    {
      "name": "createsANewAdaptivePolicyGroup",
      "protocol": "REST",
      "method": "POST",
      "entitypath": "{base_path}/{version}/organizations/{pathv1}/adaptivePolicy/groups?{query}",
      "requestSchema": "schema.json",
      "responseSchema": "schema.json",
      "timeout": 0,
      "sendEmpty": false,
      "requestDatatype": "JSON",
      "responseDatatype": "JSON",
      "headers": {},
      "responseObjects": [
        {
          "type": "default",
          "key": "",
          "mockFile": "mockdatafiles/createsANewAdaptivePolicyGroup-default.json"
        }
      ]
    },
    {
      "name": "listAdaptivePolicyGroupsInAOrganization",
      "protocol": "REST",
      "method": "GET",
      "entitypath": "{base_path}/{version}/organizations/{pathv1}/adaptivePolicy/groups?{query}",
      "requestSchema": "schema.json",
      "responseSchema": "schema.json",
      "timeout": 0,
      "sendEmpty": false,
      "sendGetBody": false,
      "requestDatatype": "JSON",
      "responseDatatype": "JSON",
      "headers": {},
      "responseObjects": [
        {
          "type": "default",
          "key": "",
          "mockFile": "mockdatafiles/listAdaptivePolicyGroupsInAOrganization-default.json"
        }
      ]
    },
    {
      "name": "deletesTheSpecifiedAdaptivePolicyGroupAndAnyAssociatedPoliciesAndReferences",
      "protocol": "REST",
      "method": "DELETE",
      "entitypath": "{base_path}/{version}/organizations/{pathv1}/adaptivePolicy/groups/{pathv2}?{query}",
      "requestSchema": "schema.json",
      "responseSchema": "schema.json",
      "timeout": 0,
      "sendEmpty": false,
      "requestDatatype": "JSON",
      "responseDatatype": "JSON",
      "headers": {},
      "responseObjects": [
        {
          "type": "default",
          "key": "",
          "mockFile": ""
        }
      ]
    },
    {
      "name": "returnsAnAdaptivePolicyGroup",
      "protocol": "REST",
      "method": "GET",
      "entitypath": "{base_path}/{version}/organizations/{pathv1}/adaptivePolicy/groups/{pathv2}?{query}",
      "requestSchema": "schema.json",
      "responseSchema": "schema.json",
      "timeout": 0,
      "sendEmpty": false,
      "sendGetBody": false,
      "requestDatatype": "JSON",
      "responseDatatype": "JSON",
      "headers": {},
      "responseObjects": [
        {
          "type": "default",
          "key": "",
          "mockFile": "mockdatafiles/returnsAnAdaptivePolicyGroup-default.json"
        }
      ]
    },
    {
      "name": "updatesAnAdaptivePolicyGroup",
      "protocol": "REST",
      "method": "PUT",
      "entitypath": "{base_path}/{version}/organizations/{pathv1}/adaptivePolicy/groups/{pathv2}?{query}",
      "requestSchema": "schema.json",
      "responseSchema": "schema.json",
      "timeout": 0,
      "sendEmpty": false,
      "requestDatatype": "JSON",
      "responseDatatype": "JSON",
      "headers": {},
      "responseObjects": [
        {
          "type": "default",
          "key": "",
          "mockFile": "mockdatafiles/updatesAnAdaptivePolicyGroup-default.json"
        }
      ]
    }
  ]
}