{
  "id": "212406",
  "name": "Miles Meraki",
  "email": "miles@meraki.com",
  "orgAccess": "none",
  "accountStatus": "ok",
  "twoFactorAuthEnabled": false,
  "hasApiKey": true,
  "lastActive": "2019-01-28 14:58:56 -0800",
  "tags": [
    {
      "tag": "west",
      "access": "read-only"
    }
  ],
  "networks": [
    {
      "id": "N_24329156",
      "access": "full"
    }
  ]
}