{
  "actions": [
    {
      "name": "getNetworkConnectivityMonitoringDestinations",
      "protocol": "REST",
      "method": "GET",
      "entitypath": {
        "v0":"{base_path}/{version}/networks/{pathv1}/connectivityMonitoringDestinations?{query}",
        "v1":"{base_path}/{version}/networks/{pathv1}/appliance/connectivityMonitoringDestinations?{query}"
      },
      "requestSchema": "schema.json",
      "responseSchema": "schema.json",
      "timeout": 0,
      "sendEmpty": false,
      "sendGetBody": false,
      "requestDatatype": "JSON",
      "responseDatatype": "JSON",
      "headers": {},
      "responseObjects": [
        {
          "type": "default",
          "key": "",
          "mockFile": "mockdatafiles/getNetworkConnectivityMonitoringDestinations-default.json"
        }
      ]
    },
    {
      "name": "updateNetworkConnectivityMonitoringDestinations",
      "protocol": "REST",
      "method": "PUT",
      "entitypath": {
        "v0":"{base_path}/{version}/networks/{pathv1}/connectivityMonitoringDestinations?{query}",
        "v1":"{base_path}/{version}/networks/{pathv1}/appliance/connectivityMonitoringDestinations?{query}"
      },
      "requestSchema": "schema.json",
      "responseSchema": "schema.json",
      "timeout": 0,
      "sendEmpty": false,
      "sendGetBody": false,
      "requestDatatype": "JSON",
      "responseDatatype": "JSON",
      "headers": {},
      "responseObjects": [
        {
          "type": "default",
          "key": "",
          "mockFile": ""
        }
      ]
    }
  ]
}