{
  "brandingPolicyId": "string",
  "name": "string",
  "enabled": false,
  "adminSettings": {
    "appliesTo": "string",
    "values": [
      {},
      {}
    ]
  },
  "helpSettings": {
    "helpTab": "string",
    "getHelpSubtab": "string",
    "communitySubtab": "string",
    "casesSubtab": "string",
    "dataProtectionRequestsSubtab": "string",
    "getHelpSubtabKnowledgeBaseSearch": "string",
    "universalSearchKnowledgeBaseSearch": "string",
    "ciscoMerakiProductDocumentation": "string",
    "supportContactInfo": "string",
    "newFeaturesSubtab": "string",
    "firewallInfoSubtab": "string",
    "apiDocsSubtab": "string",
    "hardwareReplacementsSubtab": "string",
    "smForums": "string"
  }
}