[
  {
    "bundleSize": null,
    "createdAt": "2018-02-11T00:00:00Z",
    "dynamicSize": null,
    "id": "1284392014819",
    "identifier": "com.test.app",
    "installedAt": "2018-05-12T00:00:00Z",
    "toInstall": null,
    "iosRedemptionCode": null,
    "isManaged": true,
    "itunesId": null,
    "licenseKey": null,
    "name": "My app",
    "path": "/Path/to/app.app",
    "redemptionCode": null,
    "shortVersion": null,
    "status": null,
    "toUninstall": false,
    "uninstalledAt": null,
    "updatedAt": "2018-05-12T00:00:00Z",
    "vendor": "Apple",
    "version": "0.1"
  }
]