[
  {
    "networkId": "N_12345",
    "serial": "Q2AB-CDEF-GHIJ",
    "uplink": "wan1",
    "ip": "8.8.8.8",
    "timeSeries": [
      {
        "ts": "2019-01-31T18:46:13Z",
        "lossPercent": 5.3,
        "latencyMs": 194.9
      }
    ]
  }
]