{
  "bandwidthLimits": {
    "wan1": {
      "limitUp": 1000000,
      "limitDown": 1000000
    },
    "wan2": {
      "limitUp": 1000000,
      "limitDown": 1000000
    },
    "cellular": {
      "limitUp": 51200,
      "limitDown": 51200
    }
  }
}