[
  {
    "id": "1",
    "shortName": "has_new_feature",
    "limitScopeToNetworks": [
      {
        "id": "L_1234",
        "name": "My Network"
      }
    ],
    "createdAt": "2022-05-01T04:07:15Z"
  }
]