[
  {
    "serial": "Q2JC-2MJM-FHRD",
    "latencyStats": {
      "backgroundTraffic": {
        "rawDistribution": {
          "0": 1234,
          "1": 2345,
          "2": 3456,
          "4": 4567,
          "8": 5678,
          "16": 6789,
          "32": 7890,
          "64": 8901,
          "128": 9012,
          "256": 83,
          "512": 1234,
          "1024": 2345,
          "2048": 9999
        },
        "avg": 606.52
      },
      "bestEffortTraffic": "same shape as backgroundTraffic",
      "videoTraffic": "same shape as backgroundTraffic",
      "voiceTraffic": "same shape as backgroundTraffic"
    }
  },
  {
    "serial": "Q2FJ-3SHB-Y2K2",
    "latencyStats": {
      "backgroundTraffic": {
        "rawDistribution": {
          "0": 1234,
          "1": 2345,
          "2": 3456,
          "4": 4567,
          "8": 5678,
          "16": 6789,
          "32": 7890,
          "64": 8901,
          "128": 9012,
          "256": 83,
          "512": 1234,
          "1024": 2345,
          "2048": 9999
        },
        "avg": 606.52
      },
      "bestEffortTraffic": "same shape as backgroundTraffic",
      "videoTraffic": "same shape as backgroundTraffic",
      "voiceTraffic": "same shape as backgroundTraffic"
    }
  }
]