{
  "senseEnabled": true,
  "audioDetection": {
    "enabled": false
  },
  "mqttBrokerId": "1234",
  "mqttTopics": [
    "/merakimv/Q2AA-AAAA-1111/raw_detections",
    "/merakimv/Q2AA-AAAA-1111/light"
  ]
}