{
  "currency": "USD",
  "plans": [
    {
      "id": "1",
      "price": 5,
      "bandwidthLimits": {
        "limitUp": 1000,
        "limitDown": 1000
      },
      "timeLimit": "1 hour"
    }
  ]
}