[
  {
    "serial": "Q234-ABCD-5678",
    "network": {
      "id": "N_24329156",
      "name": "Main Office"
    },
    "ts": "2021-10-18T23:54:48Z",
    "metric": "temperature",
    "temperature": {
      "fahrenheit": 77.81,
      "celsius": 25.45
    },
    "humidity": {
      "relativePercentage": 34
    },
    "water": {
      "present": true
    },
    "door": {
      "open": true
    },
    "tvoc": {
      "concentration": 100
    },
    "pm25": {
      "concentration": 100
    },
    "noise": {
      "ambient": {
        "level": 45
      }
    },
    "indoorAirQuality": {
      "score": 89
    },
    "button": {
      "pressType": "short"
    },
    "battery": {
      "percentage": 91
    }
  }
]