{
  "actions": [
    {
      "name": "getNetworkOneToManyNatRules",
      "protocol": "REST",
      "method": "GET",
      "entitypath": {
        "v0": "{base_path}/{version}/networks/{pathv1}/oneToManyNatRules?{query}",
        "v1": "{base_path}/{version}/networks/{pathv1}/appliance/firewall/oneToManyNatRules?{query}"
      },
      "requestSchema": "schema.json",
      "responseSchema": "schema.json",
      "timeout": 0,
      "sendEmpty": false,
      "sendGetBody": false,
      "requestDatatype": "JSON",
      "responseDatatype": "JSON",
      "headers": {},
      "responseObjects": [
        {
          "type": "default",
          "key": "",
          "mockFile": "mockdatafiles/getNetworkOneToManyNatRules-default.json"
        }
      ]
    },
    {
      "name": "updateNetworkOneToManyNatRules",
      "protocol": "REST",
      "method": "PUT",
      "entitypath": {
        "v0": "{base_path}/{version}/networks/{pathv1}/oneToManyNatRules?{query}",
        "v1": "{base_path}/{version}/networks/{pathv1}/appliance/firewall/oneToManyNatRules?{query}"
      },
      "requestSchema": "schema.json",
      "responseSchema": "schema.json",
      "timeout": 0,
      "sendEmpty": false,
      "sendGetBody": false,
      "requestDatatype": "JSON",
      "responseDatatype": "JSON",
      "headers": {},
      "responseObjects": [
        {
          "type": "default",
          "key": "",
          "mockFile": "mockdatafiles/updateNetworkOneToManyNatRules-default.json"
        }
      ]
    }
  ]
}