[
  {
    "ts": 1547683314.270398,
    "deviceMac": "00:18:0a:01:02:03",
    "clientMac": "A1:B2:C3:D4:E5:F6",
    "srcIp": "1.2.3.4:34195",
    "destIp": "10.20.30.40:80",
    "protocol": "tcp/ip",
    "priority": "2",
    "classification": "4",
    "blocked": true,
    "message": "SERVER-WEBAPP JBoss JMX console access attempt",
    "signature": "1:21516:9",
    "sigSource": ""
  },
  {
    "ts": 1547683827.723265,
    "deviceMac": "00:18:0a:01:02:03",
    "clientMac": "A1:B2:C3:D4:E5:F6",
    "srcIp": "1.2.3.4:56023",
    "destIp": "10.20.30.40:80",
    "protocol": "tcp/ip",
    "priority": "1",
    "classification": "33",
    "blocked": true,
    "message": "POLICY-OTHER Adobe ColdFusion admin interface access attempt",
    "signature": "1:25975:2",
    "sigSource": ""
  }
]