{
  "actions": [
    {
      "name": "getNetworkSsidSplashSettings",
      "protocol": "REST",
      "method": "GET",
      "entitypath": {
        "v0": "{base_path}/{version}/networks/{pathv1}/ssids/{pathv2}/splashSettings?{query}",
        "v1": "{base_path}/{version}/networks/{pathv1}/wireless/ssids/{pathv2}/splash/settings?{query}"
      },
      "requestSchema": "schema.json",
      "responseSchema": "schema.json",
      "timeout": 0,
      "sendEmpty": false,
      "sendGetBody": false,
      "requestDatatype": "JSON",
      "responseDatatype": "JSON",
      "headers": {},
      "responseObjects": [
        {
          "type": "default",
          "key": "",
          "mockFile": "mockdatafiles/getNetworkSsidSplashSettings-default.json"
        }
      ]
    },
    {
      "name": "updateNetworkSsidSplashSettings",
      "protocol": "REST",
      "method": "PUT",
      "entitypath": {
        "v0": "{base_path}/{version}/networks/{pathv1}/ssids/{pathv2}/splashSettings?{query}",
        "v1": "{base_path}/{version}/networks/{pathv1}/wireless/ssids/{pathv2}/splash/settings?{query}"
      },
      "requestSchema": "schema.json",
      "responseSchema": "schema.json",
      "timeout": 0,
      "sendEmpty": false,
      "sendGetBody": false,
      "requestDatatype": "JSON",
      "responseDatatype": "JSON",
      "headers": {},
      "responseObjects": [
        {
          "type": "default",
          "key": "",
          "mockFile": "mockdatafiles/updateNetworkSsidSplashSettings-default.json"
        }
      ]
    }
  ]
}