[
  {
    "name": "my phone",
    "clientId": "abc",
    "assigned": [
      {
        "name": "Allowed",
        "type": "ssid",
        "ssid": [
          {
            "ssidNumber": 1
          }
        ]
      }
    ]
  }
]