{
  "message": null,
  "pageStartAt": "string",
  "pageEndAt": "string",
  "events": [
    {
      "occurredAt": "string",
      "networkId": "string",
      "type": "string",
      "description": "string",
      "clientId": "string",
      "clientDescription": "string",
      "deviceSerial": "string",
      "deviceName": "string",
      "ssidNumber": 9,
      "ssidName": "string",
      "eventData": {
        "radio": "string",
        "vap": "string",
        "client_mac": "string",
        "client_ip": "string",
        "channel": "string",
        "rssi": "string",
        "aid": "string"
      }
    }
  ]
}