{
  "actions": [
    {
      "name": "authorizeAUserConfiguredWithMerakiAuthenticationForANetworkCurrentlySupports8021XSplashGuestAndClientVPNUsersAndCurrentlyOrganizationsHaveA50000UserCap",
      "protocol": "REST",
      "method": "POST",
      "entitypath": "{base_path}/{version}/networks/{pathv1}/merakiAuthUsers?{query}",
      "requestSchema": "schema.json",
      "responseSchema": "schema.json",
      "timeout": 0,
      "sendEmpty": false,
      "requestDatatype": "JSON",
      "responseDatatype": "JSON",
      "headers": {},
      "responseObjects": [
        {
          "type": "default",
          "key": "",
          "mockFile": "mockdatafiles/authorizeAUserConfiguredWithMerakiAuthenticationForANetworkCurrentlySupports8021XSplashGuestAndClientVPNUsersAndCurrentlyOrganizationsHaveA50000UserCap-default.json"
        }
      ]
    },
    {
      "name": "deauthorizeAUser",
      "protocol": "REST",
      "method": "DELETE",
      "entitypath": "{base_path}/{version}/networks/{pathv1}/merakiAuthUsers/{pathv2}?{query}",
      "requestSchema": "schema.json",
      "responseSchema": "schema.json",
      "timeout": 0,
      "sendEmpty": false,
      "requestDatatype": "JSON",
      "responseDatatype": "JSON",
      "headers": {},
      "responseObjects": [
        {
          "type": "default",
          "key": "",
          "mockFile": ""
        }
      ]
    },
    {
      "name": "updateAUserConfiguredWithMerakiAuthenticationCurrently8021XRADIUSSplashGuestAndClientVPNUsersCanBeUpdated",
      "protocol": "REST",
      "method": "PUT",
      "entitypath": "{base_path}/{version}/networks/{pathv1}/merakiAuthUsers/{pathv2}?{query}",
      "requestSchema": "schema.json",
      "responseSchema": "schema.json",
      "timeout": 0,
      "sendEmpty": false,
      "requestDatatype": "JSON",
      "responseDatatype": "JSON",
      "headers": {},
      "responseObjects": [
        {
          "type": "default",
          "key": "",
          "mockFile": "mockdatafiles/updateAUserConfiguredWithMerakiAuthenticationCurrently8021XRADIUSSplashGuestAndClientVPNUsersCanBeUpdated-default.json"
        }
      ]
    }
  ]
}