{
  "enabled": true,
  "operatorName": "Meraki Product Management",
  "venueName": "SF Branch",
  "venueType": "Unspecified Assembly",
  "networkType": "Private network",
  "domainList": [
    "meraki.local",
    "domain2.com"
  ],
  "roamConsortOis": [
    "ABC123",
    "456EFG"
  ],
  "mccMncs": [
    [
      "123",
      "456"
    ],
    [
      "563",
      "232"
    ]
  ],
  "naiRealms": [
    {
      "format": 1,
      "name": "Realm 1",
      "methods": [
        {
          "id": "1",
          "params": [
            "Non-EAP Inner Authentication: MSCHAP",
            "EAP Inner Authentication: EAP-TTLS with MSCHAPv2"
          ]
        }
      ]
    }
  ]
}