{
  "actions": [
    {
      "name": "getNetworkStaticRoutes",
      "protocol": "REST",
      "method": "GET",
      "entitypath": {
        "v0": "{base_path}/{version}/networks/{pathv1}/staticRoutes?{query}",
        "v1": "{base_path}/{version}/networks/{pathv1}/appliance/staticRoutes?{query}"
      },
      "requestSchema": "schema.json",
      "responseSchema": "schema.json",
      "timeout": 0,
      "sendEmpty": false,
      "sendGetBody": false,
      "requestDatatype": "JSON",
      "responseDatatype": "JSON",
      "headers": {},
      "responseObjects": [
        {
          "type": "default",
          "key": "",
          "mockFile": "mockdatafiles/getNetworkStaticRoutes-default.json"
        }
      ]
    },
    {
      "name": "createNetworkStaticRoute",
      "protocol": "REST",
      "method": "POST",
      "entitypath": {
        "v0": "{base_path}/{version}/networks/{pathv1}/staticRoutes?{query}",
        "v1": "{base_path}/{version}/networks/{pathv1}/appliance/staticRoutes?{query}"
      },
      "requestSchema": "schema.json",
      "responseSchema": "schema.json",
      "timeout": 0,
      "sendEmpty": false,
      "sendGetBody": false,
      "requestDatatype": "JSON",
      "responseDatatype": "JSON",
      "headers": {},
      "responseObjects": [
        {
          "type": "default",
          "key": "",
          "mockFile": "mockdatafiles/createNetworkStaticRoute-default.json"
        }
      ]
    },
    {
      "name": "getNetworkStaticRoute",
      "protocol": "REST",
      "method": "GET",
      "entitypath": {
        "v0": "{base_path}/{version}/networks/{pathv1}/staticRoutes/{pathv2}?{query}",
        "v1": "{base_path}/{version}/networks/{pathv1}/appliance/staticRoutes/{pathv2}?{query}"
      },
      "requestSchema": "schema.json",
      "responseSchema": "schema.json",
      "timeout": 0,
      "sendEmpty": false,
      "sendGetBody": false,
      "requestDatatype": "JSON",
      "responseDatatype": "JSON",
      "headers": {},
      "responseObjects": [
        {
          "type": "default",
          "key": "",
          "mockFile": "mockdatafiles/getNetworkStaticRoute-default.json"
        }
      ]
    },
    {
      "name": "updateNetworkStaticRoute",
      "protocol": "REST",
      "method": "PUT",
      "entitypath": {
        "v0": "{base_path}/{version}/networks/{pathv1}/staticRoutes/{pathv2}?{query}",
        "v1": "{base_path}/{version}/networks/{pathv1}/appliance/staticRoutes/{pathv2}?{query}"
      },
      "requestSchema": "schema.json",
      "responseSchema": "schema.json",
      "timeout": 0,
      "sendEmpty": false,
      "sendGetBody": false,
      "requestDatatype": "JSON",
      "responseDatatype": "JSON",
      "headers": {},
      "responseObjects": [
        {
          "type": "default",
          "key": "",
          "mockFile": "mockdatafiles/updateNetworkStaticRoute-default.json"
        }
      ]
    },
    {
      "name": "deleteNetworkStaticRoute",
      "protocol": "REST",
      "method": "DELETE",
      "entitypath": {
        "v0": "{base_path}/{version}/networks/{pathv1}/staticRoutes/{pathv2}?{query}",
        "v1": "{base_path}/{version}/networks/{pathv1}/appliance/staticRoutes/{pathv2}?{query}"
      },
      "requestSchema": "schema.json",
      "responseSchema": "schema.json",
      "timeout": 0,
      "sendEmpty": false,
      "sendGetBody": false,
      "requestDatatype": "JSON",
      "responseDatatype": "JSON",
      "headers": {},
      "responseObjects": [
        {
          "type": "default",
          "key": "",
          "mockFile": ""
        }
      ]
    }
  ]
}