{
  "allowedUrlPatterns": [
    "http://www.example.org",
    "http://help.com.au"
  ],
  "blockedUrlPatterns": [
    "http://www.example.com",
    "http://www.betting.com"
  ],
  "blockedUrlCategories": [
    {
      "id": "meraki:contentFiltering/category/1",
      "name": "Real Estate"
    },
    {
      "id": "meraki:contentFiltering/category/7",
      "name": "Shopping"
    }
  ],
  "urlCategoryListSize": "topSites"
}