{
  "actions": [
    {
      "name": "returnTheSNMPSettingsForANetwork",
      "protocol": "REST",
      "method": "GET",
      "entitypath": {
        "v0": "{base_path}/{version}/networks/{pathv1}/snmpSettings?{query}",
        "v1": "{base_path}/{version}/networks/{pathv1}/snmp?{query}"
      },
      "requestSchema": "schema.json",
      "responseSchema": "schema.json",
      "timeout": 0,
      "sendEmpty": false,
      "sendGetBody": false,
      "requestDatatype": "JSON",
      "responseDatatype": "JSON",
      "headers": {},
      "responseObjects": [
        {
          "type": "default",
          "key": "",
          "mockFile": "mockdatafiles/returnTheSNMPSettingsForANetwork-default.json"
        }
      ]
    },
    {
      "name": "updateTheSNMPSettingsForANetwork",
      "protocol": "REST",
      "method": "PUT",
      "entitypath": {
        "v0": "{base_path}/{version}/networks/{pathv1}/snmpSettings?{query}",
        "v1": "{base_path}/{version}/networks/{pathv1}/snmp?{query}"
      },
      "requestSchema": "schema.json",
      "responseSchema": "schema.json",
      "timeout": 0,
      "sendEmpty": false,
      "requestDatatype": "JSON",
      "responseDatatype": "JSON",
      "headers": {},
      "responseObjects": [
        {
          "type": "default",
          "key": "",
          "mockFile": "mockdatafiles/updateTheSNMPSettingsForANetwork-default.json"
        }
      ]
    },
    {
      "name": "returnTheSNMPSettingsForAnOrganization",
      "protocol": "REST",
      "method": "GET",
      "entitypath": "{base_path}/{version}/organizations/{pathv1}/snmp?{query}",
      "requestSchema": "schema.json",
      "responseSchema": "schema.json",
      "timeout": 0,
      "sendEmpty": false,
      "sendGetBody": false,
      "requestDatatype": "JSON",
      "responseDatatype": "JSON",
      "headers": {},
      "responseObjects": [
        {
          "type": "default",
          "key": "",
          "mockFile": "mockdatafiles/returnTheSNMPSettingsForAnOrganization-default.json"
        }
      ]
    },
    {
      "name": "updateTheSNMPSettingsForAnOrganization",
      "protocol": "REST",
      "method": "PUT",
      "entitypath": "{base_path}/{version}/organizations/{pathv1}/snmp?{query}",
      "requestSchema": "schema.json",
      "responseSchema": "schema.json",
      "timeout": 0,
      "sendEmpty": false,
      "requestDatatype": "JSON",
      "responseDatatype": "JSON",
      "headers": {},
      "responseObjects": [
        {
          "type": "default",
          "key": "",
          "mockFile": "mockdatafiles/updateTheSNMPSettingsForAnOrganization-default.json"
        }
      ]
    }
  ]
}