{
  "idpId": "ab0c1de23Fg",
  "consumerUrl": "https://n7.meraki.com/saml/login/XXX",
  "x509certSha1Fingerprint": "00:11:22:33:44:55:66:77:88:99:00:11:22:33:44:55:66:77:88:99",
  "sloLogoutUrl": "https://somewhere.com"
}