{
  "mode": "prevention",
  "idsRulesets": "balanced",
  "protectedNetworks": {
    "useDefault": false,
    "includedCidr": [
      "10.0.0.0/8",
      "127.0.0.0/8",
      "169.254.0.0/16",
      "172.16.0.0/12"
    ],
    "excludedCidr": [
      "10.0.0.0/8",
      "127.0.0.0/8"
    ]
  }
}