{
  "serial": "Q234-ABCD-5678",
  "meshRoute": [
    "Q234-ABCD-5678",
    "QWEY-SKTD-ST01",
    "QWEY-SKTD-ST02"
  ],
  "latestMeshPerformance": {
    "mbps": 43,
    "metric": 12345,
    "usagePercentage": "100%"
  }
}