{
  "name": "adapter-menmice_micetro",
  "webName": "Adapter for Integration to Men and Mice Micetro",
  "supportLevel": "community",
  "vendor": "Men and Mice",
  "product": "Micetro",
  "techAlliance": false,
  "osVersion": [],
  "apiVersions": [],
  "iapVersions": [
    "2021.1.x",
    "2021.2.x",
    "2022.1.x",
    "2023.1.x"
  ],
  "method": "REST",
  "type": "Adapter",
  "domains": [
    "Inventory",
    "Network Services"
  ],
  "tags": [
    "Network Infrastructure Changes",
    "Configuration & Compliance"
  ],
  "useCases": [
    "Device Onboarding",
    "Assign Network & IP",
    "Create A Record",
    "Run network compliance checks and remediation",
    "Golden Configuration",
    "Bulk IP Address Allocation",
    "DNS Management"
  ],
  "deprecated": {
    "isDeprecated": false
  },
  "authMethods": [
    {
      "type": "Basic Auth",
      "primary": true
    }
  ],
  "brokerSince": "",
  "documentation": {
    "storeLink": "",
    "npmLink": "https://www.npmjs.com/package/@itentialopensource/adapter-menmice_micetro",
    "repoLink": "https://gitlab.com/itentialopensource/adapters/adapter-menmice_micetro",
    "docLink": "https://gitlab.com/itentialopensource/adapters/adapter-menmice_micetro/-/blob/master/README.md?ref_type=heads",
    "demoLinks": [],
    "trainingLinks": [
      {
        "title": "Itential Academy",
        "link": "https://www.itential.com/itential-academy/"
      }
    ],
    "faqLink": "https://docs.itential.com/opensource/docs/troubleshooting-an-adapter",
    "contributeLink": "https://gitlab.com/itentialopensource/adapters/contributing-guide",
    "issueLink": "https://itential.atlassian.net/servicedesk/customer/portals",
    "webLink": "https://www.itential.com/adapters/men-and-mice-micetro/",
    "vendorLink": "https://www.menandmice.com/",
    "productLink": "https://www.menandmice.com/products/micetro",
    "apiLinks": [
      {
        "title": "Micetro REST API Documentation",
        "link": "https://docs.menandmice.com/en/latest/guides/user-manual/rest_api/",
        "public": true
      },
      {
        "title": "Men&Mice Micetro REST API",
        "link": "https://www.menandmice.com/resources/whitepapers/rest-api",
        "public": true
      },
      {
        "title": "Men&Mice Micetro API Guide",
        "link": "https://www.menandmice.com/blog/ultimate-guide-to-the-micetro-rest-api",
        "public": true
      }
    ],
    "workshopLinks": [],
    "workshopHomePage": "https://www.itential.com/get-started/"
  },
  "assets": [],
  "relatedItems": {
    "adapters": [],
    "integrations": [],
    "ecosystemApplications": [],
    "workflowProjects": [],
    "transformationProjects": [],
    "exampleProjects": []
  }
}