{
  "id": "string",
  "type": "string",
  "attributes": {
    "kind": "activation-token",
    "token": "string",
    "expiry": "string",
    "maxActivations": 4,
    "activations": 9,
    "maxDeactivations": 4,
    "deactivations": 3,
    "created": "string",
    "updated": "string"
  },
  "relationships": {
    "account": {
      "links": {
        "related": "string"
      },
      "data": {
        "type": "string",
        "id": "string"
      }
    },
    "bearer": {
      "links": {
        "related": "string"
      },
      "data": {
        "type": "string",
        "id": "string"
      }
    }
  }
}