{
  "meta": {
    "ts": "string",
    "valid": false,
    "detail": "string",
    "constant": "string",
    "nonce": 6,
    "scope": {
      "fingerprint": {}
    }
  },
  "id": "string",
  "type": "string",
  "links": {
    "self": "string"
  },
  "attributes": {
    "name": "string",
    "key": "string",
    "expiry": "string",
    "users": 5,
    "protected": false,
    "suspended": true,
    "scheme": "string",
    "encrypted": false,
    "floating": false,
    "concurrent": true,
    "strict": true,
    "maxMachines": 6,
    "maxUses": 9,
    "requireCheckIn": false,
    "lastCheckIn": "string",
    "nextCheckIn": "string",
    "metadata": "string",
    "created": "string",
    "updated": "string"
  },
  "relationships": {
    "account": {
      "links": {
        "related": "string"
      },
      "data": {
        "type": "string",
        "id": "string"
      }
    },
    "products": {
      "links": {
        "related": "string"
      },
      "data": {
        "type": "string",
        "id": "string"
      }
    },
    "policy": {
      "links": {
        "related": "string"
      },
      "data": {
        "type": "string",
        "id": "string"
      }
    },
    "user": {
      "links": {
        "related": "string"
      },
      "data": {
        "type": "string",
        "id": "string"
      }
    },
    "machines": {
      "links": {
        "related": "string"
      },
      "meta": {
        "count": 7
      }
    },
    "tokens": {
      "links": {
        "related": "string"
      }
    }
  }
}