{
  "id": "string",
  "type": "string",
  "links": {
    "self": "string"
  },
  "attributes": {
    "name": "string",
    "url": "string",
    "platforms": [
      "string",
      "string"
    ],
    "metadata": "string",
    "created": "string",
    "updated": "string"
  },
  "relationships": {
    "account": {
      "links": {
        "related": "string"
      },
      "data": {
        "type": "string",
        "id": "string"
      }
    },
    "policy": {
      "links": {
        "related": "string"
      }
    },
    "licenses": {
      "links": {
        "related": "string"
      }
    },
    "machines": {
      "links": {
        "related": "string"
      }
    },
    "users": {
      "links": {
        "related": "string"
      }
    },
    "tokens": {
      "links": {
        "related": "string"
      }
    }
  }
}