{
  "actions": [
    {
      "name": "postAccountsAccountPolicies",
      "protocol": "REST",
      "method": "POST",
      "entitypath": "{base_path}/{version}/accounts/{pathv1}/policies?{query}",
      "requestSchema": "schema.json",
      "responseSchema": "schema.json",
      "timeout": 0,
      "sendEmpty": false,
      "requestDatatype": "JSON",
      "responseDatatype": "JSON",
      "headers": {},
      "responseObjects": [
        {
          "type": "default",
          "key": "",
          "mockFile": "mockdatafiles/postAccountsAccountPolicies-default.json"
        }
      ]
    },
    {
      "name": "getAccountsAccountPolicies",
      "protocol": "REST",
      "method": "GET",
      "entitypath": "{base_path}/{version}/accounts/{pathv1}/policies?{query}",
      "requestSchema": "schema.json",
      "responseSchema": "schema.json",
      "timeout": 0,
      "sendEmpty": false,
      "sendGetBody": false,
      "requestDatatype": "JSON",
      "responseDatatype": "JSON",
      "headers": {},
      "responseObjects": [
        {
          "type": "default",
          "key": "",
          "mockFile": "mockdatafiles/getAccountsAccountPolicies-default.json"
        }
      ]
    },
    {
      "name": "getAccountsAccountPoliciesId",
      "protocol": "REST",
      "method": "GET",
      "entitypath": "{base_path}/{version}/accounts/{pathv1}/policies/{pathv2}?{query}",
      "requestSchema": "schema.json",
      "responseSchema": "schema.json",
      "timeout": 0,
      "sendEmpty": false,
      "sendGetBody": false,
      "requestDatatype": "JSON",
      "responseDatatype": "JSON",
      "headers": {},
      "responseObjects": [
        {
          "type": "default",
          "key": "",
          "mockFile": "mockdatafiles/getAccountsAccountPoliciesId-default.json"
        }
      ]
    },
    {
      "name": "patchAccountsAccountPoliciesId",
      "protocol": "REST",
      "method": "PATCH",
      "entitypath": "{base_path}/{version}/accounts/{pathv1}/policies/{pathv2}?{query}",
      "requestSchema": "schema.json",
      "responseSchema": "schema.json",
      "timeout": 0,
      "sendEmpty": false,
      "requestDatatype": "JSON",
      "responseDatatype": "JSON",
      "headers": {},
      "responseObjects": [
        {
          "type": "default",
          "key": "",
          "mockFile": "mockdatafiles/patchAccountsAccountPoliciesId-default.json"
        }
      ]
    },
    {
      "name": "deleteAccountsAccountPoliciesId",
      "protocol": "REST",
      "method": "DELETE",
      "entitypath": "{base_path}/{version}/accounts/{pathv1}/policies/{pathv2}?{query}",
      "requestSchema": "schema.json",
      "responseSchema": "schema.json",
      "timeout": 0,
      "sendEmpty": false,
      "requestDatatype": "JSON",
      "responseDatatype": "JSON",
      "headers": {},
      "responseObjects": [
        {
          "type": "default",
          "key": "",
          "mockFile": ""
        }
      ]
    },
    {
      "name": "deleteAccountsAccountPoliciesIdPool",
      "protocol": "REST",
      "method": "DELETE",
      "entitypath": "{base_path}/{version}/accounts/{pathv1}/policies/{pathv2}/pool?{query}",
      "requestSchema": "schema.json",
      "responseSchema": "schema.json",
      "timeout": 0,
      "sendEmpty": false,
      "requestDatatype": "JSON",
      "responseDatatype": "JSON",
      "headers": {},
      "responseObjects": [
        {
          "type": "default",
          "key": "",
          "mockFile": "mockdatafiles/deleteAccountsAccountPoliciesIdPool-default.json"
        }
      ]
    }
  ]
}