[
  {
    "id": "string",
    "type": "string",
    "attributes": {
      "fullName": "string",
      "firstName": "string",
      "lastName": "string",
      "email": "string",
      "role": "string",
      "created": "string",
      "updated": "string"
    },
    "relationships": {
      "account": {
        "links": {
          "related": "string"
        },
        "data": {
          "type": "string",
          "id": "string"
        }
      },
      "products": {
        "links": {
          "related": "string"
        }
      },
      "licenses": {
        "links": {
          "related": "string"
        }
      },
      "machines": {
        "links": {
          "related": "string"
        }
      },
      "tokens": {
        "links": {
          "related": "string"
        }
      }
    }
  },
  {
    "id": "string",
    "type": "string",
    "attributes": {
      "fullName": "string",
      "firstName": "string",
      "lastName": "string",
      "email": "string",
      "role": "string",
      "created": "string",
      "updated": "string"
    },
    "relationships": {
      "account": {
        "links": {
          "related": "string"
        },
        "data": {
          "type": "string",
          "id": "string"
        }
      },
      "products": {
        "links": {
          "related": "string"
        }
      },
      "licenses": {
        "links": {
          "related": "string"
        }
      },
      "machines": {
        "links": {
          "related": "string"
        }
      },
      "tokens": {
        "links": {
          "related": "string"
        }
      }
    }
  },
  {
    "id": "string",
    "type": "string",
    "attributes": {
      "fullName": "string",
      "firstName": "string",
      "lastName": "string",
      "email": "string",
      "role": "string",
      "created": "string",
      "updated": "string"
    },
    "relationships": {
      "account": {
        "links": {
          "related": "string"
        },
        "data": {
          "type": "string",
          "id": "string"
        }
      },
      "products": {
        "links": {
          "related": "string"
        }
      },
      "licenses": {
        "links": {
          "related": "string"
        }
      },
      "machines": {
        "links": {
          "related": "string"
        }
      },
      "tokens": {
        "links": {
          "related": "string"
        }
      }
    }
  }
]