{
  "id": "string",
  "type": "string",
  "links": {
    "self": "string"
  },
  "attributes": {
    "name": "string",
    "duration": 9,
    "strict": false,
    "floating": true,
    "concurrent": false,
    "scheme": "RSA_2048_PKCS1_PSS_SIGN",
    "requireProductScope": false,
    "requirePolicyScope": false,
    "requireMachineScope": false,
    "requireFingerprintScope": true,
    "requireCheckIn": true,
    "checkInInterval": "day",
    "checkInIntervalCount": 3,
    "usePool": false,
    "maxMachines": 2,
    "maxUses": 3,
    "encrypted": true,
    "protected": false,
    "metadata": {},
    "created": "string",
    "updated": "string"
  },
  "relationships": {
    "account": {
      "links": {
        "related": "string"
      },
      "data": {
        "type": "string",
        "id": "string"
      }
    },
    "product": {
      "links": {
        "related": "string"
      },
      "data": {
        "type": "string",
        "id": "string"
      }
    },
    "pool": {
      "links": {
        "related": "string"
      }
    },
    "licenses": {
      "links": {
        "related": "string"
      }
    }
  }
}