{
  "created_at": "string",
  "deployable": {
    "artifacts_file": {
      "filename": "string",
      "size": "string"
    },
    "commit": {
      "author_email": "string",
      "author_name": "string",
      "committer_email": "string",
      "committer_name": "string",
      "created_at": "string",
      "id": "string",
      "message": "string",
      "short_id": "string",
      "title": "string"
    },
    "coverage": "string",
    "created_at": "string",
    "finished_at": "string",
    "id": "string",
    "name": "string",
    "pipeline": {
      "id": "string",
      "ref": "string",
      "sha": "string",
      "status": "string"
    },
    "ref": "string",
    "runner": {
      "active": "string",
      "description": "string",
      "id": "string",
      "is_shared": "string",
      "name": "string"
    },
    "stage": "string",
    "started_at": "string",
    "status": "string",
    "tag": "string",
    "user": {
      "avatar_url": "string",
      "bio": "string",
      "created_at": "string",
      "id": "string",
      "is_admin": "string",
      "linkedin": "string",
      "location": "string",
      "name": "string",
      "organization": "string",
      "skype": "string",
      "state": "string",
      "twitter": "string",
      "username": "string",
      "web_url": "string",
      "website_url": "string"
    }
  },
  "environment": {
    "external_url": "string",
    "id": "string",
    "name": "string",
    "slug": "string"
  },
  "id": "string",
  "iid": "string",
  "ref": "string",
  "sha": "string",
  "user": {
    "avatar_url": "string",
    "id": "string",
    "name": "string",
    "state": "string",
    "username": "string",
    "web_url": "string"
  }
}