{
  "awardable_id": "string",
  "awardable_type": "string",
  "created_at": "string",
  "id": "string",
  "name": "string",
  "updated_at": "string",
  "user": {
    "avatar_url": "string",
    "id": "string",
    "name": "string",
    "state": "string",
    "username": "string",
    "web_url": "string"
  }
}