{
  "attachment": "string",
  "author": {
    "avatar_url": "string",
    "id": "string",
    "name": "string",
    "state": "string",
    "username": "string",
    "web_url": "string"
  },
  "body": "string",
  "created_at": "string",
  "id": "string",
  "noteable_id": "string",
  "noteable_type": "string",
  "system": "string",
  "updated_at": "string"
}