{
  "before_sha": "string",
  "committed_at": "string",
  "coverage": "string",
  "created_at": "string",
  "duration": "string",
  "finished_at": "string",
  "id": "string",
  "ref": "string",
  "sha": "string",
  "started_at": "string",
  "status": "string",
  "tag": "string",
  "updated_at": "string",
  "user": {
    "avatar_url": "string",
    "id": "string",
    "name": "string",
    "state": "string",
    "username": "string",
    "web_url": "string"
  },
  "yaml_errors": "string"
}