[
  {
    "id": 10,
    "label": {
      "name": "string",
      "color": "string",
      "description": {}
    },
    "position": 5
  },
  {
    "id": 4,
    "label": {
      "name": "string",
      "color": "string",
      "description": {}
    },
    "position": 10
  },
  {
    "id": 10,
    "label": {
      "name": "string",
      "color": "string",
      "description": {}
    },
    "position": 4
  }
]