{
  "actions": [
    {
      "name": "getV4Users",
      "protocol": "REST",
      "method": "GET",
      "entitypath": "{base_path}/{version}/users?{query}",
      "requestSchema": "schema.json",
      "responseSchema": "schema.json",
      "timeout": 0,
      "sendEmpty": false,
      "sendGetBody": false,
      "requestDatatype": "JSON",
      "responseDatatype": "JSON",
      "headers": {},
      "responseObjects": [
        {
          "type": "default",
          "key": "",
          "mockFile": "mockdatafiles/getV4Users-default.json"
        }
      ]
    },
    {
      "name": "postV4Users",
      "protocol": "REST",
      "method": "POST",
      "entitypath": "{base_path}/{version}/users?{query}",
      "requestSchema": "schema.json",
      "responseSchema": "schema.json",
      "timeout": 0,
      "sendEmpty": false,
      "sendGetBody": false,
      "requestDatatype": "JSON",
      "responseDatatype": "JSON",
      "headers": {},
      "responseObjects": [
        {
          "type": "default",
          "key": "",
          "mockFile": "mockdatafiles/postV4Users-default.json"
        }
      ]
    },
    {
      "name": "getV4UsersId",
      "protocol": "REST",
      "method": "GET",
      "entitypath": "{base_path}/{version}/users/{pathv1}?{query}",
      "requestSchema": "schema.json",
      "responseSchema": "schema.json",
      "timeout": 0,
      "sendEmpty": false,
      "sendGetBody": false,
      "requestDatatype": "JSON",
      "responseDatatype": "JSON",
      "headers": {},
      "responseObjects": [
        {
          "type": "default",
          "key": "",
          "mockFile": "mockdatafiles/getV4UsersId-default.json"
        }
      ]
    },
    {
      "name": "putV4UsersId",
      "protocol": "REST",
      "method": "PUT",
      "entitypath": "{base_path}/{version}/users/{pathv1}?{query}",
      "requestSchema": "schema.json",
      "responseSchema": "schema.json",
      "timeout": 0,
      "sendEmpty": false,
      "sendGetBody": false,
      "requestDatatype": "JSON",
      "responseDatatype": "JSON",
      "headers": {},
      "responseObjects": [
        {
          "type": "default",
          "key": "",
          "mockFile": "mockdatafiles/putV4UsersId-default.json"
        }
      ]
    },
    {
      "name": "deleteV4UsersId",
      "protocol": "REST",
      "method": "DELETE",
      "entitypath": "{base_path}/{version}/users/{pathv1}?{query}",
      "requestSchema": "schema.json",
      "responseSchema": "schema.json",
      "timeout": 0,
      "sendEmpty": false,
      "sendGetBody": false,
      "requestDatatype": "JSON",
      "responseDatatype": "JSON",
      "headers": {},
      "responseObjects": [
        {
          "type": "default",
          "key": "",
          "mockFile": "mockdatafiles/deleteV4UsersId-default.json"
        }
      ]
    },
    {
      "name": "putV4UsersIdBlock",
      "protocol": "REST",
      "method": "PUT",
      "entitypath": "{base_path}/{version}/users/{pathv1}/block?{query}",
      "requestSchema": "schema.json",
      "responseSchema": "schema.json",
      "timeout": 0,
      "sendEmpty": false,
      "sendGetBody": false,
      "requestDatatype": "JSON",
      "responseDatatype": "JSON",
      "headers": {},
      "responseObjects": [
        {
          "type": "default",
          "key": "",
          "mockFile": ""
        }
      ]
    },
    {
      "name": "getV4UsersIdEmails",
      "protocol": "REST",
      "method": "GET",
      "entitypath": "{base_path}/{version}/users/{pathv1}/emails?{query}",
      "requestSchema": "schema.json",
      "responseSchema": "schema.json",
      "timeout": 0,
      "sendEmpty": false,
      "sendGetBody": false,
      "requestDatatype": "JSON",
      "responseDatatype": "JSON",
      "headers": {},
      "responseObjects": [
        {
          "type": "default",
          "key": "",
          "mockFile": "mockdatafiles/getV4UsersIdEmails-default.json"
        }
      ]
    },
    {
      "name": "postV4UsersIdEmails",
      "protocol": "REST",
      "method": "POST",
      "entitypath": "{base_path}/{version}/users/{pathv1}/emails?{query}",
      "requestSchema": "schema.json",
      "responseSchema": "schema.json",
      "timeout": 0,
      "sendEmpty": false,
      "sendGetBody": false,
      "requestDatatype": "JSON",
      "responseDatatype": "JSON",
      "headers": {},
      "responseObjects": [
        {
          "type": "default",
          "key": "",
          "mockFile": "mockdatafiles/postV4UsersIdEmails-default.json"
        }
      ]
    },
    {
      "name": "deleteV4UsersIdEmailsEmailId",
      "protocol": "REST",
      "method": "DELETE",
      "entitypath": "{base_path}/{version}/users/{pathv1}/emails/{pathv2}?{query}",
      "requestSchema": "schema.json",
      "responseSchema": "schema.json",
      "timeout": 0,
      "sendEmpty": false,
      "sendGetBody": false,
      "requestDatatype": "JSON",
      "responseDatatype": "JSON",
      "headers": {},
      "responseObjects": [
        {
          "type": "default",
          "key": "",
          "mockFile": "mockdatafiles/deleteV4UsersIdEmailsEmailId-default.json"
        }
      ]
    },
    {
      "name": "getV4UsersIdEvents",
      "protocol": "REST",
      "method": "GET",
      "entitypath": "{base_path}/{version}/users/{pathv1}/events?{query}",
      "requestSchema": "schema.json",
      "responseSchema": "schema.json",
      "timeout": 0,
      "sendEmpty": false,
      "sendGetBody": false,
      "requestDatatype": "JSON",
      "responseDatatype": "JSON",
      "headers": {},
      "responseObjects": [
        {
          "type": "default",
          "key": "",
          "mockFile": "mockdatafiles/getV4UsersIdEvents-default.json"
        }
      ]
    },
    {
      "name": "getV4UsersIdKeys",
      "protocol": "REST",
      "method": "GET",
      "entitypath": "{base_path}/{version}/users/{pathv1}/keys?{query}",
      "requestSchema": "schema.json",
      "responseSchema": "schema.json",
      "timeout": 0,
      "sendEmpty": false,
      "sendGetBody": false,
      "requestDatatype": "JSON",
      "responseDatatype": "JSON",
      "headers": {},
      "responseObjects": [
        {
          "type": "default",
          "key": "",
          "mockFile": "mockdatafiles/getV4UsersIdKeys-default.json"
        }
      ]
    },
    {
      "name": "postV4UsersIdKeys",
      "protocol": "REST",
      "method": "POST",
      "entitypath": "{base_path}/{version}/users/{pathv1}/keys?{query}",
      "requestSchema": "schema.json",
      "responseSchema": "schema.json",
      "timeout": 0,
      "sendEmpty": false,
      "sendGetBody": false,
      "requestDatatype": "JSON",
      "responseDatatype": "JSON",
      "headers": {},
      "responseObjects": [
        {
          "type": "default",
          "key": "",
          "mockFile": "mockdatafiles/postV4UsersIdKeys-default.json"
        }
      ]
    },
    {
      "name": "deleteV4UsersIdKeysKeyId",
      "protocol": "REST",
      "method": "DELETE",
      "entitypath": "{base_path}/{version}/users/{pathv1}/keys/{pathv2}?{query}",
      "requestSchema": "schema.json",
      "responseSchema": "schema.json",
      "timeout": 0,
      "sendEmpty": false,
      "sendGetBody": false,
      "requestDatatype": "JSON",
      "responseDatatype": "JSON",
      "headers": {},
      "responseObjects": [
        {
          "type": "default",
          "key": "",
          "mockFile": "mockdatafiles/deleteV4UsersIdKeysKeyId-default.json"
        }
      ]
    },
    {
      "name": "putV4UsersIdUnblock",
      "protocol": "REST",
      "method": "PUT",
      "entitypath": "{base_path}/{version}/users/{pathv1}/unblock?{query}",
      "requestSchema": "schema.json",
      "responseSchema": "schema.json",
      "timeout": 0,
      "sendEmpty": false,
      "sendGetBody": false,
      "requestDatatype": "JSON",
      "responseDatatype": "JSON",
      "headers": {},
      "responseObjects": [
        {
          "type": "default",
          "key": "",
          "mockFile": ""
        }
      ]
    },
    {
      "name": "getV4UsersIdProjects",
      "protocol": "REST",
      "method": "GET",
      "entitypath": "{base_path}/{version}/users/{pathv1}/projects?{query}",
      "requestSchema": "schema.json",
      "responseSchema": "schema.json",
      "timeout": 0,
      "sendEmpty": false,
      "sendGetBody": false,
      "requestDatatype": "JSON",
      "responseDatatype": "JSON",
      "headers": {},
      "responseObjects": [
        {
          "type": "default",
          "key": "",
          "mockFile": "mockdatafiles/getV4UsersIdProjects-default.json"
        }
      ]
    },
    {
      "name": "getV4UsersIdStatus",
      "protocol": "REST",
      "method": "GET",
      "entitypath": "{base_path}/{version}/users/{pathv1}/status?{query}",
      "requestSchema": "schema.json",
      "responseSchema": "schema.json",
      "timeout": 0,
      "sendEmpty": false,
      "sendGetBody": false,
      "requestDatatype": "JSON",
      "responseDatatype": "JSON",
      "headers": {},
      "responseObjects": [
        {
          "type": "default",
          "key": "",
          "mockFile": "mockdatafiles/getV4UsersIdStatus-default.json"
        }
      ]
    }
  ]
}