{
  "id": 3,
  "description": "string",
  "name": "string",
  "name_with_namespace": "string",
  "path": "string",
  "path_with_namespace": "string",
  "created_at": "string",
  "export_status": "string"
}