[
  {
    "id": 1,
    "link_url": "http://example.com/ci_status.svg?project=%{project_path}&ref=%{default_branch}",
    "image_url": "https://shields.io/my/badge",
    "rendered_link_url": "http://example.com/ci_status.svg?project=example-org/example-project&ref=master",
    "rendered_image_url": "https://shields.io/my/badge",
    "kind": "project"
  },
  {
    "id": 1,
    "link_url": "http://example.com/ci_status.svg?project=%{project_path}&ref=%{default_branch}",
    "image_url": "https://shields.io/my/badge",
    "rendered_link_url": "http://example.com/ci_status.svg?project=example-org/example-project&ref=master",
    "rendered_image_url": "https://shields.io/my/badge",
    "kind": "project"
  },
  {
    "id": 1,
    "link_url": "http://example.com/ci_status.svg?project=%{project_path}&ref=%{default_branch}",
    "image_url": "https://shields.io/my/badge",
    "rendered_link_url": "http://example.com/ci_status.svg?project=example-org/example-project&ref=master",
    "rendered_image_url": "https://shields.io/my/badge",
    "kind": "project"
  },
  {
    "id": 1,
    "link_url": "http://example.com/ci_status.svg?project=%{project_path}&ref=%{default_branch}",
    "image_url": "https://shields.io/my/badge",
    "rendered_link_url": "http://example.com/ci_status.svg?project=example-org/example-project&ref=master",
    "rendered_image_url": "https://shields.io/my/badge",
    "kind": "project"
  }
]