{
  "$id": "schema.json",
  "type": "object",
  "schema": "http://json-schema.org/draft-07/schema#",
  "translate": true,
  "dynamicfields": true,
  "properties": {
    "ph_request_type": {
      "type": "string",
      "description": "type of request (internal to adapter)",
      "default": "getV4Issues",
      "enum": [
        "getV4Issues"
      ],
      "external_name": "ph_request_type"
    },
    "orderBy": {
      "description": "Return issues ordered by `created_at` or `updated_at` fields.",
      "parse": false,
      "encode": false,
      "encrypt": {
        "type": "AES",
        "key": ""
      },
      "external_name": "order_by"
    },
    "perPage": {
      "description": "Number of items per page",
      "parse": false,
      "encode": false,
      "encrypt": {
        "type": "AES",
        "key": ""
      },
      "external_name": "per_page"
    }
  },
  "definitions": {}
}