[
  {
    "color": "string",
    "name": "string",
    "url": "string"
  },
  {
    "color": "string",
    "name": "string",
    "url": "string"
  },
  {
    "color": "string",
    "name": "string",
    "url": "string"
  }
]