{
  "assignee": "string",
  "body": "string",
  "labels": [
    "string",
    "string",
    "string",
    "string",
    "string",
    "string",
    "string"
  ],
  "milestone": 4,
  "title": "string"
}