{
  "closed_issues": 4,
  "created_at": "string",
  "creator": {
    "avatar_url": "string",
    "bio": "string",
    "blog": "string",
    "collaborators": 9,
    "company": "string",
    "created_at": "string",
    "disk_usage": 2,
    "email": "string",
    "followers": 6,
    "followers_url": "string",
    "following": 8,
    "following_url": "string",
    "gists_url": "string",
    "gravatar_id": "string",
    "hireable": false,
    "html_url": "string",
    "id": 2,
    "location": "string",
    "login": "string",
    "name": "string",
    "organizations_url": "string",
    "owned_private_repos": 9,
    "plan": {
      "collaborators": 2,
      "name": "string",
      "private_repos": 10,
      "space": 8
    },
    "private_gists": 8,
    "public_gists": 7,
    "public_repos": 1,
    "starred_url": "string",
    "subscriptions_url": "string",
    "total_private_repos": 1,
    "type": "Organization",
    "updated_at": "string",
    "url": "string"
  },
  "description": "string",
  "due_on": "string",
  "number": 4,
  "open_issues": 4,
  "state": "closed",
  "title": "string",
  "url": "string"
}