[
  {
    "author": {
      "avatar_url": "string",
      "bio": "string",
      "blog": "string",
      "collaborators": 1,
      "company": "string",
      "created_at": "string",
      "disk_usage": 9,
      "email": "string",
      "followers": 6,
      "followers_url": "string",
      "following": 4,
      "following_url": "string",
      "gists_url": "string",
      "gravatar_id": "string",
      "hireable": true,
      "html_url": "string",
      "id": 3,
      "location": "string",
      "login": "string",
      "name": "string",
      "organizations_url": "string",
      "owned_private_repos": 7,
      "plan": {
        "collaborators": 2,
        "name": "string",
        "private_repos": 6,
        "space": 8
      },
      "private_gists": 3,
      "public_gists": 8,
      "public_repos": 8,
      "starred_url": "string",
      "subscriptions_url": "string",
      "total_private_repos": 7,
      "type": "User",
      "updated_at": "string",
      "url": "string"
    },
    "commit": {
      "author": {
        "date": "string",
        "email": "string",
        "name": "string"
      },
      "committer": {
        "date": "string",
        "email": "string",
        "name": "string"
      },
      "message": "string",
      "tree": {
        "sha": "string",
        "url": "string"
      },
      "url": "string"
    },
    "committer": {
      "avatar_url": "string",
      "bio": "string",
      "blog": "string",
      "collaborators": 5,
      "company": "string",
      "created_at": "string",
      "disk_usage": 10,
      "email": "string",
      "followers": 3,
      "followers_url": "string",
      "following": 5,
      "following_url": "string",
      "gists_url": "string",
      "gravatar_id": "string",
      "hireable": false,
      "html_url": "string",
      "id": 9,
      "location": "string",
      "login": "string",
      "name": "string",
      "organizations_url": "string",
      "owned_private_repos": 9,
      "plan": {
        "collaborators": 1,
        "name": "string",
        "private_repos": 1,
        "space": 8
      },
      "private_gists": 7,
      "public_gists": 5,
      "public_repos": 5,
      "starred_url": "string",
      "subscriptions_url": "string",
      "total_private_repos": 4,
      "type": "User",
      "updated_at": "string",
      "url": "string"
    },
    "parents": [
      {
        "sha": "string",
        "url": "string"
      },
      {
        "sha": "string",
        "url": "string"
      },
      {
        "sha": "string",
        "url": "string"
      },
      {
        "sha": "string",
        "url": "string"
      },
      {
        "sha": "string",
        "url": "string"
      },
      {
        "sha": "string",
        "url": "string"
      },
      {
        "sha": "string",
        "url": "string"
      },
      {
        "sha": "string",
        "url": "string"
      },
      {
        "sha": "string",
        "url": "string"
      },
      {
        "sha": "string",
        "url": "string"
      }
    ],
    "sha": "string",
    "url": "string"
  }
]