{
  "assets": [
    {
      "content_type": "string",
      "created_at": "string",
      "download_count": 10,
      "id": 6,
      "label": "string",
      "name": "string",
      "size": 9,
      "state": "string",
      "updated_at": "string",
      "uploader": {
        "avatar_url": "string",
        "bio": "string",
        "blog": "string",
        "collaborators": 4,
        "company": "string",
        "created_at": "string",
        "disk_usage": 5,
        "email": "string",
        "followers": 1,
        "followers_url": "string",
        "following": 10,
        "following_url": "string",
        "gists_url": "string",
        "gravatar_id": "string",
        "hireable": true,
        "html_url": "string",
        "id": 6,
        "location": "string",
        "login": "string",
        "name": "string",
        "organizations_url": "string",
        "owned_private_repos": 5,
        "plan": {
          "collaborators": 4,
          "name": "string",
          "private_repos": 6,
          "space": 9
        },
        "private_gists": 10,
        "public_gists": 6,
        "public_repos": 4,
        "starred_url": "string",
        "subscriptions_url": "string",
        "total_private_repos": 2,
        "type": "User",
        "updated_at": "string",
        "url": "string"
      },
      "url": "string"
    },
    {
      "content_type": "string",
      "created_at": "string",
      "download_count": 6,
      "id": 3,
      "label": "string",
      "name": "string",
      "size": 10,
      "state": "string",
      "updated_at": "string",
      "uploader": {
        "avatar_url": "string",
        "bio": "string",
        "blog": "string",
        "collaborators": 1,
        "company": "string",
        "created_at": "string",
        "disk_usage": 9,
        "email": "string",
        "followers": 4,
        "followers_url": "string",
        "following": 7,
        "following_url": "string",
        "gists_url": "string",
        "gravatar_id": "string",
        "hireable": true,
        "html_url": "string",
        "id": 5,
        "location": "string",
        "login": "string",
        "name": "string",
        "organizations_url": "string",
        "owned_private_repos": 8,
        "plan": {
          "collaborators": 1,
          "name": "string",
          "private_repos": 1,
          "space": 2
        },
        "private_gists": 8,
        "public_gists": 2,
        "public_repos": 2,
        "starred_url": "string",
        "subscriptions_url": "string",
        "total_private_repos": 1,
        "type": "User",
        "updated_at": "string",
        "url": "string"
      },
      "url": "string"
    },
    {
      "content_type": "string",
      "created_at": "string",
      "download_count": 2,
      "id": 8,
      "label": "string",
      "name": "string",
      "size": 10,
      "state": "string",
      "updated_at": "string",
      "uploader": {
        "avatar_url": "string",
        "bio": "string",
        "blog": "string",
        "collaborators": 10,
        "company": "string",
        "created_at": "string",
        "disk_usage": 5,
        "email": "string",
        "followers": 2,
        "followers_url": "string",
        "following": 2,
        "following_url": "string",
        "gists_url": "string",
        "gravatar_id": "string",
        "hireable": true,
        "html_url": "string",
        "id": 5,
        "location": "string",
        "login": "string",
        "name": "string",
        "organizations_url": "string",
        "owned_private_repos": 3,
        "plan": {
          "collaborators": 7,
          "name": "string",
          "private_repos": 2,
          "space": 8
        },
        "private_gists": 1,
        "public_gists": 8,
        "public_repos": 5,
        "starred_url": "string",
        "subscriptions_url": "string",
        "total_private_repos": 4,
        "type": "Organization",
        "updated_at": "string",
        "url": "string"
      },
      "url": "string"
    },
    {
      "content_type": "string",
      "created_at": "string",
      "download_count": 7,
      "id": 3,
      "label": "string",
      "name": "string",
      "size": 1,
      "state": "string",
      "updated_at": "string",
      "uploader": {
        "avatar_url": "string",
        "bio": "string",
        "blog": "string",
        "collaborators": 10,
        "company": "string",
        "created_at": "string",
        "disk_usage": 9,
        "email": "string",
        "followers": 7,
        "followers_url": "string",
        "following": 7,
        "following_url": "string",
        "gists_url": "string",
        "gravatar_id": "string",
        "hireable": false,
        "html_url": "string",
        "id": 9,
        "location": "string",
        "login": "string",
        "name": "string",
        "organizations_url": "string",
        "owned_private_repos": 8,
        "plan": {
          "collaborators": 1,
          "name": "string",
          "private_repos": 10,
          "space": 4
        },
        "private_gists": 9,
        "public_gists": 2,
        "public_repos": 8,
        "starred_url": "string",
        "subscriptions_url": "string",
        "total_private_repos": 2,
        "type": "Organization",
        "updated_at": "string",
        "url": "string"
      },
      "url": "string"
    },
    {
      "content_type": "string",
      "created_at": "string",
      "download_count": 1,
      "id": 6,
      "label": "string",
      "name": "string",
      "size": 7,
      "state": "string",
      "updated_at": "string",
      "uploader": {
        "avatar_url": "string",
        "bio": "string",
        "blog": "string",
        "collaborators": 1,
        "company": "string",
        "created_at": "string",
        "disk_usage": 5,
        "email": "string",
        "followers": 9,
        "followers_url": "string",
        "following": 5,
        "following_url": "string",
        "gists_url": "string",
        "gravatar_id": "string",
        "hireable": false,
        "html_url": "string",
        "id": 6,
        "location": "string",
        "login": "string",
        "name": "string",
        "organizations_url": "string",
        "owned_private_repos": 3,
        "plan": {
          "collaborators": 2,
          "name": "string",
          "private_repos": 10,
          "space": 3
        },
        "private_gists": 9,
        "public_gists": 5,
        "public_repos": 6,
        "starred_url": "string",
        "subscriptions_url": "string",
        "total_private_repos": 10,
        "type": "Organization",
        "updated_at": "string",
        "url": "string"
      },
      "url": "string"
    }
  ],
  "assets_url": "string",
  "author": {
    "avatar_url": "string",
    "bio": "string",
    "blog": "string",
    "collaborators": 2,
    "company": "string",
    "created_at": "string",
    "disk_usage": 4,
    "email": "string",
    "followers": 9,
    "followers_url": "string",
    "following": 8,
    "following_url": "string",
    "gists_url": "string",
    "gravatar_id": "string",
    "hireable": false,
    "html_url": "string",
    "id": 7,
    "location": "string",
    "login": "string",
    "name": "string",
    "organizations_url": "string",
    "owned_private_repos": 9,
    "plan": {
      "collaborators": 5,
      "name": "string",
      "private_repos": 8,
      "space": 6
    },
    "private_gists": 8,
    "public_gists": 8,
    "public_repos": 2,
    "starred_url": "string",
    "subscriptions_url": "string",
    "total_private_repos": 10,
    "type": "Organization",
    "updated_at": "string",
    "url": "string"
  },
  "body": "string",
  "created_at": "string",
  "draft": false,
  "html_url": "string",
  "id": 6,
  "name": "string",
  "prerelease": true,
  "published_at": "string",
  "tag_name": "string",
  "tarball_url": "string",
  "target_commitish": "string",
  "upload_url": "string",
  "url": "string",
  "zipball_url": "string"
}