[
  {
    "author": {
      "avatar_url": "string",
      "gravatar_id": "string",
      "id": 4,
      "login": "string",
      "url": "string"
    },
    "total": 6,
    "weeks": [
      {
        "a": 2,
        "c": 7,
        "d": 7,
        "w": "string"
      },
      {
        "a": 6,
        "c": 5,
        "d": 4,
        "w": "string"
      },
      {
        "a": 10,
        "c": 5,
        "d": 3,
        "w": "string"
      }
    ]
  }
]