[
  {
    "commit": {
      "sha": "string",
      "url": "string"
    },
    "name": "string"
  },
  {
    "commit": {
      "sha": "string",
      "url": "string"
    },
    "name": "string"
  },
  {
    "commit": {
      "sha": "string",
      "url": "string"
    },
    "name": "string"
  }
]