[
  {
    "comments": 7,
    "comments_url": "string",
    "created_at": "string",
    "description": "string",
    "files": {
      "ring.erl": {
        "filename": "string",
        "raw_url": "string",
        "size": 8
      }
    },
    "git_pull_url": "string",
    "git_push_url": "string",
    "html_url": "string",
    "id": "string",
    "public": true,
    "url": "string",
    "user": {
      "avatar_url": "string",
      "bio": "string",
      "blog": "string",
      "collaborators": 6,
      "company": "string",
      "created_at": "string",
      "disk_usage": 2,
      "email": "string",
      "followers": 7,
      "followers_url": "string",
      "following": 2,
      "following_url": "string",
      "gists_url": "string",
      "gravatar_id": "string",
      "hireable": false,
      "html_url": "string",
      "id": 3,
      "location": "string",
      "login": "string",
      "name": "string",
      "organizations_url": "string",
      "owned_private_repos": 6,
      "plan": {
        "collaborators": 5,
        "name": "string",
        "private_repos": 1,
        "space": 2
      },
      "private_gists": 3,
      "public_gists": 9,
      "public_repos": 2,
      "starred_url": "string",
      "subscriptions_url": "string",
      "total_private_repos": 2,
      "type": "User",
      "updated_at": "string",
      "url": "string"
    }
  },
  {
    "comments": 6,
    "comments_url": "string",
    "created_at": "string",
    "description": "string",
    "files": {
      "ring.erl": {
        "filename": "string",
        "raw_url": "string",
        "size": 8
      }
    },
    "git_pull_url": "string",
    "git_push_url": "string",
    "html_url": "string",
    "id": "string",
    "public": false,
    "url": "string",
    "user": {
      "avatar_url": "string",
      "bio": "string",
      "blog": "string",
      "collaborators": 1,
      "company": "string",
      "created_at": "string",
      "disk_usage": 3,
      "email": "string",
      "followers": 1,
      "followers_url": "string",
      "following": 4,
      "following_url": "string",
      "gists_url": "string",
      "gravatar_id": "string",
      "hireable": true,
      "html_url": "string",
      "id": 9,
      "location": "string",
      "login": "string",
      "name": "string",
      "organizations_url": "string",
      "owned_private_repos": 1,
      "plan": {
        "collaborators": 10,
        "name": "string",
        "private_repos": 1,
        "space": 7
      },
      "private_gists": 3,
      "public_gists": 3,
      "public_repos": 7,
      "starred_url": "string",
      "subscriptions_url": "string",
      "total_private_repos": 4,
      "type": "Organization",
      "updated_at": "string",
      "url": "string"
    }
  },
  {
    "comments": 6,
    "comments_url": "string",
    "created_at": "string",
    "description": "string",
    "files": {
      "ring.erl": {
        "filename": "string",
        "raw_url": "string",
        "size": 5
      }
    },
    "git_pull_url": "string",
    "git_push_url": "string",
    "html_url": "string",
    "id": "string",
    "public": true,
    "url": "string",
    "user": {
      "avatar_url": "string",
      "bio": "string",
      "blog": "string",
      "collaborators": 9,
      "company": "string",
      "created_at": "string",
      "disk_usage": 5,
      "email": "string",
      "followers": 2,
      "followers_url": "string",
      "following": 1,
      "following_url": "string",
      "gists_url": "string",
      "gravatar_id": "string",
      "hireable": false,
      "html_url": "string",
      "id": 8,
      "location": "string",
      "login": "string",
      "name": "string",
      "organizations_url": "string",
      "owned_private_repos": 8,
      "plan": {
        "collaborators": 5,
        "name": "string",
        "private_repos": 7,
        "space": 9
      },
      "private_gists": 6,
      "public_gists": 9,
      "public_repos": 6,
      "starred_url": "string",
      "subscriptions_url": "string",
      "total_private_repos": 6,
      "type": "Organization",
      "updated_at": "string",
      "url": "string"
    }
  },
  {
    "comments": 6,
    "comments_url": "string",
    "created_at": "string",
    "description": "string",
    "files": {
      "ring.erl": {
        "filename": "string",
        "raw_url": "string",
        "size": 10
      }
    },
    "git_pull_url": "string",
    "git_push_url": "string",
    "html_url": "string",
    "id": "string",
    "public": true,
    "url": "string",
    "user": {
      "avatar_url": "string",
      "bio": "string",
      "blog": "string",
      "collaborators": 8,
      "company": "string",
      "created_at": "string",
      "disk_usage": 3,
      "email": "string",
      "followers": 7,
      "followers_url": "string",
      "following": 8,
      "following_url": "string",
      "gists_url": "string",
      "gravatar_id": "string",
      "hireable": false,
      "html_url": "string",
      "id": 8,
      "location": "string",
      "login": "string",
      "name": "string",
      "organizations_url": "string",
      "owned_private_repos": 8,
      "plan": {
        "collaborators": 9,
        "name": "string",
        "private_repos": 4,
        "space": 3
      },
      "private_gists": 7,
      "public_gists": 9,
      "public_repos": 9,
      "starred_url": "string",
      "subscriptions_url": "string",
      "total_private_repos": 8,
      "type": "Organization",
      "updated_at": "string",
      "url": "string"
    }
  }
]