{
  "success": false,
  "messages": [
    {
      "code": 3,
      "msg": "string",
      "type": "warning",
      "extra": {}
    },
    {
      "code": 1,
      "msg": "string",
      "type": "notice",
      "extra": {}
    }
  ],
  "data": [
    {
      "pool_end_hostaddr": "string",
      "pool_end_ip_addr": "string",
      "pool_multistatus": "string",
      "parent_network_class_name": "string",
      "parent_network_id": "string",
      "parent_network_name": "string",
      "parent_network_size": "string",
      "pool_class_name": "string",
      "pool_class_parameters": [
        {
          "name": "string",
          "value": "string",
          "inheritance": "set",
          "propagation": "restrict",
          "source": "string"
        },
        {
          "name": "string",
          "value": "string",
          "inheritance": "inherited",
          "propagation": "restrict",
          "source": "string"
        },
        {
          "name": "string",
          "value": "string",
          "inheritance": "inherited",
          "propagation": "propagate",
          "source": "string"
        },
        {
          "name": "string",
          "value": "string",
          "inheritance": "set",
          "propagation": "restrict",
          "source": "string"
        }
      ],
      "pool_end_address_addr": "string",
      "pool_id": "string",
      "pool_name": "string",
      "pool_read_only": "string",
      "pool_size": "string",
      "pool_start_address_addr": "string",
      "space_class_name": "string",
      "space_class_parameters": [
        {
          "name": "string",
          "value": "string",
          "inheritance": "set",
          "propagation": "propagate",
          "source": "string"
        },
        {
          "name": "string",
          "value": "string",
          "inheritance": "inherited",
          "propagation": "restrict",
          "source": "string"
        },
        {
          "name": "string",
          "value": "string",
          "inheritance": "set",
          "propagation": "restrict",
          "source": "string"
        },
        {
          "name": "string",
          "value": "string",
          "inheritance": "set",
          "propagation": "restrict",
          "source": "string"
        },
        {
          "name": "string",
          "value": "string",
          "inheritance": "inherited",
          "propagation": "propagate",
          "source": "string"
        },
        {
          "name": "string",
          "value": "string",
          "inheritance": "set",
          "propagation": "restrict",
          "source": "string"
        }
      ],
      "space_description": "string",
      "space_id": "string",
      "space_is_template": "string",
      "space_name": "string",
      "pool_start_hostaddr": "string",
      "pool_start_ip_addr": "string",
      "network_class_name": "string",
      "network_class_parameters": [
        {
          "name": "string",
          "value": "string",
          "inheritance": "set",
          "propagation": "restrict",
          "source": "string"
        },
        {
          "name": "string",
          "value": "string",
          "inheritance": "inherited",
          "propagation": "propagate",
          "source": "string"
        },
        {
          "name": "string",
          "value": "string",
          "inheritance": "set",
          "propagation": "restrict",
          "source": "string"
        },
        {
          "name": "string",
          "value": "string",
          "inheritance": "inherited",
          "propagation": "propagate",
          "source": "string"
        },
        {
          "name": "string",
          "value": "string",
          "inheritance": "set",
          "propagation": "restrict",
          "source": "string"
        }
      ],
      "network_end_address_addr": "string",
      "network_id": "string",
      "network_name": "string",
      "network_size": "string",
      "network_start_address_addr": "string",
      "vlsm_block_id": "string",
      "vlsm_network_id": "string"
    },
    {
      "pool_end_hostaddr": "string",
      "pool_end_ip_addr": "string",
      "pool_multistatus": "string",
      "parent_network_class_name": "string",
      "parent_network_id": "string",
      "parent_network_name": "string",
      "parent_network_size": "string",
      "pool_class_name": "string",
      "pool_class_parameters": [
        {
          "name": "string",
          "value": "string",
          "inheritance": "inherited",
          "propagation": "propagate",
          "source": "string"
        },
        {
          "name": "string",
          "value": "string",
          "inheritance": "set",
          "propagation": "propagate",
          "source": "string"
        },
        {
          "name": "string",
          "value": "string",
          "inheritance": "inherited",
          "propagation": "propagate",
          "source": "string"
        },
        {
          "name": "string",
          "value": "string",
          "inheritance": "set",
          "propagation": "restrict",
          "source": "string"
        }
      ],
      "pool_end_address_addr": "string",
      "pool_id": "string",
      "pool_name": "string",
      "pool_read_only": "string",
      "pool_size": "string",
      "pool_start_address_addr": "string",
      "space_class_name": "string",
      "space_class_parameters": [
        {
          "name": "string",
          "value": "string",
          "inheritance": "inherited",
          "propagation": "restrict",
          "source": "string"
        }
      ],
      "space_description": "string",
      "space_id": "string",
      "space_is_template": "string",
      "space_name": "string",
      "pool_start_hostaddr": "string",
      "pool_start_ip_addr": "string",
      "network_class_name": "string",
      "network_class_parameters": [
        {
          "name": "string",
          "value": "string",
          "inheritance": "set",
          "propagation": "restrict",
          "source": "string"
        },
        {
          "name": "string",
          "value": "string",
          "inheritance": "inherited",
          "propagation": "propagate",
          "source": "string"
        },
        {
          "name": "string",
          "value": "string",
          "inheritance": "set",
          "propagation": "propagate",
          "source": "string"
        },
        {
          "name": "string",
          "value": "string",
          "inheritance": "set",
          "propagation": "propagate",
          "source": "string"
        },
        {
          "name": "string",
          "value": "string",
          "inheritance": "set",
          "propagation": "restrict",
          "source": "string"
        },
        {
          "name": "string",
          "value": "string",
          "inheritance": "inherited",
          "propagation": "restrict",
          "source": "string"
        },
        {
          "name": "string",
          "value": "string",
          "inheritance": "inherited",
          "propagation": "restrict",
          "source": "string"
        },
        {
          "name": "string",
          "value": "string",
          "inheritance": "set",
          "propagation": "restrict",
          "source": "string"
        },
        {
          "name": "string",
          "value": "string",
          "inheritance": "inherited",
          "propagation": "restrict",
          "source": "string"
        },
        {
          "name": "string",
          "value": "string",
          "inheritance": "inherited",
          "propagation": "propagate",
          "source": "string"
        }
      ],
      "network_end_address_addr": "string",
      "network_id": "string",
      "network_name": "string",
      "network_size": "string",
      "network_start_address_addr": "string",
      "vlsm_block_id": "string",
      "vlsm_network_id": "string"
    },
    {
      "pool_end_hostaddr": "string",
      "pool_end_ip_addr": "string",
      "pool_multistatus": "string",
      "parent_network_class_name": "string",
      "parent_network_id": "string",
      "parent_network_name": "string",
      "parent_network_size": "string",
      "pool_class_name": "string",
      "pool_class_parameters": [
        {
          "name": "string",
          "value": "string",
          "inheritance": "inherited",
          "propagation": "propagate",
          "source": "string"
        },
        {
          "name": "string",
          "value": "string",
          "inheritance": "inherited",
          "propagation": "restrict",
          "source": "string"
        },
        {
          "name": "string",
          "value": "string",
          "inheritance": "inherited",
          "propagation": "propagate",
          "source": "string"
        },
        {
          "name": "string",
          "value": "string",
          "inheritance": "set",
          "propagation": "restrict",
          "source": "string"
        },
        {
          "name": "string",
          "value": "string",
          "inheritance": "inherited",
          "propagation": "restrict",
          "source": "string"
        },
        {
          "name": "string",
          "value": "string",
          "inheritance": "inherited",
          "propagation": "restrict",
          "source": "string"
        },
        {
          "name": "string",
          "value": "string",
          "inheritance": "set",
          "propagation": "propagate",
          "source": "string"
        },
        {
          "name": "string",
          "value": "string",
          "inheritance": "set",
          "propagation": "restrict",
          "source": "string"
        },
        {
          "name": "string",
          "value": "string",
          "inheritance": "inherited",
          "propagation": "propagate",
          "source": "string"
        },
        {
          "name": "string",
          "value": "string",
          "inheritance": "inherited",
          "propagation": "restrict",
          "source": "string"
        }
      ],
      "pool_end_address_addr": "string",
      "pool_id": "string",
      "pool_name": "string",
      "pool_read_only": "string",
      "pool_size": "string",
      "pool_start_address_addr": "string",
      "space_class_name": "string",
      "space_class_parameters": [
        {
          "name": "string",
          "value": "string",
          "inheritance": "inherited",
          "propagation": "restrict",
          "source": "string"
        },
        {
          "name": "string",
          "value": "string",
          "inheritance": "set",
          "propagation": "propagate",
          "source": "string"
        },
        {
          "name": "string",
          "value": "string",
          "inheritance": "set",
          "propagation": "propagate",
          "source": "string"
        },
        {
          "name": "string",
          "value": "string",
          "inheritance": "set",
          "propagation": "propagate",
          "source": "string"
        },
        {
          "name": "string",
          "value": "string",
          "inheritance": "set",
          "propagation": "propagate",
          "source": "string"
        },
        {
          "name": "string",
          "value": "string",
          "inheritance": "set",
          "propagation": "propagate",
          "source": "string"
        },
        {
          "name": "string",
          "value": "string",
          "inheritance": "inherited",
          "propagation": "propagate",
          "source": "string"
        },
        {
          "name": "string",
          "value": "string",
          "inheritance": "set",
          "propagation": "restrict",
          "source": "string"
        },
        {
          "name": "string",
          "value": "string",
          "inheritance": "inherited",
          "propagation": "restrict",
          "source": "string"
        },
        {
          "name": "string",
          "value": "string",
          "inheritance": "inherited",
          "propagation": "restrict",
          "source": "string"
        }
      ],
      "space_description": "string",
      "space_id": "string",
      "space_is_template": "string",
      "space_name": "string",
      "pool_start_hostaddr": "string",
      "pool_start_ip_addr": "string",
      "network_class_name": "string",
      "network_class_parameters": [
        {
          "name": "string",
          "value": "string",
          "inheritance": "set",
          "propagation": "restrict",
          "source": "string"
        },
        {
          "name": "string",
          "value": "string",
          "inheritance": "set",
          "propagation": "propagate",
          "source": "string"
        }
      ],
      "network_end_address_addr": "string",
      "network_id": "string",
      "network_name": "string",
      "network_size": "string",
      "network_start_address_addr": "string",
      "vlsm_block_id": "string",
      "vlsm_network_id": "string"
    },
    {
      "pool_end_hostaddr": "string",
      "pool_end_ip_addr": "string",
      "pool_multistatus": "string",
      "parent_network_class_name": "string",
      "parent_network_id": "string",
      "parent_network_name": "string",
      "parent_network_size": "string",
      "pool_class_name": "string",
      "pool_class_parameters": [
        {
          "name": "string",
          "value": "string",
          "inheritance": "inherited",
          "propagation": "restrict",
          "source": "string"
        }
      ],
      "pool_end_address_addr": "string",
      "pool_id": "string",
      "pool_name": "string",
      "pool_read_only": "string",
      "pool_size": "string",
      "pool_start_address_addr": "string",
      "space_class_name": "string",
      "space_class_parameters": [
        {
          "name": "string",
          "value": "string",
          "inheritance": "inherited",
          "propagation": "propagate",
          "source": "string"
        }
      ],
      "space_description": "string",
      "space_id": "string",
      "space_is_template": "string",
      "space_name": "string",
      "pool_start_hostaddr": "string",
      "pool_start_ip_addr": "string",
      "network_class_name": "string",
      "network_class_parameters": [
        {
          "name": "string",
          "value": "string",
          "inheritance": "inherited",
          "propagation": "restrict",
          "source": "string"
        },
        {
          "name": "string",
          "value": "string",
          "inheritance": "set",
          "propagation": "restrict",
          "source": "string"
        },
        {
          "name": "string",
          "value": "string",
          "inheritance": "inherited",
          "propagation": "propagate",
          "source": "string"
        },
        {
          "name": "string",
          "value": "string",
          "inheritance": "inherited",
          "propagation": "restrict",
          "source": "string"
        },
        {
          "name": "string",
          "value": "string",
          "inheritance": "set",
          "propagation": "restrict",
          "source": "string"
        },
        {
          "name": "string",
          "value": "string",
          "inheritance": "inherited",
          "propagation": "restrict",
          "source": "string"
        },
        {
          "name": "string",
          "value": "string",
          "inheritance": "inherited",
          "propagation": "restrict",
          "source": "string"
        },
        {
          "name": "string",
          "value": "string",
          "inheritance": "set",
          "propagation": "restrict",
          "source": "string"
        },
        {
          "name": "string",
          "value": "string",
          "inheritance": "set",
          "propagation": "propagate",
          "source": "string"
        },
        {
          "name": "string",
          "value": "string",
          "inheritance": "set",
          "propagation": "restrict",
          "source": "string"
        }
      ],
      "network_end_address_addr": "string",
      "network_id": "string",
      "network_name": "string",
      "network_size": "string",
      "network_start_address_addr": "string",
      "vlsm_block_id": "string",
      "vlsm_network_id": "string"
    },
    {
      "pool_end_hostaddr": "string",
      "pool_end_ip_addr": "string",
      "pool_multistatus": "string",
      "parent_network_class_name": "string",
      "parent_network_id": "string",
      "parent_network_name": "string",
      "parent_network_size": "string",
      "pool_class_name": "string",
      "pool_class_parameters": [
        {
          "name": "string",
          "value": "string",
          "inheritance": "inherited",
          "propagation": "restrict",
          "source": "string"
        },
        {
          "name": "string",
          "value": "string",
          "inheritance": "inherited",
          "propagation": "propagate",
          "source": "string"
        },
        {
          "name": "string",
          "value": "string",
          "inheritance": "set",
          "propagation": "propagate",
          "source": "string"
        },
        {
          "name": "string",
          "value": "string",
          "inheritance": "inherited",
          "propagation": "restrict",
          "source": "string"
        },
        {
          "name": "string",
          "value": "string",
          "inheritance": "set",
          "propagation": "propagate",
          "source": "string"
        },
        {
          "name": "string",
          "value": "string",
          "inheritance": "set",
          "propagation": "propagate",
          "source": "string"
        },
        {
          "name": "string",
          "value": "string",
          "inheritance": "inherited",
          "propagation": "restrict",
          "source": "string"
        }
      ],
      "pool_end_address_addr": "string",
      "pool_id": "string",
      "pool_name": "string",
      "pool_read_only": "string",
      "pool_size": "string",
      "pool_start_address_addr": "string",
      "space_class_name": "string",
      "space_class_parameters": [
        {
          "name": "string",
          "value": "string",
          "inheritance": "inherited",
          "propagation": "propagate",
          "source": "string"
        },
        {
          "name": "string",
          "value": "string",
          "inheritance": "set",
          "propagation": "propagate",
          "source": "string"
        },
        {
          "name": "string",
          "value": "string",
          "inheritance": "inherited",
          "propagation": "propagate",
          "source": "string"
        },
        {
          "name": "string",
          "value": "string",
          "inheritance": "inherited",
          "propagation": "restrict",
          "source": "string"
        },
        {
          "name": "string",
          "value": "string",
          "inheritance": "set",
          "propagation": "propagate",
          "source": "string"
        },
        {
          "name": "string",
          "value": "string",
          "inheritance": "set",
          "propagation": "propagate",
          "source": "string"
        },
        {
          "name": "string",
          "value": "string",
          "inheritance": "inherited",
          "propagation": "restrict",
          "source": "string"
        },
        {
          "name": "string",
          "value": "string",
          "inheritance": "inherited",
          "propagation": "restrict",
          "source": "string"
        },
        {
          "name": "string",
          "value": "string",
          "inheritance": "inherited",
          "propagation": "propagate",
          "source": "string"
        },
        {
          "name": "string",
          "value": "string",
          "inheritance": "set",
          "propagation": "restrict",
          "source": "string"
        }
      ],
      "space_description": "string",
      "space_id": "string",
      "space_is_template": "string",
      "space_name": "string",
      "pool_start_hostaddr": "string",
      "pool_start_ip_addr": "string",
      "network_class_name": "string",
      "network_class_parameters": [
        {
          "name": "string",
          "value": "string",
          "inheritance": "inherited",
          "propagation": "propagate",
          "source": "string"
        }
      ],
      "network_end_address_addr": "string",
      "network_id": "string",
      "network_name": "string",
      "network_size": "string",
      "network_start_address_addr": "string",
      "vlsm_block_id": "string",
      "vlsm_network_id": "string"
    }
  ]
}