{
  "success": true,
  "messages": [
    {
      "code": 2,
      "msg": "string",
      "type": "notice",
      "extra": {}
    },
    {
      "code": 1,
      "msg": "string",
      "type": "error",
      "extra": {}
    }
  ],
  "data": [
    {
      "count": 4
    },
    {
      "count": 6
    },
    {
      "count": 5
    },
    {
      "count": 10
    },
    {
      "count": 7
    },
    {
      "count": 2
    },
    {
      "count": 8
    },
    {
      "count": 7
    }
  ]
}