{
  "success": false,
  "messages": [
    {
      "code": 7,
      "msg": "string",
      "type": "error",
      "extra": {}
    },
    {
      "code": 6,
      "msg": "string",
      "type": "warning",
      "extra": {}
    },
    {
      "code": 6,
      "msg": "string",
      "type": "notice",
      "extra": {}
    },
    {
      "code": 1,
      "msg": "string",
      "type": "warning",
      "extra": {}
    },
    {
      "code": 2,
      "msg": "string",
      "type": "notice",
      "extra": {}
    },
    {
      "code": 3,
      "msg": "string",
      "type": "warning",
      "extra": {}
    },
    {
      "code": 4,
      "msg": "string",
      "type": "notice",
      "extra": {}
    },
    {
      "code": 2,
      "msg": "string",
      "type": "warning",
      "extra": {}
    },
    {
      "code": 8,
      "msg": "string",
      "type": "warning",
      "extra": {}
    },
    {
      "code": 6,
      "msg": "string",
      "type": "notice",
      "extra": {}
    }
  ],
  "data": [
    {
      "free_end_vlan_id": "string",
      "free_start_vlan_id": "string",
      "domain_support_vxlan": "string",
      "vlan_type": "string",
      "domain_class_name": "string",
      "domain_description": "string",
      "domain_end_vlan_id": "string",
      "domain_id": "string",
      "domain_name": "string",
      "domain_start_vlan_id": "string",
      "range_class_name": "string",
      "range_description": "string",
      "range_end_vlan_id": "string",
      "range_id": "string",
      "range_name": "string",
      "range_start_vlan_id": "string",
      "vlan_id": "string",
      "vlan_name": "string",
      "vlan_vlan_id": "string"
    },
    {
      "free_end_vlan_id": "string",
      "free_start_vlan_id": "string",
      "domain_support_vxlan": "string",
      "vlan_type": "string",
      "domain_class_name": "string",
      "domain_description": "string",
      "domain_end_vlan_id": "string",
      "domain_id": "string",
      "domain_name": "string",
      "domain_start_vlan_id": "string",
      "range_class_name": "string",
      "range_description": "string",
      "range_end_vlan_id": "string",
      "range_id": "string",
      "range_name": "string",
      "range_start_vlan_id": "string",
      "vlan_id": "string",
      "vlan_name": "string",
      "vlan_vlan_id": "string"
    },
    {
      "free_end_vlan_id": "string",
      "free_start_vlan_id": "string",
      "domain_support_vxlan": "string",
      "vlan_type": "string",
      "domain_class_name": "string",
      "domain_description": "string",
      "domain_end_vlan_id": "string",
      "domain_id": "string",
      "domain_name": "string",
      "domain_start_vlan_id": "string",
      "range_class_name": "string",
      "range_description": "string",
      "range_end_vlan_id": "string",
      "range_id": "string",
      "range_name": "string",
      "range_start_vlan_id": "string",
      "vlan_id": "string",
      "vlan_name": "string",
      "vlan_vlan_id": "string"
    }
  ]
}