{
  "success": false,
  "messages": [
    {
      "code": 4,
      "msg": "string",
      "type": "notice",
      "extra": {}
    },
    {
      "code": 8,
      "msg": "string",
      "type": "error",
      "extra": {}
    }
  ],
  "data": [
    {
      "count": 7
    },
    {
      "count": 4
    },
    {
      "count": 2
    },
    {
      "count": 2
    },
    {
      "count": 6
    },
    {
      "count": 9
    },
    {
      "count": 7
    },
    {
      "count": 3
    },
    {
      "count": 1
    },
    {
      "count": 8
    }
  ]
}