{
  "success": false,
  "messages": [
    {
      "code": 10,
      "msg": "string",
      "type": "warning",
      "extra": {}
    },
    {
      "code": 4,
      "msg": "string",
      "type": "notice",
      "extra": {}
    },
    {
      "code": 10,
      "msg": "string",
      "type": "error",
      "extra": {}
    },
    {
      "code": 5,
      "msg": "string",
      "type": "warning",
      "extra": {}
    }
  ],
  "data": [
    {
      "server_cisco_login": "string",
      "server_cisco_password": "string",
      "server_cisco_root_password": "string",
      "server_cisco_use_ssh": "string",
      "server_class_name": "string",
      "server_class_parameters": [
        {
          "name": "string",
          "value": "string",
          "inheritance": "inherited",
          "propagation": "propagate",
          "source": "string"
        },
        {
          "name": "string",
          "value": "string",
          "inheritance": "inherited",
          "propagation": "propagate",
          "source": "string"
        },
        {
          "name": "string",
          "value": "string",
          "inheritance": "set",
          "propagation": "restrict",
          "source": "string"
        },
        {
          "name": "string",
          "value": "string",
          "inheritance": "inherited",
          "propagation": "propagate",
          "source": "string"
        },
        {
          "name": "string",
          "value": "string",
          "inheritance": "set",
          "propagation": "restrict",
          "source": "string"
        },
        {
          "name": "string",
          "value": "string",
          "inheritance": "inherited",
          "propagation": "restrict",
          "source": "string"
        },
        {
          "name": "string",
          "value": "string",
          "inheritance": "set",
          "propagation": "restrict",
          "source": "string"
        }
      ],
      "server_comment": "string",
      "server_dcs_key": "string",
      "server_id": "string",
      "server_last_refresh_time": "string",
      "server_localtime": "string",
      "server_name": "string",
      "server_state": "string",
      "server_synching": "string",
      "server_type": "string",
      "server_uboottime": "string",
      "server_version": "string",
      "server_addr": "string",
      "server_ip_id": "string",
      "server_https_login": "string",
      "server_is_package": "string",
      "server_ipmdhcp_protocol": "string",
      "server_isolated": "string",
      "server_ms_use_ssl": "string",
      "server_msrpc_domain": "string",
      "server_msrpc_login": "string",
      "server_msrpc_password": "string",
      "server_multistatus": "string",
      "ref1_server_name": "string",
      "ref2_server_name": "string",
      "space_name": "string",
      "server_snmp_id": "string",
      "server_snmp_port": "string",
      "server_snmp_profile_id": "string",
      "server_snmp_retry": "string",
      "server_snmp_timeout": "string",
      "server_snmp_use_tcp": "string",
      "server_stat_enabled": "string",
      "server_stat_niceness": "string",
      "server_stat_period": "string",
      "server_stat_time": "string",
      "server_tcp_port": "string",
      "total_smart_members": "string",
      "smart_arch": "string",
      "smart_members_name": "string",
      "smart_param1": "string",
      "smart_parent_arch": "string",
      "smart_parent_id": "string",
      "smart_parent_name": "string",
      "smart_ref1_server_id": "string",
      "smart_ref1_server_name": "string",
      "smart_ref2_server_id": "string",
      "smart_ref2_server_name": "string",
      "server_windhcp_protocol": "string"
    },
    {
      "server_cisco_login": "string",
      "server_cisco_password": "string",
      "server_cisco_root_password": "string",
      "server_cisco_use_ssh": "string",
      "server_class_name": "string",
      "server_class_parameters": [
        {
          "name": "string",
          "value": "string",
          "inheritance": "inherited",
          "propagation": "propagate",
          "source": "string"
        },
        {
          "name": "string",
          "value": "string",
          "inheritance": "inherited",
          "propagation": "restrict",
          "source": "string"
        },
        {
          "name": "string",
          "value": "string",
          "inheritance": "inherited",
          "propagation": "restrict",
          "source": "string"
        },
        {
          "name": "string",
          "value": "string",
          "inheritance": "set",
          "propagation": "propagate",
          "source": "string"
        },
        {
          "name": "string",
          "value": "string",
          "inheritance": "set",
          "propagation": "propagate",
          "source": "string"
        },
        {
          "name": "string",
          "value": "string",
          "inheritance": "inherited",
          "propagation": "restrict",
          "source": "string"
        },
        {
          "name": "string",
          "value": "string",
          "inheritance": "inherited",
          "propagation": "restrict",
          "source": "string"
        },
        {
          "name": "string",
          "value": "string",
          "inheritance": "set",
          "propagation": "propagate",
          "source": "string"
        }
      ],
      "server_comment": "string",
      "server_dcs_key": "string",
      "server_id": "string",
      "server_last_refresh_time": "string",
      "server_localtime": "string",
      "server_name": "string",
      "server_state": "string",
      "server_synching": "string",
      "server_type": "string",
      "server_uboottime": "string",
      "server_version": "string",
      "server_addr": "string",
      "server_ip_id": "string",
      "server_https_login": "string",
      "server_is_package": "string",
      "server_ipmdhcp_protocol": "string",
      "server_isolated": "string",
      "server_ms_use_ssl": "string",
      "server_msrpc_domain": "string",
      "server_msrpc_login": "string",
      "server_msrpc_password": "string",
      "server_multistatus": "string",
      "ref1_server_name": "string",
      "ref2_server_name": "string",
      "space_name": "string",
      "server_snmp_id": "string",
      "server_snmp_port": "string",
      "server_snmp_profile_id": "string",
      "server_snmp_retry": "string",
      "server_snmp_timeout": "string",
      "server_snmp_use_tcp": "string",
      "server_stat_enabled": "string",
      "server_stat_niceness": "string",
      "server_stat_period": "string",
      "server_stat_time": "string",
      "server_tcp_port": "string",
      "total_smart_members": "string",
      "smart_arch": "string",
      "smart_members_name": "string",
      "smart_param1": "string",
      "smart_parent_arch": "string",
      "smart_parent_id": "string",
      "smart_parent_name": "string",
      "smart_ref1_server_id": "string",
      "smart_ref1_server_name": "string",
      "smart_ref2_server_id": "string",
      "smart_ref2_server_name": "string",
      "server_windhcp_protocol": "string"
    },
    {
      "server_cisco_login": "string",
      "server_cisco_password": "string",
      "server_cisco_root_password": "string",
      "server_cisco_use_ssh": "string",
      "server_class_name": "string",
      "server_class_parameters": [
        {
          "name": "string",
          "value": "string",
          "inheritance": "inherited",
          "propagation": "restrict",
          "source": "string"
        },
        {
          "name": "string",
          "value": "string",
          "inheritance": "set",
          "propagation": "propagate",
          "source": "string"
        },
        {
          "name": "string",
          "value": "string",
          "inheritance": "inherited",
          "propagation": "propagate",
          "source": "string"
        },
        {
          "name": "string",
          "value": "string",
          "inheritance": "set",
          "propagation": "propagate",
          "source": "string"
        }
      ],
      "server_comment": "string",
      "server_dcs_key": "string",
      "server_id": "string",
      "server_last_refresh_time": "string",
      "server_localtime": "string",
      "server_name": "string",
      "server_state": "string",
      "server_synching": "string",
      "server_type": "string",
      "server_uboottime": "string",
      "server_version": "string",
      "server_addr": "string",
      "server_ip_id": "string",
      "server_https_login": "string",
      "server_is_package": "string",
      "server_ipmdhcp_protocol": "string",
      "server_isolated": "string",
      "server_ms_use_ssl": "string",
      "server_msrpc_domain": "string",
      "server_msrpc_login": "string",
      "server_msrpc_password": "string",
      "server_multistatus": "string",
      "ref1_server_name": "string",
      "ref2_server_name": "string",
      "space_name": "string",
      "server_snmp_id": "string",
      "server_snmp_port": "string",
      "server_snmp_profile_id": "string",
      "server_snmp_retry": "string",
      "server_snmp_timeout": "string",
      "server_snmp_use_tcp": "string",
      "server_stat_enabled": "string",
      "server_stat_niceness": "string",
      "server_stat_period": "string",
      "server_stat_time": "string",
      "server_tcp_port": "string",
      "total_smart_members": "string",
      "smart_arch": "string",
      "smart_members_name": "string",
      "smart_param1": "string",
      "smart_parent_arch": "string",
      "smart_parent_id": "string",
      "smart_parent_name": "string",
      "smart_ref1_server_id": "string",
      "smart_ref1_server_name": "string",
      "smart_ref2_server_id": "string",
      "smart_ref2_server_name": "string",
      "server_windhcp_protocol": "string"
    }
  ]
}