{
  "success": true,
  "messages": [
    {
      "code": 7,
      "msg": "string",
      "type": "error",
      "extra": {}
    }
  ],
  "data": [
    {
      "static6_id": "string"
    },
    {
      "static6_id": "string"
    },
    {
      "static6_id": "string"
    },
    {
      "static6_id": "string"
    },
    {
      "static6_id": "string"
    },
    {
      "static6_id": "string"
    },
    {
      "static6_id": "string"
    },
    {
      "static6_id": "string"
    },
    {
      "static6_id": "string"
    }
  ]
}