{
  "success": false,
  "messages": [
    {
      "code": 7,
      "msg": "string",
      "type": "notice",
      "extra": {}
    },
    {
      "code": 10,
      "msg": "string",
      "type": "error",
      "extra": {}
    },
    {
      "code": 9,
      "msg": "string",
      "type": "warning",
      "extra": {}
    },
    {
      "code": 10,
      "msg": "string",
      "type": "error",
      "extra": {}
    },
    {
      "code": 2,
      "msg": "string",
      "type": "notice",
      "extra": {}
    },
    {
      "code": 6,
      "msg": "string",
      "type": "notice",
      "extra": {}
    },
    {
      "code": 2,
      "msg": "string",
      "type": "notice",
      "extra": {}
    },
    {
      "code": 3,
      "msg": "string",
      "type": "error",
      "extra": {}
    },
    {
      "code": 10,
      "msg": "string",
      "type": "notice",
      "extra": {}
    },
    {
      "code": 7,
      "msg": "string",
      "type": "warning",
      "extra": {}
    }
  ],
  "data": [
    {
      "admin_status": "string",
      "application_fqdn": "string",
      "gslbserver_id": "string",
      "gslbserver_name": "string",
      "application_id": "string",
      "application_name": "string",
      "healthcheck_failback": "string",
      "healthcheck_failover": "string",
      "healthcheck_freq": "string",
      "healthcheck_id": "string",
      "healthcheck_name": "string",
      "healthcheck_params": "string",
      "healthcheck_timeout": "string",
      "node_id": "string",
      "node_address6_addr": "string",
      "node_address_addr": "string",
      "node_name": "string",
      "node_status": "string",
      "node_weight": "string",
      "pool_id": "string",
      "pool_lb_mode": "string",
      "pool_name": "string",
      "node_delayed_time": "string",
      "gslbserver_type": "string",
      "parent_application_id": "string",
      "translated_healthcheck_name": "string",
      "translated_pool_lb_mode": "string"
    },
    {
      "admin_status": "string",
      "application_fqdn": "string",
      "gslbserver_id": "string",
      "gslbserver_name": "string",
      "application_id": "string",
      "application_name": "string",
      "healthcheck_failback": "string",
      "healthcheck_failover": "string",
      "healthcheck_freq": "string",
      "healthcheck_id": "string",
      "healthcheck_name": "string",
      "healthcheck_params": "string",
      "healthcheck_timeout": "string",
      "node_id": "string",
      "node_address6_addr": "string",
      "node_address_addr": "string",
      "node_name": "string",
      "node_status": "string",
      "node_weight": "string",
      "pool_id": "string",
      "pool_lb_mode": "string",
      "pool_name": "string",
      "node_delayed_time": "string",
      "gslbserver_type": "string",
      "parent_application_id": "string",
      "translated_healthcheck_name": "string",
      "translated_pool_lb_mode": "string"
    },
    {
      "admin_status": "string",
      "application_fqdn": "string",
      "gslbserver_id": "string",
      "gslbserver_name": "string",
      "application_id": "string",
      "application_name": "string",
      "healthcheck_failback": "string",
      "healthcheck_failover": "string",
      "healthcheck_freq": "string",
      "healthcheck_id": "string",
      "healthcheck_name": "string",
      "healthcheck_params": "string",
      "healthcheck_timeout": "string",
      "node_id": "string",
      "node_address6_addr": "string",
      "node_address_addr": "string",
      "node_name": "string",
      "node_status": "string",
      "node_weight": "string",
      "pool_id": "string",
      "pool_lb_mode": "string",
      "pool_name": "string",
      "node_delayed_time": "string",
      "gslbserver_type": "string",
      "parent_application_id": "string",
      "translated_healthcheck_name": "string",
      "translated_pool_lb_mode": "string"
    },
    {
      "admin_status": "string",
      "application_fqdn": "string",
      "gslbserver_id": "string",
      "gslbserver_name": "string",
      "application_id": "string",
      "application_name": "string",
      "healthcheck_failback": "string",
      "healthcheck_failover": "string",
      "healthcheck_freq": "string",
      "healthcheck_id": "string",
      "healthcheck_name": "string",
      "healthcheck_params": "string",
      "healthcheck_timeout": "string",
      "node_id": "string",
      "node_address6_addr": "string",
      "node_address_addr": "string",
      "node_name": "string",
      "node_status": "string",
      "node_weight": "string",
      "pool_id": "string",
      "pool_lb_mode": "string",
      "pool_name": "string",
      "node_delayed_time": "string",
      "gslbserver_type": "string",
      "parent_application_id": "string",
      "translated_healthcheck_name": "string",
      "translated_pool_lb_mode": "string"
    },
    {
      "admin_status": "string",
      "application_fqdn": "string",
      "gslbserver_id": "string",
      "gslbserver_name": "string",
      "application_id": "string",
      "application_name": "string",
      "healthcheck_failback": "string",
      "healthcheck_failover": "string",
      "healthcheck_freq": "string",
      "healthcheck_id": "string",
      "healthcheck_name": "string",
      "healthcheck_params": "string",
      "healthcheck_timeout": "string",
      "node_id": "string",
      "node_address6_addr": "string",
      "node_address_addr": "string",
      "node_name": "string",
      "node_status": "string",
      "node_weight": "string",
      "pool_id": "string",
      "pool_lb_mode": "string",
      "pool_name": "string",
      "node_delayed_time": "string",
      "gslbserver_type": "string",
      "parent_application_id": "string",
      "translated_healthcheck_name": "string",
      "translated_pool_lb_mode": "string"
    },
    {
      "admin_status": "string",
      "application_fqdn": "string",
      "gslbserver_id": "string",
      "gslbserver_name": "string",
      "application_id": "string",
      "application_name": "string",
      "healthcheck_failback": "string",
      "healthcheck_failover": "string",
      "healthcheck_freq": "string",
      "healthcheck_id": "string",
      "healthcheck_name": "string",
      "healthcheck_params": "string",
      "healthcheck_timeout": "string",
      "node_id": "string",
      "node_address6_addr": "string",
      "node_address_addr": "string",
      "node_name": "string",
      "node_status": "string",
      "node_weight": "string",
      "pool_id": "string",
      "pool_lb_mode": "string",
      "pool_name": "string",
      "node_delayed_time": "string",
      "gslbserver_type": "string",
      "parent_application_id": "string",
      "translated_healthcheck_name": "string",
      "translated_pool_lb_mode": "string"
    },
    {
      "admin_status": "string",
      "application_fqdn": "string",
      "gslbserver_id": "string",
      "gslbserver_name": "string",
      "application_id": "string",
      "application_name": "string",
      "healthcheck_failback": "string",
      "healthcheck_failover": "string",
      "healthcheck_freq": "string",
      "healthcheck_id": "string",
      "healthcheck_name": "string",
      "healthcheck_params": "string",
      "healthcheck_timeout": "string",
      "node_id": "string",
      "node_address6_addr": "string",
      "node_address_addr": "string",
      "node_name": "string",
      "node_status": "string",
      "node_weight": "string",
      "pool_id": "string",
      "pool_lb_mode": "string",
      "pool_name": "string",
      "node_delayed_time": "string",
      "gslbserver_type": "string",
      "parent_application_id": "string",
      "translated_healthcheck_name": "string",
      "translated_pool_lb_mode": "string"
    },
    {
      "admin_status": "string",
      "application_fqdn": "string",
      "gslbserver_id": "string",
      "gslbserver_name": "string",
      "application_id": "string",
      "application_name": "string",
      "healthcheck_failback": "string",
      "healthcheck_failover": "string",
      "healthcheck_freq": "string",
      "healthcheck_id": "string",
      "healthcheck_name": "string",
      "healthcheck_params": "string",
      "healthcheck_timeout": "string",
      "node_id": "string",
      "node_address6_addr": "string",
      "node_address_addr": "string",
      "node_name": "string",
      "node_status": "string",
      "node_weight": "string",
      "pool_id": "string",
      "pool_lb_mode": "string",
      "pool_name": "string",
      "node_delayed_time": "string",
      "gslbserver_type": "string",
      "parent_application_id": "string",
      "translated_healthcheck_name": "string",
      "translated_pool_lb_mode": "string"
    }
  ]
}