{
  "success": true,
  "messages": [
    {
      "code": 8,
      "msg": "string",
      "type": "warning",
      "extra": {}
    },
    {
      "code": 9,
      "msg": "string",
      "type": "notice",
      "extra": {}
    },
    {
      "code": 1,
      "msg": "string",
      "type": "error",
      "extra": {}
    },
    {
      "code": 8,
      "msg": "string",
      "type": "warning",
      "extra": {}
    },
    {
      "code": 8,
      "msg": "string",
      "type": "error",
      "extra": {}
    },
    {
      "code": 5,
      "msg": "string",
      "type": "notice",
      "extra": {}
    },
    {
      "code": 8,
      "msg": "string",
      "type": "warning",
      "extra": {}
    },
    {
      "code": 10,
      "msg": "string",
      "type": "error",
      "extra": {}
    }
  ],
  "data": [
    {
      "server_id": "string",
      "acl_id": "string",
      "acl_name": "string",
      "acl_value": "string"
    },
    {
      "server_id": "string",
      "acl_id": "string",
      "acl_name": "string",
      "acl_value": "string"
    }
  ]
}