{
  "success": false,
  "messages": [
    {
      "code": 3,
      "msg": "string",
      "type": "error",
      "extra": {}
    },
    {
      "code": 1,
      "msg": "string",
      "type": "error",
      "extra": {}
    },
    {
      "code": 9,
      "msg": "string",
      "type": "error",
      "extra": {}
    },
    {
      "code": 5,
      "msg": "string",
      "type": "notice",
      "extra": {}
    },
    {
      "code": 9,
      "msg": "string",
      "type": "warning",
      "extra": {}
    },
    {
      "code": 6,
      "msg": "string",
      "type": "notice",
      "extra": {}
    },
    {
      "code": 8,
      "msg": "string",
      "type": "warning",
      "extra": {}
    },
    {
      "code": 5,
      "msg": "string",
      "type": "error",
      "extra": {}
    }
  ],
  "data": [
    {
      "network6_end_hostaddr": "string",
      "end_address6_addr": "string",
      "network6_is_in_orphan": "string",
      "network6_is_terminal": "string",
      "network6_lock_network_broadcast": "string",
      "network6_multistatus": "string",
      "parent_end_address6_addr": "string",
      "parent_network6_is_terminal": "string",
      "parent_network6_percent_allocated": "string",
      "parent_network6_percent_used": "string",
      "parent_space_id": "string",
      "parent_space_name": "string",
      "parent_start_address6_addr": "string",
      "parent_network6_class_name": "string",
      "parent_network6_class_parameters": [
        {
          "name": "string",
          "value": "string",
          "inheritance": "set",
          "propagation": "propagate",
          "source": "string"
        },
        {
          "name": "string",
          "value": "string",
          "inheritance": "inherited",
          "propagation": "restrict",
          "source": "string"
        },
        {
          "name": "string",
          "value": "string",
          "inheritance": "set",
          "propagation": "restrict",
          "source": "string"
        },
        {
          "name": "string",
          "value": "string",
          "inheritance": "inherited",
          "propagation": "propagate",
          "source": "string"
        },
        {
          "name": "string",
          "value": "string",
          "inheritance": "inherited",
          "propagation": "restrict",
          "source": "string"
        },
        {
          "name": "string",
          "value": "string",
          "inheritance": "inherited",
          "propagation": "propagate",
          "source": "string"
        },
        {
          "name": "string",
          "value": "string",
          "inheritance": "set",
          "propagation": "propagate",
          "source": "string"
        }
      ],
      "parent_network6_id": "string",
      "parent_network6_name": "string",
      "parent_network6_prefix": "string",
      "parent_network_level": "string",
      "parent_network_path": "string",
      "parent_network_size": "string",
      "parent_vlsm_network6_id": "string",
      "percent_allocated": "string",
      "percent_used": "string",
      "space_class_name": "string",
      "space_class_parameters": [
        {
          "name": "string",
          "value": "string",
          "inheritance": "inherited",
          "propagation": "propagate",
          "source": "string"
        },
        {
          "name": "string",
          "value": "string",
          "inheritance": "set",
          "propagation": "propagate",
          "source": "string"
        },
        {
          "name": "string",
          "value": "string",
          "inheritance": "set",
          "propagation": "propagate",
          "source": "string"
        },
        {
          "name": "string",
          "value": "string",
          "inheritance": "inherited",
          "propagation": "restrict",
          "source": "string"
        },
        {
          "name": "string",
          "value": "string",
          "inheritance": "inherited",
          "propagation": "propagate",
          "source": "string"
        },
        {
          "name": "string",
          "value": "string",
          "inheritance": "set",
          "propagation": "propagate",
          "source": "string"
        },
        {
          "name": "string",
          "value": "string",
          "inheritance": "set",
          "propagation": "restrict",
          "source": "string"
        },
        {
          "name": "string",
          "value": "string",
          "inheritance": "inherited",
          "propagation": "restrict",
          "source": "string"
        },
        {
          "name": "string",
          "value": "string",
          "inheritance": "inherited",
          "propagation": "restrict",
          "source": "string"
        },
        {
          "name": "string",
          "value": "string",
          "inheritance": "inherited",
          "propagation": "restrict",
          "source": "string"
        }
      ],
      "space_description": "string",
      "space_id": "string",
      "space_is_template": "string",
      "space_name": "string",
      "space_parent_space_id": "string",
      "network6_start_hostaddr": "string",
      "start_address6_addr": "string",
      "network6_class_name": "string",
      "network6_class_parameters": [
        {
          "name": "string",
          "value": "string",
          "inheritance": "set",
          "propagation": "restrict",
          "source": "string"
        },
        {
          "name": "string",
          "value": "string",
          "inheritance": "set",
          "propagation": "propagate",
          "source": "string"
        },
        {
          "name": "string",
          "value": "string",
          "inheritance": "set",
          "propagation": "restrict",
          "source": "string"
        },
        {
          "name": "string",
          "value": "string",
          "inheritance": "set",
          "propagation": "propagate",
          "source": "string"
        },
        {
          "name": "string",
          "value": "string",
          "inheritance": "inherited",
          "propagation": "restrict",
          "source": "string"
        },
        {
          "name": "string",
          "value": "string",
          "inheritance": "set",
          "propagation": "restrict",
          "source": "string"
        },
        {
          "name": "string",
          "value": "string",
          "inheritance": "set",
          "propagation": "propagate",
          "source": "string"
        },
        {
          "name": "string",
          "value": "string",
          "inheritance": "set",
          "propagation": "propagate",
          "source": "string"
        },
        {
          "name": "string",
          "value": "string",
          "inheritance": "inherited",
          "propagation": "restrict",
          "source": "string"
        },
        {
          "name": "string",
          "value": "string",
          "inheritance": "inherited",
          "propagation": "restrict",
          "source": "string"
        }
      ],
      "network6_id": "string",
      "network6_is_valid": "string",
      "network6_name": "string",
      "network6_prefix": "string",
      "network_level": "string",
      "network_path": "string",
      "network_size": "string",
      "domain_id": "string",
      "domain_name": "string",
      "range_id": "string",
      "range_name": "string",
      "vlan_id": "string",
      "vlan_name": "string",
      "vlan_vlan_id": "string",
      "vlsm_block6_id": "string",
      "vlsm_space_id": "string",
      "vlsm_space_name": "string",
      "vlsm_network6_id": "string",
      "network6_ripe_waiting_state": "string",
      "network6_ripe_waiting_status": "string"
    },
    {
      "network6_end_hostaddr": "string",
      "end_address6_addr": "string",
      "network6_is_in_orphan": "string",
      "network6_is_terminal": "string",
      "network6_lock_network_broadcast": "string",
      "network6_multistatus": "string",
      "parent_end_address6_addr": "string",
      "parent_network6_is_terminal": "string",
      "parent_network6_percent_allocated": "string",
      "parent_network6_percent_used": "string",
      "parent_space_id": "string",
      "parent_space_name": "string",
      "parent_start_address6_addr": "string",
      "parent_network6_class_name": "string",
      "parent_network6_class_parameters": [
        {
          "name": "string",
          "value": "string",
          "inheritance": "inherited",
          "propagation": "propagate",
          "source": "string"
        },
        {
          "name": "string",
          "value": "string",
          "inheritance": "inherited",
          "propagation": "propagate",
          "source": "string"
        },
        {
          "name": "string",
          "value": "string",
          "inheritance": "inherited",
          "propagation": "propagate",
          "source": "string"
        },
        {
          "name": "string",
          "value": "string",
          "inheritance": "inherited",
          "propagation": "restrict",
          "source": "string"
        },
        {
          "name": "string",
          "value": "string",
          "inheritance": "inherited",
          "propagation": "propagate",
          "source": "string"
        },
        {
          "name": "string",
          "value": "string",
          "inheritance": "inherited",
          "propagation": "propagate",
          "source": "string"
        },
        {
          "name": "string",
          "value": "string",
          "inheritance": "set",
          "propagation": "restrict",
          "source": "string"
        },
        {
          "name": "string",
          "value": "string",
          "inheritance": "inherited",
          "propagation": "restrict",
          "source": "string"
        },
        {
          "name": "string",
          "value": "string",
          "inheritance": "set",
          "propagation": "restrict",
          "source": "string"
        },
        {
          "name": "string",
          "value": "string",
          "inheritance": "inherited",
          "propagation": "propagate",
          "source": "string"
        }
      ],
      "parent_network6_id": "string",
      "parent_network6_name": "string",
      "parent_network6_prefix": "string",
      "parent_network_level": "string",
      "parent_network_path": "string",
      "parent_network_size": "string",
      "parent_vlsm_network6_id": "string",
      "percent_allocated": "string",
      "percent_used": "string",
      "space_class_name": "string",
      "space_class_parameters": [
        {
          "name": "string",
          "value": "string",
          "inheritance": "inherited",
          "propagation": "propagate",
          "source": "string"
        },
        {
          "name": "string",
          "value": "string",
          "inheritance": "set",
          "propagation": "propagate",
          "source": "string"
        }
      ],
      "space_description": "string",
      "space_id": "string",
      "space_is_template": "string",
      "space_name": "string",
      "space_parent_space_id": "string",
      "network6_start_hostaddr": "string",
      "start_address6_addr": "string",
      "network6_class_name": "string",
      "network6_class_parameters": [
        {
          "name": "string",
          "value": "string",
          "inheritance": "set",
          "propagation": "restrict",
          "source": "string"
        },
        {
          "name": "string",
          "value": "string",
          "inheritance": "set",
          "propagation": "propagate",
          "source": "string"
        },
        {
          "name": "string",
          "value": "string",
          "inheritance": "set",
          "propagation": "propagate",
          "source": "string"
        },
        {
          "name": "string",
          "value": "string",
          "inheritance": "set",
          "propagation": "restrict",
          "source": "string"
        },
        {
          "name": "string",
          "value": "string",
          "inheritance": "set",
          "propagation": "restrict",
          "source": "string"
        },
        {
          "name": "string",
          "value": "string",
          "inheritance": "set",
          "propagation": "propagate",
          "source": "string"
        },
        {
          "name": "string",
          "value": "string",
          "inheritance": "set",
          "propagation": "restrict",
          "source": "string"
        },
        {
          "name": "string",
          "value": "string",
          "inheritance": "set",
          "propagation": "propagate",
          "source": "string"
        }
      ],
      "network6_id": "string",
      "network6_is_valid": "string",
      "network6_name": "string",
      "network6_prefix": "string",
      "network_level": "string",
      "network_path": "string",
      "network_size": "string",
      "domain_id": "string",
      "domain_name": "string",
      "range_id": "string",
      "range_name": "string",
      "vlan_id": "string",
      "vlan_name": "string",
      "vlan_vlan_id": "string",
      "vlsm_block6_id": "string",
      "vlsm_space_id": "string",
      "vlsm_space_name": "string",
      "vlsm_network6_id": "string",
      "network6_ripe_waiting_state": "string",
      "network6_ripe_waiting_status": "string"
    },
    {
      "network6_end_hostaddr": "string",
      "end_address6_addr": "string",
      "network6_is_in_orphan": "string",
      "network6_is_terminal": "string",
      "network6_lock_network_broadcast": "string",
      "network6_multistatus": "string",
      "parent_end_address6_addr": "string",
      "parent_network6_is_terminal": "string",
      "parent_network6_percent_allocated": "string",
      "parent_network6_percent_used": "string",
      "parent_space_id": "string",
      "parent_space_name": "string",
      "parent_start_address6_addr": "string",
      "parent_network6_class_name": "string",
      "parent_network6_class_parameters": [
        {
          "name": "string",
          "value": "string",
          "inheritance": "inherited",
          "propagation": "restrict",
          "source": "string"
        },
        {
          "name": "string",
          "value": "string",
          "inheritance": "inherited",
          "propagation": "restrict",
          "source": "string"
        },
        {
          "name": "string",
          "value": "string",
          "inheritance": "set",
          "propagation": "restrict",
          "source": "string"
        }
      ],
      "parent_network6_id": "string",
      "parent_network6_name": "string",
      "parent_network6_prefix": "string",
      "parent_network_level": "string",
      "parent_network_path": "string",
      "parent_network_size": "string",
      "parent_vlsm_network6_id": "string",
      "percent_allocated": "string",
      "percent_used": "string",
      "space_class_name": "string",
      "space_class_parameters": [
        {
          "name": "string",
          "value": "string",
          "inheritance": "set",
          "propagation": "restrict",
          "source": "string"
        },
        {
          "name": "string",
          "value": "string",
          "inheritance": "set",
          "propagation": "restrict",
          "source": "string"
        },
        {
          "name": "string",
          "value": "string",
          "inheritance": "inherited",
          "propagation": "propagate",
          "source": "string"
        },
        {
          "name": "string",
          "value": "string",
          "inheritance": "set",
          "propagation": "restrict",
          "source": "string"
        }
      ],
      "space_description": "string",
      "space_id": "string",
      "space_is_template": "string",
      "space_name": "string",
      "space_parent_space_id": "string",
      "network6_start_hostaddr": "string",
      "start_address6_addr": "string",
      "network6_class_name": "string",
      "network6_class_parameters": [
        {
          "name": "string",
          "value": "string",
          "inheritance": "set",
          "propagation": "propagate",
          "source": "string"
        },
        {
          "name": "string",
          "value": "string",
          "inheritance": "inherited",
          "propagation": "propagate",
          "source": "string"
        },
        {
          "name": "string",
          "value": "string",
          "inheritance": "set",
          "propagation": "restrict",
          "source": "string"
        },
        {
          "name": "string",
          "value": "string",
          "inheritance": "inherited",
          "propagation": "restrict",
          "source": "string"
        },
        {
          "name": "string",
          "value": "string",
          "inheritance": "set",
          "propagation": "propagate",
          "source": "string"
        }
      ],
      "network6_id": "string",
      "network6_is_valid": "string",
      "network6_name": "string",
      "network6_prefix": "string",
      "network_level": "string",
      "network_path": "string",
      "network_size": "string",
      "domain_id": "string",
      "domain_name": "string",
      "range_id": "string",
      "range_name": "string",
      "vlan_id": "string",
      "vlan_name": "string",
      "vlan_vlan_id": "string",
      "vlsm_block6_id": "string",
      "vlsm_space_id": "string",
      "vlsm_space_name": "string",
      "vlsm_network6_id": "string",
      "network6_ripe_waiting_state": "string",
      "network6_ripe_waiting_status": "string"
    },
    {
      "network6_end_hostaddr": "string",
      "end_address6_addr": "string",
      "network6_is_in_orphan": "string",
      "network6_is_terminal": "string",
      "network6_lock_network_broadcast": "string",
      "network6_multistatus": "string",
      "parent_end_address6_addr": "string",
      "parent_network6_is_terminal": "string",
      "parent_network6_percent_allocated": "string",
      "parent_network6_percent_used": "string",
      "parent_space_id": "string",
      "parent_space_name": "string",
      "parent_start_address6_addr": "string",
      "parent_network6_class_name": "string",
      "parent_network6_class_parameters": [
        {
          "name": "string",
          "value": "string",
          "inheritance": "inherited",
          "propagation": "propagate",
          "source": "string"
        },
        {
          "name": "string",
          "value": "string",
          "inheritance": "inherited",
          "propagation": "propagate",
          "source": "string"
        },
        {
          "name": "string",
          "value": "string",
          "inheritance": "inherited",
          "propagation": "propagate",
          "source": "string"
        },
        {
          "name": "string",
          "value": "string",
          "inheritance": "inherited",
          "propagation": "restrict",
          "source": "string"
        },
        {
          "name": "string",
          "value": "string",
          "inheritance": "inherited",
          "propagation": "restrict",
          "source": "string"
        },
        {
          "name": "string",
          "value": "string",
          "inheritance": "inherited",
          "propagation": "propagate",
          "source": "string"
        },
        {
          "name": "string",
          "value": "string",
          "inheritance": "set",
          "propagation": "propagate",
          "source": "string"
        },
        {
          "name": "string",
          "value": "string",
          "inheritance": "set",
          "propagation": "restrict",
          "source": "string"
        },
        {
          "name": "string",
          "value": "string",
          "inheritance": "inherited",
          "propagation": "propagate",
          "source": "string"
        },
        {
          "name": "string",
          "value": "string",
          "inheritance": "set",
          "propagation": "propagate",
          "source": "string"
        }
      ],
      "parent_network6_id": "string",
      "parent_network6_name": "string",
      "parent_network6_prefix": "string",
      "parent_network_level": "string",
      "parent_network_path": "string",
      "parent_network_size": "string",
      "parent_vlsm_network6_id": "string",
      "percent_allocated": "string",
      "percent_used": "string",
      "space_class_name": "string",
      "space_class_parameters": [
        {
          "name": "string",
          "value": "string",
          "inheritance": "inherited",
          "propagation": "propagate",
          "source": "string"
        },
        {
          "name": "string",
          "value": "string",
          "inheritance": "set",
          "propagation": "restrict",
          "source": "string"
        },
        {
          "name": "string",
          "value": "string",
          "inheritance": "set",
          "propagation": "restrict",
          "source": "string"
        },
        {
          "name": "string",
          "value": "string",
          "inheritance": "set",
          "propagation": "propagate",
          "source": "string"
        },
        {
          "name": "string",
          "value": "string",
          "inheritance": "set",
          "propagation": "restrict",
          "source": "string"
        },
        {
          "name": "string",
          "value": "string",
          "inheritance": "set",
          "propagation": "restrict",
          "source": "string"
        },
        {
          "name": "string",
          "value": "string",
          "inheritance": "inherited",
          "propagation": "restrict",
          "source": "string"
        },
        {
          "name": "string",
          "value": "string",
          "inheritance": "set",
          "propagation": "restrict",
          "source": "string"
        }
      ],
      "space_description": "string",
      "space_id": "string",
      "space_is_template": "string",
      "space_name": "string",
      "space_parent_space_id": "string",
      "network6_start_hostaddr": "string",
      "start_address6_addr": "string",
      "network6_class_name": "string",
      "network6_class_parameters": [
        {
          "name": "string",
          "value": "string",
          "inheritance": "inherited",
          "propagation": "restrict",
          "source": "string"
        },
        {
          "name": "string",
          "value": "string",
          "inheritance": "set",
          "propagation": "propagate",
          "source": "string"
        },
        {
          "name": "string",
          "value": "string",
          "inheritance": "set",
          "propagation": "propagate",
          "source": "string"
        },
        {
          "name": "string",
          "value": "string",
          "inheritance": "inherited",
          "propagation": "restrict",
          "source": "string"
        },
        {
          "name": "string",
          "value": "string",
          "inheritance": "inherited",
          "propagation": "restrict",
          "source": "string"
        },
        {
          "name": "string",
          "value": "string",
          "inheritance": "inherited",
          "propagation": "restrict",
          "source": "string"
        },
        {
          "name": "string",
          "value": "string",
          "inheritance": "inherited",
          "propagation": "propagate",
          "source": "string"
        },
        {
          "name": "string",
          "value": "string",
          "inheritance": "inherited",
          "propagation": "restrict",
          "source": "string"
        },
        {
          "name": "string",
          "value": "string",
          "inheritance": "set",
          "propagation": "restrict",
          "source": "string"
        },
        {
          "name": "string",
          "value": "string",
          "inheritance": "set",
          "propagation": "propagate",
          "source": "string"
        }
      ],
      "network6_id": "string",
      "network6_is_valid": "string",
      "network6_name": "string",
      "network6_prefix": "string",
      "network_level": "string",
      "network_path": "string",
      "network_size": "string",
      "domain_id": "string",
      "domain_name": "string",
      "range_id": "string",
      "range_name": "string",
      "vlan_id": "string",
      "vlan_name": "string",
      "vlan_vlan_id": "string",
      "vlsm_block6_id": "string",
      "vlsm_space_id": "string",
      "vlsm_space_name": "string",
      "vlsm_network6_id": "string",
      "network6_ripe_waiting_state": "string",
      "network6_ripe_waiting_status": "string"
    }
  ]
}