{
  "success": false,
  "messages": [
    {
      "code": 7,
      "msg": "string",
      "type": "error",
      "extra": {}
    },
    {
      "code": 8,
      "msg": "string",
      "type": "notice",
      "extra": {}
    },
    {
      "code": 1,
      "msg": "string",
      "type": "notice",
      "extra": {}
    },
    {
      "code": 8,
      "msg": "string",
      "type": "error",
      "extra": {}
    },
    {
      "code": 2,
      "msg": "string",
      "type": "error",
      "extra": {}
    },
    {
      "code": 4,
      "msg": "string",
      "type": "error",
      "extra": {}
    },
    {
      "code": 1,
      "msg": "string",
      "type": "notice",
      "extra": {}
    },
    {
      "code": 10,
      "msg": "string",
      "type": "warning",
      "extra": {}
    }
  ],
  "data": [
    {
      "rr_delayed_create_time": "string",
      "rr_delayed_delete_time": "string",
      "rr_delayed_time": "string",
      "server_class_name": "string",
      "server_cloud": "string",
      "server_comment": "string",
      "server_id": "string",
      "server_name": "string",
      "server_type": "string",
      "server_version": "string",
      "view_class_name": "string",
      "view_class_parameters": [
        {
          "name": "string",
          "value": "string",
          "inheritance": "set",
          "propagation": "propagate",
          "source": "string"
        },
        {
          "name": "string",
          "value": "string",
          "inheritance": "set",
          "propagation": "propagate",
          "source": "string"
        },
        {
          "name": "string",
          "value": "string",
          "inheritance": "set",
          "propagation": "propagate",
          "source": "string"
        },
        {
          "name": "string",
          "value": "string",
          "inheritance": "set",
          "propagation": "restrict",
          "source": "string"
        },
        {
          "name": "string",
          "value": "string",
          "inheritance": "set",
          "propagation": "restrict",
          "source": "string"
        },
        {
          "name": "string",
          "value": "string",
          "inheritance": "inherited",
          "propagation": "propagate",
          "source": "string"
        },
        {
          "name": "string",
          "value": "string",
          "inheritance": "set",
          "propagation": "restrict",
          "source": "string"
        },
        {
          "name": "string",
          "value": "string",
          "inheritance": "inherited",
          "propagation": "restrict",
          "source": "string"
        },
        {
          "name": "string",
          "value": "string",
          "inheritance": "inherited",
          "propagation": "propagate",
          "source": "string"
        },
        {
          "name": "string",
          "value": "string",
          "inheritance": "set",
          "propagation": "propagate",
          "source": "string"
        }
      ],
      "view_id": "string",
      "view_name": "string",
      "zone_class_name": "string",
      "zone_forwarders": "string",
      "zone_id": "string",
      "zone_is_reverse": "string",
      "zone_is_rpz": "string",
      "zone_masters": "string",
      "zone_name": "string",
      "zone_name_utf": "string",
      "zone_space_name": "string",
      "zone_sort_zone": "string",
      "zone_type": "string",
      "rr_multistatus": "string",
      "rr_all_value": "string",
      "rr_class_parameters": [
        {
          "name": "string",
          "value": "string",
          "inheritance": "set",
          "propagation": "propagate",
          "source": "string"
        },
        {
          "name": "string",
          "value": "string",
          "inheritance": "inherited",
          "propagation": "restrict",
          "source": "string"
        },
        {
          "name": "string",
          "value": "string",
          "inheritance": "inherited",
          "propagation": "restrict",
          "source": "string"
        },
        {
          "name": "string",
          "value": "string",
          "inheritance": "set",
          "propagation": "propagate",
          "source": "string"
        },
        {
          "name": "string",
          "value": "string",
          "inheritance": "set",
          "propagation": "propagate",
          "source": "string"
        }
      ],
      "rr_full_name": "string",
      "rr_full_name_utf": "string",
      "rr_glue": "string",
      "rr_id": "string",
      "rr_name_ip4_addr": "string",
      "rr_name_address_addr": "string",
      "rr_type": "string",
      "rr_value_ip4_addr": "string",
      "rr_value_address_addr": "string",
      "rr_ttl": "string",
      "rr_value1": "string",
      "rr_value2": "string",
      "rr_value3": "string",
      "rr_value4": "string",
      "rr_value5": "string",
      "rr_value6": "string",
      "rr_value7": "string",
      "smart_parent_id": "string",
      "smart_parent_name": "string"
    },
    {
      "rr_delayed_create_time": "string",
      "rr_delayed_delete_time": "string",
      "rr_delayed_time": "string",
      "server_class_name": "string",
      "server_cloud": "string",
      "server_comment": "string",
      "server_id": "string",
      "server_name": "string",
      "server_type": "string",
      "server_version": "string",
      "view_class_name": "string",
      "view_class_parameters": [
        {
          "name": "string",
          "value": "string",
          "inheritance": "inherited",
          "propagation": "propagate",
          "source": "string"
        },
        {
          "name": "string",
          "value": "string",
          "inheritance": "set",
          "propagation": "restrict",
          "source": "string"
        },
        {
          "name": "string",
          "value": "string",
          "inheritance": "inherited",
          "propagation": "propagate",
          "source": "string"
        },
        {
          "name": "string",
          "value": "string",
          "inheritance": "inherited",
          "propagation": "restrict",
          "source": "string"
        },
        {
          "name": "string",
          "value": "string",
          "inheritance": "set",
          "propagation": "propagate",
          "source": "string"
        },
        {
          "name": "string",
          "value": "string",
          "inheritance": "set",
          "propagation": "propagate",
          "source": "string"
        },
        {
          "name": "string",
          "value": "string",
          "inheritance": "set",
          "propagation": "propagate",
          "source": "string"
        }
      ],
      "view_id": "string",
      "view_name": "string",
      "zone_class_name": "string",
      "zone_forwarders": "string",
      "zone_id": "string",
      "zone_is_reverse": "string",
      "zone_is_rpz": "string",
      "zone_masters": "string",
      "zone_name": "string",
      "zone_name_utf": "string",
      "zone_space_name": "string",
      "zone_sort_zone": "string",
      "zone_type": "string",
      "rr_multistatus": "string",
      "rr_all_value": "string",
      "rr_class_parameters": [
        {
          "name": "string",
          "value": "string",
          "inheritance": "inherited",
          "propagation": "restrict",
          "source": "string"
        },
        {
          "name": "string",
          "value": "string",
          "inheritance": "set",
          "propagation": "restrict",
          "source": "string"
        },
        {
          "name": "string",
          "value": "string",
          "inheritance": "inherited",
          "propagation": "restrict",
          "source": "string"
        },
        {
          "name": "string",
          "value": "string",
          "inheritance": "set",
          "propagation": "restrict",
          "source": "string"
        },
        {
          "name": "string",
          "value": "string",
          "inheritance": "set",
          "propagation": "restrict",
          "source": "string"
        },
        {
          "name": "string",
          "value": "string",
          "inheritance": "inherited",
          "propagation": "restrict",
          "source": "string"
        },
        {
          "name": "string",
          "value": "string",
          "inheritance": "inherited",
          "propagation": "restrict",
          "source": "string"
        },
        {
          "name": "string",
          "value": "string",
          "inheritance": "inherited",
          "propagation": "propagate",
          "source": "string"
        }
      ],
      "rr_full_name": "string",
      "rr_full_name_utf": "string",
      "rr_glue": "string",
      "rr_id": "string",
      "rr_name_ip4_addr": "string",
      "rr_name_address_addr": "string",
      "rr_type": "string",
      "rr_value_ip4_addr": "string",
      "rr_value_address_addr": "string",
      "rr_ttl": "string",
      "rr_value1": "string",
      "rr_value2": "string",
      "rr_value3": "string",
      "rr_value4": "string",
      "rr_value5": "string",
      "rr_value6": "string",
      "rr_value7": "string",
      "smart_parent_id": "string",
      "smart_parent_name": "string"
    }
  ]
}