{
  "type": "oci/port",
  "id": 1,
  "href": "oci/port/1",
  "transientAttributes": {},
  "name": "1",
  "status": "Admin",
  "role": "",
  "connectorType": "X2",
  "bandWidth": "10BASET",
  "key": {
    "type": "oci/portKey",
    "keyValue": 1
  }
}