[
	{
		"type": "occ/trail",
		"id": 1,
		"href": "occ/trail/1",
		"transientAttributes": {},
		"revisionNumber": 1,
		"name": "BERKELE1-BERKELE2-ETRANS-10GE-0001",
		"comments": "",
		"status": "ACTIVE",
		"revisionGroupKey": {
			"type": "revisionGroupKey",
			"keyValue": 141
		},
		"_type": "BACKBONE_LINK",
		"assignmentType": "NONE",
		"protectionType": "NONE",
		"bandWidth": "10BASET",
		"key": {
			"type": "occ/trailKey",
			"keyValue": 1
		}
	},
	{
		"type": "occ/trail",
		"id": 2,
		"href": "occ/trail/2",
		"transientAttributes": {},
		"revisionNumber": 1,
		"name": "BERKELE1-BERKELE3-ETRANS-10GE-0001",
		"comments": "",
		"status": "ACTIVE",
		"revisionGroupKey": {
			"type": "revisionGroupKey",
			"keyValue": 142
		},
		"_type": "BACKBONE_LINK",
		"assignmentType": "NONE",
		"protectionType": "NONE",
		"bandWidth": "10BASET",
		"key": {
			"type": "occ/trailKey",
			"keyValue": 2
		}
	},
	{
		"type": "occ/trail",
		"id": 3,
		"href": "occ/trail/3",
		"transientAttributes": {},
		"revisionNumber": 1,
		"name": "BERKELE1-EMERYVI1-ETRANS-10GE-0001",
		"comments": "",
		"status": "ACTIVE",
		"revisionGroupKey": {
			"type": "revisionGroupKey",
			"keyValue": 143
		},
		"_type": "BACKBONE_LINK",
		"assignmentType": "NONE",
		"protectionType": "NONE",
		"bandWidth": "10BASET",
		"key": {
			"type": "occ/trailKey",
			"keyValue": 3
		}
	},
	{
		"type": "occ/trail",
		"id": 4,
		"href": "occ/trail/4",
		"transientAttributes": {},
		"revisionNumber": 1,
		"name": "BERKELE2-BERKELE4-ETRANS-10GE-0001",
		"comments": "",
		"status": "ACTIVE",
		"revisionGroupKey": {
			"type": "revisionGroupKey",
			"keyValue": 144
		},
		"_type": "BACKBONE_LINK",
		"assignmentType": "NONE",
		"protectionType": "NONE",
		"bandWidth": "10BASET",
		"key": {
			"type": "occ/trailKey",
			"keyValue": 4
		}
	}
]