{
  "actions": [
    {
      "name": "getSites",
      "protocol": "REST",
      "method": "GET",
      "entitypath": "{base_path}/{version}/oci/site/{pathv1}?{query}",
      "requestSchema": "schema.json",
      "responseSchema": "schema.json",
      "timeout": 0,
      "sendEmpty": false,
      "sendGetBody": false,
      "requestDatatype": "JSON",
      "responseDatatype": "JSON",
      "headers": {},
      "responseObjects": [
        {
          "type": "withpathv1",
          "key": "",
          "mockFile": "mockdatafiles/getSingleSite.json"
        },
        {
          "type": "default",
          "key": "",
          "mockFile": "mockdatafiles/getMultipleSites.json"
        }
      ]
    },
    {
      "name": "createSite",
      "protocol": "REST",
      "method": "POST",
      "entitypath": "{base_path}/{version}/oci/site?{query}",
      "requestSchema": "schema.json",
      "responseSchema": "schema.json",
      "timeout": 0,
      "sendEmpty": false,
      "sendGetBody": false,
      "requestDatatype": "JSON",
      "responseDatatype": "JSON",
      "headers": {},
      "responseObjects": [
        {
          "type": "default",
          "key": "",
          "mockFile": "mockdatafiles/createSite.json"
        }
      ]
    },
    {
      "name": "updateSite",
      "protocol": "REST",
      "method": "PUT",
      "entitypath": "{base_path}/{version}/oci/site/{pathv1}?{query}",
      "requestSchema": "schema.json",
      "responseSchema": "schema.json",
      "timeout": 0,
      "sendEmpty": false,
      "sendGetBody": false,
      "requestDatatype": "JSON",
      "responseDatatype": "JSON",
      "headers": {},
      "responseObjects": [
        {
          "type": "default",
          "key": "",
          "mockFile": "mockdatafiles/updateSite.json"
        }
      ]
    },
    {
      "name": "deleteSite",
      "protocol": "REST",
      "method": "POST",
      "entitypath": "{base_path}/{version}/oci/site/{pathv1}/cascadeDelete?{query}",
      "requestSchema": "schema.json",
      "responseSchema": "schema.json",
      "timeout": 0,
      "sendEmpty": false,
      "sendGetBody": false,
      "requestDatatype": "JSON",
      "responseDatatype": "JSON",
      "headers": {},
      "responseObjects": [
        {
          "type": "default",
          "key": "",
          "mockFile": "mockdatafiles/deleteSite.json"
        }
      ]
    },
    {
      "name": "getSiteTemplates",
      "protocol": "REST",
      "method": "GET",
      "entitypath": "{base_path}/{version}/oci/sitetemplate/{pathv1}?{query}",
      "requestSchema": "templateschema.json",
      "responseSchema": "templateschema.json",
      "timeout": 0,
      "sendEmpty": false,
      "sendGetBody": false,
      "requestDatatype": "JSON",
      "responseDatatype": "JSON",
      "headers": {},
      "responseObjects": [
        {
          "type": "withpathv1",
          "key": "",
          "mockFile": "mockdatafiles/getSingleSiteTemplate.json"
        },
        {
          "type": "default",
          "key": "",
          "mockFile": "mockdatafiles/getMultipleSiteTemplates.json"
        }
      ]
    },
    {
      "name": "createSiteTemplate",
      "protocol": "REST",
      "method": "POST",
      "entitypath": "{base_path}/{version}/oci/sitetemplate?{query}",
      "requestSchema": "templateschema.json",
      "responseSchema": "templateschema.json",
      "timeout": 0,
      "sendEmpty": false,
      "sendGetBody": false,
      "requestDatatype": "JSON",
      "responseDatatype": "JSON",
      "headers": {},
      "responseObjects": [
        {
          "type": "default",
          "key": "",
          "mockFile": "mockdatafiles/createSiteTemplate.json"
        }
      ]
    },
    {
      "name": "updateSiteTemplate",
      "protocol": "REST",
      "method": "PUT",
      "entitypath": "{base_path}/{version}/oci/sitetemplate/{pathv1}?{query}",
      "requestSchema": "templateschema.json",
      "responseSchema": "templateschema.json",
      "timeout": 0,
      "sendEmpty": false,
      "sendGetBody": false,
      "requestDatatype": "JSON",
      "responseDatatype": "JSON",
      "headers": {},
      "responseObjects": [
        {
          "type": "default",
          "key": "",
          "mockFile": "mockdatafiles/updateSiteTemplate.json"
        }
      ]
    },
    {
      "name": "deleteSiteTemplate",
      "protocol": "REST",
      "method": "DELETE",
      "entitypath": "{base_path}/{version}/oci/sitetemplate/{pathv1}?{query}",
      "requestSchema": "templateschema.json",
      "responseSchema": "templateschema.json",
      "timeout": 0,
      "sendEmpty": false,
      "sendGetBody": false,
      "requestDatatype": "JSON",
      "responseDatatype": "JSON",
      "headers": {},
      "responseObjects": [
        {
          "type": "default",
          "key": "",
          "mockFile": "mockdatafiles/deleteSiteTemplate.json"
        }
      ]
    }
  ]
}