{
   "type": "occ/trailtemplate",
   "id": 1,
   "href": "occ/trailtemplate/1",
   "transientAttributes": {},
   "_type": "SERVICE",
   "assignmentType": "NONE",
   "protectionType": "NONE",
   "bandWidth": "25 MBPS",
   "status": "PENDING",
   "name": "MIKETESTdsds",
   "key": {
      "type": "occ/trailtemplateKey",
      "keyValue": 1
   }
}