{
  "type": "oci/site",
  "id": 1,
  "href": "oci/site/1",
  "transientAttributes": {},
  "name": "BERKELE1",
  "siteId": "BERKELE1",
  "status": "Live",
  "_type": "LEC",
  "contacts": "",
  "country": "U.S.A.",
  "floor": "",
  "address": "",
  "stateProv": "CA",
  "city": "Berkeley",
  "room": "",
  "postalCode1": "",
  "latitude": "37.879340",
  "longitude": "-122.268978",
  "key": {
    "type": "oci/siteKey",
    "keyValue": 1
  }
}