{
  "actions": [
    {
      "name": "getContainers",
      "protocol": "REST",
      "method": "GET",
      "entitypath": "{base_path}/{version}/oci/container/{pathv1}?{query}",
      "requestSchema": "schema.json",
      "responseSchema": "schema.json",
      "timeout": 0,
      "sendEmpty": false,
      "sendGetBody": false,
      "requestDatatype": "JSON",
      "responseDatatype": "JSON",
      "headers": {},
      "responseObjects": [
        {
          "type": "withpathv1",
          "key": "",
          "mockFile": "mockdatafiles/getSingleContainer.json"
        },
        {
          "type": "default",
          "key": "",
          "mockFile": "mockdatafiles/getMultipleContainers.json"
        }
      ]
    },
    {
      "name": "createContainer",
      "protocol": "REST",
      "method": "POST",
      "entitypath": "{base_path}/{version}/oci/container?{query}",
      "requestSchema": "schema.json",
      "responseSchema": "schema.json",
      "timeout": 0,
      "sendEmpty": false,
      "sendGetBody": false,
      "requestDatatype": "JSON",
      "responseDatatype": "JSON",
      "headers": {},
      "responseObjects": [
        {
          "type": "default",
          "key": "",
          "mockFile": "mockdatafiles/createContainer.json"
        }
      ]
    },
    {
      "name": "updateContainer",
      "protocol": "REST",
      "method": "PUT",
      "entitypath": "{base_path}/{version}/oci/container/{pathv1}?{query}",
      "requestSchema": "schema.json",
      "responseSchema": "schema.json",
      "timeout": 0,
      "sendEmpty": false,
      "sendGetBody": false,
      "requestDatatype": "JSON",
      "responseDatatype": "JSON",
      "headers": {},
      "responseObjects": [
        {
          "type": "default",
          "key": "",
          "mockFile": "mockdatafiles/updateContainer.json"
        }
      ]
    },
    {
      "name": "deleteContainer",
      "protocol": "REST",
      "method": "POST",
      "entitypath": "{base_path}/{version}/oci/container/{pathv1}/cascadeDelete?{query}",
      "requestSchema": "schema.json",
      "responseSchema": "schema.json",
      "timeout": 0,
      "sendEmpty": false,
      "sendGetBody": false,
      "requestDatatype": "JSON",
      "responseDatatype": "JSON",
      "headers": {},
      "responseObjects": [
        {
          "type": "default",
          "key": "",
          "mockFile": "mockdatafiles/deleteContainer.json"
        }
      ]
    },
    {
      "name": "getContainerTemplates",
      "protocol": "REST",
      "method": "GET",
      "entitypath": "{base_path}/{version}/oci/containertemplate/{pathv1}?{query}",
      "requestSchema": "templateschema.json",
      "responseSchema": "templateschema.json",
      "timeout": 0,
      "sendEmpty": false,
      "sendGetBody": false,
      "requestDatatype": "JSON",
      "responseDatatype": "JSON",
      "headers": {},
      "responseObjects": [
        {
          "type": "withpathv1",
          "key": "",
          "mockFile": "mockdatafiles/getSingleContainerTemplate.json"
        },
        {
          "type": "default",
          "key": "",
          "mockFile": "mockdatafiles/getMultipleContainerTemplates.json"
        }
      ]
    },
    {
      "name": "createContainerTemplate",
      "protocol": "REST",
      "method": "POST",
      "entitypath": "{base_path}/{version}/oci/containertemplate?{query}",
      "requestSchema": "templateschema.json",
      "responseSchema": "templateschema.json",
      "timeout": 0,
      "sendEmpty": false,
      "sendGetBody": false,
      "requestDatatype": "JSON",
      "responseDatatype": "JSON",
      "headers": {},
      "responseObjects": [
        {
          "type": "default",
          "key": "",
          "mockFile": "mockdatafiles/createContainerTemplate.json"
        }
      ]
    },
    {
      "name": "updateContainerTemplate",
      "protocol": "REST",
      "method": "PUT",
      "entitypath": "{base_path}/{version}/oci/containertemplate/{pathv1}?{query}",
      "requestSchema": "templateschema.json",
      "responseSchema": "templateschema.json",
      "timeout": 0,
      "sendEmpty": false,
      "sendGetBody": false,
      "requestDatatype": "JSON",
      "responseDatatype": "JSON",
      "headers": {},
      "responseObjects": [
        {
          "type": "default",
          "key": "",
          "mockFile": "mockdatafiles/updateContainerTemplate.json"
        }
      ]
    },
    {
      "name": "deleteContainerTemplate",
      "protocol": "REST",
      "method": "DELETE",
      "entitypath": "{base_path}/{version}/oci/containertemplate/{pathv1}?{query}",
      "requestSchema": "templateschema.json",
      "responseSchema": "templateschema.json",
      "timeout": 0,
      "sendEmpty": false,
      "sendGetBody": false,
      "requestDatatype": "JSON",
      "responseDatatype": "JSON",
      "headers": {},
      "responseObjects": [
        {
          "type": "default",
          "key": "",
          "mockFile": "mockdatafiles/deleteContainerTemplate.json"
        }
      ]
    }
  ]
}