{
  "type": "oci/card",
  "id": 1,
  "href": "oci/card/1",
  "transientAttributes": {},
  "name": "04|WS-X6716-10G-3C",
  "_type": "WS-X6716-10G-3C",
  "role": "",
  "description": "",
  "slotOccupancy": 1,
  "serialNumber": "",
  "inServiceDate": "2011-05-11T00:00:00.000Z",
  "status": "Live",
  "key": {
    "type": "oci/cardKey",
    "keyValue": 1
  }
}