{
  "$id": "schema.json",
  "type": "object",
  "schema": "http://json-schema.org/draft-07/schema#",
  "translate": true,
  "dynamicfields": true,
  "properties": {
    "ph_request_type": {
      "type": "string",
      "description": "type of request (internal to adapter)",
      "default": "getHardwares",
      "enum": [
        "getHardwares",
        "postHardwares",
        "deleteHardwares"
      ],
      "external_name": "ph_request_type"
    },
    "deviceSubType": {
      "type": "string",
      "description": "filter by device sub type (Added in v14.7.2)",
      "parse": false,
      "encode": false,
      "encrypt": {
        "type": "AES",
        "key": ""
      },
      "external_name": "device_sub_type"
    },
    "partNo": {
      "type": "string",
      "description": "filter by part #",
      "parse": false,
      "encode": false,
      "encrypt": {
        "type": "AES",
        "key": ""
      },
      "external_name": "part_no"
    }
  },
  "definitions": {}
}