{
  "$id": "schema.json",
  "type": "object",
  "schema": "http://json-schema.org/draft-07/schema#",
  "translate": true,
  "dynamicfields": true,
  "properties": {
    "ph_request_type": {
      "type": "string",
      "description": "type of request (internal to adapter)",
      "default": "getAutoDiscoveryNetworks",
      "enum": [
        "getAutoDiscoveryNetworks",
        "postAutoDiscoveryNetworks",
        "putAutoDiscoveryNetworks",
        "getAutoDiscoverynmap",
        "postAutoDiscoverynmap",
        "putAutoDiscoverynmap",
        "getAutoDiscoveryPingsweep",
        "postAutoDiscoveryPingsweep",
        "putAutoDiscoveryPingsweep",
        "postAutoDiscoveryBladeDisc",
        "putAutoDiscoveryBladeDisc",
        "postAutoDiscoveryPowerDisc",
        "putAutoDiscoveryPowerDisc",
        "getAutoDiscoveryvServer",
        "postAutoDiscoveryVserver",
        "putAutoDiscoveryVserver",
        "getAutoDiscoveryCloudaccount",
        "postAutoDiscoveryCloudaccount",
        "putAutoDiscoveryCloudaccount",
        "getCloudInfrastructure",
        "postCloudInfrastructure",
        "deleteCloudInfrastructure",
        "putCustomFieldCloudInfrastructure",
        "getCloudResource",
        "postCloudResource",
        "deleteCloudResource",
        "putCustomFieldCloudResource",
        "getResourceRelationship",
        "deleteResourceRelationship",
        "getAutoDiscoverySnmpDisc",
        "postAutoDiscoverySnmpDisc",
        "putAutoDiscoverySnmpDisc",
        "getAutoDiscoveryIpmi",
        "postAutoDiscoveryIpmi",
        "putAutoDiscoveryIpmi",
        "getAutoDiscoveryUcs",
        "postAutoDiscoveryUcs",
        "putAutoDiscoveryUcs",
        "getAutoDiscoveryDns",
        "postAutoDiscoveryDns",
        "putAutoDiscoveryDns",
        "getAutoDiscoveryCertificate",
        "postAutoDiscoveryCertificate",
        "putAutoDiscoveryCertificate"
      ],
      "external_name": "ph_request_type"
    },
    "hostnameToUse": {
      "type": "string",
      "description": "",
      "parse": false,
      "encode": false,
      "encrypt": {
        "type": "AES",
        "key": ""
      },
      "external_name": "hostname_to_use"
    }
  },
  "definitions": {}
}