{
  "$id": "schema.json",
  "type": "object",
  "schema": "http://json-schema.org/draft-07/schema#",
  "translate": true,
  "dynamicfields": true,
  "properties": {
    "ph_request_type": {
      "type": "string",
      "description": "type of request (internal to adapter)",
      "default": "getPatchPanelID",
      "enum": [
        "getPatchPanelID",
        "getPatchPanelPortsPatchPanelId",
        "postPatchPanelPortsPatchPanelId",
        "getPatchPanelModels",
        "postPatchPanelModels",
        "getPatchPanelModuleModels",
        "postPatchPanelModuleModels"
      ],
      "external_name": "ph_request_type"
    },
    "iD": {
      "type": "number",
      "description": "The ID of the Patch Panel to retrieve",
      "parse": false,
      "encode": false,
      "encrypt": {
        "type": "AES",
        "key": ""
      },
      "external_name": "ID"
    },
    "patchPanelId": {
      "type": "number",
      "description": "Patch panel id",
      "parse": false,
      "encode": false,
      "encrypt": {
        "type": "AES",
        "key": ""
      },
      "external_name": "patch_panel_id"
    },
    "backConnectionId": {
      "type": "string",
      "description": "ID for the back connection port. Available via GET at /api/api/1.0/patch_panel_ports// or Tools &gt; Export &gt; Patch Panel Port",
      "parse": false,
      "encode": false,
      "encrypt": {
        "type": "AES",
        "key": ""
      },
      "external_name": "back_connection_id"
    }
  },
  "definitions": {}
}