{
  "actions": [
    {
      "name": "getPurchases",
      "protocol": "REST",
      "method": "GET",
      "entitypath": "{base_path}/{version}/api/1.0/purchases/?{query}",
      "requestSchema": "schema.json",
      "responseSchema": "schema.json",
      "timeout": 0,
      "sendEmpty": false,
      "sendGetBody": false,
      "requestDatatype": "JSON",
      "responseDatatype": "JSON",
      "headers": {},
      "responseObjects": [
        {
          "type": "default",
          "key": "",
          "mockFile": "mockdatafiles/getPurchases-default.json"
        }
      ]
    },
    {
      "name": "postPurchases",
      "protocol": "REST",
      "method": "POST",
      "entitypath": "{base_path}/{version}/api/1.0/purchases/?{query}",
      "requestSchema": "schema.json",
      "responseSchema": "schema.json",
      "timeout": 0,
      "sendEmpty": false,
      "requestDatatype": "FORM",
      "responseDatatype": "JSON",
      "headers": {},
      "responseObjects": [
        {
          "type": "default",
          "key": "",
          "mockFile": ""
        }
      ]
    },
    {
      "name": "deletePurchases",
      "protocol": "REST",
      "method": "DELETE",
      "entitypath": "{base_path}/{version}/api/1.0/purchases/{pathv1}/?{query}",
      "requestSchema": "schema.json",
      "responseSchema": "schema.json",
      "timeout": 0,
      "sendEmpty": false,
      "requestDatatype": "JSON",
      "responseDatatype": "JSON",
      "headers": {},
      "responseObjects": [
        {
          "type": "default",
          "key": "",
          "mockFile": ""
        }
      ]
    },
    {
      "name": "putCustomFieldPurchases",
      "protocol": "REST",
      "method": "PUT",
      "entitypath": "{base_path}/{version}/api/1.0/custom_fields/purchases/?{query}",
      "requestSchema": "schema.json",
      "responseSchema": "schema.json",
      "timeout": 0,
      "sendEmpty": false,
      "requestDatatype": "FORM",
      "responseDatatype": "JSON",
      "headers": {},
      "responseObjects": [
        {
          "type": "default",
          "key": "",
          "mockFile": ""
        }
      ]
    }
  ]
}