{
  "$id": "schema.json",
  "type": "object",
  "schema": "http://json-schema.org/draft-07/schema#",
  "translate": true,
  "dynamicfields": true,
  "properties": {
    "ph_request_type": {
      "type": "string",
      "description": "type of request (internal to adapter)",
      "default": "getCables",
      "enum": [
        "getCables",
        "postCables",
        "deleteCable"
      ],
      "external_name": "ph_request_type"
    },
    "cableId": {
      "type": "number",
      "description": "filter by cable_id",
      "parse": false,
      "encode": false,
      "encrypt": {
        "type": "AES",
        "key": ""
      },
      "external_name": "cable_id"
    }
  },
  "definitions": {}
}