{
  "total_count": 8305,
  "limit": 1,
  "aliases": [
    {},
    {},
    {},
    {}
  ],
  "asset_no": {},
  "building": {},
  "category": {},
  "cpucore": 2,
  "cpucount": 1,
  "cpuspeed": 3300,
  "custom_fields": [
    {},
    {},
    {},
    {},
    {},
    {},
    {},
    {},
    {}
  ],
  "customer": {},
  "customer_id": 9,
  "device_external_links": [
    {},
    {}
  ],
  "device_id": 136,
  "device_purchase_line_items": [
    {},
    {},
    {},
    {},
    {},
    {},
    {},
    {},
    {},
    {}
  ],
  "hdd_details": [
    {},
    {},
    {},
    {},
    {},
    {}
  ],
  "groups": {},
  "hddcount": 2,
  "hddraid": "hardware",
  "hddraid_type": "none",
  "hddsize": {},
  "hw_depth": 1,
  "hw_model": {},
  "hw_size": 1,
  "id": 136,
  "in_service": true,
  "ip_addresses": [
    {},
    {},
    {},
    {}
  ],
  "last_updated": {},
  "mac_addresses": [
    {},
    {},
    {},
    {},
    {},
    {},
    {},
    {},
    {},
    {}
  ],
  "manufacturer": {},
  "name": {},
  "notes": {},
  "orientation": 1,
  "os": {},
  "osarch": 64,
  "osver": {},
  "osverno": 7.1,
  "rack": {},
  "rack_id": 39,
  "ram": 4096,
  "room": {},
  "row": 2,
  "serial_no": 409357205,
  "service_level": {},
  "start_at": 24,
  "tags": [
    "abc",
    "sql"
  ],
  "type": {},
  "ucs_manager": {},
  "uuid": {},
  "virtual_host_name": {},
  "virtual_subtype": "outscale",
  "where": 5,
  "xpos": {}
}