{
  "comment": {
    "handle": "test@datadoghq.com",
    "id": 1382557387240473000,
    "message": "My new comment message.",
    "resource": "/api/v1/comments/1382557387240472966",
    "url": "/event/jump_to?event_id=1382557387240472966"
  }
}