{
  "notify_list": [],
  "description": "An updated dashboard with memory info.",
  "template_variables": [
    {
      "default": "myhost",
      "prefix": "host",
      "name": "host1"
    }
  ],
  "is_read_only": true,
  "id": "civ-zbj-ag5",
  "title": "<NEW_DASHBOARD_TITLE>",
  "url": "/dashboard/civ-zbj-ag5/newdashboardtitle",
  "created_at": "2019-04-19T12:35:20.490074+00:00",
  "modified_at": "2019-04-19T12:36:11.667609+00:00",
  "author_handle": "test@datadoghq.com",
  "widgets": [
    {
      "definition": {
        "requests": [
          {
            "q": "sum:system.mem.free{*}"
          }
        ],
        "type": "timeseries",
        "title": "Sum Memory Free Shell"
      },
      "id": 8077021146151090
    }
  ],
  "layout_type": "ordered"
}