{
  "DirectoryType": "string",
  "BindUsername": "string",
  "BindPassword": "string",
  "SSLConnect": false,
  "LDAPDirectoryName": "string",
  "LDAPDirectoryQueryOrder": 10,
  "LDAPDirectoryDescription": "string",
  "VaultObjectNamesPrefix": "string",
  "PasswordObjectPath": "string",
  "LDAPDirectoryGroupBaseContext": "string",
  "ReferralsChasingHopLimit": 2,
  "AppendFriendlyDomainNameToGroup": false,
  "RequireReferredDirectoryDefinition": true,
  "ReferralsDNSLookup": false,
  "DisableUserEnumeration": true,
  "AdditionalQueryFilterOptimize": false,
  "ClientBrowsing": true,
  "ExternalObjectCreation": false,
  "Authentication": false,
  "UseLDAPCertificatesOnly": false,
  "DisablePaging": true,
  "ProvisionDisabledUsers": false,
  "LDAPDirectoryUsage": [
    "string",
    "string",
    "string",
    "string",
    "string",
    "string"
  ],
  "DCList": [
    {
      "Name": "192.168.3.100",
      "Port": 389,
      "SSLConnect": false
    },
    {
      "Name": "192.168.3.100",
      "Port": 389,
      "SSLConnect": false
    },
    {
      "Name": "192.168.3.100",
      "Port": 389,
      "SSLConnect": false
    }
  ],
  "DomainName": "string",
  "DomainBaseContext": "string"
}