{
  "actions": [
    {
      "name": "baseUrlSysInfoAbout",
      "protocol": "REST",
      "method": "POST",
      "entitypath": "{base_path}/{version}/SysInfo/About?{query}",
      "requestSchema": "schema.json",
      "responseSchema": "schema.json",
      "timeout": 0,
      "sendEmpty": false,
      "requestDatatype": "JSON",
      "responseDatatype": "JSON",
      "headers": {},
      "responseObjects": [
        {
          "type": "default",
          "key": "",
          "mockFile": ""
        }
      ]
    },
    {
      "name": "baseUrlSysInfoDummy",
      "protocol": "REST",
      "method": "POST",
      "entitypath": "{base_path}/{version}/SysInfo/Dummy?{query}",
      "requestSchema": "schema.json",
      "responseSchema": "schema.json",
      "timeout": 0,
      "sendEmpty": false,
      "requestDatatype": "JSON",
      "responseDatatype": "JSON",
      "headers": {},
      "responseObjects": [
        {
          "type": "default",
          "key": "",
          "mockFile": ""
        }
      ]
    },
    {
      "name": "baseUrlSysInfoGetMySession",
      "protocol": "REST",
      "method": "POST",
      "entitypath": "{base_path}/{version}/SysInfo/GetMySession?{query}",
      "requestSchema": "schema.json",
      "responseSchema": "schema.json",
      "timeout": 0,
      "sendEmpty": false,
      "requestDatatype": "JSON",
      "responseDatatype": "JSON",
      "headers": {},
      "responseObjects": [
        {
          "type": "default",
          "key": "",
          "mockFile": ""
        }
      ]
    },
    {
      "name": "baseUrlSysInfoVersion",
      "protocol": "REST",
      "method": "POST",
      "entitypath": "{base_path}/{version}/SysInfo/Version?{query}",
      "requestSchema": "schema.json",
      "responseSchema": "schema.json",
      "timeout": 0,
      "sendEmpty": false,
      "requestDatatype": "JSON",
      "responseDatatype": "JSON",
      "headers": {},
      "responseObjects": [
        {
          "type": "default",
          "key": "",
          "mockFile": ""
        }
      ]
    }
  ]
}