{
  "$id": "schema.json",
  "type": "object",
  "schema": "http://json-schema.org/draft-07/schema#",
  "translate": true,
  "dynamicfields": true,
  "properties": {
    "ph_request_type": {
      "type": "string",
      "description": "type of request (internal to adapter)",
      "default": "baseUrlTenantConfigDeleteAdminSecurityQuestion",
      "enum": [
        "baseUrlTenantConfigDeleteAdminSecurityQuestion",
        "baseUrlTenantConfigDeleteAdvancedConfig",
        "baseUrlTenantConfigGetAdminSecurityQuestion",
        "baseUrlTenantConfigGetAdminSecurityQuestions",
        "baseUrlTenantConfigGetAdvancedConfig",
        "baseUrlTenantConfigGetCustomerConfig",
        "baseUrlTenantConfigGetEditableMailTemplates",
        "baseUrlTenantConfigGetEditableMessageTemplate",
        "baseUrlTenantConfigGetEditableMessageTemplates",
        "baseUrlTenantConfigGetGoogleKey",
        "baseUrlTenantConfigGetMobileConfig",
        "baseUrlTenantConfigGetSMTPConfig",
        "baseUrlTenantConfigGetTwilioConfig",
        "baseUrlTenantConfigResetPortalConfig",
        "baseUrlTenantConfigSendTestMessageTemplate",
        "baseUrlTenantConfigSetAdminSecurityQuestion",
        "baseUrlTenantConfigSetAdvancedConfig",
        "baseUrlTenantConfigSetCustomerConfig",
        "baseUrlTenantConfigSetGoogleKey",
        "baseUrlTenantConfigSetMobileConfig",
        "baseUrlTenantConfigSetPasswordPersistance",
        "baseUrlTenantConfigSetSMTPConfig",
        "baseUrlTenantConfigSetTwilioConfig",
        "baseUrlTenantConfigTestSMTPConfig",
        "baseUrlTenantConfigTestTwilioConfig"
      ],
      "external_name": "ph_request_type"
    },
    "id": {
      "type": "string",
      "description": "(Required) Uuid of the question.",
      "parse": false,
      "encode": false,
      "encrypt": {
        "type": "AES",
        "key": ""
      },
      "external_name": "Id"
    },
    "body": {
      "type": "object",
      "description": "",
      "parse": false,
      "encode": false,
      "encrypt": {
        "type": "AES",
        "key": ""
      },
      "external_name": "Body"
    }
  },
  "definitions": {}
}