{
  "DirectoryType": "string",
  "HostAddresses": [
    "string",
    "string"
  ],
  "BindUsername": "string",
  "BindPassword": "string",
  "Port": 8,
  "SSLConnect": false,
  "LDAPDirectoryName": "string",
  "LDAPDirectoryQueryOrder": 4,
  "LDAPDirectoryDescription": "string",
  "VaultObjectNamesPrefix": "string",
  "PasswordObjectPath": "string",
  "LDAPDirectoryGroupBaseContext": "string",
  "ReferralsChasingHopLimit": 2,
  "AppendFriendlyDomainNameToGroup": true,
  "RequireReferredDirectoryDefinition": true,
  "ReferralsDNSLookup": false,
  "DisableUserEnumeration": false,
  "AdditionalQueryFilterOptimize": true,
  "ClientBrowsing": false,
  "ExternalObjectCreation": false,
  "Authentication": true,
  "UseLDAPCertificatesOnly": true,
  "DisablePaging": false,
  "ProvisionDisabledUsers": true,
  "LDAPDirectoryUsage": "string",
  "DCList": "string",
  "DomainName": "string",
  "DomainBaseContext": "string"
}