{
  "$id": "schema.json",
  "type": "object",
  "schema": "http://json-schema.org/draft-07/schema#",
  "translate": true,
  "dynamicfields": true,
  "properties": {
    "ph_request_type": {
      "type": "string",
      "description": "type of request (internal to adapter)",
      "default": "baseUrlSaasManageAddUsersAndGroupsToRole",
      "enum": [
        "baseUrlSaasManageAddUsersAndGroupsToRole",
        "baseUrlSaasManageDeleteApplication",
        "baseUrlSaasManageDeleteRole",
        "baseUrlSaasManageDeleteRoles",
        "baseUrlSaasManageGetAppIDByServiceName",
        "baseUrlSaasManageGetApplication",
        "baseUrlSaasManageGetRole",
        "baseUrlSaasManageGetRoleMembers",
        "baseUrlSaasManageGetTemplatesAndCategories",
        "baseUrlSaasManageImportAppFromTemplate",
        "baseUrlSaasManageIsApplicationAvailableInCatalog",
        "baseUrlSaasManageRemoveUsersAndGroupsFromRole",
        "baseUrlSaasManageSetApplicationPermissions",
        "baseUrlSaasManageStoreRole",
        "baseUrlSaasManageUpdateApplicationDE",
        "baseUrlSaasManageUpdateRole"
      ],
      "external_name": "ph_request_type"
    },
    "body": {
      "type": "object",
      "description": "",
      "parse": false,
      "encode": false,
      "encrypt": {
        "type": "AES",
        "key": ""
      },
      "external_name": "Body"
    },
    "name": {
      "type": "string",
      "description": "(Required) Role UUID",
      "parse": false,
      "encode": false,
      "encrypt": {
        "type": "AES",
        "key": ""
      },
      "external_name": "Name"
    },
    "rowKey": {
      "type": "string",
      "description": "(Required) App key",
      "parse": false,
      "encode": false,
      "encrypt": {
        "type": "AES",
        "key": ""
      },
      "external_name": "_RowKey"
    },
    "suppressPrincipalsList": {
      "type": "string",
      "description": "If true, the principals list will not be included (may make this call much faster)",
      "parse": false,
      "encode": false,
      "encrypt": {
        "type": "AES",
        "key": ""
      },
      "external_name": "SuppressPrincipalsList"
    }
  },
  "definitions": {}
}