{
  "actions": [
    {
      "name": "getPlatformDetails",
      "protocol": "REST",
      "method": "GET",
      "entitypath": "{base_path}/{version}/PasswordVault/API/Platforms/?{query}",
      "requestSchema": "schema.json",
      "responseSchema": "schema.json",
      "timeout": 0,
      "sendEmpty": false,
      "sendGetBody": false,
      "requestDatatype": "JSON",
      "responseDatatype": "JSON",
      "headers": {},
      "responseObjects": [
        {
          "type": "default",
          "key": "",
          "mockFile": "mockdatafiles/getPlatformDetails-default.json"
        }
      ]
    },
    {
      "name": "getPlatforms",
      "protocol": "REST",
      "method": "GET",
      "entitypath": "{base_path}/{version}/PasswordVault/API/Platforms?{query}",
      "requestSchema": "schema.json",
      "responseSchema": "schema.json",
      "timeout": 0,
      "sendEmpty": false,
      "sendGetBody": false,
      "requestDatatype": "JSON",
      "responseDatatype": "JSON",
      "headers": {},
      "responseObjects": [
        {
          "type": "default",
          "key": "",
          "mockFile": ""
        }
      ]
    },
    {
      "name": "exportPlatform",
      "protocol": "REST",
      "method": "POST",
      "entitypath": "{base_path}/{version}/PasswordVault/API/Platforms/Export?{query}",
      "requestSchema": "schema.json",
      "responseSchema": "schema.json",
      "timeout": 0,
      "sendEmpty": false,
      "requestDatatype": "JSON",
      "responseDatatype": "JSON",
      "headers": {},
      "responseObjects": [
        {
          "type": "default",
          "key": "",
          "mockFile": ""
        }
      ]
    },
    {
      "name": "importPlatform",
      "protocol": "REST",
      "method": "POST",
      "entitypath": "{base_path}/{version}/API/Platforms/Import?{query}",
      "requestSchema": "schema.json",
      "responseSchema": "schema.json",
      "timeout": 0,
      "sendEmpty": false,
      "requestDatatype": "JSON",
      "responseDatatype": "JSON",
      "headers": {},
      "responseObjects": [
        {
          "type": "default",
          "key": "",
          "mockFile": ""
        }
      ]
    }
  ]
}