{
  "id": "string",
  "name": "string",
  "address": "string",
  "userName": "string",
  "platformId": "string",
  "safeName": "string",
  "secretType": "string",
  "secretManagement": {
    "automaticManagementEnabled": true,
    "status": "success",
    "lastModifiedTime": 1541876282
  },
  "createdTime": 6
}