{
  "actions": [
    {
      "name": "baseUrlUserMgmtAnalyzeAdaptiveMfaRisk",
      "protocol": "REST",
      "method": "POST",
      "entitypath": "{base_path}/{version}/UserMgmt/AnalyzeAdaptiveMfaRisk?{query}",
      "requestSchema": "schema.json",
      "responseSchema": "schema.json",
      "timeout": 0,
      "sendEmpty": false,
      "requestDatatype": "JSON",
      "responseDatatype": "JSON",
      "headers": {},
      "responseObjects": [
        {
          "type": "default",
          "key": "",
          "mockFile": ""
        }
      ]
    },
    {
      "name": "baseUrlUserMgmtCanEditUserAttributes",
      "protocol": "REST",
      "method": "POST",
      "entitypath": "{base_path}/{version}/UserMgmt/CanEditUserAttributes?{query}",
      "requestSchema": "schema.json",
      "responseSchema": "schema.json",
      "timeout": 0,
      "sendEmpty": false,
      "requestDatatype": "JSON",
      "responseDatatype": "JSON",
      "headers": {},
      "responseObjects": [
        {
          "type": "default",
          "key": "",
          "mockFile": ""
        }
      ]
    },
    {
      "name": "baseUrlUserMgmtChangeUserAttributes",
      "protocol": "REST",
      "method": "POST",
      "entitypath": "{base_path}/{version}/UserMgmt/ChangeUserAttributes?{query}",
      "requestSchema": "schema.json",
      "responseSchema": "schema.json",
      "timeout": 0,
      "sendEmpty": false,
      "requestDatatype": "JSON",
      "responseDatatype": "JSON",
      "headers": {},
      "responseObjects": [
        {
          "type": "default",
          "key": "",
          "mockFile": ""
        }
      ]
    },
    {
      "name": "baseUrlUserMgmtChangeUserPassword",
      "protocol": "REST",
      "method": "POST",
      "entitypath": "{base_path}/{version}/UserMgmt/ChangeUserPassword?{query}",
      "requestSchema": "schema.json",
      "responseSchema": "schema.json",
      "timeout": 0,
      "sendEmpty": false,
      "requestDatatype": "JSON",
      "responseDatatype": "JSON",
      "headers": {},
      "responseObjects": [
        {
          "type": "default",
          "key": "",
          "mockFile": ""
        }
      ]
    },
    {
      "name": "baseUrlUserMgmtCheckUserProfileChallenge",
      "protocol": "REST",
      "method": "POST",
      "entitypath": "{base_path}/{version}/UserMgmt/CheckUserProfileChallenge?{query}",
      "requestSchema": "schema.json",
      "responseSchema": "schema.json",
      "timeout": 0,
      "sendEmpty": false,
      "requestDatatype": "JSON",
      "responseDatatype": "JSON",
      "headers": {},
      "responseObjects": [
        {
          "type": "default",
          "key": "",
          "mockFile": ""
        }
      ]
    },
    {
      "name": "baseUrlUserMgmtDirectoryServiceQuery",
      "protocol": "REST",
      "method": "POST",
      "entitypath": "{base_path}/{version}/UserMgmt/DirectoryServiceQuery?{query}",
      "requestSchema": "schema.json",
      "responseSchema": "schema.json",
      "timeout": 0,
      "sendEmpty": false,
      "requestDatatype": "JSON",
      "responseDatatype": "JSON",
      "headers": {},
      "responseObjects": [
        {
          "type": "default",
          "key": "",
          "mockFile": ""
        }
      ]
    },
    {
      "name": "baseUrlUserMgmtGetCachedEntity",
      "protocol": "REST",
      "method": "POST",
      "entitypath": "{base_path}/{version}/UserMgmt/GetCachedEntity?{query}",
      "requestSchema": "schema.json",
      "responseSchema": "schema.json",
      "timeout": 0,
      "sendEmpty": false,
      "requestDatatype": "JSON",
      "responseDatatype": "JSON",
      "headers": {},
      "responseObjects": [
        {
          "type": "default",
          "key": "",
          "mockFile": ""
        }
      ]
    },
    {
      "name": "baseUrlUserMgmtGetCachedUser",
      "protocol": "REST",
      "method": "POST",
      "entitypath": "{base_path}/{version}/UserMgmt/GetCachedUser?{query}",
      "requestSchema": "schema.json",
      "responseSchema": "schema.json",
      "timeout": 0,
      "sendEmpty": false,
      "requestDatatype": "JSON",
      "responseDatatype": "JSON",
      "headers": {},
      "responseObjects": [
        {
          "type": "default",
          "key": "",
          "mockFile": ""
        }
      ]
    },
    {
      "name": "baseUrlUserMgmtGetSecurityQuestions",
      "protocol": "REST",
      "method": "POST",
      "entitypath": "{base_path}/{version}/UserMgmt/GetSecurityQuestions?{query}",
      "requestSchema": "schema.json",
      "responseSchema": "schema.json",
      "timeout": 0,
      "sendEmpty": false,
      "requestDatatype": "JSON",
      "responseDatatype": "JSON",
      "headers": {},
      "responseObjects": [
        {
          "type": "default",
          "key": "",
          "mockFile": ""
        }
      ]
    },
    {
      "name": "baseUrlUserMgmtGetUserAttributes",
      "protocol": "REST",
      "method": "POST",
      "entitypath": "{base_path}/{version}/UserMgmt/GetUserAttributes?{query}",
      "requestSchema": "schema.json",
      "responseSchema": "schema.json",
      "timeout": 0,
      "sendEmpty": false,
      "requestDatatype": "JSON",
      "responseDatatype": "JSON",
      "headers": {},
      "responseObjects": [
        {
          "type": "default",
          "key": "",
          "mockFile": ""
        }
      ]
    },
    {
      "name": "baseUrlUserMgmtGetUserCertificateInfo",
      "protocol": "REST",
      "method": "POST",
      "entitypath": "{base_path}/{version}/UserMgmt/GetUserCertificateInfo?{query}",
      "requestSchema": "schema.json",
      "responseSchema": "schema.json",
      "timeout": 0,
      "sendEmpty": false,
      "requestDatatype": "JSON",
      "responseDatatype": "JSON",
      "headers": {},
      "responseObjects": [
        {
          "type": "default",
          "key": "",
          "mockFile": ""
        }
      ]
    },
    {
      "name": "baseUrlUserMgmtGetUserHierarchy",
      "protocol": "REST",
      "method": "POST",
      "entitypath": "{base_path}/{version}/UserMgmt/GetUserHierarchy?{query}",
      "requestSchema": "schema.json",
      "responseSchema": "schema.json",
      "timeout": 0,
      "sendEmpty": false,
      "requestDatatype": "JSON",
      "responseDatatype": "JSON",
      "headers": {},
      "responseObjects": [
        {
          "type": "default",
          "key": "",
          "mockFile": ""
        }
      ]
    },
    {
      "name": "baseUrlUserMgmtGetUserInfo",
      "protocol": "REST",
      "method": "POST",
      "entitypath": "{base_path}/{version}/UserMgmt/GetUserInfo?{query}",
      "requestSchema": "schema.json",
      "responseSchema": "schema.json",
      "timeout": 0,
      "sendEmpty": false,
      "requestDatatype": "JSON",
      "responseDatatype": "JSON",
      "headers": {},
      "responseObjects": [
        {
          "type": "default",
          "key": "",
          "mockFile": ""
        }
      ]
    },
    {
      "name": "baseUrlUserMgmtGetUserPicture",
      "protocol": "REST",
      "method": "POST",
      "entitypath": "{base_path}/{version}/UserMgmt/GetUserPicture?{query}",
      "requestSchema": "schema.json",
      "responseSchema": "schema.json",
      "timeout": 0,
      "sendEmpty": false,
      "requestDatatype": "JSON",
      "responseDatatype": "JSON",
      "headers": {},
      "responseObjects": [
        {
          "type": "default",
          "key": "",
          "mockFile": ""
        }
      ]
    },
    {
      "name": "baseUrlUserMgmtGetUserPreferences",
      "protocol": "REST",
      "method": "POST",
      "entitypath": "{base_path}/{version}/UserMgmt/GetUserPreferences?{query}",
      "requestSchema": "schema.json",
      "responseSchema": "schema.json",
      "timeout": 0,
      "sendEmpty": false,
      "requestDatatype": "JSON",
      "responseDatatype": "JSON",
      "headers": {},
      "responseObjects": [
        {
          "type": "default",
          "key": "",
          "mockFile": ""
        }
      ]
    },
    {
      "name": "baseUrlUserMgmtGetUsersRolesAndAdministrativeRights",
      "protocol": "REST",
      "method": "POST",
      "entitypath": "{base_path}/{version}/UserMgmt/GetUsersRolesAndAdministrativeRights?{query}",
      "requestSchema": "schema.json",
      "responseSchema": "schema.json",
      "timeout": 0,
      "sendEmpty": false,
      "requestDatatype": "JSON",
      "responseDatatype": "JSON",
      "headers": {},
      "responseObjects": [
        {
          "type": "default",
          "key": "",
          "mockFile": ""
        }
      ]
    },
    {
      "name": "baseUrlUserMgmtInviteUsers",
      "protocol": "REST",
      "method": "POST",
      "entitypath": "{base_path}/{version}/UserMgmt/InviteUsers?{query}",
      "requestSchema": "schema.json",
      "responseSchema": "schema.json",
      "timeout": 0,
      "sendEmpty": false,
      "requestDatatype": "JSON",
      "responseDatatype": "JSON",
      "headers": {},
      "responseObjects": [
        {
          "type": "default",
          "key": "",
          "mockFile": ""
        }
      ]
    },
    {
      "name": "baseUrlUserMgmtIsUserCloudLocked",
      "protocol": "REST",
      "method": "POST",
      "entitypath": "{base_path}/{version}/UserMgmt/IsUserCloudLocked?{query}",
      "requestSchema": "schema.json",
      "responseSchema": "schema.json",
      "timeout": 0,
      "sendEmpty": false,
      "requestDatatype": "JSON",
      "responseDatatype": "JSON",
      "headers": {},
      "responseObjects": [
        {
          "type": "default",
          "key": "",
          "mockFile": ""
        }
      ]
    },
    {
      "name": "baseUrlUserMgmtIsUserLockedOutByPolicy",
      "protocol": "REST",
      "method": "POST",
      "entitypath": "{base_path}/{version}/UserMgmt/IsUserLockedOutByPolicy?{query}",
      "requestSchema": "schema.json",
      "responseSchema": "schema.json",
      "timeout": 0,
      "sendEmpty": false,
      "requestDatatype": "JSON",
      "responseDatatype": "JSON",
      "headers": {},
      "responseObjects": [
        {
          "type": "default",
          "key": "",
          "mockFile": ""
        }
      ]
    },
    {
      "name": "baseUrlUserMgmtIsUserSubjectToCloudLocks",
      "protocol": "REST",
      "method": "POST",
      "entitypath": "{base_path}/{version}/UserMgmt/IsUserSubjectToCloudLocks?{query}",
      "requestSchema": "schema.json",
      "responseSchema": "schema.json",
      "timeout": 0,
      "sendEmpty": false,
      "requestDatatype": "JSON",
      "responseDatatype": "JSON",
      "headers": {},
      "responseObjects": [
        {
          "type": "default",
          "key": "",
          "mockFile": ""
        }
      ]
    },
    {
      "name": "baseUrlUserMgmtRemoveUser",
      "protocol": "REST",
      "method": "POST",
      "entitypath": "{base_path}/{version}/UserMgmt/RemoveUser?{query}",
      "requestSchema": "schema.json",
      "responseSchema": "schema.json",
      "timeout": 0,
      "sendEmpty": false,
      "requestDatatype": "JSON",
      "responseDatatype": "JSON",
      "headers": {},
      "responseObjects": [
        {
          "type": "default",
          "key": "",
          "mockFile": ""
        }
      ]
    },
    {
      "name": "baseUrlUserMgmtRemoveUserCertificate",
      "protocol": "REST",
      "method": "POST",
      "entitypath": "{base_path}/{version}/UserMgmt/RemoveUserCertificate?{query}",
      "requestSchema": "schema.json",
      "responseSchema": "schema.json",
      "timeout": 0,
      "sendEmpty": false,
      "requestDatatype": "JSON",
      "responseDatatype": "JSON",
      "headers": {},
      "responseObjects": [
        {
          "type": "default",
          "key": "",
          "mockFile": ""
        }
      ]
    },
    {
      "name": "baseUrlUserMgmtRemoveUsers",
      "protocol": "REST",
      "method": "POST",
      "entitypath": "{base_path}/{version}/UserMgmt/RemoveUsers?{query}",
      "requestSchema": "schema.json",
      "responseSchema": "schema.json",
      "timeout": 0,
      "sendEmpty": false,
      "requestDatatype": "JSON",
      "responseDatatype": "JSON",
      "headers": {},
      "responseObjects": [
        {
          "type": "default",
          "key": "",
          "mockFile": ""
        }
      ]
    },
    {
      "name": "baseUrlUserMgmtResetSecurityQuestions",
      "protocol": "REST",
      "method": "POST",
      "entitypath": "{base_path}/{version}/UserMgmt/ResetSecurityQuestions?{query}",
      "requestSchema": "schema.json",
      "responseSchema": "schema.json",
      "timeout": 0,
      "sendEmpty": false,
      "requestDatatype": "JSON",
      "responseDatatype": "JSON",
      "headers": {},
      "responseObjects": [
        {
          "type": "default",
          "key": "",
          "mockFile": ""
        }
      ]
    },
    {
      "name": "baseUrlUserMgmtResetUserPassword",
      "protocol": "REST",
      "method": "POST",
      "entitypath": "{base_path}/{version}/UserMgmt/ResetUserPassword?{query}",
      "requestSchema": "schema.json",
      "responseSchema": "schema.json",
      "timeout": 0,
      "sendEmpty": false,
      "requestDatatype": "JSON",
      "responseDatatype": "JSON",
      "headers": {},
      "responseObjects": [
        {
          "type": "default",
          "key": "",
          "mockFile": ""
        }
      ]
    },
    {
      "name": "baseUrlUserMgmtSendLoginEmail",
      "protocol": "REST",
      "method": "POST",
      "entitypath": "{base_path}/{version}/UserMgmt/SendLoginEmail?{query}",
      "requestSchema": "schema.json",
      "responseSchema": "schema.json",
      "timeout": 0,
      "sendEmpty": false,
      "requestDatatype": "JSON",
      "responseDatatype": "JSON",
      "headers": {},
      "responseObjects": [
        {
          "type": "default",
          "key": "",
          "mockFile": ""
        }
      ]
    },
    {
      "name": "baseUrlUserMgmtSendLoginEmails",
      "protocol": "REST",
      "method": "POST",
      "entitypath": "{base_path}/{version}/UserMgmt/SendLoginEmails?{query}",
      "requestSchema": "schema.json",
      "responseSchema": "schema.json",
      "timeout": 0,
      "sendEmpty": false,
      "requestDatatype": "JSON",
      "responseDatatype": "JSON",
      "headers": {},
      "responseObjects": [
        {
          "type": "default",
          "key": "",
          "mockFile": ""
        }
      ]
    },
    {
      "name": "baseUrlUserMgmtSendSmsInvite",
      "protocol": "REST",
      "method": "POST",
      "entitypath": "{base_path}/{version}/UserMgmt/SendSmsInvite?{query}",
      "requestSchema": "schema.json",
      "responseSchema": "schema.json",
      "timeout": 0,
      "sendEmpty": false,
      "requestDatatype": "JSON",
      "responseDatatype": "JSON",
      "headers": {},
      "responseObjects": [
        {
          "type": "default",
          "key": "",
          "mockFile": ""
        }
      ]
    },
    {
      "name": "baseUrlUserMgmtSetCloudLock",
      "protocol": "REST",
      "method": "POST",
      "entitypath": "{base_path}/{version}/UserMgmt/SetCloudLock?{query}",
      "requestSchema": "schema.json",
      "responseSchema": "schema.json",
      "timeout": 0,
      "sendEmpty": false,
      "requestDatatype": "JSON",
      "responseDatatype": "JSON",
      "headers": {},
      "responseObjects": [
        {
          "type": "default",
          "key": "",
          "mockFile": ""
        }
      ]
    },
    {
      "name": "baseUrlUserMgmtSetPhonePin",
      "protocol": "REST",
      "method": "POST",
      "entitypath": "{base_path}/{version}/UserMgmt/SetPhonePin?{query}",
      "requestSchema": "schema.json",
      "responseSchema": "schema.json",
      "timeout": 0,
      "sendEmpty": false,
      "requestDatatype": "JSON",
      "responseDatatype": "JSON",
      "headers": {},
      "responseObjects": [
        {
          "type": "default",
          "key": "",
          "mockFile": ""
        }
      ]
    },
    {
      "name": "baseUrlUserMgmtSetSecurityQuestion",
      "protocol": "REST",
      "method": "POST",
      "entitypath": "{base_path}/{version}/UserMgmt/SetSecurityQuestion?{query}",
      "requestSchema": "schema.json",
      "responseSchema": "schema.json",
      "timeout": 0,
      "sendEmpty": false,
      "requestDatatype": "JSON",
      "responseDatatype": "JSON",
      "headers": {},
      "responseObjects": [
        {
          "type": "default",
          "key": "",
          "mockFile": ""
        }
      ]
    },
    {
      "name": "baseUrlUserMgmtUncacheUserPreferences",
      "protocol": "REST",
      "method": "POST",
      "entitypath": "{base_path}/{version}/UserMgmt/UncacheUserPreferences?{query}",
      "requestSchema": "schema.json",
      "responseSchema": "schema.json",
      "timeout": 0,
      "sendEmpty": false,
      "requestDatatype": "JSON",
      "responseDatatype": "JSON",
      "headers": {},
      "responseObjects": [
        {
          "type": "default",
          "key": "",
          "mockFile": ""
        }
      ]
    },
    {
      "name": "baseUrlUserMgmtUpdateSecurityQuestions",
      "protocol": "REST",
      "method": "POST",
      "entitypath": "{base_path}/{version}/UserMgmt/UpdateSecurityQuestions?{query}",
      "requestSchema": "schema.json",
      "responseSchema": "schema.json",
      "timeout": 0,
      "sendEmpty": false,
      "requestDatatype": "JSON",
      "responseDatatype": "JSON",
      "headers": {},
      "responseObjects": [
        {
          "type": "default",
          "key": "",
          "mockFile": ""
        }
      ]
    },
    {
      "name": "baseUrlUserMgmtUpdateUserPreferences",
      "protocol": "REST",
      "method": "POST",
      "entitypath": "{base_path}/{version}/UserMgmt/UpdateUserPreferences?{query}",
      "requestSchema": "schema.json",
      "responseSchema": "schema.json",
      "timeout": 0,
      "sendEmpty": false,
      "requestDatatype": "JSON",
      "responseDatatype": "JSON",
      "headers": {},
      "responseObjects": [
        {
          "type": "default",
          "key": "",
          "mockFile": ""
        }
      ]
    }
  ]
}