{
  "actions": [
    {
      "name": "baseUrlHealthCheck",
      "protocol": "REST",
      "method": "POST",
      "entitypath": "{base_path}/{version}/Health/Check?{query}",
      "requestSchema": "schema.json",
      "responseSchema": "schema.json",
      "timeout": 0,
      "sendEmpty": false,
      "requestDatatype": "JSON",
      "responseDatatype": "JSON",
      "headers": {},
      "responseObjects": [
        {
          "type": "default",
          "key": "",
          "mockFile": ""
        }
      ]
    },
    {
      "name": "baseUrlHomeGetLoginData",
      "protocol": "REST",
      "method": "POST",
      "entitypath": "{base_path}/{version}/Home/GetLoginData?{query}",
      "requestSchema": "schema.json",
      "responseSchema": "schema.json",
      "timeout": 0,
      "sendEmpty": false,
      "requestDatatype": "JSON",
      "responseDatatype": "JSON",
      "headers": {},
      "responseObjects": [
        {
          "type": "default",
          "key": "",
          "mockFile": ""
        }
      ]
    },
    {
      "name": "baseUrlLibOnlyVfsGetFile",
      "protocol": "REST",
      "method": "POST",
      "entitypath": "{base_path}/{version}/LibOnlyVfs/GetFile?{query}",
      "requestSchema": "schema.json",
      "responseSchema": "schema.json",
      "timeout": 0,
      "sendEmpty": false,
      "requestDatatype": "JSON",
      "responseDatatype": "JSON",
      "headers": {},
      "responseObjects": [
        {
          "type": "default",
          "key": "",
          "mockFile": ""
        }
      ]
    },
    {
      "name": "baseUrlOAuth2ManCreateClientToken",
      "protocol": "REST",
      "method": "POST",
      "entitypath": "{base_path}/{version}/OAuth2Man/CreateClientToken?{query}",
      "requestSchema": "schema.json",
      "responseSchema": "schema.json",
      "timeout": 0,
      "sendEmpty": false,
      "requestDatatype": "JSON",
      "responseDatatype": "JSON",
      "headers": {},
      "responseObjects": [
        {
          "type": "default",
          "key": "",
          "mockFile": ""
        }
      ]
    },
    {
      "name": "baseUrlPKILogin",
      "protocol": "REST",
      "method": "POST",
      "entitypath": "{base_path}/{version}/PKI/Login?{query}",
      "requestSchema": "schema.json",
      "responseSchema": "schema.json",
      "timeout": 0,
      "sendEmpty": false,
      "requestDatatype": "JSON",
      "responseDatatype": "JSON",
      "headers": {},
      "responseObjects": [
        {
          "type": "default",
          "key": "",
          "mockFile": ""
        }
      ]
    },
    {
      "name": "baseUrlUEvaluate",
      "protocol": "REST",
      "method": "POST",
      "entitypath": "{base_path}/{version}/U/Evaluate?{query}",
      "requestSchema": "schema.json",
      "responseSchema": "schema.json",
      "timeout": 0,
      "sendEmpty": false,
      "requestDatatype": "JSON",
      "responseDatatype": "JSON",
      "headers": {},
      "responseObjects": [
        {
          "type": "default",
          "key": "",
          "mockFile": ""
        }
      ]
    }
  ]
}