{
  "authentication": [
    {
      "AllowInternalScripts": null,
      "AppID": "Ansible",
      "AuthType": "machineAddress",
      "AuthValue": "ansible.192.168.3.103.xip.io",
      "Comment": null,
      "IsFolder": null,
      "authID": 1
    },
    {
      "AllowInternalScripts": null,
      "AppID": "Ansible",
      "AuthType": "machineAddress",
      "AuthValue": "ansible.192.168.3.103.xip.io",
      "Comment": null,
      "IsFolder": null,
      "authID": 1
    },
    {
      "AllowInternalScripts": null,
      "AppID": "Ansible",
      "AuthType": "machineAddress",
      "AuthValue": "ansible.192.168.3.103.xip.io",
      "Comment": null,
      "IsFolder": null,
      "authID": 1
    },
    {
      "AllowInternalScripts": null,
      "AppID": "Ansible",
      "AuthType": "machineAddress",
      "AuthValue": "ansible.192.168.3.103.xip.io",
      "Comment": null,
      "IsFolder": null,
      "authID": 1
    },
    {
      "AllowInternalScripts": null,
      "AppID": "Ansible",
      "AuthType": "machineAddress",
      "AuthValue": "ansible.192.168.3.103.xip.io",
      "Comment": null,
      "IsFolder": null,
      "authID": 1
    },
    {
      "AllowInternalScripts": null,
      "AppID": "Ansible",
      "AuthType": "machineAddress",
      "AuthValue": "ansible.192.168.3.103.xip.io",
      "Comment": null,
      "IsFolder": null,
      "authID": 1
    }
  ]
}