{
  "actions": [
    {
      "name": "getAllConnectionComponents",
      "protocol": "REST",
      "method": "GET",
      "entitypath": "{base_path}/{version}/PasswordVault/API/PSM/Connectors?{query}",
      "requestSchema": "schema.json",
      "responseSchema": "schema.json",
      "timeout": 0,
      "sendEmpty": false,
      "sendGetBody": false,
      "requestDatatype": "JSON",
      "responseDatatype": "JSON",
      "headers": {},
      "responseObjects": [
        {
          "type": "default",
          "key": "",
          "mockFile": "mockdatafiles/getAllConnectionComponents-default.json"
        }
      ]
    },
    {
      "name": "getAllPSMServers",
      "protocol": "REST",
      "method": "GET",
      "entitypath": "{base_path}/{version}/PasswordVault/API/PSM/Servers?{query}",
      "requestSchema": "schema.json",
      "responseSchema": "schema.json",
      "timeout": 0,
      "sendEmpty": false,
      "sendGetBody": false,
      "requestDatatype": "JSON",
      "responseDatatype": "JSON",
      "headers": {},
      "responseObjects": [
        {
          "type": "default",
          "key": "",
          "mockFile": "mockdatafiles/getAllPSMServers-default.json"
        }
      ]
    },
    {
      "name": "getSessionManagementPolicyofPlatform",
      "protocol": "REST",
      "method": "GET",
      "entitypath": "{base_path}/{version}/PasswordVault/API/Platforms/Targets/PrivilegedSessionManagement?{query}",
      "requestSchema": "schema.json",
      "responseSchema": "schema.json",
      "timeout": 0,
      "sendEmpty": false,
      "sendGetBody": false,
      "requestDatatype": "JSON",
      "responseDatatype": "JSON",
      "headers": {},
      "responseObjects": [
        {
          "type": "default",
          "key": "",
          "mockFile": ""
        }
      ]
    },
    {
      "name": "importConnectionComponent",
      "protocol": "REST",
      "method": "POST",
      "entitypath": "{base_path}/{version}/PasswordVault/API/ConnectionComponents/Import?{query}",
      "requestSchema": "schema.json",
      "responseSchema": "schema.json",
      "timeout": 0,
      "sendEmpty": false,
      "requestDatatype": "JSON",
      "responseDatatype": "JSON",
      "headers": {},
      "responseObjects": [
        {
          "type": "default",
          "key": "",
          "mockFile": ""
        }
      ]
    },
    {
      "name": "updateSessionManagementPolicyofPlatform",
      "protocol": "REST",
      "method": "PUT",
      "entitypath": "{base_path}/{version}/passwordvault/api/Platforms/Targets/PrivilegedSessionManagement?{query}",
      "requestSchema": "schema.json",
      "responseSchema": "schema.json",
      "timeout": 0,
      "sendEmpty": false,
      "requestDatatype": "JSON",
      "responseDatatype": "JSON",
      "headers": {},
      "responseObjects": [
        {
          "type": "default",
          "key": "",
          "mockFile": ""
        }
      ]
    }
  ]
}