{
  "$id": "schema.json",
  "type": "object",
  "schema": "http://json-schema.org/draft-07/schema#",
  "translate": true,
  "dynamicfields": true,
  "properties": {
    "ph_request_type": {
      "type": "string",
      "description": "type of request (internal to adapter)",
      "default": "baseUrlServerAgentAddEnrollmentCode",
      "enum": [
        "baseUrlServerAgentAddEnrollmentCode",
        "baseUrlServerAgentDeleteEnrollmentCode",
        "baseUrlServerAgentDisableFeatures",
        "baseUrlServerAgentEnableFeatures",
        "baseUrlServerAgentEnableFeaturesV2",
        "baseUrlServerAgentEnroll",
        "baseUrlServerAgentEnrollV2",
        "baseUrlServerAgentGetAllEnrollmentCodes",
        "baseUrlServerAgentGetCertificate",
        "baseUrlServerAgentRegister",
        "baseUrlServerAgentRegisterV2",
        "baseUrlServerAgentUnenroll",
        "baseUrlServerAgentVerifyPasswordV2"
      ],
      "external_name": "ph_request_type"
    },
    "body": {
      "type": "object",
      "description": "",
      "parse": false,
      "encode": false,
      "encrypt": {
        "type": "AES",
        "key": ""
      },
      "external_name": "Body"
    }
  },
  "definitions": {}
}