{
  "$id": "schema.json",
  "type": "object",
  "schema": "http://json-schema.org/draft-07/schema#",
  "translate": true,
  "dynamicfields": true,
  "properties": {
    "ph_request_type": {
      "type": "string",
      "description": "type of request (internal to adapter)",
      "default": "getPTASystemHealth",
      "enum": [
        "getPTASystemHealth",
        "systemDetails",
        "systemSummary"
      ],
      "external_name": "ph_request_type"
    },
    "match": {
      "type": "string",
      "description": "Job ID(s) to monitor in array",
      "parse": false,
      "encode": false,
      "encrypt": {
        "type": "AES",
        "key": ""
      },
      "external_name": "match[]"
    }
  },
  "definitions": {}
}