{
  "$id": "schema.json",
  "type": "object",
  "schema": "http://json-schema.org/draft-07/schema#",
  "translate": true,
  "dynamicfields": true,
  "properties": {
    "ph_request_type": {
      "type": "string",
      "description": "type of request (internal to adapter)",
      "default": "baseUrlSecurityAdvanceAuthentication",
      "enum": [
        "baseUrlSecurityAdvanceAuthentication",
        "baseUrlSecurityAdvanceForgotUsername",
        "baseUrlSecurityAmIAuthenticated",
        "baseUrlSecurityAnswerOOBChallenge",
        "baseUrlSecurityChallengeUser",
        "baseUrlSecurityCleanupAuthentication",
        "baseUrlSecurityDoIHaveRight",
        "baseUrlSecurityForgotUsername",
        "baseUrlSecurityGetOneTimePassword",
        "baseUrlSecurityGetRiskAnalysisLevels",
        "baseUrlSecurityLogin",
        "baseUrlSecurityLogout",
        "baseUrlSecurityMultiAuthLogin",
        "baseUrlSecurityOnDemandChallenge",
        "baseUrlSecurityRefreshToken",
        "baseUrlSecurityResumeFromExtIdpAuth",
        "baseUrlSecurityStartAuthentication",
        "baseUrlSecurityStartChallenge",
        "baseUrlSecurityStartForgotUsername",
        "baseUrlSecurityStartSocialAuthentication",
        "baseUrlSecuritySubmitOathOtpCode",
        "baseUrlSecurityTaskCheck",
        "baseUrlSecurityTaskChecks",
        "baseUrlSecurityTwilioPhoneChallengeCompleted",
        "baseUrlSecurityTwilioPhoneChallengeNotAnswered",
        "baseUrlSecurityWhoAmI"
      ],
      "external_name": "ph_request_type"
    },
    "body": {
      "type": "object",
      "description": "",
      "parse": false,
      "encode": false,
      "encrypt": {
        "type": "AES",
        "key": ""
      },
      "external_name": "Body"
    },
    "extIdpAuthChallengeState": {
      "type": "string",
      "description": "(Required) The current Idp challenge state.",
      "parse": false,
      "encode": false,
      "encrypt": {
        "type": "AES",
        "key": ""
      },
      "external_name": "ExtIdpAuthChallengeState"
    },
    "task": {
      "type": "string",
      "description": "(Required) The task.",
      "parse": false,
      "encode": false,
      "encrypt": {
        "type": "AES",
        "key": ""
      },
      "external_name": "Task"
    }
  },
  "definitions": {}
}