{
  "$id": "schema.json",
  "type": "object",
  "schema": "http://json-schema.org/draft-07/schema#",
  "translate": false,
  "dynamicfields": true,
  "properties": {
    "ph_request_type": {
      "type": "string",
      "description": "type of request (internal to adapter)",
      "default": "getCableModemRealTimeData",
      "enum": [
        "getCableModemRealTimeData",
        "getMacsWithHourlyData",
        "getMacWithHourlyData",
        "getMacWithMonthlyData",
        "getSumOfTransfersInCurrentMonth",
        "getMACsTransferredMostCurrentMonth",
        "getSumTransfersInMonthForEachMac",
        "getSumTransfersInMonthForEachMacCount",
        "getSumTransfersInMonthForEachMacSortTotal",
        "getSumTransfersInMonthForEachMacSortUpload",
        "getSumTransfersInMonthForEachMacSortDownload",
        "getSumTransfersInMonthForEachMacLimit",
        "getSumServices",
        "getAllCableModemHourly",
        "getCableModemHourly",
        "getCableModemDailyMac",
        "getCableModemMonthly",
        "getCableModemCurrentMonthAverage",
        "getCableModemAverageMac",
        "getAllCableModemFlapHourly",
        "getCableModemFlapHourly",
        "getCableModemFlapDaily",
        "getCableModemFlapMonthly",
        "getCableModemFlapCurrentDay",
        "getCableModemFlapCurrentMonth",
        "getCableModemFlapLastMonth",
        "getCableModemFlapCurrentMonthMost",
        "getCableModemStatus"
      ],
      "external_name": "ph_request_type"
    }
  },
  "definitions": {}
}