{
  "actions": [
    {
      "name": "getGetCatalogClass",
      "protocol": "REST",
      "method": "GET",
      "entitypath": "{base_path}/{version}/cco/catalog?{query}",
      "requestSchema": "schema.json",
      "responseSchema": "schema.json",
      "timeout": 0,
      "sendEmpty": false,
      "sendGetBody": false,
      "requestDatatype": "JSON",
      "responseDatatype": "JSON",
      "headers": {
        "Content-Type": "*/*"
      },
      "responseObjects": [
        {
          "type": "default",
          "key": "",
          "mockFile": ""
        }
      ]
    },
    {
      "name": "postGetOptimizedSoftwareClass",
      "protocol": "REST",
      "method": "POST",
      "entitypath": "{base_path}/{version}/cco/get_optimized_list?{query}",
      "requestSchema": "schema.json",
      "responseSchema": "schema.json",
      "timeout": 0,
      "sendEmpty": false,
      "sendGetBody": false,
      "requestDatatype": "JSON",
      "responseDatatype": "JSON",
      "headers": {},
      "responseObjects": [
        {
          "type": "default",
          "key": "",
          "mockFile": ""
        }
      ]
    },
    {
      "name": "getGetSoftwareClass",
      "protocol": "REST",
      "method": "GET",
      "entitypath": "{base_path}/{version}/cco/software/platform/{pathv1}/release/{pathv2}?{query}",
      "requestSchema": "schema.json",
      "responseSchema": "schema.json",
      "timeout": 0,
      "sendEmpty": false,
      "sendGetBody": false,
      "requestDatatype": "JSON",
      "responseDatatype": "JSON",
      "headers": {
        "Content-Type": "*/*"
      },
      "responseObjects": [
        {
          "type": "default",
          "key": "",
          "mockFile": ""
        }
      ]
    },
    {
      "name": "getGetCcoSoftwareEntryClass",
      "protocol": "REST",
      "method": "GET",
      "entitypath": "{base_path}/{version}/cco/software/platform/{pathv1}/release/{pathv2}/name_or_id/{pathv3}?{query}",
      "requestSchema": "schema.json",
      "responseSchema": "schema.json",
      "timeout": 0,
      "sendEmpty": false,
      "sendGetBody": false,
      "requestDatatype": "JSON",
      "responseDatatype": "JSON",
      "headers": {
        "Content-Type": "*/*"
      },
      "responseObjects": [
        {
          "type": "default",
          "key": "",
          "mockFile": ""
        }
      ]
    }
  ]
}