[
  {
    "id": "id",
    "name": "name",
    "description": "description",
    "systemDefined": true
  },
  {
    "id": "id",
    "name": "name",
    "description": "description",
    "systemDefined": true
  },
  {
    "id": "id",
    "name": "name",
    "description": "description",
    "systemDefined": true
  },
  {
    "id": "id",
    "name": "name",
    "description": "description",
    "systemDefined": true
  }
]