{
  "actions": [
    {
      "name": "getsponsoredguestportals",
      "protocol": "REST",
      "method": "GET",
      "entitypath": "{base_path}/{version}/sponsoredguestportal?{query}",
      "requestSchema": "schema.json",
      "responseSchema": "schema.json",
      "timeout": 0,
      "sendEmpty": false,
      "sendGetBody": false,
      "requestDatatype": "JSON",
      "responseDatatype": "JSON",
      "headers": {},
      "responseObjects": [
        {
          "type": "default",
          "key": "",
          "mockFile": "mockdatafiles/getsponsoredguestportals-default.json"
        }
      ]
    },
    {
      "name": "createsponsoredGuestPortal",
      "protocol": "REST",
      "method": "POST",
      "entitypath": "{base_path}/{version}/sponsoredguestportal?{query}",
      "requestSchema": "schema.json",
      "responseSchema": "schema.json",
      "timeout": 0,
      "sendEmpty": false,
      "requestDatatype": "JSON",
      "responseDatatype": "JSON",
      "headers": {},
      "responseObjects": [
        {
          "type": "default",
          "key": "",
          "mockFile": ""
        }
      ]
    },
    {
      "name": "getsponsoredGuestPortal",
      "protocol": "REST",
      "method": "GET",
      "entitypath": "{base_path}/{version}/sponsoredguestportal/{pathv1}?{query}",
      "requestSchema": "schema.json",
      "responseSchema": "schema.json",
      "timeout": 0,
      "sendEmpty": false,
      "sendGetBody": false,
      "requestDatatype": "JSON",
      "responseDatatype": "JSON",
      "headers": {},
      "responseObjects": [
        {
          "type": "default",
          "key": "",
          "mockFile": "mockdatafiles/getsponsoredGuestPortal-default.json"
        }
      ]
    },
    {
      "name": "updatesponsoredGuestPortal",
      "protocol": "REST",
      "method": "PUT",
      "entitypath": "{base_path}/{version}/sponsoredguestportal/{pathv1}?{query}",
      "requestSchema": "schema.json",
      "responseSchema": "schema.json",
      "timeout": 0,
      "sendEmpty": false,
      "requestDatatype": "JSON",
      "responseDatatype": "JSON",
      "headers": {},
      "responseObjects": [
        {
          "type": "default",
          "key": "",
          "mockFile": ""
        }
      ]
    },
    {
      "name": "deletesponsoredGuestPortal",
      "protocol": "REST",
      "method": "DELETE",
      "entitypath": "{base_path}/{version}/sponsoredguestportal/{pathv1}?{query}",
      "requestSchema": "schema.json",
      "responseSchema": "schema.json",
      "timeout": 0,
      "sendEmpty": false,
      "requestDatatype": "JSON",
      "responseDatatype": "JSON",
      "headers": {},
      "responseObjects": [
        {
          "type": "default",
          "key": "",
          "mockFile": ""
        }
      ]
    }
  ]
}