{
  "items": [
    {
      "version": "string",
      "enableAutomaticUpdates": true,
      "queryCloudUnknown": false,
      "urlCacheReloadTTL": "FOURTY_EIGHT_HRS",
      "id": "string",
      "type": "cloudconfig",
      "links": {
        "self": "string"
      }
    },
    {
      "version": "string",
      "enableAutomaticUpdates": true,
      "queryCloudUnknown": true,
      "urlCacheReloadTTL": "EIGHT_HRS",
      "id": "string",
      "type": "cloudconfig",
      "links": {
        "self": "string"
      }
    },
    {
      "version": "string",
      "enableAutomaticUpdates": false,
      "queryCloudUnknown": false,
      "urlCacheReloadTTL": "NEVER",
      "id": "string",
      "type": "cloudconfig",
      "links": {
        "self": "string"
      }
    },
    {
      "version": "string",
      "enableAutomaticUpdates": true,
      "queryCloudUnknown": false,
      "urlCacheReloadTTL": "TWO_HRS",
      "id": "string",
      "type": "cloudconfig",
      "links": {
        "self": "string"
      }
    },
    {
      "version": "string",
      "enableAutomaticUpdates": true,
      "queryCloudUnknown": true,
      "urlCacheReloadTTL": "EIGHT_HRS",
      "id": "string",
      "type": "cloudconfig",
      "links": {
        "self": "string"
      }
    },
    {
      "version": "string",
      "enableAutomaticUpdates": true,
      "queryCloudUnknown": false,
      "urlCacheReloadTTL": "FOUR_HRS",
      "id": "string",
      "type": "cloudconfig",
      "links": {
        "self": "string"
      }
    },
    {
      "version": "string",
      "enableAutomaticUpdates": true,
      "queryCloudUnknown": false,
      "urlCacheReloadTTL": "EIGHT_HRS",
      "id": "string",
      "type": "cloudconfig",
      "links": {
        "self": "string"
      }
    },
    {
      "version": "string",
      "enableAutomaticUpdates": true,
      "queryCloudUnknown": false,
      "urlCacheReloadTTL": "TWELVE_HRS",
      "id": "string",
      "type": "cloudconfig",
      "links": {
        "self": "string"
      }
    },
    {
      "version": "string",
      "enableAutomaticUpdates": true,
      "queryCloudUnknown": false,
      "urlCacheReloadTTL": "TWO_HRS",
      "id": "string",
      "type": "cloudconfig",
      "links": {
        "self": "string"
      }
    },
    {
      "version": "string",
      "enableAutomaticUpdates": true,
      "queryCloudUnknown": true,
      "urlCacheReloadTTL": "TWELVE_HRS",
      "id": "string",
      "type": "cloudconfig",
      "links": {
        "self": "string"
      }
    }
  ],
  "paging": {
    "prev": [
      "string",
      "string",
      "string",
      "string",
      "string",
      "string"
    ],
    "next": [
      "string",
      "string",
      "string",
      "string"
    ],
    "limit": 4,
    "offset": 6,
    "count": 10,
    "pages": 3
  }
}