{
  "version": "string",
  "name": "string",
  "whitelistRules": [
    {
      "name": "string",
      "dnsObjects": [
        {
          "id": "string",
          "type": "string",
          "version": "string",
          "name": "string"
        },
        {
          "id": "string",
          "type": "string",
          "version": "string",
          "name": "string"
        }
      ],
      "sourceZones": [
        {
          "id": "string",
          "type": "string",
          "version": "string",
          "name": "string"
        }
      ],
      "sourceNetworks": [
        {
          "id": "string",
          "type": "string",
          "version": "string",
          "name": "string"
        },
        {
          "id": "string",
          "type": "string",
          "version": "string",
          "name": "string"
        },
        {
          "id": "string",
          "type": "string",
          "version": "string",
          "name": "string"
        },
        {
          "id": "string",
          "type": "string",
          "version": "string",
          "name": "string"
        },
        {
          "id": "string",
          "type": "string",
          "version": "string",
          "name": "string"
        },
        {
          "id": "string",
          "type": "string",
          "version": "string",
          "name": "string"
        },
        {
          "id": "string",
          "type": "string",
          "version": "string",
          "name": "string"
        },
        {
          "id": "string",
          "type": "string",
          "version": "string",
          "name": "string"
        }
      ],
      "ruleAction": "WHITELIST",
      "systemDefined": true,
      "type": "dnsrule"
    },
    {
      "name": "string",
      "dnsObjects": [
        {
          "id": "string",
          "type": "string",
          "version": "string",
          "name": "string"
        },
        {
          "id": "string",
          "type": "string",
          "version": "string",
          "name": "string"
        },
        {
          "id": "string",
          "type": "string",
          "version": "string",
          "name": "string"
        }
      ],
      "sourceZones": [
        {
          "id": "string",
          "type": "string",
          "version": "string",
          "name": "string"
        },
        {
          "id": "string",
          "type": "string",
          "version": "string",
          "name": "string"
        },
        {
          "id": "string",
          "type": "string",
          "version": "string",
          "name": "string"
        },
        {
          "id": "string",
          "type": "string",
          "version": "string",
          "name": "string"
        },
        {
          "id": "string",
          "type": "string",
          "version": "string",
          "name": "string"
        },
        {
          "id": "string",
          "type": "string",
          "version": "string",
          "name": "string"
        },
        {
          "id": "string",
          "type": "string",
          "version": "string",
          "name": "string"
        },
        {
          "id": "string",
          "type": "string",
          "version": "string",
          "name": "string"
        },
        {
          "id": "string",
          "type": "string",
          "version": "string",
          "name": "string"
        },
        {
          "id": "string",
          "type": "string",
          "version": "string",
          "name": "string"
        }
      ],
      "sourceNetworks": [
        {
          "id": "string",
          "type": "string",
          "version": "string",
          "name": "string"
        },
        {
          "id": "string",
          "type": "string",
          "version": "string",
          "name": "string"
        },
        {
          "id": "string",
          "type": "string",
          "version": "string",
          "name": "string"
        },
        {
          "id": "string",
          "type": "string",
          "version": "string",
          "name": "string"
        }
      ],
      "ruleAction": "WHITELIST",
      "systemDefined": false,
      "type": "dnsrule"
    },
    {
      "name": "string",
      "dnsObjects": [
        {
          "id": "string",
          "type": "string",
          "version": "string",
          "name": "string"
        },
        {
          "id": "string",
          "type": "string",
          "version": "string",
          "name": "string"
        },
        {
          "id": "string",
          "type": "string",
          "version": "string",
          "name": "string"
        },
        {
          "id": "string",
          "type": "string",
          "version": "string",
          "name": "string"
        },
        {
          "id": "string",
          "type": "string",
          "version": "string",
          "name": "string"
        },
        {
          "id": "string",
          "type": "string",
          "version": "string",
          "name": "string"
        },
        {
          "id": "string",
          "type": "string",
          "version": "string",
          "name": "string"
        },
        {
          "id": "string",
          "type": "string",
          "version": "string",
          "name": "string"
        },
        {
          "id": "string",
          "type": "string",
          "version": "string",
          "name": "string"
        }
      ],
      "sourceZones": [
        {
          "id": "string",
          "type": "string",
          "version": "string",
          "name": "string"
        },
        {
          "id": "string",
          "type": "string",
          "version": "string",
          "name": "string"
        },
        {
          "id": "string",
          "type": "string",
          "version": "string",
          "name": "string"
        }
      ],
      "sourceNetworks": [
        {
          "id": "string",
          "type": "string",
          "version": "string",
          "name": "string"
        }
      ],
      "ruleAction": "DOMAIN_NOT_FOUND",
      "systemDefined": false,
      "type": "dnsrule"
    },
    {
      "name": "string",
      "dnsObjects": [
        {
          "id": "string",
          "type": "string",
          "version": "string",
          "name": "string"
        },
        {
          "id": "string",
          "type": "string",
          "version": "string",
          "name": "string"
        },
        {
          "id": "string",
          "type": "string",
          "version": "string",
          "name": "string"
        },
        {
          "id": "string",
          "type": "string",
          "version": "string",
          "name": "string"
        },
        {
          "id": "string",
          "type": "string",
          "version": "string",
          "name": "string"
        },
        {
          "id": "string",
          "type": "string",
          "version": "string",
          "name": "string"
        },
        {
          "id": "string",
          "type": "string",
          "version": "string",
          "name": "string"
        }
      ],
      "sourceZones": [
        {
          "id": "string",
          "type": "string",
          "version": "string",
          "name": "string"
        }
      ],
      "sourceNetworks": [
        {
          "id": "string",
          "type": "string",
          "version": "string",
          "name": "string"
        },
        {
          "id": "string",
          "type": "string",
          "version": "string",
          "name": "string"
        },
        {
          "id": "string",
          "type": "string",
          "version": "string",
          "name": "string"
        }
      ],
      "ruleAction": "WHITELIST",
      "systemDefined": true,
      "type": "dnsrule"
    },
    {
      "name": "string",
      "dnsObjects": [
        {
          "id": "string",
          "type": "string",
          "version": "string",
          "name": "string"
        },
        {
          "id": "string",
          "type": "string",
          "version": "string",
          "name": "string"
        },
        {
          "id": "string",
          "type": "string",
          "version": "string",
          "name": "string"
        },
        {
          "id": "string",
          "type": "string",
          "version": "string",
          "name": "string"
        },
        {
          "id": "string",
          "type": "string",
          "version": "string",
          "name": "string"
        },
        {
          "id": "string",
          "type": "string",
          "version": "string",
          "name": "string"
        },
        {
          "id": "string",
          "type": "string",
          "version": "string",
          "name": "string"
        },
        {
          "id": "string",
          "type": "string",
          "version": "string",
          "name": "string"
        }
      ],
      "sourceZones": [
        {
          "id": "string",
          "type": "string",
          "version": "string",
          "name": "string"
        },
        {
          "id": "string",
          "type": "string",
          "version": "string",
          "name": "string"
        },
        {
          "id": "string",
          "type": "string",
          "version": "string",
          "name": "string"
        },
        {
          "id": "string",
          "type": "string",
          "version": "string",
          "name": "string"
        }
      ],
      "sourceNetworks": [
        {
          "id": "string",
          "type": "string",
          "version": "string",
          "name": "string"
        },
        {
          "id": "string",
          "type": "string",
          "version": "string",
          "name": "string"
        },
        {
          "id": "string",
          "type": "string",
          "version": "string",
          "name": "string"
        },
        {
          "id": "string",
          "type": "string",
          "version": "string",
          "name": "string"
        },
        {
          "id": "string",
          "type": "string",
          "version": "string",
          "name": "string"
        },
        {
          "id": "string",
          "type": "string",
          "version": "string",
          "name": "string"
        },
        {
          "id": "string",
          "type": "string",
          "version": "string",
          "name": "string"
        }
      ],
      "ruleAction": "DROP",
      "systemDefined": true,
      "type": "dnsrule"
    },
    {
      "name": "string",
      "dnsObjects": [
        {
          "id": "string",
          "type": "string",
          "version": "string",
          "name": "string"
        },
        {
          "id": "string",
          "type": "string",
          "version": "string",
          "name": "string"
        },
        {
          "id": "string",
          "type": "string",
          "version": "string",
          "name": "string"
        },
        {
          "id": "string",
          "type": "string",
          "version": "string",
          "name": "string"
        },
        {
          "id": "string",
          "type": "string",
          "version": "string",
          "name": "string"
        },
        {
          "id": "string",
          "type": "string",
          "version": "string",
          "name": "string"
        },
        {
          "id": "string",
          "type": "string",
          "version": "string",
          "name": "string"
        },
        {
          "id": "string",
          "type": "string",
          "version": "string",
          "name": "string"
        },
        {
          "id": "string",
          "type": "string",
          "version": "string",
          "name": "string"
        },
        {
          "id": "string",
          "type": "string",
          "version": "string",
          "name": "string"
        }
      ],
      "sourceZones": [
        {
          "id": "string",
          "type": "string",
          "version": "string",
          "name": "string"
        },
        {
          "id": "string",
          "type": "string",
          "version": "string",
          "name": "string"
        },
        {
          "id": "string",
          "type": "string",
          "version": "string",
          "name": "string"
        },
        {
          "id": "string",
          "type": "string",
          "version": "string",
          "name": "string"
        },
        {
          "id": "string",
          "type": "string",
          "version": "string",
          "name": "string"
        },
        {
          "id": "string",
          "type": "string",
          "version": "string",
          "name": "string"
        }
      ],
      "sourceNetworks": [
        {
          "id": "string",
          "type": "string",
          "version": "string",
          "name": "string"
        },
        {
          "id": "string",
          "type": "string",
          "version": "string",
          "name": "string"
        },
        {
          "id": "string",
          "type": "string",
          "version": "string",
          "name": "string"
        }
      ],
      "ruleAction": "DOMAIN_NOT_FOUND",
      "systemDefined": true,
      "type": "dnsrule"
    },
    {
      "name": "string",
      "dnsObjects": [
        {
          "id": "string",
          "type": "string",
          "version": "string",
          "name": "string"
        },
        {
          "id": "string",
          "type": "string",
          "version": "string",
          "name": "string"
        },
        {
          "id": "string",
          "type": "string",
          "version": "string",
          "name": "string"
        },
        {
          "id": "string",
          "type": "string",
          "version": "string",
          "name": "string"
        },
        {
          "id": "string",
          "type": "string",
          "version": "string",
          "name": "string"
        },
        {
          "id": "string",
          "type": "string",
          "version": "string",
          "name": "string"
        },
        {
          "id": "string",
          "type": "string",
          "version": "string",
          "name": "string"
        },
        {
          "id": "string",
          "type": "string",
          "version": "string",
          "name": "string"
        },
        {
          "id": "string",
          "type": "string",
          "version": "string",
          "name": "string"
        }
      ],
      "sourceZones": [
        {
          "id": "string",
          "type": "string",
          "version": "string",
          "name": "string"
        },
        {
          "id": "string",
          "type": "string",
          "version": "string",
          "name": "string"
        },
        {
          "id": "string",
          "type": "string",
          "version": "string",
          "name": "string"
        },
        {
          "id": "string",
          "type": "string",
          "version": "string",
          "name": "string"
        },
        {
          "id": "string",
          "type": "string",
          "version": "string",
          "name": "string"
        },
        {
          "id": "string",
          "type": "string",
          "version": "string",
          "name": "string"
        },
        {
          "id": "string",
          "type": "string",
          "version": "string",
          "name": "string"
        },
        {
          "id": "string",
          "type": "string",
          "version": "string",
          "name": "string"
        },
        {
          "id": "string",
          "type": "string",
          "version": "string",
          "name": "string"
        },
        {
          "id": "string",
          "type": "string",
          "version": "string",
          "name": "string"
        }
      ],
      "sourceNetworks": [
        {
          "id": "string",
          "type": "string",
          "version": "string",
          "name": "string"
        },
        {
          "id": "string",
          "type": "string",
          "version": "string",
          "name": "string"
        },
        {
          "id": "string",
          "type": "string",
          "version": "string",
          "name": "string"
        },
        {
          "id": "string",
          "type": "string",
          "version": "string",
          "name": "string"
        },
        {
          "id": "string",
          "type": "string",
          "version": "string",
          "name": "string"
        },
        {
          "id": "string",
          "type": "string",
          "version": "string",
          "name": "string"
        },
        {
          "id": "string",
          "type": "string",
          "version": "string",
          "name": "string"
        },
        {
          "id": "string",
          "type": "string",
          "version": "string",
          "name": "string"
        },
        {
          "id": "string",
          "type": "string",
          "version": "string",
          "name": "string"
        }
      ],
      "ruleAction": "DOMAIN_NOT_FOUND",
      "systemDefined": true,
      "type": "dnsrule"
    }
  ],
  "blacklistRules": [
    {
      "name": "string",
      "dnsObjects": [
        {
          "id": "string",
          "type": "string",
          "version": "string",
          "name": "string"
        },
        {
          "id": "string",
          "type": "string",
          "version": "string",
          "name": "string"
        },
        {
          "id": "string",
          "type": "string",
          "version": "string",
          "name": "string"
        },
        {
          "id": "string",
          "type": "string",
          "version": "string",
          "name": "string"
        },
        {
          "id": "string",
          "type": "string",
          "version": "string",
          "name": "string"
        },
        {
          "id": "string",
          "type": "string",
          "version": "string",
          "name": "string"
        },
        {
          "id": "string",
          "type": "string",
          "version": "string",
          "name": "string"
        },
        {
          "id": "string",
          "type": "string",
          "version": "string",
          "name": "string"
        },
        {
          "id": "string",
          "type": "string",
          "version": "string",
          "name": "string"
        },
        {
          "id": "string",
          "type": "string",
          "version": "string",
          "name": "string"
        }
      ],
      "sourceZones": [
        {
          "id": "string",
          "type": "string",
          "version": "string",
          "name": "string"
        },
        {
          "id": "string",
          "type": "string",
          "version": "string",
          "name": "string"
        }
      ],
      "sourceNetworks": [
        {
          "id": "string",
          "type": "string",
          "version": "string",
          "name": "string"
        },
        {
          "id": "string",
          "type": "string",
          "version": "string",
          "name": "string"
        },
        {
          "id": "string",
          "type": "string",
          "version": "string",
          "name": "string"
        }
      ],
      "ruleAction": "DOMAIN_NOT_FOUND",
      "systemDefined": false,
      "type": "dnsrule"
    },
    {
      "name": "string",
      "dnsObjects": [
        {
          "id": "string",
          "type": "string",
          "version": "string",
          "name": "string"
        },
        {
          "id": "string",
          "type": "string",
          "version": "string",
          "name": "string"
        },
        {
          "id": "string",
          "type": "string",
          "version": "string",
          "name": "string"
        },
        {
          "id": "string",
          "type": "string",
          "version": "string",
          "name": "string"
        }
      ],
      "sourceZones": [
        {
          "id": "string",
          "type": "string",
          "version": "string",
          "name": "string"
        },
        {
          "id": "string",
          "type": "string",
          "version": "string",
          "name": "string"
        },
        {
          "id": "string",
          "type": "string",
          "version": "string",
          "name": "string"
        },
        {
          "id": "string",
          "type": "string",
          "version": "string",
          "name": "string"
        },
        {
          "id": "string",
          "type": "string",
          "version": "string",
          "name": "string"
        },
        {
          "id": "string",
          "type": "string",
          "version": "string",
          "name": "string"
        },
        {
          "id": "string",
          "type": "string",
          "version": "string",
          "name": "string"
        }
      ],
      "sourceNetworks": [
        {
          "id": "string",
          "type": "string",
          "version": "string",
          "name": "string"
        },
        {
          "id": "string",
          "type": "string",
          "version": "string",
          "name": "string"
        }
      ],
      "ruleAction": "WHITELIST",
      "systemDefined": false,
      "type": "dnsrule"
    },
    {
      "name": "string",
      "dnsObjects": [
        {
          "id": "string",
          "type": "string",
          "version": "string",
          "name": "string"
        },
        {
          "id": "string",
          "type": "string",
          "version": "string",
          "name": "string"
        },
        {
          "id": "string",
          "type": "string",
          "version": "string",
          "name": "string"
        },
        {
          "id": "string",
          "type": "string",
          "version": "string",
          "name": "string"
        },
        {
          "id": "string",
          "type": "string",
          "version": "string",
          "name": "string"
        },
        {
          "id": "string",
          "type": "string",
          "version": "string",
          "name": "string"
        },
        {
          "id": "string",
          "type": "string",
          "version": "string",
          "name": "string"
        }
      ],
      "sourceZones": [
        {
          "id": "string",
          "type": "string",
          "version": "string",
          "name": "string"
        },
        {
          "id": "string",
          "type": "string",
          "version": "string",
          "name": "string"
        },
        {
          "id": "string",
          "type": "string",
          "version": "string",
          "name": "string"
        },
        {
          "id": "string",
          "type": "string",
          "version": "string",
          "name": "string"
        },
        {
          "id": "string",
          "type": "string",
          "version": "string",
          "name": "string"
        },
        {
          "id": "string",
          "type": "string",
          "version": "string",
          "name": "string"
        },
        {
          "id": "string",
          "type": "string",
          "version": "string",
          "name": "string"
        },
        {
          "id": "string",
          "type": "string",
          "version": "string",
          "name": "string"
        },
        {
          "id": "string",
          "type": "string",
          "version": "string",
          "name": "string"
        }
      ],
      "sourceNetworks": [
        {
          "id": "string",
          "type": "string",
          "version": "string",
          "name": "string"
        },
        {
          "id": "string",
          "type": "string",
          "version": "string",
          "name": "string"
        }
      ],
      "ruleAction": "WHITELIST",
      "systemDefined": true,
      "type": "dnsrule"
    },
    {
      "name": "string",
      "dnsObjects": [
        {
          "id": "string",
          "type": "string",
          "version": "string",
          "name": "string"
        },
        {
          "id": "string",
          "type": "string",
          "version": "string",
          "name": "string"
        },
        {
          "id": "string",
          "type": "string",
          "version": "string",
          "name": "string"
        },
        {
          "id": "string",
          "type": "string",
          "version": "string",
          "name": "string"
        },
        {
          "id": "string",
          "type": "string",
          "version": "string",
          "name": "string"
        },
        {
          "id": "string",
          "type": "string",
          "version": "string",
          "name": "string"
        },
        {
          "id": "string",
          "type": "string",
          "version": "string",
          "name": "string"
        },
        {
          "id": "string",
          "type": "string",
          "version": "string",
          "name": "string"
        },
        {
          "id": "string",
          "type": "string",
          "version": "string",
          "name": "string"
        },
        {
          "id": "string",
          "type": "string",
          "version": "string",
          "name": "string"
        }
      ],
      "sourceZones": [
        {
          "id": "string",
          "type": "string",
          "version": "string",
          "name": "string"
        },
        {
          "id": "string",
          "type": "string",
          "version": "string",
          "name": "string"
        },
        {
          "id": "string",
          "type": "string",
          "version": "string",
          "name": "string"
        },
        {
          "id": "string",
          "type": "string",
          "version": "string",
          "name": "string"
        },
        {
          "id": "string",
          "type": "string",
          "version": "string",
          "name": "string"
        },
        {
          "id": "string",
          "type": "string",
          "version": "string",
          "name": "string"
        },
        {
          "id": "string",
          "type": "string",
          "version": "string",
          "name": "string"
        },
        {
          "id": "string",
          "type": "string",
          "version": "string",
          "name": "string"
        },
        {
          "id": "string",
          "type": "string",
          "version": "string",
          "name": "string"
        }
      ],
      "sourceNetworks": [
        {
          "id": "string",
          "type": "string",
          "version": "string",
          "name": "string"
        },
        {
          "id": "string",
          "type": "string",
          "version": "string",
          "name": "string"
        },
        {
          "id": "string",
          "type": "string",
          "version": "string",
          "name": "string"
        },
        {
          "id": "string",
          "type": "string",
          "version": "string",
          "name": "string"
        },
        {
          "id": "string",
          "type": "string",
          "version": "string",
          "name": "string"
        },
        {
          "id": "string",
          "type": "string",
          "version": "string",
          "name": "string"
        },
        {
          "id": "string",
          "type": "string",
          "version": "string",
          "name": "string"
        },
        {
          "id": "string",
          "type": "string",
          "version": "string",
          "name": "string"
        }
      ],
      "ruleAction": "WHITELIST",
      "systemDefined": false,
      "type": "dnsrule"
    },
    {
      "name": "string",
      "dnsObjects": [
        {
          "id": "string",
          "type": "string",
          "version": "string",
          "name": "string"
        },
        {
          "id": "string",
          "type": "string",
          "version": "string",
          "name": "string"
        },
        {
          "id": "string",
          "type": "string",
          "version": "string",
          "name": "string"
        },
        {
          "id": "string",
          "type": "string",
          "version": "string",
          "name": "string"
        },
        {
          "id": "string",
          "type": "string",
          "version": "string",
          "name": "string"
        }
      ],
      "sourceZones": [
        {
          "id": "string",
          "type": "string",
          "version": "string",
          "name": "string"
        },
        {
          "id": "string",
          "type": "string",
          "version": "string",
          "name": "string"
        },
        {
          "id": "string",
          "type": "string",
          "version": "string",
          "name": "string"
        }
      ],
      "sourceNetworks": [
        {
          "id": "string",
          "type": "string",
          "version": "string",
          "name": "string"
        },
        {
          "id": "string",
          "type": "string",
          "version": "string",
          "name": "string"
        },
        {
          "id": "string",
          "type": "string",
          "version": "string",
          "name": "string"
        },
        {
          "id": "string",
          "type": "string",
          "version": "string",
          "name": "string"
        },
        {
          "id": "string",
          "type": "string",
          "version": "string",
          "name": "string"
        },
        {
          "id": "string",
          "type": "string",
          "version": "string",
          "name": "string"
        },
        {
          "id": "string",
          "type": "string",
          "version": "string",
          "name": "string"
        }
      ],
      "ruleAction": "DOMAIN_NOT_FOUND",
      "systemDefined": true,
      "type": "dnsrule"
    }
  ],
  "id": "string",
  "type": "securityintelligencednspolicy",
  "links": {
    "self": "string"
  }
}