{
  "actions": [
    {
      "name": "getScheduleConfigExportList",
      "protocol": "REST",
      "method": "GET",
      "entitypath": "{base_path}/{version}/action/configexport?{query}",
      "requestSchema": "schema.json",
      "responseSchema": "schema.json",
      "timeout": 0,
      "sendEmpty": false,
      "sendGetBody": false,
      "requestDatatype": "JSON",
      "responseDatatype": "JSON",
      "headers": {},
      "responseObjects": [
        {
          "type": "default",
          "key": "",
          "mockFile": "mockdatafiles/getScheduleConfigExportList-default.json"
        }
      ]
    },
    {
      "name": "addScheduleConfigExport",
      "protocol": "REST",
      "method": "POST",
      "entitypath": "{base_path}/{version}/action/configexport?{query}",
      "requestSchema": "schema.json",
      "responseSchema": "schema.json",
      "timeout": 0,
      "sendEmpty": false,
      "requestDatatype": "JSON",
      "responseDatatype": "JSON",
      "headers": {},
      "responseObjects": [
        {
          "type": "default",
          "key": "",
          "mockFile": "mockdatafiles/addScheduleConfigExport-default.json"
        }
      ]
    },
    {
      "name": "getConfigExportJobStatus",
      "protocol": "REST",
      "method": "GET",
      "entitypath": "{base_path}/{version}/jobs/configexportstatus/{pathv1}?{query}",
      "requestSchema": "schema.json",
      "responseSchema": "schema.json",
      "timeout": 0,
      "sendEmpty": false,
      "sendGetBody": false,
      "requestDatatype": "JSON",
      "responseDatatype": "JSON",
      "headers": {},
      "responseObjects": [
        {
          "type": "default",
          "key": "",
          "mockFile": "mockdatafiles/getConfigExportJobStatus-default.json"
        }
      ]
    },
    {
      "name": "deleteConfigExportJobStatus",
      "protocol": "REST",
      "method": "DELETE",
      "entitypath": "{base_path}/{version}/jobs/configexportstatus/{pathv1}?{query}",
      "requestSchema": "schema.json",
      "responseSchema": "schema.json",
      "timeout": 0,
      "sendEmpty": false,
      "requestDatatype": "JSON",
      "responseDatatype": "JSON",
      "headers": {},
      "responseObjects": [
        {
          "type": "default",
          "key": "",
          "mockFile": ""
        }
      ]
    },
    {
      "name": "getConfigExportJobStatusList",
      "protocol": "REST",
      "method": "GET",
      "entitypath": "{base_path}/{version}/jobs/configexportstatus?{query}",
      "requestSchema": "schema.json",
      "responseSchema": "schema.json",
      "timeout": 0,
      "sendEmpty": false,
      "sendGetBody": false,
      "requestDatatype": "JSON",
      "responseDatatype": "JSON",
      "headers": {},
      "responseObjects": [
        {
          "type": "default",
          "key": "",
          "mockFile": "mockdatafiles/getConfigExportJobStatusList-default.json"
        }
      ]
    },
    {
      "name": "downloadConfigFile",
      "protocol": "REST",
      "method": "GET",
      "entitypath": "{base_path}/{version}/action/downloadconfigfile/{pathv1}?{query}",
      "requestSchema": "schema.json",
      "responseSchema": "schema.json",
      "timeout": 0,
      "sendEmpty": false,
      "sendGetBody": false,
      "requestDatatype": "JSON",
      "responseDatatype": "JSON",
      "headers": {},
      "responseObjects": [
        {
          "type": "default",
          "key": "",
          "mockFile": ""
        }
      ]
    },
    {
      "name": "postuploadconfigfile",
      "protocol": "REST",
      "method": "POST",
      "entitypath": "{base_path}/{version}/action/uploadconfigfile?{query}",
      "requestSchema": "schema.json",
      "responseSchema": "schema.json",
      "timeout": 0,
      "sendEmpty": false,
      "requestDatatype": "FORM",
      "responseDatatype": "JSON",
      "headers": {},
      "responseObjects": [
        {
          "type": "default",
          "key": "",
          "mockFile": "mockdatafiles/postuploadconfigfile-default.json"
        }
      ]
    },
    {
      "name": "getConfigImportExportFileInfo",
      "protocol": "REST",
      "method": "GET",
      "entitypath": "{base_path}/{version}/action/configfiles/{pathv1}?{query}",
      "requestSchema": "schema.json",
      "responseSchema": "schema.json",
      "timeout": 0,
      "sendEmpty": false,
      "sendGetBody": false,
      "requestDatatype": "JSON",
      "responseDatatype": "JSON",
      "headers": {},
      "responseObjects": [
        {
          "type": "default",
          "key": "",
          "mockFile": "mockdatafiles/getConfigImportExportFileInfo-default.json"
        }
      ]
    },
    {
      "name": "deleteConfigImportExportFileInfo",
      "protocol": "REST",
      "method": "DELETE",
      "entitypath": "{base_path}/{version}/action/configfiles/{pathv1}?{query}",
      "requestSchema": "schema.json",
      "responseSchema": "schema.json",
      "timeout": 0,
      "sendEmpty": false,
      "requestDatatype": "JSON",
      "responseDatatype": "JSON",
      "headers": {},
      "responseObjects": [
        {
          "type": "default",
          "key": "",
          "mockFile": ""
        }
      ]
    },
    {
      "name": "getConfigImportExportFileInfoList",
      "protocol": "REST",
      "method": "GET",
      "entitypath": "{base_path}/{version}/action/configfiles?{query}",
      "requestSchema": "schema.json",
      "responseSchema": "schema.json",
      "timeout": 0,
      "sendEmpty": false,
      "sendGetBody": false,
      "requestDatatype": "JSON",
      "responseDatatype": "JSON",
      "headers": {},
      "responseObjects": [
        {
          "type": "default",
          "key": "",
          "mockFile": "mockdatafiles/getConfigImportExportFileInfoList-default.json"
        }
      ]
    },
    {
      "name": "getScheduleConfigImportList",
      "protocol": "REST",
      "method": "GET",
      "entitypath": "{base_path}/{version}/action/configimport?{query}",
      "requestSchema": "schema.json",
      "responseSchema": "schema.json",
      "timeout": 0,
      "sendEmpty": false,
      "sendGetBody": false,
      "requestDatatype": "JSON",
      "responseDatatype": "JSON",
      "headers": {},
      "responseObjects": [
        {
          "type": "default",
          "key": "",
          "mockFile": "mockdatafiles/getScheduleConfigImportList-default.json"
        }
      ]
    },
    {
      "name": "addScheduleConfigImport",
      "protocol": "REST",
      "method": "POST",
      "entitypath": "{base_path}/{version}/action/configimport?{query}",
      "requestSchema": "schema.json",
      "responseSchema": "schema.json",
      "timeout": 0,
      "sendEmpty": false,
      "requestDatatype": "JSON",
      "responseDatatype": "JSON",
      "headers": {},
      "responseObjects": [
        {
          "type": "default",
          "key": "",
          "mockFile": "mockdatafiles/addScheduleConfigImport-default.json"
        }
      ]
    },
    {
      "name": "getConfigImportJobStatus",
      "protocol": "REST",
      "method": "GET",
      "entitypath": "{base_path}/{version}/jobs/configimportstatus/{pathv1}?{query}",
      "requestSchema": "schema.json",
      "responseSchema": "schema.json",
      "timeout": 0,
      "sendEmpty": false,
      "sendGetBody": false,
      "requestDatatype": "JSON",
      "responseDatatype": "JSON",
      "headers": {},
      "responseObjects": [
        {
          "type": "default",
          "key": "",
          "mockFile": "mockdatafiles/getConfigImportJobStatus-default.json"
        }
      ]
    },
    {
      "name": "deleteConfigImportJobStatus",
      "protocol": "REST",
      "method": "DELETE",
      "entitypath": "{base_path}/{version}/jobs/configimportstatus/{pathv1}?{query}",
      "requestSchema": "schema.json",
      "responseSchema": "schema.json",
      "timeout": 0,
      "sendEmpty": false,
      "requestDatatype": "JSON",
      "responseDatatype": "JSON",
      "headers": {},
      "responseObjects": [
        {
          "type": "default",
          "key": "",
          "mockFile": ""
        }
      ]
    },
    {
      "name": "getConfigImportJobStatusList",
      "protocol": "REST",
      "method": "GET",
      "entitypath": "{base_path}/{version}/jobs/configimportstatus?{query}",
      "requestSchema": "schema.json",
      "responseSchema": "schema.json",
      "timeout": 0,
      "sendEmpty": false,
      "sendGetBody": false,
      "requestDatatype": "JSON",
      "responseDatatype": "JSON",
      "headers": {},
      "responseObjects": [
        {
          "type": "default",
          "key": "",
          "mockFile": "mockdatafiles/getConfigImportJobStatusList-default.json"
        }
      ]
    }
  ]
}