{
  "version": "string",
  "name": "string",
  "dnsServers": [
    {
      "ipAddress": "string",
      "type": "dnsserver"
    },
    {
      "ipAddress": "string",
      "type": "dnsserver"
    },
    {
      "ipAddress": "string",
      "type": "dnsserver"
    },
    {
      "ipAddress": "string",
      "type": "dnsserver"
    },
    {
      "ipAddress": "string",
      "type": "dnsserver"
    },
    {
      "ipAddress": "string",
      "type": "dnsserver"
    },
    {
      "ipAddress": "string",
      "type": "dnsserver"
    },
    {
      "ipAddress": "string",
      "type": "dnsserver"
    }
  ],
  "timeout": 4,
  "retries": 6,
  "searchDomain": "string",
  "systemDefined": true,
  "id": "string",
  "type": "dnsservergroup",
  "links": {
    "self": "string"
  }
}