{
  "version": "string",
  "name": "string",
  "description": "string",
  "timeZoneId": "string",
  "timeZone": "string",
  "dstDateRange": {
    "startDateTime": "string",
    "endDateTime": "string",
    "offset": 1,
    "type": "daylightsavingdaterange"
  },
  "dstDayRecurrence": {
    "startMonth": "FEB",
    "startWeek": "FOURTH",
    "startDayOfWeek": "MON",
    "startTime": "string",
    "endMonth": "JUN",
    "endWeek": "FOURTH",
    "endDayOfWeek": "WED",
    "endTime": "string",
    "offset": 6,
    "type": "daylightsavingdayrecurrence"
  },
  "id": "string",
  "type": "timezoneobject",
  "links": {
    "self": "string"
  }
}