{
  "version": "string",
  "name": "string",
  "ruleConfigs": [
    {
      "id": "string",
      "type": "string",
      "version": "string",
      "name": "string"
    },
    {
      "id": "string",
      "type": "string",
      "version": "string",
      "name": "string"
    },
    {
      "id": "string",
      "type": "string",
      "version": "string",
      "name": "string"
    }
  ],
  "id": "string",
  "type": "intrusionpolicyruleupdate",
  "links": {
    "self": "string"
  }
}