{
  "version": "string",
  "telemetryEnabled": true,
  "defenseOrchestratorEnabled": false,
  "eventToCloudEnabled": false,
  "id": "string",
  "type": "cloudcommunicationsettings",
  "links": {
    "self": "string"
  }
}