{
  "items": [
    {
      "role": "string",
      "rolePermissionSet": [
        {
          "resourceName": "string",
          "resourceUrls": [
            "string",
            "string",
            "string",
            "string",
            "string",
            "string",
            "string"
          ],
          "resourceType": "string",
          "permissionType": "READ"
        },
        {
          "resourceName": "string",
          "resourceUrls": [
            "string",
            "string"
          ],
          "resourceType": "string",
          "permissionType": "WRITE"
        },
        {
          "resourceName": "string",
          "resourceUrls": [
            "string"
          ],
          "resourceType": "string",
          "permissionType": "READ"
        },
        {
          "resourceName": "string",
          "resourceUrls": [
            "string",
            "string",
            "string",
            "string"
          ],
          "resourceType": "string",
          "permissionType": "NONE"
        },
        {
          "resourceName": "string",
          "resourceUrls": [
            "string",
            "string"
          ],
          "resourceType": "string",
          "permissionType": "WRITE"
        }
      ],
      "id": "string",
      "type": "RolePermission",
      "links": {
        "self": "string"
      }
    },
    {
      "role": "string",
      "rolePermissionSet": [
        {
          "resourceName": "string",
          "resourceUrls": [
            "string",
            "string",
            "string",
            "string",
            "string",
            "string",
            "string",
            "string"
          ],
          "resourceType": "string",
          "permissionType": "NONE"
        },
        {
          "resourceName": "string",
          "resourceUrls": [
            "string",
            "string",
            "string",
            "string",
            "string"
          ],
          "resourceType": "string",
          "permissionType": "READ"
        },
        {
          "resourceName": "string",
          "resourceUrls": [
            "string",
            "string",
            "string",
            "string",
            "string",
            "string",
            "string",
            "string"
          ],
          "resourceType": "string",
          "permissionType": "WRITE"
        },
        {
          "resourceName": "string",
          "resourceUrls": [
            "string",
            "string",
            "string",
            "string",
            "string",
            "string",
            "string",
            "string",
            "string"
          ],
          "resourceType": "string",
          "permissionType": "WRITE"
        },
        {
          "resourceName": "string",
          "resourceUrls": [
            "string",
            "string",
            "string",
            "string"
          ],
          "resourceType": "string",
          "permissionType": "NONE"
        },
        {
          "resourceName": "string",
          "resourceUrls": [
            "string"
          ],
          "resourceType": "string",
          "permissionType": "WRITE"
        },
        {
          "resourceName": "string",
          "resourceUrls": [
            "string",
            "string",
            "string",
            "string",
            "string",
            "string",
            "string",
            "string",
            "string",
            "string"
          ],
          "resourceType": "string",
          "permissionType": "WRITE"
        }
      ],
      "id": "string",
      "type": "RolePermission",
      "links": {
        "self": "string"
      }
    }
  ],
  "paging": {
    "prev": [
      "string",
      "string",
      "string",
      "string",
      "string",
      "string",
      "string",
      "string",
      "string"
    ],
    "next": [
      "string",
      "string",
      "string"
    ],
    "limit": 7,
    "offset": 1,
    "count": 10,
    "pages": 3
  }
}