{
  "actions": [
    {
      "name": "getWebAnalyticsSettingList",
      "protocol": "REST",
      "method": "GET",
      "entitypath": "{base_path}/{version}/devicesettings/default/webanalyticssettings?{query}",
      "requestSchema": "schema.json",
      "responseSchema": "schema.json",
      "timeout": 0,
      "sendEmpty": false,
      "sendGetBody": false,
      "requestDatatype": "JSON",
      "responseDatatype": "JSON",
      "headers": {},
      "responseObjects": [
        {
          "type": "default",
          "key": "",
          "mockFile": "mockdatafiles/getWebAnalyticsSettingList-default.json"
        }
      ]
    },
    {
      "name": "getWebAnalyticsSetting",
      "protocol": "REST",
      "method": "GET",
      "entitypath": "{base_path}/{version}/devicesettings/default/webanalyticssettings/{pathv1}?{query}",
      "requestSchema": "schema.json",
      "responseSchema": "schema.json",
      "timeout": 0,
      "sendEmpty": false,
      "sendGetBody": false,
      "requestDatatype": "JSON",
      "responseDatatype": "JSON",
      "headers": {},
      "responseObjects": [
        {
          "type": "default",
          "key": "",
          "mockFile": "mockdatafiles/getWebAnalyticsSetting-default.json"
        }
      ]
    },
    {
      "name": "editWebAnalyticsSetting",
      "protocol": "REST",
      "method": "PUT",
      "entitypath": "{base_path}/{version}/devicesettings/default/webanalyticssettings/{pathv1}?{query}",
      "requestSchema": "schema.json",
      "responseSchema": "schema.json",
      "timeout": 0,
      "sendEmpty": false,
      "requestDatatype": "JSON",
      "responseDatatype": "JSON",
      "headers": {},
      "responseObjects": [
        {
          "type": "default",
          "key": "",
          "mockFile": "mockdatafiles/editWebAnalyticsSetting-default.json"
        }
      ]
    }
  ]
}