{
  "version": "string",
  "name": "string",
  "description": "string",
  "monitoredAddress": {
    "id": "string",
    "type": "string",
    "version": "string",
    "name": "string"
  },
  "targetInterface": {
    "id": "string",
    "type": "string",
    "version": "string",
    "name": "string"
  },
  "slaOperation": {
    "id": "string",
    "type": "string",
    "version": "string",
    "name": "string"
  },
  "id": "string",
  "type": "slamonitor",
  "links": {
    "self": "string"
  }
}