{
  "items": [
    {
      "name": "string",
      "identitySource": {
        "version": "string",
        "name": "string",
        "id": "string",
        "type": "identitysourcebase"
      },
      "id": "string",
      "type": "TrafficUserGroup",
      "links": {
        "self": "string"
      }
    },
    {
      "name": "string",
      "identitySource": {
        "version": "string",
        "name": "string",
        "id": "string",
        "type": "identitysourcebase"
      },
      "id": "string",
      "type": "TrafficUserGroup",
      "links": {
        "self": "string"
      }
    },
    {
      "name": "string",
      "identitySource": {
        "version": "string",
        "name": "string",
        "id": "string",
        "type": "identitysourcebase"
      },
      "id": "string",
      "type": "TrafficUserGroup",
      "links": {
        "self": "string"
      }
    }
  ],
  "paging": {
    "prev": [
      "string",
      "string",
      "string",
      "string",
      "string",
      "string",
      "string",
      "string",
      "string"
    ],
    "next": [
      "string",
      "string",
      "string"
    ],
    "limit": 3,
    "offset": 7,
    "count": 10,
    "pages": 10
  }
}