{
  "items": [
    {
      "version": "string",
      "name": "string",
      "encryptionMethod": "ESP_DES",
      "authenticationMethod": "ESP_NONE",
      "mode": "TRANSPORT",
      "cryptoRestricted": true,
      "defaultAssignable": false,
      "summaryLabel": "string",
      "id": "string",
      "isSystemDefined": false,
      "type": "ikevoneproposal",
      "links": {
        "self": "string"
      }
    },
    {
      "version": "string",
      "name": "string",
      "encryptionMethod": "ESP_AES192",
      "authenticationMethod": "ESP_SHA_HMAC",
      "mode": "TUNNEL",
      "cryptoRestricted": true,
      "defaultAssignable": false,
      "summaryLabel": "string",
      "id": "string",
      "isSystemDefined": false,
      "type": "ikevoneproposal",
      "links": {
        "self": "string"
      }
    },
    {
      "version": "string",
      "name": "string",
      "encryptionMethod": "ESP_AES192",
      "authenticationMethod": "ESP_NONE",
      "mode": "TRANSPORT",
      "cryptoRestricted": false,
      "defaultAssignable": true,
      "summaryLabel": "string",
      "id": "string",
      "isSystemDefined": true,
      "type": "ikevoneproposal",
      "links": {
        "self": "string"
      }
    },
    {
      "version": "string",
      "name": "string",
      "encryptionMethod": "ESP_DES",
      "authenticationMethod": "ESP_NONE",
      "mode": "TRANSPORT",
      "cryptoRestricted": true,
      "defaultAssignable": true,
      "summaryLabel": "string",
      "id": "string",
      "isSystemDefined": true,
      "type": "ikevoneproposal",
      "links": {
        "self": "string"
      }
    },
    {
      "version": "string",
      "name": "string",
      "encryptionMethod": "ESP_3DES",
      "authenticationMethod": "ESP_MD5_HMAC",
      "mode": "TUNNEL",
      "cryptoRestricted": false,
      "defaultAssignable": false,
      "summaryLabel": "string",
      "id": "string",
      "isSystemDefined": true,
      "type": "ikevoneproposal",
      "links": {
        "self": "string"
      }
    },
    {
      "version": "string",
      "name": "string",
      "encryptionMethod": "ESP_DES",
      "authenticationMethod": "ESP_SHA_HMAC",
      "mode": "TUNNEL",
      "cryptoRestricted": true,
      "defaultAssignable": true,
      "summaryLabel": "string",
      "id": "string",
      "isSystemDefined": false,
      "type": "ikevoneproposal",
      "links": {
        "self": "string"
      }
    },
    {
      "version": "string",
      "name": "string",
      "encryptionMethod": "ESP_3DES",
      "authenticationMethod": "ESP_NONE",
      "mode": "TUNNEL",
      "cryptoRestricted": false,
      "defaultAssignable": false,
      "summaryLabel": "string",
      "id": "string",
      "isSystemDefined": true,
      "type": "ikevoneproposal",
      "links": {
        "self": "string"
      }
    },
    {
      "version": "string",
      "name": "string",
      "encryptionMethod": "ESP_3DES",
      "authenticationMethod": "ESP_NONE",
      "mode": "TUNNEL",
      "cryptoRestricted": false,
      "defaultAssignable": false,
      "summaryLabel": "string",
      "id": "string",
      "isSystemDefined": false,
      "type": "ikevoneproposal",
      "links": {
        "self": "string"
      }
    }
  ],
  "paging": {
    "prev": [
      "string",
      "string",
      "string",
      "string",
      "string",
      "string",
      "string"
    ],
    "next": [
      "string",
      "string",
      "string",
      "string"
    ],
    "limit": 6,
    "offset": 7,
    "count": 1,
    "pages": 5
  }
}