{
  "items": [
    {
      "version": "string",
      "name": "string",
      "defaultAction": {
        "action": "PERMIT",
        "eventLogAction": "LOG_FLOW_END",
        "intrusionPolicy": {
          "id": "string",
          "type": "string",
          "version": "string",
          "name": "string"
        },
        "syslogServer": {
          "id": "string",
          "type": "string",
          "version": "string",
          "name": "string"
        },
        "hitCount": {
          "hitCount": 9,
          "rule": {
            "type": "accessruleinfo",
            "name": "string",
            "ruleId": 3,
            "id": "string"
          },
          "firstHitTimeStamp": "string",
          "lastHitTimeStamp": "string",
          "lastFetchTimeStamp": "string",
          "type": "HitCount"
        },
        "type": "accessdefaultaction"
      },
      "sslPolicy": {
        "id": "string",
        "type": "string",
        "version": "string",
        "name": "string"
      },
      "id": "string",
      "identityPolicySetting": {
        "id": "string",
        "type": "string",
        "version": "string",
        "name": "string"
      },
      "securityIntelligence": {
        "id": "string",
        "type": "string",
        "version": "string",
        "name": "string"
      },
      "type": "accesspolicy",
      "links": {
        "self": "string"
      }
    },
    {
      "version": "string",
      "name": "string",
      "defaultAction": {
        "action": "PERMIT",
        "eventLogAction": "LOG_FLOW_START",
        "intrusionPolicy": {
          "id": "string",
          "type": "string",
          "version": "string",
          "name": "string"
        },
        "syslogServer": {
          "id": "string",
          "type": "string",
          "version": "string",
          "name": "string"
        },
        "hitCount": {
          "hitCount": 6,
          "rule": {
            "type": "accessruleinfo",
            "name": "string",
            "ruleId": 8,
            "id": "string"
          },
          "firstHitTimeStamp": "string",
          "lastHitTimeStamp": "string",
          "lastFetchTimeStamp": "string",
          "type": "HitCount"
        },
        "type": "accessdefaultaction"
      },
      "sslPolicy": {
        "id": "string",
        "type": "string",
        "version": "string",
        "name": "string"
      },
      "id": "string",
      "identityPolicySetting": {
        "id": "string",
        "type": "string",
        "version": "string",
        "name": "string"
      },
      "securityIntelligence": {
        "id": "string",
        "type": "string",
        "version": "string",
        "name": "string"
      },
      "type": "accesspolicy",
      "links": {
        "self": "string"
      }
    },
    {
      "version": "string",
      "name": "string",
      "defaultAction": {
        "action": "DENY",
        "eventLogAction": "LOG_NONE",
        "intrusionPolicy": {
          "id": "string",
          "type": "string",
          "version": "string",
          "name": "string"
        },
        "syslogServer": {
          "id": "string",
          "type": "string",
          "version": "string",
          "name": "string"
        },
        "hitCount": {
          "hitCount": 4,
          "rule": {
            "type": "accessruleinfo",
            "name": "string",
            "ruleId": 10,
            "id": "string"
          },
          "firstHitTimeStamp": "string",
          "lastHitTimeStamp": "string",
          "lastFetchTimeStamp": "string",
          "type": "HitCount"
        },
        "type": "accessdefaultaction"
      },
      "sslPolicy": {
        "id": "string",
        "type": "string",
        "version": "string",
        "name": "string"
      },
      "id": "string",
      "identityPolicySetting": {
        "id": "string",
        "type": "string",
        "version": "string",
        "name": "string"
      },
      "securityIntelligence": {
        "id": "string",
        "type": "string",
        "version": "string",
        "name": "string"
      },
      "type": "accesspolicy",
      "links": {
        "self": "string"
      }
    }
  ],
  "paging": {
    "prev": [
      "string",
      "string",
      "string",
      "string",
      "string",
      "string"
    ],
    "next": [
      "string",
      "string",
      "string",
      "string",
      "string",
      "string",
      "string",
      "string",
      "string",
      "string"
    ],
    "limit": 4,
    "offset": 5,
    "count": 2,
    "pages": 2
  }
}