{
  "version": "string",
  "name": "string",
  "activeAuthPort": 4,
  "defaultIdentityRule": {
    "authAction": "NO_AUTH",
    "type": "defaultidentityrule"
  },
  "id": "string",
  "activeAuthCertificate": {
    "id": "string",
    "type": "string",
    "version": "string",
    "name": "string"
  },
  "type": "identitypolicy",
  "links": {
    "self": "string"
  }
}