{
  "actions": [
    {
      "name": "getApplicationList",
      "protocol": "REST",
      "method": "GET",
      "entitypath": "{base_path}/{version}/object/applications?{query}",
      "requestSchema": "schema.json",
      "responseSchema": "schema.json",
      "timeout": 0,
      "sendEmpty": false,
      "sendGetBody": false,
      "requestDatatype": "JSON",
      "responseDatatype": "JSON",
      "headers": {},
      "responseObjects": [
        {
          "type": "default",
          "key": "",
          "mockFile": "mockdatafiles/getApplicationList-default.json"
        }
      ]
    },
    {
      "name": "getApplicationTagList",
      "protocol": "REST",
      "method": "GET",
      "entitypath": "{base_path}/{version}/object/applicationtags?{query}",
      "requestSchema": "schema.json",
      "responseSchema": "schema.json",
      "timeout": 0,
      "sendEmpty": false,
      "sendGetBody": false,
      "requestDatatype": "JSON",
      "responseDatatype": "JSON",
      "headers": {},
      "responseObjects": [
        {
          "type": "default",
          "key": "",
          "mockFile": "mockdatafiles/getApplicationTagList-default.json"
        }
      ]
    },
    {
      "name": "getApplicationCategoryList",
      "protocol": "REST",
      "method": "GET",
      "entitypath": "{base_path}/{version}/object/applicationcategories?{query}",
      "requestSchema": "schema.json",
      "responseSchema": "schema.json",
      "timeout": 0,
      "sendEmpty": false,
      "sendGetBody": false,
      "requestDatatype": "JSON",
      "responseDatatype": "JSON",
      "headers": {},
      "responseObjects": [
        {
          "type": "default",
          "key": "",
          "mockFile": "mockdatafiles/getApplicationCategoryList-default.json"
        }
      ]
    },
    {
      "name": "getApplicationFilterList",
      "protocol": "REST",
      "method": "GET",
      "entitypath": "{base_path}/{version}/object/applicationfilters?{query}",
      "requestSchema": "schema.json",
      "responseSchema": "schema.json",
      "timeout": 0,
      "sendEmpty": false,
      "sendGetBody": false,
      "requestDatatype": "JSON",
      "responseDatatype": "JSON",
      "headers": {},
      "responseObjects": [
        {
          "type": "default",
          "key": "",
          "mockFile": "mockdatafiles/getApplicationFilterList-default.json"
        }
      ]
    },
    {
      "name": "addApplicationFilter",
      "protocol": "REST",
      "method": "POST",
      "entitypath": "{base_path}/{version}/object/applicationfilters?{query}",
      "requestSchema": "schema.json",
      "responseSchema": "schema.json",
      "timeout": 0,
      "sendEmpty": false,
      "requestDatatype": "JSON",
      "responseDatatype": "JSON",
      "headers": {},
      "responseObjects": [
        {
          "type": "default",
          "key": "",
          "mockFile": "mockdatafiles/addApplicationFilter-default.json"
        }
      ]
    },
    {
      "name": "getApplicationFilter",
      "protocol": "REST",
      "method": "GET",
      "entitypath": "{base_path}/{version}/object/applicationfilters/{pathv1}?{query}",
      "requestSchema": "schema.json",
      "responseSchema": "schema.json",
      "timeout": 0,
      "sendEmpty": false,
      "sendGetBody": false,
      "requestDatatype": "JSON",
      "responseDatatype": "JSON",
      "headers": {},
      "responseObjects": [
        {
          "type": "default",
          "key": "",
          "mockFile": "mockdatafiles/getApplicationFilter-default.json"
        }
      ]
    },
    {
      "name": "editApplicationFilter",
      "protocol": "REST",
      "method": "PUT",
      "entitypath": "{base_path}/{version}/object/applicationfilters/{pathv1}?{query}",
      "requestSchema": "schema.json",
      "responseSchema": "schema.json",
      "timeout": 0,
      "sendEmpty": false,
      "requestDatatype": "JSON",
      "responseDatatype": "JSON",
      "headers": {},
      "responseObjects": [
        {
          "type": "default",
          "key": "",
          "mockFile": "mockdatafiles/editApplicationFilter-default.json"
        }
      ]
    },
    {
      "name": "deleteApplicationFilter",
      "protocol": "REST",
      "method": "DELETE",
      "entitypath": "{base_path}/{version}/object/applicationfilters/{pathv1}?{query}",
      "requestSchema": "schema.json",
      "responseSchema": "schema.json",
      "timeout": 0,
      "sendEmpty": false,
      "requestDatatype": "JSON",
      "responseDatatype": "JSON",
      "headers": {},
      "responseObjects": [
        {
          "type": "default",
          "key": "",
          "mockFile": ""
        }
      ]
    }
  ]
}