{
  "version": "string",
  "jobName": "string",
  "jobDescription": "string",
  "user": "string",
  "startDateTime": "string",
  "endDateTime": "string",
  "status": "SUCCESS",
  "statusMessage": "string",
  "scheduleUuid": "string",
  "id": "string",
  "type": "jobhistorycloudmanagement",
  "links": {
    "self": "string"
  }
}