{
  "items": [
    {
      "version": "string",
      "scheduleType": "WEEKLY",
      "user": "string",
      "forceOperation": true,
      "jobHistoryUuid": "string",
      "runTimes": "string",
      "name": "string",
      "description": "string",
      "jobName": "string",
      "id": "string",
      "type": "geolocationupdateschedule",
      "links": {
        "self": "string"
      }
    },
    {
      "version": "string",
      "scheduleType": "IMMEDIATE",
      "user": "string",
      "forceOperation": false,
      "jobHistoryUuid": "string",
      "runTimes": "string",
      "name": "string",
      "description": "string",
      "jobName": "string",
      "id": "string",
      "type": "geolocationupdateschedule",
      "links": {
        "self": "string"
      }
    },
    {
      "version": "string",
      "scheduleType": "DAILY",
      "user": "string",
      "forceOperation": false,
      "jobHistoryUuid": "string",
      "runTimes": "string",
      "name": "string",
      "description": "string",
      "jobName": "string",
      "id": "string",
      "type": "geolocationupdateschedule",
      "links": {
        "self": "string"
      }
    },
    {
      "version": "string",
      "scheduleType": "IMMEDIATE",
      "user": "string",
      "forceOperation": true,
      "jobHistoryUuid": "string",
      "runTimes": "string",
      "name": "string",
      "description": "string",
      "jobName": "string",
      "id": "string",
      "type": "geolocationupdateschedule",
      "links": {
        "self": "string"
      }
    },
    {
      "version": "string",
      "scheduleType": "WEEKLY",
      "user": "string",
      "forceOperation": true,
      "jobHistoryUuid": "string",
      "runTimes": "string",
      "name": "string",
      "description": "string",
      "jobName": "string",
      "id": "string",
      "type": "geolocationupdateschedule",
      "links": {
        "self": "string"
      }
    },
    {
      "version": "string",
      "scheduleType": "SINGLE",
      "user": "string",
      "forceOperation": true,
      "jobHistoryUuid": "string",
      "runTimes": "string",
      "name": "string",
      "description": "string",
      "jobName": "string",
      "id": "string",
      "type": "geolocationupdateschedule",
      "links": {
        "self": "string"
      }
    },
    {
      "version": "string",
      "scheduleType": "IMMEDIATE",
      "user": "string",
      "forceOperation": true,
      "jobHistoryUuid": "string",
      "runTimes": "string",
      "name": "string",
      "description": "string",
      "jobName": "string",
      "id": "string",
      "type": "geolocationupdateschedule",
      "links": {
        "self": "string"
      }
    },
    {
      "version": "string",
      "scheduleType": "HOURLY",
      "user": "string",
      "forceOperation": true,
      "jobHistoryUuid": "string",
      "runTimes": "string",
      "name": "string",
      "description": "string",
      "jobName": "string",
      "id": "string",
      "type": "geolocationupdateschedule",
      "links": {
        "self": "string"
      }
    },
    {
      "version": "string",
      "scheduleType": "NONE",
      "user": "string",
      "forceOperation": false,
      "jobHistoryUuid": "string",
      "runTimes": "string",
      "name": "string",
      "description": "string",
      "jobName": "string",
      "id": "string",
      "type": "geolocationupdateschedule",
      "links": {
        "self": "string"
      }
    }
  ],
  "paging": {
    "prev": [
      "string",
      "string",
      "string"
    ],
    "next": [
      "string",
      "string",
      "string",
      "string"
    ],
    "limit": 1,
    "offset": 2,
    "count": 1,
    "pages": 8
  }
}