{
  "version": "string",
  "name": "string",
  "securityIntelligenceNetworkPolicy": {
    "id": "string",
    "type": "string",
    "version": "string",
    "name": "string"
  },
  "securityIntelligenceURLPolicy": {
    "id": "string",
    "type": "string",
    "version": "string",
    "name": "string"
  },
  "securityIntelligenceDNSPolicy": {
    "id": "string",
    "type": "string",
    "version": "string",
    "name": "string"
  },
  "logEnabled": true,
  "syslogServer": {
    "id": "string",
    "type": "string",
    "version": "string",
    "name": "string"
  },
  "id": "string",
  "type": "securityintelligencepolicy",
  "links": {
    "self": "string"
  }
}