{
  "items": [
    {
      "version": "string",
      "name": "string",
      "afterAuto": false,
      "id": "string",
      "type": "manualnatrulecontainer",
      "links": {
        "self": "string"
      }
    },
    {
      "version": "string",
      "name": "string",
      "afterAuto": false,
      "id": "string",
      "type": "manualnatrulecontainer",
      "links": {
        "self": "string"
      }
    }
  ],
  "paging": {
    "prev": [
      "string"
    ],
    "next": [
      "string",
      "string",
      "string",
      "string",
      "string",
      "string",
      "string",
      "string",
      "string",
      "string"
    ],
    "limit": 5,
    "offset": 2,
    "count": 2,
    "pages": 2
  }
}