{
  "items": [
    {
      "version": "string",
      "jobName": "string",
      "jobDescription": "string",
      "user": "string",
      "startDateTime": "string",
      "endDateTime": "string",
      "status": "FAILED",
      "statusMessage": "string",
      "scheduleUuid": "string",
      "fileName": "string",
      "id": "string",
      "type": "pullfilejob",
      "links": {
        "self": "string"
      }
    },
    {
      "version": "string",
      "jobName": "string",
      "jobDescription": "string",
      "user": "string",
      "startDateTime": "string",
      "endDateTime": "string",
      "status": "FAILED",
      "statusMessage": "string",
      "scheduleUuid": "string",
      "fileName": "string",
      "id": "string",
      "type": "pullfilejob",
      "links": {
        "self": "string"
      }
    },
    {
      "version": "string",
      "jobName": "string",
      "jobDescription": "string",
      "user": "string",
      "startDateTime": "string",
      "endDateTime": "string",
      "status": "SUCCESS",
      "statusMessage": "string",
      "scheduleUuid": "string",
      "fileName": "string",
      "id": "string",
      "type": "pullfilejob",
      "links": {
        "self": "string"
      }
    },
    {
      "version": "string",
      "jobName": "string",
      "jobDescription": "string",
      "user": "string",
      "startDateTime": "string",
      "endDateTime": "string",
      "status": "IN_PROGRESS",
      "statusMessage": "string",
      "scheduleUuid": "string",
      "fileName": "string",
      "id": "string",
      "type": "pullfilejob",
      "links": {
        "self": "string"
      }
    }
  ],
  "paging": {
    "prev": [
      "string",
      "string",
      "string",
      "string",
      "string"
    ],
    "next": [
      "string"
    ],
    "limit": 8,
    "offset": 10,
    "count": 6,
    "pages": 2
  }
}