{
  "items": [
    {
      "version": "string",
      "name": "string",
      "messagesCriteria": [
        {
          "messageStartId": 10,
          "messageEndId": 1,
          "type": "customlogginglistmessage"
        },
        {
          "messageStartId": 7,
          "messageEndId": 4,
          "type": "customlogginglistmessage"
        },
        {
          "messageStartId": 4,
          "messageEndId": 9,
          "type": "customlogginglistmessage"
        },
        {
          "messageStartId": 8,
          "messageEndId": 6,
          "type": "customlogginglistmessage"
        },
        {
          "messageStartId": 7,
          "messageEndId": 10,
          "type": "customlogginglistmessage"
        },
        {
          "messageStartId": 8,
          "messageEndId": 8,
          "type": "customlogginglistmessage"
        },
        {
          "messageStartId": 10,
          "messageEndId": 5,
          "type": "customlogginglistmessage"
        },
        {
          "messageStartId": 2,
          "messageEndId": 6,
          "type": "customlogginglistmessage"
        },
        {
          "messageStartId": 10,
          "messageEndId": 4,
          "type": "customlogginglistmessage"
        }
      ],
      "logClassCriteria": [
        {
          "severityLogLevel": "EMERGENCY",
          "className": "PPTP_AND_L2TP_SESSION",
          "type": "customlogginglistloglevel"
        },
        {
          "severityLogLevel": "NOTIFICATION",
          "className": "CITRIX_CLIENT",
          "type": "customlogginglistloglevel"
        },
        {
          "severityLogLevel": "ERROR",
          "className": "OSPF_ROUTING",
          "type": "customlogginglistloglevel"
        },
        {
          "severityLogLevel": "CRITICAL",
          "className": "FAILOVER",
          "type": "customlogginglistloglevel"
        },
        {
          "severityLogLevel": "CRITICAL",
          "className": "SYSTEM",
          "type": "customlogginglistloglevel"
        }
      ],
      "description": "string",
      "id": "string",
      "type": "customlogginglist",
      "links": {
        "self": "string"
      }
    },
    {
      "version": "string",
      "name": "string",
      "messagesCriteria": [
        {
          "messageStartId": 2,
          "messageEndId": 8,
          "type": "customlogginglistmessage"
        },
        {
          "messageStartId": 3,
          "messageEndId": 1,
          "type": "customlogginglistmessage"
        },
        {
          "messageStartId": 5,
          "messageEndId": 3,
          "type": "customlogginglistmessage"
        },
        {
          "messageStartId": 10,
          "messageEndId": 6,
          "type": "customlogginglistmessage"
        },
        {
          "messageStartId": 3,
          "messageEndId": 7,
          "type": "customlogginglistmessage"
        }
      ],
      "logClassCriteria": [
        {
          "severityLogLevel": "CRITICAL",
          "className": "VLAN_MAPPING",
          "type": "customlogginglistloglevel"
        },
        {
          "severityLogLevel": "INFORMATIONAL",
          "className": "RESOURCE_MANAGER",
          "type": "customlogginglistloglevel"
        },
        {
          "severityLogLevel": "ERROR",
          "className": "IP_ADDRESS_ASSIGNMENT",
          "type": "customlogginglistloglevel"
        }
      ],
      "description": "string",
      "id": "string",
      "type": "customlogginglist",
      "links": {
        "self": "string"
      }
    },
    {
      "version": "string",
      "name": "string",
      "messagesCriteria": [
        {
          "messageStartId": 2,
          "messageEndId": 3,
          "type": "customlogginglistmessage"
        }
      ],
      "logClassCriteria": [
        {
          "severityLogLevel": "WARNING",
          "className": "SERVICE_TAG_SWITCHING",
          "type": "customlogginglistloglevel"
        },
        {
          "severityLogLevel": "EMERGENCY",
          "className": "CISCO_TRUSTSEC",
          "type": "customlogginglistloglevel"
        },
        {
          "severityLogLevel": "EMERGENCY",
          "className": "IKE_AND_IPSEC",
          "type": "customlogginglistloglevel"
        }
      ],
      "description": "string",
      "id": "string",
      "type": "customlogginglist",
      "links": {
        "self": "string"
      }
    }
  ],
  "paging": {
    "prev": [
      "string",
      "string",
      "string",
      "string",
      "string"
    ],
    "next": [
      "string",
      "string",
      "string",
      "string",
      "string",
      "string",
      "string",
      "string",
      "string",
      "string"
    ],
    "limit": 1,
    "offset": 2,
    "count": 7,
    "pages": 5
  }
}