{
  "actions": [
    {
      "name": "getHTTPProxyList",
      "protocol": "REST",
      "method": "GET",
      "entitypath": "{base_path}/{version}/object/httpproxy?{query}",
      "requestSchema": "schema.json",
      "responseSchema": "schema.json",
      "timeout": 0,
      "sendEmpty": false,
      "sendGetBody": false,
      "requestDatatype": "JSON",
      "responseDatatype": "JSON",
      "headers": {},
      "responseObjects": [
        {
          "type": "default",
          "key": "",
          "mockFile": "mockdatafiles/getHTTPProxyList-default.json"
        }
      ]
    },
    {
      "name": "getHTTPProxy",
      "protocol": "REST",
      "method": "GET",
      "entitypath": "{base_path}/{version}/object/httpproxy/{pathv1}?{query}",
      "requestSchema": "schema.json",
      "responseSchema": "schema.json",
      "timeout": 0,
      "sendEmpty": false,
      "sendGetBody": false,
      "requestDatatype": "JSON",
      "responseDatatype": "JSON",
      "headers": {},
      "responseObjects": [
        {
          "type": "default",
          "key": "",
          "mockFile": "mockdatafiles/getHTTPProxy-default.json"
        }
      ]
    },
    {
      "name": "editHTTPProxy",
      "protocol": "REST",
      "method": "PUT",
      "entitypath": "{base_path}/{version}/object/httpproxy/{pathv1}?{query}",
      "requestSchema": "schema.json",
      "responseSchema": "schema.json",
      "timeout": 0,
      "sendEmpty": false,
      "requestDatatype": "JSON",
      "responseDatatype": "JSON",
      "headers": {},
      "responseObjects": [
        {
          "type": "default",
          "key": "",
          "mockFile": "mockdatafiles/editHTTPProxy-default.json"
        }
      ]
    }
  ]
}