{
  "items": [
    {
      "version": "string",
      "name": "string",
      "urlCategoryId": 10,
      "deleted": false,
      "state": "URL_CATEGORY_ADDED",
      "mnemonicName": "string",
      "id": "string",
      "type": "urlcategory",
      "links": {
        "self": "string"
      }
    },
    {
      "version": "string",
      "name": "string",
      "urlCategoryId": 5,
      "deleted": true,
      "state": "URL_CATEGORY_ADDED",
      "mnemonicName": "string",
      "id": "string",
      "type": "urlcategory",
      "links": {
        "self": "string"
      }
    },
    {
      "version": "string",
      "name": "string",
      "urlCategoryId": 6,
      "deleted": true,
      "state": "URL_CATEGORY_DELETED",
      "mnemonicName": "string",
      "id": "string",
      "type": "urlcategory",
      "links": {
        "self": "string"
      }
    },
    {
      "version": "string",
      "name": "string",
      "urlCategoryId": 1,
      "deleted": false,
      "state": "URL_CATEGORY_DELETED",
      "mnemonicName": "string",
      "id": "string",
      "type": "urlcategory",
      "links": {
        "self": "string"
      }
    },
    {
      "version": "string",
      "name": "string",
      "urlCategoryId": 3,
      "deleted": true,
      "state": "URL_CATEGORY_ADDED",
      "mnemonicName": "string",
      "id": "string",
      "type": "urlcategory",
      "links": {
        "self": "string"
      }
    }
  ],
  "paging": {
    "prev": [
      "string",
      "string",
      "string"
    ],
    "next": [
      "string",
      "string",
      "string",
      "string",
      "string",
      "string",
      "string",
      "string"
    ],
    "limit": 5,
    "offset": 2,
    "count": 2,
    "pages": 5
  }
}