{
  "actions": [
    {
      "name": "getManualNatRuleList",
      "protocol": "REST",
      "method": "GET",
      "entitypath": "{base_path}/{version}/policy/manualnatpolicies/{pathv1}/manualnatrules?{query}",
      "requestSchema": "schema.json",
      "responseSchema": "schema.json",
      "timeout": 0,
      "sendEmpty": false,
      "sendGetBody": false,
      "requestDatatype": "JSON",
      "responseDatatype": "JSON",
      "headers": {},
      "responseObjects": [
        {
          "type": "default",
          "key": "",
          "mockFile": "mockdatafiles/getManualNatRuleList-default.json"
        }
      ]
    },
    {
      "name": "addManualNatRule",
      "protocol": "REST",
      "method": "POST",
      "entitypath": "{base_path}/{version}/policy/manualnatpolicies/{pathv1}/manualnatrules?{query}",
      "requestSchema": "schema.json",
      "responseSchema": "schema.json",
      "timeout": 0,
      "sendEmpty": false,
      "requestDatatype": "JSON",
      "responseDatatype": "JSON",
      "headers": {},
      "responseObjects": [
        {
          "type": "default",
          "key": "",
          "mockFile": "mockdatafiles/addManualNatRule-default.json"
        }
      ]
    },
    {
      "name": "getManualNatRule",
      "protocol": "REST",
      "method": "GET",
      "entitypath": "{base_path}/{version}/policy/manualnatpolicies/{pathv1}/manualnatrules/{pathv2}?{query}",
      "requestSchema": "schema.json",
      "responseSchema": "schema.json",
      "timeout": 0,
      "sendEmpty": false,
      "sendGetBody": false,
      "requestDatatype": "JSON",
      "responseDatatype": "JSON",
      "headers": {},
      "responseObjects": [
        {
          "type": "default",
          "key": "",
          "mockFile": "mockdatafiles/getManualNatRule-default.json"
        }
      ]
    },
    {
      "name": "editManualNatRule",
      "protocol": "REST",
      "method": "PUT",
      "entitypath": "{base_path}/{version}/policy/manualnatpolicies/{pathv1}/manualnatrules/{pathv2}?{query}",
      "requestSchema": "schema.json",
      "responseSchema": "schema.json",
      "timeout": 0,
      "sendEmpty": false,
      "requestDatatype": "JSON",
      "responseDatatype": "JSON",
      "headers": {},
      "responseObjects": [
        {
          "type": "default",
          "key": "",
          "mockFile": "mockdatafiles/editManualNatRule-default.json"
        }
      ]
    },
    {
      "name": "deleteManualNatRule",
      "protocol": "REST",
      "method": "DELETE",
      "entitypath": "{base_path}/{version}/policy/manualnatpolicies/{pathv1}/manualnatrules/{pathv2}?{query}",
      "requestSchema": "schema.json",
      "responseSchema": "schema.json",
      "timeout": 0,
      "sendEmpty": false,
      "requestDatatype": "JSON",
      "responseDatatype": "JSON",
      "headers": {},
      "responseObjects": [
        {
          "type": "default",
          "key": "",
          "mockFile": ""
        }
      ]
    },
    {
      "name": "getManualNatRuleContainerList",
      "protocol": "REST",
      "method": "GET",
      "entitypath": "{base_path}/{version}/policy/manualnatpolicies?{query}",
      "requestSchema": "schema.json",
      "responseSchema": "schema.json",
      "timeout": 0,
      "sendEmpty": false,
      "sendGetBody": false,
      "requestDatatype": "JSON",
      "responseDatatype": "JSON",
      "headers": {},
      "responseObjects": [
        {
          "type": "default",
          "key": "",
          "mockFile": "mockdatafiles/getManualNatRuleContainerList-default.json"
        }
      ]
    },
    {
      "name": "getManualNatRuleContainer",
      "protocol": "REST",
      "method": "GET",
      "entitypath": "{base_path}/{version}/policy/manualnatpolicies/{pathv1}?{query}",
      "requestSchema": "schema.json",
      "responseSchema": "schema.json",
      "timeout": 0,
      "sendEmpty": false,
      "sendGetBody": false,
      "requestDatatype": "JSON",
      "responseDatatype": "JSON",
      "headers": {},
      "responseObjects": [
        {
          "type": "default",
          "key": "",
          "mockFile": "mockdatafiles/getManualNatRuleContainer-default.json"
        }
      ]
    },
    {
      "name": "getObjectNatRuleList",
      "protocol": "REST",
      "method": "GET",
      "entitypath": "{base_path}/{version}/policy/objectnatpolicies/{pathv1}/objectnatrules?{query}",
      "requestSchema": "schema.json",
      "responseSchema": "schema.json",
      "timeout": 0,
      "sendEmpty": false,
      "sendGetBody": false,
      "requestDatatype": "JSON",
      "responseDatatype": "JSON",
      "headers": {},
      "responseObjects": [
        {
          "type": "default",
          "key": "",
          "mockFile": "mockdatafiles/getObjectNatRuleList-default.json"
        }
      ]
    },
    {
      "name": "addObjectNatRule",
      "protocol": "REST",
      "method": "POST",
      "entitypath": "{base_path}/{version}/policy/objectnatpolicies/{pathv1}/objectnatrules?{query}",
      "requestSchema": "schema.json",
      "responseSchema": "schema.json",
      "timeout": 0,
      "sendEmpty": false,
      "requestDatatype": "JSON",
      "responseDatatype": "JSON",
      "headers": {},
      "responseObjects": [
        {
          "type": "default",
          "key": "",
          "mockFile": "mockdatafiles/addObjectNatRule-default.json"
        }
      ]
    },
    {
      "name": "getObjectNatRule",
      "protocol": "REST",
      "method": "GET",
      "entitypath": "{base_path}/{version}/policy/objectnatpolicies/{pathv1}/objectnatrules/{pathv2}?{query}",
      "requestSchema": "schema.json",
      "responseSchema": "schema.json",
      "timeout": 0,
      "sendEmpty": false,
      "sendGetBody": false,
      "requestDatatype": "JSON",
      "responseDatatype": "JSON",
      "headers": {},
      "responseObjects": [
        {
          "type": "default",
          "key": "",
          "mockFile": "mockdatafiles/getObjectNatRule-default.json"
        }
      ]
    },
    {
      "name": "editObjectNatRule",
      "protocol": "REST",
      "method": "PUT",
      "entitypath": "{base_path}/{version}/policy/objectnatpolicies/{pathv1}/objectnatrules/{pathv2}?{query}",
      "requestSchema": "schema.json",
      "responseSchema": "schema.json",
      "timeout": 0,
      "sendEmpty": false,
      "requestDatatype": "JSON",
      "responseDatatype": "JSON",
      "headers": {},
      "responseObjects": [
        {
          "type": "default",
          "key": "",
          "mockFile": "mockdatafiles/editObjectNatRule-default.json"
        }
      ]
    },
    {
      "name": "deleteObjectNatRule",
      "protocol": "REST",
      "method": "DELETE",
      "entitypath": "{base_path}/{version}/policy/objectnatpolicies/{pathv1}/objectnatrules/{pathv2}?{query}",
      "requestSchema": "schema.json",
      "responseSchema": "schema.json",
      "timeout": 0,
      "sendEmpty": false,
      "requestDatatype": "JSON",
      "responseDatatype": "JSON",
      "headers": {},
      "responseObjects": [
        {
          "type": "default",
          "key": "",
          "mockFile": ""
        }
      ]
    },
    {
      "name": "getObjectNatRuleContainerList",
      "protocol": "REST",
      "method": "GET",
      "entitypath": "{base_path}/{version}/policy/objectnatpolicies?{query}",
      "requestSchema": "schema.json",
      "responseSchema": "schema.json",
      "timeout": 0,
      "sendEmpty": false,
      "sendGetBody": false,
      "requestDatatype": "JSON",
      "responseDatatype": "JSON",
      "headers": {},
      "responseObjects": [
        {
          "type": "default",
          "key": "",
          "mockFile": "mockdatafiles/getObjectNatRuleContainerList-default.json"
        }
      ]
    },
    {
      "name": "getObjectNatRuleContainer",
      "protocol": "REST",
      "method": "GET",
      "entitypath": "{base_path}/{version}/policy/objectnatpolicies/{pathv1}?{query}",
      "requestSchema": "schema.json",
      "responseSchema": "schema.json",
      "timeout": 0,
      "sendEmpty": false,
      "sendGetBody": false,
      "requestDatatype": "JSON",
      "responseDatatype": "JSON",
      "headers": {},
      "responseObjects": [
        {
          "type": "default",
          "key": "",
          "mockFile": "mockdatafiles/getObjectNatRuleContainer-default.json"
        }
      ]
    }
  ]
}