{
  "version": "string",
  "name": "string",
  "description": "string",
  "isSystemDefined": false,
  "id": "string",
  "objects": [
    {
      "id": "string",
      "type": "string",
      "version": "string",
      "name": "string"
    },
    {
      "id": "string",
      "type": "string",
      "version": "string",
      "name": "string"
    },
    {
      "id": "string",
      "type": "string",
      "version": "string",
      "name": "string"
    },
    {
      "id": "string",
      "type": "string",
      "version": "string",
      "name": "string"
    },
    {
      "id": "string",
      "type": "string",
      "version": "string",
      "name": "string"
    }
  ],
  "type": "portobjectgroup",
  "links": {
    "self": "string"
  }
}