{
  "version": "string",
  "name": "string",
  "dnsServerGroup": {
    "id": "string",
    "type": "string",
    "version": "string",
    "name": "string"
  },
  "id": "string",
  "type": "devicednssettings",
  "links": {
    "self": "string"
  }
}