{
  "items": [
    {
      "version": "string",
      "name": "string",
      "cert": "*********",
      "privateKey": "*********",
      "passPhrase": "string",
      "issuerCommonName": "string",
      "issuerCountry": "string",
      "issuerLocality": "string",
      "issuerOrganization": "string",
      "issuerOrganizationUnit": "string",
      "issuerState": "string",
      "subjectCommonName": "string",
      "subjectCountry": "string",
      "subjectDistinguishedName": "string",
      "subjectLocality": "string",
      "subjectOrganization": "string",
      "subjectOrganizationUnit": "string",
      "subjectState": "string",
      "validityStartDate": "string",
      "validityEndDate": "string",
      "isSystemDefined": false,
      "id": "string",
      "type": "externalcertificate",
      "links": {
        "self": "string"
      }
    },
    {
      "version": "string",
      "name": "string",
      "cert": "*********",
      "privateKey": "*********",
      "passPhrase": "string",
      "issuerCommonName": "string",
      "issuerCountry": "string",
      "issuerLocality": "string",
      "issuerOrganization": "string",
      "issuerOrganizationUnit": "string",
      "issuerState": "string",
      "subjectCommonName": "string",
      "subjectCountry": "string",
      "subjectDistinguishedName": "string",
      "subjectLocality": "string",
      "subjectOrganization": "string",
      "subjectOrganizationUnit": "string",
      "subjectState": "string",
      "validityStartDate": "string",
      "validityEndDate": "string",
      "isSystemDefined": true,
      "id": "string",
      "type": "externalcertificate",
      "links": {
        "self": "string"
      }
    },
    {
      "version": "string",
      "name": "string",
      "cert": "*********",
      "privateKey": "*********",
      "passPhrase": "string",
      "issuerCommonName": "string",
      "issuerCountry": "string",
      "issuerLocality": "string",
      "issuerOrganization": "string",
      "issuerOrganizationUnit": "string",
      "issuerState": "string",
      "subjectCommonName": "string",
      "subjectCountry": "string",
      "subjectDistinguishedName": "string",
      "subjectLocality": "string",
      "subjectOrganization": "string",
      "subjectOrganizationUnit": "string",
      "subjectState": "string",
      "validityStartDate": "string",
      "validityEndDate": "string",
      "isSystemDefined": true,
      "id": "string",
      "type": "externalcertificate",
      "links": {
        "self": "string"
      }
    },
    {
      "version": "string",
      "name": "string",
      "cert": "*********",
      "privateKey": "*********",
      "passPhrase": "string",
      "issuerCommonName": "string",
      "issuerCountry": "string",
      "issuerLocality": "string",
      "issuerOrganization": "string",
      "issuerOrganizationUnit": "string",
      "issuerState": "string",
      "subjectCommonName": "string",
      "subjectCountry": "string",
      "subjectDistinguishedName": "string",
      "subjectLocality": "string",
      "subjectOrganization": "string",
      "subjectOrganizationUnit": "string",
      "subjectState": "string",
      "validityStartDate": "string",
      "validityEndDate": "string",
      "isSystemDefined": false,
      "id": "string",
      "type": "externalcertificate",
      "links": {
        "self": "string"
      }
    },
    {
      "version": "string",
      "name": "string",
      "cert": "*********",
      "privateKey": "*********",
      "passPhrase": "string",
      "issuerCommonName": "string",
      "issuerCountry": "string",
      "issuerLocality": "string",
      "issuerOrganization": "string",
      "issuerOrganizationUnit": "string",
      "issuerState": "string",
      "subjectCommonName": "string",
      "subjectCountry": "string",
      "subjectDistinguishedName": "string",
      "subjectLocality": "string",
      "subjectOrganization": "string",
      "subjectOrganizationUnit": "string",
      "subjectState": "string",
      "validityStartDate": "string",
      "validityEndDate": "string",
      "isSystemDefined": false,
      "id": "string",
      "type": "externalcertificate",
      "links": {
        "self": "string"
      }
    },
    {
      "version": "string",
      "name": "string",
      "cert": "*********",
      "privateKey": "*********",
      "passPhrase": "string",
      "issuerCommonName": "string",
      "issuerCountry": "string",
      "issuerLocality": "string",
      "issuerOrganization": "string",
      "issuerOrganizationUnit": "string",
      "issuerState": "string",
      "subjectCommonName": "string",
      "subjectCountry": "string",
      "subjectDistinguishedName": "string",
      "subjectLocality": "string",
      "subjectOrganization": "string",
      "subjectOrganizationUnit": "string",
      "subjectState": "string",
      "validityStartDate": "string",
      "validityEndDate": "string",
      "isSystemDefined": true,
      "id": "string",
      "type": "externalcertificate",
      "links": {
        "self": "string"
      }
    },
    {
      "version": "string",
      "name": "string",
      "cert": "*********",
      "privateKey": "*********",
      "passPhrase": "string",
      "issuerCommonName": "string",
      "issuerCountry": "string",
      "issuerLocality": "string",
      "issuerOrganization": "string",
      "issuerOrganizationUnit": "string",
      "issuerState": "string",
      "subjectCommonName": "string",
      "subjectCountry": "string",
      "subjectDistinguishedName": "string",
      "subjectLocality": "string",
      "subjectOrganization": "string",
      "subjectOrganizationUnit": "string",
      "subjectState": "string",
      "validityStartDate": "string",
      "validityEndDate": "string",
      "isSystemDefined": true,
      "id": "string",
      "type": "externalcertificate",
      "links": {
        "self": "string"
      }
    },
    {
      "version": "string",
      "name": "string",
      "cert": "*********",
      "privateKey": "*********",
      "passPhrase": "string",
      "issuerCommonName": "string",
      "issuerCountry": "string",
      "issuerLocality": "string",
      "issuerOrganization": "string",
      "issuerOrganizationUnit": "string",
      "issuerState": "string",
      "subjectCommonName": "string",
      "subjectCountry": "string",
      "subjectDistinguishedName": "string",
      "subjectLocality": "string",
      "subjectOrganization": "string",
      "subjectOrganizationUnit": "string",
      "subjectState": "string",
      "validityStartDate": "string",
      "validityEndDate": "string",
      "isSystemDefined": false,
      "id": "string",
      "type": "externalcertificate",
      "links": {
        "self": "string"
      }
    },
    {
      "version": "string",
      "name": "string",
      "cert": "*********",
      "privateKey": "*********",
      "passPhrase": "string",
      "issuerCommonName": "string",
      "issuerCountry": "string",
      "issuerLocality": "string",
      "issuerOrganization": "string",
      "issuerOrganizationUnit": "string",
      "issuerState": "string",
      "subjectCommonName": "string",
      "subjectCountry": "string",
      "subjectDistinguishedName": "string",
      "subjectLocality": "string",
      "subjectOrganization": "string",
      "subjectOrganizationUnit": "string",
      "subjectState": "string",
      "validityStartDate": "string",
      "validityEndDate": "string",
      "isSystemDefined": false,
      "id": "string",
      "type": "externalcertificate",
      "links": {
        "self": "string"
      }
    },
    {
      "version": "string",
      "name": "string",
      "cert": "*********",
      "privateKey": "*********",
      "passPhrase": "string",
      "issuerCommonName": "string",
      "issuerCountry": "string",
      "issuerLocality": "string",
      "issuerOrganization": "string",
      "issuerOrganizationUnit": "string",
      "issuerState": "string",
      "subjectCommonName": "string",
      "subjectCountry": "string",
      "subjectDistinguishedName": "string",
      "subjectLocality": "string",
      "subjectOrganization": "string",
      "subjectOrganizationUnit": "string",
      "subjectState": "string",
      "validityStartDate": "string",
      "validityEndDate": "string",
      "isSystemDefined": false,
      "id": "string",
      "type": "externalcertificate",
      "links": {
        "self": "string"
      }
    }
  ],
  "paging": {
    "prev": [
      "string",
      "string",
      "string",
      "string",
      "string",
      "string"
    ],
    "next": [
      "string",
      "string",
      "string"
    ],
    "limit": 5,
    "offset": 10,
    "count": 7,
    "pages": 8
  }
}