{
  "items": [
    {
      "version": "string",
      "name": "string",
      "description": "string",
      "isSystemDefined": false,
      "icmpv4Type": "MOBILE_HOST_REDIRECT",
      "icmpv4Code": "NEED_AUTHENTICATION",
      "id": "string",
      "type": "icmpv4portobject",
      "links": {
        "self": "string"
      }
    },
    {
      "version": "string",
      "name": "string",
      "description": "string",
      "isSystemDefined": true,
      "icmpv4Type": "ROUTER_ADVERTISEMENT",
      "icmpv4Code": "COMM_ADMINISTRATIVELY_PROHIBITED",
      "id": "string",
      "type": "icmpv4portobject",
      "links": {
        "self": "string"
      }
    },
    {
      "version": "string",
      "name": "string",
      "description": "string",
      "isSystemDefined": true,
      "icmpv4Type": "ADDR_MASK_REPLY",
      "icmpv4Code": "DEST_NET_UNREACHABLE_FOR_TOS",
      "id": "string",
      "type": "icmpv4portobject",
      "links": {
        "self": "string"
      }
    },
    {
      "version": "string",
      "name": "string",
      "description": "string",
      "isSystemDefined": false,
      "icmpv4Type": "MOBILE_HOST_REDIRECT",
      "icmpv4Code": "COMM_ADMINISTRATIVELY_PROHIBITED",
      "id": "string",
      "type": "icmpv4portobject",
      "links": {
        "self": "string"
      }
    },
    {
      "version": "string",
      "name": "string",
      "description": "string",
      "isSystemDefined": true,
      "icmpv4Type": "SOURCE_QUENCH",
      "icmpv4Code": "REDIRECT_DATAGRAM_NETWORK",
      "id": "string",
      "type": "icmpv4portobject",
      "links": {
        "self": "string"
      }
    },
    {
      "version": "string",
      "name": "string",
      "description": "string",
      "isSystemDefined": true,
      "icmpv4Type": "ADDR_MASK_REPLY",
      "icmpv4Code": "NEED_AUTHORIZATION",
      "id": "string",
      "type": "icmpv4portobject",
      "links": {
        "self": "string"
      }
    }
  ],
  "paging": {
    "prev": [
      "string"
    ],
    "next": [
      "string",
      "string",
      "string",
      "string",
      "string",
      "string",
      "string",
      "string"
    ],
    "limit": 8,
    "offset": 10,
    "count": 3,
    "pages": 8
  }
}