{
  "version": "string",
  "name": "string",
  "description": "string",
  "entries": [
    {
      "action": "DENY",
      "regularExpression": "string",
      "type": "aspathentry"
    },
    {
      "action": "DENY",
      "regularExpression": "string",
      "type": "aspathentry"
    },
    {
      "action": "PERMIT",
      "regularExpression": "string",
      "type": "aspathentry"
    },
    {
      "action": "PERMIT",
      "regularExpression": "string",
      "type": "aspathentry"
    },
    {
      "action": "DENY",
      "regularExpression": "string",
      "type": "aspathentry"
    },
    {
      "action": "PERMIT",
      "regularExpression": "string",
      "type": "aspathentry"
    }
  ],
  "id": "string",
  "type": "aspathlist",
  "links": {
    "self": "string"
  }
}