{
  "actions": [
    {
      "name": "getSmartAgentConnectionList",
      "protocol": "REST",
      "method": "GET",
      "entitypath": "{base_path}/{version}/license/smartagentconnections?{query}",
      "requestSchema": "schema.json",
      "responseSchema": "schema.json",
      "timeout": 0,
      "sendEmpty": false,
      "sendGetBody": false,
      "requestDatatype": "JSON",
      "responseDatatype": "JSON",
      "headers": {},
      "responseObjects": [
        {
          "type": "default",
          "key": "",
          "mockFile": "mockdatafiles/getSmartAgentConnectionList-default.json"
        }
      ]
    },
    {
      "name": "addSmartAgentConnection",
      "protocol": "REST",
      "method": "POST",
      "entitypath": "{base_path}/{version}/license/smartagentconnections?{query}",
      "requestSchema": "schema.json",
      "responseSchema": "schema.json",
      "timeout": 0,
      "sendEmpty": false,
      "requestDatatype": "JSON",
      "responseDatatype": "JSON",
      "headers": {},
      "responseObjects": [
        {
          "type": "default",
          "key": "",
          "mockFile": "mockdatafiles/addSmartAgentConnection-default.json"
        }
      ]
    },
    {
      "name": "getSmartAgentConnection",
      "protocol": "REST",
      "method": "GET",
      "entitypath": "{base_path}/{version}/license/smartagentconnections/{pathv1}?{query}",
      "requestSchema": "schema.json",
      "responseSchema": "schema.json",
      "timeout": 0,
      "sendEmpty": false,
      "sendGetBody": false,
      "requestDatatype": "JSON",
      "responseDatatype": "JSON",
      "headers": {},
      "responseObjects": [
        {
          "type": "default",
          "key": "",
          "mockFile": "mockdatafiles/getSmartAgentConnection-default.json"
        }
      ]
    },
    {
      "name": "editSmartAgentConnection",
      "protocol": "REST",
      "method": "PUT",
      "entitypath": "{base_path}/{version}/license/smartagentconnections/{pathv1}?{query}",
      "requestSchema": "schema.json",
      "responseSchema": "schema.json",
      "timeout": 0,
      "sendEmpty": false,
      "requestDatatype": "JSON",
      "responseDatatype": "JSON",
      "headers": {},
      "responseObjects": [
        {
          "type": "default",
          "key": "",
          "mockFile": "mockdatafiles/editSmartAgentConnection-default.json"
        }
      ]
    },
    {
      "name": "deleteSmartAgentConnection",
      "protocol": "REST",
      "method": "DELETE",
      "entitypath": "{base_path}/{version}/license/smartagentconnections/{pathv1}?{query}",
      "requestSchema": "schema.json",
      "responseSchema": "schema.json",
      "timeout": 0,
      "sendEmpty": false,
      "requestDatatype": "JSON",
      "responseDatatype": "JSON",
      "headers": {},
      "responseObjects": [
        {
          "type": "default",
          "key": "",
          "mockFile": ""
        }
      ]
    },
    {
      "name": "getSmartAgentStatusList",
      "protocol": "REST",
      "method": "GET",
      "entitypath": "{base_path}/{version}/license/smartagentstatuses?{query}",
      "requestSchema": "schema.json",
      "responseSchema": "schema.json",
      "timeout": 0,
      "sendEmpty": false,
      "sendGetBody": false,
      "requestDatatype": "JSON",
      "responseDatatype": "JSON",
      "headers": {},
      "responseObjects": [
        {
          "type": "default",
          "key": "",
          "mockFile": "mockdatafiles/getSmartAgentStatusList-default.json"
        }
      ]
    },
    {
      "name": "getSmartAgentStatus",
      "protocol": "REST",
      "method": "GET",
      "entitypath": "{base_path}/{version}/license/smartagentstatuses/{pathv1}?{query}",
      "requestSchema": "schema.json",
      "responseSchema": "schema.json",
      "timeout": 0,
      "sendEmpty": false,
      "sendGetBody": false,
      "requestDatatype": "JSON",
      "responseDatatype": "JSON",
      "headers": {},
      "responseObjects": [
        {
          "type": "default",
          "key": "",
          "mockFile": "mockdatafiles/getSmartAgentStatus-default.json"
        }
      ]
    },
    {
      "name": "getLicenseList",
      "protocol": "REST",
      "method": "GET",
      "entitypath": "{base_path}/{version}/license/smartlicenses?{query}",
      "requestSchema": "schema.json",
      "responseSchema": "schema.json",
      "timeout": 0,
      "sendEmpty": false,
      "sendGetBody": false,
      "requestDatatype": "JSON",
      "responseDatatype": "JSON",
      "headers": {},
      "responseObjects": [
        {
          "type": "default",
          "key": "",
          "mockFile": "mockdatafiles/getLicenseList-default.json"
        }
      ]
    },
    {
      "name": "addLicense",
      "protocol": "REST",
      "method": "POST",
      "entitypath": "{base_path}/{version}/license/smartlicenses?{query}",
      "requestSchema": "schema.json",
      "responseSchema": "schema.json",
      "timeout": 0,
      "sendEmpty": false,
      "requestDatatype": "JSON",
      "responseDatatype": "JSON",
      "headers": {},
      "responseObjects": [
        {
          "type": "default",
          "key": "",
          "mockFile": "mockdatafiles/addLicense-default.json"
        }
      ]
    },
    {
      "name": "getLicense",
      "protocol": "REST",
      "method": "GET",
      "entitypath": "{base_path}/{version}/license/smartlicenses/{pathv1}?{query}",
      "requestSchema": "schema.json",
      "responseSchema": "schema.json",
      "timeout": 0,
      "sendEmpty": false,
      "sendGetBody": false,
      "requestDatatype": "JSON",
      "responseDatatype": "JSON",
      "headers": {},
      "responseObjects": [
        {
          "type": "default",
          "key": "",
          "mockFile": "mockdatafiles/getLicense-default.json"
        }
      ]
    },
    {
      "name": "deleteLicense",
      "protocol": "REST",
      "method": "DELETE",
      "entitypath": "{base_path}/{version}/license/smartlicenses/{pathv1}?{query}",
      "requestSchema": "schema.json",
      "responseSchema": "schema.json",
      "timeout": 0,
      "sendEmpty": false,
      "requestDatatype": "JSON",
      "responseDatatype": "JSON",
      "headers": {},
      "responseObjects": [
        {
          "type": "default",
          "key": "",
          "mockFile": ""
        }
      ]
    },
    {
      "name": "addSmartAgentSyncRequest",
      "protocol": "REST",
      "method": "POST",
      "entitypath": "{base_path}/{version}/license/smartagentsyncrequests?{query}",
      "requestSchema": "schema.json",
      "responseSchema": "schema.json",
      "timeout": 0,
      "sendEmpty": false,
      "requestDatatype": "JSON",
      "responseDatatype": "JSON",
      "headers": {},
      "responseObjects": [
        {
          "type": "default",
          "key": "",
          "mockFile": "mockdatafiles/addSmartAgentSyncRequest-default.json"
        }
      ]
    },
    {
      "name": "getPLRRequestCode",
      "protocol": "REST",
      "method": "GET",
      "entitypath": "{base_path}/{version}/license/operational/plrrequestcode/{pathv1}?{query}",
      "requestSchema": "schema.json",
      "responseSchema": "schema.json",
      "timeout": 0,
      "sendEmpty": false,
      "sendGetBody": false,
      "requestDatatype": "JSON",
      "responseDatatype": "JSON",
      "headers": {},
      "responseObjects": [
        {
          "type": "default",
          "key": "",
          "mockFile": "mockdatafiles/getPLRRequestCode-default.json"
        }
      ]
    },
    {
      "name": "getPLRRequestCodeList",
      "protocol": "REST",
      "method": "GET",
      "entitypath": "{base_path}/{version}/license/operational/plrrequestcode?{query}",
      "requestSchema": "schema.json",
      "responseSchema": "schema.json",
      "timeout": 0,
      "sendEmpty": false,
      "sendGetBody": false,
      "requestDatatype": "JSON",
      "responseDatatype": "JSON",
      "headers": {},
      "responseObjects": [
        {
          "type": "default",
          "key": "",
          "mockFile": "mockdatafiles/getPLRRequestCodeList-default.json"
        }
      ]
    },
    {
      "name": "addPLRAuthorizationCode",
      "protocol": "REST",
      "method": "POST",
      "entitypath": "{base_path}/{version}/license/action/installplrcode?{query}",
      "requestSchema": "schema.json",
      "responseSchema": "schema.json",
      "timeout": 0,
      "sendEmpty": false,
      "requestDatatype": "JSON",
      "responseDatatype": "JSON",
      "headers": {},
      "responseObjects": [
        {
          "type": "default",
          "key": "",
          "mockFile": "mockdatafiles/addPLRAuthorizationCode-default.json"
        }
      ]
    },
    {
      "name": "addPLRReleaseCode",
      "protocol": "REST",
      "method": "POST",
      "entitypath": "{base_path}/{version}/license/action/cancelreservation?{query}",
      "requestSchema": "schema.json",
      "responseSchema": "schema.json",
      "timeout": 0,
      "sendEmpty": false,
      "requestDatatype": "JSON",
      "responseDatatype": "JSON",
      "headers": {},
      "responseObjects": [
        {
          "type": "default",
          "key": "",
          "mockFile": "mockdatafiles/addPLRReleaseCode-default.json"
        }
      ]
    }
  ]
}