{
  "items": [
    {
      "hitCount": 1,
      "rule": {
        "type": "accessruleinfo",
        "name": "string",
        "ruleId": 8,
        "id": "string"
      },
      "firstHitTimeStamp": "string",
      "lastHitTimeStamp": "string",
      "lastFetchTimeStamp": "string",
      "type": "HitCount",
      "links": {
        "self": "string"
      }
    },
    {
      "hitCount": 7,
      "rule": {
        "type": "accessruleinfo",
        "name": "string",
        "ruleId": 1,
        "id": "string"
      },
      "firstHitTimeStamp": "string",
      "lastHitTimeStamp": "string",
      "lastFetchTimeStamp": "string",
      "type": "HitCount",
      "links": {
        "self": "string"
      }
    },
    {
      "hitCount": 2,
      "rule": {
        "type": "accessruleinfo",
        "name": "string",
        "ruleId": 1,
        "id": "string"
      },
      "firstHitTimeStamp": "string",
      "lastHitTimeStamp": "string",
      "lastFetchTimeStamp": "string",
      "type": "HitCount",
      "links": {
        "self": "string"
      }
    }
  ],
  "paging": {
    "prev": [
      "string",
      "string",
      "string",
      "string",
      "string",
      "string",
      "string"
    ],
    "next": [
      "string",
      "string",
      "string",
      "string",
      "string",
      "string",
      "string",
      "string",
      "string"
    ],
    "limit": 4,
    "offset": 9,
    "count": 4,
    "pages": 3
  }
}