{
  "items": [
    {
      "version": "string",
      "jobName": "string",
      "jobDescription": "string",
      "user": "string",
      "startDateTime": "string",
      "endDateTime": "string",
      "status": "FAILED",
      "statusMessage": "string",
      "scheduleUuid": "string",
      "id": "string",
      "type": "jobhistoryvdbupdate",
      "links": {
        "self": "string"
      }
    },
    {
      "version": "string",
      "jobName": "string",
      "jobDescription": "string",
      "user": "string",
      "startDateTime": "string",
      "endDateTime": "string",
      "status": "IN_PROGRESS",
      "statusMessage": "string",
      "scheduleUuid": "string",
      "id": "string",
      "type": "jobhistoryvdbupdate",
      "links": {
        "self": "string"
      }
    },
    {
      "version": "string",
      "jobName": "string",
      "jobDescription": "string",
      "user": "string",
      "startDateTime": "string",
      "endDateTime": "string",
      "status": "FAILED",
      "statusMessage": "string",
      "scheduleUuid": "string",
      "id": "string",
      "type": "jobhistoryvdbupdate",
      "links": {
        "self": "string"
      }
    },
    {
      "version": "string",
      "jobName": "string",
      "jobDescription": "string",
      "user": "string",
      "startDateTime": "string",
      "endDateTime": "string",
      "status": "QUEUED",
      "statusMessage": "string",
      "scheduleUuid": "string",
      "id": "string",
      "type": "jobhistoryvdbupdate",
      "links": {
        "self": "string"
      }
    },
    {
      "version": "string",
      "jobName": "string",
      "jobDescription": "string",
      "user": "string",
      "startDateTime": "string",
      "endDateTime": "string",
      "status": "QUEUED",
      "statusMessage": "string",
      "scheduleUuid": "string",
      "id": "string",
      "type": "jobhistoryvdbupdate",
      "links": {
        "self": "string"
      }
    },
    {
      "version": "string",
      "jobName": "string",
      "jobDescription": "string",
      "user": "string",
      "startDateTime": "string",
      "endDateTime": "string",
      "status": "IN_PROGRESS",
      "statusMessage": "string",
      "scheduleUuid": "string",
      "id": "string",
      "type": "jobhistoryvdbupdate",
      "links": {
        "self": "string"
      }
    },
    {
      "version": "string",
      "jobName": "string",
      "jobDescription": "string",
      "user": "string",
      "startDateTime": "string",
      "endDateTime": "string",
      "status": "FAILED",
      "statusMessage": "string",
      "scheduleUuid": "string",
      "id": "string",
      "type": "jobhistoryvdbupdate",
      "links": {
        "self": "string"
      }
    },
    {
      "version": "string",
      "jobName": "string",
      "jobDescription": "string",
      "user": "string",
      "startDateTime": "string",
      "endDateTime": "string",
      "status": "IN_PROGRESS",
      "statusMessage": "string",
      "scheduleUuid": "string",
      "id": "string",
      "type": "jobhistoryvdbupdate",
      "links": {
        "self": "string"
      }
    }
  ],
  "paging": {
    "prev": [
      "string",
      "string",
      "string"
    ],
    "next": [
      "string",
      "string",
      "string",
      "string",
      "string",
      "string",
      "string",
      "string",
      "string",
      "string"
    ],
    "limit": 9,
    "offset": 7,
    "count": 2,
    "pages": 6
  }
}