{
  "version": "string",
  "name": "string",
  "description": "string",
  "sourceInterface": {
    "id": "string",
    "type": "string",
    "version": "string",
    "name": "string"
  },
  "destinationInterface": {
    "id": "string",
    "type": "string",
    "version": "string",
    "name": "string"
  },
  "natType": "STATIC",
  "patOptions": {
    "patPoolAddress": {
      "id": "string",
      "type": "string",
      "version": "string",
      "name": "string"
    },
    "interfacePat": true,
    "roundRobin": true,
    "flat": true,
    "extended": false,
    "includeReserve": false,
    "type": "patoptions"
  },
  "netToNet": true,
  "noProxyArp": true,
  "dns": true,
  "interfaceIPv6": false,
  "routeLookup": true,
  "enabled": false,
  "originalNetwork": {
    "id": "string",
    "type": "string",
    "version": "string",
    "name": "string"
  },
  "translatedNetwork": {
    "id": "string",
    "type": "string",
    "version": "string",
    "name": "string"
  },
  "originalPort": {
    "id": "string",
    "type": "string",
    "version": "string",
    "name": "string"
  },
  "translatedPort": {
    "id": "string",
    "type": "string",
    "version": "string",
    "name": "string"
  },
  "interfaceInTranslatedNetwork": false,
  "rulePosition": 7,
  "id": "string",
  "type": "objectnatrule",
  "links": {
    "self": "string"
  }
}