{
  "items": [
    {
      "version": "string",
      "connectionType": "REGISTER",
      "token": "string",
      "id": "string",
      "type": "smartagentconnection",
      "links": {
        "self": "string"
      }
    },
    {
      "version": "string",
      "connectionType": "REGISTER",
      "token": "string",
      "id": "string",
      "type": "smartagentconnection",
      "links": {
        "self": "string"
      }
    },
    {
      "version": "string",
      "connectionType": "UNIVERSAL_PLR",
      "token": "string",
      "id": "string",
      "type": "smartagentconnection",
      "links": {
        "self": "string"
      }
    },
    {
      "version": "string",
      "connectionType": "UNIVERSAL_PLR",
      "token": "string",
      "id": "string",
      "type": "smartagentconnection",
      "links": {
        "self": "string"
      }
    },
    {
      "version": "string",
      "connectionType": "UNIVERSAL_PLR",
      "token": "string",
      "id": "string",
      "type": "smartagentconnection",
      "links": {
        "self": "string"
      }
    },
    {
      "version": "string",
      "connectionType": "EVALUATION",
      "token": "string",
      "id": "string",
      "type": "smartagentconnection",
      "links": {
        "self": "string"
      }
    },
    {
      "version": "string",
      "connectionType": "REGISTER",
      "token": "string",
      "id": "string",
      "type": "smartagentconnection",
      "links": {
        "self": "string"
      }
    },
    {
      "version": "string",
      "connectionType": "UNIVERSAL_PLR",
      "token": "string",
      "id": "string",
      "type": "smartagentconnection",
      "links": {
        "self": "string"
      }
    },
    {
      "version": "string",
      "connectionType": "EVALUATION",
      "token": "string",
      "id": "string",
      "type": "smartagentconnection",
      "links": {
        "self": "string"
      }
    }
  ],
  "paging": {
    "prev": [
      "string"
    ],
    "next": [
      "string",
      "string",
      "string",
      "string",
      "string",
      "string",
      "string",
      "string",
      "string"
    ],
    "limit": 9,
    "offset": 7,
    "count": 3,
    "pages": 10
  }
}