{
  "items": [
    {
      "version": "string",
      "scheduleType": "SINGLE",
      "user": "string",
      "forceOperation": false,
      "jobHistoryUuid": "string",
      "ipAddress": "string",
      "name": "string",
      "description": "string",
      "sourceInterfaceId": "string",
      "sourceInterfaceType": "string",
      "destinationInterfaceId": "string",
      "destinationInterfaceType": "string",
      "jobName": "string",
      "id": "string",
      "type": "interfacemigrationimmediate",
      "links": {
        "self": "string"
      }
    },
    {
      "version": "string",
      "scheduleType": "WEEKLY",
      "user": "string",
      "forceOperation": false,
      "jobHistoryUuid": "string",
      "ipAddress": "string",
      "name": "string",
      "description": "string",
      "sourceInterfaceId": "string",
      "sourceInterfaceType": "string",
      "destinationInterfaceId": "string",
      "destinationInterfaceType": "string",
      "jobName": "string",
      "id": "string",
      "type": "interfacemigrationimmediate",
      "links": {
        "self": "string"
      }
    },
    {
      "version": "string",
      "scheduleType": "IMMEDIATE",
      "user": "string",
      "forceOperation": false,
      "jobHistoryUuid": "string",
      "ipAddress": "string",
      "name": "string",
      "description": "string",
      "sourceInterfaceId": "string",
      "sourceInterfaceType": "string",
      "destinationInterfaceId": "string",
      "destinationInterfaceType": "string",
      "jobName": "string",
      "id": "string",
      "type": "interfacemigrationimmediate",
      "links": {
        "self": "string"
      }
    },
    {
      "version": "string",
      "scheduleType": "IMMEDIATE",
      "user": "string",
      "forceOperation": false,
      "jobHistoryUuid": "string",
      "ipAddress": "string",
      "name": "string",
      "description": "string",
      "sourceInterfaceId": "string",
      "sourceInterfaceType": "string",
      "destinationInterfaceId": "string",
      "destinationInterfaceType": "string",
      "jobName": "string",
      "id": "string",
      "type": "interfacemigrationimmediate",
      "links": {
        "self": "string"
      }
    }
  ],
  "paging": {
    "prev": [
      "string"
    ],
    "next": [
      "string",
      "string",
      "string",
      "string",
      "string",
      "string",
      "string",
      "string"
    ],
    "limit": 10,
    "offset": 1,
    "count": 7,
    "pages": 10
  }
}