{
  "version": "string",
  "name": "string",
  "protocolVersions": [
    "DTLSV1_2",
    "TLSV1",
    "TLSV1",
    "TLSV1_2"
  ],
  "securityLevel": "CUSTOM",
  "isSystemDefined": false,
  "inferredSecurityLevel": "MEDIUM",
  "cipherSuites": [
    "string",
    "string",
    "string",
    "string",
    "string",
    "string",
    "string",
    "string",
    "string"
  ],
  "description": "string",
  "id": "string",
  "type": "sslcipher",
  "links": {
    "self": "string"
  }
}