{
  "items": [
    {
      "version": "string",
      "name": "string",
      "description": "string",
      "entries": [
        {
          "action": "DENY",
          "communities": [
            "string",
            "string",
            "string",
            "string",
            "string",
            "string",
            "string"
          ],
          "internet": true,
          "noAdvertise": false,
          "noExport": true,
          "type": "standardcommunityentry"
        },
        {
          "action": "DENY",
          "communities": [
            "string",
            "string",
            "string",
            "string"
          ],
          "internet": false,
          "noAdvertise": false,
          "noExport": false,
          "type": "standardcommunityentry"
        }
      ],
      "id": "string",
      "type": "standardcommunitylist",
      "links": {
        "self": "string"
      }
    },
    {
      "version": "string",
      "name": "string",
      "description": "string",
      "entries": [
        {
          "action": "DENY",
          "communities": [
            "string",
            "string",
            "string",
            "string",
            "string",
            "string",
            "string",
            "string",
            "string",
            "string"
          ],
          "internet": true,
          "noAdvertise": false,
          "noExport": true,
          "type": "standardcommunityentry"
        },
        {
          "action": "DENY",
          "communities": [
            "string",
            "string",
            "string",
            "string",
            "string",
            "string"
          ],
          "internet": true,
          "noAdvertise": true,
          "noExport": false,
          "type": "standardcommunityentry"
        }
      ],
      "id": "string",
      "type": "standardcommunitylist",
      "links": {
        "self": "string"
      }
    },
    {
      "version": "string",
      "name": "string",
      "description": "string",
      "entries": [
        {
          "action": "DENY",
          "communities": [
            "string",
            "string",
            "string"
          ],
          "internet": true,
          "noAdvertise": false,
          "noExport": false,
          "type": "standardcommunityentry"
        }
      ],
      "id": "string",
      "type": "standardcommunitylist",
      "links": {
        "self": "string"
      }
    },
    {
      "version": "string",
      "name": "string",
      "description": "string",
      "entries": [
        {
          "action": "DENY",
          "communities": [
            "string",
            "string",
            "string",
            "string",
            "string",
            "string",
            "string",
            "string"
          ],
          "internet": true,
          "noAdvertise": true,
          "noExport": true,
          "type": "standardcommunityentry"
        },
        {
          "action": "PERMIT",
          "communities": [
            "string",
            "string",
            "string",
            "string",
            "string",
            "string"
          ],
          "internet": true,
          "noAdvertise": false,
          "noExport": true,
          "type": "standardcommunityentry"
        },
        {
          "action": "DENY",
          "communities": [
            "string",
            "string"
          ],
          "internet": true,
          "noAdvertise": true,
          "noExport": true,
          "type": "standardcommunityentry"
        }
      ],
      "id": "string",
      "type": "standardcommunitylist",
      "links": {
        "self": "string"
      }
    },
    {
      "version": "string",
      "name": "string",
      "description": "string",
      "entries": [
        {
          "action": "PERMIT",
          "communities": [
            "string",
            "string",
            "string",
            "string",
            "string",
            "string",
            "string",
            "string"
          ],
          "internet": false,
          "noAdvertise": false,
          "noExport": true,
          "type": "standardcommunityentry"
        },
        {
          "action": "DENY",
          "communities": [
            "string",
            "string",
            "string",
            "string",
            "string",
            "string",
            "string"
          ],
          "internet": false,
          "noAdvertise": true,
          "noExport": false,
          "type": "standardcommunityentry"
        },
        {
          "action": "DENY",
          "communities": [
            "string",
            "string",
            "string"
          ],
          "internet": true,
          "noAdvertise": true,
          "noExport": true,
          "type": "standardcommunityentry"
        },
        {
          "action": "DENY",
          "communities": [
            "string",
            "string",
            "string",
            "string",
            "string"
          ],
          "internet": true,
          "noAdvertise": false,
          "noExport": true,
          "type": "standardcommunityentry"
        },
        {
          "action": "DENY",
          "communities": [
            "string",
            "string",
            "string",
            "string"
          ],
          "internet": true,
          "noAdvertise": false,
          "noExport": false,
          "type": "standardcommunityentry"
        },
        {
          "action": "PERMIT",
          "communities": [
            "string",
            "string",
            "string"
          ],
          "internet": true,
          "noAdvertise": true,
          "noExport": false,
          "type": "standardcommunityentry"
        },
        {
          "action": "DENY",
          "communities": [
            "string",
            "string",
            "string",
            "string",
            "string",
            "string"
          ],
          "internet": true,
          "noAdvertise": false,
          "noExport": false,
          "type": "standardcommunityentry"
        },
        {
          "action": "DENY",
          "communities": [
            "string",
            "string",
            "string",
            "string",
            "string",
            "string",
            "string",
            "string",
            "string"
          ],
          "internet": true,
          "noAdvertise": true,
          "noExport": true,
          "type": "standardcommunityentry"
        },
        {
          "action": "DENY",
          "communities": [
            "string",
            "string",
            "string",
            "string",
            "string",
            "string",
            "string",
            "string"
          ],
          "internet": true,
          "noAdvertise": true,
          "noExport": true,
          "type": "standardcommunityentry"
        },
        {
          "action": "PERMIT",
          "communities": [
            "string",
            "string",
            "string",
            "string"
          ],
          "internet": false,
          "noAdvertise": false,
          "noExport": true,
          "type": "standardcommunityentry"
        }
      ],
      "id": "string",
      "type": "standardcommunitylist",
      "links": {
        "self": "string"
      }
    },
    {
      "version": "string",
      "name": "string",
      "description": "string",
      "entries": [
        {
          "action": "PERMIT",
          "communities": [
            "string",
            "string",
            "string"
          ],
          "internet": true,
          "noAdvertise": false,
          "noExport": true,
          "type": "standardcommunityentry"
        },
        {
          "action": "DENY",
          "communities": [
            "string",
            "string",
            "string",
            "string",
            "string",
            "string",
            "string",
            "string",
            "string"
          ],
          "internet": true,
          "noAdvertise": false,
          "noExport": true,
          "type": "standardcommunityentry"
        }
      ],
      "id": "string",
      "type": "standardcommunitylist",
      "links": {
        "self": "string"
      }
    },
    {
      "version": "string",
      "name": "string",
      "description": "string",
      "entries": [
        {
          "action": "DENY",
          "communities": [
            "string",
            "string",
            "string",
            "string",
            "string"
          ],
          "internet": true,
          "noAdvertise": true,
          "noExport": false,
          "type": "standardcommunityentry"
        },
        {
          "action": "PERMIT",
          "communities": [
            "string",
            "string",
            "string",
            "string",
            "string",
            "string",
            "string",
            "string",
            "string"
          ],
          "internet": false,
          "noAdvertise": false,
          "noExport": true,
          "type": "standardcommunityentry"
        },
        {
          "action": "PERMIT",
          "communities": [
            "string",
            "string",
            "string",
            "string",
            "string"
          ],
          "internet": true,
          "noAdvertise": true,
          "noExport": true,
          "type": "standardcommunityentry"
        },
        {
          "action": "DENY",
          "communities": [
            "string",
            "string",
            "string",
            "string",
            "string",
            "string",
            "string",
            "string",
            "string",
            "string"
          ],
          "internet": true,
          "noAdvertise": false,
          "noExport": false,
          "type": "standardcommunityentry"
        },
        {
          "action": "DENY",
          "communities": [
            "string",
            "string",
            "string"
          ],
          "internet": false,
          "noAdvertise": false,
          "noExport": false,
          "type": "standardcommunityentry"
        },
        {
          "action": "DENY",
          "communities": [
            "string",
            "string",
            "string",
            "string"
          ],
          "internet": false,
          "noAdvertise": false,
          "noExport": false,
          "type": "standardcommunityentry"
        },
        {
          "action": "DENY",
          "communities": [
            "string",
            "string",
            "string",
            "string",
            "string",
            "string"
          ],
          "internet": false,
          "noAdvertise": false,
          "noExport": true,
          "type": "standardcommunityentry"
        }
      ],
      "id": "string",
      "type": "standardcommunitylist",
      "links": {
        "self": "string"
      }
    },
    {
      "version": "string",
      "name": "string",
      "description": "string",
      "entries": [
        {
          "action": "DENY",
          "communities": [
            "string",
            "string",
            "string",
            "string",
            "string",
            "string",
            "string",
            "string"
          ],
          "internet": false,
          "noAdvertise": true,
          "noExport": true,
          "type": "standardcommunityentry"
        },
        {
          "action": "PERMIT",
          "communities": [
            "string"
          ],
          "internet": true,
          "noAdvertise": true,
          "noExport": false,
          "type": "standardcommunityentry"
        },
        {
          "action": "DENY",
          "communities": [
            "string",
            "string",
            "string",
            "string",
            "string",
            "string",
            "string",
            "string"
          ],
          "internet": false,
          "noAdvertise": true,
          "noExport": false,
          "type": "standardcommunityentry"
        },
        {
          "action": "PERMIT",
          "communities": [
            "string",
            "string",
            "string",
            "string",
            "string",
            "string",
            "string",
            "string",
            "string",
            "string"
          ],
          "internet": false,
          "noAdvertise": false,
          "noExport": false,
          "type": "standardcommunityentry"
        },
        {
          "action": "DENY",
          "communities": [
            "string"
          ],
          "internet": true,
          "noAdvertise": false,
          "noExport": false,
          "type": "standardcommunityentry"
        },
        {
          "action": "PERMIT",
          "communities": [
            "string",
            "string",
            "string",
            "string",
            "string",
            "string"
          ],
          "internet": true,
          "noAdvertise": true,
          "noExport": true,
          "type": "standardcommunityentry"
        }
      ],
      "id": "string",
      "type": "standardcommunitylist",
      "links": {
        "self": "string"
      }
    }
  ],
  "paging": {
    "prev": [
      "string"
    ],
    "next": [
      "string",
      "string",
      "string",
      "string",
      "string",
      "string",
      "string"
    ],
    "limit": 6,
    "offset": 2,
    "count": 1,
    "pages": 9
  }
}