{
  "items": [
    {
      "version": "string",
      "name": "string",
      "description": "string",
      "iface": {
        "id": "string",
        "type": "string",
        "version": "string",
        "name": "string"
      },
      "networks": [
        {
          "id": "string",
          "type": "string",
          "version": "string",
          "name": "string"
        },
        {
          "id": "string",
          "type": "string",
          "version": "string",
          "name": "string"
        },
        {
          "id": "string",
          "type": "string",
          "version": "string",
          "name": "string"
        },
        {
          "id": "string",
          "type": "string",
          "version": "string",
          "name": "string"
        }
      ],
      "gateway": {
        "id": "string",
        "type": "string",
        "version": "string",
        "name": "string"
      },
      "metricValue": 3,
      "ipType": "IPv4",
      "slaMonitor": {
        "id": "string",
        "type": "string",
        "version": "string",
        "name": "string"
      },
      "rulePosition": 6,
      "id": "string",
      "type": "staticrouteentry",
      "links": {
        "self": "string"
      }
    },
    {
      "version": "string",
      "name": "string",
      "description": "string",
      "iface": {
        "id": "string",
        "type": "string",
        "version": "string",
        "name": "string"
      },
      "networks": [
        {
          "id": "string",
          "type": "string",
          "version": "string",
          "name": "string"
        },
        {
          "id": "string",
          "type": "string",
          "version": "string",
          "name": "string"
        },
        {
          "id": "string",
          "type": "string",
          "version": "string",
          "name": "string"
        },
        {
          "id": "string",
          "type": "string",
          "version": "string",
          "name": "string"
        },
        {
          "id": "string",
          "type": "string",
          "version": "string",
          "name": "string"
        }
      ],
      "gateway": {
        "id": "string",
        "type": "string",
        "version": "string",
        "name": "string"
      },
      "metricValue": 7,
      "ipType": "IPv6",
      "slaMonitor": {
        "id": "string",
        "type": "string",
        "version": "string",
        "name": "string"
      },
      "rulePosition": 4,
      "id": "string",
      "type": "staticrouteentry",
      "links": {
        "self": "string"
      }
    },
    {
      "version": "string",
      "name": "string",
      "description": "string",
      "iface": {
        "id": "string",
        "type": "string",
        "version": "string",
        "name": "string"
      },
      "networks": [
        {
          "id": "string",
          "type": "string",
          "version": "string",
          "name": "string"
        },
        {
          "id": "string",
          "type": "string",
          "version": "string",
          "name": "string"
        },
        {
          "id": "string",
          "type": "string",
          "version": "string",
          "name": "string"
        },
        {
          "id": "string",
          "type": "string",
          "version": "string",
          "name": "string"
        },
        {
          "id": "string",
          "type": "string",
          "version": "string",
          "name": "string"
        },
        {
          "id": "string",
          "type": "string",
          "version": "string",
          "name": "string"
        },
        {
          "id": "string",
          "type": "string",
          "version": "string",
          "name": "string"
        },
        {
          "id": "string",
          "type": "string",
          "version": "string",
          "name": "string"
        }
      ],
      "gateway": {
        "id": "string",
        "type": "string",
        "version": "string",
        "name": "string"
      },
      "metricValue": 4,
      "ipType": "IPv6",
      "slaMonitor": {
        "id": "string",
        "type": "string",
        "version": "string",
        "name": "string"
      },
      "rulePosition": 3,
      "id": "string",
      "type": "staticrouteentry",
      "links": {
        "self": "string"
      }
    },
    {
      "version": "string",
      "name": "string",
      "description": "string",
      "iface": {
        "id": "string",
        "type": "string",
        "version": "string",
        "name": "string"
      },
      "networks": [
        {
          "id": "string",
          "type": "string",
          "version": "string",
          "name": "string"
        }
      ],
      "gateway": {
        "id": "string",
        "type": "string",
        "version": "string",
        "name": "string"
      },
      "metricValue": 7,
      "ipType": "IPv6",
      "slaMonitor": {
        "id": "string",
        "type": "string",
        "version": "string",
        "name": "string"
      },
      "rulePosition": 6,
      "id": "string",
      "type": "staticrouteentry",
      "links": {
        "self": "string"
      }
    }
  ],
  "paging": {
    "prev": [
      "string",
      "string",
      "string"
    ],
    "next": [
      "string",
      "string",
      "string",
      "string",
      "string"
    ],
    "limit": 10,
    "offset": 6,
    "count": 4,
    "pages": 6
  }
}