{
  "items": [
    {
      "version": "string",
      "name": "string",
      "pollTimer": 10,
      "expiryEntryTimer": 5,
      "dnsServerGroup": {
        "id": "string",
        "type": "string",
        "version": "string",
        "name": "string"
      },
      "id": "string",
      "interfaces": [
        {
          "id": "string",
          "type": "string",
          "version": "string",
          "name": "string"
        },
        {
          "id": "string",
          "type": "string",
          "version": "string",
          "name": "string"
        },
        {
          "id": "string",
          "type": "string",
          "version": "string",
          "name": "string"
        },
        {
          "id": "string",
          "type": "string",
          "version": "string",
          "name": "string"
        }
      ],
      "type": "datadnssettings",
      "links": {
        "self": "string"
      }
    }
  ],
  "paging": {
    "prev": [
      "string",
      "string",
      "string",
      "string"
    ],
    "next": [
      "string",
      "string",
      "string",
      "string"
    ],
    "limit": 5,
    "offset": 4,
    "count": 3,
    "pages": 3
  }
}