{
  "version": "string",
  "name": "string",
  "enabled": false,
  "lifeTime": 1,
  "priority": 5,
  "encryptionTypes": [
    "AES_GCM192",
    "DES",
    "NULL"
  ],
  "groupTypes": [
    "GROUP14",
    "GROUP16",
    "GROUP19",
    "GROUP20",
    "GROUP21",
    "GROUP5"
  ],
  "integrityTypes": [
    "SHA256",
    "NULL",
    "SHA256",
    "NULL",
    "SHA"
  ],
  "prfTypes": [
    "SHA",
    "SHA256",
    "SHA",
    "SHA512",
    "SHA",
    "MD5",
    "MD5",
    "SHA384"
  ],
  "cryptoRestricted": false,
  "summaryLabel": "string",
  "id": "string",
  "isSystemDefined": false,
  "type": "ikevtwopolicy",
  "links": {
    "self": "string"
  }
}