{
  "version": "string",
  "name": "string",
  "consoleLogFilter": {
    "loggingEnabled": false,
    "severityLogLevel": "CRITICAL",
    "type": "consolelogfilter"
  },
  "syslogServerLogFilter": {
    "dataLogging": {
      "loggingEnabled": false,
      "severityLogLevel": "EMERGENCY",
      "syslogServers": [
        {
          "id": "string",
          "type": "string",
          "version": "string",
          "name": "string"
        },
        {
          "id": "string",
          "type": "string",
          "version": "string",
          "name": "string"
        },
        {
          "id": "string",
          "type": "string",
          "version": "string",
          "name": "string"
        },
        {
          "id": "string",
          "type": "string",
          "version": "string",
          "name": "string"
        }
      ],
      "platformLogLevel": "ALERT",
      "customList": {
        "id": "string",
        "type": "string",
        "version": "string",
        "name": "string"
      },
      "type": "datasyslogserverlogging"
    },
    "fileMalwareLogging": {
      "loggingEnabled": true,
      "syslogServer": {
        "id": "string",
        "type": "string",
        "version": "string",
        "name": "string"
      },
      "severityLogLevel": "EMERGENCY",
      "type": "filemalwaresyslogserverlogging"
    },
    "type": "syslogserverlogfilter"
  },
  "bufferedLogging": {
    "loggingEnabled": true,
    "logLevel": "EMERGENCY",
    "customList": {
      "id": "string",
      "type": "string",
      "version": "string",
      "name": "string"
    },
    "bufferSize": 9,
    "type": "bufferedlogging"
  },
  "deviceLoggingEnabled": false,
  "id": "string",
  "type": "devicelogsettings",
  "links": {
    "self": "string"
  }
}