{
  "links": {
    "self": "/fmc_config/v1/domain/default/object/ikev2policies?expanded=true"
  },
  "items": [
    {
      "links": {
        "self": "https://<fmc_url>/api/fmc_config/v1/domain/e276abec-e0f2-11e3-8169-6d9ed49b625f/object/ikev2policies/005056A9-5C7D-0ed3-0000-000000000400"
      },
      "priority": 10,
      "type": "Ikev2Policy",
      "lifetimeInSeconds": 86400,
      "encryptionAlgorithms": [
        "AES-GCM",
        "AES-GCM-192",
        "AES-GCM-256"
      ],
      "integrityAlgorithms": [
        "NULL"
      ],
      "prfIntegrityAlgorithms": [
        "SHA",
        "SHA-256",
        "SHA-384",
        "SHA-512"
      ],
      "diffieHellmanGroups": [
        5,
        14,
        19,
        20,
        21
      ],
      "name": "AES-GCM-NULL-SHA",
      "description": " ",
      "id": "005056A9-5C7D-0ed3-0000-000000000400"
    },
    {
      "links": {
        "self": "https://<fmc_url>/api/fmc_config/v1/domain/e276abec-e0f2-11e3-8169-6d9ed49b625f/object/ikev2policies/005056A9-5C7D-0ed3-0000-000000000401"
      },
      "priority": 20,
      "type": "Ikev2Policy",
      "lifetimeInSeconds": 86400,
      "encryptionAlgorithms": [
        "AES",
        "AES-192",
        "AES-256"
      ],
      "integrityAlgorithms": [
        "SHA",
        "SHA-256",
        "SHA-384",
        "SHA-512"
      ],
      "prfIntegrityAlgorithms": [
        "SHA",
        "SHA-256",
        "SHA-384",
        "SHA-512"
      ],
      "diffieHellmanGroups": [
        5,
        14,
        20,
        21,
        24
      ],
      "name": "AES-SHA-SHA",
      "description": " ",
      "id": "005056A9-5C7D-0ed3-0000-000000000401"
    },
    {
      "links": {
        "self": "https://<fmc_url>/api/fmc_config/v1/domain/e276abec-e0f2-11e3-8169-6d9ed49b625f/object/ikev2policies/005056A9-5C7D-0ed3-0000-081604378664"
      },
      "priority": 10,
      "type": "Ikev2Policy",
      "lifetimeInSeconds": 86400,
      "encryptionAlgorithms": [
        "AES-GCM",
        "AES-GCM-192",
        "AES-GCM-256"
      ],
      "integrityAlgorithms": [
        "NULL"
      ],
      "prfIntegrityAlgorithms": [
        "SHA",
        "SHA-256",
        "SHA-384",
        "SHA-512"
      ],
      "diffieHellmanGroups": [
        5,
        14,
        19,
        20,
        21
      ],
      "name": "api_ike2",
      "description": " ",
      "id": "005056A9-5C7D-0ed3-0000-081604378664"
    },
    {
      "links": {
        "self": "https://<fmc_url>/api/fmc_config/v1/domain/e276abec-e0f2-11e3-8169-6d9ed49b625f/object/ikev2policies/005056A9-5C7D-0ed3-0000-000000000402"
      },
      "priority": 80,
      "type": "Ikev2Policy",
      "lifetimeInSeconds": 86400,
      "encryptionAlgorithms": [
        "DES"
      ],
      "integrityAlgorithms": [
        "SHA"
      ],
      "prfIntegrityAlgorithms": [
        "SHA"
      ],
      "diffieHellmanGroups": [
        5
      ],
      "name": "DES-SHA-SHA",
      "description": " ",
      "id": "005056A9-5C7D-0ed3-0000-000000000402"
    }
  ],
  "paging": {
    "offset": 0,
    "limit": 4,
    "count": 4,
    "pages": 1
  },
  "expectStatus": 200,
  "expectHeaderContains": [
    {
      "content-type": "application/json"
    }
  ]
}