{
  "id": "<failover_interface_mac-address_uuid>",
  "type": "FailoverInterfaceMACAddressConfig",
  "physicalInterface": {
    "id": "<uuid>",
    "type": "PhysicalInterface",
    "enabled": false,
    "MTU": 1500,
    "managementOnly": false,
    "name": "GigabitEthernet0/0"
  },
  "failoverActiveMac": "0050.56a9.603c",
  "failoverStandbyMac": "0050.56a9.603d"
}