{
  "links": {
    "parent": "string",
    "self": "string"
  },
  "paging": {
    "pages": 5,
    "offset": 5,
    "limit": 3,
    "count": 8
  },
  "items": [
    {
      "metadata": {
        "lastUser": {
          "name": "string",
          "links": {
            "parent": "string",
            "self": "string"
          },
          "id": "string",
          "type": "string"
        },
        "domain": {
          "name": "string",
          "links": {
            "parent": "string",
            "self": "string"
          },
          "id": "string",
          "type": "string"
        },
        "readOnly": {
          "reason": "DOMAIN",
          "state": false
        },
        "timestamp": 7
      },
      "objects": [
        {
          "metadata": {
            "lastUser": {
              "name": "string",
              "links": {},
              "id": "string",
              "type": "string"
            },
            "domain": {
              "name": "string",
              "links": {},
              "id": "string",
              "type": "string"
            },
            "readOnly": {
              "reason": {},
              "state": false
            },
            "timestamp": 9
          },
          "overridable": true,
          "name": "string",
          "description": "string",
          "links": {
            "parent": "string",
            "self": "string"
          },
          "overrides": {
            "parent": {
              "name": "string",
              "links": {},
              "id": "string",
              "type": "string"
            },
            "target": {
              "name": "string",
              "links": {},
              "id": "string",
              "type": "string"
            }
          },
          "id": "string",
          "type": "string",
          "version": "string"
        },
        {
          "metadata": {
            "lastUser": {
              "name": "string",
              "links": {},
              "id": "string",
              "type": "string"
            },
            "domain": {
              "name": "string",
              "links": {},
              "id": "string",
              "type": "string"
            },
            "readOnly": {
              "reason": {},
              "state": true
            },
            "timestamp": 9
          },
          "overridable": false,
          "name": "string",
          "description": "string",
          "links": {
            "parent": "string",
            "self": "string"
          },
          "overrides": {
            "parent": {
              "name": "string",
              "links": {},
              "id": "string",
              "type": "string"
            },
            "target": {
              "name": "string",
              "links": {},
              "id": "string",
              "type": "string"
            }
          },
          "id": "string",
          "type": "string",
          "version": "string"
        },
        {
          "metadata": {
            "lastUser": {
              "name": "string",
              "links": {},
              "id": "string",
              "type": "string"
            },
            "domain": {
              "name": "string",
              "links": {},
              "id": "string",
              "type": "string"
            },
            "readOnly": {
              "reason": {},
              "state": true
            },
            "timestamp": 7
          },
          "overridable": false,
          "name": "string",
          "description": "string",
          "links": {
            "parent": "string",
            "self": "string"
          },
          "overrides": {
            "parent": {
              "name": "string",
              "links": {},
              "id": "string",
              "type": "string"
            },
            "target": {
              "name": "string",
              "links": {},
              "id": "string",
              "type": "string"
            }
          },
          "id": "string",
          "type": "string",
          "version": "string"
        },
        {
          "metadata": {
            "lastUser": {
              "name": "string",
              "links": {},
              "id": "string",
              "type": "string"
            },
            "domain": {
              "name": "string",
              "links": {},
              "id": "string",
              "type": "string"
            },
            "readOnly": {
              "reason": {},
              "state": false
            },
            "timestamp": 10
          },
          "overridable": false,
          "name": "string",
          "description": "string",
          "links": {
            "parent": "string",
            "self": "string"
          },
          "overrides": {
            "parent": {
              "name": "string",
              "links": {},
              "id": "string",
              "type": "string"
            },
            "target": {
              "name": "string",
              "links": {},
              "id": "string",
              "type": "string"
            }
          },
          "id": "string",
          "type": "string",
          "version": "string"
        },
        {
          "metadata": {
            "lastUser": {
              "name": "string",
              "links": {},
              "id": "string",
              "type": "string"
            },
            "domain": {
              "name": "string",
              "links": {},
              "id": "string",
              "type": "string"
            },
            "readOnly": {
              "reason": {},
              "state": true
            },
            "timestamp": 5
          },
          "overridable": false,
          "name": "string",
          "description": "string",
          "links": {
            "parent": "string",
            "self": "string"
          },
          "overrides": {
            "parent": {
              "name": "string",
              "links": {},
              "id": "string",
              "type": "string"
            },
            "target": {
              "name": "string",
              "links": {},
              "id": "string",
              "type": "string"
            }
          },
          "id": "string",
          "type": "string",
          "version": "string"
        },
        {
          "metadata": {
            "lastUser": {
              "name": "string",
              "links": {},
              "id": "string",
              "type": "string"
            },
            "domain": {
              "name": "string",
              "links": {},
              "id": "string",
              "type": "string"
            },
            "readOnly": {
              "reason": {},
              "state": true
            },
            "timestamp": 7
          },
          "overridable": false,
          "name": "string",
          "description": "string",
          "links": {
            "parent": "string",
            "self": "string"
          },
          "overrides": {
            "parent": {
              "name": "string",
              "links": {},
              "id": "string",
              "type": "string"
            },
            "target": {
              "name": "string",
              "links": {},
              "id": "string",
              "type": "string"
            }
          },
          "id": "string",
          "type": "string",
          "version": "string"
        },
        {
          "metadata": {
            "lastUser": {
              "name": "string",
              "links": {},
              "id": "string",
              "type": "string"
            },
            "domain": {
              "name": "string",
              "links": {},
              "id": "string",
              "type": "string"
            },
            "readOnly": {
              "reason": {},
              "state": false
            },
            "timestamp": 1
          },
          "overridable": true,
          "name": "string",
          "description": "string",
          "links": {
            "parent": "string",
            "self": "string"
          },
          "overrides": {
            "parent": {
              "name": "string",
              "links": {},
              "id": "string",
              "type": "string"
            },
            "target": {
              "name": "string",
              "links": {},
              "id": "string",
              "type": "string"
            }
          },
          "id": "string",
          "type": "string",
          "version": "string"
        },
        {
          "metadata": {
            "lastUser": {
              "name": "string",
              "links": {},
              "id": "string",
              "type": "string"
            },
            "domain": {
              "name": "string",
              "links": {},
              "id": "string",
              "type": "string"
            },
            "readOnly": {
              "reason": {},
              "state": true
            },
            "timestamp": 6
          },
          "overridable": true,
          "name": "string",
          "description": "string",
          "links": {
            "parent": "string",
            "self": "string"
          },
          "overrides": {
            "parent": {
              "name": "string",
              "links": {},
              "id": "string",
              "type": "string"
            },
            "target": {
              "name": "string",
              "links": {},
              "id": "string",
              "type": "string"
            }
          },
          "id": "string",
          "type": "string",
          "version": "string"
        },
        {
          "metadata": {
            "lastUser": {
              "name": "string",
              "links": {},
              "id": "string",
              "type": "string"
            },
            "domain": {
              "name": "string",
              "links": {},
              "id": "string",
              "type": "string"
            },
            "readOnly": {
              "reason": {},
              "state": true
            },
            "timestamp": 7
          },
          "overridable": false,
          "name": "string",
          "description": "string",
          "links": {
            "parent": "string",
            "self": "string"
          },
          "overrides": {
            "parent": {
              "name": "string",
              "links": {},
              "id": "string",
              "type": "string"
            },
            "target": {
              "name": "string",
              "links": {},
              "id": "string",
              "type": "string"
            }
          },
          "id": "string",
          "type": "string",
          "version": "string"
        }
      ],
      "literals": [
        {
          "type": "string",
          "value": "string"
        },
        {
          "type": "string",
          "value": "string"
        },
        {
          "type": "string",
          "value": "string"
        },
        {
          "type": "string",
          "value": "string"
        },
        {
          "type": "string",
          "value": "string"
        }
      ],
      "overridable": false,
      "name": "string",
      "description": "string",
      "links": {
        "parent": "string",
        "self": "string"
      },
      "overrides": {
        "parent": {
          "name": "string",
          "links": {},
          "id": "string",
          "type": "string"
        },
        "target": {
          "name": "string",
          "links": {},
          "id": "string",
          "type": "string"
        }
      },
      "id": "string",
      "type": "string",
      "version": "string",
      "overrideTargetId": "string"
    },
    {
      "metadata": {
        "lastUser": {
          "name": "string",
          "links": {
            "parent": "string",
            "self": "string"
          },
          "id": "string",
          "type": "string"
        },
        "domain": {
          "name": "string",
          "links": {
            "parent": "string",
            "self": "string"
          },
          "id": "string",
          "type": "string"
        },
        "readOnly": {
          "reason": "RBAC",
          "state": false
        },
        "timestamp": 6
      },
      "objects": [
        {
          "metadata": {
            "lastUser": {
              "name": "string",
              "links": {},
              "id": "string",
              "type": "string"
            },
            "domain": {
              "name": "string",
              "links": {},
              "id": "string",
              "type": "string"
            },
            "readOnly": {
              "reason": {},
              "state": false
            },
            "timestamp": 5
          },
          "overridable": false,
          "name": "string",
          "description": "string",
          "links": {
            "parent": "string",
            "self": "string"
          },
          "overrides": {
            "parent": {
              "name": "string",
              "links": {},
              "id": "string",
              "type": "string"
            },
            "target": {
              "name": "string",
              "links": {},
              "id": "string",
              "type": "string"
            }
          },
          "id": "string",
          "type": "string",
          "version": "string"
        }
      ],
      "literals": [
        {
          "type": "string",
          "value": "string"
        },
        {
          "type": "string",
          "value": "string"
        }
      ],
      "overridable": true,
      "name": "string",
      "description": "string",
      "links": {
        "parent": "string",
        "self": "string"
      },
      "overrides": {
        "parent": {
          "name": "string",
          "links": {},
          "id": "string",
          "type": "string"
        },
        "target": {
          "name": "string",
          "links": {},
          "id": "string",
          "type": "string"
        }
      },
      "id": "string",
      "type": "string",
      "version": "string",
      "overrideTargetId": "string"
    },
    {
      "metadata": {
        "lastUser": {
          "name": "string",
          "links": {
            "parent": "string",
            "self": "string"
          },
          "id": "string",
          "type": "string"
        },
        "domain": {
          "name": "string",
          "links": {
            "parent": "string",
            "self": "string"
          },
          "id": "string",
          "type": "string"
        },
        "readOnly": {
          "reason": "SYSTEM",
          "state": false
        },
        "timestamp": 9
      },
      "objects": [
        {
          "metadata": {
            "lastUser": {
              "name": "string",
              "links": {},
              "id": "string",
              "type": "string"
            },
            "domain": {
              "name": "string",
              "links": {},
              "id": "string",
              "type": "string"
            },
            "readOnly": {
              "reason": {},
              "state": false
            },
            "timestamp": 5
          },
          "overridable": true,
          "name": "string",
          "description": "string",
          "links": {
            "parent": "string",
            "self": "string"
          },
          "overrides": {
            "parent": {
              "name": "string",
              "links": {},
              "id": "string",
              "type": "string"
            },
            "target": {
              "name": "string",
              "links": {},
              "id": "string",
              "type": "string"
            }
          },
          "id": "string",
          "type": "string",
          "version": "string"
        },
        {
          "metadata": {
            "lastUser": {
              "name": "string",
              "links": {},
              "id": "string",
              "type": "string"
            },
            "domain": {
              "name": "string",
              "links": {},
              "id": "string",
              "type": "string"
            },
            "readOnly": {
              "reason": {},
              "state": true
            },
            "timestamp": 3
          },
          "overridable": true,
          "name": "string",
          "description": "string",
          "links": {
            "parent": "string",
            "self": "string"
          },
          "overrides": {
            "parent": {
              "name": "string",
              "links": {},
              "id": "string",
              "type": "string"
            },
            "target": {
              "name": "string",
              "links": {},
              "id": "string",
              "type": "string"
            }
          },
          "id": "string",
          "type": "string",
          "version": "string"
        },
        {
          "metadata": {
            "lastUser": {
              "name": "string",
              "links": {},
              "id": "string",
              "type": "string"
            },
            "domain": {
              "name": "string",
              "links": {},
              "id": "string",
              "type": "string"
            },
            "readOnly": {
              "reason": {},
              "state": true
            },
            "timestamp": 7
          },
          "overridable": false,
          "name": "string",
          "description": "string",
          "links": {
            "parent": "string",
            "self": "string"
          },
          "overrides": {
            "parent": {
              "name": "string",
              "links": {},
              "id": "string",
              "type": "string"
            },
            "target": {
              "name": "string",
              "links": {},
              "id": "string",
              "type": "string"
            }
          },
          "id": "string",
          "type": "string",
          "version": "string"
        },
        {
          "metadata": {
            "lastUser": {
              "name": "string",
              "links": {},
              "id": "string",
              "type": "string"
            },
            "domain": {
              "name": "string",
              "links": {},
              "id": "string",
              "type": "string"
            },
            "readOnly": {
              "reason": {},
              "state": true
            },
            "timestamp": 8
          },
          "overridable": true,
          "name": "string",
          "description": "string",
          "links": {
            "parent": "string",
            "self": "string"
          },
          "overrides": {
            "parent": {
              "name": "string",
              "links": {},
              "id": "string",
              "type": "string"
            },
            "target": {
              "name": "string",
              "links": {},
              "id": "string",
              "type": "string"
            }
          },
          "id": "string",
          "type": "string",
          "version": "string"
        },
        {
          "metadata": {
            "lastUser": {
              "name": "string",
              "links": {},
              "id": "string",
              "type": "string"
            },
            "domain": {
              "name": "string",
              "links": {},
              "id": "string",
              "type": "string"
            },
            "readOnly": {
              "reason": {},
              "state": false
            },
            "timestamp": 2
          },
          "overridable": false,
          "name": "string",
          "description": "string",
          "links": {
            "parent": "string",
            "self": "string"
          },
          "overrides": {
            "parent": {
              "name": "string",
              "links": {},
              "id": "string",
              "type": "string"
            },
            "target": {
              "name": "string",
              "links": {},
              "id": "string",
              "type": "string"
            }
          },
          "id": "string",
          "type": "string",
          "version": "string"
        }
      ],
      "literals": [
        {
          "type": "string",
          "value": "string"
        }
      ],
      "overridable": true,
      "name": "string",
      "description": "string",
      "links": {
        "parent": "string",
        "self": "string"
      },
      "overrides": {
        "parent": {
          "name": "string",
          "links": {},
          "id": "string",
          "type": "string"
        },
        "target": {
          "name": "string",
          "links": {},
          "id": "string",
          "type": "string"
        }
      },
      "id": "string",
      "type": "string",
      "version": "string",
      "overrideTargetId": "string"
    },
    {
      "metadata": {
        "lastUser": {
          "name": "string",
          "links": {
            "parent": "string",
            "self": "string"
          },
          "id": "string",
          "type": "string"
        },
        "domain": {
          "name": "string",
          "links": {
            "parent": "string",
            "self": "string"
          },
          "id": "string",
          "type": "string"
        },
        "readOnly": {
          "reason": "RBAC",
          "state": false
        },
        "timestamp": 8
      },
      "objects": [
        {
          "metadata": {
            "lastUser": {
              "name": "string",
              "links": {},
              "id": "string",
              "type": "string"
            },
            "domain": {
              "name": "string",
              "links": {},
              "id": "string",
              "type": "string"
            },
            "readOnly": {
              "reason": {},
              "state": false
            },
            "timestamp": 6
          },
          "overridable": true,
          "name": "string",
          "description": "string",
          "links": {
            "parent": "string",
            "self": "string"
          },
          "overrides": {
            "parent": {
              "name": "string",
              "links": {},
              "id": "string",
              "type": "string"
            },
            "target": {
              "name": "string",
              "links": {},
              "id": "string",
              "type": "string"
            }
          },
          "id": "string",
          "type": "string",
          "version": "string"
        },
        {
          "metadata": {
            "lastUser": {
              "name": "string",
              "links": {},
              "id": "string",
              "type": "string"
            },
            "domain": {
              "name": "string",
              "links": {},
              "id": "string",
              "type": "string"
            },
            "readOnly": {
              "reason": {},
              "state": true
            },
            "timestamp": 5
          },
          "overridable": true,
          "name": "string",
          "description": "string",
          "links": {
            "parent": "string",
            "self": "string"
          },
          "overrides": {
            "parent": {
              "name": "string",
              "links": {},
              "id": "string",
              "type": "string"
            },
            "target": {
              "name": "string",
              "links": {},
              "id": "string",
              "type": "string"
            }
          },
          "id": "string",
          "type": "string",
          "version": "string"
        },
        {
          "metadata": {
            "lastUser": {
              "name": "string",
              "links": {},
              "id": "string",
              "type": "string"
            },
            "domain": {
              "name": "string",
              "links": {},
              "id": "string",
              "type": "string"
            },
            "readOnly": {
              "reason": {},
              "state": true
            },
            "timestamp": 2
          },
          "overridable": true,
          "name": "string",
          "description": "string",
          "links": {
            "parent": "string",
            "self": "string"
          },
          "overrides": {
            "parent": {
              "name": "string",
              "links": {},
              "id": "string",
              "type": "string"
            },
            "target": {
              "name": "string",
              "links": {},
              "id": "string",
              "type": "string"
            }
          },
          "id": "string",
          "type": "string",
          "version": "string"
        },
        {
          "metadata": {
            "lastUser": {
              "name": "string",
              "links": {},
              "id": "string",
              "type": "string"
            },
            "domain": {
              "name": "string",
              "links": {},
              "id": "string",
              "type": "string"
            },
            "readOnly": {
              "reason": {},
              "state": true
            },
            "timestamp": 5
          },
          "overridable": true,
          "name": "string",
          "description": "string",
          "links": {
            "parent": "string",
            "self": "string"
          },
          "overrides": {
            "parent": {
              "name": "string",
              "links": {},
              "id": "string",
              "type": "string"
            },
            "target": {
              "name": "string",
              "links": {},
              "id": "string",
              "type": "string"
            }
          },
          "id": "string",
          "type": "string",
          "version": "string"
        },
        {
          "metadata": {
            "lastUser": {
              "name": "string",
              "links": {},
              "id": "string",
              "type": "string"
            },
            "domain": {
              "name": "string",
              "links": {},
              "id": "string",
              "type": "string"
            },
            "readOnly": {
              "reason": {},
              "state": false
            },
            "timestamp": 1
          },
          "overridable": true,
          "name": "string",
          "description": "string",
          "links": {
            "parent": "string",
            "self": "string"
          },
          "overrides": {
            "parent": {
              "name": "string",
              "links": {},
              "id": "string",
              "type": "string"
            },
            "target": {
              "name": "string",
              "links": {},
              "id": "string",
              "type": "string"
            }
          },
          "id": "string",
          "type": "string",
          "version": "string"
        }
      ],
      "literals": [
        {
          "type": "string",
          "value": "string"
        },
        {
          "type": "string",
          "value": "string"
        },
        {
          "type": "string",
          "value": "string"
        },
        {
          "type": "string",
          "value": "string"
        },
        {
          "type": "string",
          "value": "string"
        },
        {
          "type": "string",
          "value": "string"
        },
        {
          "type": "string",
          "value": "string"
        },
        {
          "type": "string",
          "value": "string"
        },
        {
          "type": "string",
          "value": "string"
        },
        {
          "type": "string",
          "value": "string"
        }
      ],
      "overridable": true,
      "name": "string",
      "description": "string",
      "links": {
        "parent": "string",
        "self": "string"
      },
      "overrides": {
        "parent": {
          "name": "string",
          "links": {},
          "id": "string",
          "type": "string"
        },
        "target": {
          "name": "string",
          "links": {},
          "id": "string",
          "type": "string"
        }
      },
      "id": "string",
      "type": "string",
      "version": "string",
      "overrideTargetId": "string"
    },
    {
      "metadata": {
        "lastUser": {
          "name": "string",
          "links": {
            "parent": "string",
            "self": "string"
          },
          "id": "string",
          "type": "string"
        },
        "domain": {
          "name": "string",
          "links": {
            "parent": "string",
            "self": "string"
          },
          "id": "string",
          "type": "string"
        },
        "readOnly": {
          "reason": "SYSTEM",
          "state": true
        },
        "timestamp": 4
      },
      "objects": [
        {
          "metadata": {
            "lastUser": {
              "name": "string",
              "links": {},
              "id": "string",
              "type": "string"
            },
            "domain": {
              "name": "string",
              "links": {},
              "id": "string",
              "type": "string"
            },
            "readOnly": {
              "reason": {},
              "state": true
            },
            "timestamp": 2
          },
          "overridable": true,
          "name": "string",
          "description": "string",
          "links": {
            "parent": "string",
            "self": "string"
          },
          "overrides": {
            "parent": {
              "name": "string",
              "links": {},
              "id": "string",
              "type": "string"
            },
            "target": {
              "name": "string",
              "links": {},
              "id": "string",
              "type": "string"
            }
          },
          "id": "string",
          "type": "string",
          "version": "string"
        },
        {
          "metadata": {
            "lastUser": {
              "name": "string",
              "links": {},
              "id": "string",
              "type": "string"
            },
            "domain": {
              "name": "string",
              "links": {},
              "id": "string",
              "type": "string"
            },
            "readOnly": {
              "reason": {},
              "state": false
            },
            "timestamp": 7
          },
          "overridable": false,
          "name": "string",
          "description": "string",
          "links": {
            "parent": "string",
            "self": "string"
          },
          "overrides": {
            "parent": {
              "name": "string",
              "links": {},
              "id": "string",
              "type": "string"
            },
            "target": {
              "name": "string",
              "links": {},
              "id": "string",
              "type": "string"
            }
          },
          "id": "string",
          "type": "string",
          "version": "string"
        },
        {
          "metadata": {
            "lastUser": {
              "name": "string",
              "links": {},
              "id": "string",
              "type": "string"
            },
            "domain": {
              "name": "string",
              "links": {},
              "id": "string",
              "type": "string"
            },
            "readOnly": {
              "reason": {},
              "state": true
            },
            "timestamp": 4
          },
          "overridable": true,
          "name": "string",
          "description": "string",
          "links": {
            "parent": "string",
            "self": "string"
          },
          "overrides": {
            "parent": {
              "name": "string",
              "links": {},
              "id": "string",
              "type": "string"
            },
            "target": {
              "name": "string",
              "links": {},
              "id": "string",
              "type": "string"
            }
          },
          "id": "string",
          "type": "string",
          "version": "string"
        },
        {
          "metadata": {
            "lastUser": {
              "name": "string",
              "links": {},
              "id": "string",
              "type": "string"
            },
            "domain": {
              "name": "string",
              "links": {},
              "id": "string",
              "type": "string"
            },
            "readOnly": {
              "reason": {},
              "state": false
            },
            "timestamp": 7
          },
          "overridable": true,
          "name": "string",
          "description": "string",
          "links": {
            "parent": "string",
            "self": "string"
          },
          "overrides": {
            "parent": {
              "name": "string",
              "links": {},
              "id": "string",
              "type": "string"
            },
            "target": {
              "name": "string",
              "links": {},
              "id": "string",
              "type": "string"
            }
          },
          "id": "string",
          "type": "string",
          "version": "string"
        },
        {
          "metadata": {
            "lastUser": {
              "name": "string",
              "links": {},
              "id": "string",
              "type": "string"
            },
            "domain": {
              "name": "string",
              "links": {},
              "id": "string",
              "type": "string"
            },
            "readOnly": {
              "reason": {},
              "state": true
            },
            "timestamp": 4
          },
          "overridable": true,
          "name": "string",
          "description": "string",
          "links": {
            "parent": "string",
            "self": "string"
          },
          "overrides": {
            "parent": {
              "name": "string",
              "links": {},
              "id": "string",
              "type": "string"
            },
            "target": {
              "name": "string",
              "links": {},
              "id": "string",
              "type": "string"
            }
          },
          "id": "string",
          "type": "string",
          "version": "string"
        },
        {
          "metadata": {
            "lastUser": {
              "name": "string",
              "links": {},
              "id": "string",
              "type": "string"
            },
            "domain": {
              "name": "string",
              "links": {},
              "id": "string",
              "type": "string"
            },
            "readOnly": {
              "reason": {},
              "state": true
            },
            "timestamp": 9
          },
          "overridable": false,
          "name": "string",
          "description": "string",
          "links": {
            "parent": "string",
            "self": "string"
          },
          "overrides": {
            "parent": {
              "name": "string",
              "links": {},
              "id": "string",
              "type": "string"
            },
            "target": {
              "name": "string",
              "links": {},
              "id": "string",
              "type": "string"
            }
          },
          "id": "string",
          "type": "string",
          "version": "string"
        },
        {
          "metadata": {
            "lastUser": {
              "name": "string",
              "links": {},
              "id": "string",
              "type": "string"
            },
            "domain": {
              "name": "string",
              "links": {},
              "id": "string",
              "type": "string"
            },
            "readOnly": {
              "reason": {},
              "state": false
            },
            "timestamp": 2
          },
          "overridable": false,
          "name": "string",
          "description": "string",
          "links": {
            "parent": "string",
            "self": "string"
          },
          "overrides": {
            "parent": {
              "name": "string",
              "links": {},
              "id": "string",
              "type": "string"
            },
            "target": {
              "name": "string",
              "links": {},
              "id": "string",
              "type": "string"
            }
          },
          "id": "string",
          "type": "string",
          "version": "string"
        },
        {
          "metadata": {
            "lastUser": {
              "name": "string",
              "links": {},
              "id": "string",
              "type": "string"
            },
            "domain": {
              "name": "string",
              "links": {},
              "id": "string",
              "type": "string"
            },
            "readOnly": {
              "reason": {},
              "state": false
            },
            "timestamp": 9
          },
          "overridable": false,
          "name": "string",
          "description": "string",
          "links": {
            "parent": "string",
            "self": "string"
          },
          "overrides": {
            "parent": {
              "name": "string",
              "links": {},
              "id": "string",
              "type": "string"
            },
            "target": {
              "name": "string",
              "links": {},
              "id": "string",
              "type": "string"
            }
          },
          "id": "string",
          "type": "string",
          "version": "string"
        },
        {
          "metadata": {
            "lastUser": {
              "name": "string",
              "links": {},
              "id": "string",
              "type": "string"
            },
            "domain": {
              "name": "string",
              "links": {},
              "id": "string",
              "type": "string"
            },
            "readOnly": {
              "reason": {},
              "state": false
            },
            "timestamp": 1
          },
          "overridable": false,
          "name": "string",
          "description": "string",
          "links": {
            "parent": "string",
            "self": "string"
          },
          "overrides": {
            "parent": {
              "name": "string",
              "links": {},
              "id": "string",
              "type": "string"
            },
            "target": {
              "name": "string",
              "links": {},
              "id": "string",
              "type": "string"
            }
          },
          "id": "string",
          "type": "string",
          "version": "string"
        },
        {
          "metadata": {
            "lastUser": {
              "name": "string",
              "links": {},
              "id": "string",
              "type": "string"
            },
            "domain": {
              "name": "string",
              "links": {},
              "id": "string",
              "type": "string"
            },
            "readOnly": {
              "reason": {},
              "state": false
            },
            "timestamp": 10
          },
          "overridable": true,
          "name": "string",
          "description": "string",
          "links": {
            "parent": "string",
            "self": "string"
          },
          "overrides": {
            "parent": {
              "name": "string",
              "links": {},
              "id": "string",
              "type": "string"
            },
            "target": {
              "name": "string",
              "links": {},
              "id": "string",
              "type": "string"
            }
          },
          "id": "string",
          "type": "string",
          "version": "string"
        }
      ],
      "literals": [
        {
          "type": "string",
          "value": "string"
        }
      ],
      "overridable": true,
      "name": "string",
      "description": "string",
      "links": {
        "parent": "string",
        "self": "string"
      },
      "overrides": {
        "parent": {
          "name": "string",
          "links": {},
          "id": "string",
          "type": "string"
        },
        "target": {
          "name": "string",
          "links": {},
          "id": "string",
          "type": "string"
        }
      },
      "id": "string",
      "type": "string",
      "version": "string",
      "overrideTargetId": "string"
    },
    {
      "metadata": {
        "lastUser": {
          "name": "string",
          "links": {
            "parent": "string",
            "self": "string"
          },
          "id": "string",
          "type": "string"
        },
        "domain": {
          "name": "string",
          "links": {
            "parent": "string",
            "self": "string"
          },
          "id": "string",
          "type": "string"
        },
        "readOnly": {
          "reason": "RBAC",
          "state": true
        },
        "timestamp": 4
      },
      "objects": [
        {
          "metadata": {
            "lastUser": {
              "name": "string",
              "links": {},
              "id": "string",
              "type": "string"
            },
            "domain": {
              "name": "string",
              "links": {},
              "id": "string",
              "type": "string"
            },
            "readOnly": {
              "reason": {},
              "state": true
            },
            "timestamp": 3
          },
          "overridable": false,
          "name": "string",
          "description": "string",
          "links": {
            "parent": "string",
            "self": "string"
          },
          "overrides": {
            "parent": {
              "name": "string",
              "links": {},
              "id": "string",
              "type": "string"
            },
            "target": {
              "name": "string",
              "links": {},
              "id": "string",
              "type": "string"
            }
          },
          "id": "string",
          "type": "string",
          "version": "string"
        },
        {
          "metadata": {
            "lastUser": {
              "name": "string",
              "links": {},
              "id": "string",
              "type": "string"
            },
            "domain": {
              "name": "string",
              "links": {},
              "id": "string",
              "type": "string"
            },
            "readOnly": {
              "reason": {},
              "state": false
            },
            "timestamp": 9
          },
          "overridable": true,
          "name": "string",
          "description": "string",
          "links": {
            "parent": "string",
            "self": "string"
          },
          "overrides": {
            "parent": {
              "name": "string",
              "links": {},
              "id": "string",
              "type": "string"
            },
            "target": {
              "name": "string",
              "links": {},
              "id": "string",
              "type": "string"
            }
          },
          "id": "string",
          "type": "string",
          "version": "string"
        },
        {
          "metadata": {
            "lastUser": {
              "name": "string",
              "links": {},
              "id": "string",
              "type": "string"
            },
            "domain": {
              "name": "string",
              "links": {},
              "id": "string",
              "type": "string"
            },
            "readOnly": {
              "reason": {},
              "state": false
            },
            "timestamp": 1
          },
          "overridable": false,
          "name": "string",
          "description": "string",
          "links": {
            "parent": "string",
            "self": "string"
          },
          "overrides": {
            "parent": {
              "name": "string",
              "links": {},
              "id": "string",
              "type": "string"
            },
            "target": {
              "name": "string",
              "links": {},
              "id": "string",
              "type": "string"
            }
          },
          "id": "string",
          "type": "string",
          "version": "string"
        }
      ],
      "literals": [
        {
          "type": "string",
          "value": "string"
        },
        {
          "type": "string",
          "value": "string"
        },
        {
          "type": "string",
          "value": "string"
        },
        {
          "type": "string",
          "value": "string"
        },
        {
          "type": "string",
          "value": "string"
        },
        {
          "type": "string",
          "value": "string"
        },
        {
          "type": "string",
          "value": "string"
        },
        {
          "type": "string",
          "value": "string"
        }
      ],
      "overridable": false,
      "name": "string",
      "description": "string",
      "links": {
        "parent": "string",
        "self": "string"
      },
      "overrides": {
        "parent": {
          "name": "string",
          "links": {},
          "id": "string",
          "type": "string"
        },
        "target": {
          "name": "string",
          "links": {},
          "id": "string",
          "type": "string"
        }
      },
      "id": "string",
      "type": "string",
      "version": "string",
      "overrideTargetId": "string"
    },
    {
      "metadata": {
        "lastUser": {
          "name": "string",
          "links": {
            "parent": "string",
            "self": "string"
          },
          "id": "string",
          "type": "string"
        },
        "domain": {
          "name": "string",
          "links": {
            "parent": "string",
            "self": "string"
          },
          "id": "string",
          "type": "string"
        },
        "readOnly": {
          "reason": "DOMAIN",
          "state": false
        },
        "timestamp": 2
      },
      "objects": [
        {
          "metadata": {
            "lastUser": {
              "name": "string",
              "links": {},
              "id": "string",
              "type": "string"
            },
            "domain": {
              "name": "string",
              "links": {},
              "id": "string",
              "type": "string"
            },
            "readOnly": {
              "reason": {},
              "state": true
            },
            "timestamp": 5
          },
          "overridable": true,
          "name": "string",
          "description": "string",
          "links": {
            "parent": "string",
            "self": "string"
          },
          "overrides": {
            "parent": {
              "name": "string",
              "links": {},
              "id": "string",
              "type": "string"
            },
            "target": {
              "name": "string",
              "links": {},
              "id": "string",
              "type": "string"
            }
          },
          "id": "string",
          "type": "string",
          "version": "string"
        },
        {
          "metadata": {
            "lastUser": {
              "name": "string",
              "links": {},
              "id": "string",
              "type": "string"
            },
            "domain": {
              "name": "string",
              "links": {},
              "id": "string",
              "type": "string"
            },
            "readOnly": {
              "reason": {},
              "state": true
            },
            "timestamp": 4
          },
          "overridable": true,
          "name": "string",
          "description": "string",
          "links": {
            "parent": "string",
            "self": "string"
          },
          "overrides": {
            "parent": {
              "name": "string",
              "links": {},
              "id": "string",
              "type": "string"
            },
            "target": {
              "name": "string",
              "links": {},
              "id": "string",
              "type": "string"
            }
          },
          "id": "string",
          "type": "string",
          "version": "string"
        },
        {
          "metadata": {
            "lastUser": {
              "name": "string",
              "links": {},
              "id": "string",
              "type": "string"
            },
            "domain": {
              "name": "string",
              "links": {},
              "id": "string",
              "type": "string"
            },
            "readOnly": {
              "reason": {},
              "state": true
            },
            "timestamp": 6
          },
          "overridable": true,
          "name": "string",
          "description": "string",
          "links": {
            "parent": "string",
            "self": "string"
          },
          "overrides": {
            "parent": {
              "name": "string",
              "links": {},
              "id": "string",
              "type": "string"
            },
            "target": {
              "name": "string",
              "links": {},
              "id": "string",
              "type": "string"
            }
          },
          "id": "string",
          "type": "string",
          "version": "string"
        },
        {
          "metadata": {
            "lastUser": {
              "name": "string",
              "links": {},
              "id": "string",
              "type": "string"
            },
            "domain": {
              "name": "string",
              "links": {},
              "id": "string",
              "type": "string"
            },
            "readOnly": {
              "reason": {},
              "state": false
            },
            "timestamp": 3
          },
          "overridable": true,
          "name": "string",
          "description": "string",
          "links": {
            "parent": "string",
            "self": "string"
          },
          "overrides": {
            "parent": {
              "name": "string",
              "links": {},
              "id": "string",
              "type": "string"
            },
            "target": {
              "name": "string",
              "links": {},
              "id": "string",
              "type": "string"
            }
          },
          "id": "string",
          "type": "string",
          "version": "string"
        },
        {
          "metadata": {
            "lastUser": {
              "name": "string",
              "links": {},
              "id": "string",
              "type": "string"
            },
            "domain": {
              "name": "string",
              "links": {},
              "id": "string",
              "type": "string"
            },
            "readOnly": {
              "reason": {},
              "state": false
            },
            "timestamp": 2
          },
          "overridable": true,
          "name": "string",
          "description": "string",
          "links": {
            "parent": "string",
            "self": "string"
          },
          "overrides": {
            "parent": {
              "name": "string",
              "links": {},
              "id": "string",
              "type": "string"
            },
            "target": {
              "name": "string",
              "links": {},
              "id": "string",
              "type": "string"
            }
          },
          "id": "string",
          "type": "string",
          "version": "string"
        },
        {
          "metadata": {
            "lastUser": {
              "name": "string",
              "links": {},
              "id": "string",
              "type": "string"
            },
            "domain": {
              "name": "string",
              "links": {},
              "id": "string",
              "type": "string"
            },
            "readOnly": {
              "reason": {},
              "state": false
            },
            "timestamp": 2
          },
          "overridable": false,
          "name": "string",
          "description": "string",
          "links": {
            "parent": "string",
            "self": "string"
          },
          "overrides": {
            "parent": {
              "name": "string",
              "links": {},
              "id": "string",
              "type": "string"
            },
            "target": {
              "name": "string",
              "links": {},
              "id": "string",
              "type": "string"
            }
          },
          "id": "string",
          "type": "string",
          "version": "string"
        },
        {
          "metadata": {
            "lastUser": {
              "name": "string",
              "links": {},
              "id": "string",
              "type": "string"
            },
            "domain": {
              "name": "string",
              "links": {},
              "id": "string",
              "type": "string"
            },
            "readOnly": {
              "reason": {},
              "state": true
            },
            "timestamp": 9
          },
          "overridable": false,
          "name": "string",
          "description": "string",
          "links": {
            "parent": "string",
            "self": "string"
          },
          "overrides": {
            "parent": {
              "name": "string",
              "links": {},
              "id": "string",
              "type": "string"
            },
            "target": {
              "name": "string",
              "links": {},
              "id": "string",
              "type": "string"
            }
          },
          "id": "string",
          "type": "string",
          "version": "string"
        },
        {
          "metadata": {
            "lastUser": {
              "name": "string",
              "links": {},
              "id": "string",
              "type": "string"
            },
            "domain": {
              "name": "string",
              "links": {},
              "id": "string",
              "type": "string"
            },
            "readOnly": {
              "reason": {},
              "state": true
            },
            "timestamp": 10
          },
          "overridable": false,
          "name": "string",
          "description": "string",
          "links": {
            "parent": "string",
            "self": "string"
          },
          "overrides": {
            "parent": {
              "name": "string",
              "links": {},
              "id": "string",
              "type": "string"
            },
            "target": {
              "name": "string",
              "links": {},
              "id": "string",
              "type": "string"
            }
          },
          "id": "string",
          "type": "string",
          "version": "string"
        },
        {
          "metadata": {
            "lastUser": {
              "name": "string",
              "links": {},
              "id": "string",
              "type": "string"
            },
            "domain": {
              "name": "string",
              "links": {},
              "id": "string",
              "type": "string"
            },
            "readOnly": {
              "reason": {},
              "state": true
            },
            "timestamp": 10
          },
          "overridable": false,
          "name": "string",
          "description": "string",
          "links": {
            "parent": "string",
            "self": "string"
          },
          "overrides": {
            "parent": {
              "name": "string",
              "links": {},
              "id": "string",
              "type": "string"
            },
            "target": {
              "name": "string",
              "links": {},
              "id": "string",
              "type": "string"
            }
          },
          "id": "string",
          "type": "string",
          "version": "string"
        },
        {
          "metadata": {
            "lastUser": {
              "name": "string",
              "links": {},
              "id": "string",
              "type": "string"
            },
            "domain": {
              "name": "string",
              "links": {},
              "id": "string",
              "type": "string"
            },
            "readOnly": {
              "reason": {},
              "state": true
            },
            "timestamp": 10
          },
          "overridable": true,
          "name": "string",
          "description": "string",
          "links": {
            "parent": "string",
            "self": "string"
          },
          "overrides": {
            "parent": {
              "name": "string",
              "links": {},
              "id": "string",
              "type": "string"
            },
            "target": {
              "name": "string",
              "links": {},
              "id": "string",
              "type": "string"
            }
          },
          "id": "string",
          "type": "string",
          "version": "string"
        }
      ],
      "literals": [
        {
          "type": "string",
          "value": "string"
        },
        {
          "type": "string",
          "value": "string"
        },
        {
          "type": "string",
          "value": "string"
        },
        {
          "type": "string",
          "value": "string"
        },
        {
          "type": "string",
          "value": "string"
        }
      ],
      "overridable": true,
      "name": "string",
      "description": "string",
      "links": {
        "parent": "string",
        "self": "string"
      },
      "overrides": {
        "parent": {
          "name": "string",
          "links": {},
          "id": "string",
          "type": "string"
        },
        "target": {
          "name": "string",
          "links": {},
          "id": "string",
          "type": "string"
        }
      },
      "id": "string",
      "type": "string",
      "version": "string",
      "overrideTargetId": "string"
    },
    {
      "metadata": {
        "lastUser": {
          "name": "string",
          "links": {
            "parent": "string",
            "self": "string"
          },
          "id": "string",
          "type": "string"
        },
        "domain": {
          "name": "string",
          "links": {
            "parent": "string",
            "self": "string"
          },
          "id": "string",
          "type": "string"
        },
        "readOnly": {
          "reason": "DOMAIN",
          "state": true
        },
        "timestamp": 6
      },
      "objects": [
        {
          "metadata": {
            "lastUser": {
              "name": "string",
              "links": {},
              "id": "string",
              "type": "string"
            },
            "domain": {
              "name": "string",
              "links": {},
              "id": "string",
              "type": "string"
            },
            "readOnly": {
              "reason": {},
              "state": false
            },
            "timestamp": 1
          },
          "overridable": false,
          "name": "string",
          "description": "string",
          "links": {
            "parent": "string",
            "self": "string"
          },
          "overrides": {
            "parent": {
              "name": "string",
              "links": {},
              "id": "string",
              "type": "string"
            },
            "target": {
              "name": "string",
              "links": {},
              "id": "string",
              "type": "string"
            }
          },
          "id": "string",
          "type": "string",
          "version": "string"
        },
        {
          "metadata": {
            "lastUser": {
              "name": "string",
              "links": {},
              "id": "string",
              "type": "string"
            },
            "domain": {
              "name": "string",
              "links": {},
              "id": "string",
              "type": "string"
            },
            "readOnly": {
              "reason": {},
              "state": false
            },
            "timestamp": 4
          },
          "overridable": false,
          "name": "string",
          "description": "string",
          "links": {
            "parent": "string",
            "self": "string"
          },
          "overrides": {
            "parent": {
              "name": "string",
              "links": {},
              "id": "string",
              "type": "string"
            },
            "target": {
              "name": "string",
              "links": {},
              "id": "string",
              "type": "string"
            }
          },
          "id": "string",
          "type": "string",
          "version": "string"
        },
        {
          "metadata": {
            "lastUser": {
              "name": "string",
              "links": {},
              "id": "string",
              "type": "string"
            },
            "domain": {
              "name": "string",
              "links": {},
              "id": "string",
              "type": "string"
            },
            "readOnly": {
              "reason": {},
              "state": false
            },
            "timestamp": 10
          },
          "overridable": true,
          "name": "string",
          "description": "string",
          "links": {
            "parent": "string",
            "self": "string"
          },
          "overrides": {
            "parent": {
              "name": "string",
              "links": {},
              "id": "string",
              "type": "string"
            },
            "target": {
              "name": "string",
              "links": {},
              "id": "string",
              "type": "string"
            }
          },
          "id": "string",
          "type": "string",
          "version": "string"
        },
        {
          "metadata": {
            "lastUser": {
              "name": "string",
              "links": {},
              "id": "string",
              "type": "string"
            },
            "domain": {
              "name": "string",
              "links": {},
              "id": "string",
              "type": "string"
            },
            "readOnly": {
              "reason": {},
              "state": false
            },
            "timestamp": 2
          },
          "overridable": true,
          "name": "string",
          "description": "string",
          "links": {
            "parent": "string",
            "self": "string"
          },
          "overrides": {
            "parent": {
              "name": "string",
              "links": {},
              "id": "string",
              "type": "string"
            },
            "target": {
              "name": "string",
              "links": {},
              "id": "string",
              "type": "string"
            }
          },
          "id": "string",
          "type": "string",
          "version": "string"
        },
        {
          "metadata": {
            "lastUser": {
              "name": "string",
              "links": {},
              "id": "string",
              "type": "string"
            },
            "domain": {
              "name": "string",
              "links": {},
              "id": "string",
              "type": "string"
            },
            "readOnly": {
              "reason": {},
              "state": false
            },
            "timestamp": 10
          },
          "overridable": false,
          "name": "string",
          "description": "string",
          "links": {
            "parent": "string",
            "self": "string"
          },
          "overrides": {
            "parent": {
              "name": "string",
              "links": {},
              "id": "string",
              "type": "string"
            },
            "target": {
              "name": "string",
              "links": {},
              "id": "string",
              "type": "string"
            }
          },
          "id": "string",
          "type": "string",
          "version": "string"
        },
        {
          "metadata": {
            "lastUser": {
              "name": "string",
              "links": {},
              "id": "string",
              "type": "string"
            },
            "domain": {
              "name": "string",
              "links": {},
              "id": "string",
              "type": "string"
            },
            "readOnly": {
              "reason": {},
              "state": false
            },
            "timestamp": 6
          },
          "overridable": false,
          "name": "string",
          "description": "string",
          "links": {
            "parent": "string",
            "self": "string"
          },
          "overrides": {
            "parent": {
              "name": "string",
              "links": {},
              "id": "string",
              "type": "string"
            },
            "target": {
              "name": "string",
              "links": {},
              "id": "string",
              "type": "string"
            }
          },
          "id": "string",
          "type": "string",
          "version": "string"
        },
        {
          "metadata": {
            "lastUser": {
              "name": "string",
              "links": {},
              "id": "string",
              "type": "string"
            },
            "domain": {
              "name": "string",
              "links": {},
              "id": "string",
              "type": "string"
            },
            "readOnly": {
              "reason": {},
              "state": true
            },
            "timestamp": 6
          },
          "overridable": true,
          "name": "string",
          "description": "string",
          "links": {
            "parent": "string",
            "self": "string"
          },
          "overrides": {
            "parent": {
              "name": "string",
              "links": {},
              "id": "string",
              "type": "string"
            },
            "target": {
              "name": "string",
              "links": {},
              "id": "string",
              "type": "string"
            }
          },
          "id": "string",
          "type": "string",
          "version": "string"
        },
        {
          "metadata": {
            "lastUser": {
              "name": "string",
              "links": {},
              "id": "string",
              "type": "string"
            },
            "domain": {
              "name": "string",
              "links": {},
              "id": "string",
              "type": "string"
            },
            "readOnly": {
              "reason": {},
              "state": true
            },
            "timestamp": 3
          },
          "overridable": false,
          "name": "string",
          "description": "string",
          "links": {
            "parent": "string",
            "self": "string"
          },
          "overrides": {
            "parent": {
              "name": "string",
              "links": {},
              "id": "string",
              "type": "string"
            },
            "target": {
              "name": "string",
              "links": {},
              "id": "string",
              "type": "string"
            }
          },
          "id": "string",
          "type": "string",
          "version": "string"
        },
        {
          "metadata": {
            "lastUser": {
              "name": "string",
              "links": {},
              "id": "string",
              "type": "string"
            },
            "domain": {
              "name": "string",
              "links": {},
              "id": "string",
              "type": "string"
            },
            "readOnly": {
              "reason": {},
              "state": true
            },
            "timestamp": 8
          },
          "overridable": true,
          "name": "string",
          "description": "string",
          "links": {
            "parent": "string",
            "self": "string"
          },
          "overrides": {
            "parent": {
              "name": "string",
              "links": {},
              "id": "string",
              "type": "string"
            },
            "target": {
              "name": "string",
              "links": {},
              "id": "string",
              "type": "string"
            }
          },
          "id": "string",
          "type": "string",
          "version": "string"
        }
      ],
      "literals": [
        {
          "type": "string",
          "value": "string"
        },
        {
          "type": "string",
          "value": "string"
        },
        {
          "type": "string",
          "value": "string"
        },
        {
          "type": "string",
          "value": "string"
        },
        {
          "type": "string",
          "value": "string"
        },
        {
          "type": "string",
          "value": "string"
        }
      ],
      "overridable": false,
      "name": "string",
      "description": "string",
      "links": {
        "parent": "string",
        "self": "string"
      },
      "overrides": {
        "parent": {
          "name": "string",
          "links": {},
          "id": "string",
          "type": "string"
        },
        "target": {
          "name": "string",
          "links": {},
          "id": "string",
          "type": "string"
        }
      },
      "id": "string",
      "type": "string",
      "version": "string",
      "overrideTargetId": "string"
    },
    {
      "metadata": {
        "lastUser": {
          "name": "string",
          "links": {
            "parent": "string",
            "self": "string"
          },
          "id": "string",
          "type": "string"
        },
        "domain": {
          "name": "string",
          "links": {
            "parent": "string",
            "self": "string"
          },
          "id": "string",
          "type": "string"
        },
        "readOnly": {
          "reason": "SYSTEM",
          "state": false
        },
        "timestamp": 8
      },
      "objects": [
        {
          "metadata": {
            "lastUser": {
              "name": "string",
              "links": {},
              "id": "string",
              "type": "string"
            },
            "domain": {
              "name": "string",
              "links": {},
              "id": "string",
              "type": "string"
            },
            "readOnly": {
              "reason": {},
              "state": false
            },
            "timestamp": 5
          },
          "overridable": true,
          "name": "string",
          "description": "string",
          "links": {
            "parent": "string",
            "self": "string"
          },
          "overrides": {
            "parent": {
              "name": "string",
              "links": {},
              "id": "string",
              "type": "string"
            },
            "target": {
              "name": "string",
              "links": {},
              "id": "string",
              "type": "string"
            }
          },
          "id": "string",
          "type": "string",
          "version": "string"
        },
        {
          "metadata": {
            "lastUser": {
              "name": "string",
              "links": {},
              "id": "string",
              "type": "string"
            },
            "domain": {
              "name": "string",
              "links": {},
              "id": "string",
              "type": "string"
            },
            "readOnly": {
              "reason": {},
              "state": false
            },
            "timestamp": 3
          },
          "overridable": false,
          "name": "string",
          "description": "string",
          "links": {
            "parent": "string",
            "self": "string"
          },
          "overrides": {
            "parent": {
              "name": "string",
              "links": {},
              "id": "string",
              "type": "string"
            },
            "target": {
              "name": "string",
              "links": {},
              "id": "string",
              "type": "string"
            }
          },
          "id": "string",
          "type": "string",
          "version": "string"
        },
        {
          "metadata": {
            "lastUser": {
              "name": "string",
              "links": {},
              "id": "string",
              "type": "string"
            },
            "domain": {
              "name": "string",
              "links": {},
              "id": "string",
              "type": "string"
            },
            "readOnly": {
              "reason": {},
              "state": true
            },
            "timestamp": 1
          },
          "overridable": false,
          "name": "string",
          "description": "string",
          "links": {
            "parent": "string",
            "self": "string"
          },
          "overrides": {
            "parent": {
              "name": "string",
              "links": {},
              "id": "string",
              "type": "string"
            },
            "target": {
              "name": "string",
              "links": {},
              "id": "string",
              "type": "string"
            }
          },
          "id": "string",
          "type": "string",
          "version": "string"
        },
        {
          "metadata": {
            "lastUser": {
              "name": "string",
              "links": {},
              "id": "string",
              "type": "string"
            },
            "domain": {
              "name": "string",
              "links": {},
              "id": "string",
              "type": "string"
            },
            "readOnly": {
              "reason": {},
              "state": false
            },
            "timestamp": 7
          },
          "overridable": true,
          "name": "string",
          "description": "string",
          "links": {
            "parent": "string",
            "self": "string"
          },
          "overrides": {
            "parent": {
              "name": "string",
              "links": {},
              "id": "string",
              "type": "string"
            },
            "target": {
              "name": "string",
              "links": {},
              "id": "string",
              "type": "string"
            }
          },
          "id": "string",
          "type": "string",
          "version": "string"
        },
        {
          "metadata": {
            "lastUser": {
              "name": "string",
              "links": {},
              "id": "string",
              "type": "string"
            },
            "domain": {
              "name": "string",
              "links": {},
              "id": "string",
              "type": "string"
            },
            "readOnly": {
              "reason": {},
              "state": true
            },
            "timestamp": 9
          },
          "overridable": false,
          "name": "string",
          "description": "string",
          "links": {
            "parent": "string",
            "self": "string"
          },
          "overrides": {
            "parent": {
              "name": "string",
              "links": {},
              "id": "string",
              "type": "string"
            },
            "target": {
              "name": "string",
              "links": {},
              "id": "string",
              "type": "string"
            }
          },
          "id": "string",
          "type": "string",
          "version": "string"
        },
        {
          "metadata": {
            "lastUser": {
              "name": "string",
              "links": {},
              "id": "string",
              "type": "string"
            },
            "domain": {
              "name": "string",
              "links": {},
              "id": "string",
              "type": "string"
            },
            "readOnly": {
              "reason": {},
              "state": false
            },
            "timestamp": 10
          },
          "overridable": false,
          "name": "string",
          "description": "string",
          "links": {
            "parent": "string",
            "self": "string"
          },
          "overrides": {
            "parent": {
              "name": "string",
              "links": {},
              "id": "string",
              "type": "string"
            },
            "target": {
              "name": "string",
              "links": {},
              "id": "string",
              "type": "string"
            }
          },
          "id": "string",
          "type": "string",
          "version": "string"
        },
        {
          "metadata": {
            "lastUser": {
              "name": "string",
              "links": {},
              "id": "string",
              "type": "string"
            },
            "domain": {
              "name": "string",
              "links": {},
              "id": "string",
              "type": "string"
            },
            "readOnly": {
              "reason": {},
              "state": true
            },
            "timestamp": 1
          },
          "overridable": true,
          "name": "string",
          "description": "string",
          "links": {
            "parent": "string",
            "self": "string"
          },
          "overrides": {
            "parent": {
              "name": "string",
              "links": {},
              "id": "string",
              "type": "string"
            },
            "target": {
              "name": "string",
              "links": {},
              "id": "string",
              "type": "string"
            }
          },
          "id": "string",
          "type": "string",
          "version": "string"
        },
        {
          "metadata": {
            "lastUser": {
              "name": "string",
              "links": {},
              "id": "string",
              "type": "string"
            },
            "domain": {
              "name": "string",
              "links": {},
              "id": "string",
              "type": "string"
            },
            "readOnly": {
              "reason": {},
              "state": true
            },
            "timestamp": 10
          },
          "overridable": true,
          "name": "string",
          "description": "string",
          "links": {
            "parent": "string",
            "self": "string"
          },
          "overrides": {
            "parent": {
              "name": "string",
              "links": {},
              "id": "string",
              "type": "string"
            },
            "target": {
              "name": "string",
              "links": {},
              "id": "string",
              "type": "string"
            }
          },
          "id": "string",
          "type": "string",
          "version": "string"
        }
      ],
      "literals": [
        {
          "type": "string",
          "value": "string"
        },
        {
          "type": "string",
          "value": "string"
        },
        {
          "type": "string",
          "value": "string"
        }
      ],
      "overridable": true,
      "name": "string",
      "description": "string",
      "links": {
        "parent": "string",
        "self": "string"
      },
      "overrides": {
        "parent": {
          "name": "string",
          "links": {},
          "id": "string",
          "type": "string"
        },
        "target": {
          "name": "string",
          "links": {},
          "id": "string",
          "type": "string"
        }
      },
      "id": "string",
      "type": "string",
      "version": "string",
      "overrideTargetId": "string"
    }
  ]
}