{
  "links": {
    "self": "https://fmc_host_ip/api/fmc_config/v1/domain/global/object/anyprotocolportobjects/anyProtocolPortObjUUID",
    "parent": "https://fmc_host_ip/api/fmc_config/v1/domain/global/object/ports"
  },
  "type": "AnyProtocolPortObject",
  "name": "myAny",
  "description": " ",
  "id": "anyProtocolPortObjUUID"
}