{
  "taskType": "DEVICE_REGISTRATION",
  "subTasks": [
    {
      "message": "string",
      "target": {},
      "status": "string"
    },
    {
      "message": "string",
      "target": {},
      "status": "string"
    },
    {
      "message": "string",
      "target": {},
      "status": "string"
    },
    {
      "message": "string",
      "target": {},
      "status": "string"
    },
    {
      "message": "string",
      "target": {},
      "status": "string"
    },
    {
      "message": "string",
      "target": {},
      "status": "string"
    },
    {
      "message": "string",
      "target": {},
      "status": "string"
    },
    {
      "message": "string",
      "target": {},
      "status": "string"
    }
  ],
  "name": "string",
  "description": "string",
  "links": {
    "parent": "string",
    "self": "string"
  },
  "id": "string",
  "type": "string",
  "message": "string",
  "status": "string"
}