{
  "links": {
    "self": "/fmc_config/v1/domain/childDomainUUID/object/icmpv6objects?offset=0&limit=1"
  },
  "items": [
    {
      "metadata": {
        "lastUser": {
          "name": "pvs"
        },
        "domain": {
          "name": "Global \\ Asia",
          "id": "childDomainUUID"
        },
        "parentType": "Port"
      },
      "links": {
        "self": "/fmc_config/v1/domain/childDomainUUID/object/icmpv6objects/icmpv6ObjectUUID",
        "parent": "/fmc_config/v1/domain/childDomainUUID/object/ports"
      },
      "type": "ICMPV6Object",
      "code": 0,
      "icmpType": "3",
      "overrides": {
        "parent": {
          "id": "icmpv6ObjectUUID",
          "type": "ICMPV6Object"
        },
        "target": {
          "name": "Global \\ Asia",
          "id": "childDomainUUID",
          "type": "Domain"
        }
      },
      "overridable": true,
      "description": " ",
      "name": "pvs_icmpv6",
      "id": "icmpv6ObjectUUID"
    }
  ],
  "paging": {
    "offset": 0,
    "limit": 1,
    "count": 1,
    "pages": 1
  }
}