{
  "links": {
    "self": "/api/fmc_config/v1/domain/DomainUUID/object/dnsservergroups/DNSServerGroupObjectUUID"
  },
  "dnsservers": [
    {
      "name-server": "IPv4/IPv6hostaddress1"
    },
    {
      "name-server": "IPv4/IPv6hostaddress2"
    }
  ],
  "retries": 1,
  "defaultdomain": "cisco.com",
  "type": "DNSServerGroupObject",
  "name": "DNSServerGroupObjectName1",
  "timeout": 1,
  "id": "DNSServerGroupObjectUUID",
  "metadata": {
    "timestamp": 1523597066886,
    "lastUser": {
      "name": "rest"
    },
    "domain": {
      "name": "Global",
      "id": "DomainUUID"
    }
  }
}