{
  "links": {
    "parent": "string",
    "self": "string"
  },
  "paging": {
    "pages": 7,
    "offset": 9,
    "limit": 10,
    "count": 8
  },
  "items": [
    {
      "metadata": {
        "lastUser": {
          "name": "string",
          "links": {},
          "id": "string",
          "type": "string"
        },
        "domain": {
          "name": "string",
          "links": {},
          "id": "string",
          "type": "string"
        },
        "readOnly": {
          "reason": {},
          "state": false
        },
        "timestamp": 3
      },
      "members": [
        {
          "metadata": {
            "lastUser": {
              "name": "string",
              "links": {},
              "id": "string",
              "type": "string"
            },
            "domain": {
              "name": "string",
              "links": {},
              "id": "string",
              "type": "string"
            },
            "readOnly": {
              "reason": {},
              "state": true
            },
            "timestamp": 9
          },
          "modelId": "string",
          "description": "string",
          "modelType": "string",
          "type": "string",
          "version": "string",
          "sw_version": "string",
          "healthStatus": "string",
          "healthPolicy": {
            "name": "string",
            "links": {
              "parent": "string",
              "self": "string"
            },
            "id": "string",
            "type": "string"
          },
          "name": "string",
          "model": "string",
          "modelNumber": "string",
          "links": {
            "parent": "string",
            "self": "string"
          },
          "accessPolicy": {
            "metadata": {
              "lastUser": {
                "name": "string",
                "links": {},
                "id": "string",
                "type": "string"
              },
              "domain": {
                "name": "string",
                "links": {},
                "id": "string",
                "type": "string"
              },
              "readOnly": {
                "reason": {},
                "state": true
              },
              "timestamp": 4
            },
            "name": "string",
            "description": "string",
            "links": {
              "parent": "string",
              "self": "string"
            },
            "id": "string",
            "type": "string",
            "version": "string"
          },
          "id": "string"
        },
        {
          "metadata": {
            "lastUser": {
              "name": "string",
              "links": {},
              "id": "string",
              "type": "string"
            },
            "domain": {
              "name": "string",
              "links": {},
              "id": "string",
              "type": "string"
            },
            "readOnly": {
              "reason": {},
              "state": false
            },
            "timestamp": 4
          },
          "modelId": "string",
          "description": "string",
          "modelType": "string",
          "type": "string",
          "version": "string",
          "sw_version": "string",
          "healthStatus": "string",
          "healthPolicy": {
            "name": "string",
            "links": {
              "parent": "string",
              "self": "string"
            },
            "id": "string",
            "type": "string"
          },
          "name": "string",
          "model": "string",
          "modelNumber": "string",
          "links": {
            "parent": "string",
            "self": "string"
          },
          "accessPolicy": {
            "metadata": {
              "lastUser": {
                "name": "string",
                "links": {},
                "id": "string",
                "type": "string"
              },
              "domain": {
                "name": "string",
                "links": {},
                "id": "string",
                "type": "string"
              },
              "readOnly": {
                "reason": {},
                "state": false
              },
              "timestamp": 3
            },
            "name": "string",
            "description": "string",
            "links": {
              "parent": "string",
              "self": "string"
            },
            "id": "string",
            "type": "string",
            "version": "string"
          },
          "id": "string"
        },
        {
          "metadata": {
            "lastUser": {
              "name": "string",
              "links": {},
              "id": "string",
              "type": "string"
            },
            "domain": {
              "name": "string",
              "links": {},
              "id": "string",
              "type": "string"
            },
            "readOnly": {
              "reason": {},
              "state": false
            },
            "timestamp": 6
          },
          "modelId": "string",
          "description": "string",
          "modelType": "string",
          "type": "string",
          "version": "string",
          "sw_version": "string",
          "healthStatus": "string",
          "healthPolicy": {
            "name": "string",
            "links": {
              "parent": "string",
              "self": "string"
            },
            "id": "string",
            "type": "string"
          },
          "name": "string",
          "model": "string",
          "modelNumber": "string",
          "links": {
            "parent": "string",
            "self": "string"
          },
          "accessPolicy": {
            "metadata": {
              "lastUser": {
                "name": "string",
                "links": {},
                "id": "string",
                "type": "string"
              },
              "domain": {
                "name": "string",
                "links": {},
                "id": "string",
                "type": "string"
              },
              "readOnly": {
                "reason": {},
                "state": false
              },
              "timestamp": 3
            },
            "name": "string",
            "description": "string",
            "links": {
              "parent": "string",
              "self": "string"
            },
            "id": "string",
            "type": "string",
            "version": "string"
          },
          "id": "string"
        },
        {
          "metadata": {
            "lastUser": {
              "name": "string",
              "links": {},
              "id": "string",
              "type": "string"
            },
            "domain": {
              "name": "string",
              "links": {},
              "id": "string",
              "type": "string"
            },
            "readOnly": {
              "reason": {},
              "state": false
            },
            "timestamp": 9
          },
          "modelId": "string",
          "description": "string",
          "modelType": "string",
          "type": "string",
          "version": "string",
          "sw_version": "string",
          "healthStatus": "string",
          "healthPolicy": {
            "name": "string",
            "links": {
              "parent": "string",
              "self": "string"
            },
            "id": "string",
            "type": "string"
          },
          "name": "string",
          "model": "string",
          "modelNumber": "string",
          "links": {
            "parent": "string",
            "self": "string"
          },
          "accessPolicy": {
            "metadata": {
              "lastUser": {
                "name": "string",
                "links": {},
                "id": "string",
                "type": "string"
              },
              "domain": {
                "name": "string",
                "links": {},
                "id": "string",
                "type": "string"
              },
              "readOnly": {
                "reason": {},
                "state": false
              },
              "timestamp": 7
            },
            "name": "string",
            "description": "string",
            "links": {
              "parent": "string",
              "self": "string"
            },
            "id": "string",
            "type": "string",
            "version": "string"
          },
          "id": "string"
        }
      ],
      "name": "string",
      "description": "string",
      "links": {
        "parent": "string",
        "self": "string"
      },
      "id": "string",
      "type": "string",
      "version": "string"
    },
    {
      "metadata": {
        "lastUser": {
          "name": "string",
          "links": {},
          "id": "string",
          "type": "string"
        },
        "domain": {
          "name": "string",
          "links": {},
          "id": "string",
          "type": "string"
        },
        "readOnly": {
          "reason": {},
          "state": false
        },
        "timestamp": 1
      },
      "members": [
        {
          "metadata": {
            "lastUser": {
              "name": "string",
              "links": {},
              "id": "string",
              "type": "string"
            },
            "domain": {
              "name": "string",
              "links": {},
              "id": "string",
              "type": "string"
            },
            "readOnly": {
              "reason": {},
              "state": false
            },
            "timestamp": 10
          },
          "modelId": "string",
          "description": "string",
          "modelType": "string",
          "type": "string",
          "version": "string",
          "sw_version": "string",
          "healthStatus": "string",
          "healthPolicy": {
            "name": "string",
            "links": {
              "parent": "string",
              "self": "string"
            },
            "id": "string",
            "type": "string"
          },
          "name": "string",
          "model": "string",
          "modelNumber": "string",
          "links": {
            "parent": "string",
            "self": "string"
          },
          "accessPolicy": {
            "metadata": {
              "lastUser": {
                "name": "string",
                "links": {},
                "id": "string",
                "type": "string"
              },
              "domain": {
                "name": "string",
                "links": {},
                "id": "string",
                "type": "string"
              },
              "readOnly": {
                "reason": {},
                "state": true
              },
              "timestamp": 4
            },
            "name": "string",
            "description": "string",
            "links": {
              "parent": "string",
              "self": "string"
            },
            "id": "string",
            "type": "string",
            "version": "string"
          },
          "id": "string"
        },
        {
          "metadata": {
            "lastUser": {
              "name": "string",
              "links": {},
              "id": "string",
              "type": "string"
            },
            "domain": {
              "name": "string",
              "links": {},
              "id": "string",
              "type": "string"
            },
            "readOnly": {
              "reason": {},
              "state": false
            },
            "timestamp": 6
          },
          "modelId": "string",
          "description": "string",
          "modelType": "string",
          "type": "string",
          "version": "string",
          "sw_version": "string",
          "healthStatus": "string",
          "healthPolicy": {
            "name": "string",
            "links": {
              "parent": "string",
              "self": "string"
            },
            "id": "string",
            "type": "string"
          },
          "name": "string",
          "model": "string",
          "modelNumber": "string",
          "links": {
            "parent": "string",
            "self": "string"
          },
          "accessPolicy": {
            "metadata": {
              "lastUser": {
                "name": "string",
                "links": {},
                "id": "string",
                "type": "string"
              },
              "domain": {
                "name": "string",
                "links": {},
                "id": "string",
                "type": "string"
              },
              "readOnly": {
                "reason": {},
                "state": false
              },
              "timestamp": 6
            },
            "name": "string",
            "description": "string",
            "links": {
              "parent": "string",
              "self": "string"
            },
            "id": "string",
            "type": "string",
            "version": "string"
          },
          "id": "string"
        },
        {
          "metadata": {
            "lastUser": {
              "name": "string",
              "links": {},
              "id": "string",
              "type": "string"
            },
            "domain": {
              "name": "string",
              "links": {},
              "id": "string",
              "type": "string"
            },
            "readOnly": {
              "reason": {},
              "state": true
            },
            "timestamp": 6
          },
          "modelId": "string",
          "description": "string",
          "modelType": "string",
          "type": "string",
          "version": "string",
          "sw_version": "string",
          "healthStatus": "string",
          "healthPolicy": {
            "name": "string",
            "links": {
              "parent": "string",
              "self": "string"
            },
            "id": "string",
            "type": "string"
          },
          "name": "string",
          "model": "string",
          "modelNumber": "string",
          "links": {
            "parent": "string",
            "self": "string"
          },
          "accessPolicy": {
            "metadata": {
              "lastUser": {
                "name": "string",
                "links": {},
                "id": "string",
                "type": "string"
              },
              "domain": {
                "name": "string",
                "links": {},
                "id": "string",
                "type": "string"
              },
              "readOnly": {
                "reason": {},
                "state": false
              },
              "timestamp": 2
            },
            "name": "string",
            "description": "string",
            "links": {
              "parent": "string",
              "self": "string"
            },
            "id": "string",
            "type": "string",
            "version": "string"
          },
          "id": "string"
        },
        {
          "metadata": {
            "lastUser": {
              "name": "string",
              "links": {},
              "id": "string",
              "type": "string"
            },
            "domain": {
              "name": "string",
              "links": {},
              "id": "string",
              "type": "string"
            },
            "readOnly": {
              "reason": {},
              "state": true
            },
            "timestamp": 10
          },
          "modelId": "string",
          "description": "string",
          "modelType": "string",
          "type": "string",
          "version": "string",
          "sw_version": "string",
          "healthStatus": "string",
          "healthPolicy": {
            "name": "string",
            "links": {
              "parent": "string",
              "self": "string"
            },
            "id": "string",
            "type": "string"
          },
          "name": "string",
          "model": "string",
          "modelNumber": "string",
          "links": {
            "parent": "string",
            "self": "string"
          },
          "accessPolicy": {
            "metadata": {
              "lastUser": {
                "name": "string",
                "links": {},
                "id": "string",
                "type": "string"
              },
              "domain": {
                "name": "string",
                "links": {},
                "id": "string",
                "type": "string"
              },
              "readOnly": {
                "reason": {},
                "state": true
              },
              "timestamp": 5
            },
            "name": "string",
            "description": "string",
            "links": {
              "parent": "string",
              "self": "string"
            },
            "id": "string",
            "type": "string",
            "version": "string"
          },
          "id": "string"
        },
        {
          "metadata": {
            "lastUser": {
              "name": "string",
              "links": {},
              "id": "string",
              "type": "string"
            },
            "domain": {
              "name": "string",
              "links": {},
              "id": "string",
              "type": "string"
            },
            "readOnly": {
              "reason": {},
              "state": true
            },
            "timestamp": 1
          },
          "modelId": "string",
          "description": "string",
          "modelType": "string",
          "type": "string",
          "version": "string",
          "sw_version": "string",
          "healthStatus": "string",
          "healthPolicy": {
            "name": "string",
            "links": {
              "parent": "string",
              "self": "string"
            },
            "id": "string",
            "type": "string"
          },
          "name": "string",
          "model": "string",
          "modelNumber": "string",
          "links": {
            "parent": "string",
            "self": "string"
          },
          "accessPolicy": {
            "metadata": {
              "lastUser": {
                "name": "string",
                "links": {},
                "id": "string",
                "type": "string"
              },
              "domain": {
                "name": "string",
                "links": {},
                "id": "string",
                "type": "string"
              },
              "readOnly": {
                "reason": {},
                "state": true
              },
              "timestamp": 1
            },
            "name": "string",
            "description": "string",
            "links": {
              "parent": "string",
              "self": "string"
            },
            "id": "string",
            "type": "string",
            "version": "string"
          },
          "id": "string"
        },
        {
          "metadata": {
            "lastUser": {
              "name": "string",
              "links": {},
              "id": "string",
              "type": "string"
            },
            "domain": {
              "name": "string",
              "links": {},
              "id": "string",
              "type": "string"
            },
            "readOnly": {
              "reason": {},
              "state": false
            },
            "timestamp": 3
          },
          "modelId": "string",
          "description": "string",
          "modelType": "string",
          "type": "string",
          "version": "string",
          "sw_version": "string",
          "healthStatus": "string",
          "healthPolicy": {
            "name": "string",
            "links": {
              "parent": "string",
              "self": "string"
            },
            "id": "string",
            "type": "string"
          },
          "name": "string",
          "model": "string",
          "modelNumber": "string",
          "links": {
            "parent": "string",
            "self": "string"
          },
          "accessPolicy": {
            "metadata": {
              "lastUser": {
                "name": "string",
                "links": {},
                "id": "string",
                "type": "string"
              },
              "domain": {
                "name": "string",
                "links": {},
                "id": "string",
                "type": "string"
              },
              "readOnly": {
                "reason": {},
                "state": false
              },
              "timestamp": 5
            },
            "name": "string",
            "description": "string",
            "links": {
              "parent": "string",
              "self": "string"
            },
            "id": "string",
            "type": "string",
            "version": "string"
          },
          "id": "string"
        },
        {
          "metadata": {
            "lastUser": {
              "name": "string",
              "links": {},
              "id": "string",
              "type": "string"
            },
            "domain": {
              "name": "string",
              "links": {},
              "id": "string",
              "type": "string"
            },
            "readOnly": {
              "reason": {},
              "state": false
            },
            "timestamp": 5
          },
          "modelId": "string",
          "description": "string",
          "modelType": "string",
          "type": "string",
          "version": "string",
          "sw_version": "string",
          "healthStatus": "string",
          "healthPolicy": {
            "name": "string",
            "links": {
              "parent": "string",
              "self": "string"
            },
            "id": "string",
            "type": "string"
          },
          "name": "string",
          "model": "string",
          "modelNumber": "string",
          "links": {
            "parent": "string",
            "self": "string"
          },
          "accessPolicy": {
            "metadata": {
              "lastUser": {
                "name": "string",
                "links": {},
                "id": "string",
                "type": "string"
              },
              "domain": {
                "name": "string",
                "links": {},
                "id": "string",
                "type": "string"
              },
              "readOnly": {
                "reason": {},
                "state": true
              },
              "timestamp": 4
            },
            "name": "string",
            "description": "string",
            "links": {
              "parent": "string",
              "self": "string"
            },
            "id": "string",
            "type": "string",
            "version": "string"
          },
          "id": "string"
        },
        {
          "metadata": {
            "lastUser": {
              "name": "string",
              "links": {},
              "id": "string",
              "type": "string"
            },
            "domain": {
              "name": "string",
              "links": {},
              "id": "string",
              "type": "string"
            },
            "readOnly": {
              "reason": {},
              "state": true
            },
            "timestamp": 6
          },
          "modelId": "string",
          "description": "string",
          "modelType": "string",
          "type": "string",
          "version": "string",
          "sw_version": "string",
          "healthStatus": "string",
          "healthPolicy": {
            "name": "string",
            "links": {
              "parent": "string",
              "self": "string"
            },
            "id": "string",
            "type": "string"
          },
          "name": "string",
          "model": "string",
          "modelNumber": "string",
          "links": {
            "parent": "string",
            "self": "string"
          },
          "accessPolicy": {
            "metadata": {
              "lastUser": {
                "name": "string",
                "links": {},
                "id": "string",
                "type": "string"
              },
              "domain": {
                "name": "string",
                "links": {},
                "id": "string",
                "type": "string"
              },
              "readOnly": {
                "reason": {},
                "state": true
              },
              "timestamp": 7
            },
            "name": "string",
            "description": "string",
            "links": {
              "parent": "string",
              "self": "string"
            },
            "id": "string",
            "type": "string",
            "version": "string"
          },
          "id": "string"
        },
        {
          "metadata": {
            "lastUser": {
              "name": "string",
              "links": {},
              "id": "string",
              "type": "string"
            },
            "domain": {
              "name": "string",
              "links": {},
              "id": "string",
              "type": "string"
            },
            "readOnly": {
              "reason": {},
              "state": false
            },
            "timestamp": 7
          },
          "modelId": "string",
          "description": "string",
          "modelType": "string",
          "type": "string",
          "version": "string",
          "sw_version": "string",
          "healthStatus": "string",
          "healthPolicy": {
            "name": "string",
            "links": {
              "parent": "string",
              "self": "string"
            },
            "id": "string",
            "type": "string"
          },
          "name": "string",
          "model": "string",
          "modelNumber": "string",
          "links": {
            "parent": "string",
            "self": "string"
          },
          "accessPolicy": {
            "metadata": {
              "lastUser": {
                "name": "string",
                "links": {},
                "id": "string",
                "type": "string"
              },
              "domain": {
                "name": "string",
                "links": {},
                "id": "string",
                "type": "string"
              },
              "readOnly": {
                "reason": {},
                "state": false
              },
              "timestamp": 1
            },
            "name": "string",
            "description": "string",
            "links": {
              "parent": "string",
              "self": "string"
            },
            "id": "string",
            "type": "string",
            "version": "string"
          },
          "id": "string"
        },
        {
          "metadata": {
            "lastUser": {
              "name": "string",
              "links": {},
              "id": "string",
              "type": "string"
            },
            "domain": {
              "name": "string",
              "links": {},
              "id": "string",
              "type": "string"
            },
            "readOnly": {
              "reason": {},
              "state": false
            },
            "timestamp": 4
          },
          "modelId": "string",
          "description": "string",
          "modelType": "string",
          "type": "string",
          "version": "string",
          "sw_version": "string",
          "healthStatus": "string",
          "healthPolicy": {
            "name": "string",
            "links": {
              "parent": "string",
              "self": "string"
            },
            "id": "string",
            "type": "string"
          },
          "name": "string",
          "model": "string",
          "modelNumber": "string",
          "links": {
            "parent": "string",
            "self": "string"
          },
          "accessPolicy": {
            "metadata": {
              "lastUser": {
                "name": "string",
                "links": {},
                "id": "string",
                "type": "string"
              },
              "domain": {
                "name": "string",
                "links": {},
                "id": "string",
                "type": "string"
              },
              "readOnly": {
                "reason": {},
                "state": false
              },
              "timestamp": 1
            },
            "name": "string",
            "description": "string",
            "links": {
              "parent": "string",
              "self": "string"
            },
            "id": "string",
            "type": "string",
            "version": "string"
          },
          "id": "string"
        }
      ],
      "name": "string",
      "description": "string",
      "links": {
        "parent": "string",
        "self": "string"
      },
      "id": "string",
      "type": "string",
      "version": "string"
    },
    {
      "metadata": {
        "lastUser": {
          "name": "string",
          "links": {},
          "id": "string",
          "type": "string"
        },
        "domain": {
          "name": "string",
          "links": {},
          "id": "string",
          "type": "string"
        },
        "readOnly": {
          "reason": {},
          "state": true
        },
        "timestamp": 10
      },
      "members": [
        {
          "metadata": {
            "lastUser": {
              "name": "string",
              "links": {},
              "id": "string",
              "type": "string"
            },
            "domain": {
              "name": "string",
              "links": {},
              "id": "string",
              "type": "string"
            },
            "readOnly": {
              "reason": {},
              "state": false
            },
            "timestamp": 5
          },
          "modelId": "string",
          "description": "string",
          "modelType": "string",
          "type": "string",
          "version": "string",
          "sw_version": "string",
          "healthStatus": "string",
          "healthPolicy": {
            "name": "string",
            "links": {
              "parent": "string",
              "self": "string"
            },
            "id": "string",
            "type": "string"
          },
          "name": "string",
          "model": "string",
          "modelNumber": "string",
          "links": {
            "parent": "string",
            "self": "string"
          },
          "accessPolicy": {
            "metadata": {
              "lastUser": {
                "name": "string",
                "links": {},
                "id": "string",
                "type": "string"
              },
              "domain": {
                "name": "string",
                "links": {},
                "id": "string",
                "type": "string"
              },
              "readOnly": {
                "reason": {},
                "state": false
              },
              "timestamp": 3
            },
            "name": "string",
            "description": "string",
            "links": {
              "parent": "string",
              "self": "string"
            },
            "id": "string",
            "type": "string",
            "version": "string"
          },
          "id": "string"
        },
        {
          "metadata": {
            "lastUser": {
              "name": "string",
              "links": {},
              "id": "string",
              "type": "string"
            },
            "domain": {
              "name": "string",
              "links": {},
              "id": "string",
              "type": "string"
            },
            "readOnly": {
              "reason": {},
              "state": true
            },
            "timestamp": 2
          },
          "modelId": "string",
          "description": "string",
          "modelType": "string",
          "type": "string",
          "version": "string",
          "sw_version": "string",
          "healthStatus": "string",
          "healthPolicy": {
            "name": "string",
            "links": {
              "parent": "string",
              "self": "string"
            },
            "id": "string",
            "type": "string"
          },
          "name": "string",
          "model": "string",
          "modelNumber": "string",
          "links": {
            "parent": "string",
            "self": "string"
          },
          "accessPolicy": {
            "metadata": {
              "lastUser": {
                "name": "string",
                "links": {},
                "id": "string",
                "type": "string"
              },
              "domain": {
                "name": "string",
                "links": {},
                "id": "string",
                "type": "string"
              },
              "readOnly": {
                "reason": {},
                "state": false
              },
              "timestamp": 4
            },
            "name": "string",
            "description": "string",
            "links": {
              "parent": "string",
              "self": "string"
            },
            "id": "string",
            "type": "string",
            "version": "string"
          },
          "id": "string"
        },
        {
          "metadata": {
            "lastUser": {
              "name": "string",
              "links": {},
              "id": "string",
              "type": "string"
            },
            "domain": {
              "name": "string",
              "links": {},
              "id": "string",
              "type": "string"
            },
            "readOnly": {
              "reason": {},
              "state": true
            },
            "timestamp": 4
          },
          "modelId": "string",
          "description": "string",
          "modelType": "string",
          "type": "string",
          "version": "string",
          "sw_version": "string",
          "healthStatus": "string",
          "healthPolicy": {
            "name": "string",
            "links": {
              "parent": "string",
              "self": "string"
            },
            "id": "string",
            "type": "string"
          },
          "name": "string",
          "model": "string",
          "modelNumber": "string",
          "links": {
            "parent": "string",
            "self": "string"
          },
          "accessPolicy": {
            "metadata": {
              "lastUser": {
                "name": "string",
                "links": {},
                "id": "string",
                "type": "string"
              },
              "domain": {
                "name": "string",
                "links": {},
                "id": "string",
                "type": "string"
              },
              "readOnly": {
                "reason": {},
                "state": false
              },
              "timestamp": 10
            },
            "name": "string",
            "description": "string",
            "links": {
              "parent": "string",
              "self": "string"
            },
            "id": "string",
            "type": "string",
            "version": "string"
          },
          "id": "string"
        },
        {
          "metadata": {
            "lastUser": {
              "name": "string",
              "links": {},
              "id": "string",
              "type": "string"
            },
            "domain": {
              "name": "string",
              "links": {},
              "id": "string",
              "type": "string"
            },
            "readOnly": {
              "reason": {},
              "state": false
            },
            "timestamp": 7
          },
          "modelId": "string",
          "description": "string",
          "modelType": "string",
          "type": "string",
          "version": "string",
          "sw_version": "string",
          "healthStatus": "string",
          "healthPolicy": {
            "name": "string",
            "links": {
              "parent": "string",
              "self": "string"
            },
            "id": "string",
            "type": "string"
          },
          "name": "string",
          "model": "string",
          "modelNumber": "string",
          "links": {
            "parent": "string",
            "self": "string"
          },
          "accessPolicy": {
            "metadata": {
              "lastUser": {
                "name": "string",
                "links": {},
                "id": "string",
                "type": "string"
              },
              "domain": {
                "name": "string",
                "links": {},
                "id": "string",
                "type": "string"
              },
              "readOnly": {
                "reason": {},
                "state": false
              },
              "timestamp": 9
            },
            "name": "string",
            "description": "string",
            "links": {
              "parent": "string",
              "self": "string"
            },
            "id": "string",
            "type": "string",
            "version": "string"
          },
          "id": "string"
        },
        {
          "metadata": {
            "lastUser": {
              "name": "string",
              "links": {},
              "id": "string",
              "type": "string"
            },
            "domain": {
              "name": "string",
              "links": {},
              "id": "string",
              "type": "string"
            },
            "readOnly": {
              "reason": {},
              "state": true
            },
            "timestamp": 6
          },
          "modelId": "string",
          "description": "string",
          "modelType": "string",
          "type": "string",
          "version": "string",
          "sw_version": "string",
          "healthStatus": "string",
          "healthPolicy": {
            "name": "string",
            "links": {
              "parent": "string",
              "self": "string"
            },
            "id": "string",
            "type": "string"
          },
          "name": "string",
          "model": "string",
          "modelNumber": "string",
          "links": {
            "parent": "string",
            "self": "string"
          },
          "accessPolicy": {
            "metadata": {
              "lastUser": {
                "name": "string",
                "links": {},
                "id": "string",
                "type": "string"
              },
              "domain": {
                "name": "string",
                "links": {},
                "id": "string",
                "type": "string"
              },
              "readOnly": {
                "reason": {},
                "state": false
              },
              "timestamp": 2
            },
            "name": "string",
            "description": "string",
            "links": {
              "parent": "string",
              "self": "string"
            },
            "id": "string",
            "type": "string",
            "version": "string"
          },
          "id": "string"
        }
      ],
      "name": "string",
      "description": "string",
      "links": {
        "parent": "string",
        "self": "string"
      },
      "id": "string",
      "type": "string",
      "version": "string"
    },
    {
      "metadata": {
        "lastUser": {
          "name": "string",
          "links": {},
          "id": "string",
          "type": "string"
        },
        "domain": {
          "name": "string",
          "links": {},
          "id": "string",
          "type": "string"
        },
        "readOnly": {
          "reason": {},
          "state": true
        },
        "timestamp": 3
      },
      "members": [
        {
          "metadata": {
            "lastUser": {
              "name": "string",
              "links": {},
              "id": "string",
              "type": "string"
            },
            "domain": {
              "name": "string",
              "links": {},
              "id": "string",
              "type": "string"
            },
            "readOnly": {
              "reason": {},
              "state": true
            },
            "timestamp": 9
          },
          "modelId": "string",
          "description": "string",
          "modelType": "string",
          "type": "string",
          "version": "string",
          "sw_version": "string",
          "healthStatus": "string",
          "healthPolicy": {
            "name": "string",
            "links": {
              "parent": "string",
              "self": "string"
            },
            "id": "string",
            "type": "string"
          },
          "name": "string",
          "model": "string",
          "modelNumber": "string",
          "links": {
            "parent": "string",
            "self": "string"
          },
          "accessPolicy": {
            "metadata": {
              "lastUser": {
                "name": "string",
                "links": {},
                "id": "string",
                "type": "string"
              },
              "domain": {
                "name": "string",
                "links": {},
                "id": "string",
                "type": "string"
              },
              "readOnly": {
                "reason": {},
                "state": true
              },
              "timestamp": 5
            },
            "name": "string",
            "description": "string",
            "links": {
              "parent": "string",
              "self": "string"
            },
            "id": "string",
            "type": "string",
            "version": "string"
          },
          "id": "string"
        },
        {
          "metadata": {
            "lastUser": {
              "name": "string",
              "links": {},
              "id": "string",
              "type": "string"
            },
            "domain": {
              "name": "string",
              "links": {},
              "id": "string",
              "type": "string"
            },
            "readOnly": {
              "reason": {},
              "state": true
            },
            "timestamp": 2
          },
          "modelId": "string",
          "description": "string",
          "modelType": "string",
          "type": "string",
          "version": "string",
          "sw_version": "string",
          "healthStatus": "string",
          "healthPolicy": {
            "name": "string",
            "links": {
              "parent": "string",
              "self": "string"
            },
            "id": "string",
            "type": "string"
          },
          "name": "string",
          "model": "string",
          "modelNumber": "string",
          "links": {
            "parent": "string",
            "self": "string"
          },
          "accessPolicy": {
            "metadata": {
              "lastUser": {
                "name": "string",
                "links": {},
                "id": "string",
                "type": "string"
              },
              "domain": {
                "name": "string",
                "links": {},
                "id": "string",
                "type": "string"
              },
              "readOnly": {
                "reason": {},
                "state": true
              },
              "timestamp": 7
            },
            "name": "string",
            "description": "string",
            "links": {
              "parent": "string",
              "self": "string"
            },
            "id": "string",
            "type": "string",
            "version": "string"
          },
          "id": "string"
        },
        {
          "metadata": {
            "lastUser": {
              "name": "string",
              "links": {},
              "id": "string",
              "type": "string"
            },
            "domain": {
              "name": "string",
              "links": {},
              "id": "string",
              "type": "string"
            },
            "readOnly": {
              "reason": {},
              "state": false
            },
            "timestamp": 6
          },
          "modelId": "string",
          "description": "string",
          "modelType": "string",
          "type": "string",
          "version": "string",
          "sw_version": "string",
          "healthStatus": "string",
          "healthPolicy": {
            "name": "string",
            "links": {
              "parent": "string",
              "self": "string"
            },
            "id": "string",
            "type": "string"
          },
          "name": "string",
          "model": "string",
          "modelNumber": "string",
          "links": {
            "parent": "string",
            "self": "string"
          },
          "accessPolicy": {
            "metadata": {
              "lastUser": {
                "name": "string",
                "links": {},
                "id": "string",
                "type": "string"
              },
              "domain": {
                "name": "string",
                "links": {},
                "id": "string",
                "type": "string"
              },
              "readOnly": {
                "reason": {},
                "state": true
              },
              "timestamp": 9
            },
            "name": "string",
            "description": "string",
            "links": {
              "parent": "string",
              "self": "string"
            },
            "id": "string",
            "type": "string",
            "version": "string"
          },
          "id": "string"
        },
        {
          "metadata": {
            "lastUser": {
              "name": "string",
              "links": {},
              "id": "string",
              "type": "string"
            },
            "domain": {
              "name": "string",
              "links": {},
              "id": "string",
              "type": "string"
            },
            "readOnly": {
              "reason": {},
              "state": true
            },
            "timestamp": 8
          },
          "modelId": "string",
          "description": "string",
          "modelType": "string",
          "type": "string",
          "version": "string",
          "sw_version": "string",
          "healthStatus": "string",
          "healthPolicy": {
            "name": "string",
            "links": {
              "parent": "string",
              "self": "string"
            },
            "id": "string",
            "type": "string"
          },
          "name": "string",
          "model": "string",
          "modelNumber": "string",
          "links": {
            "parent": "string",
            "self": "string"
          },
          "accessPolicy": {
            "metadata": {
              "lastUser": {
                "name": "string",
                "links": {},
                "id": "string",
                "type": "string"
              },
              "domain": {
                "name": "string",
                "links": {},
                "id": "string",
                "type": "string"
              },
              "readOnly": {
                "reason": {},
                "state": false
              },
              "timestamp": 3
            },
            "name": "string",
            "description": "string",
            "links": {
              "parent": "string",
              "self": "string"
            },
            "id": "string",
            "type": "string",
            "version": "string"
          },
          "id": "string"
        },
        {
          "metadata": {
            "lastUser": {
              "name": "string",
              "links": {},
              "id": "string",
              "type": "string"
            },
            "domain": {
              "name": "string",
              "links": {},
              "id": "string",
              "type": "string"
            },
            "readOnly": {
              "reason": {},
              "state": false
            },
            "timestamp": 1
          },
          "modelId": "string",
          "description": "string",
          "modelType": "string",
          "type": "string",
          "version": "string",
          "sw_version": "string",
          "healthStatus": "string",
          "healthPolicy": {
            "name": "string",
            "links": {
              "parent": "string",
              "self": "string"
            },
            "id": "string",
            "type": "string"
          },
          "name": "string",
          "model": "string",
          "modelNumber": "string",
          "links": {
            "parent": "string",
            "self": "string"
          },
          "accessPolicy": {
            "metadata": {
              "lastUser": {
                "name": "string",
                "links": {},
                "id": "string",
                "type": "string"
              },
              "domain": {
                "name": "string",
                "links": {},
                "id": "string",
                "type": "string"
              },
              "readOnly": {
                "reason": {},
                "state": true
              },
              "timestamp": 2
            },
            "name": "string",
            "description": "string",
            "links": {
              "parent": "string",
              "self": "string"
            },
            "id": "string",
            "type": "string",
            "version": "string"
          },
          "id": "string"
        },
        {
          "metadata": {
            "lastUser": {
              "name": "string",
              "links": {},
              "id": "string",
              "type": "string"
            },
            "domain": {
              "name": "string",
              "links": {},
              "id": "string",
              "type": "string"
            },
            "readOnly": {
              "reason": {},
              "state": true
            },
            "timestamp": 2
          },
          "modelId": "string",
          "description": "string",
          "modelType": "string",
          "type": "string",
          "version": "string",
          "sw_version": "string",
          "healthStatus": "string",
          "healthPolicy": {
            "name": "string",
            "links": {
              "parent": "string",
              "self": "string"
            },
            "id": "string",
            "type": "string"
          },
          "name": "string",
          "model": "string",
          "modelNumber": "string",
          "links": {
            "parent": "string",
            "self": "string"
          },
          "accessPolicy": {
            "metadata": {
              "lastUser": {
                "name": "string",
                "links": {},
                "id": "string",
                "type": "string"
              },
              "domain": {
                "name": "string",
                "links": {},
                "id": "string",
                "type": "string"
              },
              "readOnly": {
                "reason": {},
                "state": true
              },
              "timestamp": 6
            },
            "name": "string",
            "description": "string",
            "links": {
              "parent": "string",
              "self": "string"
            },
            "id": "string",
            "type": "string",
            "version": "string"
          },
          "id": "string"
        },
        {
          "metadata": {
            "lastUser": {
              "name": "string",
              "links": {},
              "id": "string",
              "type": "string"
            },
            "domain": {
              "name": "string",
              "links": {},
              "id": "string",
              "type": "string"
            },
            "readOnly": {
              "reason": {},
              "state": false
            },
            "timestamp": 7
          },
          "modelId": "string",
          "description": "string",
          "modelType": "string",
          "type": "string",
          "version": "string",
          "sw_version": "string",
          "healthStatus": "string",
          "healthPolicy": {
            "name": "string",
            "links": {
              "parent": "string",
              "self": "string"
            },
            "id": "string",
            "type": "string"
          },
          "name": "string",
          "model": "string",
          "modelNumber": "string",
          "links": {
            "parent": "string",
            "self": "string"
          },
          "accessPolicy": {
            "metadata": {
              "lastUser": {
                "name": "string",
                "links": {},
                "id": "string",
                "type": "string"
              },
              "domain": {
                "name": "string",
                "links": {},
                "id": "string",
                "type": "string"
              },
              "readOnly": {
                "reason": {},
                "state": false
              },
              "timestamp": 9
            },
            "name": "string",
            "description": "string",
            "links": {
              "parent": "string",
              "self": "string"
            },
            "id": "string",
            "type": "string",
            "version": "string"
          },
          "id": "string"
        },
        {
          "metadata": {
            "lastUser": {
              "name": "string",
              "links": {},
              "id": "string",
              "type": "string"
            },
            "domain": {
              "name": "string",
              "links": {},
              "id": "string",
              "type": "string"
            },
            "readOnly": {
              "reason": {},
              "state": false
            },
            "timestamp": 10
          },
          "modelId": "string",
          "description": "string",
          "modelType": "string",
          "type": "string",
          "version": "string",
          "sw_version": "string",
          "healthStatus": "string",
          "healthPolicy": {
            "name": "string",
            "links": {
              "parent": "string",
              "self": "string"
            },
            "id": "string",
            "type": "string"
          },
          "name": "string",
          "model": "string",
          "modelNumber": "string",
          "links": {
            "parent": "string",
            "self": "string"
          },
          "accessPolicy": {
            "metadata": {
              "lastUser": {
                "name": "string",
                "links": {},
                "id": "string",
                "type": "string"
              },
              "domain": {
                "name": "string",
                "links": {},
                "id": "string",
                "type": "string"
              },
              "readOnly": {
                "reason": {},
                "state": true
              },
              "timestamp": 10
            },
            "name": "string",
            "description": "string",
            "links": {
              "parent": "string",
              "self": "string"
            },
            "id": "string",
            "type": "string",
            "version": "string"
          },
          "id": "string"
        }
      ],
      "name": "string",
      "description": "string",
      "links": {
        "parent": "string",
        "self": "string"
      },
      "id": "string",
      "type": "string",
      "version": "string"
    },
    {
      "metadata": {
        "lastUser": {
          "name": "string",
          "links": {},
          "id": "string",
          "type": "string"
        },
        "domain": {
          "name": "string",
          "links": {},
          "id": "string",
          "type": "string"
        },
        "readOnly": {
          "reason": {},
          "state": false
        },
        "timestamp": 4
      },
      "members": [
        {
          "metadata": {
            "lastUser": {
              "name": "string",
              "links": {},
              "id": "string",
              "type": "string"
            },
            "domain": {
              "name": "string",
              "links": {},
              "id": "string",
              "type": "string"
            },
            "readOnly": {
              "reason": {},
              "state": true
            },
            "timestamp": 3
          },
          "modelId": "string",
          "description": "string",
          "modelType": "string",
          "type": "string",
          "version": "string",
          "sw_version": "string",
          "healthStatus": "string",
          "healthPolicy": {
            "name": "string",
            "links": {
              "parent": "string",
              "self": "string"
            },
            "id": "string",
            "type": "string"
          },
          "name": "string",
          "model": "string",
          "modelNumber": "string",
          "links": {
            "parent": "string",
            "self": "string"
          },
          "accessPolicy": {
            "metadata": {
              "lastUser": {
                "name": "string",
                "links": {},
                "id": "string",
                "type": "string"
              },
              "domain": {
                "name": "string",
                "links": {},
                "id": "string",
                "type": "string"
              },
              "readOnly": {
                "reason": {},
                "state": false
              },
              "timestamp": 10
            },
            "name": "string",
            "description": "string",
            "links": {
              "parent": "string",
              "self": "string"
            },
            "id": "string",
            "type": "string",
            "version": "string"
          },
          "id": "string"
        },
        {
          "metadata": {
            "lastUser": {
              "name": "string",
              "links": {},
              "id": "string",
              "type": "string"
            },
            "domain": {
              "name": "string",
              "links": {},
              "id": "string",
              "type": "string"
            },
            "readOnly": {
              "reason": {},
              "state": false
            },
            "timestamp": 10
          },
          "modelId": "string",
          "description": "string",
          "modelType": "string",
          "type": "string",
          "version": "string",
          "sw_version": "string",
          "healthStatus": "string",
          "healthPolicy": {
            "name": "string",
            "links": {
              "parent": "string",
              "self": "string"
            },
            "id": "string",
            "type": "string"
          },
          "name": "string",
          "model": "string",
          "modelNumber": "string",
          "links": {
            "parent": "string",
            "self": "string"
          },
          "accessPolicy": {
            "metadata": {
              "lastUser": {
                "name": "string",
                "links": {},
                "id": "string",
                "type": "string"
              },
              "domain": {
                "name": "string",
                "links": {},
                "id": "string",
                "type": "string"
              },
              "readOnly": {
                "reason": {},
                "state": true
              },
              "timestamp": 10
            },
            "name": "string",
            "description": "string",
            "links": {
              "parent": "string",
              "self": "string"
            },
            "id": "string",
            "type": "string",
            "version": "string"
          },
          "id": "string"
        },
        {
          "metadata": {
            "lastUser": {
              "name": "string",
              "links": {},
              "id": "string",
              "type": "string"
            },
            "domain": {
              "name": "string",
              "links": {},
              "id": "string",
              "type": "string"
            },
            "readOnly": {
              "reason": {},
              "state": true
            },
            "timestamp": 6
          },
          "modelId": "string",
          "description": "string",
          "modelType": "string",
          "type": "string",
          "version": "string",
          "sw_version": "string",
          "healthStatus": "string",
          "healthPolicy": {
            "name": "string",
            "links": {
              "parent": "string",
              "self": "string"
            },
            "id": "string",
            "type": "string"
          },
          "name": "string",
          "model": "string",
          "modelNumber": "string",
          "links": {
            "parent": "string",
            "self": "string"
          },
          "accessPolicy": {
            "metadata": {
              "lastUser": {
                "name": "string",
                "links": {},
                "id": "string",
                "type": "string"
              },
              "domain": {
                "name": "string",
                "links": {},
                "id": "string",
                "type": "string"
              },
              "readOnly": {
                "reason": {},
                "state": false
              },
              "timestamp": 1
            },
            "name": "string",
            "description": "string",
            "links": {
              "parent": "string",
              "self": "string"
            },
            "id": "string",
            "type": "string",
            "version": "string"
          },
          "id": "string"
        },
        {
          "metadata": {
            "lastUser": {
              "name": "string",
              "links": {},
              "id": "string",
              "type": "string"
            },
            "domain": {
              "name": "string",
              "links": {},
              "id": "string",
              "type": "string"
            },
            "readOnly": {
              "reason": {},
              "state": false
            },
            "timestamp": 2
          },
          "modelId": "string",
          "description": "string",
          "modelType": "string",
          "type": "string",
          "version": "string",
          "sw_version": "string",
          "healthStatus": "string",
          "healthPolicy": {
            "name": "string",
            "links": {
              "parent": "string",
              "self": "string"
            },
            "id": "string",
            "type": "string"
          },
          "name": "string",
          "model": "string",
          "modelNumber": "string",
          "links": {
            "parent": "string",
            "self": "string"
          },
          "accessPolicy": {
            "metadata": {
              "lastUser": {
                "name": "string",
                "links": {},
                "id": "string",
                "type": "string"
              },
              "domain": {
                "name": "string",
                "links": {},
                "id": "string",
                "type": "string"
              },
              "readOnly": {
                "reason": {},
                "state": false
              },
              "timestamp": 10
            },
            "name": "string",
            "description": "string",
            "links": {
              "parent": "string",
              "self": "string"
            },
            "id": "string",
            "type": "string",
            "version": "string"
          },
          "id": "string"
        },
        {
          "metadata": {
            "lastUser": {
              "name": "string",
              "links": {},
              "id": "string",
              "type": "string"
            },
            "domain": {
              "name": "string",
              "links": {},
              "id": "string",
              "type": "string"
            },
            "readOnly": {
              "reason": {},
              "state": false
            },
            "timestamp": 6
          },
          "modelId": "string",
          "description": "string",
          "modelType": "string",
          "type": "string",
          "version": "string",
          "sw_version": "string",
          "healthStatus": "string",
          "healthPolicy": {
            "name": "string",
            "links": {
              "parent": "string",
              "self": "string"
            },
            "id": "string",
            "type": "string"
          },
          "name": "string",
          "model": "string",
          "modelNumber": "string",
          "links": {
            "parent": "string",
            "self": "string"
          },
          "accessPolicy": {
            "metadata": {
              "lastUser": {
                "name": "string",
                "links": {},
                "id": "string",
                "type": "string"
              },
              "domain": {
                "name": "string",
                "links": {},
                "id": "string",
                "type": "string"
              },
              "readOnly": {
                "reason": {},
                "state": false
              },
              "timestamp": 1
            },
            "name": "string",
            "description": "string",
            "links": {
              "parent": "string",
              "self": "string"
            },
            "id": "string",
            "type": "string",
            "version": "string"
          },
          "id": "string"
        }
      ],
      "name": "string",
      "description": "string",
      "links": {
        "parent": "string",
        "self": "string"
      },
      "id": "string",
      "type": "string",
      "version": "string"
    },
    {
      "metadata": {
        "lastUser": {
          "name": "string",
          "links": {},
          "id": "string",
          "type": "string"
        },
        "domain": {
          "name": "string",
          "links": {},
          "id": "string",
          "type": "string"
        },
        "readOnly": {
          "reason": {},
          "state": true
        },
        "timestamp": 3
      },
      "members": [
        {
          "metadata": {
            "lastUser": {
              "name": "string",
              "links": {},
              "id": "string",
              "type": "string"
            },
            "domain": {
              "name": "string",
              "links": {},
              "id": "string",
              "type": "string"
            },
            "readOnly": {
              "reason": {},
              "state": true
            },
            "timestamp": 9
          },
          "modelId": "string",
          "description": "string",
          "modelType": "string",
          "type": "string",
          "version": "string",
          "sw_version": "string",
          "healthStatus": "string",
          "healthPolicy": {
            "name": "string",
            "links": {
              "parent": "string",
              "self": "string"
            },
            "id": "string",
            "type": "string"
          },
          "name": "string",
          "model": "string",
          "modelNumber": "string",
          "links": {
            "parent": "string",
            "self": "string"
          },
          "accessPolicy": {
            "metadata": {
              "lastUser": {
                "name": "string",
                "links": {},
                "id": "string",
                "type": "string"
              },
              "domain": {
                "name": "string",
                "links": {},
                "id": "string",
                "type": "string"
              },
              "readOnly": {
                "reason": {},
                "state": false
              },
              "timestamp": 7
            },
            "name": "string",
            "description": "string",
            "links": {
              "parent": "string",
              "self": "string"
            },
            "id": "string",
            "type": "string",
            "version": "string"
          },
          "id": "string"
        },
        {
          "metadata": {
            "lastUser": {
              "name": "string",
              "links": {},
              "id": "string",
              "type": "string"
            },
            "domain": {
              "name": "string",
              "links": {},
              "id": "string",
              "type": "string"
            },
            "readOnly": {
              "reason": {},
              "state": false
            },
            "timestamp": 6
          },
          "modelId": "string",
          "description": "string",
          "modelType": "string",
          "type": "string",
          "version": "string",
          "sw_version": "string",
          "healthStatus": "string",
          "healthPolicy": {
            "name": "string",
            "links": {
              "parent": "string",
              "self": "string"
            },
            "id": "string",
            "type": "string"
          },
          "name": "string",
          "model": "string",
          "modelNumber": "string",
          "links": {
            "parent": "string",
            "self": "string"
          },
          "accessPolicy": {
            "metadata": {
              "lastUser": {
                "name": "string",
                "links": {},
                "id": "string",
                "type": "string"
              },
              "domain": {
                "name": "string",
                "links": {},
                "id": "string",
                "type": "string"
              },
              "readOnly": {
                "reason": {},
                "state": false
              },
              "timestamp": 8
            },
            "name": "string",
            "description": "string",
            "links": {
              "parent": "string",
              "self": "string"
            },
            "id": "string",
            "type": "string",
            "version": "string"
          },
          "id": "string"
        },
        {
          "metadata": {
            "lastUser": {
              "name": "string",
              "links": {},
              "id": "string",
              "type": "string"
            },
            "domain": {
              "name": "string",
              "links": {},
              "id": "string",
              "type": "string"
            },
            "readOnly": {
              "reason": {},
              "state": true
            },
            "timestamp": 6
          },
          "modelId": "string",
          "description": "string",
          "modelType": "string",
          "type": "string",
          "version": "string",
          "sw_version": "string",
          "healthStatus": "string",
          "healthPolicy": {
            "name": "string",
            "links": {
              "parent": "string",
              "self": "string"
            },
            "id": "string",
            "type": "string"
          },
          "name": "string",
          "model": "string",
          "modelNumber": "string",
          "links": {
            "parent": "string",
            "self": "string"
          },
          "accessPolicy": {
            "metadata": {
              "lastUser": {
                "name": "string",
                "links": {},
                "id": "string",
                "type": "string"
              },
              "domain": {
                "name": "string",
                "links": {},
                "id": "string",
                "type": "string"
              },
              "readOnly": {
                "reason": {},
                "state": true
              },
              "timestamp": 2
            },
            "name": "string",
            "description": "string",
            "links": {
              "parent": "string",
              "self": "string"
            },
            "id": "string",
            "type": "string",
            "version": "string"
          },
          "id": "string"
        },
        {
          "metadata": {
            "lastUser": {
              "name": "string",
              "links": {},
              "id": "string",
              "type": "string"
            },
            "domain": {
              "name": "string",
              "links": {},
              "id": "string",
              "type": "string"
            },
            "readOnly": {
              "reason": {},
              "state": false
            },
            "timestamp": 8
          },
          "modelId": "string",
          "description": "string",
          "modelType": "string",
          "type": "string",
          "version": "string",
          "sw_version": "string",
          "healthStatus": "string",
          "healthPolicy": {
            "name": "string",
            "links": {
              "parent": "string",
              "self": "string"
            },
            "id": "string",
            "type": "string"
          },
          "name": "string",
          "model": "string",
          "modelNumber": "string",
          "links": {
            "parent": "string",
            "self": "string"
          },
          "accessPolicy": {
            "metadata": {
              "lastUser": {
                "name": "string",
                "links": {},
                "id": "string",
                "type": "string"
              },
              "domain": {
                "name": "string",
                "links": {},
                "id": "string",
                "type": "string"
              },
              "readOnly": {
                "reason": {},
                "state": false
              },
              "timestamp": 7
            },
            "name": "string",
            "description": "string",
            "links": {
              "parent": "string",
              "self": "string"
            },
            "id": "string",
            "type": "string",
            "version": "string"
          },
          "id": "string"
        }
      ],
      "name": "string",
      "description": "string",
      "links": {
        "parent": "string",
        "self": "string"
      },
      "id": "string",
      "type": "string",
      "version": "string"
    },
    {
      "metadata": {
        "lastUser": {
          "name": "string",
          "links": {},
          "id": "string",
          "type": "string"
        },
        "domain": {
          "name": "string",
          "links": {},
          "id": "string",
          "type": "string"
        },
        "readOnly": {
          "reason": {},
          "state": true
        },
        "timestamp": 4
      },
      "members": [
        {
          "metadata": {
            "lastUser": {
              "name": "string",
              "links": {},
              "id": "string",
              "type": "string"
            },
            "domain": {
              "name": "string",
              "links": {},
              "id": "string",
              "type": "string"
            },
            "readOnly": {
              "reason": {},
              "state": true
            },
            "timestamp": 5
          },
          "modelId": "string",
          "description": "string",
          "modelType": "string",
          "type": "string",
          "version": "string",
          "sw_version": "string",
          "healthStatus": "string",
          "healthPolicy": {
            "name": "string",
            "links": {
              "parent": "string",
              "self": "string"
            },
            "id": "string",
            "type": "string"
          },
          "name": "string",
          "model": "string",
          "modelNumber": "string",
          "links": {
            "parent": "string",
            "self": "string"
          },
          "accessPolicy": {
            "metadata": {
              "lastUser": {
                "name": "string",
                "links": {},
                "id": "string",
                "type": "string"
              },
              "domain": {
                "name": "string",
                "links": {},
                "id": "string",
                "type": "string"
              },
              "readOnly": {
                "reason": {},
                "state": true
              },
              "timestamp": 2
            },
            "name": "string",
            "description": "string",
            "links": {
              "parent": "string",
              "self": "string"
            },
            "id": "string",
            "type": "string",
            "version": "string"
          },
          "id": "string"
        },
        {
          "metadata": {
            "lastUser": {
              "name": "string",
              "links": {},
              "id": "string",
              "type": "string"
            },
            "domain": {
              "name": "string",
              "links": {},
              "id": "string",
              "type": "string"
            },
            "readOnly": {
              "reason": {},
              "state": false
            },
            "timestamp": 7
          },
          "modelId": "string",
          "description": "string",
          "modelType": "string",
          "type": "string",
          "version": "string",
          "sw_version": "string",
          "healthStatus": "string",
          "healthPolicy": {
            "name": "string",
            "links": {
              "parent": "string",
              "self": "string"
            },
            "id": "string",
            "type": "string"
          },
          "name": "string",
          "model": "string",
          "modelNumber": "string",
          "links": {
            "parent": "string",
            "self": "string"
          },
          "accessPolicy": {
            "metadata": {
              "lastUser": {
                "name": "string",
                "links": {},
                "id": "string",
                "type": "string"
              },
              "domain": {
                "name": "string",
                "links": {},
                "id": "string",
                "type": "string"
              },
              "readOnly": {
                "reason": {},
                "state": true
              },
              "timestamp": 2
            },
            "name": "string",
            "description": "string",
            "links": {
              "parent": "string",
              "self": "string"
            },
            "id": "string",
            "type": "string",
            "version": "string"
          },
          "id": "string"
        },
        {
          "metadata": {
            "lastUser": {
              "name": "string",
              "links": {},
              "id": "string",
              "type": "string"
            },
            "domain": {
              "name": "string",
              "links": {},
              "id": "string",
              "type": "string"
            },
            "readOnly": {
              "reason": {},
              "state": false
            },
            "timestamp": 3
          },
          "modelId": "string",
          "description": "string",
          "modelType": "string",
          "type": "string",
          "version": "string",
          "sw_version": "string",
          "healthStatus": "string",
          "healthPolicy": {
            "name": "string",
            "links": {
              "parent": "string",
              "self": "string"
            },
            "id": "string",
            "type": "string"
          },
          "name": "string",
          "model": "string",
          "modelNumber": "string",
          "links": {
            "parent": "string",
            "self": "string"
          },
          "accessPolicy": {
            "metadata": {
              "lastUser": {
                "name": "string",
                "links": {},
                "id": "string",
                "type": "string"
              },
              "domain": {
                "name": "string",
                "links": {},
                "id": "string",
                "type": "string"
              },
              "readOnly": {
                "reason": {},
                "state": false
              },
              "timestamp": 7
            },
            "name": "string",
            "description": "string",
            "links": {
              "parent": "string",
              "self": "string"
            },
            "id": "string",
            "type": "string",
            "version": "string"
          },
          "id": "string"
        },
        {
          "metadata": {
            "lastUser": {
              "name": "string",
              "links": {},
              "id": "string",
              "type": "string"
            },
            "domain": {
              "name": "string",
              "links": {},
              "id": "string",
              "type": "string"
            },
            "readOnly": {
              "reason": {},
              "state": false
            },
            "timestamp": 10
          },
          "modelId": "string",
          "description": "string",
          "modelType": "string",
          "type": "string",
          "version": "string",
          "sw_version": "string",
          "healthStatus": "string",
          "healthPolicy": {
            "name": "string",
            "links": {
              "parent": "string",
              "self": "string"
            },
            "id": "string",
            "type": "string"
          },
          "name": "string",
          "model": "string",
          "modelNumber": "string",
          "links": {
            "parent": "string",
            "self": "string"
          },
          "accessPolicy": {
            "metadata": {
              "lastUser": {
                "name": "string",
                "links": {},
                "id": "string",
                "type": "string"
              },
              "domain": {
                "name": "string",
                "links": {},
                "id": "string",
                "type": "string"
              },
              "readOnly": {
                "reason": {},
                "state": true
              },
              "timestamp": 10
            },
            "name": "string",
            "description": "string",
            "links": {
              "parent": "string",
              "self": "string"
            },
            "id": "string",
            "type": "string",
            "version": "string"
          },
          "id": "string"
        },
        {
          "metadata": {
            "lastUser": {
              "name": "string",
              "links": {},
              "id": "string",
              "type": "string"
            },
            "domain": {
              "name": "string",
              "links": {},
              "id": "string",
              "type": "string"
            },
            "readOnly": {
              "reason": {},
              "state": false
            },
            "timestamp": 5
          },
          "modelId": "string",
          "description": "string",
          "modelType": "string",
          "type": "string",
          "version": "string",
          "sw_version": "string",
          "healthStatus": "string",
          "healthPolicy": {
            "name": "string",
            "links": {
              "parent": "string",
              "self": "string"
            },
            "id": "string",
            "type": "string"
          },
          "name": "string",
          "model": "string",
          "modelNumber": "string",
          "links": {
            "parent": "string",
            "self": "string"
          },
          "accessPolicy": {
            "metadata": {
              "lastUser": {
                "name": "string",
                "links": {},
                "id": "string",
                "type": "string"
              },
              "domain": {
                "name": "string",
                "links": {},
                "id": "string",
                "type": "string"
              },
              "readOnly": {
                "reason": {},
                "state": true
              },
              "timestamp": 10
            },
            "name": "string",
            "description": "string",
            "links": {
              "parent": "string",
              "self": "string"
            },
            "id": "string",
            "type": "string",
            "version": "string"
          },
          "id": "string"
        },
        {
          "metadata": {
            "lastUser": {
              "name": "string",
              "links": {},
              "id": "string",
              "type": "string"
            },
            "domain": {
              "name": "string",
              "links": {},
              "id": "string",
              "type": "string"
            },
            "readOnly": {
              "reason": {},
              "state": false
            },
            "timestamp": 6
          },
          "modelId": "string",
          "description": "string",
          "modelType": "string",
          "type": "string",
          "version": "string",
          "sw_version": "string",
          "healthStatus": "string",
          "healthPolicy": {
            "name": "string",
            "links": {
              "parent": "string",
              "self": "string"
            },
            "id": "string",
            "type": "string"
          },
          "name": "string",
          "model": "string",
          "modelNumber": "string",
          "links": {
            "parent": "string",
            "self": "string"
          },
          "accessPolicy": {
            "metadata": {
              "lastUser": {
                "name": "string",
                "links": {},
                "id": "string",
                "type": "string"
              },
              "domain": {
                "name": "string",
                "links": {},
                "id": "string",
                "type": "string"
              },
              "readOnly": {
                "reason": {},
                "state": false
              },
              "timestamp": 2
            },
            "name": "string",
            "description": "string",
            "links": {
              "parent": "string",
              "self": "string"
            },
            "id": "string",
            "type": "string",
            "version": "string"
          },
          "id": "string"
        },
        {
          "metadata": {
            "lastUser": {
              "name": "string",
              "links": {},
              "id": "string",
              "type": "string"
            },
            "domain": {
              "name": "string",
              "links": {},
              "id": "string",
              "type": "string"
            },
            "readOnly": {
              "reason": {},
              "state": true
            },
            "timestamp": 6
          },
          "modelId": "string",
          "description": "string",
          "modelType": "string",
          "type": "string",
          "version": "string",
          "sw_version": "string",
          "healthStatus": "string",
          "healthPolicy": {
            "name": "string",
            "links": {
              "parent": "string",
              "self": "string"
            },
            "id": "string",
            "type": "string"
          },
          "name": "string",
          "model": "string",
          "modelNumber": "string",
          "links": {
            "parent": "string",
            "self": "string"
          },
          "accessPolicy": {
            "metadata": {
              "lastUser": {
                "name": "string",
                "links": {},
                "id": "string",
                "type": "string"
              },
              "domain": {
                "name": "string",
                "links": {},
                "id": "string",
                "type": "string"
              },
              "readOnly": {
                "reason": {},
                "state": true
              },
              "timestamp": 10
            },
            "name": "string",
            "description": "string",
            "links": {
              "parent": "string",
              "self": "string"
            },
            "id": "string",
            "type": "string",
            "version": "string"
          },
          "id": "string"
        },
        {
          "metadata": {
            "lastUser": {
              "name": "string",
              "links": {},
              "id": "string",
              "type": "string"
            },
            "domain": {
              "name": "string",
              "links": {},
              "id": "string",
              "type": "string"
            },
            "readOnly": {
              "reason": {},
              "state": true
            },
            "timestamp": 2
          },
          "modelId": "string",
          "description": "string",
          "modelType": "string",
          "type": "string",
          "version": "string",
          "sw_version": "string",
          "healthStatus": "string",
          "healthPolicy": {
            "name": "string",
            "links": {
              "parent": "string",
              "self": "string"
            },
            "id": "string",
            "type": "string"
          },
          "name": "string",
          "model": "string",
          "modelNumber": "string",
          "links": {
            "parent": "string",
            "self": "string"
          },
          "accessPolicy": {
            "metadata": {
              "lastUser": {
                "name": "string",
                "links": {},
                "id": "string",
                "type": "string"
              },
              "domain": {
                "name": "string",
                "links": {},
                "id": "string",
                "type": "string"
              },
              "readOnly": {
                "reason": {},
                "state": false
              },
              "timestamp": 6
            },
            "name": "string",
            "description": "string",
            "links": {
              "parent": "string",
              "self": "string"
            },
            "id": "string",
            "type": "string",
            "version": "string"
          },
          "id": "string"
        },
        {
          "metadata": {
            "lastUser": {
              "name": "string",
              "links": {},
              "id": "string",
              "type": "string"
            },
            "domain": {
              "name": "string",
              "links": {},
              "id": "string",
              "type": "string"
            },
            "readOnly": {
              "reason": {},
              "state": false
            },
            "timestamp": 8
          },
          "modelId": "string",
          "description": "string",
          "modelType": "string",
          "type": "string",
          "version": "string",
          "sw_version": "string",
          "healthStatus": "string",
          "healthPolicy": {
            "name": "string",
            "links": {
              "parent": "string",
              "self": "string"
            },
            "id": "string",
            "type": "string"
          },
          "name": "string",
          "model": "string",
          "modelNumber": "string",
          "links": {
            "parent": "string",
            "self": "string"
          },
          "accessPolicy": {
            "metadata": {
              "lastUser": {
                "name": "string",
                "links": {},
                "id": "string",
                "type": "string"
              },
              "domain": {
                "name": "string",
                "links": {},
                "id": "string",
                "type": "string"
              },
              "readOnly": {
                "reason": {},
                "state": true
              },
              "timestamp": 6
            },
            "name": "string",
            "description": "string",
            "links": {
              "parent": "string",
              "self": "string"
            },
            "id": "string",
            "type": "string",
            "version": "string"
          },
          "id": "string"
        }
      ],
      "name": "string",
      "description": "string",
      "links": {
        "parent": "string",
        "self": "string"
      },
      "id": "string",
      "type": "string",
      "version": "string"
    }
  ]
}