{
  "id": "ExternalLookupUUID",
  "type": "ExternalLookup",
  "name": "test1055",
  "links": {
    "self": "/fmc_config/v1/domain/DomainUUID/integration/externallookups/ExternalLookupUUID"
  },
  "template": "http://www.example.com/{ip}",
  "enabled": true
}