{
  "links": {
    "self": "/fmc_config/v1/domain/domainUUID/object/urls/urlUUID/overrides?offset=0&limit=1"
  },
  "items": [
    {
      "links": {
        "self": "/fmc_config/v1/domain/domainUUID/object/urls/urlUUID?overrideTargetId=targetUUID"
      },
      "type": "Url",
      "url": "abcDevice.com",
      "overrides": {
        "parent": {
          "id": "urlUUID",
          "type": "Url"
        },
        "target": {
          "name": "10.10.19.27",
          "id": "targetUUID",
          "type": "Device"
        }
      },
      "overridable": true,
      "description": " ",
      "name": "url_2",
      "id": "urlUUID",
      "metadata": {
        "timestamp": 1520419867090,
        "lastUser": {
          "name": "user1"
        },
        "domain": {
          "name": "Global \\ INDIA \\ BENGALURU",
          "id": "domainUUID"
        }
      }
    }
  ],
  "paging": {
    "offset": 0,
    "limit": 1,
    "count": 1,
    "pages": 1
  }
}