{
  "name": "Default-Set-TestDomain",
  "id": "Variable-Set-UUID-1",
  "type": "variableset",
  "description": "This Variable Set is system-provided.",
  "links": {
    "self": "https://example.cisco.com/api/fmc_config/v1/domain/domainUUID/object/variablesets/Variable-Set-UUID-1"
  },
  "metadata": {
    "readOnly": {
      "state": true
    },
    "timestamp": 1460056664,
    "lastUser": {
      "name": "admin",
      "id": "User-UUID",
      "type": "user"
    },
    "domain": {
      "name": "TestDomain",
      "id": "domainUUID",
      "type": "domain"
    }
  }
}