{
  "actions": [
    {
      "name": "getAllUpgradePackage",
      "protocol": "REST",
      "method": "GET",
      "entitypath": "{base_path}/{version}/api/fmc_platform/v1/updates/upgradepackages?{query}",
      "requestSchema": "schema.json",
      "responseSchema": "schema.json",
      "timeout": 0,
      "sendEmpty": false,
      "sendGetBody": false,
      "requestDatatype": "JSON",
      "responseDatatype": "JSON",
      "headers": {},
      "responseObjects": [
        {
          "type": "default",
          "key": "",
          "mockFile": "mockdatafiles/getAllUpgradePackage-default.json"
        }
      ]
    },
    {
      "name": "getAllApplicableDevice",
      "protocol": "REST",
      "method": "GET",
      "entitypath": "{base_path}/{version}/api/fmc_platform/v1/updates/upgradepackages/{pathv1}/applicabledevices?{query}",
      "requestSchema": "schema.json",
      "responseSchema": "schema.json",
      "timeout": 0,
      "sendEmpty": false,
      "sendGetBody": false,
      "requestDatatype": "JSON",
      "responseDatatype": "JSON",
      "headers": {},
      "responseObjects": [
        {
          "type": "default",
          "key": "",
          "mockFile": "mockdatafiles/getAllApplicableDevice-default.json"
        }
      ]
    },
    {
      "name": "getUpgradePackage",
      "protocol": "REST",
      "method": "GET",
      "entitypath": "{base_path}/{version}/api/fmc_platform/v1/updates/upgradepackages/{pathv1}?{query}",
      "requestSchema": "schema.json",
      "responseSchema": "schema.json",
      "timeout": 0,
      "sendEmpty": false,
      "sendGetBody": false,
      "requestDatatype": "JSON",
      "responseDatatype": "JSON",
      "headers": {},
      "responseObjects": [
        {
          "type": "default",
          "key": "",
          "mockFile": "mockdatafiles/getUpgradePackage-default.json"
        }
      ]
    },
    {
      "name": "deleteUpgradePackage",
      "protocol": "REST",
      "method": "DELETE",
      "entitypath": "{base_path}/{version}/api/fmc_platform/v1/updates/upgradepackages/{pathv1}?{query}",
      "requestSchema": "schema.json",
      "responseSchema": "schema.json",
      "timeout": 0,
      "sendEmpty": false,
      "requestDatatype": "JSON",
      "responseDatatype": "JSON",
      "headers": {},
      "responseObjects": [
        {
          "type": "default",
          "key": "",
          "mockFile": "mockdatafiles/deleteUpgradePackage-default.json"
        }
      ]
    },
    {
      "name": "createUpgrade",
      "protocol": "REST",
      "method": "POST",
      "entitypath": "{base_path}/{version}/api/fmc_platform/v1/updates/upgrades?{query}",
      "requestSchema": "schema.json",
      "responseSchema": "schema.json",
      "timeout": 0,
      "sendEmpty": false,
      "requestDatatype": "JSON",
      "responseDatatype": "JSON",
      "headers": {},
      "responseObjects": [
        {
          "type": "default",
          "key": "",
          "mockFile": "mockdatafiles/createUpgrade-default.json"
        }
      ]
    }
  ]
}