{
  "name": "virtual_switch_2",
  "id": "virtualswitchUUID2",
  "type": "VirtualSwitch",
  "domainId": 3,
  "dropBPDU": true,
  "enableSpanningTreeProtocol": false,
  "strictTCPEnforcement": false,
  "hybridInterface": {
    "name": "hybrid_1",
    "type": "FPLogicalInterface",
    "id": "hybridInterfaceUUID"
  },
  "switchedInterfaces": [
    {
      "name": "s1p3.1",
      "type": "FPLogicalInterface",
      "id": "switchedInterfaceUUID1"
    },
    {
      "name": "s1p4.1",
      "type": "FPLogicalInterface",
      "id": "switchedInterfaceUUID2"
    }
  ]
}