{
  "type": "FTDNatPolicy",
  "links": {
    "self": "<fmc_ip>/api/fmc_config/v1/domain/domainUUID/policy/ftdnatpolicies/natPolUuid1"
  },
  "rules": {
    "refType": "list",
    "links": {
      "self": "<fmc_ip>/api/fmc_config/v1/domain/domainUUID/policy/ftdnatpolicies/natPolUuid1/natrules"
    }
  },
  "name": "NatPol",
  "description": "nat policy for testing",
  "id": "natPolUuid1"
}