{
  "metadata": {
    "lastUser": {
      "name": "admin"
    },
    "domain": {
      "name": "Global",
      "id": "global_domain_id"
    }
  },
  "links": {
    "self": "https://fmc_host_ip/api/fmc_config/v1/domain/global/object/urls/urlObjectUUID"
  },
  "type": "Url",
  "url": "www.cisco.com",
  "overridable": false,
  "description": " ",
  "name": "url_obj1",
  "id": "urlObjectUUID"
}