{
  "metadata": {
    "lastUser": {
      "name": "string",
      "links": {},
      "id": "string",
      "type": "string"
    },
    "domain": {
      "name": "string",
      "links": {},
      "id": "string",
      "type": "string"
    },
    "readOnly": {
      "reason": {},
      "state": true
    },
    "timestamp": 5
  },
  "description": "string",
  "type": "string",
  "enabled": true,
  "MTU": 7,
  "mode": "TAP",
  "arpConfig": [
    {
      "macAddress": "string",
      "enableAlias": false,
      "ipAddress": "string"
    },
    {
      "macAddress": "string",
      "enableAlias": true,
      "ipAddress": "string"
    },
    {
      "macAddress": "string",
      "enableAlias": false,
      "ipAddress": "string"
    },
    {
      "macAddress": "string",
      "enableAlias": true,
      "ipAddress": "string"
    },
    {
      "macAddress": "string",
      "enableAlias": false,
      "ipAddress": "string"
    },
    {
      "macAddress": "string",
      "enableAlias": true,
      "ipAddress": "string"
    },
    {
      "macAddress": "string",
      "enableAlias": true,
      "ipAddress": "string"
    },
    {
      "macAddress": "string",
      "enableAlias": false,
      "ipAddress": "string"
    },
    {
      "macAddress": "string",
      "enableAlias": true,
      "ipAddress": "string"
    }
  ],
  "selectedInterfaces": [
    {
      "metadata": {
        "lastUser": {
          "name": "string",
          "links": {},
          "id": "string",
          "type": "string"
        },
        "domain": {
          "name": "string",
          "links": {},
          "id": "string",
          "type": "string"
        },
        "readOnly": {
          "reason": {},
          "state": true
        },
        "timestamp": 3
      },
      "name": "string",
      "description": "string",
      "links": {
        "parent": "string",
        "self": "string"
      },
      "id": "string",
      "type": "string",
      "version": "string"
    },
    {
      "metadata": {
        "lastUser": {
          "name": "string",
          "links": {},
          "id": "string",
          "type": "string"
        },
        "domain": {
          "name": "string",
          "links": {},
          "id": "string",
          "type": "string"
        },
        "readOnly": {
          "reason": {},
          "state": true
        },
        "timestamp": 4
      },
      "name": "string",
      "description": "string",
      "links": {
        "parent": "string",
        "self": "string"
      },
      "id": "string",
      "type": "string",
      "version": "string"
    },
    {
      "metadata": {
        "lastUser": {
          "name": "string",
          "links": {},
          "id": "string",
          "type": "string"
        },
        "domain": {
          "name": "string",
          "links": {},
          "id": "string",
          "type": "string"
        },
        "readOnly": {
          "reason": {},
          "state": false
        },
        "timestamp": 8
      },
      "name": "string",
      "description": "string",
      "links": {
        "parent": "string",
        "self": "string"
      },
      "id": "string",
      "type": "string",
      "version": "string"
    },
    {
      "metadata": {
        "lastUser": {
          "name": "string",
          "links": {},
          "id": "string",
          "type": "string"
        },
        "domain": {
          "name": "string",
          "links": {},
          "id": "string",
          "type": "string"
        },
        "readOnly": {
          "reason": {},
          "state": true
        },
        "timestamp": 9
      },
      "name": "string",
      "description": "string",
      "links": {
        "parent": "string",
        "self": "string"
      },
      "id": "string",
      "type": "string",
      "version": "string"
    }
  ],
  "ipv4": {
    "static": {
      "address": "string",
      "netmask": "string"
    },
    "pppoe": {
      "pppoePassword": "string",
      "pppoeRouteMetric": 8,
      "ipAddress": "string",
      "vpdnGroupName": "string",
      "pppAuth": "MSCHAP",
      "enableRouteSettings": true,
      "storeCredsInFlash": false,
      "pppoeUser": "string"
    },
    "dhcp": {
      "dhcpRouteMetric": 1,
      "enableDefaultRouteDHCP": true
    }
  },
  "ifname": "string",
  "ipv6": {
    "linkLocalAddress": "string",
    "addresses": [
      {
        "address": "string",
        "enforceEUI64": true,
        "prefix": "string"
      },
      {
        "address": "string",
        "enforceEUI64": true,
        "prefix": "string"
      },
      {
        "address": "string",
        "enforceEUI64": true,
        "prefix": "string"
      },
      {
        "address": "string",
        "enforceEUI64": false,
        "prefix": "string"
      },
      {
        "address": "string",
        "enforceEUI64": false,
        "prefix": "string"
      },
      {
        "address": "string",
        "enforceEUI64": false,
        "prefix": "string"
      }
    ],
    "raInterval": 1,
    "enableAutoConfig": false,
    "nsInterval": 3,
    "prefixes": [
      {
        "default": false,
        "address": "string",
        "advertisement": {
          "autoConfig": true,
          "offlink": true,
          "preferLifeTime": {}
        }
      },
      {
        "default": true,
        "address": "string",
        "advertisement": {
          "autoConfig": true,
          "offlink": true,
          "preferLifeTime": {}
        }
      }
    ],
    "enforceEUI64": false,
    "enableRA": true,
    "dadAttempts": 3,
    "enableDHCPAddrConfig": false,
    "enableDHCPNonAddrConfig": true,
    "raLifeTime": 5,
    "enableIPV6": false,
    "reachableTime": 2
  },
  "links": {
    "parent": "string",
    "self": "string"
  },
  "id": "string",
  "managementOnly": true,
  "macLearn": false,
  "enableAntiSpoofing": false,
  "securityZone": {
    "interfaceMode": "ROUTED",
    "interfaces": [
      {
        "metadata": {
          "lastUser": {
            "name": "string",
            "links": {},
            "id": "string",
            "type": "string"
          },
          "domain": {
            "name": "string",
            "links": {},
            "id": "string",
            "type": "string"
          },
          "readOnly": {
            "reason": {},
            "state": false
          },
          "timestamp": 3
        },
        "name": "string",
        "description": "string",
        "links": {
          "parent": "string",
          "self": "string"
        },
        "id": "string",
        "type": "string",
        "version": "string"
      },
      {
        "metadata": {
          "lastUser": {
            "name": "string",
            "links": {},
            "id": "string",
            "type": "string"
          },
          "domain": {
            "name": "string",
            "links": {},
            "id": "string",
            "type": "string"
          },
          "readOnly": {
            "reason": {},
            "state": false
          },
          "timestamp": 6
        },
        "name": "string",
        "description": "string",
        "links": {
          "parent": "string",
          "self": "string"
        },
        "id": "string",
        "type": "string",
        "version": "string"
      },
      {
        "metadata": {
          "lastUser": {
            "name": "string",
            "links": {},
            "id": "string",
            "type": "string"
          },
          "domain": {
            "name": "string",
            "links": {},
            "id": "string",
            "type": "string"
          },
          "readOnly": {
            "reason": {},
            "state": false
          },
          "timestamp": 10
        },
        "name": "string",
        "description": "string",
        "links": {
          "parent": "string",
          "self": "string"
        },
        "id": "string",
        "type": "string",
        "version": "string"
      },
      {
        "metadata": {
          "lastUser": {
            "name": "string",
            "links": {},
            "id": "string",
            "type": "string"
          },
          "domain": {
            "name": "string",
            "links": {},
            "id": "string",
            "type": "string"
          },
          "readOnly": {
            "reason": {},
            "state": false
          },
          "timestamp": 2
        },
        "name": "string",
        "description": "string",
        "links": {
          "parent": "string",
          "self": "string"
        },
        "id": "string",
        "type": "string",
        "version": "string"
      },
      {
        "metadata": {
          "lastUser": {
            "name": "string",
            "links": {},
            "id": "string",
            "type": "string"
          },
          "domain": {
            "name": "string",
            "links": {},
            "id": "string",
            "type": "string"
          },
          "readOnly": {
            "reason": {},
            "state": true
          },
          "timestamp": 9
        },
        "name": "string",
        "description": "string",
        "links": {
          "parent": "string",
          "self": "string"
        },
        "id": "string",
        "type": "string",
        "version": "string"
      },
      {
        "metadata": {
          "lastUser": {
            "name": "string",
            "links": {},
            "id": "string",
            "type": "string"
          },
          "domain": {
            "name": "string",
            "links": {},
            "id": "string",
            "type": "string"
          },
          "readOnly": {
            "reason": {},
            "state": false
          },
          "timestamp": 8
        },
        "name": "string",
        "description": "string",
        "links": {
          "parent": "string",
          "self": "string"
        },
        "id": "string",
        "type": "string",
        "version": "string"
      },
      {
        "metadata": {
          "lastUser": {
            "name": "string",
            "links": {},
            "id": "string",
            "type": "string"
          },
          "domain": {
            "name": "string",
            "links": {},
            "id": "string",
            "type": "string"
          },
          "readOnly": {
            "reason": {},
            "state": true
          },
          "timestamp": 7
        },
        "name": "string",
        "description": "string",
        "links": {
          "parent": "string",
          "self": "string"
        },
        "id": "string",
        "type": "string",
        "version": "string"
      }
    ],
    "metadata": {
      "lastUser": {
        "name": "string",
        "links": {},
        "id": "string",
        "type": "string"
      },
      "domain": {
        "name": "string",
        "links": {},
        "id": "string",
        "type": "string"
      },
      "readOnly": {
        "reason": {},
        "state": true
      },
      "timestamp": 10
    },
    "name": "string",
    "overridable": false,
    "description": "string",
    "links": {
      "parent": "string",
      "self": "string"
    },
    "overrides": {
      "parent": {
        "name": "string",
        "links": {},
        "id": "string",
        "type": "string"
      },
      "target": {
        "name": "string",
        "links": {},
        "id": "string",
        "type": "string"
      }
    },
    "id": "string",
    "type": "string",
    "version": "string"
  },
  "activeMACAddress": "string",
  "fragmentReassembly": false,
  "macTable": [
    "string",
    "string"
  ],
  "bridgeGroupId": 10,
  "standbyMACAddress": "string",
  "ipAddress": "string",
  "enableDNSLookup": true,
  "overrideDefaultFragmentSetting": {
    "chain": 1,
    "size": 4,
    "timeout": 4
  },
  "version": "string",
  "name": "string"
}