{
  "links": {
    "self": "https://example.cisco.com/api/fmc_config/v1/domain/default/object/securityzones?offset=0&limit=2"
  },
  "items": [
    {
      "name": "Test2",
      "id": "Sec-zone-UUID-2",
      "type": "SecurityZone",
      "links": {
        "self": "https://example.cisco.com/api/fmc_config/v1/domain/default/object/securityzones/Sec-zone-UUID-2",
        "parent": "https://example.cisco.com/api/fmc_config/v1/domain/domainUUID/object/interfaceobjects/"
      },
      "metadata": {
        "readOnly": {
          "state": true
        },
        "timestamp": 1459973987,
        "lastUser": {
          "name": "admin",
          "id": "User-UUID",
          "type": "user"
        },
        "domain": {
          "name": "Global",
          "id": "domainUUID",
          "type": "domain"
        },
        "parentType": "InterfaceObject"
      },
      "interfaceMode": "ASA",
      "interfaces": [
        {
          "type": "FPPhysicalInterface",
          "id": "Intf-UUID-3",
          "name": "outside"
        },
        {
          "type": "FPPhysicalInterface",
          "id": "Intf-UUID-4",
          "name": "inside"
        }
      ]
    },
    {
      "name": "Test1",
      "id": "Sec-zone-UUID-3",
      "type": "SecurityZone",
      "links": {
        "self": "https://example.cisco.com/api/fmc_config/v1/domain/default/object/securityzones/Sec-zone-UUID-3",
        "parent": "https://example.cisco.com/api/fmc_config/v1/domain/domainUUID/object/interfaceobjects/"
      },
      "metadata": {
        "readOnly": {
          "state": true
        },
        "timestamp": 1459973857,
        "lastUser": {
          "name": "admin",
          "id": "User-UUID",
          "type": "user"
        },
        "domain": {
          "name": "Global",
          "id": "domainUUID",
          "type": "domain"
        },
        "parentType": "InterfaceObject"
      },
      "interfaceMode": "INLINE",
      "interfaces": [
        {
          "type": "FPPhysicalInterface",
          "id": "Intf-UUID-5",
          "name": "s1p2"
        },
        {
          "type": "FPPhysicalInterface",
          "id": "Intf-UUID-6",
          "name": "s1p1"
        }
      ]
    }
  ],
  "paging": {
    "offset": 0,
    "limit": 2,
    "count": 2,
    "pages": 1
  }
}