{
  "links": {
    "self": "/fmc_config/v1/domain/domainUUID/object/vlangrouptags/valnGroupTagUUID/overrides?offset=0&limit=1"
  },
  "items": [
    {
      "links": {
        "self": "/fmc_config/v1/domain/domainUUID/object/vlangrouptags/valnGroupTagUUID?overrideTargetId=targetUUID"
      },
      "type": "VlanGroupTag",
      "objects": [
        {
          "type": "VlanTag",
          "data": {
            "startTag": 20,
            "endTag": 20,
            "type": "VlanTagLiteral"
          },
          "overridable": false,
          "name": "Vlan_2",
          "id": "vlanObjectUUID"
        }
      ],
      "overrides": {
        "parent": {
          "id": "valnGroupTagUUID1",
          "type": "VlanGroupTag"
        },
        "target": {
          "name": "10.10.19.27",
          "id": "targetUUID",
          "type": "Device"
        }
      },
      "overridable": true,
      "description": " ",
      "name": "vlan_grp",
      "id": "valnGroupTagUUID1",
      "metadata": {
        "timestamp": 1520420232013,
        "lastUser": {
          "name": "user1"
        },
        "domain": {
          "name": "Global \\ INDIA \\ BENGALURU",
          "id": "domainUUID"
        }
      }
    }
  ],
  "paging": {
    "offset": 0,
    "limit": 1,
    "count": 1,
    "pages": 1
  }
}