{
  "$id": "schema.json",
  "type": "object",
  "schema": "http://json-schema.org/draft-07/schema#",
  "translate": false,
  "dynamicfields": true,
  "properties": {
    "ph_request_type": {
      "type": "string",
      "description": "type of request (internal to adapter)",
      "default": "createRESTTaxiiCollection",
      "enum": [
        "createRESTTaxiiCollection",
        "createRESTDiscoveryInfo",
        "getAllRESTElement",
        "getRESTElement",
        "getAllRESTIncident",
        "getRESTIncident",
        "updateRESTIncident",
        "deleteRESTIncident",
        "getAllRESTIndicator",
        "getRESTIndicator",
        "updateRESTIndicator",
        "getAllRESTObservable",
        "getRESTObservable",
        "updateRESTObservable",
        "getRESTSettings",
        "updateRESTSettings",
        "getAllRESTTidSource",
        "createRESTTidSource",
        "getRESTTidSource",
        "updateRESTTidSource",
        "deleteRESTTidSource"
      ],
      "external_name": "ph_request_type"
    }
  },
  "definitions": {}
}