{
  "links": {
    "parent": "string",
    "self": "string"
  },
  "paging": {
    "pages": 6,
    "offset": 1,
    "limit": 3,
    "count": 1
  },
  "items": [
    {
      "metadata": {
        "lastUser": {
          "name": "string",
          "links": {},
          "id": "string",
          "type": "string"
        },
        "domain": {
          "name": "string",
          "links": {},
          "id": "string",
          "type": "string"
        },
        "readOnly": {
          "reason": {},
          "state": false
        },
        "timestamp": 5
      },
      "name": "string",
      "overridable": false,
      "description": "string",
      "links": {
        "parent": "string",
        "self": "string"
      },
      "id": "string",
      "tag": 10,
      "overrides": {
        "parent": {
          "name": "string",
          "links": {},
          "id": "string",
          "type": "string"
        },
        "target": {
          "name": "string",
          "links": {},
          "id": "string",
          "type": "string"
        }
      },
      "type": "string",
      "version": "string"
    },
    {
      "metadata": {
        "lastUser": {
          "name": "string",
          "links": {},
          "id": "string",
          "type": "string"
        },
        "domain": {
          "name": "string",
          "links": {},
          "id": "string",
          "type": "string"
        },
        "readOnly": {
          "reason": {},
          "state": false
        },
        "timestamp": 4
      },
      "name": "string",
      "overridable": true,
      "description": "string",
      "links": {
        "parent": "string",
        "self": "string"
      },
      "id": "string",
      "tag": 1,
      "overrides": {
        "parent": {
          "name": "string",
          "links": {},
          "id": "string",
          "type": "string"
        },
        "target": {
          "name": "string",
          "links": {},
          "id": "string",
          "type": "string"
        }
      },
      "type": "string",
      "version": "string"
    },
    {
      "metadata": {
        "lastUser": {
          "name": "string",
          "links": {},
          "id": "string",
          "type": "string"
        },
        "domain": {
          "name": "string",
          "links": {},
          "id": "string",
          "type": "string"
        },
        "readOnly": {
          "reason": {},
          "state": true
        },
        "timestamp": 3
      },
      "name": "string",
      "overridable": false,
      "description": "string",
      "links": {
        "parent": "string",
        "self": "string"
      },
      "id": "string",
      "tag": 10,
      "overrides": {
        "parent": {
          "name": "string",
          "links": {},
          "id": "string",
          "type": "string"
        },
        "target": {
          "name": "string",
          "links": {},
          "id": "string",
          "type": "string"
        }
      },
      "type": "string",
      "version": "string"
    },
    {
      "metadata": {
        "lastUser": {
          "name": "string",
          "links": {},
          "id": "string",
          "type": "string"
        },
        "domain": {
          "name": "string",
          "links": {},
          "id": "string",
          "type": "string"
        },
        "readOnly": {
          "reason": {},
          "state": true
        },
        "timestamp": 10
      },
      "name": "string",
      "overridable": true,
      "description": "string",
      "links": {
        "parent": "string",
        "self": "string"
      },
      "id": "string",
      "tag": 8,
      "overrides": {
        "parent": {
          "name": "string",
          "links": {},
          "id": "string",
          "type": "string"
        },
        "target": {
          "name": "string",
          "links": {},
          "id": "string",
          "type": "string"
        }
      },
      "type": "string",
      "version": "string"
    },
    {
      "metadata": {
        "lastUser": {
          "name": "string",
          "links": {},
          "id": "string",
          "type": "string"
        },
        "domain": {
          "name": "string",
          "links": {},
          "id": "string",
          "type": "string"
        },
        "readOnly": {
          "reason": {},
          "state": true
        },
        "timestamp": 2
      },
      "name": "string",
      "overridable": true,
      "description": "string",
      "links": {
        "parent": "string",
        "self": "string"
      },
      "id": "string",
      "tag": 5,
      "overrides": {
        "parent": {
          "name": "string",
          "links": {},
          "id": "string",
          "type": "string"
        },
        "target": {
          "name": "string",
          "links": {},
          "id": "string",
          "type": "string"
        }
      },
      "type": "string",
      "version": "string"
    },
    {
      "metadata": {
        "lastUser": {
          "name": "string",
          "links": {},
          "id": "string",
          "type": "string"
        },
        "domain": {
          "name": "string",
          "links": {},
          "id": "string",
          "type": "string"
        },
        "readOnly": {
          "reason": {},
          "state": false
        },
        "timestamp": 1
      },
      "name": "string",
      "overridable": true,
      "description": "string",
      "links": {
        "parent": "string",
        "self": "string"
      },
      "id": "string",
      "tag": 6,
      "overrides": {
        "parent": {
          "name": "string",
          "links": {},
          "id": "string",
          "type": "string"
        },
        "target": {
          "name": "string",
          "links": {},
          "id": "string",
          "type": "string"
        }
      },
      "type": "string",
      "version": "string"
    }
  ]
}