{
  "links": {
    "self": "/fmc_config/v1/domain/DomainUUID/object/ikev1ipsecproposals/ikev1ipsecproposalUUID"
  },
  "espEncryption": "AES-192",
  "espHash": "NONE",
  "name": "ikev1ipsecproposal-1",
  "description": "IKEv1 IPsec Proposal object description",
  "id": "ikev1ipsecproposalUUID",
  "type": "IKEv1IPsecProposal"
}