{
  "type": "BridgeGroupInterface",
  "selectedInterfaces": [
    {
      "type": "PhysicalInterface",
      "name": "GigabitEthernet0/1",
      "id": "interface UUID"
    }
  ],
  "enabled": true,
  "MTU": 1500,
  "ifname": "bridgeGroupIntf1",
  "managementOnly": false,
  "ipAddress": "1.2.3.4",
  "bridgeGroupId": 39,
  "ipv4": {
    "static": {
      "address": "1.2.3.4",
      "netmask": "25"
    }
  },
  "id": "bridgegroupinterfaceUUID",
  "links": {
    "self": "/fmc_config/v1/domain/domainUUID/devices/devicerecords/containerUUID/bridgegroupinterfaces/bridgegroupinterfaceUUID"
  },
  "metadata": {
    "readOnly": {
      "state": false
    },
    "timestamp": 1458597038,
    "lastUser": {
      "name": "admin",
      "id": "UserUUID",
      "type": "user"
    },
    "domain": {
      "name": "Global",
      "id": "DomainUUID",
      "type": "domain"
    }
  }
}