{
  "links": {
    "self": "/fmc_config/v1/domain/domainUUID/object/applications?offset=0&limit=5"
  },
  "items": [
    {
      "links": {
        "self": "/fmc_config/v1/domain/domainUUID/object/applications/1234"
      },
      "type": "Application",
      "name": "Very Low 1234",
      "id": "1234",
      "metadata": {
        "count": 1094
      }
    },
    {
      "links": {
        "self": "/fmc_config/v1/domain/domainUUID/object/applications/2325"
      },
      "type": "Application",
      "name": "050plus",
      "id": "2325",
      "metadata": {
        "count": 808
      }
    }
  ],
  "paging": {
    "offset": 0,
    "limit": 2,
    "count": 5,
    "next": [
      "/fmc_config/v1/domain/domainUUID/object/applications?offset=2&limit=2",
      "/fmc_config/v1/domain/domainUUID/object/applications?offset=4&limit=1"
    ],
    "pages": 3
  }
}