{
  "links": {
    "parent": "string",
    "self": "string"
  },
  "paging": {
    "pages": 2,
    "offset": 10,
    "limit": 10,
    "count": 2
  },
  "items": [
    {
      "metadata": {
        "lastUser": {
          "name": "string",
          "links": {},
          "id": "string",
          "type": "string"
        },
        "domain": {
          "name": "string",
          "links": {},
          "id": "string",
          "type": "string"
        },
        "readOnly": {
          "reason": {},
          "state": true
        },
        "timestamp": 3
      },
      "isPartOfContainer": "string",
      "modelId": "string",
      "containerType": "string",
      "description": "string",
      "modelType": "string",
      "type": "string",
      "version": "string",
      "upgradePackage": {
        "metadata": {
          "lastUser": {
            "name": "string",
            "links": {},
            "id": "string",
            "type": "string"
          },
          "domain": {
            "name": "string",
            "links": {},
            "id": "string",
            "type": "string"
          },
          "readOnly": {
            "reason": {},
            "state": false
          },
          "timestamp": 10
        },
        "name": "string",
        "description": "string",
        "links": {
          "parent": "string",
          "self": "string"
        },
        "id": "string",
        "type": "string"
      },
      "sw_version": "string",
      "healthStatus": "string",
      "healthPolicy": {
        "name": "string",
        "links": {
          "parent": "string",
          "self": "string"
        },
        "id": "string",
        "type": "string"
      },
      "name": "string",
      "links": {
        "parent": "string",
        "self": "string"
      },
      "model": "string",
      "modelNumber": "string",
      "id": "string",
      "accessPolicy": {
        "metadata": {
          "lastUser": {
            "name": "string",
            "links": {},
            "id": "string",
            "type": "string"
          },
          "domain": {
            "name": "string",
            "links": {},
            "id": "string",
            "type": "string"
          },
          "readOnly": {
            "reason": {},
            "state": false
          },
          "timestamp": 1
        },
        "name": "string",
        "description": "string",
        "links": {
          "parent": "string",
          "self": "string"
        },
        "id": "string",
        "type": "string",
        "version": "string"
      }
    },
    {
      "metadata": {
        "lastUser": {
          "name": "string",
          "links": {},
          "id": "string",
          "type": "string"
        },
        "domain": {
          "name": "string",
          "links": {},
          "id": "string",
          "type": "string"
        },
        "readOnly": {
          "reason": {},
          "state": true
        },
        "timestamp": 7
      },
      "isPartOfContainer": "string",
      "modelId": "string",
      "containerType": "string",
      "description": "string",
      "modelType": "string",
      "type": "string",
      "version": "string",
      "upgradePackage": {
        "metadata": {
          "lastUser": {
            "name": "string",
            "links": {},
            "id": "string",
            "type": "string"
          },
          "domain": {
            "name": "string",
            "links": {},
            "id": "string",
            "type": "string"
          },
          "readOnly": {
            "reason": {},
            "state": false
          },
          "timestamp": 7
        },
        "name": "string",
        "description": "string",
        "links": {
          "parent": "string",
          "self": "string"
        },
        "id": "string",
        "type": "string"
      },
      "sw_version": "string",
      "healthStatus": "string",
      "healthPolicy": {
        "name": "string",
        "links": {
          "parent": "string",
          "self": "string"
        },
        "id": "string",
        "type": "string"
      },
      "name": "string",
      "links": {
        "parent": "string",
        "self": "string"
      },
      "model": "string",
      "modelNumber": "string",
      "id": "string",
      "accessPolicy": {
        "metadata": {
          "lastUser": {
            "name": "string",
            "links": {},
            "id": "string",
            "type": "string"
          },
          "domain": {
            "name": "string",
            "links": {},
            "id": "string",
            "type": "string"
          },
          "readOnly": {
            "reason": {},
            "state": false
          },
          "timestamp": 8
        },
        "name": "string",
        "description": "string",
        "links": {
          "parent": "string",
          "self": "string"
        },
        "id": "string",
        "type": "string",
        "version": "string"
      }
    },
    {
      "metadata": {
        "lastUser": {
          "name": "string",
          "links": {},
          "id": "string",
          "type": "string"
        },
        "domain": {
          "name": "string",
          "links": {},
          "id": "string",
          "type": "string"
        },
        "readOnly": {
          "reason": {},
          "state": false
        },
        "timestamp": 3
      },
      "isPartOfContainer": "string",
      "modelId": "string",
      "containerType": "string",
      "description": "string",
      "modelType": "string",
      "type": "string",
      "version": "string",
      "upgradePackage": {
        "metadata": {
          "lastUser": {
            "name": "string",
            "links": {},
            "id": "string",
            "type": "string"
          },
          "domain": {
            "name": "string",
            "links": {},
            "id": "string",
            "type": "string"
          },
          "readOnly": {
            "reason": {},
            "state": false
          },
          "timestamp": 1
        },
        "name": "string",
        "description": "string",
        "links": {
          "parent": "string",
          "self": "string"
        },
        "id": "string",
        "type": "string"
      },
      "sw_version": "string",
      "healthStatus": "string",
      "healthPolicy": {
        "name": "string",
        "links": {
          "parent": "string",
          "self": "string"
        },
        "id": "string",
        "type": "string"
      },
      "name": "string",
      "links": {
        "parent": "string",
        "self": "string"
      },
      "model": "string",
      "modelNumber": "string",
      "id": "string",
      "accessPolicy": {
        "metadata": {
          "lastUser": {
            "name": "string",
            "links": {},
            "id": "string",
            "type": "string"
          },
          "domain": {
            "name": "string",
            "links": {},
            "id": "string",
            "type": "string"
          },
          "readOnly": {
            "reason": {},
            "state": true
          },
          "timestamp": 5
        },
        "name": "string",
        "description": "string",
        "links": {
          "parent": "string",
          "self": "string"
        },
        "id": "string",
        "type": "string",
        "version": "string"
      }
    },
    {
      "metadata": {
        "lastUser": {
          "name": "string",
          "links": {},
          "id": "string",
          "type": "string"
        },
        "domain": {
          "name": "string",
          "links": {},
          "id": "string",
          "type": "string"
        },
        "readOnly": {
          "reason": {},
          "state": false
        },
        "timestamp": 10
      },
      "isPartOfContainer": "string",
      "modelId": "string",
      "containerType": "string",
      "description": "string",
      "modelType": "string",
      "type": "string",
      "version": "string",
      "upgradePackage": {
        "metadata": {
          "lastUser": {
            "name": "string",
            "links": {},
            "id": "string",
            "type": "string"
          },
          "domain": {
            "name": "string",
            "links": {},
            "id": "string",
            "type": "string"
          },
          "readOnly": {
            "reason": {},
            "state": false
          },
          "timestamp": 8
        },
        "name": "string",
        "description": "string",
        "links": {
          "parent": "string",
          "self": "string"
        },
        "id": "string",
        "type": "string"
      },
      "sw_version": "string",
      "healthStatus": "string",
      "healthPolicy": {
        "name": "string",
        "links": {
          "parent": "string",
          "self": "string"
        },
        "id": "string",
        "type": "string"
      },
      "name": "string",
      "links": {
        "parent": "string",
        "self": "string"
      },
      "model": "string",
      "modelNumber": "string",
      "id": "string",
      "accessPolicy": {
        "metadata": {
          "lastUser": {
            "name": "string",
            "links": {},
            "id": "string",
            "type": "string"
          },
          "domain": {
            "name": "string",
            "links": {},
            "id": "string",
            "type": "string"
          },
          "readOnly": {
            "reason": {},
            "state": false
          },
          "timestamp": 1
        },
        "name": "string",
        "description": "string",
        "links": {
          "parent": "string",
          "self": "string"
        },
        "id": "string",
        "type": "string",
        "version": "string"
      }
    },
    {
      "metadata": {
        "lastUser": {
          "name": "string",
          "links": {},
          "id": "string",
          "type": "string"
        },
        "domain": {
          "name": "string",
          "links": {},
          "id": "string",
          "type": "string"
        },
        "readOnly": {
          "reason": {},
          "state": false
        },
        "timestamp": 7
      },
      "isPartOfContainer": "string",
      "modelId": "string",
      "containerType": "string",
      "description": "string",
      "modelType": "string",
      "type": "string",
      "version": "string",
      "upgradePackage": {
        "metadata": {
          "lastUser": {
            "name": "string",
            "links": {},
            "id": "string",
            "type": "string"
          },
          "domain": {
            "name": "string",
            "links": {},
            "id": "string",
            "type": "string"
          },
          "readOnly": {
            "reason": {},
            "state": true
          },
          "timestamp": 10
        },
        "name": "string",
        "description": "string",
        "links": {
          "parent": "string",
          "self": "string"
        },
        "id": "string",
        "type": "string"
      },
      "sw_version": "string",
      "healthStatus": "string",
      "healthPolicy": {
        "name": "string",
        "links": {
          "parent": "string",
          "self": "string"
        },
        "id": "string",
        "type": "string"
      },
      "name": "string",
      "links": {
        "parent": "string",
        "self": "string"
      },
      "model": "string",
      "modelNumber": "string",
      "id": "string",
      "accessPolicy": {
        "metadata": {
          "lastUser": {
            "name": "string",
            "links": {},
            "id": "string",
            "type": "string"
          },
          "domain": {
            "name": "string",
            "links": {},
            "id": "string",
            "type": "string"
          },
          "readOnly": {
            "reason": {},
            "state": false
          },
          "timestamp": 9
        },
        "name": "string",
        "description": "string",
        "links": {
          "parent": "string",
          "self": "string"
        },
        "id": "string",
        "type": "string",
        "version": "string"
      }
    }
  ]
}