{
  "endpoints": {},
  "metadata": {
    "lastUser": {
      "name": "string",
      "links": {},
      "id": "string",
      "type": "string"
    },
    "domain": {
      "name": "string",
      "links": {},
      "id": "string",
      "type": "string"
    },
    "readOnly": {
      "reason": {},
      "state": true
    },
    "timestamp": 8
  },
  "description": "string",
  "type": "string",
  "ipsecSettings": {
    "name": "string",
    "links": {},
    "id": "string",
    "type": "string"
  },
  "version": "string",
  "ikeV2Enabled": true,
  "ikeV1Enabled": true,
  "topologyType": "string",
  "advancedSettings": {
    "name": "string",
    "links": {},
    "id": "string",
    "type": "string"
  },
  "name": "string",
  "links": {
    "parent": "string",
    "self": "string"
  },
  "ikeSettings": {
    "name": "string",
    "links": {},
    "id": "string",
    "type": "string"
  },
  "id": "string"
}