{
  "links": {
    "self": "/fmc_config/v1/domain/default/object/hosts/hostObject3UUID",
    "parent": "/fmc_config/v1/domain/default/object/networkaddresses"
  },
  "type": "Host",
  "value": "10.5.3.28",
  "overridable": false,
  "description": "Test Description",
  "id": "hostObject3UUID",
  "name": "TestHost",
  "metadata": {
    "lastUser": {
      "name": "admin"
    },
    "domain": {
      "name": "Global",
      "id": "GloablDomainUUID"
    },
    "ipType": "V_4",
    "parentType": "NetworkAddress"
  }
}