{
  "name": "ikev2ipsecproposal-test-1",
  "id": "ikev2ipsecproposalUUID",
  "encryptionAlgorithms": [
    "3DES"
  ],
  "integrityAlgorithms": [
    "SHA-256"
  ],
  "type": "IKEv2IPsecProposal",
  "description": "IKEv2 IPsec object description"
}