{
  "links": {
    "self": "/fmc_config/v1/domain/domainUUID/devices/devicerecords/containerUUID/bridgegroupinterfaces/bridgegroupinterfaceUUID?offset=0&limit=2"
  },
  "items": [
    {
      "metadata": {
        "timestamp": 1462814174120,
        "domain": {
          "name": "Global",
          "id": "domainUUID"
        }
      },
      "links": {
        "self": "/fmc_config/v1/domain/default/devices/devicerecords/containerUUID/bridgegroupinterfaces/bridgegroupinterfaceUUID1"
      },
      "type": "BridgeGroupInterface",
      "selectedInterfaces": [
        {
          "type": "PhysicalInterface",
          "name": "GigabitEthernet0/1",
          "id": "interface UUID"
        }
      ],
      "enabled": true,
      "MTU": 1500,
      "name": "BVI1",
      "ifname": "BVI1",
      "mode": "NONE",
      "managementOnly": false,
      "ipAddress": "1.2.3.4",
      "bridgeGroupId": 1,
      "ipv4": {
        "static": {
          "address": "1.2.3.4",
          "netmask": "25"
        }
      },
      "id": "bridgegroupinterfaceUUID1"
    },
    {
      "metadata": {
        "timestamp": 1462814174120,
        "domain": {
          "name": "Global",
          "id": "domainUUID"
        }
      },
      "links": {
        "self": "/fmc_config/v1/domain/default/devices/devicerecords/containerUUID/bridgegroupinterfaces/bridgegroupinterfaceUUID2"
      },
      "type": "BridgeGroupInterface",
      "selectedInterfaces": [
        {
          "type": "PhysicalInterface",
          "name": "GigabitEthernet0/2",
          "id": "interface UUID"
        }
      ],
      "enabled": true,
      "MTU": 1500,
      "name": "BVI2",
      "ifname": "BVI2",
      "mode": "NONE",
      "managementOnly": false,
      "ipAddress": "1.2.3.4",
      "bridgeGroupId": 2,
      "ipv4": {
        "static": {
          "address": "1.2.3.4",
          "netmask": "25"
        }
      },
      "id": "bridgegroupinterfaceUUID2"
    }
  ]
}