{
  "links": {
    "parent": "string",
    "self": "string"
  },
  "paging": {
    "pages": 5,
    "offset": 5,
    "limit": 10,
    "count": 7
  },
  "items": [
    {
      "metadata": {
        "lastUser": {
          "name": "string",
          "links": {},
          "id": "string",
          "type": "string"
        },
        "domain": {
          "name": "string",
          "links": {},
          "id": "string",
          "type": "string"
        },
        "readOnly": {
          "reason": {},
          "state": true
        },
        "timestamp": 10
      },
      "modelId": "string",
      "description": "string",
      "ftdHAFailoverTriggerCriteria": {
        "percentFailedInterfaceExceed": 6,
        "metadata": {
          "lastUser": {
            "name": "string",
            "links": {},
            "id": "string",
            "type": "string"
          },
          "domain": {
            "name": "string",
            "links": {},
            "id": "string",
            "type": "string"
          },
          "readOnly": {
            "reason": {},
            "state": true
          },
          "timestamp": 4
        },
        "peerHoldTimeUnit": "MSEC",
        "description": "string",
        "peerHoldTime": 6,
        "type": "string",
        "version": "string",
        "interfacePollTime": 7,
        "noOfFailedInterfaceLimit": 5,
        "peerPollTime": 7,
        "interfaceHoldTime": 1,
        "name": "string",
        "links": {
          "parent": "string",
          "self": "string"
        },
        "id": "string",
        "peerPollTimeUnit": "MSEC",
        "interfacePollTimeUnit": "MSEC"
      },
      "modelType": "string",
      "type": "string",
      "version": "string",
      "ftdHABootstrap": {
        "sharedKey": "string",
        "lanFailover": {
          "interfaceObject": {
            "enableAntiSpoofing": false,
            "metadata": {},
            "securityZone": {},
            "activeMACAddress": "string",
            "fragmentReassembly": false,
            "macTable": [
              "string",
              "string"
            ],
            "standbyMACAddress": "string",
            "enableDNSLookup": false,
            "description": "string",
            "overrideDefaultFragmentSetting": {},
            "type": "string",
            "version": "string",
            "enabled": false,
            "MTU": 7,
            "mode": {},
            "arpConfig": [
              {},
              {},
              {},
              {},
              {},
              {},
              {}
            ],
            "ipv4": {},
            "ifname": "string",
            "ipv6": {},
            "name": "string",
            "links": {},
            "id": "string",
            "macLearn": false,
            "managementOnly": true
          },
          "useIPv6Address": false,
          "standbyIP": "string",
          "activeIP": "string",
          "logicalName": "string",
          "subnetMask": "string"
        },
        "encKeyGenerationScheme": "CUSTOM",
        "useSameLinkForFailovers": true,
        "isEncryptionEnabled": true,
        "statefulFailover": {
          "interfaceObject": {
            "enableAntiSpoofing": true,
            "metadata": {},
            "securityZone": {},
            "activeMACAddress": "string",
            "fragmentReassembly": false,
            "macTable": [
              "string",
              "string",
              "string",
              "string",
              "string",
              "string",
              "string",
              "string"
            ],
            "standbyMACAddress": "string",
            "enableDNSLookup": false,
            "description": "string",
            "overrideDefaultFragmentSetting": {},
            "type": "string",
            "version": "string",
            "enabled": false,
            "MTU": 10,
            "mode": {},
            "arpConfig": [
              {},
              {},
              {},
              {}
            ],
            "ipv4": {},
            "ifname": "string",
            "ipv6": {},
            "name": "string",
            "links": {},
            "id": "string",
            "macLearn": false,
            "managementOnly": false
          },
          "useIPv6Address": false,
          "standbyIP": "string",
          "activeIP": "string",
          "logicalName": "string",
          "subnetMask": "string"
        }
      },
      "sw_version": "string",
      "secondary": {
        "metadata": {
          "lastUser": {
            "name": "string",
            "links": {},
            "id": "string",
            "type": "string"
          },
          "domain": {
            "name": "string",
            "links": {},
            "id": "string",
            "type": "string"
          },
          "readOnly": {
            "reason": {},
            "state": true
          },
          "timestamp": 2
        },
        "modelId": "string",
        "description": "string",
        "modelType": "string",
        "type": "string",
        "version": "string",
        "sw_version": "string",
        "healthStatus": "string",
        "healthPolicy": {
          "name": "string",
          "links": {
            "parent": "string",
            "self": "string"
          },
          "id": "string",
          "type": "string"
        },
        "name": "string",
        "model": "string",
        "modelNumber": "string",
        "links": {
          "parent": "string",
          "self": "string"
        },
        "accessPolicy": {
          "metadata": {
            "lastUser": {
              "name": "string",
              "links": {},
              "id": "string",
              "type": "string"
            },
            "domain": {
              "name": "string",
              "links": {},
              "id": "string",
              "type": "string"
            },
            "readOnly": {
              "reason": {},
              "state": false
            },
            "timestamp": 1
          },
          "name": "string",
          "description": "string",
          "links": {
            "parent": "string",
            "self": "string"
          },
          "id": "string",
          "type": "string",
          "version": "string"
        },
        "id": "string"
      },
      "healthStatus": "string",
      "healthPolicy": {
        "name": "string",
        "links": {
          "parent": "string",
          "self": "string"
        },
        "id": "string",
        "type": "string"
      },
      "name": "string",
      "action": "SWITCH",
      "links": {
        "parent": "string",
        "self": "string"
      },
      "model": "string",
      "modelNumber": "string",
      "forceBreak": false,
      "id": "string",
      "accessPolicy": {
        "metadata": {
          "lastUser": {
            "name": "string",
            "links": {},
            "id": "string",
            "type": "string"
          },
          "domain": {
            "name": "string",
            "links": {},
            "id": "string",
            "type": "string"
          },
          "readOnly": {
            "reason": {},
            "state": false
          },
          "timestamp": 2
        },
        "name": "string",
        "description": "string",
        "links": {
          "parent": "string",
          "self": "string"
        },
        "id": "string",
        "type": "string",
        "version": "string"
      },
      "primary": {
        "metadata": {
          "lastUser": {
            "name": "string",
            "links": {},
            "id": "string",
            "type": "string"
          },
          "domain": {
            "name": "string",
            "links": {},
            "id": "string",
            "type": "string"
          },
          "readOnly": {
            "reason": {},
            "state": true
          },
          "timestamp": 4
        },
        "modelId": "string",
        "description": "string",
        "modelType": "string",
        "type": "string",
        "version": "string",
        "sw_version": "string",
        "healthStatus": "string",
        "healthPolicy": {
          "name": "string",
          "links": {
            "parent": "string",
            "self": "string"
          },
          "id": "string",
          "type": "string"
        },
        "name": "string",
        "model": "string",
        "modelNumber": "string",
        "links": {
          "parent": "string",
          "self": "string"
        },
        "accessPolicy": {
          "metadata": {
            "lastUser": {
              "name": "string",
              "links": {},
              "id": "string",
              "type": "string"
            },
            "domain": {
              "name": "string",
              "links": {},
              "id": "string",
              "type": "string"
            },
            "readOnly": {
              "reason": {},
              "state": true
            },
            "timestamp": 10
          },
          "name": "string",
          "description": "string",
          "links": {
            "parent": "string",
            "self": "string"
          },
          "id": "string",
          "type": "string",
          "version": "string"
        },
        "id": "string"
      }
    },
    {
      "metadata": {
        "lastUser": {
          "name": "string",
          "links": {},
          "id": "string",
          "type": "string"
        },
        "domain": {
          "name": "string",
          "links": {},
          "id": "string",
          "type": "string"
        },
        "readOnly": {
          "reason": {},
          "state": true
        },
        "timestamp": 5
      },
      "modelId": "string",
      "description": "string",
      "ftdHAFailoverTriggerCriteria": {
        "percentFailedInterfaceExceed": 2,
        "metadata": {
          "lastUser": {
            "name": "string",
            "links": {},
            "id": "string",
            "type": "string"
          },
          "domain": {
            "name": "string",
            "links": {},
            "id": "string",
            "type": "string"
          },
          "readOnly": {
            "reason": {},
            "state": false
          },
          "timestamp": 2
        },
        "peerHoldTimeUnit": "MSEC",
        "description": "string",
        "peerHoldTime": 3,
        "type": "string",
        "version": "string",
        "interfacePollTime": 10,
        "noOfFailedInterfaceLimit": 9,
        "peerPollTime": 1,
        "interfaceHoldTime": 1,
        "name": "string",
        "links": {
          "parent": "string",
          "self": "string"
        },
        "id": "string",
        "peerPollTimeUnit": "SEC",
        "interfacePollTimeUnit": "MSEC"
      },
      "modelType": "string",
      "type": "string",
      "version": "string",
      "ftdHABootstrap": {
        "sharedKey": "string",
        "lanFailover": {
          "interfaceObject": {
            "enableAntiSpoofing": false,
            "metadata": {},
            "securityZone": {},
            "activeMACAddress": "string",
            "fragmentReassembly": false,
            "macTable": [
              "string",
              "string",
              "string",
              "string",
              "string",
              "string",
              "string"
            ],
            "standbyMACAddress": "string",
            "enableDNSLookup": true,
            "description": "string",
            "overrideDefaultFragmentSetting": {},
            "type": "string",
            "version": "string",
            "enabled": true,
            "MTU": 6,
            "mode": {},
            "arpConfig": [
              {},
              {},
              {},
              {},
              {},
              {},
              {},
              {},
              {},
              {}
            ],
            "ipv4": {},
            "ifname": "string",
            "ipv6": {},
            "name": "string",
            "links": {},
            "id": "string",
            "macLearn": true,
            "managementOnly": true
          },
          "useIPv6Address": true,
          "standbyIP": "string",
          "activeIP": "string",
          "logicalName": "string",
          "subnetMask": "string"
        },
        "encKeyGenerationScheme": "CUSTOM",
        "useSameLinkForFailovers": false,
        "isEncryptionEnabled": false,
        "statefulFailover": {
          "interfaceObject": {
            "enableAntiSpoofing": true,
            "metadata": {},
            "securityZone": {},
            "activeMACAddress": "string",
            "fragmentReassembly": false,
            "macTable": [
              "string",
              "string",
              "string",
              "string",
              "string",
              "string",
              "string",
              "string",
              "string"
            ],
            "standbyMACAddress": "string",
            "enableDNSLookup": true,
            "description": "string",
            "overrideDefaultFragmentSetting": {},
            "type": "string",
            "version": "string",
            "enabled": true,
            "MTU": 10,
            "mode": {},
            "arpConfig": [
              {},
              {},
              {}
            ],
            "ipv4": {},
            "ifname": "string",
            "ipv6": {},
            "name": "string",
            "links": {},
            "id": "string",
            "macLearn": false,
            "managementOnly": true
          },
          "useIPv6Address": false,
          "standbyIP": "string",
          "activeIP": "string",
          "logicalName": "string",
          "subnetMask": "string"
        }
      },
      "sw_version": "string",
      "secondary": {
        "metadata": {
          "lastUser": {
            "name": "string",
            "links": {},
            "id": "string",
            "type": "string"
          },
          "domain": {
            "name": "string",
            "links": {},
            "id": "string",
            "type": "string"
          },
          "readOnly": {
            "reason": {},
            "state": true
          },
          "timestamp": 8
        },
        "modelId": "string",
        "description": "string",
        "modelType": "string",
        "type": "string",
        "version": "string",
        "sw_version": "string",
        "healthStatus": "string",
        "healthPolicy": {
          "name": "string",
          "links": {
            "parent": "string",
            "self": "string"
          },
          "id": "string",
          "type": "string"
        },
        "name": "string",
        "model": "string",
        "modelNumber": "string",
        "links": {
          "parent": "string",
          "self": "string"
        },
        "accessPolicy": {
          "metadata": {
            "lastUser": {
              "name": "string",
              "links": {},
              "id": "string",
              "type": "string"
            },
            "domain": {
              "name": "string",
              "links": {},
              "id": "string",
              "type": "string"
            },
            "readOnly": {
              "reason": {},
              "state": false
            },
            "timestamp": 1
          },
          "name": "string",
          "description": "string",
          "links": {
            "parent": "string",
            "self": "string"
          },
          "id": "string",
          "type": "string",
          "version": "string"
        },
        "id": "string"
      },
      "healthStatus": "string",
      "healthPolicy": {
        "name": "string",
        "links": {
          "parent": "string",
          "self": "string"
        },
        "id": "string",
        "type": "string"
      },
      "name": "string",
      "action": "HABREAK",
      "links": {
        "parent": "string",
        "self": "string"
      },
      "model": "string",
      "modelNumber": "string",
      "forceBreak": false,
      "id": "string",
      "accessPolicy": {
        "metadata": {
          "lastUser": {
            "name": "string",
            "links": {},
            "id": "string",
            "type": "string"
          },
          "domain": {
            "name": "string",
            "links": {},
            "id": "string",
            "type": "string"
          },
          "readOnly": {
            "reason": {},
            "state": false
          },
          "timestamp": 6
        },
        "name": "string",
        "description": "string",
        "links": {
          "parent": "string",
          "self": "string"
        },
        "id": "string",
        "type": "string",
        "version": "string"
      },
      "primary": {
        "metadata": {
          "lastUser": {
            "name": "string",
            "links": {},
            "id": "string",
            "type": "string"
          },
          "domain": {
            "name": "string",
            "links": {},
            "id": "string",
            "type": "string"
          },
          "readOnly": {
            "reason": {},
            "state": true
          },
          "timestamp": 1
        },
        "modelId": "string",
        "description": "string",
        "modelType": "string",
        "type": "string",
        "version": "string",
        "sw_version": "string",
        "healthStatus": "string",
        "healthPolicy": {
          "name": "string",
          "links": {
            "parent": "string",
            "self": "string"
          },
          "id": "string",
          "type": "string"
        },
        "name": "string",
        "model": "string",
        "modelNumber": "string",
        "links": {
          "parent": "string",
          "self": "string"
        },
        "accessPolicy": {
          "metadata": {
            "lastUser": {
              "name": "string",
              "links": {},
              "id": "string",
              "type": "string"
            },
            "domain": {
              "name": "string",
              "links": {},
              "id": "string",
              "type": "string"
            },
            "readOnly": {
              "reason": {},
              "state": true
            },
            "timestamp": 4
          },
          "name": "string",
          "description": "string",
          "links": {
            "parent": "string",
            "self": "string"
          },
          "id": "string",
          "type": "string",
          "version": "string"
        },
        "id": "string"
      }
    },
    {
      "metadata": {
        "lastUser": {
          "name": "string",
          "links": {},
          "id": "string",
          "type": "string"
        },
        "domain": {
          "name": "string",
          "links": {},
          "id": "string",
          "type": "string"
        },
        "readOnly": {
          "reason": {},
          "state": true
        },
        "timestamp": 7
      },
      "modelId": "string",
      "description": "string",
      "ftdHAFailoverTriggerCriteria": {
        "percentFailedInterfaceExceed": 8,
        "metadata": {
          "lastUser": {
            "name": "string",
            "links": {},
            "id": "string",
            "type": "string"
          },
          "domain": {
            "name": "string",
            "links": {},
            "id": "string",
            "type": "string"
          },
          "readOnly": {
            "reason": {},
            "state": true
          },
          "timestamp": 5
        },
        "peerHoldTimeUnit": "SEC",
        "description": "string",
        "peerHoldTime": 10,
        "type": "string",
        "version": "string",
        "interfacePollTime": 5,
        "noOfFailedInterfaceLimit": 7,
        "peerPollTime": 4,
        "interfaceHoldTime": 5,
        "name": "string",
        "links": {
          "parent": "string",
          "self": "string"
        },
        "id": "string",
        "peerPollTimeUnit": "SEC",
        "interfacePollTimeUnit": "SEC"
      },
      "modelType": "string",
      "type": "string",
      "version": "string",
      "ftdHABootstrap": {
        "sharedKey": "string",
        "lanFailover": {
          "interfaceObject": {
            "enableAntiSpoofing": false,
            "metadata": {},
            "securityZone": {},
            "activeMACAddress": "string",
            "fragmentReassembly": false,
            "macTable": [
              "string",
              "string",
              "string",
              "string"
            ],
            "standbyMACAddress": "string",
            "enableDNSLookup": true,
            "description": "string",
            "overrideDefaultFragmentSetting": {},
            "type": "string",
            "version": "string",
            "enabled": false,
            "MTU": 6,
            "mode": {},
            "arpConfig": [
              {},
              {},
              {},
              {},
              {},
              {},
              {},
              {},
              {},
              {}
            ],
            "ipv4": {},
            "ifname": "string",
            "ipv6": {},
            "name": "string",
            "links": {},
            "id": "string",
            "macLearn": true,
            "managementOnly": true
          },
          "useIPv6Address": true,
          "standbyIP": "string",
          "activeIP": "string",
          "logicalName": "string",
          "subnetMask": "string"
        },
        "encKeyGenerationScheme": "CUSTOM",
        "useSameLinkForFailovers": false,
        "isEncryptionEnabled": false,
        "statefulFailover": {
          "interfaceObject": {
            "enableAntiSpoofing": false,
            "metadata": {},
            "securityZone": {},
            "activeMACAddress": "string",
            "fragmentReassembly": false,
            "macTable": [
              "string"
            ],
            "standbyMACAddress": "string",
            "enableDNSLookup": true,
            "description": "string",
            "overrideDefaultFragmentSetting": {},
            "type": "string",
            "version": "string",
            "enabled": false,
            "MTU": 3,
            "mode": {},
            "arpConfig": [
              {},
              {},
              {},
              {}
            ],
            "ipv4": {},
            "ifname": "string",
            "ipv6": {},
            "name": "string",
            "links": {},
            "id": "string",
            "macLearn": true,
            "managementOnly": true
          },
          "useIPv6Address": true,
          "standbyIP": "string",
          "activeIP": "string",
          "logicalName": "string",
          "subnetMask": "string"
        }
      },
      "sw_version": "string",
      "secondary": {
        "metadata": {
          "lastUser": {
            "name": "string",
            "links": {},
            "id": "string",
            "type": "string"
          },
          "domain": {
            "name": "string",
            "links": {},
            "id": "string",
            "type": "string"
          },
          "readOnly": {
            "reason": {},
            "state": true
          },
          "timestamp": 10
        },
        "modelId": "string",
        "description": "string",
        "modelType": "string",
        "type": "string",
        "version": "string",
        "sw_version": "string",
        "healthStatus": "string",
        "healthPolicy": {
          "name": "string",
          "links": {
            "parent": "string",
            "self": "string"
          },
          "id": "string",
          "type": "string"
        },
        "name": "string",
        "model": "string",
        "modelNumber": "string",
        "links": {
          "parent": "string",
          "self": "string"
        },
        "accessPolicy": {
          "metadata": {
            "lastUser": {
              "name": "string",
              "links": {},
              "id": "string",
              "type": "string"
            },
            "domain": {
              "name": "string",
              "links": {},
              "id": "string",
              "type": "string"
            },
            "readOnly": {
              "reason": {},
              "state": true
            },
            "timestamp": 9
          },
          "name": "string",
          "description": "string",
          "links": {
            "parent": "string",
            "self": "string"
          },
          "id": "string",
          "type": "string",
          "version": "string"
        },
        "id": "string"
      },
      "healthStatus": "string",
      "healthPolicy": {
        "name": "string",
        "links": {
          "parent": "string",
          "self": "string"
        },
        "id": "string",
        "type": "string"
      },
      "name": "string",
      "action": "SWITCH",
      "links": {
        "parent": "string",
        "self": "string"
      },
      "model": "string",
      "modelNumber": "string",
      "forceBreak": false,
      "id": "string",
      "accessPolicy": {
        "metadata": {
          "lastUser": {
            "name": "string",
            "links": {},
            "id": "string",
            "type": "string"
          },
          "domain": {
            "name": "string",
            "links": {},
            "id": "string",
            "type": "string"
          },
          "readOnly": {
            "reason": {},
            "state": false
          },
          "timestamp": 2
        },
        "name": "string",
        "description": "string",
        "links": {
          "parent": "string",
          "self": "string"
        },
        "id": "string",
        "type": "string",
        "version": "string"
      },
      "primary": {
        "metadata": {
          "lastUser": {
            "name": "string",
            "links": {},
            "id": "string",
            "type": "string"
          },
          "domain": {
            "name": "string",
            "links": {},
            "id": "string",
            "type": "string"
          },
          "readOnly": {
            "reason": {},
            "state": true
          },
          "timestamp": 1
        },
        "modelId": "string",
        "description": "string",
        "modelType": "string",
        "type": "string",
        "version": "string",
        "sw_version": "string",
        "healthStatus": "string",
        "healthPolicy": {
          "name": "string",
          "links": {
            "parent": "string",
            "self": "string"
          },
          "id": "string",
          "type": "string"
        },
        "name": "string",
        "model": "string",
        "modelNumber": "string",
        "links": {
          "parent": "string",
          "self": "string"
        },
        "accessPolicy": {
          "metadata": {
            "lastUser": {
              "name": "string",
              "links": {},
              "id": "string",
              "type": "string"
            },
            "domain": {
              "name": "string",
              "links": {},
              "id": "string",
              "type": "string"
            },
            "readOnly": {
              "reason": {},
              "state": false
            },
            "timestamp": 4
          },
          "name": "string",
          "description": "string",
          "links": {
            "parent": "string",
            "self": "string"
          },
          "id": "string",
          "type": "string",
          "version": "string"
        },
        "id": "string"
      }
    },
    {
      "metadata": {
        "lastUser": {
          "name": "string",
          "links": {},
          "id": "string",
          "type": "string"
        },
        "domain": {
          "name": "string",
          "links": {},
          "id": "string",
          "type": "string"
        },
        "readOnly": {
          "reason": {},
          "state": false
        },
        "timestamp": 2
      },
      "modelId": "string",
      "description": "string",
      "ftdHAFailoverTriggerCriteria": {
        "percentFailedInterfaceExceed": 9,
        "metadata": {
          "lastUser": {
            "name": "string",
            "links": {},
            "id": "string",
            "type": "string"
          },
          "domain": {
            "name": "string",
            "links": {},
            "id": "string",
            "type": "string"
          },
          "readOnly": {
            "reason": {},
            "state": true
          },
          "timestamp": 9
        },
        "peerHoldTimeUnit": "SEC",
        "description": "string",
        "peerHoldTime": 8,
        "type": "string",
        "version": "string",
        "interfacePollTime": 6,
        "noOfFailedInterfaceLimit": 9,
        "peerPollTime": 4,
        "interfaceHoldTime": 1,
        "name": "string",
        "links": {
          "parent": "string",
          "self": "string"
        },
        "id": "string",
        "peerPollTimeUnit": "MSEC",
        "interfacePollTimeUnit": "MSEC"
      },
      "modelType": "string",
      "type": "string",
      "version": "string",
      "ftdHABootstrap": {
        "sharedKey": "string",
        "lanFailover": {
          "interfaceObject": {
            "enableAntiSpoofing": true,
            "metadata": {},
            "securityZone": {},
            "activeMACAddress": "string",
            "fragmentReassembly": false,
            "macTable": [
              "string",
              "string",
              "string",
              "string"
            ],
            "standbyMACAddress": "string",
            "enableDNSLookup": false,
            "description": "string",
            "overrideDefaultFragmentSetting": {},
            "type": "string",
            "version": "string",
            "enabled": true,
            "MTU": 2,
            "mode": {},
            "arpConfig": [
              {},
              {},
              {},
              {},
              {},
              {},
              {}
            ],
            "ipv4": {},
            "ifname": "string",
            "ipv6": {},
            "name": "string",
            "links": {},
            "id": "string",
            "macLearn": false,
            "managementOnly": true
          },
          "useIPv6Address": false,
          "standbyIP": "string",
          "activeIP": "string",
          "logicalName": "string",
          "subnetMask": "string"
        },
        "encKeyGenerationScheme": "CUSTOM",
        "useSameLinkForFailovers": true,
        "isEncryptionEnabled": false,
        "statefulFailover": {
          "interfaceObject": {
            "enableAntiSpoofing": false,
            "metadata": {},
            "securityZone": {},
            "activeMACAddress": "string",
            "fragmentReassembly": false,
            "macTable": [
              "string"
            ],
            "standbyMACAddress": "string",
            "enableDNSLookup": false,
            "description": "string",
            "overrideDefaultFragmentSetting": {},
            "type": "string",
            "version": "string",
            "enabled": false,
            "MTU": 4,
            "mode": {},
            "arpConfig": [
              {},
              {},
              {},
              {},
              {},
              {},
              {}
            ],
            "ipv4": {},
            "ifname": "string",
            "ipv6": {},
            "name": "string",
            "links": {},
            "id": "string",
            "macLearn": false,
            "managementOnly": false
          },
          "useIPv6Address": false,
          "standbyIP": "string",
          "activeIP": "string",
          "logicalName": "string",
          "subnetMask": "string"
        }
      },
      "sw_version": "string",
      "secondary": {
        "metadata": {
          "lastUser": {
            "name": "string",
            "links": {},
            "id": "string",
            "type": "string"
          },
          "domain": {
            "name": "string",
            "links": {},
            "id": "string",
            "type": "string"
          },
          "readOnly": {
            "reason": {},
            "state": false
          },
          "timestamp": 7
        },
        "modelId": "string",
        "description": "string",
        "modelType": "string",
        "type": "string",
        "version": "string",
        "sw_version": "string",
        "healthStatus": "string",
        "healthPolicy": {
          "name": "string",
          "links": {
            "parent": "string",
            "self": "string"
          },
          "id": "string",
          "type": "string"
        },
        "name": "string",
        "model": "string",
        "modelNumber": "string",
        "links": {
          "parent": "string",
          "self": "string"
        },
        "accessPolicy": {
          "metadata": {
            "lastUser": {
              "name": "string",
              "links": {},
              "id": "string",
              "type": "string"
            },
            "domain": {
              "name": "string",
              "links": {},
              "id": "string",
              "type": "string"
            },
            "readOnly": {
              "reason": {},
              "state": false
            },
            "timestamp": 1
          },
          "name": "string",
          "description": "string",
          "links": {
            "parent": "string",
            "self": "string"
          },
          "id": "string",
          "type": "string",
          "version": "string"
        },
        "id": "string"
      },
      "healthStatus": "string",
      "healthPolicy": {
        "name": "string",
        "links": {
          "parent": "string",
          "self": "string"
        },
        "id": "string",
        "type": "string"
      },
      "name": "string",
      "action": "SWITCH",
      "links": {
        "parent": "string",
        "self": "string"
      },
      "model": "string",
      "modelNumber": "string",
      "forceBreak": true,
      "id": "string",
      "accessPolicy": {
        "metadata": {
          "lastUser": {
            "name": "string",
            "links": {},
            "id": "string",
            "type": "string"
          },
          "domain": {
            "name": "string",
            "links": {},
            "id": "string",
            "type": "string"
          },
          "readOnly": {
            "reason": {},
            "state": true
          },
          "timestamp": 10
        },
        "name": "string",
        "description": "string",
        "links": {
          "parent": "string",
          "self": "string"
        },
        "id": "string",
        "type": "string",
        "version": "string"
      },
      "primary": {
        "metadata": {
          "lastUser": {
            "name": "string",
            "links": {},
            "id": "string",
            "type": "string"
          },
          "domain": {
            "name": "string",
            "links": {},
            "id": "string",
            "type": "string"
          },
          "readOnly": {
            "reason": {},
            "state": false
          },
          "timestamp": 9
        },
        "modelId": "string",
        "description": "string",
        "modelType": "string",
        "type": "string",
        "version": "string",
        "sw_version": "string",
        "healthStatus": "string",
        "healthPolicy": {
          "name": "string",
          "links": {
            "parent": "string",
            "self": "string"
          },
          "id": "string",
          "type": "string"
        },
        "name": "string",
        "model": "string",
        "modelNumber": "string",
        "links": {
          "parent": "string",
          "self": "string"
        },
        "accessPolicy": {
          "metadata": {
            "lastUser": {
              "name": "string",
              "links": {},
              "id": "string",
              "type": "string"
            },
            "domain": {
              "name": "string",
              "links": {},
              "id": "string",
              "type": "string"
            },
            "readOnly": {
              "reason": {},
              "state": false
            },
            "timestamp": 5
          },
          "name": "string",
          "description": "string",
          "links": {
            "parent": "string",
            "self": "string"
          },
          "id": "string",
          "type": "string",
          "version": "string"
        },
        "id": "string"
      }
    },
    {
      "metadata": {
        "lastUser": {
          "name": "string",
          "links": {},
          "id": "string",
          "type": "string"
        },
        "domain": {
          "name": "string",
          "links": {},
          "id": "string",
          "type": "string"
        },
        "readOnly": {
          "reason": {},
          "state": true
        },
        "timestamp": 1
      },
      "modelId": "string",
      "description": "string",
      "ftdHAFailoverTriggerCriteria": {
        "percentFailedInterfaceExceed": 3,
        "metadata": {
          "lastUser": {
            "name": "string",
            "links": {},
            "id": "string",
            "type": "string"
          },
          "domain": {
            "name": "string",
            "links": {},
            "id": "string",
            "type": "string"
          },
          "readOnly": {
            "reason": {},
            "state": true
          },
          "timestamp": 4
        },
        "peerHoldTimeUnit": "SEC",
        "description": "string",
        "peerHoldTime": 1,
        "type": "string",
        "version": "string",
        "interfacePollTime": 3,
        "noOfFailedInterfaceLimit": 10,
        "peerPollTime": 5,
        "interfaceHoldTime": 3,
        "name": "string",
        "links": {
          "parent": "string",
          "self": "string"
        },
        "id": "string",
        "peerPollTimeUnit": "SEC",
        "interfacePollTimeUnit": "SEC"
      },
      "modelType": "string",
      "type": "string",
      "version": "string",
      "ftdHABootstrap": {
        "sharedKey": "string",
        "lanFailover": {
          "interfaceObject": {
            "enableAntiSpoofing": false,
            "metadata": {},
            "securityZone": {},
            "activeMACAddress": "string",
            "fragmentReassembly": false,
            "macTable": [
              "string",
              "string",
              "string",
              "string",
              "string",
              "string",
              "string",
              "string"
            ],
            "standbyMACAddress": "string",
            "enableDNSLookup": true,
            "description": "string",
            "overrideDefaultFragmentSetting": {},
            "type": "string",
            "version": "string",
            "enabled": true,
            "MTU": 4,
            "mode": {},
            "arpConfig": [
              {},
              {},
              {}
            ],
            "ipv4": {},
            "ifname": "string",
            "ipv6": {},
            "name": "string",
            "links": {},
            "id": "string",
            "macLearn": false,
            "managementOnly": false
          },
          "useIPv6Address": true,
          "standbyIP": "string",
          "activeIP": "string",
          "logicalName": "string",
          "subnetMask": "string"
        },
        "encKeyGenerationScheme": "AUTO",
        "useSameLinkForFailovers": false,
        "isEncryptionEnabled": true,
        "statefulFailover": {
          "interfaceObject": {
            "enableAntiSpoofing": false,
            "metadata": {},
            "securityZone": {},
            "activeMACAddress": "string",
            "fragmentReassembly": false,
            "macTable": [
              "string",
              "string",
              "string",
              "string",
              "string",
              "string",
              "string",
              "string",
              "string",
              "string"
            ],
            "standbyMACAddress": "string",
            "enableDNSLookup": false,
            "description": "string",
            "overrideDefaultFragmentSetting": {},
            "type": "string",
            "version": "string",
            "enabled": false,
            "MTU": 5,
            "mode": {},
            "arpConfig": [
              {},
              {},
              {},
              {},
              {},
              {},
              {}
            ],
            "ipv4": {},
            "ifname": "string",
            "ipv6": {},
            "name": "string",
            "links": {},
            "id": "string",
            "macLearn": true,
            "managementOnly": false
          },
          "useIPv6Address": true,
          "standbyIP": "string",
          "activeIP": "string",
          "logicalName": "string",
          "subnetMask": "string"
        }
      },
      "sw_version": "string",
      "secondary": {
        "metadata": {
          "lastUser": {
            "name": "string",
            "links": {},
            "id": "string",
            "type": "string"
          },
          "domain": {
            "name": "string",
            "links": {},
            "id": "string",
            "type": "string"
          },
          "readOnly": {
            "reason": {},
            "state": true
          },
          "timestamp": 2
        },
        "modelId": "string",
        "description": "string",
        "modelType": "string",
        "type": "string",
        "version": "string",
        "sw_version": "string",
        "healthStatus": "string",
        "healthPolicy": {
          "name": "string",
          "links": {
            "parent": "string",
            "self": "string"
          },
          "id": "string",
          "type": "string"
        },
        "name": "string",
        "model": "string",
        "modelNumber": "string",
        "links": {
          "parent": "string",
          "self": "string"
        },
        "accessPolicy": {
          "metadata": {
            "lastUser": {
              "name": "string",
              "links": {},
              "id": "string",
              "type": "string"
            },
            "domain": {
              "name": "string",
              "links": {},
              "id": "string",
              "type": "string"
            },
            "readOnly": {
              "reason": {},
              "state": false
            },
            "timestamp": 2
          },
          "name": "string",
          "description": "string",
          "links": {
            "parent": "string",
            "self": "string"
          },
          "id": "string",
          "type": "string",
          "version": "string"
        },
        "id": "string"
      },
      "healthStatus": "string",
      "healthPolicy": {
        "name": "string",
        "links": {
          "parent": "string",
          "self": "string"
        },
        "id": "string",
        "type": "string"
      },
      "name": "string",
      "action": "HABREAK",
      "links": {
        "parent": "string",
        "self": "string"
      },
      "model": "string",
      "modelNumber": "string",
      "forceBreak": true,
      "id": "string",
      "accessPolicy": {
        "metadata": {
          "lastUser": {
            "name": "string",
            "links": {},
            "id": "string",
            "type": "string"
          },
          "domain": {
            "name": "string",
            "links": {},
            "id": "string",
            "type": "string"
          },
          "readOnly": {
            "reason": {},
            "state": false
          },
          "timestamp": 1
        },
        "name": "string",
        "description": "string",
        "links": {
          "parent": "string",
          "self": "string"
        },
        "id": "string",
        "type": "string",
        "version": "string"
      },
      "primary": {
        "metadata": {
          "lastUser": {
            "name": "string",
            "links": {},
            "id": "string",
            "type": "string"
          },
          "domain": {
            "name": "string",
            "links": {},
            "id": "string",
            "type": "string"
          },
          "readOnly": {
            "reason": {},
            "state": true
          },
          "timestamp": 6
        },
        "modelId": "string",
        "description": "string",
        "modelType": "string",
        "type": "string",
        "version": "string",
        "sw_version": "string",
        "healthStatus": "string",
        "healthPolicy": {
          "name": "string",
          "links": {
            "parent": "string",
            "self": "string"
          },
          "id": "string",
          "type": "string"
        },
        "name": "string",
        "model": "string",
        "modelNumber": "string",
        "links": {
          "parent": "string",
          "self": "string"
        },
        "accessPolicy": {
          "metadata": {
            "lastUser": {
              "name": "string",
              "links": {},
              "id": "string",
              "type": "string"
            },
            "domain": {
              "name": "string",
              "links": {},
              "id": "string",
              "type": "string"
            },
            "readOnly": {
              "reason": {},
              "state": true
            },
            "timestamp": 7
          },
          "name": "string",
          "description": "string",
          "links": {
            "parent": "string",
            "self": "string"
          },
          "id": "string",
          "type": "string",
          "version": "string"
        },
        "id": "string"
      }
    },
    {
      "metadata": {
        "lastUser": {
          "name": "string",
          "links": {},
          "id": "string",
          "type": "string"
        },
        "domain": {
          "name": "string",
          "links": {},
          "id": "string",
          "type": "string"
        },
        "readOnly": {
          "reason": {},
          "state": true
        },
        "timestamp": 4
      },
      "modelId": "string",
      "description": "string",
      "ftdHAFailoverTriggerCriteria": {
        "percentFailedInterfaceExceed": 7,
        "metadata": {
          "lastUser": {
            "name": "string",
            "links": {},
            "id": "string",
            "type": "string"
          },
          "domain": {
            "name": "string",
            "links": {},
            "id": "string",
            "type": "string"
          },
          "readOnly": {
            "reason": {},
            "state": false
          },
          "timestamp": 7
        },
        "peerHoldTimeUnit": "SEC",
        "description": "string",
        "peerHoldTime": 10,
        "type": "string",
        "version": "string",
        "interfacePollTime": 6,
        "noOfFailedInterfaceLimit": 10,
        "peerPollTime": 6,
        "interfaceHoldTime": 1,
        "name": "string",
        "links": {
          "parent": "string",
          "self": "string"
        },
        "id": "string",
        "peerPollTimeUnit": "MSEC",
        "interfacePollTimeUnit": "SEC"
      },
      "modelType": "string",
      "type": "string",
      "version": "string",
      "ftdHABootstrap": {
        "sharedKey": "string",
        "lanFailover": {
          "interfaceObject": {
            "enableAntiSpoofing": false,
            "metadata": {},
            "securityZone": {},
            "activeMACAddress": "string",
            "fragmentReassembly": false,
            "macTable": [
              "string",
              "string",
              "string",
              "string",
              "string",
              "string",
              "string",
              "string",
              "string"
            ],
            "standbyMACAddress": "string",
            "enableDNSLookup": false,
            "description": "string",
            "overrideDefaultFragmentSetting": {},
            "type": "string",
            "version": "string",
            "enabled": false,
            "MTU": 3,
            "mode": {},
            "arpConfig": [
              {},
              {}
            ],
            "ipv4": {},
            "ifname": "string",
            "ipv6": {},
            "name": "string",
            "links": {},
            "id": "string",
            "macLearn": true,
            "managementOnly": true
          },
          "useIPv6Address": false,
          "standbyIP": "string",
          "activeIP": "string",
          "logicalName": "string",
          "subnetMask": "string"
        },
        "encKeyGenerationScheme": "AUTO",
        "useSameLinkForFailovers": false,
        "isEncryptionEnabled": true,
        "statefulFailover": {
          "interfaceObject": {
            "enableAntiSpoofing": false,
            "metadata": {},
            "securityZone": {},
            "activeMACAddress": "string",
            "fragmentReassembly": true,
            "macTable": [
              "string",
              "string",
              "string",
              "string",
              "string",
              "string",
              "string",
              "string"
            ],
            "standbyMACAddress": "string",
            "enableDNSLookup": true,
            "description": "string",
            "overrideDefaultFragmentSetting": {},
            "type": "string",
            "version": "string",
            "enabled": true,
            "MTU": 1,
            "mode": {},
            "arpConfig": [
              {},
              {},
              {},
              {},
              {},
              {},
              {},
              {}
            ],
            "ipv4": {},
            "ifname": "string",
            "ipv6": {},
            "name": "string",
            "links": {},
            "id": "string",
            "macLearn": true,
            "managementOnly": false
          },
          "useIPv6Address": true,
          "standbyIP": "string",
          "activeIP": "string",
          "logicalName": "string",
          "subnetMask": "string"
        }
      },
      "sw_version": "string",
      "secondary": {
        "metadata": {
          "lastUser": {
            "name": "string",
            "links": {},
            "id": "string",
            "type": "string"
          },
          "domain": {
            "name": "string",
            "links": {},
            "id": "string",
            "type": "string"
          },
          "readOnly": {
            "reason": {},
            "state": true
          },
          "timestamp": 9
        },
        "modelId": "string",
        "description": "string",
        "modelType": "string",
        "type": "string",
        "version": "string",
        "sw_version": "string",
        "healthStatus": "string",
        "healthPolicy": {
          "name": "string",
          "links": {
            "parent": "string",
            "self": "string"
          },
          "id": "string",
          "type": "string"
        },
        "name": "string",
        "model": "string",
        "modelNumber": "string",
        "links": {
          "parent": "string",
          "self": "string"
        },
        "accessPolicy": {
          "metadata": {
            "lastUser": {
              "name": "string",
              "links": {},
              "id": "string",
              "type": "string"
            },
            "domain": {
              "name": "string",
              "links": {},
              "id": "string",
              "type": "string"
            },
            "readOnly": {
              "reason": {},
              "state": false
            },
            "timestamp": 7
          },
          "name": "string",
          "description": "string",
          "links": {
            "parent": "string",
            "self": "string"
          },
          "id": "string",
          "type": "string",
          "version": "string"
        },
        "id": "string"
      },
      "healthStatus": "string",
      "healthPolicy": {
        "name": "string",
        "links": {
          "parent": "string",
          "self": "string"
        },
        "id": "string",
        "type": "string"
      },
      "name": "string",
      "action": "HABREAK",
      "links": {
        "parent": "string",
        "self": "string"
      },
      "model": "string",
      "modelNumber": "string",
      "forceBreak": true,
      "id": "string",
      "accessPolicy": {
        "metadata": {
          "lastUser": {
            "name": "string",
            "links": {},
            "id": "string",
            "type": "string"
          },
          "domain": {
            "name": "string",
            "links": {},
            "id": "string",
            "type": "string"
          },
          "readOnly": {
            "reason": {},
            "state": false
          },
          "timestamp": 3
        },
        "name": "string",
        "description": "string",
        "links": {
          "parent": "string",
          "self": "string"
        },
        "id": "string",
        "type": "string",
        "version": "string"
      },
      "primary": {
        "metadata": {
          "lastUser": {
            "name": "string",
            "links": {},
            "id": "string",
            "type": "string"
          },
          "domain": {
            "name": "string",
            "links": {},
            "id": "string",
            "type": "string"
          },
          "readOnly": {
            "reason": {},
            "state": true
          },
          "timestamp": 5
        },
        "modelId": "string",
        "description": "string",
        "modelType": "string",
        "type": "string",
        "version": "string",
        "sw_version": "string",
        "healthStatus": "string",
        "healthPolicy": {
          "name": "string",
          "links": {
            "parent": "string",
            "self": "string"
          },
          "id": "string",
          "type": "string"
        },
        "name": "string",
        "model": "string",
        "modelNumber": "string",
        "links": {
          "parent": "string",
          "self": "string"
        },
        "accessPolicy": {
          "metadata": {
            "lastUser": {
              "name": "string",
              "links": {},
              "id": "string",
              "type": "string"
            },
            "domain": {
              "name": "string",
              "links": {},
              "id": "string",
              "type": "string"
            },
            "readOnly": {
              "reason": {},
              "state": false
            },
            "timestamp": 7
          },
          "name": "string",
          "description": "string",
          "links": {
            "parent": "string",
            "self": "string"
          },
          "id": "string",
          "type": "string",
          "version": "string"
        },
        "id": "string"
      }
    },
    {
      "metadata": {
        "lastUser": {
          "name": "string",
          "links": {},
          "id": "string",
          "type": "string"
        },
        "domain": {
          "name": "string",
          "links": {},
          "id": "string",
          "type": "string"
        },
        "readOnly": {
          "reason": {},
          "state": false
        },
        "timestamp": 10
      },
      "modelId": "string",
      "description": "string",
      "ftdHAFailoverTriggerCriteria": {
        "percentFailedInterfaceExceed": 2,
        "metadata": {
          "lastUser": {
            "name": "string",
            "links": {},
            "id": "string",
            "type": "string"
          },
          "domain": {
            "name": "string",
            "links": {},
            "id": "string",
            "type": "string"
          },
          "readOnly": {
            "reason": {},
            "state": true
          },
          "timestamp": 10
        },
        "peerHoldTimeUnit": "MSEC",
        "description": "string",
        "peerHoldTime": 9,
        "type": "string",
        "version": "string",
        "interfacePollTime": 7,
        "noOfFailedInterfaceLimit": 10,
        "peerPollTime": 1,
        "interfaceHoldTime": 8,
        "name": "string",
        "links": {
          "parent": "string",
          "self": "string"
        },
        "id": "string",
        "peerPollTimeUnit": "MSEC",
        "interfacePollTimeUnit": "MSEC"
      },
      "modelType": "string",
      "type": "string",
      "version": "string",
      "ftdHABootstrap": {
        "sharedKey": "string",
        "lanFailover": {
          "interfaceObject": {
            "enableAntiSpoofing": false,
            "metadata": {},
            "securityZone": {},
            "activeMACAddress": "string",
            "fragmentReassembly": true,
            "macTable": [
              "string",
              "string",
              "string",
              "string"
            ],
            "standbyMACAddress": "string",
            "enableDNSLookup": true,
            "description": "string",
            "overrideDefaultFragmentSetting": {},
            "type": "string",
            "version": "string",
            "enabled": true,
            "MTU": 3,
            "mode": {},
            "arpConfig": [
              {},
              {},
              {},
              {},
              {}
            ],
            "ipv4": {},
            "ifname": "string",
            "ipv6": {},
            "name": "string",
            "links": {},
            "id": "string",
            "macLearn": false,
            "managementOnly": false
          },
          "useIPv6Address": false,
          "standbyIP": "string",
          "activeIP": "string",
          "logicalName": "string",
          "subnetMask": "string"
        },
        "encKeyGenerationScheme": "CUSTOM",
        "useSameLinkForFailovers": false,
        "isEncryptionEnabled": true,
        "statefulFailover": {
          "interfaceObject": {
            "enableAntiSpoofing": true,
            "metadata": {},
            "securityZone": {},
            "activeMACAddress": "string",
            "fragmentReassembly": false,
            "macTable": [
              "string",
              "string",
              "string",
              "string",
              "string"
            ],
            "standbyMACAddress": "string",
            "enableDNSLookup": true,
            "description": "string",
            "overrideDefaultFragmentSetting": {},
            "type": "string",
            "version": "string",
            "enabled": true,
            "MTU": 10,
            "mode": {},
            "arpConfig": [
              {},
              {},
              {},
              {},
              {},
              {},
              {},
              {},
              {}
            ],
            "ipv4": {},
            "ifname": "string",
            "ipv6": {},
            "name": "string",
            "links": {},
            "id": "string",
            "macLearn": false,
            "managementOnly": false
          },
          "useIPv6Address": true,
          "standbyIP": "string",
          "activeIP": "string",
          "logicalName": "string",
          "subnetMask": "string"
        }
      },
      "sw_version": "string",
      "secondary": {
        "metadata": {
          "lastUser": {
            "name": "string",
            "links": {},
            "id": "string",
            "type": "string"
          },
          "domain": {
            "name": "string",
            "links": {},
            "id": "string",
            "type": "string"
          },
          "readOnly": {
            "reason": {},
            "state": true
          },
          "timestamp": 9
        },
        "modelId": "string",
        "description": "string",
        "modelType": "string",
        "type": "string",
        "version": "string",
        "sw_version": "string",
        "healthStatus": "string",
        "healthPolicy": {
          "name": "string",
          "links": {
            "parent": "string",
            "self": "string"
          },
          "id": "string",
          "type": "string"
        },
        "name": "string",
        "model": "string",
        "modelNumber": "string",
        "links": {
          "parent": "string",
          "self": "string"
        },
        "accessPolicy": {
          "metadata": {
            "lastUser": {
              "name": "string",
              "links": {},
              "id": "string",
              "type": "string"
            },
            "domain": {
              "name": "string",
              "links": {},
              "id": "string",
              "type": "string"
            },
            "readOnly": {
              "reason": {},
              "state": true
            },
            "timestamp": 2
          },
          "name": "string",
          "description": "string",
          "links": {
            "parent": "string",
            "self": "string"
          },
          "id": "string",
          "type": "string",
          "version": "string"
        },
        "id": "string"
      },
      "healthStatus": "string",
      "healthPolicy": {
        "name": "string",
        "links": {
          "parent": "string",
          "self": "string"
        },
        "id": "string",
        "type": "string"
      },
      "name": "string",
      "action": "SWITCH",
      "links": {
        "parent": "string",
        "self": "string"
      },
      "model": "string",
      "modelNumber": "string",
      "forceBreak": true,
      "id": "string",
      "accessPolicy": {
        "metadata": {
          "lastUser": {
            "name": "string",
            "links": {},
            "id": "string",
            "type": "string"
          },
          "domain": {
            "name": "string",
            "links": {},
            "id": "string",
            "type": "string"
          },
          "readOnly": {
            "reason": {},
            "state": true
          },
          "timestamp": 4
        },
        "name": "string",
        "description": "string",
        "links": {
          "parent": "string",
          "self": "string"
        },
        "id": "string",
        "type": "string",
        "version": "string"
      },
      "primary": {
        "metadata": {
          "lastUser": {
            "name": "string",
            "links": {},
            "id": "string",
            "type": "string"
          },
          "domain": {
            "name": "string",
            "links": {},
            "id": "string",
            "type": "string"
          },
          "readOnly": {
            "reason": {},
            "state": true
          },
          "timestamp": 3
        },
        "modelId": "string",
        "description": "string",
        "modelType": "string",
        "type": "string",
        "version": "string",
        "sw_version": "string",
        "healthStatus": "string",
        "healthPolicy": {
          "name": "string",
          "links": {
            "parent": "string",
            "self": "string"
          },
          "id": "string",
          "type": "string"
        },
        "name": "string",
        "model": "string",
        "modelNumber": "string",
        "links": {
          "parent": "string",
          "self": "string"
        },
        "accessPolicy": {
          "metadata": {
            "lastUser": {
              "name": "string",
              "links": {},
              "id": "string",
              "type": "string"
            },
            "domain": {
              "name": "string",
              "links": {},
              "id": "string",
              "type": "string"
            },
            "readOnly": {
              "reason": {},
              "state": false
            },
            "timestamp": 3
          },
          "name": "string",
          "description": "string",
          "links": {
            "parent": "string",
            "self": "string"
          },
          "id": "string",
          "type": "string",
          "version": "string"
        },
        "id": "string"
      }
    },
    {
      "metadata": {
        "lastUser": {
          "name": "string",
          "links": {},
          "id": "string",
          "type": "string"
        },
        "domain": {
          "name": "string",
          "links": {},
          "id": "string",
          "type": "string"
        },
        "readOnly": {
          "reason": {},
          "state": true
        },
        "timestamp": 3
      },
      "modelId": "string",
      "description": "string",
      "ftdHAFailoverTriggerCriteria": {
        "percentFailedInterfaceExceed": 2,
        "metadata": {
          "lastUser": {
            "name": "string",
            "links": {},
            "id": "string",
            "type": "string"
          },
          "domain": {
            "name": "string",
            "links": {},
            "id": "string",
            "type": "string"
          },
          "readOnly": {
            "reason": {},
            "state": true
          },
          "timestamp": 9
        },
        "peerHoldTimeUnit": "SEC",
        "description": "string",
        "peerHoldTime": 8,
        "type": "string",
        "version": "string",
        "interfacePollTime": 9,
        "noOfFailedInterfaceLimit": 5,
        "peerPollTime": 6,
        "interfaceHoldTime": 5,
        "name": "string",
        "links": {
          "parent": "string",
          "self": "string"
        },
        "id": "string",
        "peerPollTimeUnit": "SEC",
        "interfacePollTimeUnit": "SEC"
      },
      "modelType": "string",
      "type": "string",
      "version": "string",
      "ftdHABootstrap": {
        "sharedKey": "string",
        "lanFailover": {
          "interfaceObject": {
            "enableAntiSpoofing": true,
            "metadata": {},
            "securityZone": {},
            "activeMACAddress": "string",
            "fragmentReassembly": false,
            "macTable": [
              "string",
              "string",
              "string",
              "string",
              "string"
            ],
            "standbyMACAddress": "string",
            "enableDNSLookup": false,
            "description": "string",
            "overrideDefaultFragmentSetting": {},
            "type": "string",
            "version": "string",
            "enabled": true,
            "MTU": 2,
            "mode": {},
            "arpConfig": [
              {}
            ],
            "ipv4": {},
            "ifname": "string",
            "ipv6": {},
            "name": "string",
            "links": {},
            "id": "string",
            "macLearn": true,
            "managementOnly": true
          },
          "useIPv6Address": true,
          "standbyIP": "string",
          "activeIP": "string",
          "logicalName": "string",
          "subnetMask": "string"
        },
        "encKeyGenerationScheme": "AUTO",
        "useSameLinkForFailovers": true,
        "isEncryptionEnabled": false,
        "statefulFailover": {
          "interfaceObject": {
            "enableAntiSpoofing": false,
            "metadata": {},
            "securityZone": {},
            "activeMACAddress": "string",
            "fragmentReassembly": true,
            "macTable": [
              "string",
              "string",
              "string",
              "string",
              "string",
              "string",
              "string",
              "string",
              "string"
            ],
            "standbyMACAddress": "string",
            "enableDNSLookup": false,
            "description": "string",
            "overrideDefaultFragmentSetting": {},
            "type": "string",
            "version": "string",
            "enabled": false,
            "MTU": 10,
            "mode": {},
            "arpConfig": [
              {},
              {}
            ],
            "ipv4": {},
            "ifname": "string",
            "ipv6": {},
            "name": "string",
            "links": {},
            "id": "string",
            "macLearn": false,
            "managementOnly": false
          },
          "useIPv6Address": true,
          "standbyIP": "string",
          "activeIP": "string",
          "logicalName": "string",
          "subnetMask": "string"
        }
      },
      "sw_version": "string",
      "secondary": {
        "metadata": {
          "lastUser": {
            "name": "string",
            "links": {},
            "id": "string",
            "type": "string"
          },
          "domain": {
            "name": "string",
            "links": {},
            "id": "string",
            "type": "string"
          },
          "readOnly": {
            "reason": {},
            "state": false
          },
          "timestamp": 4
        },
        "modelId": "string",
        "description": "string",
        "modelType": "string",
        "type": "string",
        "version": "string",
        "sw_version": "string",
        "healthStatus": "string",
        "healthPolicy": {
          "name": "string",
          "links": {
            "parent": "string",
            "self": "string"
          },
          "id": "string",
          "type": "string"
        },
        "name": "string",
        "model": "string",
        "modelNumber": "string",
        "links": {
          "parent": "string",
          "self": "string"
        },
        "accessPolicy": {
          "metadata": {
            "lastUser": {
              "name": "string",
              "links": {},
              "id": "string",
              "type": "string"
            },
            "domain": {
              "name": "string",
              "links": {},
              "id": "string",
              "type": "string"
            },
            "readOnly": {
              "reason": {},
              "state": true
            },
            "timestamp": 6
          },
          "name": "string",
          "description": "string",
          "links": {
            "parent": "string",
            "self": "string"
          },
          "id": "string",
          "type": "string",
          "version": "string"
        },
        "id": "string"
      },
      "healthStatus": "string",
      "healthPolicy": {
        "name": "string",
        "links": {
          "parent": "string",
          "self": "string"
        },
        "id": "string",
        "type": "string"
      },
      "name": "string",
      "action": "SWITCH",
      "links": {
        "parent": "string",
        "self": "string"
      },
      "model": "string",
      "modelNumber": "string",
      "forceBreak": true,
      "id": "string",
      "accessPolicy": {
        "metadata": {
          "lastUser": {
            "name": "string",
            "links": {},
            "id": "string",
            "type": "string"
          },
          "domain": {
            "name": "string",
            "links": {},
            "id": "string",
            "type": "string"
          },
          "readOnly": {
            "reason": {},
            "state": true
          },
          "timestamp": 9
        },
        "name": "string",
        "description": "string",
        "links": {
          "parent": "string",
          "self": "string"
        },
        "id": "string",
        "type": "string",
        "version": "string"
      },
      "primary": {
        "metadata": {
          "lastUser": {
            "name": "string",
            "links": {},
            "id": "string",
            "type": "string"
          },
          "domain": {
            "name": "string",
            "links": {},
            "id": "string",
            "type": "string"
          },
          "readOnly": {
            "reason": {},
            "state": true
          },
          "timestamp": 10
        },
        "modelId": "string",
        "description": "string",
        "modelType": "string",
        "type": "string",
        "version": "string",
        "sw_version": "string",
        "healthStatus": "string",
        "healthPolicy": {
          "name": "string",
          "links": {
            "parent": "string",
            "self": "string"
          },
          "id": "string",
          "type": "string"
        },
        "name": "string",
        "model": "string",
        "modelNumber": "string",
        "links": {
          "parent": "string",
          "self": "string"
        },
        "accessPolicy": {
          "metadata": {
            "lastUser": {
              "name": "string",
              "links": {},
              "id": "string",
              "type": "string"
            },
            "domain": {
              "name": "string",
              "links": {},
              "id": "string",
              "type": "string"
            },
            "readOnly": {
              "reason": {},
              "state": false
            },
            "timestamp": 2
          },
          "name": "string",
          "description": "string",
          "links": {
            "parent": "string",
            "self": "string"
          },
          "id": "string",
          "type": "string",
          "version": "string"
        },
        "id": "string"
      }
    },
    {
      "metadata": {
        "lastUser": {
          "name": "string",
          "links": {},
          "id": "string",
          "type": "string"
        },
        "domain": {
          "name": "string",
          "links": {},
          "id": "string",
          "type": "string"
        },
        "readOnly": {
          "reason": {},
          "state": false
        },
        "timestamp": 7
      },
      "modelId": "string",
      "description": "string",
      "ftdHAFailoverTriggerCriteria": {
        "percentFailedInterfaceExceed": 7,
        "metadata": {
          "lastUser": {
            "name": "string",
            "links": {},
            "id": "string",
            "type": "string"
          },
          "domain": {
            "name": "string",
            "links": {},
            "id": "string",
            "type": "string"
          },
          "readOnly": {
            "reason": {},
            "state": true
          },
          "timestamp": 9
        },
        "peerHoldTimeUnit": "MSEC",
        "description": "string",
        "peerHoldTime": 1,
        "type": "string",
        "version": "string",
        "interfacePollTime": 7,
        "noOfFailedInterfaceLimit": 5,
        "peerPollTime": 6,
        "interfaceHoldTime": 10,
        "name": "string",
        "links": {
          "parent": "string",
          "self": "string"
        },
        "id": "string",
        "peerPollTimeUnit": "SEC",
        "interfacePollTimeUnit": "SEC"
      },
      "modelType": "string",
      "type": "string",
      "version": "string",
      "ftdHABootstrap": {
        "sharedKey": "string",
        "lanFailover": {
          "interfaceObject": {
            "enableAntiSpoofing": false,
            "metadata": {},
            "securityZone": {},
            "activeMACAddress": "string",
            "fragmentReassembly": true,
            "macTable": [
              "string",
              "string",
              "string",
              "string",
              "string",
              "string",
              "string",
              "string"
            ],
            "standbyMACAddress": "string",
            "enableDNSLookup": true,
            "description": "string",
            "overrideDefaultFragmentSetting": {},
            "type": "string",
            "version": "string",
            "enabled": true,
            "MTU": 5,
            "mode": {},
            "arpConfig": [
              {},
              {},
              {},
              {},
              {},
              {},
              {},
              {}
            ],
            "ipv4": {},
            "ifname": "string",
            "ipv6": {},
            "name": "string",
            "links": {},
            "id": "string",
            "macLearn": false,
            "managementOnly": true
          },
          "useIPv6Address": false,
          "standbyIP": "string",
          "activeIP": "string",
          "logicalName": "string",
          "subnetMask": "string"
        },
        "encKeyGenerationScheme": "AUTO",
        "useSameLinkForFailovers": true,
        "isEncryptionEnabled": false,
        "statefulFailover": {
          "interfaceObject": {
            "enableAntiSpoofing": false,
            "metadata": {},
            "securityZone": {},
            "activeMACAddress": "string",
            "fragmentReassembly": false,
            "macTable": [
              "string",
              "string",
              "string",
              "string",
              "string",
              "string",
              "string",
              "string",
              "string"
            ],
            "standbyMACAddress": "string",
            "enableDNSLookup": false,
            "description": "string",
            "overrideDefaultFragmentSetting": {},
            "type": "string",
            "version": "string",
            "enabled": false,
            "MTU": 5,
            "mode": {},
            "arpConfig": [
              {},
              {},
              {},
              {},
              {},
              {},
              {}
            ],
            "ipv4": {},
            "ifname": "string",
            "ipv6": {},
            "name": "string",
            "links": {},
            "id": "string",
            "macLearn": false,
            "managementOnly": false
          },
          "useIPv6Address": true,
          "standbyIP": "string",
          "activeIP": "string",
          "logicalName": "string",
          "subnetMask": "string"
        }
      },
      "sw_version": "string",
      "secondary": {
        "metadata": {
          "lastUser": {
            "name": "string",
            "links": {},
            "id": "string",
            "type": "string"
          },
          "domain": {
            "name": "string",
            "links": {},
            "id": "string",
            "type": "string"
          },
          "readOnly": {
            "reason": {},
            "state": false
          },
          "timestamp": 9
        },
        "modelId": "string",
        "description": "string",
        "modelType": "string",
        "type": "string",
        "version": "string",
        "sw_version": "string",
        "healthStatus": "string",
        "healthPolicy": {
          "name": "string",
          "links": {
            "parent": "string",
            "self": "string"
          },
          "id": "string",
          "type": "string"
        },
        "name": "string",
        "model": "string",
        "modelNumber": "string",
        "links": {
          "parent": "string",
          "self": "string"
        },
        "accessPolicy": {
          "metadata": {
            "lastUser": {
              "name": "string",
              "links": {},
              "id": "string",
              "type": "string"
            },
            "domain": {
              "name": "string",
              "links": {},
              "id": "string",
              "type": "string"
            },
            "readOnly": {
              "reason": {},
              "state": true
            },
            "timestamp": 1
          },
          "name": "string",
          "description": "string",
          "links": {
            "parent": "string",
            "self": "string"
          },
          "id": "string",
          "type": "string",
          "version": "string"
        },
        "id": "string"
      },
      "healthStatus": "string",
      "healthPolicy": {
        "name": "string",
        "links": {
          "parent": "string",
          "self": "string"
        },
        "id": "string",
        "type": "string"
      },
      "name": "string",
      "action": "HABREAK",
      "links": {
        "parent": "string",
        "self": "string"
      },
      "model": "string",
      "modelNumber": "string",
      "forceBreak": false,
      "id": "string",
      "accessPolicy": {
        "metadata": {
          "lastUser": {
            "name": "string",
            "links": {},
            "id": "string",
            "type": "string"
          },
          "domain": {
            "name": "string",
            "links": {},
            "id": "string",
            "type": "string"
          },
          "readOnly": {
            "reason": {},
            "state": true
          },
          "timestamp": 4
        },
        "name": "string",
        "description": "string",
        "links": {
          "parent": "string",
          "self": "string"
        },
        "id": "string",
        "type": "string",
        "version": "string"
      },
      "primary": {
        "metadata": {
          "lastUser": {
            "name": "string",
            "links": {},
            "id": "string",
            "type": "string"
          },
          "domain": {
            "name": "string",
            "links": {},
            "id": "string",
            "type": "string"
          },
          "readOnly": {
            "reason": {},
            "state": true
          },
          "timestamp": 10
        },
        "modelId": "string",
        "description": "string",
        "modelType": "string",
        "type": "string",
        "version": "string",
        "sw_version": "string",
        "healthStatus": "string",
        "healthPolicy": {
          "name": "string",
          "links": {
            "parent": "string",
            "self": "string"
          },
          "id": "string",
          "type": "string"
        },
        "name": "string",
        "model": "string",
        "modelNumber": "string",
        "links": {
          "parent": "string",
          "self": "string"
        },
        "accessPolicy": {
          "metadata": {
            "lastUser": {
              "name": "string",
              "links": {},
              "id": "string",
              "type": "string"
            },
            "domain": {
              "name": "string",
              "links": {},
              "id": "string",
              "type": "string"
            },
            "readOnly": {
              "reason": {},
              "state": false
            },
            "timestamp": 3
          },
          "name": "string",
          "description": "string",
          "links": {
            "parent": "string",
            "self": "string"
          },
          "id": "string",
          "type": "string",
          "version": "string"
        },
        "id": "string"
      }
    }
  ]
}