{
  "inheritedProperty": {
    "ttl": 90,
    "publish": true,
    "whitelist": false,
    "expirationTime": 1506280028,
    "action": "monitor"
  },
  "effectiveProperty": {
    "ttl": 90,
    "publish": true,
    "whitelist": false,
    "expirationTime": 1506280028,
    "action": "monitor"
  },
  "customProperty": {
    "publish": true,
    "action": "block"
  },
  "feedId": "feedUUID",
  "equation": {
    "children": [
      {
        "children": [
          {
            "isRealized": false,
            "type": "IPV_4_ADDR",
            "value": "IPV_4_ADDR:c4a098d02ba0407e165c14996f8eae6b65a119a2"
          }
        ],
        "condition": "EQUALS",
        "applyCondition": "ANY",
        "isRealized": false
      }
    ],
    "isRealized": false,
    "op": "OR"
  },
  "updatedAt": 1499842559,
  "sourceName": "Test Flat File IPV4",
  "containsUnsupported": false,
  "containsInvalid": false,
  "observables": [
    {
      "inheritedProperty": {
        "ttl": 90,
        "publish": true,
        "whitelist": false,
        "expirationTime": 1506280028,
        "action": "monitor"
      },
      "effectiveProperty": {
        "ttl": 90,
        "publish": true,
        "whitelist": false,
        "expirationTime": 1506280028,
        "action": "monitor"
      },
      "indicatorCount": 1,
      "observableType": "IPV_4_ADDR",
      "updatedAt": 1498504028,
      "value": "ipAddressValue",
      "id": "IPV_4_ADDR:c4a098d02ba0407e165c14996f8eae6b65a119a2",
      "type": "observable",
      "name": "Observable",
      "version": "1.0.0"
    }
  ],
  "indicatorVersion": "1.0.0",
  "noRealizedIncidents": 0,
  "noPartialIncidents": 0,
  "id": "indicatorUUID",
  "type": "indicator",
  "name": "Sample Indicator IPV4",
  "version": "1.0.0",
  "description": "Indicator description changed"
}