{
  "links": {
    "self": "/fmc_config/v1/domain/domainUUID/object/applicationrisks/VERY_LOW"
  },
  "type": "ApplicationRisk",
  "name": "Very Low",
  "id": "VERY_LOW",
  "metadata": {
    "count": 1094
  }
}