{
  "links": {
    "parent": "string",
    "self": "string"
  },
  "paging": {
    "pages": 10,
    "offset": 2,
    "limit": 7,
    "count": 2
  },
  "items": [
    {
      "metadata": {
        "lastUser": {
          "name": "string",
          "links": {
            "parent": "string",
            "self": "string"
          },
          "id": "string",
          "type": "string"
        },
        "parentPolicy": {
          "name": "string",
          "links": {},
          "id": "string",
          "type": "string"
        },
        "inherit": true,
        "domain": {
          "name": "string",
          "links": {
            "parent": "string",
            "self": "string"
          },
          "id": "string",
          "type": "string"
        },
        "readOnly": {
          "reason": "DOMAIN",
          "state": true
        },
        "timestamp": 8
      },
      "defaultAction": {
        "logEnd": false,
        "logBegin": true,
        "metadata": {},
        "snmpConfig": {},
        "intrusionPolicy": {},
        "sendEventsToFMC": true,
        "description": "string",
        "type": "string",
        "variableSet": {},
        "version": "string",
        "syslogConfig": {},
        "name": "string",
        "action": {},
        "links": {},
        "id": "string"
      },
      "name": "string",
      "description": "string",
      "links": {
        "parent": "string",
        "self": "string"
      },
      "rules": {},
      "id": "string",
      "type": "string",
      "version": "string"
    },
    {
      "metadata": {
        "lastUser": {
          "name": "string",
          "links": {
            "parent": "string",
            "self": "string"
          },
          "id": "string",
          "type": "string"
        },
        "parentPolicy": {
          "name": "string",
          "links": {},
          "id": "string",
          "type": "string"
        },
        "inherit": true,
        "domain": {
          "name": "string",
          "links": {
            "parent": "string",
            "self": "string"
          },
          "id": "string",
          "type": "string"
        },
        "readOnly": {
          "reason": "DOMAIN",
          "state": true
        },
        "timestamp": 1
      },
      "defaultAction": {
        "logEnd": true,
        "logBegin": false,
        "metadata": {},
        "snmpConfig": {},
        "intrusionPolicy": {},
        "sendEventsToFMC": false,
        "description": "string",
        "type": "string",
        "variableSet": {},
        "version": "string",
        "syslogConfig": {},
        "name": "string",
        "action": {},
        "links": {},
        "id": "string"
      },
      "name": "string",
      "description": "string",
      "links": {
        "parent": "string",
        "self": "string"
      },
      "rules": {},
      "id": "string",
      "type": "string",
      "version": "string"
    },
    {
      "metadata": {
        "lastUser": {
          "name": "string",
          "links": {
            "parent": "string",
            "self": "string"
          },
          "id": "string",
          "type": "string"
        },
        "parentPolicy": {
          "name": "string",
          "links": {},
          "id": "string",
          "type": "string"
        },
        "inherit": false,
        "domain": {
          "name": "string",
          "links": {
            "parent": "string",
            "self": "string"
          },
          "id": "string",
          "type": "string"
        },
        "readOnly": {
          "reason": "RBAC",
          "state": false
        },
        "timestamp": 5
      },
      "defaultAction": {
        "logEnd": true,
        "logBegin": true,
        "metadata": {},
        "snmpConfig": {},
        "intrusionPolicy": {},
        "sendEventsToFMC": false,
        "description": "string",
        "type": "string",
        "variableSet": {},
        "version": "string",
        "syslogConfig": {},
        "name": "string",
        "action": {},
        "links": {},
        "id": "string"
      },
      "name": "string",
      "description": "string",
      "links": {
        "parent": "string",
        "self": "string"
      },
      "rules": {},
      "id": "string",
      "type": "string",
      "version": "string"
    },
    {
      "metadata": {
        "lastUser": {
          "name": "string",
          "links": {
            "parent": "string",
            "self": "string"
          },
          "id": "string",
          "type": "string"
        },
        "parentPolicy": {
          "name": "string",
          "links": {},
          "id": "string",
          "type": "string"
        },
        "inherit": false,
        "domain": {
          "name": "string",
          "links": {
            "parent": "string",
            "self": "string"
          },
          "id": "string",
          "type": "string"
        },
        "readOnly": {
          "reason": "SYSTEM",
          "state": true
        },
        "timestamp": 5
      },
      "defaultAction": {
        "logEnd": false,
        "logBegin": true,
        "metadata": {},
        "snmpConfig": {},
        "intrusionPolicy": {},
        "sendEventsToFMC": true,
        "description": "string",
        "type": "string",
        "variableSet": {},
        "version": "string",
        "syslogConfig": {},
        "name": "string",
        "action": {},
        "links": {},
        "id": "string"
      },
      "name": "string",
      "description": "string",
      "links": {
        "parent": "string",
        "self": "string"
      },
      "rules": {},
      "id": "string",
      "type": "string",
      "version": "string"
    },
    {
      "metadata": {
        "lastUser": {
          "name": "string",
          "links": {
            "parent": "string",
            "self": "string"
          },
          "id": "string",
          "type": "string"
        },
        "parentPolicy": {
          "name": "string",
          "links": {},
          "id": "string",
          "type": "string"
        },
        "inherit": false,
        "domain": {
          "name": "string",
          "links": {
            "parent": "string",
            "self": "string"
          },
          "id": "string",
          "type": "string"
        },
        "readOnly": {
          "reason": "RBAC",
          "state": true
        },
        "timestamp": 5
      },
      "defaultAction": {
        "logEnd": true,
        "logBegin": true,
        "metadata": {},
        "snmpConfig": {},
        "intrusionPolicy": {},
        "sendEventsToFMC": false,
        "description": "string",
        "type": "string",
        "variableSet": {},
        "version": "string",
        "syslogConfig": {},
        "name": "string",
        "action": {},
        "links": {},
        "id": "string"
      },
      "name": "string",
      "description": "string",
      "links": {
        "parent": "string",
        "self": "string"
      },
      "rules": {},
      "id": "string",
      "type": "string",
      "version": "string"
    },
    {
      "metadata": {
        "lastUser": {
          "name": "string",
          "links": {
            "parent": "string",
            "self": "string"
          },
          "id": "string",
          "type": "string"
        },
        "parentPolicy": {
          "name": "string",
          "links": {},
          "id": "string",
          "type": "string"
        },
        "inherit": false,
        "domain": {
          "name": "string",
          "links": {
            "parent": "string",
            "self": "string"
          },
          "id": "string",
          "type": "string"
        },
        "readOnly": {
          "reason": "DOMAIN",
          "state": true
        },
        "timestamp": 9
      },
      "defaultAction": {
        "logEnd": true,
        "logBegin": true,
        "metadata": {},
        "snmpConfig": {},
        "intrusionPolicy": {},
        "sendEventsToFMC": true,
        "description": "string",
        "type": "string",
        "variableSet": {},
        "version": "string",
        "syslogConfig": {},
        "name": "string",
        "action": {},
        "links": {},
        "id": "string"
      },
      "name": "string",
      "description": "string",
      "links": {
        "parent": "string",
        "self": "string"
      },
      "rules": {},
      "id": "string",
      "type": "string",
      "version": "string"
    }
  ]
}