{
  "metadata": {
    "lastUser": {
      "name": "string",
      "links": {
        "parent": "string",
        "self": "string"
      },
      "id": "string",
      "type": "string"
    },
    "domain": {
      "name": "string",
      "links": {
        "parent": "string",
        "self": "string"
      },
      "id": "string",
      "type": "string"
    },
    "readOnly": {
      "reason": "DOMAIN",
      "state": true
    },
    "timestamp": 6
  },
  "extranet": true,
  "description": "string",
  "type": "string",
  "interface": {
    "name": "string",
    "links": {},
    "id": "string",
    "type": "string"
  },
  "connectionType": "string",
  "version": "string",
  "extranetInfo": {
    "isDynamicIP": true,
    "name": "string",
    "ipAddress": "string"
  },
  "protectedNetworks": {
    "acl": {
      "name": "string",
      "links": {},
      "id": "string",
      "type": "string"
    },
    "networks": [
      {
        "name": "string",
        "links": {},
        "id": "string",
        "type": "string"
      },
      {
        "name": "string",
        "links": {},
        "id": "string",
        "type": "string"
      },
      {
        "name": "string",
        "links": {},
        "id": "string",
        "type": "string"
      },
      {
        "name": "string",
        "links": {},
        "id": "string",
        "type": "string"
      },
      {
        "name": "string",
        "links": {},
        "id": "string",
        "type": "string"
      },
      {
        "name": "string",
        "links": {},
        "id": "string",
        "type": "string"
      }
    ]
  },
  "nattedInterfaceAddress": "string",
  "name": "string",
  "links": {
    "parent": "string",
    "self": "string"
  },
  "id": "string",
  "peerType": "string",
  "device": {
    "name": "string",
    "links": {},
    "id": "string",
    "type": "string"
  },
  "ipv6InterfaceAddress": "string"
}