{
  "metadata": {
    "readOnly": {
      "state": true,
      "reason": "SYSTEM"
    }
  },
  "links": {
    "self": "/fmc_config/v1/domain/DomainUUID/policy/accesspolicies/containerUUID/accessrules/accessruleUUID"
  },
  "action": "ALLOW",
  "enabled": true,
  "type": "AccessRule",
  "name": "Rule2",
  "sendEventsToFMC": false,
  "ipsPolicy": {
    "name": "Connectivity Over Security",
    "id": "ipsPolicyUUID",
    "type": "IntrusionPolicy"
  },
  "originalSourceNetworks": {},
  "id": "accessruleUUID",
  "vlanTags": {
    "objects": [
      {
        "type": "VlanTag",
        "name": "vlan_tag_1",
        "id": "vlanTagUUID"
      }
    ]
  },
  "urls": {
    "urlCategoriesWithReputation": [
      {
        "type": "UrlCategoryAndReputation",
        "category": {
          "name": "Weapons",
          "id": "categoryUUID",
          "type": "URLCategory"
        },
        "reputation": "BENIGN_SITES_WITH_SECURITY_RISKS"
      }
    ]
  },
  "sourceZones": {
    "objects": [
      {
        "name": "External",
        "id": "sourceZoneObjectUUID",
        "type": "SecurityZone"
      }
    ]
  },
  "destinationZones": {
    "objects": [
      {
        "name": "Internal",
        "id": "destinationZonesUUID",
        "type": "SecurityZone"
      }
    ]
  },
  "logFiles": false,
  "logBegin": false,
  "logEnd": false,
  "variableSet": {
    "name": "Default Set",
    "id": "variableSetUUID",
    "type": "VariableSet"
  },
  "sourcePorts": {
    "objects": [
      {
        "type": "ProtocolPortObject",
        "name": "AOL",
        "id": "ProtocolPortObjectUUID"
      }
    ]
  },
  "destinationPorts": {
    "objects": [
      {
        "type": "ProtocolPortObject",
        "name": "Bittorrent",
        "id": "ProtocolPortObjectUUID"
      }
    ]
  },
  "applications": {
    "applications": [
      {
        "id": "1553",
        "type": "Application",
        "name": "1&1 Internet"
      }
    ]
  }
}