{
  "name": "Test-Syslog-Global",
  "id": "Syslog-alert-UUID-1",
  "type": "SyslogAlert",
  "links": {
    "self": "https://somehost.cisco.com/api/fmc_config/v1/domain/default/policy/syslogalerts/Syslog-alert-UUID-1"
  },
  "metadata": {
    "readOnly": {
      "state": true
    },
    "timestamp": 1460056577,
    "lastUser": {
      "name": "admin",
      "id": "User-UUID",
      "type": "user"
    },
    "domain": {
      "name": "Global",
      "id": "Global-domain-UUID",
      "type": "domain"
    }
  }
}