{
  "logEnd": false,
  "metadata": {
    "lastUser": {
      "name": "string",
      "links": {
        "parent": "string",
        "self": "string"
      },
      "id": "string",
      "type": "string"
    },
    "domain": {
      "name": "string",
      "links": {
        "parent": "string",
        "self": "string"
      },
      "id": "string",
      "type": "string"
    },
    "readOnly": {
      "reason": "RBAC",
      "state": true
    },
    "timestamp": 9
  },
  "logBegin": true,
  "snmpConfig": {
    "name": "string",
    "links": {},
    "id": "string",
    "type": "string"
  },
  "intrusionPolicy": {
    "inlineDrop": 3,
    "metadata": {
      "lastUser": {
        "name": "string",
        "links": {},
        "id": "string",
        "type": "string"
      },
      "domain": {
        "name": "string",
        "links": {},
        "id": "string",
        "type": "string"
      },
      "readOnly": {
        "reason": {},
        "state": true
      },
      "timestamp": 7
    },
    "name": "string",
    "basePolicy": {},
    "description": "string",
    "links": {
      "parent": "string",
      "self": "string"
    },
    "id": "string",
    "type": "string",
    "version": "string"
  },
  "sendEventsToFMC": true,
  "description": "string",
  "type": "string",
  "variableSet": {
    "name": "string",
    "links": {},
    "id": "string",
    "type": "string"
  },
  "version": "string",
  "syslogConfig": {
    "name": "string",
    "links": {},
    "id": "string",
    "type": "string"
  },
  "name": "string",
  "action": "BLOCK",
  "links": {
    "parent": "string",
    "self": "string"
  },
  "id": "string"
}