{
  "metadata": {
    "lastUser": {
      "name": "string",
      "links": {},
      "id": "string",
      "type": "string"
    },
    "domain": {
      "name": "string",
      "links": {},
      "id": "string",
      "type": "string"
    },
    "readOnly": {
      "reason": {},
      "state": false
    },
    "timestamp": 8
  },
  "modelId": "string",
  "description": "string",
  "ftdHAFailoverTriggerCriteria": {
    "percentFailedInterfaceExceed": 9,
    "metadata": {
      "lastUser": {
        "name": "string",
        "links": {},
        "id": "string",
        "type": "string"
      },
      "domain": {
        "name": "string",
        "links": {},
        "id": "string",
        "type": "string"
      },
      "readOnly": {
        "reason": {},
        "state": false
      },
      "timestamp": 5
    },
    "peerHoldTimeUnit": "SEC",
    "description": "string",
    "peerHoldTime": 2,
    "type": "string",
    "version": "string",
    "interfacePollTime": 1,
    "noOfFailedInterfaceLimit": 2,
    "peerPollTime": 9,
    "interfaceHoldTime": 4,
    "name": "string",
    "links": {
      "parent": "string",
      "self": "string"
    },
    "id": "string",
    "peerPollTimeUnit": "SEC",
    "interfacePollTimeUnit": "SEC"
  },
  "modelType": "string",
  "type": "string",
  "version": "string",
  "ftdHABootstrap": {
    "sharedKey": "string",
    "lanFailover": {
      "interfaceObject": {
        "enableAntiSpoofing": false,
        "metadata": {},
        "securityZone": {},
        "activeMACAddress": "string",
        "fragmentReassembly": false,
        "macTable": [
          "string",
          "string",
          "string",
          "string",
          "string",
          "string",
          "string",
          "string",
          "string",
          "string"
        ],
        "standbyMACAddress": "string",
        "enableDNSLookup": false,
        "description": "string",
        "overrideDefaultFragmentSetting": {},
        "type": "string",
        "version": "string",
        "enabled": true,
        "MTU": 3,
        "mode": {},
        "arpConfig": [
          {},
          {},
          {},
          {},
          {},
          {}
        ],
        "ipv4": {},
        "ifname": "string",
        "ipv6": {},
        "name": "string",
        "links": {},
        "id": "string",
        "macLearn": false,
        "managementOnly": false
      },
      "useIPv6Address": false,
      "standbyIP": "string",
      "activeIP": "string",
      "logicalName": "string",
      "subnetMask": "string"
    },
    "encKeyGenerationScheme": "CUSTOM",
    "useSameLinkForFailovers": true,
    "isEncryptionEnabled": true,
    "statefulFailover": {
      "interfaceObject": {
        "enableAntiSpoofing": true,
        "metadata": {},
        "securityZone": {},
        "activeMACAddress": "string",
        "fragmentReassembly": true,
        "macTable": [
          "string",
          "string"
        ],
        "standbyMACAddress": "string",
        "enableDNSLookup": false,
        "description": "string",
        "overrideDefaultFragmentSetting": {},
        "type": "string",
        "version": "string",
        "enabled": false,
        "MTU": 5,
        "mode": {},
        "arpConfig": [
          {},
          {},
          {},
          {},
          {},
          {},
          {},
          {}
        ],
        "ipv4": {},
        "ifname": "string",
        "ipv6": {},
        "name": "string",
        "links": {},
        "id": "string",
        "macLearn": true,
        "managementOnly": true
      },
      "useIPv6Address": true,
      "standbyIP": "string",
      "activeIP": "string",
      "logicalName": "string",
      "subnetMask": "string"
    }
  },
  "sw_version": "string",
  "secondary": {
    "metadata": {
      "lastUser": {
        "name": "string",
        "links": {},
        "id": "string",
        "type": "string"
      },
      "domain": {
        "name": "string",
        "links": {},
        "id": "string",
        "type": "string"
      },
      "readOnly": {
        "reason": {},
        "state": true
      },
      "timestamp": 8
    },
    "modelId": "string",
    "description": "string",
    "modelType": "string",
    "type": "string",
    "version": "string",
    "sw_version": "string",
    "healthStatus": "string",
    "healthPolicy": {
      "name": "string",
      "links": {
        "parent": "string",
        "self": "string"
      },
      "id": "string",
      "type": "string"
    },
    "name": "string",
    "model": "string",
    "modelNumber": "string",
    "links": {
      "parent": "string",
      "self": "string"
    },
    "accessPolicy": {
      "metadata": {
        "lastUser": {
          "name": "string",
          "links": {},
          "id": "string",
          "type": "string"
        },
        "domain": {
          "name": "string",
          "links": {},
          "id": "string",
          "type": "string"
        },
        "readOnly": {
          "reason": {},
          "state": false
        },
        "timestamp": 10
      },
      "name": "string",
      "description": "string",
      "links": {
        "parent": "string",
        "self": "string"
      },
      "id": "string",
      "type": "string",
      "version": "string"
    },
    "id": "string"
  },
  "healthStatus": "string",
  "healthPolicy": {
    "name": "string",
    "links": {
      "parent": "string",
      "self": "string"
    },
    "id": "string",
    "type": "string"
  },
  "name": "string",
  "action": "HABREAK",
  "links": {
    "parent": "string",
    "self": "string"
  },
  "model": "string",
  "modelNumber": "string",
  "forceBreak": false,
  "id": "string",
  "accessPolicy": {
    "metadata": {
      "lastUser": {
        "name": "string",
        "links": {},
        "id": "string",
        "type": "string"
      },
      "domain": {
        "name": "string",
        "links": {},
        "id": "string",
        "type": "string"
      },
      "readOnly": {
        "reason": {},
        "state": true
      },
      "timestamp": 4
    },
    "name": "string",
    "description": "string",
    "links": {
      "parent": "string",
      "self": "string"
    },
    "id": "string",
    "type": "string",
    "version": "string"
  },
  "primary": {
    "metadata": {
      "lastUser": {
        "name": "string",
        "links": {},
        "id": "string",
        "type": "string"
      },
      "domain": {
        "name": "string",
        "links": {},
        "id": "string",
        "type": "string"
      },
      "readOnly": {
        "reason": {},
        "state": true
      },
      "timestamp": 8
    },
    "modelId": "string",
    "description": "string",
    "modelType": "string",
    "type": "string",
    "version": "string",
    "sw_version": "string",
    "healthStatus": "string",
    "healthPolicy": {
      "name": "string",
      "links": {
        "parent": "string",
        "self": "string"
      },
      "id": "string",
      "type": "string"
    },
    "name": "string",
    "model": "string",
    "modelNumber": "string",
    "links": {
      "parent": "string",
      "self": "string"
    },
    "accessPolicy": {
      "metadata": {
        "lastUser": {
          "name": "string",
          "links": {},
          "id": "string",
          "type": "string"
        },
        "domain": {
          "name": "string",
          "links": {},
          "id": "string",
          "type": "string"
        },
        "readOnly": {
          "reason": {},
          "state": false
        },
        "timestamp": 3
      },
      "name": "string",
      "description": "string",
      "links": {
        "parent": "string",
        "self": "string"
      },
      "id": "string",
      "type": "string",
      "version": "string"
    },
    "id": "string"
  }
}