{
  "metadata": {
    "lastUser": {
      "name": "string",
      "links": {
        "parent": "string",
        "self": "string"
      },
      "id": "string",
      "type": "string"
    },
    "domain": {
      "name": "string",
      "links": {
        "parent": "string",
        "self": "string"
      },
      "id": "string",
      "type": "string"
    },
    "readOnly": {
      "reason": "SYSTEM",
      "state": false
    },
    "timestamp": 1
  },
  "objects": [
    {
      "metadata": {
        "lastUser": {
          "name": "string",
          "links": {},
          "id": "string",
          "type": "string"
        },
        "domain": {
          "name": "string",
          "links": {},
          "id": "string",
          "type": "string"
        },
        "readOnly": {
          "reason": {},
          "state": false
        },
        "timestamp": 1
      },
      "overridable": false,
      "name": "string",
      "description": "string",
      "links": {
        "parent": "string",
        "self": "string"
      },
      "overrides": {
        "parent": {
          "name": "string",
          "links": {},
          "id": "string",
          "type": "string"
        },
        "target": {
          "name": "string",
          "links": {},
          "id": "string",
          "type": "string"
        }
      },
      "id": "string",
      "type": "string",
      "version": "string",
      "url": "string"
    },
    {
      "metadata": {
        "lastUser": {
          "name": "string",
          "links": {},
          "id": "string",
          "type": "string"
        },
        "domain": {
          "name": "string",
          "links": {},
          "id": "string",
          "type": "string"
        },
        "readOnly": {
          "reason": {},
          "state": true
        },
        "timestamp": 9
      },
      "overridable": false,
      "name": "string",
      "description": "string",
      "links": {
        "parent": "string",
        "self": "string"
      },
      "overrides": {
        "parent": {
          "name": "string",
          "links": {},
          "id": "string",
          "type": "string"
        },
        "target": {
          "name": "string",
          "links": {},
          "id": "string",
          "type": "string"
        }
      },
      "id": "string",
      "type": "string",
      "version": "string",
      "url": "string"
    }
  ],
  "literals": [
    {
      "type": "string",
      "url": "string"
    },
    {
      "type": "string",
      "url": "string"
    }
  ],
  "overridable": true,
  "name": "string",
  "description": "string",
  "links": {
    "parent": "string",
    "self": "string"
  },
  "overrides": {
    "parent": {
      "name": "string",
      "links": {},
      "id": "string",
      "type": "string"
    },
    "target": {
      "name": "string",
      "links": {},
      "id": "string",
      "type": "string"
    }
  },
  "id": "string",
  "type": "string",
  "version": "string",
  "overrideTargetId": "string"
}