{
  "icmpType": "string",
  "metadata": {
    "lastUser": {
      "name": "string",
      "links": {
        "parent": "string",
        "self": "string"
      },
      "id": "string",
      "type": "string"
    },
    "domain": {
      "name": "string",
      "links": {
        "parent": "string",
        "self": "string"
      },
      "id": "string",
      "type": "string"
    },
    "readOnly": {
      "reason": "DOMAIN",
      "state": true
    },
    "parentType": "string",
    "timestamp": 4
  },
  "code": 10,
  "overridable": false,
  "name": "string",
  "description": "string",
  "links": {
    "parent": "string",
    "self": "string"
  },
  "overrides": {
    "parent": {
      "name": "string",
      "links": {},
      "id": "string",
      "type": "string"
    },
    "target": {
      "name": "string",
      "links": {},
      "id": "string",
      "type": "string"
    }
  },
  "id": "string",
  "type": "string",
  "version": "string",
  "overrideTargetId": "string"
}