{
  "links": {
    "self": "/fmc_config/v1/domain/domainUUID/object/applicationcategories?offset=0&limit=2"
  },
  "items": [
    {
      "type": "ApplicationCategory",
      "id": "2325",
      "name": "Low",
      "links": {
        "self": "/fmc_config/v1/domain/domainUUID/object/applicationcategories/2325"
      }
    },
    {
      "type": "ApplicationCategory",
      "id": "1234",
      "name": "Medium",
      "links": {
        "self": "/fmc_config/v1/domain/e276abec-e0f2-11e3-8169-6d9ed49b625f/object/applicationcategories/1234"
      }
    }
  ],
  "paging": {
    "offset": 0,
    "limit": 2,
    "count": 5,
    "next": [
      "/fmc_config/v1/domain/domainUUID/object/applicationcategories?offset=2&limit=2",
      "/fmc_config/v1/domain/domainUUID/object/applicationcategories?offset=4&limit=1"
    ],
    "pages": 3
  }
}