{
  "links": {
    "parent": "string",
    "self": "string"
  },
  "paging": {
    "pages": 7,
    "offset": 9,
    "limit": 8,
    "count": 2
  },
  "items": [
    {
      "metadata": {
        "lastUser": {
          "name": "string",
          "links": {},
          "id": "string",
          "type": "string"
        },
        "domain": {
          "name": "string",
          "links": {},
          "id": "string",
          "type": "string"
        },
        "readOnly": {
          "reason": {},
          "state": false
        },
        "timestamp": 6
      },
      "name": "string",
      "overridable": true,
      "description": "string",
      "links": {
        "parent": "string",
        "self": "string"
      },
      "id": "string",
      "tag": 6,
      "overrides": {
        "parent": {
          "name": "string",
          "links": {},
          "id": "string",
          "type": "string"
        },
        "target": {
          "name": "string",
          "links": {},
          "id": "string",
          "type": "string"
        }
      },
      "type": "string",
      "version": "string"
    },
    {
      "metadata": {
        "lastUser": {
          "name": "string",
          "links": {},
          "id": "string",
          "type": "string"
        },
        "domain": {
          "name": "string",
          "links": {},
          "id": "string",
          "type": "string"
        },
        "readOnly": {
          "reason": {},
          "state": false
        },
        "timestamp": 3
      },
      "name": "string",
      "overridable": false,
      "description": "string",
      "links": {
        "parent": "string",
        "self": "string"
      },
      "id": "string",
      "tag": 3,
      "overrides": {
        "parent": {
          "name": "string",
          "links": {},
          "id": "string",
          "type": "string"
        },
        "target": {
          "name": "string",
          "links": {},
          "id": "string",
          "type": "string"
        }
      },
      "type": "string",
      "version": "string"
    },
    {
      "metadata": {
        "lastUser": {
          "name": "string",
          "links": {},
          "id": "string",
          "type": "string"
        },
        "domain": {
          "name": "string",
          "links": {},
          "id": "string",
          "type": "string"
        },
        "readOnly": {
          "reason": {},
          "state": true
        },
        "timestamp": 6
      },
      "name": "string",
      "overridable": true,
      "description": "string",
      "links": {
        "parent": "string",
        "self": "string"
      },
      "id": "string",
      "tag": 9,
      "overrides": {
        "parent": {
          "name": "string",
          "links": {},
          "id": "string",
          "type": "string"
        },
        "target": {
          "name": "string",
          "links": {},
          "id": "string",
          "type": "string"
        }
      },
      "type": "string",
      "version": "string"
    }
  ]
}