{
  "links": {
    "self": "<fmc_ip>/api/fmc_config/v1/domain/domainUUID/policy/ftds2svpns/topologyUuid/endpoints?offset=0&limit=2&expanded=true"
  },
  "items": [
    {
      "links": {
        "self": "<fmc_ip>/api/fmc_config/v1/domain/domainUUID/policy/ftds2svpns/topologyUuid/endpoints/005056A9-6FFE-0ed3-0000-120259084433"
      },
      "name": "192.168.0.22",
      "id": "005056A9-6FFE-0ed3-0000-120259084433",
      "type": "EndPoint",
      "extranet": false,
      "device": {
        "name": "192.168.0.22",
        "id": "463b5424-2812-11e8-9a5f-89adee70d40d",
        "type": "Device"
      },
      "interface": {
        "name": "s1",
        "id": "005056A9-6FFE-0ed3-0000-042949673272"
      },
      "protectedNetworks": {
        "networks": [
          {
            "name": "IPv4-Private-172.16.0.0-12",
            "id": "b7a78a7d-20c5-47b2-b02f-86b4360112ac"
          }
        ]
      },
      "connectionType": "BIDIRECTIONAL",
      "peerType": "PEER"
    },
    {
      "links": {
        "self": "<fmc_ip>/api/fmc_config/v1/domain/domainUUID/policy/ftds2svpns/topologyUuid/endpoints/endpointId"
      },
      "interface": {
        "name": "inside",
        "id": "005056A9-6FFE-0ed3-0000-004294967551"
      },
      "name": "192.168.0.22",
      "id": "endpointId",
      "type": "EndPoint",
      "extranet": false,
      "device": {
        "name": "192.168.0.22",
        "id": "463b5424-2812-11e8-9a5f-89adee70d40d",
        "type": "Device"
      },
      "connectionType": "ORIGINATE_ONLY",
      "protectedNetworks": {
        "networks": [
          {
            "name": "IPv4-Private-172.16.0.0-12",
            "id": "b7a78a7d-20c5-47b2-b02f-86b4360112ac"
          }
        ]
      },
      "peerType": "PEER"
    }
  ],
  "paging": {
    "offset": 0,
    "limit": 2,
    "count": 2,
    "pages": 1
  }
}