{
  "links": {
    "self": "/fmc_config/v1/domain/DomainUUID/devices/devicerecords/containerUUID/inlinesets?offset=0&limit=1"
  },
  "items": [
    {
      "name": "Default Inline Set",
      "id": "inlinesetUUID",
      "type": "InlineSet",
      "links": {
        "self": "/fmc_config/v1/domain/DomainUUID/devices/devicerecords/containerUUID/inlinesets/inlinesetUUID"
      },
      "failSafe": false,
      "failopen": true,
      "macFiltering": false,
      "inlinepairs": [
        {
          "first": {
            "name": "s1p1",
            "type": "FPPhysicalInterface",
            "id": "FPPhysicalInterfaceUUID1"
          },
          "second": {
            "name": "s1p2",
            "type": "FPPhysicalInterface",
            "id": "FPPhysicalInterfaceUUID2"
          }
        }
      ],
      "loadBalancingMode": "inner",
      "loadBalancingModeVlan": "inner",
      "mtu": 1518,
      "propogateLinkState": false,
      "strictTCPEnforcement": false,
      "metadata": {
        "readOnly": {
          "state": false
        },
        "timestamp": 1458595542,
        "lastUser": {
          "name": "admin",
          "id": "UserUUID",
          "type": "user"
        },
        "domain": {
          "name": "Global",
          "id": "DomainUUID",
          "type": "domain"
        }
      }
    }
  ],
  "paging": {
    "offset": 0,
    "limit": 2,
    "count": 2,
    "pages": 1
  }
}