{
  "links": {
    "parent": "string",
    "self": "string"
  },
  "paging": {
    "pages": 3,
    "offset": 3,
    "limit": 10,
    "count": 7
  },
  "items": [
    {
      "metadata": {
        "lastUser": {
          "name": "string",
          "links": {
            "parent": "string",
            "self": "string"
          },
          "id": "string",
          "type": "string"
        },
        "task": {
          "taskType": {},
          "subTasks": [
            {},
            {},
            {},
            {},
            {}
          ],
          "name": "string",
          "description": "string",
          "links": {},
          "id": "string",
          "message": "string",
          "type": "string",
          "status": "string"
        },
        "ruleIndex": 3,
        "domain": {
          "name": "string",
          "links": {
            "parent": "string",
            "self": "string"
          },
          "id": "string",
          "type": "string"
        },
        "deviceRuleId": "string",
        "timestamp": 3,
        "policy": {
          "metadata": {
            "lastUser": {
              "name": "string",
              "links": {},
              "id": "string",
              "type": "string"
            },
            "domain": {
              "name": "string",
              "links": {},
              "id": "string",
              "type": "string"
            },
            "readOnly": {
              "reason": {},
              "state": true
            },
            "timestamp": 2
          },
          "name": "string",
          "description": "string",
          "links": {
            "parent": "string",
            "self": "string"
          },
          "id": "string",
          "type": "string",
          "version": "string"
        }
      },
      "lastFetchTimeStamp": "string",
      "hitCount": 7,
      "firstHitTimeStamp": "string",
      "rule": {
        "metadata": {
          "lastUser": {
            "name": "string",
            "links": {},
            "id": "string",
            "type": "string"
          },
          "domain": {
            "name": "string",
            "links": {},
            "id": "string",
            "type": "string"
          },
          "readOnly": {
            "reason": {},
            "state": true
          },
          "timestamp": 9
        },
        "name": "string",
        "description": "string",
        "links": {
          "parent": "string",
          "self": "string"
        },
        "id": "string",
        "type": "string",
        "version": "string"
      },
      "lastHitTimeStamp": "string",
      "description": "string",
      "links": {
        "parent": "string",
        "self": "string"
      },
      "type": "string",
      "version": "string"
    },
    {
      "metadata": {
        "lastUser": {
          "name": "string",
          "links": {
            "parent": "string",
            "self": "string"
          },
          "id": "string",
          "type": "string"
        },
        "task": {
          "taskType": {},
          "subTasks": [
            {},
            {},
            {}
          ],
          "name": "string",
          "description": "string",
          "links": {},
          "id": "string",
          "message": "string",
          "type": "string",
          "status": "string"
        },
        "ruleIndex": 1,
        "domain": {
          "name": "string",
          "links": {
            "parent": "string",
            "self": "string"
          },
          "id": "string",
          "type": "string"
        },
        "deviceRuleId": "string",
        "timestamp": 8,
        "policy": {
          "metadata": {
            "lastUser": {
              "name": "string",
              "links": {},
              "id": "string",
              "type": "string"
            },
            "domain": {
              "name": "string",
              "links": {},
              "id": "string",
              "type": "string"
            },
            "readOnly": {
              "reason": {},
              "state": false
            },
            "timestamp": 9
          },
          "name": "string",
          "description": "string",
          "links": {
            "parent": "string",
            "self": "string"
          },
          "id": "string",
          "type": "string",
          "version": "string"
        }
      },
      "lastFetchTimeStamp": "string",
      "hitCount": 7,
      "firstHitTimeStamp": "string",
      "rule": {
        "metadata": {
          "lastUser": {
            "name": "string",
            "links": {},
            "id": "string",
            "type": "string"
          },
          "domain": {
            "name": "string",
            "links": {},
            "id": "string",
            "type": "string"
          },
          "readOnly": {
            "reason": {},
            "state": true
          },
          "timestamp": 2
        },
        "name": "string",
        "description": "string",
        "links": {
          "parent": "string",
          "self": "string"
        },
        "id": "string",
        "type": "string",
        "version": "string"
      },
      "lastHitTimeStamp": "string",
      "description": "string",
      "links": {
        "parent": "string",
        "self": "string"
      },
      "type": "string",
      "version": "string"
    },
    {
      "metadata": {
        "lastUser": {
          "name": "string",
          "links": {
            "parent": "string",
            "self": "string"
          },
          "id": "string",
          "type": "string"
        },
        "task": {
          "taskType": {},
          "subTasks": [
            {},
            {},
            {},
            {}
          ],
          "name": "string",
          "description": "string",
          "links": {},
          "id": "string",
          "message": "string",
          "type": "string",
          "status": "string"
        },
        "ruleIndex": 2,
        "domain": {
          "name": "string",
          "links": {
            "parent": "string",
            "self": "string"
          },
          "id": "string",
          "type": "string"
        },
        "deviceRuleId": "string",
        "timestamp": 6,
        "policy": {
          "metadata": {
            "lastUser": {
              "name": "string",
              "links": {},
              "id": "string",
              "type": "string"
            },
            "domain": {
              "name": "string",
              "links": {},
              "id": "string",
              "type": "string"
            },
            "readOnly": {
              "reason": {},
              "state": false
            },
            "timestamp": 10
          },
          "name": "string",
          "description": "string",
          "links": {
            "parent": "string",
            "self": "string"
          },
          "id": "string",
          "type": "string",
          "version": "string"
        }
      },
      "lastFetchTimeStamp": "string",
      "hitCount": 5,
      "firstHitTimeStamp": "string",
      "rule": {
        "metadata": {
          "lastUser": {
            "name": "string",
            "links": {},
            "id": "string",
            "type": "string"
          },
          "domain": {
            "name": "string",
            "links": {},
            "id": "string",
            "type": "string"
          },
          "readOnly": {
            "reason": {},
            "state": true
          },
          "timestamp": 1
        },
        "name": "string",
        "description": "string",
        "links": {
          "parent": "string",
          "self": "string"
        },
        "id": "string",
        "type": "string",
        "version": "string"
      },
      "lastHitTimeStamp": "string",
      "description": "string",
      "links": {
        "parent": "string",
        "self": "string"
      },
      "type": "string",
      "version": "string"
    },
    {
      "metadata": {
        "lastUser": {
          "name": "string",
          "links": {
            "parent": "string",
            "self": "string"
          },
          "id": "string",
          "type": "string"
        },
        "task": {
          "taskType": {},
          "subTasks": [
            {}
          ],
          "name": "string",
          "description": "string",
          "links": {},
          "id": "string",
          "message": "string",
          "type": "string",
          "status": "string"
        },
        "ruleIndex": 7,
        "domain": {
          "name": "string",
          "links": {
            "parent": "string",
            "self": "string"
          },
          "id": "string",
          "type": "string"
        },
        "deviceRuleId": "string",
        "timestamp": 4,
        "policy": {
          "metadata": {
            "lastUser": {
              "name": "string",
              "links": {},
              "id": "string",
              "type": "string"
            },
            "domain": {
              "name": "string",
              "links": {},
              "id": "string",
              "type": "string"
            },
            "readOnly": {
              "reason": {},
              "state": false
            },
            "timestamp": 8
          },
          "name": "string",
          "description": "string",
          "links": {
            "parent": "string",
            "self": "string"
          },
          "id": "string",
          "type": "string",
          "version": "string"
        }
      },
      "lastFetchTimeStamp": "string",
      "hitCount": 9,
      "firstHitTimeStamp": "string",
      "rule": {
        "metadata": {
          "lastUser": {
            "name": "string",
            "links": {},
            "id": "string",
            "type": "string"
          },
          "domain": {
            "name": "string",
            "links": {},
            "id": "string",
            "type": "string"
          },
          "readOnly": {
            "reason": {},
            "state": true
          },
          "timestamp": 9
        },
        "name": "string",
        "description": "string",
        "links": {
          "parent": "string",
          "self": "string"
        },
        "id": "string",
        "type": "string",
        "version": "string"
      },
      "lastHitTimeStamp": "string",
      "description": "string",
      "links": {
        "parent": "string",
        "self": "string"
      },
      "type": "string",
      "version": "string"
    },
    {
      "metadata": {
        "lastUser": {
          "name": "string",
          "links": {
            "parent": "string",
            "self": "string"
          },
          "id": "string",
          "type": "string"
        },
        "task": {
          "taskType": {},
          "subTasks": [
            {},
            {},
            {},
            {},
            {},
            {}
          ],
          "name": "string",
          "description": "string",
          "links": {},
          "id": "string",
          "message": "string",
          "type": "string",
          "status": "string"
        },
        "ruleIndex": 9,
        "domain": {
          "name": "string",
          "links": {
            "parent": "string",
            "self": "string"
          },
          "id": "string",
          "type": "string"
        },
        "deviceRuleId": "string",
        "timestamp": 3,
        "policy": {
          "metadata": {
            "lastUser": {
              "name": "string",
              "links": {},
              "id": "string",
              "type": "string"
            },
            "domain": {
              "name": "string",
              "links": {},
              "id": "string",
              "type": "string"
            },
            "readOnly": {
              "reason": {},
              "state": true
            },
            "timestamp": 8
          },
          "name": "string",
          "description": "string",
          "links": {
            "parent": "string",
            "self": "string"
          },
          "id": "string",
          "type": "string",
          "version": "string"
        }
      },
      "lastFetchTimeStamp": "string",
      "hitCount": 5,
      "firstHitTimeStamp": "string",
      "rule": {
        "metadata": {
          "lastUser": {
            "name": "string",
            "links": {},
            "id": "string",
            "type": "string"
          },
          "domain": {
            "name": "string",
            "links": {},
            "id": "string",
            "type": "string"
          },
          "readOnly": {
            "reason": {},
            "state": false
          },
          "timestamp": 4
        },
        "name": "string",
        "description": "string",
        "links": {
          "parent": "string",
          "self": "string"
        },
        "id": "string",
        "type": "string",
        "version": "string"
      },
      "lastHitTimeStamp": "string",
      "description": "string",
      "links": {
        "parent": "string",
        "self": "string"
      },
      "type": "string",
      "version": "string"
    },
    {
      "metadata": {
        "lastUser": {
          "name": "string",
          "links": {
            "parent": "string",
            "self": "string"
          },
          "id": "string",
          "type": "string"
        },
        "task": {
          "taskType": {},
          "subTasks": [
            {},
            {},
            {},
            {}
          ],
          "name": "string",
          "description": "string",
          "links": {},
          "id": "string",
          "message": "string",
          "type": "string",
          "status": "string"
        },
        "ruleIndex": 3,
        "domain": {
          "name": "string",
          "links": {
            "parent": "string",
            "self": "string"
          },
          "id": "string",
          "type": "string"
        },
        "deviceRuleId": "string",
        "timestamp": 4,
        "policy": {
          "metadata": {
            "lastUser": {
              "name": "string",
              "links": {},
              "id": "string",
              "type": "string"
            },
            "domain": {
              "name": "string",
              "links": {},
              "id": "string",
              "type": "string"
            },
            "readOnly": {
              "reason": {},
              "state": false
            },
            "timestamp": 1
          },
          "name": "string",
          "description": "string",
          "links": {
            "parent": "string",
            "self": "string"
          },
          "id": "string",
          "type": "string",
          "version": "string"
        }
      },
      "lastFetchTimeStamp": "string",
      "hitCount": 4,
      "firstHitTimeStamp": "string",
      "rule": {
        "metadata": {
          "lastUser": {
            "name": "string",
            "links": {},
            "id": "string",
            "type": "string"
          },
          "domain": {
            "name": "string",
            "links": {},
            "id": "string",
            "type": "string"
          },
          "readOnly": {
            "reason": {},
            "state": true
          },
          "timestamp": 9
        },
        "name": "string",
        "description": "string",
        "links": {
          "parent": "string",
          "self": "string"
        },
        "id": "string",
        "type": "string",
        "version": "string"
      },
      "lastHitTimeStamp": "string",
      "description": "string",
      "links": {
        "parent": "string",
        "self": "string"
      },
      "type": "string",
      "version": "string"
    },
    {
      "metadata": {
        "lastUser": {
          "name": "string",
          "links": {
            "parent": "string",
            "self": "string"
          },
          "id": "string",
          "type": "string"
        },
        "task": {
          "taskType": {},
          "subTasks": [
            {},
            {},
            {},
            {},
            {},
            {},
            {}
          ],
          "name": "string",
          "description": "string",
          "links": {},
          "id": "string",
          "message": "string",
          "type": "string",
          "status": "string"
        },
        "ruleIndex": 6,
        "domain": {
          "name": "string",
          "links": {
            "parent": "string",
            "self": "string"
          },
          "id": "string",
          "type": "string"
        },
        "deviceRuleId": "string",
        "timestamp": 4,
        "policy": {
          "metadata": {
            "lastUser": {
              "name": "string",
              "links": {},
              "id": "string",
              "type": "string"
            },
            "domain": {
              "name": "string",
              "links": {},
              "id": "string",
              "type": "string"
            },
            "readOnly": {
              "reason": {},
              "state": false
            },
            "timestamp": 8
          },
          "name": "string",
          "description": "string",
          "links": {
            "parent": "string",
            "self": "string"
          },
          "id": "string",
          "type": "string",
          "version": "string"
        }
      },
      "lastFetchTimeStamp": "string",
      "hitCount": 2,
      "firstHitTimeStamp": "string",
      "rule": {
        "metadata": {
          "lastUser": {
            "name": "string",
            "links": {},
            "id": "string",
            "type": "string"
          },
          "domain": {
            "name": "string",
            "links": {},
            "id": "string",
            "type": "string"
          },
          "readOnly": {
            "reason": {},
            "state": true
          },
          "timestamp": 3
        },
        "name": "string",
        "description": "string",
        "links": {
          "parent": "string",
          "self": "string"
        },
        "id": "string",
        "type": "string",
        "version": "string"
      },
      "lastHitTimeStamp": "string",
      "description": "string",
      "links": {
        "parent": "string",
        "self": "string"
      },
      "type": "string",
      "version": "string"
    },
    {
      "metadata": {
        "lastUser": {
          "name": "string",
          "links": {
            "parent": "string",
            "self": "string"
          },
          "id": "string",
          "type": "string"
        },
        "task": {
          "taskType": {},
          "subTasks": [
            {},
            {},
            {},
            {},
            {},
            {},
            {},
            {},
            {},
            {}
          ],
          "name": "string",
          "description": "string",
          "links": {},
          "id": "string",
          "message": "string",
          "type": "string",
          "status": "string"
        },
        "ruleIndex": 2,
        "domain": {
          "name": "string",
          "links": {
            "parent": "string",
            "self": "string"
          },
          "id": "string",
          "type": "string"
        },
        "deviceRuleId": "string",
        "timestamp": 3,
        "policy": {
          "metadata": {
            "lastUser": {
              "name": "string",
              "links": {},
              "id": "string",
              "type": "string"
            },
            "domain": {
              "name": "string",
              "links": {},
              "id": "string",
              "type": "string"
            },
            "readOnly": {
              "reason": {},
              "state": true
            },
            "timestamp": 3
          },
          "name": "string",
          "description": "string",
          "links": {
            "parent": "string",
            "self": "string"
          },
          "id": "string",
          "type": "string",
          "version": "string"
        }
      },
      "lastFetchTimeStamp": "string",
      "hitCount": 1,
      "firstHitTimeStamp": "string",
      "rule": {
        "metadata": {
          "lastUser": {
            "name": "string",
            "links": {},
            "id": "string",
            "type": "string"
          },
          "domain": {
            "name": "string",
            "links": {},
            "id": "string",
            "type": "string"
          },
          "readOnly": {
            "reason": {},
            "state": true
          },
          "timestamp": 3
        },
        "name": "string",
        "description": "string",
        "links": {
          "parent": "string",
          "self": "string"
        },
        "id": "string",
        "type": "string",
        "version": "string"
      },
      "lastHitTimeStamp": "string",
      "description": "string",
      "links": {
        "parent": "string",
        "self": "string"
      },
      "type": "string",
      "version": "string"
    },
    {
      "metadata": {
        "lastUser": {
          "name": "string",
          "links": {
            "parent": "string",
            "self": "string"
          },
          "id": "string",
          "type": "string"
        },
        "task": {
          "taskType": {},
          "subTasks": [
            {},
            {},
            {},
            {},
            {}
          ],
          "name": "string",
          "description": "string",
          "links": {},
          "id": "string",
          "message": "string",
          "type": "string",
          "status": "string"
        },
        "ruleIndex": 3,
        "domain": {
          "name": "string",
          "links": {
            "parent": "string",
            "self": "string"
          },
          "id": "string",
          "type": "string"
        },
        "deviceRuleId": "string",
        "timestamp": 7,
        "policy": {
          "metadata": {
            "lastUser": {
              "name": "string",
              "links": {},
              "id": "string",
              "type": "string"
            },
            "domain": {
              "name": "string",
              "links": {},
              "id": "string",
              "type": "string"
            },
            "readOnly": {
              "reason": {},
              "state": false
            },
            "timestamp": 4
          },
          "name": "string",
          "description": "string",
          "links": {
            "parent": "string",
            "self": "string"
          },
          "id": "string",
          "type": "string",
          "version": "string"
        }
      },
      "lastFetchTimeStamp": "string",
      "hitCount": 9,
      "firstHitTimeStamp": "string",
      "rule": {
        "metadata": {
          "lastUser": {
            "name": "string",
            "links": {},
            "id": "string",
            "type": "string"
          },
          "domain": {
            "name": "string",
            "links": {},
            "id": "string",
            "type": "string"
          },
          "readOnly": {
            "reason": {},
            "state": true
          },
          "timestamp": 10
        },
        "name": "string",
        "description": "string",
        "links": {
          "parent": "string",
          "self": "string"
        },
        "id": "string",
        "type": "string",
        "version": "string"
      },
      "lastHitTimeStamp": "string",
      "description": "string",
      "links": {
        "parent": "string",
        "self": "string"
      },
      "type": "string",
      "version": "string"
    },
    {
      "metadata": {
        "lastUser": {
          "name": "string",
          "links": {
            "parent": "string",
            "self": "string"
          },
          "id": "string",
          "type": "string"
        },
        "task": {
          "taskType": {},
          "subTasks": [
            {},
            {},
            {}
          ],
          "name": "string",
          "description": "string",
          "links": {},
          "id": "string",
          "message": "string",
          "type": "string",
          "status": "string"
        },
        "ruleIndex": 8,
        "domain": {
          "name": "string",
          "links": {
            "parent": "string",
            "self": "string"
          },
          "id": "string",
          "type": "string"
        },
        "deviceRuleId": "string",
        "timestamp": 9,
        "policy": {
          "metadata": {
            "lastUser": {
              "name": "string",
              "links": {},
              "id": "string",
              "type": "string"
            },
            "domain": {
              "name": "string",
              "links": {},
              "id": "string",
              "type": "string"
            },
            "readOnly": {
              "reason": {},
              "state": false
            },
            "timestamp": 7
          },
          "name": "string",
          "description": "string",
          "links": {
            "parent": "string",
            "self": "string"
          },
          "id": "string",
          "type": "string",
          "version": "string"
        }
      },
      "lastFetchTimeStamp": "string",
      "hitCount": 2,
      "firstHitTimeStamp": "string",
      "rule": {
        "metadata": {
          "lastUser": {
            "name": "string",
            "links": {},
            "id": "string",
            "type": "string"
          },
          "domain": {
            "name": "string",
            "links": {},
            "id": "string",
            "type": "string"
          },
          "readOnly": {
            "reason": {},
            "state": true
          },
          "timestamp": 2
        },
        "name": "string",
        "description": "string",
        "links": {
          "parent": "string",
          "self": "string"
        },
        "id": "string",
        "type": "string",
        "version": "string"
      },
      "lastHitTimeStamp": "string",
      "description": "string",
      "links": {
        "parent": "string",
        "self": "string"
      },
      "type": "string",
      "version": "string"
    }
  ]
}