{
  "metadata": {
    "lastUser": {
      "name": "string",
      "links": {
        "parent": "string",
        "self": "string"
      },
      "id": "string",
      "type": "string"
    },
    "domain": {
      "name": "string",
      "links": {
        "parent": "string",
        "self": "string"
      },
      "id": "string",
      "type": "string"
    },
    "readOnly": {
      "reason": "DOMAIN",
      "state": true
    },
    "timestamp": 3
  },
  "keys": [
    {
      "acceptLifeTime": {
        "endLifeTimeValue": "string",
        "startLifeTimeValue": "string",
        "timeZone": "string",
        "endLifetimeType": "DURATION"
      },
      "authAlgorithm": "string",
      "keyId": 9,
      "authString": {
        "cryptoKeyString": "string",
        "cryptoEncryptionType": "PLAINTEXT"
      },
      "sendLifeTime": {
        "endLifeTimeValue": "string",
        "startLifeTimeValue": "string",
        "timeZone": "string",
        "endLifetimeType": "DATETIME"
      }
    },
    {
      "acceptLifeTime": {
        "endLifeTimeValue": "string",
        "startLifeTimeValue": "string",
        "timeZone": "string",
        "endLifetimeType": "DURATION"
      },
      "authAlgorithm": "string",
      "keyId": 1,
      "authString": {
        "cryptoKeyString": "string",
        "cryptoEncryptionType": "PLAINTEXT"
      },
      "sendLifeTime": {
        "endLifeTimeValue": "string",
        "startLifeTimeValue": "string",
        "timeZone": "string",
        "endLifetimeType": "INFINITE"
      }
    },
    {
      "acceptLifeTime": {
        "endLifeTimeValue": "string",
        "startLifeTimeValue": "string",
        "timeZone": "string",
        "endLifetimeType": "DATETIME"
      },
      "authAlgorithm": "string",
      "keyId": 2,
      "authString": {
        "cryptoKeyString": "string",
        "cryptoEncryptionType": "PLAINTEXT"
      },
      "sendLifeTime": {
        "endLifeTimeValue": "string",
        "startLifeTimeValue": "string",
        "timeZone": "string",
        "endLifetimeType": "DATETIME"
      }
    },
    {
      "acceptLifeTime": {
        "endLifeTimeValue": "string",
        "startLifeTimeValue": "string",
        "timeZone": "string",
        "endLifetimeType": "DURATION"
      },
      "authAlgorithm": "string",
      "keyId": 3,
      "authString": {
        "cryptoKeyString": "string",
        "cryptoEncryptionType": "PLAINTEXT"
      },
      "sendLifeTime": {
        "endLifeTimeValue": "string",
        "startLifeTimeValue": "string",
        "timeZone": "string",
        "endLifetimeType": "INFINITE"
      }
    },
    {
      "acceptLifeTime": {
        "endLifeTimeValue": "string",
        "startLifeTimeValue": "string",
        "timeZone": "string",
        "endLifetimeType": "DATETIME"
      },
      "authAlgorithm": "string",
      "keyId": 3,
      "authString": {
        "cryptoKeyString": "string",
        "cryptoEncryptionType": "PLAINTEXT"
      },
      "sendLifeTime": {
        "endLifeTimeValue": "string",
        "startLifeTimeValue": "string",
        "timeZone": "string",
        "endLifetimeType": "DURATION"
      }
    }
  ],
  "name": "string",
  "overridable": false,
  "description": "string",
  "links": {
    "parent": "string",
    "self": "string"
  },
  "id": "string",
  "overrides": {
    "parent": {
      "name": "string",
      "links": {},
      "id": "string",
      "type": "string"
    },
    "target": {
      "name": "string",
      "links": {},
      "id": "string",
      "type": "string"
    }
  },
  "type": "string",
  "version": "string",
  "overrideTargetId": "string"
}