{
  "links": {
    "parent": "string",
    "self": "string"
  },
  "paging": {
    "pages": 7,
    "offset": 6,
    "limit": 7,
    "count": 9
  },
  "items": [
    {
      "hostName": "string",
      "metadata": {
        "lastUser": {
          "name": "string",
          "links": {},
          "id": "string",
          "type": "string"
        },
        "domain": {
          "name": "string",
          "links": {},
          "id": "string",
          "type": "string"
        },
        "readOnly": {
          "reason": {},
          "state": false
        },
        "timestamp": 9
      },
      "modelId": "string",
      "natID": "string",
      "description": "string",
      "license_caps": [
        "string",
        "string",
        "string",
        "string"
      ],
      "ftdMode": "ROUTED",
      "modelType": "string",
      "type": "string",
      "regKey": "string",
      "keepLocalEvents": false,
      "version": "string",
      "sw_version": "string",
      "healthStatus": "string",
      "healthPolicy": {
        "name": "string",
        "links": {
          "parent": "string",
          "self": "string"
        },
        "id": "string",
        "type": "string"
      },
      "name": "string",
      "links": {
        "parent": "string",
        "self": "string"
      },
      "model": "string",
      "modelNumber": "string",
      "id": "string",
      "accessPolicy": {
        "metadata": {
          "lastUser": {
            "name": "string",
            "links": {},
            "id": "string",
            "type": "string"
          },
          "domain": {
            "name": "string",
            "links": {},
            "id": "string",
            "type": "string"
          },
          "readOnly": {
            "reason": {},
            "state": true
          },
          "timestamp": 9
        },
        "name": "string",
        "description": "string",
        "links": {
          "parent": "string",
          "self": "string"
        },
        "id": "string",
        "type": "string",
        "version": "string"
      },
      "prohibitPacketTransfer": false,
      "deviceGroup": {
        "metadata": {
          "lastUser": {
            "name": "string",
            "links": {},
            "id": "string",
            "type": "string"
          },
          "domain": {
            "name": "string",
            "links": {},
            "id": "string",
            "type": "string"
          },
          "readOnly": {
            "reason": {},
            "state": false
          },
          "timestamp": 10
        },
        "members": [
          {
            "metadata": {
              "lastUser": {
                "name": "string",
                "links": {},
                "id": "string",
                "type": "string"
              },
              "domain": {
                "name": "string",
                "links": {},
                "id": "string",
                "type": "string"
              },
              "readOnly": {
                "reason": {},
                "state": true
              },
              "timestamp": 5
            },
            "modelId": "string",
            "description": "string",
            "modelType": "string",
            "type": "string",
            "version": "string",
            "sw_version": "string",
            "healthStatus": "string",
            "healthPolicy": {
              "name": "string",
              "links": {
                "parent": "string",
                "self": "string"
              },
              "id": "string",
              "type": "string"
            },
            "name": "string",
            "model": "string",
            "modelNumber": "string",
            "links": {
              "parent": "string",
              "self": "string"
            },
            "accessPolicy": {
              "metadata": {
                "lastUser": {
                  "name": "string",
                  "links": {},
                  "id": "string",
                  "type": "string"
                },
                "domain": {
                  "name": "string",
                  "links": {},
                  "id": "string",
                  "type": "string"
                },
                "readOnly": {
                  "reason": {},
                  "state": false
                },
                "timestamp": 10
              },
              "name": "string",
              "description": "string",
              "links": {
                "parent": "string",
                "self": "string"
              },
              "id": "string",
              "type": "string",
              "version": "string"
            },
            "id": "string"
          },
          {
            "metadata": {
              "lastUser": {
                "name": "string",
                "links": {},
                "id": "string",
                "type": "string"
              },
              "domain": {
                "name": "string",
                "links": {},
                "id": "string",
                "type": "string"
              },
              "readOnly": {
                "reason": {},
                "state": true
              },
              "timestamp": 8
            },
            "modelId": "string",
            "description": "string",
            "modelType": "string",
            "type": "string",
            "version": "string",
            "sw_version": "string",
            "healthStatus": "string",
            "healthPolicy": {
              "name": "string",
              "links": {
                "parent": "string",
                "self": "string"
              },
              "id": "string",
              "type": "string"
            },
            "name": "string",
            "model": "string",
            "modelNumber": "string",
            "links": {
              "parent": "string",
              "self": "string"
            },
            "accessPolicy": {
              "metadata": {
                "lastUser": {
                  "name": "string",
                  "links": {},
                  "id": "string",
                  "type": "string"
                },
                "domain": {
                  "name": "string",
                  "links": {},
                  "id": "string",
                  "type": "string"
                },
                "readOnly": {
                  "reason": {},
                  "state": true
                },
                "timestamp": 4
              },
              "name": "string",
              "description": "string",
              "links": {
                "parent": "string",
                "self": "string"
              },
              "id": "string",
              "type": "string",
              "version": "string"
            },
            "id": "string"
          },
          {
            "metadata": {
              "lastUser": {
                "name": "string",
                "links": {},
                "id": "string",
                "type": "string"
              },
              "domain": {
                "name": "string",
                "links": {},
                "id": "string",
                "type": "string"
              },
              "readOnly": {
                "reason": {},
                "state": false
              },
              "timestamp": 3
            },
            "modelId": "string",
            "description": "string",
            "modelType": "string",
            "type": "string",
            "version": "string",
            "sw_version": "string",
            "healthStatus": "string",
            "healthPolicy": {
              "name": "string",
              "links": {
                "parent": "string",
                "self": "string"
              },
              "id": "string",
              "type": "string"
            },
            "name": "string",
            "model": "string",
            "modelNumber": "string",
            "links": {
              "parent": "string",
              "self": "string"
            },
            "accessPolicy": {
              "metadata": {
                "lastUser": {
                  "name": "string",
                  "links": {},
                  "id": "string",
                  "type": "string"
                },
                "domain": {
                  "name": "string",
                  "links": {},
                  "id": "string",
                  "type": "string"
                },
                "readOnly": {
                  "reason": {},
                  "state": false
                },
                "timestamp": 6
              },
              "name": "string",
              "description": "string",
              "links": {
                "parent": "string",
                "self": "string"
              },
              "id": "string",
              "type": "string",
              "version": "string"
            },
            "id": "string"
          },
          {
            "metadata": {
              "lastUser": {
                "name": "string",
                "links": {},
                "id": "string",
                "type": "string"
              },
              "domain": {
                "name": "string",
                "links": {},
                "id": "string",
                "type": "string"
              },
              "readOnly": {
                "reason": {},
                "state": true
              },
              "timestamp": 8
            },
            "modelId": "string",
            "description": "string",
            "modelType": "string",
            "type": "string",
            "version": "string",
            "sw_version": "string",
            "healthStatus": "string",
            "healthPolicy": {
              "name": "string",
              "links": {
                "parent": "string",
                "self": "string"
              },
              "id": "string",
              "type": "string"
            },
            "name": "string",
            "model": "string",
            "modelNumber": "string",
            "links": {
              "parent": "string",
              "self": "string"
            },
            "accessPolicy": {
              "metadata": {
                "lastUser": {
                  "name": "string",
                  "links": {},
                  "id": "string",
                  "type": "string"
                },
                "domain": {
                  "name": "string",
                  "links": {},
                  "id": "string",
                  "type": "string"
                },
                "readOnly": {
                  "reason": {},
                  "state": true
                },
                "timestamp": 8
              },
              "name": "string",
              "description": "string",
              "links": {
                "parent": "string",
                "self": "string"
              },
              "id": "string",
              "type": "string",
              "version": "string"
            },
            "id": "string"
          },
          {
            "metadata": {
              "lastUser": {
                "name": "string",
                "links": {},
                "id": "string",
                "type": "string"
              },
              "domain": {
                "name": "string",
                "links": {},
                "id": "string",
                "type": "string"
              },
              "readOnly": {
                "reason": {},
                "state": true
              },
              "timestamp": 3
            },
            "modelId": "string",
            "description": "string",
            "modelType": "string",
            "type": "string",
            "version": "string",
            "sw_version": "string",
            "healthStatus": "string",
            "healthPolicy": {
              "name": "string",
              "links": {
                "parent": "string",
                "self": "string"
              },
              "id": "string",
              "type": "string"
            },
            "name": "string",
            "model": "string",
            "modelNumber": "string",
            "links": {
              "parent": "string",
              "self": "string"
            },
            "accessPolicy": {
              "metadata": {
                "lastUser": {
                  "name": "string",
                  "links": {},
                  "id": "string",
                  "type": "string"
                },
                "domain": {
                  "name": "string",
                  "links": {},
                  "id": "string",
                  "type": "string"
                },
                "readOnly": {
                  "reason": {},
                  "state": false
                },
                "timestamp": 6
              },
              "name": "string",
              "description": "string",
              "links": {
                "parent": "string",
                "self": "string"
              },
              "id": "string",
              "type": "string",
              "version": "string"
            },
            "id": "string"
          },
          {
            "metadata": {
              "lastUser": {
                "name": "string",
                "links": {},
                "id": "string",
                "type": "string"
              },
              "domain": {
                "name": "string",
                "links": {},
                "id": "string",
                "type": "string"
              },
              "readOnly": {
                "reason": {},
                "state": false
              },
              "timestamp": 3
            },
            "modelId": "string",
            "description": "string",
            "modelType": "string",
            "type": "string",
            "version": "string",
            "sw_version": "string",
            "healthStatus": "string",
            "healthPolicy": {
              "name": "string",
              "links": {
                "parent": "string",
                "self": "string"
              },
              "id": "string",
              "type": "string"
            },
            "name": "string",
            "model": "string",
            "modelNumber": "string",
            "links": {
              "parent": "string",
              "self": "string"
            },
            "accessPolicy": {
              "metadata": {
                "lastUser": {
                  "name": "string",
                  "links": {},
                  "id": "string",
                  "type": "string"
                },
                "domain": {
                  "name": "string",
                  "links": {},
                  "id": "string",
                  "type": "string"
                },
                "readOnly": {
                  "reason": {},
                  "state": true
                },
                "timestamp": 4
              },
              "name": "string",
              "description": "string",
              "links": {
                "parent": "string",
                "self": "string"
              },
              "id": "string",
              "type": "string",
              "version": "string"
            },
            "id": "string"
          },
          {
            "metadata": {
              "lastUser": {
                "name": "string",
                "links": {},
                "id": "string",
                "type": "string"
              },
              "domain": {
                "name": "string",
                "links": {},
                "id": "string",
                "type": "string"
              },
              "readOnly": {
                "reason": {},
                "state": false
              },
              "timestamp": 10
            },
            "modelId": "string",
            "description": "string",
            "modelType": "string",
            "type": "string",
            "version": "string",
            "sw_version": "string",
            "healthStatus": "string",
            "healthPolicy": {
              "name": "string",
              "links": {
                "parent": "string",
                "self": "string"
              },
              "id": "string",
              "type": "string"
            },
            "name": "string",
            "model": "string",
            "modelNumber": "string",
            "links": {
              "parent": "string",
              "self": "string"
            },
            "accessPolicy": {
              "metadata": {
                "lastUser": {
                  "name": "string",
                  "links": {},
                  "id": "string",
                  "type": "string"
                },
                "domain": {
                  "name": "string",
                  "links": {},
                  "id": "string",
                  "type": "string"
                },
                "readOnly": {
                  "reason": {},
                  "state": true
                },
                "timestamp": 2
              },
              "name": "string",
              "description": "string",
              "links": {
                "parent": "string",
                "self": "string"
              },
              "id": "string",
              "type": "string",
              "version": "string"
            },
            "id": "string"
          },
          {
            "metadata": {
              "lastUser": {
                "name": "string",
                "links": {},
                "id": "string",
                "type": "string"
              },
              "domain": {
                "name": "string",
                "links": {},
                "id": "string",
                "type": "string"
              },
              "readOnly": {
                "reason": {},
                "state": true
              },
              "timestamp": 10
            },
            "modelId": "string",
            "description": "string",
            "modelType": "string",
            "type": "string",
            "version": "string",
            "sw_version": "string",
            "healthStatus": "string",
            "healthPolicy": {
              "name": "string",
              "links": {
                "parent": "string",
                "self": "string"
              },
              "id": "string",
              "type": "string"
            },
            "name": "string",
            "model": "string",
            "modelNumber": "string",
            "links": {
              "parent": "string",
              "self": "string"
            },
            "accessPolicy": {
              "metadata": {
                "lastUser": {
                  "name": "string",
                  "links": {},
                  "id": "string",
                  "type": "string"
                },
                "domain": {
                  "name": "string",
                  "links": {},
                  "id": "string",
                  "type": "string"
                },
                "readOnly": {
                  "reason": {},
                  "state": false
                },
                "timestamp": 4
              },
              "name": "string",
              "description": "string",
              "links": {
                "parent": "string",
                "self": "string"
              },
              "id": "string",
              "type": "string",
              "version": "string"
            },
            "id": "string"
          },
          {
            "metadata": {
              "lastUser": {
                "name": "string",
                "links": {},
                "id": "string",
                "type": "string"
              },
              "domain": {
                "name": "string",
                "links": {},
                "id": "string",
                "type": "string"
              },
              "readOnly": {
                "reason": {},
                "state": false
              },
              "timestamp": 7
            },
            "modelId": "string",
            "description": "string",
            "modelType": "string",
            "type": "string",
            "version": "string",
            "sw_version": "string",
            "healthStatus": "string",
            "healthPolicy": {
              "name": "string",
              "links": {
                "parent": "string",
                "self": "string"
              },
              "id": "string",
              "type": "string"
            },
            "name": "string",
            "model": "string",
            "modelNumber": "string",
            "links": {
              "parent": "string",
              "self": "string"
            },
            "accessPolicy": {
              "metadata": {
                "lastUser": {
                  "name": "string",
                  "links": {},
                  "id": "string",
                  "type": "string"
                },
                "domain": {
                  "name": "string",
                  "links": {},
                  "id": "string",
                  "type": "string"
                },
                "readOnly": {
                  "reason": {},
                  "state": false
                },
                "timestamp": 6
              },
              "name": "string",
              "description": "string",
              "links": {
                "parent": "string",
                "self": "string"
              },
              "id": "string",
              "type": "string",
              "version": "string"
            },
            "id": "string"
          },
          {
            "metadata": {
              "lastUser": {
                "name": "string",
                "links": {},
                "id": "string",
                "type": "string"
              },
              "domain": {
                "name": "string",
                "links": {},
                "id": "string",
                "type": "string"
              },
              "readOnly": {
                "reason": {},
                "state": true
              },
              "timestamp": 7
            },
            "modelId": "string",
            "description": "string",
            "modelType": "string",
            "type": "string",
            "version": "string",
            "sw_version": "string",
            "healthStatus": "string",
            "healthPolicy": {
              "name": "string",
              "links": {
                "parent": "string",
                "self": "string"
              },
              "id": "string",
              "type": "string"
            },
            "name": "string",
            "model": "string",
            "modelNumber": "string",
            "links": {
              "parent": "string",
              "self": "string"
            },
            "accessPolicy": {
              "metadata": {
                "lastUser": {
                  "name": "string",
                  "links": {},
                  "id": "string",
                  "type": "string"
                },
                "domain": {
                  "name": "string",
                  "links": {},
                  "id": "string",
                  "type": "string"
                },
                "readOnly": {
                  "reason": {},
                  "state": false
                },
                "timestamp": 9
              },
              "name": "string",
              "description": "string",
              "links": {
                "parent": "string",
                "self": "string"
              },
              "id": "string",
              "type": "string",
              "version": "string"
            },
            "id": "string"
          }
        ],
        "name": "string",
        "description": "string",
        "links": {
          "parent": "string",
          "self": "string"
        },
        "id": "string",
        "type": "string",
        "version": "string"
      }
    }
  ]
}