{
  "actions": [
    {
      "name": "getAllPolicyAssignment",
      "protocol": "REST",
      "method": "GET",
      "entitypath": "{base_path}/{version}/api/fmc_config/v1/domain/{pathv1}/assignment/policyassignments?{query}",
      "requestSchema": "schema.json",
      "responseSchema": "schema.json",
      "timeout": 0,
      "sendEmpty": false,
      "sendGetBody": false,
      "requestDatatype": "JSON",
      "responseDatatype": "JSON",
      "headers": {},
      "responseObjects": [
        {
          "type": "default",
          "key": "",
          "mockFile": "mockdatafiles/getAllPolicyAssignment-default.json"
        }
      ]
    },
    {
      "name": "createPolicyAssignment",
      "protocol": "REST",
      "method": "POST",
      "entitypath": "{base_path}/{version}/api/fmc_config/v1/domain/{pathv1}/assignment/policyassignments?{query}",
      "requestSchema": "schema.json",
      "responseSchema": "schema.json",
      "timeout": 0,
      "sendEmpty": false,
      "requestDatatype": "JSON",
      "responseDatatype": "JSON",
      "headers": {},
      "responseObjects": [
        {
          "type": "default",
          "key": "",
          "mockFile": "mockdatafiles/createPolicyAssignment-default.json"
        }
      ]
    },
    {
      "name": "getPolicyAssignment",
      "protocol": "REST",
      "method": "GET",
      "entitypath": "{base_path}/{version}/api/fmc_config/v1/domain/{pathv1}/assignment/policyassignments/{pathv2}?{query}",
      "requestSchema": "schema.json",
      "responseSchema": "schema.json",
      "timeout": 0,
      "sendEmpty": false,
      "sendGetBody": false,
      "requestDatatype": "JSON",
      "responseDatatype": "JSON",
      "headers": {},
      "responseObjects": [
        {
          "type": "default",
          "key": "",
          "mockFile": "mockdatafiles/getPolicyAssignment-default.json"
        }
      ]
    },
    {
      "name": "updatePolicyAssignment",
      "protocol": "REST",
      "method": "PUT",
      "entitypath": "{base_path}/{version}/api/fmc_config/v1/domain/{pathv1}/assignment/policyassignments/{pathv2}?{query}",
      "requestSchema": "schema.json",
      "responseSchema": "schema.json",
      "timeout": 0,
      "sendEmpty": false,
      "requestDatatype": "JSON",
      "responseDatatype": "JSON",
      "headers": {},
      "responseObjects": [
        {
          "type": "default",
          "key": "",
          "mockFile": "mockdatafiles/updatePolicyAssignment-default.json"
        }
      ]
    }
  ]
}