{
  "links": {
    "self": "https://bglgrp0231-pod.cisco.com:13655/api/fmc_config/v1/domain/e276abec-e0f2-11e3-8169-6d9ed49b625f/object/certenrollments?offset=0&limit=1"
  },
  "items": [
    {
      "links": {
        "self": "https://bglgrp0231-pod.cisco.com:13655/api/fmc_config/v1/domain/e276abec-e0f2-11e3-8169-6d9ed49b625f/object/certenrollments/005056A9-039E-0ed3-0000-476741369876"
      },
      "type": "CertEnrollment",
      "name": "PKI_Single",
      "id": "005056A9-039E-0ed3-0000-476741369876"
    }
  ],
  "paging": {
    "offset": 0,
    "limit": 1,
    "count": 1,
    "pages": 1
  }
}