{
  "inheritedProperty": {
    "publish": true,
    "expirationTime": 1493929252,
    "whitelist": false,
    "action": "monitor",
    "ttl": 90
  },
  "observableType": "IPV_4_ADDR",
  "effectiveProperty": {
    "publish": true,
    "expirationTime": 1493929252,
    "whitelist": false,
    "action": "monitor",
    "ttl": 90
  },
  "indicatorCount": 1,
  "updatedAt": 1486153252,
  "value": "ipAddressValue",
  "id": "observableUUID",
  "type": "observable",
  "name": "Observable name 2",
  "version": "1.0.0",
  "customProperty": {
    "whitelist": true
  }
}