{
  "links": {
    "self": "/fmc_config/v1/domain/default/object/fqdns/5555-6666-7777-8888",
    "parent": "/fmc_config/v1/domain/default/object/networkaddresses"
  },
  "type": "FQDN",
  "value": "www.cisco.com",
  "dnsResolution": "IPV4_ONLY",
  "overridable": false,
  "description": "Test Description",
  "id": "5555-6666-7777-8888",
  "name": "TestFQDN",
  "metadata": {
    "lastUser": {
      "name": "admin"
    },
    "domain": {
      "name": "Global",
      "id": "domainUuid"
    },
    "parentType": "NetworkAddress"
  }
}