{
  "id": "UrlGroupUUID1",
  "name": "urlgroup_obj1_updated",
  "type": "UrlGroup",
  "objects": [
    {
      "type": "Url",
      "id": "UrlObjectUUID"
    }
  ],
  "literals": [
    {
      "type": "Url",
      "url": "www.google.com"
    }
  ]
}