{
  "links": {
    "parent": "string",
    "self": "string"
  },
  "paging": {
    "pages": 1,
    "offset": 10,
    "limit": 4,
    "count": 10
  },
  "items": [
    {
      "serverVersion": "string",
      "vdbVersion": "string",
      "metadata": {
        "lastUser": {
          "name": "string",
          "links": {},
          "id": "string",
          "type": "string"
        },
        "domain": {
          "name": "string",
          "links": {},
          "id": "string",
          "type": "string"
        },
        "readOnly": {
          "reason": {},
          "state": false
        },
        "timestamp": 6
      },
      "name": "string",
      "description": "string",
      "links": {
        "parent": "string",
        "self": "string"
      },
      "geoVersion": "string",
      "id": "string",
      "sruVersion": "string",
      "type": "string"
    },
    {
      "serverVersion": "string",
      "vdbVersion": "string",
      "metadata": {
        "lastUser": {
          "name": "string",
          "links": {},
          "id": "string",
          "type": "string"
        },
        "domain": {
          "name": "string",
          "links": {},
          "id": "string",
          "type": "string"
        },
        "readOnly": {
          "reason": {},
          "state": false
        },
        "timestamp": 7
      },
      "name": "string",
      "description": "string",
      "links": {
        "parent": "string",
        "self": "string"
      },
      "geoVersion": "string",
      "id": "string",
      "sruVersion": "string",
      "type": "string"
    },
    {
      "serverVersion": "string",
      "vdbVersion": "string",
      "metadata": {
        "lastUser": {
          "name": "string",
          "links": {},
          "id": "string",
          "type": "string"
        },
        "domain": {
          "name": "string",
          "links": {},
          "id": "string",
          "type": "string"
        },
        "readOnly": {
          "reason": {},
          "state": true
        },
        "timestamp": 2
      },
      "name": "string",
      "description": "string",
      "links": {
        "parent": "string",
        "self": "string"
      },
      "geoVersion": "string",
      "id": "string",
      "sruVersion": "string",
      "type": "string"
    },
    {
      "serverVersion": "string",
      "vdbVersion": "string",
      "metadata": {
        "lastUser": {
          "name": "string",
          "links": {},
          "id": "string",
          "type": "string"
        },
        "domain": {
          "name": "string",
          "links": {},
          "id": "string",
          "type": "string"
        },
        "readOnly": {
          "reason": {},
          "state": true
        },
        "timestamp": 9
      },
      "name": "string",
      "description": "string",
      "links": {
        "parent": "string",
        "self": "string"
      },
      "geoVersion": "string",
      "id": "string",
      "sruVersion": "string",
      "type": "string"
    },
    {
      "serverVersion": "string",
      "vdbVersion": "string",
      "metadata": {
        "lastUser": {
          "name": "string",
          "links": {},
          "id": "string",
          "type": "string"
        },
        "domain": {
          "name": "string",
          "links": {},
          "id": "string",
          "type": "string"
        },
        "readOnly": {
          "reason": {},
          "state": false
        },
        "timestamp": 9
      },
      "name": "string",
      "description": "string",
      "links": {
        "parent": "string",
        "self": "string"
      },
      "geoVersion": "string",
      "id": "string",
      "sruVersion": "string",
      "type": "string"
    }
  ]
}