{
  "metadata": {
    "lastUser": {
      "name": "string",
      "links": {
        "parent": "string",
        "self": "string"
      },
      "id": "string",
      "type": "string"
    },
    "domain": {
      "name": "string",
      "links": {
        "parent": "string",
        "self": "string"
      },
      "id": "string",
      "type": "string"
    },
    "readOnly": {
      "reason": "RBAC",
      "state": false
    },
    "timestamp": 1
  },
  "objects": [
    {
      "metadata": {
        "lastUser": {
          "name": "string",
          "links": {},
          "id": "string",
          "type": "string"
        },
        "domain": {
          "name": "string",
          "links": {},
          "id": "string",
          "type": "string"
        },
        "readOnly": {
          "reason": {},
          "state": true
        },
        "timestamp": 5
      },
      "data": {
        "startTag": 8,
        "endTag": 7,
        "type": "string"
      },
      "overridable": true,
      "name": "string",
      "description": "string",
      "links": {
        "parent": "string",
        "self": "string"
      },
      "overrides": {
        "parent": {
          "name": "string",
          "links": {},
          "id": "string",
          "type": "string"
        },
        "target": {
          "name": "string",
          "links": {},
          "id": "string",
          "type": "string"
        }
      },
      "id": "string",
      "type": "string",
      "version": "string"
    },
    {
      "metadata": {
        "lastUser": {
          "name": "string",
          "links": {},
          "id": "string",
          "type": "string"
        },
        "domain": {
          "name": "string",
          "links": {},
          "id": "string",
          "type": "string"
        },
        "readOnly": {
          "reason": {},
          "state": false
        },
        "timestamp": 6
      },
      "data": {
        "startTag": 6,
        "endTag": 5,
        "type": "string"
      },
      "overridable": true,
      "name": "string",
      "description": "string",
      "links": {
        "parent": "string",
        "self": "string"
      },
      "overrides": {
        "parent": {
          "name": "string",
          "links": {},
          "id": "string",
          "type": "string"
        },
        "target": {
          "name": "string",
          "links": {},
          "id": "string",
          "type": "string"
        }
      },
      "id": "string",
      "type": "string",
      "version": "string"
    },
    {
      "metadata": {
        "lastUser": {
          "name": "string",
          "links": {},
          "id": "string",
          "type": "string"
        },
        "domain": {
          "name": "string",
          "links": {},
          "id": "string",
          "type": "string"
        },
        "readOnly": {
          "reason": {},
          "state": true
        },
        "timestamp": 4
      },
      "data": {
        "startTag": 9,
        "endTag": 10,
        "type": "string"
      },
      "overridable": true,
      "name": "string",
      "description": "string",
      "links": {
        "parent": "string",
        "self": "string"
      },
      "overrides": {
        "parent": {
          "name": "string",
          "links": {},
          "id": "string",
          "type": "string"
        },
        "target": {
          "name": "string",
          "links": {},
          "id": "string",
          "type": "string"
        }
      },
      "id": "string",
      "type": "string",
      "version": "string"
    },
    {
      "metadata": {
        "lastUser": {
          "name": "string",
          "links": {},
          "id": "string",
          "type": "string"
        },
        "domain": {
          "name": "string",
          "links": {},
          "id": "string",
          "type": "string"
        },
        "readOnly": {
          "reason": {},
          "state": false
        },
        "timestamp": 10
      },
      "data": {
        "startTag": 3,
        "endTag": 8,
        "type": "string"
      },
      "overridable": false,
      "name": "string",
      "description": "string",
      "links": {
        "parent": "string",
        "self": "string"
      },
      "overrides": {
        "parent": {
          "name": "string",
          "links": {},
          "id": "string",
          "type": "string"
        },
        "target": {
          "name": "string",
          "links": {},
          "id": "string",
          "type": "string"
        }
      },
      "id": "string",
      "type": "string",
      "version": "string"
    },
    {
      "metadata": {
        "lastUser": {
          "name": "string",
          "links": {},
          "id": "string",
          "type": "string"
        },
        "domain": {
          "name": "string",
          "links": {},
          "id": "string",
          "type": "string"
        },
        "readOnly": {
          "reason": {},
          "state": true
        },
        "timestamp": 9
      },
      "data": {
        "startTag": 2,
        "endTag": 9,
        "type": "string"
      },
      "overridable": false,
      "name": "string",
      "description": "string",
      "links": {
        "parent": "string",
        "self": "string"
      },
      "overrides": {
        "parent": {
          "name": "string",
          "links": {},
          "id": "string",
          "type": "string"
        },
        "target": {
          "name": "string",
          "links": {},
          "id": "string",
          "type": "string"
        }
      },
      "id": "string",
      "type": "string",
      "version": "string"
    },
    {
      "metadata": {
        "lastUser": {
          "name": "string",
          "links": {},
          "id": "string",
          "type": "string"
        },
        "domain": {
          "name": "string",
          "links": {},
          "id": "string",
          "type": "string"
        },
        "readOnly": {
          "reason": {},
          "state": true
        },
        "timestamp": 1
      },
      "data": {
        "startTag": 10,
        "endTag": 3,
        "type": "string"
      },
      "overridable": false,
      "name": "string",
      "description": "string",
      "links": {
        "parent": "string",
        "self": "string"
      },
      "overrides": {
        "parent": {
          "name": "string",
          "links": {},
          "id": "string",
          "type": "string"
        },
        "target": {
          "name": "string",
          "links": {},
          "id": "string",
          "type": "string"
        }
      },
      "id": "string",
      "type": "string",
      "version": "string"
    },
    {
      "metadata": {
        "lastUser": {
          "name": "string",
          "links": {},
          "id": "string",
          "type": "string"
        },
        "domain": {
          "name": "string",
          "links": {},
          "id": "string",
          "type": "string"
        },
        "readOnly": {
          "reason": {},
          "state": false
        },
        "timestamp": 5
      },
      "data": {
        "startTag": 9,
        "endTag": 1,
        "type": "string"
      },
      "overridable": false,
      "name": "string",
      "description": "string",
      "links": {
        "parent": "string",
        "self": "string"
      },
      "overrides": {
        "parent": {
          "name": "string",
          "links": {},
          "id": "string",
          "type": "string"
        },
        "target": {
          "name": "string",
          "links": {},
          "id": "string",
          "type": "string"
        }
      },
      "id": "string",
      "type": "string",
      "version": "string"
    },
    {
      "metadata": {
        "lastUser": {
          "name": "string",
          "links": {},
          "id": "string",
          "type": "string"
        },
        "domain": {
          "name": "string",
          "links": {},
          "id": "string",
          "type": "string"
        },
        "readOnly": {
          "reason": {},
          "state": true
        },
        "timestamp": 7
      },
      "data": {
        "startTag": 2,
        "endTag": 8,
        "type": "string"
      },
      "overridable": true,
      "name": "string",
      "description": "string",
      "links": {
        "parent": "string",
        "self": "string"
      },
      "overrides": {
        "parent": {
          "name": "string",
          "links": {},
          "id": "string",
          "type": "string"
        },
        "target": {
          "name": "string",
          "links": {},
          "id": "string",
          "type": "string"
        }
      },
      "id": "string",
      "type": "string",
      "version": "string"
    },
    {
      "metadata": {
        "lastUser": {
          "name": "string",
          "links": {},
          "id": "string",
          "type": "string"
        },
        "domain": {
          "name": "string",
          "links": {},
          "id": "string",
          "type": "string"
        },
        "readOnly": {
          "reason": {},
          "state": true
        },
        "timestamp": 7
      },
      "data": {
        "startTag": 6,
        "endTag": 7,
        "type": "string"
      },
      "overridable": true,
      "name": "string",
      "description": "string",
      "links": {
        "parent": "string",
        "self": "string"
      },
      "overrides": {
        "parent": {
          "name": "string",
          "links": {},
          "id": "string",
          "type": "string"
        },
        "target": {
          "name": "string",
          "links": {},
          "id": "string",
          "type": "string"
        }
      },
      "id": "string",
      "type": "string",
      "version": "string"
    },
    {
      "metadata": {
        "lastUser": {
          "name": "string",
          "links": {},
          "id": "string",
          "type": "string"
        },
        "domain": {
          "name": "string",
          "links": {},
          "id": "string",
          "type": "string"
        },
        "readOnly": {
          "reason": {},
          "state": false
        },
        "timestamp": 8
      },
      "data": {
        "startTag": 2,
        "endTag": 5,
        "type": "string"
      },
      "overridable": false,
      "name": "string",
      "description": "string",
      "links": {
        "parent": "string",
        "self": "string"
      },
      "overrides": {
        "parent": {
          "name": "string",
          "links": {},
          "id": "string",
          "type": "string"
        },
        "target": {
          "name": "string",
          "links": {},
          "id": "string",
          "type": "string"
        }
      },
      "id": "string",
      "type": "string",
      "version": "string"
    }
  ],
  "literals": [
    {
      "startTag": 8,
      "endTag": 10,
      "type": "string"
    },
    {
      "startTag": 6,
      "endTag": 3,
      "type": "string"
    },
    {
      "startTag": 5,
      "endTag": 3,
      "type": "string"
    },
    {
      "startTag": 4,
      "endTag": 9,
      "type": "string"
    },
    {
      "startTag": 6,
      "endTag": 3,
      "type": "string"
    },
    {
      "startTag": 7,
      "endTag": 7,
      "type": "string"
    },
    {
      "startTag": 10,
      "endTag": 7,
      "type": "string"
    },
    {
      "startTag": 5,
      "endTag": 8,
      "type": "string"
    },
    {
      "startTag": 3,
      "endTag": 8,
      "type": "string"
    },
    {
      "startTag": 1,
      "endTag": 5,
      "type": "string"
    }
  ],
  "overridable": false,
  "name": "string",
  "description": "string",
  "links": {
    "parent": "string",
    "self": "string"
  },
  "overrides": {
    "parent": {
      "name": "string",
      "links": {},
      "id": "string",
      "type": "string"
    },
    "target": {
      "name": "string",
      "links": {},
      "id": "string",
      "type": "string"
    }
  },
  "id": "string",
  "type": "string",
  "version": "string",
  "overrideTargetId": "string"
}