{
  "metadata": {
    "lastUser": {
      "name": "string",
      "links": {},
      "id": "string",
      "type": "string"
    },
    "domain": {
      "name": "string",
      "links": {},
      "id": "string",
      "type": "string"
    },
    "readOnly": {
      "reason": {},
      "state": true
    },
    "timestamp": 5
  },
  "minActivePhysicalInterface": 1,
  "description": "string",
  "type": "string",
  "enabled": true,
  "MTU": 5,
  "mode": "NONE",
  "arpConfig": [
    {
      "macAddress": "string",
      "enableAlias": true,
      "ipAddress": "string"
    },
    {
      "macAddress": "string",
      "enableAlias": false,
      "ipAddress": "string"
    },
    {
      "macAddress": "string",
      "enableAlias": false,
      "ipAddress": "string"
    },
    {
      "macAddress": "string",
      "enableAlias": true,
      "ipAddress": "string"
    }
  ],
  "selectedInterfaces": [
    {
      "metadata": {
        "lastUser": {
          "name": "string",
          "links": {},
          "id": "string",
          "type": "string"
        },
        "domain": {
          "name": "string",
          "links": {},
          "id": "string",
          "type": "string"
        },
        "readOnly": {
          "reason": {},
          "state": false
        },
        "timestamp": 8
      },
      "name": "string",
      "description": "string",
      "links": {
        "parent": "string",
        "self": "string"
      },
      "id": "string",
      "type": "string",
      "version": "string"
    }
  ],
  "etherChannelId": 6,
  "ipv4": {
    "static": {
      "address": "string",
      "netmask": "string"
    },
    "pppoe": {
      "pppoePassword": "string",
      "pppoeRouteMetric": 3,
      "ipAddress": "string",
      "vpdnGroupName": "string",
      "pppAuth": "CHAP",
      "enableRouteSettings": true,
      "storeCredsInFlash": false,
      "pppoeUser": "string"
    },
    "dhcp": {
      "dhcpRouteMetric": 10,
      "enableDefaultRouteDHCP": false
    }
  },
  "ifname": "string",
  "ipv6": {
    "linkLocalAddress": "string",
    "addresses": [
      {
        "address": "string",
        "enforceEUI64": true,
        "prefix": "string"
      },
      {
        "address": "string",
        "enforceEUI64": false,
        "prefix": "string"
      },
      {
        "address": "string",
        "enforceEUI64": true,
        "prefix": "string"
      },
      {
        "address": "string",
        "enforceEUI64": false,
        "prefix": "string"
      }
    ],
    "raInterval": 3,
    "enableAutoConfig": true,
    "nsInterval": 1,
    "prefixes": [
      {
        "default": true,
        "address": "string",
        "advertisement": {
          "autoConfig": true,
          "offlink": true,
          "preferLifeTime": {}
        }
      },
      {
        "default": false,
        "address": "string",
        "advertisement": {
          "autoConfig": true,
          "offlink": true,
          "preferLifeTime": {}
        }
      },
      {
        "default": true,
        "address": "string",
        "advertisement": {
          "autoConfig": false,
          "offlink": true,
          "preferLifeTime": {}
        }
      },
      {
        "default": true,
        "address": "string",
        "advertisement": {
          "autoConfig": true,
          "offlink": false,
          "preferLifeTime": {}
        }
      }
    ],
    "enforceEUI64": false,
    "enableRA": false,
    "dadAttempts": 8,
    "enableDHCPAddrConfig": true,
    "enableDHCPNonAddrConfig": false,
    "raLifeTime": 3,
    "enableIPV6": true,
    "reachableTime": 1
  },
  "links": {
    "parent": "string",
    "self": "string"
  },
  "id": "string",
  "lacpMode": "PASSIVE",
  "hardware": {
    "duplex": "FULL",
    "speed": "AUTO"
  },
  "macLearn": false,
  "managementOnly": false,
  "enableAntiSpoofing": true,
  "securityZone": {
    "interfaceMode": "SWITCHED",
    "interfaces": [
      {
        "metadata": {
          "lastUser": {
            "name": "string",
            "links": {},
            "id": "string",
            "type": "string"
          },
          "domain": {
            "name": "string",
            "links": {},
            "id": "string",
            "type": "string"
          },
          "readOnly": {
            "reason": {},
            "state": false
          },
          "timestamp": 2
        },
        "name": "string",
        "description": "string",
        "links": {
          "parent": "string",
          "self": "string"
        },
        "id": "string",
        "type": "string",
        "version": "string"
      }
    ],
    "metadata": {
      "lastUser": {
        "name": "string",
        "links": {},
        "id": "string",
        "type": "string"
      },
      "domain": {
        "name": "string",
        "links": {},
        "id": "string",
        "type": "string"
      },
      "readOnly": {
        "reason": {},
        "state": false
      },
      "timestamp": 3
    },
    "name": "string",
    "overridable": false,
    "description": "string",
    "links": {
      "parent": "string",
      "self": "string"
    },
    "overrides": {
      "parent": {
        "name": "string",
        "links": {},
        "id": "string",
        "type": "string"
      },
      "target": {
        "name": "string",
        "links": {},
        "id": "string",
        "type": "string"
      }
    },
    "id": "string",
    "type": "string",
    "version": "string"
  },
  "activeMACAddress": "string",
  "fragmentReassembly": false,
  "macTable": [
    "string",
    "string",
    "string",
    "string",
    "string",
    "string"
  ],
  "standbyMACAddress": "string",
  "maxActivePhysicalInterface": 5,
  "enableDNSLookup": true,
  "overrideDefaultFragmentSetting": {
    "chain": 3,
    "size": 1,
    "timeout": 8
  },
  "loadBalancing": "DST_IP",
  "version": "string",
  "erspanFlowId": 1,
  "erspanSourceIP": "string",
  "name": "string"
}