{
  "$id": "schema.json",
  "type": "object",
  "schema": "http://json-schema.org/draft-07/schema#",
  "translate": false,
  "dynamicfields": true,
  "properties": {
    "ph_request_type": {
      "type": "string",
      "description": "type of request (internal to adapter)",
      "default": "createDeviceCopyConfigRequest",
      "enum": [
        "createDeviceCopyConfigRequest",
        "getAllDevice",
        "createDevice",
        "getAllFTDBridgeGroupInterface",
        "createFTDBridgeGroupInterface",
        "getFTDBridgeGroupInterface",
        "updateFTDBridgeGroupInterface",
        "deleteFTDBridgeGroupInterface",
        "getAllFTDEtherChannelInterface",
        "createFTDEtherChannelInterface",
        "getFTDEtherChannelInterface",
        "updateFTDEtherChannelInterface",
        "deleteFTDEtherChannelInterface",
        "getFPInterfaceStatistics",
        "getAllFPLogicalInterface",
        "createFPLogicalInterface",
        "getFPLogicalInterface",
        "updateFPLogicalInterface",
        "deleteFPLogicalInterface",
        "getAllFPPhysicalInterface",
        "getFPPhysicalInterface",
        "updateFPPhysicalInterface",
        "getAllInlineSet",
        "createInlineSet",
        "getInlineSet",
        "updateInlineSet",
        "deleteInlineSet",
        "getInterfaceEvent",
        "createInterfaceEvent",
        "getAllFTDPhysicalInterface",
        "getFTDPhysicalInterface",
        "updateFTDPhysicalInterface",
        "getAllFTDRedundantInterface",
        "createFTDRedundantInterface",
        "getFTDRedundantInterface",
        "updateFTDRedundantInterface",
        "deleteFTDRedundantInterface",
        "getAllIPv4StaticRouteModel",
        "createIPv4StaticRouteModel",
        "getIPv4StaticRouteModel",
        "updateIPv4StaticRouteModel",
        "deleteIPv4StaticRouteModel",
        "getAllIPv6StaticRouteModel",
        "createIPv6StaticRouteModel",
        "getIPv6StaticRouteModel",
        "updateIPv6StaticRouteModel",
        "deleteIPv6StaticRouteModel",
        "getAllStaticRouteModel",
        "getStaticRouteModel",
        "getAllFTDSubInterface",
        "createFTDSubInterface",
        "getFTDSubInterface",
        "updateFTDSubInterface",
        "deleteFTDSubInterface",
        "getAllVirtualSwitch",
        "createVirtualSwitch",
        "getVirtualSwitch",
        "updateVirtualSwitch",
        "deleteVirtualSwitch",
        "getDevice",
        "updateDevice",
        "deleteDevice"
      ],
      "external_name": "ph_request_type"
    }
  },
  "definitions": {}
}