{
  "actions": [
    {
      "name": "getAllAuditModel",
      "protocol": "REST",
      "method": "GET",
      "entitypath": "{base_path}/{version}/api/fmc_platform/v1/domain/{pathv1}/audit/auditrecords?{query}",
      "requestSchema": "schema.json",
      "responseSchema": "schema.json",
      "timeout": 0,
      "sendEmpty": false,
      "sendGetBody": false,
      "requestDatatype": "JSON",
      "responseDatatype": "JSON",
      "headers": {},
      "responseObjects": [
        {
          "type": "default",
          "key": "",
          "mockFile": "mockdatafiles/getAllAuditModel-default.json"
        }
      ]
    },
    {
      "name": "getAuditModel",
      "protocol": "REST",
      "method": "GET",
      "entitypath": "{base_path}/{version}/api/fmc_platform/v1/domain/{pathv1}/audit/auditrecords/{pathv2}?{query}",
      "requestSchema": "schema.json",
      "responseSchema": "schema.json",
      "timeout": 0,
      "sendEmpty": false,
      "sendGetBody": false,
      "requestDatatype": "JSON",
      "responseDatatype": "JSON",
      "headers": {},
      "responseObjects": [
        {
          "type": "default",
          "key": "",
          "mockFile": "mockdatafiles/getAuditModel-default.json"
        }
      ]
    }
  ]
}