{
  "primary": {
    "id": "primary_uuid"
  },
  "secondary": {
    "id": "secondary_uuid"
  },
  "name": "<ha-name>",
  "type": "DeviceHAPair",
  "ftdHAFailoverTriggerCriteria": {
    "peerPollTime": 3,
    "noOfFailedInterfaceLimit": 1,
    "peerPollTimeUnit": "SEC",
    "peerHoldTimeUnit": "SEC",
    "peerHoldTime": 34,
    "interfacePollTime": 5,
    "interfacePollTimeUnit": "SEC",
    "interfaceHoldTime": 25
  },
  "ftdHABootstrap": {
    "isEncryptionEnabled": false,
    "encKeyGenerationScheme": "CUSTOM",
    "sharedKey": "cisco123",
    "useSameLinkForFailovers": true,
    "lanFailover": {
      "useIPv6Address": false,
      "subnetMask": "255.255.255.0",
      "interfaceObject": {
        "id": "<uuid>",
        "type": "PhysicalInterface",
        "name": "GigabitEthernet0/0"
      },
      "standbyIP": "1.1.1.2",
      "logicalName": "LAN-INTERFACE",
      "activeIP": "1.1.1.1"
    },
    "statefulFailover": {
      "useIPv6Address": true,
      "subnetMask": "255.255.255.0",
      "interfaceObject": {
        "id": "<uuid>",
        "type": "PhysicalInterface",
        "name": "GigabitEthernet0/0"
      },
      "standbyIP": "1.1.1.2",
      "logicalName": "STATEFUL-INTERFACE",
      "activeIP": "1.1.1.1"
    }
  }
}