{
  "links": {
    "self": "/fmc_config/v1/domain/domainUUID/object/realmusergroups?offset=0&limit=2&realmId=RealmUUID"
  },
  "items": [
    {
      "type": "RealmUserGroup",
      "id": "RealmUUID_RealmUserGroupUUID",
      "name": "Low",
      "links": {
        "self": "/fmc_config/v1/domain/domainUUID/object/realmusergroups/RealmUUID_RealmUserGroupUUID"
      }
    },
    {
      "type": "RealmUserGroup",
      "id": "RealmUUID_RealmUserGroupUUID",
      "name": "Medium",
      "links": {
        "self": "/fmc_config/v1/domain/e276abec-e0f2-11e3-8169-6d9ed49b625f/object/realmusergroups/RealmUUID_RealmUserGroupUUID"
      }
    }
  ],
  "paging": {
    "offset": 0,
    "limit": 2,
    "count": 5,
    "next": [
      "/fmc_config/v1/domain/domainUUID/object/realmusergroups?offset=2&limit=2",
      "/fmc_config/v1/domain/domainUUID/object/realmusergroups?offset=4&limit=1"
    ],
    "pages": 3
  }
}