{
  "links": {
    "self": "<fmc_url>/api/fmc_config/v1/domain/DomainUUID/devices/devicerecords/DeviceUUID/routing/ipv6staticroutes/ipv6StaticRouteUuid",
    "parent": "<fmc_url>/api/fmc_config/v1/domain/DomainUUID/devices/devicerecords/DeviceUUID/routing/staticroutes"
  },
  "interfaceName": "InterfaceLogicalName",
  "selectedNetworks": [
    {
      "type": "Host",
      "id": "networkHostUuid",
      "name": "Host1"
    }
  ],
  "gateway": {
    "object": {
      "type": "Host",
      "id": "networkHostUuid",
      "name": "Host2"
    }
  },
  "metricValue": 22,
  "type": "IPv6StaticRoute",
  "isTunneled": false,
  "id": "ipv6StaticRouteUuid"
}