{
  "type": "EtherChannelInterface",
  "mode": "NONE",
  "lacpMode": "ACTIVE",
  "maxActivePhysicalInterface": 8,
  "minActivePhysicalInterface": 1,
  "selectedInterfaces": [
    {
      "type": "PhysicalInterface",
      "name": "GigabitEthernet0/0",
      "id": "interface UUID"
    }
  ],
  "hardware": {
    "duplex": "AUTO",
    "speed": "AUTO"
  },
  "loadBalancing": "SRC_IP_PORT",
  "etherChannelId": 1,
  "enabled": true,
  "MTU": 1500,
  "managementOnly": false,
  "securityZone": {
    "id": "securityZoneUUID",
    "type": "SecurityZone"
  },
  "ifname": "NewEthChannel",
  "enableAntiSpoofing": false,
  "overrideDefaultFragmentSetting": {},
  "ipv4": {
    "static": {
      "address": "1.2.3.5",
      "netmask": "25"
    }
  },
  "ipv6": {
    "addresses": [
      {
        "address": "9090::",
        "prefix": "12"
      }
    ],
    "dadAttempts": 1,
    "nsInterval": 10000,
    "reachableTime": 0
  },
  "name": "Port-channel1",
  "id": "etherChannelIntfUUID1"
}