{
  "$id": "schema.json",
  "type": "object",
  "schema": "http://json-schema.org/draft-07/schema#",
  "translate": true,
  "dynamicfields": true,
  "properties": {
    "ph_request_type": {
      "type": "string",
      "description": "type of request (internal to adapter)",
      "default": "getRepositoriesUsernameRepoSlugRefs",
      "enum": [
        "getRepositoriesUsernameRepoSlugRefs",
        "getRepositoriesUsernameRepoSlugRefsBranches",
        "getRepositoriesUsernameRepoSlugRefsBranchesName",
        "getRepositoriesUsernameRepoSlugRefsTags",
        "postRepositoriesUsernameRepoSlugRefsTags",
        "getRepositoriesUsernameRepoSlugRefsTagsName"
      ],
      "external_name": "ph_request_type"
    },
    "repoSlug": {
      "description": "",
      "parse": false,
      "encode": false,
      "encrypt": {
        "type": "AES",
        "key": ""
      },
      "external_name": "repo_slug"
    },
    "body": {
      "description": "",
      "parse": false,
      "encode": false,
      "encrypt": {
        "type": "AES",
        "key": ""
      },
      "external_name": "_body"
    }
  },
  "definitions": {}
}