{
  "password_minimum_length": "1-128",
  "password_complexity": "COMPLEX",
  "password_disallowed_characters": "string",
  "password_disallowed_words": "string",
  "password_prohibit_user_id": true,
  "password_prohibit_repeated_chars": true,
  "password_expiry_days": "0-500",
  "password_remember_history": "1-99",
  "reminder_days": "1-365",
  "reminder_message": "string",
  "disable_after_days": "1-1000",
  "disable_after_date": "yyyy-mm-dd",
  "disable_after_unchanged_days": "1-365",
  "disable_after_failed_attempts": "1-100",
  "reset_failed_attempts_count": false
}