{
  "name": "adapter-aruba_clearpass",
  "webName": "Adapter for Integration to Aruba Clearpass",
  "supportLevel": "community",
  "vendor": "Aruba Networks",
  "product": "Clearpass",
  "techAlliance": false,
  "osVersion": [],
  "apiVersions": [],
  "iapVersions": [
    "2021.1.x",
    "2021.2.x",
    "2022.1.x",
    "2023.1.x"
  ],
  "method": "REST",
  "type": "Adapter",
  "domains": [
    "Security (SASE)"
  ],
  "tags": [
    "Security Policy Management",
    "Configuration & Compliance",
    "Network Infrastructure Changes",
    "Software Upgrades & Device Maintenance"
  ],
  "useCases": [
    "Security Group updates",
    "Security Rule Removal",
    "Security Rule Creation",
    "Run network compliance checks and remediation",
    "Determine configuration drift",
    "Device Onboarding",
    "Software Upgrade",
    "Firewall Configuration backup or restore"
  ],
  "deprecated": {
    "isDeprecated": false
  },
  "brokerSince": "",
  "authMethods": [
    {
      "type": "OAuth",
      "subtypes": [],
      "primary": true
    }
  ],
  "documentation": {
    "storeLink": "",
    "npmLink": "https://www.npmjs.com/package/@itentialopensource/adapter-aruba_clearpass",
    "repoLink": "https://gitlab.com/itentialopensource/adapters/adapter-aruba_clearpass",
    "docLink": "https://gitlab.com/itentialopensource/adapters/adapter-aruba_clearpass/-/blob/master/README.md?ref_type=heads",
    "demoLinks": [],
    "trainingLinks": [
      {
        "title": "Itential Academy",
        "link": "https://www.itential.com/itential-academy/"
      }
    ],
    "faqLink": "https://docs.itential.com/opensource/docs/troubleshooting-an-adapter",
    "contributeLink": "https://gitlab.com/itentialopensource/adapters/contributing-guide",
    "issueLink": "https://itential.atlassian.net/servicedesk/customer/portals",
    "webLink": "https://www.itential.com/adapters/aruba-clearpass/",
    "vendorLink": "https://www.arubanetworks.com/",
    "productLink": "https://www.arubanetworks.com/products/security/network-access-control/secure-access/",
    "apiLinks": [
      {
        "title": "Aruba Clearpass REST API Reference",
        "link": "https://developer.arubanetworks.com/aruba-cppm/docs/clearpass-configuration",
        "public": true
      }
    ],
    "workshopLinks": [],
    "workshopHomePage": "https://www.itential.com/get-started/"
  },
  "assets": [],
  "relatedItems": {
    "adapters": [],
    "integrations": [],
    "ecosystemApplications": [],
    "workflowProjects": [],
    "transformationProjects": [],
    "exampleProjects": []
  }
}