{
  "ConnectionId": "string",
  "ConnectionType": "INTERNET",
  "ContentHandlingStrategy": "CONVERT_TO_BINARY",
  "CredentialsArn": "string",
  "Description": "string",
  "IntegrationId": "string",
  "IntegrationMethod": "string",
  "IntegrationResponseSelectionExpression": "string",
  "IntegrationType": "AWS",
  "IntegrationUri": "string",
  "PassthroughBehavior": "NEVER",
  "RequestParameters": {},
  "RequestTemplates": {},
  "TemplateSelectionExpression": "string",
  "TimeoutInMillis": 5
}