Jahr,Art,Statistik,Zahl,Kinder_ges
2008,Fußgänger,Getötete,23,11139106
2008,Fußgänger,Insgesamt,7927,11139106
2008,Insgesamt,Getötete,102,11139106
2008,Insgesamt,Insgesamt,31648,11139106
2009,Fußgänger,Getötete,23,11022634
2009,Fußgänger,Insgesamt,7706,11022634
2009,Insgesamt,Getötete,90,11022634
2009,Insgesamt,Insgesamt,30845,11022634
2010,Fußgänger,Getötete,28,10941201
2010,Fußgänger,Insgesamt,7304,10941201