Jahr,Einpendler,Auspendler
1994,42843,14391
1995,43427,14975
1996,45159,15400
1997,44420,15885
1998,44948,16001
1999,45114,17146
2000,46964,18401
2001,47716,19115
2002,47829,18487
2003,47415,17850
2004,47816,17927
2005,48417,17766
2006,49211,18399
2007,50151,19085
2008,51834,20227
2009,51647,21086
2010,51359,21322
2011,52095,21989
2012,53166,22737
2013,53519,23513
2014,57265,23829
2015,58525,24421
2016,59136,26267
2017,59605,26762
2018,60972,27444
2019,61487,27950
2020,61432,27913
2021,63143,29858
2022,64745,30513