{
 "allow_rename": 1,
 "autoname": "field:role_name",
 "creation": "2013-01-08 15:50:01",
 "doctype": "DocType",
 "document_type": "Document",
 "engine": "InnoDB",
 "field_order": [
  "role_name",
  "disabled",
  "desk_access",
  "two_factor_auth",
  "restrict_to_domain"
 ],
 "fields": [
  {
   "fieldname": "role_name",
   "fieldtype": "Data",
   "label": "Role Name",
   "oldfieldname": "role_name",
   "oldfieldtype": "Data",
   "reqd": 1,
   "unique": 1
  },
  {
   "default": "0",
   "description": "If disabled, this role will be removed from all users.",
   "fieldname": "disabled",
   "fieldtype": "Check",
   "label": "Disabled"
  },
  {
   "default": "1",
   "fieldname": "desk_access",
   "fieldtype": "Check",
   "in_list_view": 1,
   "label": "Desk Access"
  },
  {
   "default": "0",
   "fieldname": "two_factor_auth",
   "fieldtype": "Check",
   "label": "Two Factor Authentication"
  },
  {
   "fieldname": "restrict_to_domain",
   "fieldtype": "Link",
   "label": "Restrict To Domain",
   "options": "Domain"
  }
 ],
 "icon": "fa fa-bookmark",
 "idx": 1,
 "modified": "2020-06-11 14:49:59.612162",
 "modified_by": "Administrator",
 "module": "Core",
 "name": "Role",
 "owner": "Administrator",
 "permissions": [
  {
   "create": 1,
   "delete": 1,
   "email": 1,
   "print": 1,
   "read": 1,
   "report": 1,
   "role": "System Manager",
   "share": 1,
   "write": 1
  },
  {
   "email": 1,
   "export": 1,
   "print": 1,
   "read": 1,
   "report": 1,
   "role": "Maintenance Manager",
   "share": 1
  },
  {
   "email": 1,
   "export": 1,
   "print": 1,
   "read": 1,
   "report": 1,
   "role": "Fleet Manager",
   "share": 1
  }
 ],
 "quick_entry": 1,
 "sort_field": "modified",
 "sort_order": "ASC",
 "track_changes": 1
}