{
 "align_labels_right": 0,
 "creation": "2021-08-10 10:59:04.294654",
 "custom_format": 0,
 "disabled": 1,
 "doc_type": "Salary Slip",
 "docstatus": 0,
 "doctype": "Print Format",
 "font": "Default",
 "format_data": "[{\"fieldname\": \"print_heading_template\", \"fieldtype\": \"HTML\", \"options\": \"  <h3 style=\\\"text-align: right;\\\">{{doc.name}}</h3><div><hr></div>  \"}, {\"fieldtype\": \"Section Break\"}, {\"fieldtype\": \"Column Break\"}, {\"print_hide\": 0, \"fieldname\": \"employee\"}, {\"print_hide\": 0, \"fieldname\": \"employee_name\"}, {\"print_hide\": 0, \"fieldname\": \"department\"}, {\"print_hide\": 0, \"fieldname\": \"designation\"}, {\"print_hide\": 0, \"fieldname\": \"branch\"}, {\"fieldtype\": \"Column Break\"}, {\"print_hide\": 0, \"fieldname\": \"start_date\"}, {\"print_hide\": 0, \"fieldname\": \"end_date\"}, {\"print_hide\": 0, \"fieldname\": \"total_working_hours\"}, {\"print_hide\": 0, \"fieldname\": \"hour_rate\"}, {\"fieldtype\": \"Section Break\"}, {\"fieldtype\": \"Column Break\"}, {\"visible_columns\": [{\"print_hide\": 0, \"fieldname\": \"time_sheet\", \"print_width\": \"\"}, {\"print_hide\": 0, \"fieldname\": \"working_hours\", \"print_width\": \"\"}], \"print_hide\": 0, \"fieldname\": \"timesheets\"}, {\"fieldtype\": \"Column Break\"}, {\"fieldtype\": \"Section Break\"}, {\"fieldtype\": \"Column Break\"}, {\"visible_columns\": [{\"print_hide\": 0, \"fieldname\": \"salary_component\", \"print_width\": \"\"}, {\"print_hide\": 0, \"fieldname\": \"amount\", \"print_width\": \"\"}, {\"print_hide\": 0, \"fieldname\": \"depends_on_payment_days\", \"print_width\": \"\"}], \"print_hide\": 0, \"fieldname\": \"earnings\"}, {\"fieldtype\": \"Column Break\"}, {\"visible_columns\": [{\"print_hide\": 0, \"fieldname\": \"salary_component\", \"print_width\": \"\"}, {\"print_hide\": 0, \"fieldname\": \"amount\", \"print_width\": \"\"}, {\"print_hide\": 0, \"fieldname\": \"depends_on_payment_days\", \"print_width\": \"\"}], \"print_hide\": 0, \"fieldname\": \"deductions\"}, {\"fieldtype\": \"Section Break\"}, {\"fieldtype\": \"Column Break\"}, {\"fieldtype\": \"Column Break\"}, {\"print_hide\": 0, \"fieldname\": \"gross_pay\"}, {\"print_hide\": 0, \"fieldname\": \"total_deduction\"}, {\"print_hide\": 0, \"fieldname\": \"net_pay\"}, {\"print_hide\": 0, \"fieldname\": \"rounded_total\"}, {\"print_hide\": 0, \"fieldname\": \"total_in_words\"}]",
 "idx": 0,
 "line_breaks": 0,
 "modified": "2022-11-07 09:53:05.173062",
 "modified_by": "sysman11.gaisano@gmail.com",
 "module": "HR",
 "name": "Salary Slip based on Timesheet",
 "owner": "Administrator",
 "print_format_builder": 1,
 "print_format_type": "Server",
 "raw_printing": 0,
 "show_section_headings": 0,
 "standard": "Yes"
}