{
 "add_total_row": 1,
 "creation": "2013-04-16 11:31:13",
 "disable_prepared_report": 0,
 "disabled": 0,
 "docstatus": 0,
 "doctype": "Report",
 "idx": 3,
 "is_standard": "Yes",
 "modified": "2022-03-16 10:18:49.601691",
 "modified_by": "Administrator",
 "module": "Accounts",
 "name": "Accounts Receivable",
 "owner": "Administrator",
 "prepared_report": 0,
 "ref_doctype": "Sales Invoice",
 "report_name": "Accounts Receivable",
 "report_type": "Script Report",
 "roles": [
  {
   "role": "Accounts Manager"
  },
  {
   "role": "Accounts User"
  },
  {
   "role": "Accounts User (Billing)"
  }
 ]
}