{
 "autoname": "Prompt",
 "creation": "2019-05-20 15:14:21.604447",
 "doctype": "DocType",
 "engine": "InnoDB",
 "field_order": [
  "description"
 ],
 "fields": [
  {
   "fieldname": "description",
   "fieldtype": "Small Text",
   "label": "Description"
  }
 ],
 "modified": "2021-12-23 16:27:54.195995",
 "modified_by": "sysman11.gaisano@gmail.com",
 "module": "Support",
 "name": "Issue Priority",
 "owner": "Administrator",
 "permissions": [
  {
   "create": 1,
   "delete": 1,
   "email": 1,
   "export": 1,
   "print": 1,
   "read": 1,
   "report": 1,
   "role": "System Manager",
   "share": 1,
   "write": 1
  }
 ],
 "quick_entry": 1,
 "sort_field": "modified",
 "sort_order": "ASC",
 "track_changes": 1
}