{
 "add_total_row": 0, 
 "apply_user_permissions": 1, 
 "creation": "2017-06-08 17:35:59.598048", 
 "disabled": 0, 
 "docstatus": 0, 
 "doctype": "Report", 
 "idx": 0, 
 "is_standard": "Yes", 
 "modified": "2017-06-08 17:36:18.922707", 
 "modified_by": "Administrator", 
 "module": "Gaisano", 
 "name": "Item Market Share Percentage Per Subclass", 
 "owner": "Administrator", 
 "ref_doctype": "Item", 
 "report_name": "Item Market Share Percentage Per Subclass", 
 "report_type": "Script Report"
}