{
 "add_total_row": 0, 
 "apply_user_permissions": 1, 
 "creation": "2020-02-08 11:25:04.554751", 
 "disabled": 0, 
 "docstatus": 0, 
 "doctype": "Report", 
 "idx": 0, 
 "is_standard": "Yes", 
 "modified": "2020-02-08 11:25:04.554751", 
 "modified_by": "Administrator", 
 "module": "Gaisano", 
 "name": "Run ERP Record", 
 "owner": "Administrator", 
 "ref_doctype": "Upload POS", 
 "report_name": "Run ERP Record", 
 "report_type": "Script Report"
}