{
 "add_total_row": 0, 
 "apply_user_permissions": 1, 
 "creation": "2020-01-22 12:14:30.142544", 
 "disabled": 0, 
 "docstatus": 0, 
 "doctype": "Report", 
 "idx": 0, 
 "is_standard": "Yes", 
 "modified": "2020-01-22 12:15:32.247131", 
 "modified_by": "Administrator", 
 "module": "Gaisano", 
 "name": "Daily Service Level", 
 "owner": "Administrator", 
 "ref_doctype": "Purchase Receipt", 
 "report_name": "Daily Service Level", 
 "report_type": "Script Report"
}