{
 "add_total_row": 0, 
 "apply_user_permissions": 1, 
 "creation": "2016-09-07 16:10:15.534665", 
 "disabled": 0, 
 "docstatus": 0, 
 "doctype": "Report", 
 "idx": 0, 
 "is_standard": "Yes", 
 "modified": "2016-09-07 16:10:15.534665", 
 "modified_by": "Administrator", 
 "module": "Gaisano", 
 "name": "Zero Sales Report", 
 "owner": "Administrator", 
 "ref_doctype": "Sales Order", 
 "report_name": "Zero Sales Report", 
 "report_type": "Script Report"
}