{
 "add_total_row": 0, 
 "apply_user_permissions": 1, 
 "creation": "2020-03-06 14:59:21.208691", 
 "disabled": 0, 
 "docstatus": 0, 
 "doctype": "Report", 
 "idx": 0, 
 "is_standard": "Yes", 
 "modified": "2020-03-06 14:59:24.358552", 
 "modified_by": "Administrator", 
 "module": "Gaisano", 
 "name": "Withdrawals to Stock Card", 
 "owner": "Administrator", 
 "ref_doctype": "Stock Entry", 
 "report_name": "Withdrawals to Stock Card", 
 "report_type": "Script Report"
}