%YAML 1.1
%TAG !u! tag:unity3d.com,2011:
--- !u!1045 &1
EditorBuildSettings:
  m_ObjectHideFlags: 0
  serializedVersion: 2
  m_Scenes:
  - enabled: 1
    path: Assets/Scenes/TeleportScene.unity
    guid: 9fc0d4010bbf28b4594072e72b8655ab
  m_configObjects:
    Unity.XR.Oculus.Settings: {fileID: 11400000, guid: e994e29a77fddc14880c1241e5d48fdd, type: 2}
    com.unity.xr.management.loader_settings: {fileID: 11400000, guid: 70f7a1cd260af394ba9b8a97d747ffd2, type: 2}
    com.unity.xr.openxr.settings4: {fileID: 11400000, guid: ebf272b526909fd4690fe70b6b7d0dca, type: 2}
    xr.sdk.mock-hmd.settings: {fileID: 11400000, guid: 7e90ca803e5fe7342b8cad5df0294c95, type: 2}
