%!PS-Adobe-3.0 EPSF-3.0
%%Creator: (MATLAB, The Mathworks, Inc. Version 9.3.0.713579 \(R2017b\). Operating System: Linux)
%%Title: ./0successProbabilityRRTK.eps
%%CreationDate: 2021-01-08T17:26:19
%%Pages: (atend)
%%BoundingBox:    33    21   382   296
%%LanguageLevel: 3
%%EndComments
%%BeginProlog
%%BeginResource: procset (Apache XML Graphics Std ProcSet) 1.2 0
%%Version: 1.2 0
%%Copyright: (Copyright 2001-2003,2010 The Apache Software Foundation. License terms: http://www.apache.org/licenses/LICENSE-2.0)
/bd{bind def}bind def
/ld{load def}bd
/GR/grestore ld
/GS/gsave ld
/RM/rmoveto ld
/C/curveto ld
/t/show ld
/L/lineto ld
/ML/setmiterlimit ld
/CT/concat ld
/f/fill ld
/N/newpath ld
/S/stroke ld
/CC/setcmykcolor ld
/A/ashow ld
/cp/closepath ld
/RC/setrgbcolor ld
/LJ/setlinejoin ld
/GC/setgray ld
/LW/setlinewidth ld
/M/moveto ld
/re {4 2 roll M
1 index 0 rlineto
0 exch rlineto
neg 0 rlineto
cp } bd
/_ctm matrix def
/_tm matrix def
/BT { _ctm currentmatrix pop matrix _tm copy pop 0 0 moveto } bd
/ET { _ctm setmatrix } bd
/iTm { _ctm setmatrix _tm concat } bd
/Tm { _tm astore pop iTm 0 0 moveto } bd
/ux 0.0 def
/uy 0.0 def
/F {
  /Tp exch def
  /Tf exch def
  Tf findfont Tp scalefont setfont
  /cf Tf def  /cs Tp def
} bd
/ULS {currentpoint /uy exch def /ux exch def} bd
/ULE {
  /Tcx currentpoint pop def
  gsave
  newpath
  cf findfont cs scalefont dup
  /FontMatrix get 0 get /Ts exch def /FontInfo get dup
  /UnderlinePosition get Ts mul /To exch def
  /UnderlineThickness get Ts mul /Tt exch def
  ux uy To add moveto  Tcx uy To add lineto
  Tt setlinewidth stroke
  grestore
} bd
/OLE {
  /Tcx currentpoint pop def
  gsave
  newpath
  cf findfont cs scalefont dup
  /FontMatrix get 0 get /Ts exch def /FontInfo get dup
  /UnderlinePosition get Ts mul /To exch def
  /UnderlineThickness get Ts mul /Tt exch def
  ux uy To add cs add moveto Tcx uy To add cs add lineto
  Tt setlinewidth stroke
  grestore
} bd
/SOE {
  /Tcx currentpoint pop def
  gsave
  newpath
  cf findfont cs scalefont dup
  /FontMatrix get 0 get /Ts exch def /FontInfo get dup
  /UnderlinePosition get Ts mul /To exch def
  /UnderlineThickness get Ts mul /Tt exch def
  ux uy To add cs 10 mul 26 idiv add moveto Tcx uy To add cs 10 mul 26 idiv add lineto
  Tt setlinewidth stroke
  grestore
} bd
/QT {
/Y22 exch store
/X22 exch store
/Y21 exch store
/X21 exch store
currentpoint
/Y21 load 2 mul add 3 div exch
/X21 load 2 mul add 3 div exch
/X21 load 2 mul /X22 load add 3 div
/Y21 load 2 mul /Y22 load add 3 div
/X22 load /Y22 load curveto
} bd
/SSPD {
dup length /d exch dict def
{
/v exch def
/k exch def
currentpagedevice k known {
/cpdv currentpagedevice k get def
v cpdv ne {
/upd false def
/nullv v type /nulltype eq def
/nullcpdv cpdv type /nulltype eq def
nullv nullcpdv or
{
/upd true def
} {
/sametype v type cpdv type eq def
sametype {
v type /arraytype eq {
/vlen v length def
/cpdvlen cpdv length def
vlen cpdvlen eq {
0 1 vlen 1 sub {
/i exch def
/obj v i get def
/cpdobj cpdv i get def
obj cpdobj ne {
/upd true def
exit
} if
} for
} {
/upd true def
} ifelse
} {
v type /dicttype eq {
v {
/dv exch def
/dk exch def
/cpddv cpdv dk get def
dv cpddv ne {
/upd true def
exit
} if
} forall
} {
/upd true def
} ifelse
} ifelse
} if
} ifelse
upd true eq {
d k v put
} if
} if
} if
} forall
d length 0 gt {
d setpagedevice
} if
} bd
/RE { % /NewFontName [NewEncodingArray] /FontName RE -
  findfont dup length dict begin
  {
    1 index /FID ne
    {def} {pop pop} ifelse
  } forall
  /Encoding exch def
  /FontName 1 index def
  currentdict definefont pop
  end
} bind def
%%EndResource
%%BeginResource: procset (Apache XML Graphics EPS ProcSet) 1.0 0
%%Version: 1.0 0
%%Copyright: (Copyright 2002-2003 The Apache Software Foundation. License terms: http://www.apache.org/licenses/LICENSE-2.0)
/BeginEPSF { %def
/b4_Inc_state save def         % Save state for cleanup
/dict_count countdictstack def % Count objects on dict stack
/op_count count 1 sub def      % Count objects on operand stack
userdict begin                 % Push userdict on dict stack
/showpage { } def              % Redefine showpage, { } = null proc
0 setgray 0 setlinecap         % Prepare graphics state
1 setlinewidth 0 setlinejoin
10 setmiterlimit [ ] 0 setdash newpath
/languagelevel where           % If level not equal to 1 then
{pop languagelevel             % set strokeadjust and
1 ne                           % overprint to their defaults.
{false setstrokeadjust false setoverprint
} if
} if
} bd
/EndEPSF { %def
count op_count sub {pop} repeat            % Clean up stacks
countdictstack dict_count sub {end} repeat
b4_Inc_state restore
} bd
%%EndResource
%FOPBeginFontDict
%%IncludeResource: font Courier-Oblique
%%IncludeResource: font Courier-BoldOblique
%%IncludeResource: font Courier-Bold
%%IncludeResource: font ZapfDingbats
%%IncludeResource: font Symbol
%%IncludeResource: font Helvetica
%%IncludeResource: font Helvetica-Oblique
%%IncludeResource: font Helvetica-Bold
%%IncludeResource: font Helvetica-BoldOblique
%%IncludeResource: font Times-Roman
%%IncludeResource: font Times-Italic
%%IncludeResource: font Times-Bold
%%IncludeResource: font Times-BoldItalic
%%IncludeResource: font Courier
%FOPEndFontDict
%%BeginResource: encoding WinAnsiEncoding
/WinAnsiEncoding [
/.notdef /.notdef /.notdef /.notdef /.notdef
/.notdef /.notdef /.notdef /.notdef /.notdef
/.notdef /.notdef /.notdef /.notdef /.notdef
/.notdef /.notdef /.notdef /.notdef /.notdef
/.notdef /.notdef /.notdef /.notdef /.notdef
/.notdef /.notdef /.notdef /.notdef /.notdef
/.notdef /.notdef /space /exclam /quotedbl
/numbersign /dollar /percent /ampersand /quotesingle
/parenleft /parenright /asterisk /plus /comma
/hyphen /period /slash /zero /one
/two /three /four /five /six
/seven /eight /nine /colon /semicolon
/less /equal /greater /question /at
/A /B /C /D /E
/F /G /H /I /J
/K /L /M /N /O
/P /Q /R /S /T
/U /V /W /X /Y
/Z /bracketleft /backslash /bracketright /asciicircum
/underscore /quoteleft /a /b /c
/d /e /f /g /h
/i /j /k /l /m
/n /o /p /q /r
/s /t /u /v /w
/x /y /z /braceleft /bar
/braceright /asciitilde /bullet /Euro /bullet
/quotesinglbase /florin /quotedblbase /ellipsis /dagger
/daggerdbl /circumflex /perthousand /Scaron /guilsinglleft
/OE /bullet /Zcaron /bullet /bullet
/quoteleft /quoteright /quotedblleft /quotedblright /bullet
/endash /emdash /asciitilde /trademark /scaron
/guilsinglright /oe /bullet /zcaron /Ydieresis
/space /exclamdown /cent /sterling /currency
/yen /brokenbar /section /dieresis /copyright
/ordfeminine /guillemotleft /logicalnot /sfthyphen /registered
/macron /degree /plusminus /twosuperior /threesuperior
/acute /mu /paragraph /middot /cedilla
/onesuperior /ordmasculine /guillemotright /onequarter /onehalf
/threequarters /questiondown /Agrave /Aacute /Acircumflex
/Atilde /Adieresis /Aring /AE /Ccedilla
/Egrave /Eacute /Ecircumflex /Edieresis /Igrave
/Iacute /Icircumflex /Idieresis /Eth /Ntilde
/Ograve /Oacute /Ocircumflex /Otilde /Odieresis
/multiply /Oslash /Ugrave /Uacute /Ucircumflex
/Udieresis /Yacute /Thorn /germandbls /agrave
/aacute /acircumflex /atilde /adieresis /aring
/ae /ccedilla /egrave /eacute /ecircumflex
/edieresis /igrave /iacute /icircumflex /idieresis
/eth /ntilde /ograve /oacute /ocircumflex
/otilde /odieresis /divide /oslash /ugrave
/uacute /ucircumflex /udieresis /yacute /thorn
/ydieresis
] def
%%EndResource
%FOPBeginFontReencode
/Courier-Oblique findfont
dup length dict begin
  {1 index /FID ne {def} {pop pop} ifelse} forall
  /Encoding WinAnsiEncoding def
  currentdict
end
/Courier-Oblique exch definefont pop
/Courier-BoldOblique findfont
dup length dict begin
  {1 index /FID ne {def} {pop pop} ifelse} forall
  /Encoding WinAnsiEncoding def
  currentdict
end
/Courier-BoldOblique exch definefont pop
/Courier-Bold findfont
dup length dict begin
  {1 index /FID ne {def} {pop pop} ifelse} forall
  /Encoding WinAnsiEncoding def
  currentdict
end
/Courier-Bold exch definefont pop
/Helvetica findfont
dup length dict begin
  {1 index /FID ne {def} {pop pop} ifelse} forall
  /Encoding WinAnsiEncoding def
  currentdict
end
/Helvetica exch definefont pop
/Helvetica-Oblique findfont
dup length dict begin
  {1 index /FID ne {def} {pop pop} ifelse} forall
  /Encoding WinAnsiEncoding def
  currentdict
end
/Helvetica-Oblique exch definefont pop
/Helvetica-Bold findfont
dup length dict begin
  {1 index /FID ne {def} {pop pop} ifelse} forall
  /Encoding WinAnsiEncoding def
  currentdict
end
/Helvetica-Bold exch definefont pop
/Helvetica-BoldOblique findfont
dup length dict begin
  {1 index /FID ne {def} {pop pop} ifelse} forall
  /Encoding WinAnsiEncoding def
  currentdict
end
/Helvetica-BoldOblique exch definefont pop
/Times-Roman findfont
dup length dict begin
  {1 index /FID ne {def} {pop pop} ifelse} forall
  /Encoding WinAnsiEncoding def
  currentdict
end
/Times-Roman exch definefont pop
/Times-Italic findfont
dup length dict begin
  {1 index /FID ne {def} {pop pop} ifelse} forall
  /Encoding WinAnsiEncoding def
  currentdict
end
/Times-Italic exch definefont pop
/Times-Bold findfont
dup length dict begin
  {1 index /FID ne {def} {pop pop} ifelse} forall
  /Encoding WinAnsiEncoding def
  currentdict
end
/Times-Bold exch definefont pop
/Times-BoldItalic findfont
dup length dict begin
  {1 index /FID ne {def} {pop pop} ifelse} forall
  /Encoding WinAnsiEncoding def
  currentdict
end
/Times-BoldItalic exch definefont pop
/Courier findfont
dup length dict begin
  {1 index /FID ne {def} {pop pop} ifelse} forall
  /Encoding WinAnsiEncoding def
  currentdict
end
/Courier exch definefont pop
%FOPEndFontReencode
%%EndProlog
%%Page: 1 1
%%PageBoundingBox: 0 0 420 315
%%BeginPageSetup
[1 0 0 -1 0 315] CT
%%EndPageSetup
GS
[0.75 0 0 0.75 0 0] CT
1 GC
N
0 0 560 420 re
f
GR
GS
[0.75 0 0 0.75 0 0] CT
1 GC
N
0 0 560 420 re
f
GR
GS
[0.75 0 0 0.75 0 0] CT
1 GC
N
73 374 M
507 374 L
507 31 L
73 31 L
cp
f
GR
GS
[0.75 0 0 0.75 0 0] CT
0.873 GC
1 LJ
0.667 LW
N
73 374 M
73 31 L
S
GR
GS
[0.75 0 0 0.75 0 0] CT
0.873 GC
1 LJ
0.667 LW
N
121.222 374 M
121.222 31 L
S
GR
GS
[0.75 0 0 0.75 0 0] CT
0.873 GC
1 LJ
0.667 LW
N
169.444 374 M
169.444 31 L
S
GR
GS
[0.75 0 0 0.75 0 0] CT
0.873 GC
1 LJ
0.667 LW
N
217.667 374 M
217.667 31 L
S
GR
GS
[0.75 0 0 0.75 0 0] CT
0.873 GC
1 LJ
0.667 LW
N
265.889 374 M
265.889 31 L
S
GR
GS
[0.75 0 0 0.75 0 0] CT
0.873 GC
1 LJ
0.667 LW
N
314.111 374 M
314.111 31 L
S
GR
GS
[0.75 0 0 0.75 0 0] CT
0.873 GC
1 LJ
0.667 LW
N
362.333 374 M
362.333 31 L
S
GR
GS
[0.75 0 0 0.75 0 0] CT
0.873 GC
1 LJ
0.667 LW
N
410.556 374 M
410.556 31 L
S
GR
GS
[0.75 0 0 0.75 0 0] CT
0.873 GC
1 LJ
0.667 LW
N
458.778 374 M
458.778 31 L
S
GR
GS
[0.75 0 0 0.75 0 0] CT
0.873 GC
1 LJ
0.667 LW
N
507 374 M
507 31 L
S
GR
GS
[0.75 0 0 0.75 0 0] CT
0.873 GC
1 LJ
0.667 LW
N
507 374 M
73 374 L
S
GR
GS
[0.75 0 0 0.75 0 0] CT
0.873 GC
1 LJ
0.667 LW
N
507 331.125 M
73 331.125 L
S
GR
GS
[0.75 0 0 0.75 0 0] CT
0.873 GC
1 LJ
0.667 LW
N
507 288.25 M
73 288.25 L
S
GR
GS
[0.75 0 0 0.75 0 0] CT
0.873 GC
1 LJ
0.667 LW
N
507 245.375 M
73 245.375 L
S
GR
GS
[0.75 0 0 0.75 0 0] CT
0.873 GC
1 LJ
0.667 LW
N
507 202.5 M
73 202.5 L
S
GR
GS
[0.75 0 0 0.75 0 0] CT
0.873 GC
1 LJ
0.667 LW
N
507 159.625 M
73 159.625 L
S
GR
GS
[0.75 0 0 0.75 0 0] CT
0.873 GC
1 LJ
0.667 LW
N
507 116.75 M
73 116.75 L
S
GR
GS
[0.75 0 0 0.75 0 0] CT
0.873 GC
1 LJ
0.667 LW
N
507 73.875 M
73 73.875 L
S
GR
GS
[0.75 0 0 0.75 0 0] CT
0.873 GC
1 LJ
0.667 LW
N
507 31 M
73 31 L
S
GR
GS
[0.75 0 0 0.75 0 0] CT
0.149 GC
2 setlinecap
1 LJ
0.667 LW
N
73 374 M
507 374 L
S
GR
GS
[0.75 0 0 0.75 0 0] CT
0.149 GC
2 setlinecap
1 LJ
0.667 LW
N
73 374 M
73 369.66 L
S
GR
GS
[0.75 0 0 0.75 0 0] CT
0.149 GC
2 setlinecap
1 LJ
0.667 LW
N
121.222 374 M
121.222 369.66 L
S
GR
GS
[0.75 0 0 0.75 0 0] CT
0.149 GC
2 setlinecap
1 LJ
0.667 LW
N
169.444 374 M
169.444 369.66 L
S
GR
GS
[0.75 0 0 0.75 0 0] CT
0.149 GC
2 setlinecap
1 LJ
0.667 LW
N
217.667 374 M
217.667 369.66 L
S
GR
GS
[0.75 0 0 0.75 0 0] CT
0.149 GC
2 setlinecap
1 LJ
0.667 LW
N
265.889 374 M
265.889 369.66 L
S
GR
GS
[0.75 0 0 0.75 0 0] CT
0.149 GC
2 setlinecap
1 LJ
0.667 LW
N
314.111 374 M
314.111 369.66 L
S
GR
GS
[0.75 0 0 0.75 0 0] CT
0.149 GC
2 setlinecap
1 LJ
0.667 LW
N
362.333 374 M
362.333 369.66 L
S
GR
GS
[0.75 0 0 0.75 0 0] CT
0.149 GC
2 setlinecap
1 LJ
0.667 LW
N
410.556 374 M
410.556 369.66 L
S
GR
GS
[0.75 0 0 0.75 0 0] CT
0.149 GC
2 setlinecap
1 LJ
0.667 LW
N
458.778 374 M
458.778 369.66 L
S
GR
GS
[0.75 0 0 0.75 0 0] CT
0.149 GC
2 setlinecap
1 LJ
0.667 LW
N
507 374 M
507 369.66 L
S
GR
GS
[0.75 0 0 0.75 54.75 284.49998] CT
0.149 GC
N
-5.269 11.481 M
-6.862 11.481 -7.433 10.169 QT
-8.003 8.856 -8.003 7.059 QT
-8.003 5.919 -7.8 4.927 QT
-7.597 3.934 -6.987 3.239 QT
-6.378 2.544 -5.269 2.544 QT
-4.409 2.544 -3.862 2.958 QT
-3.315 3.372 -3.034 4.036 QT
-2.753 4.7 -2.644 5.458 QT
-2.534 6.216 -2.534 7.059 QT
-2.534 8.169 -2.745 9.145 QT
-2.956 10.122 -3.558 10.802 QT
-4.159 11.481 -5.269 11.481 QT
cp
-5.269 11.153 M
-4.55 11.153 -4.19 10.411 QT
-3.831 9.669 -3.753 8.762 QT
-3.675 7.856 -3.675 6.841 QT
-3.675 5.872 -3.753 5.044 QT
-3.831 4.216 -4.183 3.544 QT
-4.534 2.872 -5.269 2.872 QT
-6.003 2.872 -6.362 3.552 QT
-6.722 4.231 -6.8 5.052 QT
-6.878 5.872 -6.878 6.841 QT
-6.878 7.575 -6.847 8.216 QT
-6.815 8.856 -6.659 9.536 QT
-6.503 10.216 -6.167 10.684 QT
-5.831 11.153 -5.269 11.153 QT
cp
f
GR
GS
[0.75 0 0 0.75 54.75 284.49998] CT
0.149 GC
N
-0.758 10.481 M
-0.758 10.184 -0.539 9.981 QT
-0.321 9.778 -0.039 9.778 QT
0.133 9.778 0.304 9.872 QT
0.476 9.966 0.57 10.137 QT
0.664 10.309 0.664 10.481 QT
0.664 10.762 0.453 10.981 QT
0.242 11.2 -0.039 11.2 QT
-0.321 11.2 -0.539 10.981 QT
-0.758 10.762 -0.758 10.481 QT
cp
f
GR
GS
[0.75 0 0 0.75 54.75 284.49998] CT
0.149 GC
N
3.055 11.2 M
3.055 10.747 L
4.68 10.747 4.68 10.325 QT
4.68 3.512 L
4.008 3.825 2.977 3.825 QT
2.977 3.372 L
4.571 3.372 5.383 2.544 QT
5.571 2.544 L
5.617 2.544 5.657 2.575 QT
5.696 2.606 5.696 2.653 QT
5.696 10.325 L
5.696 10.747 7.321 10.747 QT
7.321 11.2 L
3.055 11.2 L
cp
f
GR
GS
[0.75 0 0 0.75 90.91667 284.49998] CT
0.149 GC
N
/f42842187{-5.269 11.481 M
-6.862 11.481 -7.433 10.169 QT
-8.003 8.856 -8.003 7.059 QT
-8.003 5.919 -7.8 4.927 QT
-7.597 3.934 -6.987 3.239 QT
-6.378 2.544 -5.269 2.544 QT
-4.409 2.544 -3.862 2.958 QT
-3.315 3.372 -3.034 4.036 QT
-2.753 4.7 -2.644 5.458 QT
-2.534 6.216 -2.534 7.059 QT
-2.534 8.169 -2.745 9.145 QT
-2.956 10.122 -3.558 10.802 QT
-4.159 11.481 -5.269 11.481 QT
cp
-5.269 11.153 M
-4.55 11.153 -4.19 10.411 QT
-3.831 9.669 -3.753 8.762 QT
-3.675 7.856 -3.675 6.841 QT
-3.675 5.872 -3.753 5.044 QT
-3.831 4.216 -4.183 3.544 QT
-4.534 2.872 -5.269 2.872 QT
-6.003 2.872 -6.362 3.552 QT
-6.722 4.231 -6.8 5.052 QT
-6.878 5.872 -6.878 6.841 QT
-6.878 7.575 -6.847 8.216 QT
-6.815 8.856 -6.659 9.536 QT
-6.503 10.216 -6.167 10.684 QT
-5.831 11.153 -5.269 11.153 QT
cp}def
f42842187
f
GR
GS
[0.75 0 0 0.75 90.91667 284.49998] CT
0.149 GC
N
/f-1562952851{-0.758 10.481 M
-0.758 10.184 -0.539 9.981 QT
-0.321 9.778 -0.039 9.778 QT
0.133 9.778 0.304 9.872 QT
0.476 9.966 0.57 10.137 QT
0.664 10.309 0.664 10.481 QT
0.664 10.762 0.453 10.981 QT
0.242 11.2 -0.039 11.2 QT
-0.321 11.2 -0.539 10.981 QT
-0.758 10.762 -0.758 10.481 QT
cp}def
f-1562952851
f
GR
GS
[0.75 0 0 0.75 90.91667 284.49998] CT
0.149 GC
N
/f-1025728929{2.492 11.2 M
2.492 10.856 L
2.492 10.825 2.524 10.778 QT
4.539 8.544 L
5.008 8.044 5.289 7.708 QT
5.571 7.372 5.852 6.934 QT
6.133 6.497 6.297 6.044 QT
6.461 5.591 6.461 5.091 QT
6.461 4.559 6.258 4.067 QT
6.055 3.575 5.664 3.286 QT
5.274 2.997 4.727 2.997 QT
4.164 2.997 3.711 3.341 QT
3.258 3.684 3.071 4.216 QT
3.133 4.2 3.211 4.2 QT
3.508 4.2 3.711 4.395 QT
3.914 4.591 3.914 4.903 QT
3.914 5.2 3.711 5.411 QT
3.508 5.622 3.211 5.622 QT
2.914 5.622 2.703 5.411 QT
2.492 5.2 2.492 4.903 QT
2.492 4.419 2.68 3.989 QT
2.867 3.559 3.211 3.231 QT
3.555 2.903 3.992 2.723 QT
4.43 2.544 4.914 2.544 QT
5.664 2.544 6.305 2.856 QT
6.946 3.169 7.321 3.747 QT
7.696 4.325 7.696 5.091 QT
7.696 5.653 7.446 6.161 QT
7.196 6.669 6.813 7.083 QT
6.43 7.497 5.821 8.028 QT
5.211 8.559 5.024 8.731 QT
3.555 10.153 L
4.805 10.153 L
5.727 10.153 6.344 10.137 QT
6.961 10.122 6.992 10.075 QT
7.149 9.919 7.305 8.887 QT
7.696 8.887 L
7.321 11.2 L
2.492 11.2 L
cp}def
f-1025728929
f
GR
GS
[0.75 0 0 0.75 127.08333 284.49998] CT
0.149 GC
N
f42842187
f
GR
GS
[0.75 0 0 0.75 127.08333 284.49998] CT
0.149 GC
N
f-1562952851
f
GR
GS
[0.75 0 0 0.75 127.08333 284.49998] CT
0.149 GC
N
/f114940892{3.086 10.2 M
3.399 10.637 3.914 10.856 QT
4.43 11.075 5.008 11.075 QT
5.774 11.075 6.086 10.427 QT
6.399 9.778 6.399 8.966 QT
6.399 8.591 6.336 8.223 QT
6.274 7.856 6.11 7.544 QT
5.946 7.231 5.672 7.036 QT
5.399 6.841 5.008 6.841 QT
4.133 6.841 L
4.024 6.841 4.024 6.731 QT
4.024 6.606 L
4.024 6.512 4.133 6.512 QT
4.852 6.45 L
5.305 6.45 5.61 6.106 QT
5.914 5.762 6.055 5.27 QT
6.196 4.778 6.196 4.341 QT
6.196 3.716 5.907 3.317 QT
5.617 2.919 5.008 2.919 QT
4.524 2.919 4.071 3.106 QT
3.617 3.294 3.352 3.669 QT
3.383 3.669 3.399 3.661 QT
3.414 3.653 3.446 3.653 QT
3.727 3.653 3.922 3.856 QT
4.117 4.059 4.117 4.356 QT
4.117 4.637 3.922 4.841 QT
3.727 5.044 3.446 5.044 QT
3.149 5.044 2.946 4.841 QT
2.742 4.637 2.742 4.356 QT
2.742 3.794 3.078 3.38 QT
3.414 2.966 3.946 2.755 QT
4.477 2.544 5.008 2.544 QT
5.414 2.544 5.852 2.661 QT
6.289 2.778 6.641 2.997 QT
6.992 3.216 7.219 3.559 QT
7.446 3.903 7.446 4.341 QT
7.446 4.887 7.203 5.348 QT
6.961 5.809 6.532 6.145 QT
6.102 6.481 5.602 6.653 QT
6.164 6.762 6.672 7.075 QT
7.18 7.387 7.485 7.887 QT
7.789 8.387 7.789 8.95 QT
7.789 9.669 7.399 10.247 QT
7.008 10.825 6.367 11.153 QT
5.727 11.481 5.008 11.481 QT
4.399 11.481 3.789 11.255 QT
3.18 11.028 2.789 10.559 QT
2.399 10.091 2.399 9.45 QT
2.399 9.122 2.617 8.911 QT
2.836 8.7 3.149 8.7 QT
3.367 8.7 3.539 8.794 QT
3.711 8.887 3.813 9.067 QT
3.914 9.247 3.914 9.45 QT
3.914 9.762 3.688 9.981 QT
3.461 10.2 3.149 10.2 QT
3.086 10.2 L
cp}def
f114940892
f
GR
GS
[0.75 0 0 0.75 163.25 284.49998] CT
0.149 GC
N
f42842187
f
GR
GS
[0.75 0 0 0.75 163.25 284.49998] CT
0.149 GC
N
f-1562952851
f
GR
GS
[0.75 0 0 0.75 163.25 284.49998] CT
0.149 GC
N
/f-789665990{2.211 9.059 M
2.211 8.591 L
6.227 2.606 L
6.274 2.544 6.367 2.544 QT
6.555 2.544 L
6.696 2.544 6.696 2.684 QT
6.696 8.591 L
7.977 8.591 L
7.977 9.059 L
6.696 9.059 L
6.696 10.325 L
6.696 10.591 7.078 10.669 QT
7.461 10.747 7.961 10.747 QT
7.961 11.2 L
4.383 11.2 L
4.383 10.747 L
4.883 10.747 5.266 10.669 QT
5.649 10.591 5.649 10.325 QT
5.649 9.059 L
2.211 9.059 L
cp
2.649 8.591 M
5.727 8.591 L
5.727 3.997 L
2.649 8.591 L
cp}def
f-789665990
f
GR
GS
[0.75 0 0 0.75 199.41666 284.49998] CT
0.149 GC
N
f42842187
f
GR
GS
[0.75 0 0 0.75 199.41666 284.49998] CT
0.149 GC
N
f-1562952851
f
GR
GS
[0.75 0 0 0.75 199.41666 284.49998] CT
0.149 GC
N
/f-266042818{2.977 9.716 M
3.117 10.106 3.391 10.419 QT
3.664 10.731 4.047 10.903 QT
4.43 11.075 4.836 11.075 QT
5.774 11.075 6.125 10.341 QT
6.477 9.606 6.477 8.575 QT
6.477 8.122 6.461 7.817 QT
6.446 7.512 6.383 7.216 QT
6.258 6.762 5.953 6.419 QT
5.649 6.075 5.211 6.075 QT
4.774 6.075 4.461 6.208 QT
4.149 6.341 3.953 6.52 QT
3.758 6.7 3.602 6.895 QT
3.446 7.091 3.414 7.106 QT
3.274 7.106 L
3.242 7.106 3.188 7.067 QT
3.133 7.028 3.133 6.981 QT
3.133 2.637 L
3.133 2.606 3.18 2.575 QT
3.227 2.544 3.274 2.544 QT
3.305 2.544 L
4.18 2.966 5.164 2.966 QT
6.133 2.966 7.024 2.544 QT
7.071 2.544 L
7.102 2.544 7.141 2.575 QT
7.18 2.606 7.18 2.637 QT
7.18 2.762 L
7.18 2.825 7.164 2.825 QT
6.711 3.419 6.039 3.747 QT
5.367 4.075 4.664 4.075 QT
4.133 4.075 3.586 3.934 QT
3.586 6.387 L
4.024 6.044 4.36 5.895 QT
4.696 5.747 5.227 5.747 QT
5.946 5.747 6.516 6.153 QT
7.086 6.559 7.391 7.223 QT
7.696 7.887 7.696 8.591 QT
7.696 9.372 7.313 10.036 QT
6.93 10.7 6.266 11.091 QT
5.602 11.481 4.836 11.481 QT
4.196 11.481 3.657 11.153 QT
3.117 10.825 2.805 10.27 QT
2.492 9.716 2.492 9.075 QT
2.492 8.794 2.688 8.606 QT
2.883 8.419 3.164 8.419 QT
3.446 8.419 3.641 8.606 QT
3.836 8.794 3.836 9.075 QT
3.836 9.356 3.641 9.552 QT
3.446 9.747 3.164 9.747 QT
3.117 9.747 3.063 9.739 QT
3.008 9.731 2.977 9.716 QT
cp}def
f-266042818
f
GR
GS
[0.75 0 0 0.75 235.58334 284.49998] CT
0.149 GC
N
f42842187
f
GR
GS
[0.75 0 0 0.75 235.58334 284.49998] CT
0.149 GC
N
f-1562952851
f
GR
GS
[0.75 0 0 0.75 235.58334 284.49998] CT
0.149 GC
N
/f-1079660156{5.102 11.481 M
4.289 11.481 3.75 11.052 QT
3.211 10.622 2.922 9.942 QT
2.633 9.262 2.516 8.512 QT
2.399 7.762 2.399 6.997 QT
2.399 5.966 2.797 4.934 QT
3.196 3.903 3.977 3.223 QT
4.758 2.544 5.821 2.544 QT
6.258 2.544 6.649 2.708 QT
7.039 2.872 7.258 3.2 QT
7.477 3.528 7.477 3.997 QT
7.477 4.262 7.289 4.442 QT
7.102 4.622 6.836 4.622 QT
6.586 4.622 6.407 4.442 QT
6.227 4.262 6.227 3.997 QT
6.227 3.747 6.407 3.559 QT
6.586 3.372 6.836 3.372 QT
6.914 3.372 L
6.742 3.137 6.446 3.028 QT
6.149 2.919 5.821 2.919 QT
5.43 2.919 5.094 3.091 QT
4.758 3.262 4.492 3.552 QT
4.227 3.841 4.047 4.192 QT
3.867 4.544 3.774 4.997 QT
3.68 5.45 3.649 5.841 QT
3.617 6.231 3.617 6.825 QT
3.852 6.294 4.274 5.958 QT
4.696 5.622 5.211 5.622 QT
5.789 5.622 6.266 5.856 QT
6.742 6.091 7.086 6.505 QT
7.43 6.919 7.61 7.45 QT
7.789 7.981 7.789 8.528 QT
7.789 9.294 7.453 9.981 QT
7.117 10.669 6.5 11.075 QT
5.883 11.481 5.102 11.481 QT
cp
5.102 11.075 M
5.602 11.075 5.907 10.848 QT
6.211 10.622 6.352 10.239 QT
6.492 9.856 6.532 9.473 QT
6.571 9.091 6.571 8.528 QT
6.571 7.794 6.5 7.278 QT
6.43 6.762 6.117 6.364 QT
5.805 5.966 5.164 5.966 QT
4.633 5.966 4.297 6.317 QT
3.961 6.669 3.805 7.216 QT
3.649 7.762 3.649 8.262 QT
3.649 8.434 3.664 8.528 QT
3.664 8.544 3.657 8.552 QT
3.649 8.559 3.649 8.591 QT
3.649 9.137 3.766 9.708 QT
3.883 10.278 4.203 10.677 QT
4.524 11.075 5.102 11.075 QT
cp}def
f-1079660156
f
GR
GS
[0.75 0 0 0.75 271.74998 284.49998] CT
0.149 GC
N
f42842187
f
GR
GS
[0.75 0 0 0.75 271.74998 284.49998] CT
0.149 GC
N
f-1562952851
f
GR
GS
[0.75 0 0 0.75 271.74998 284.49998] CT
0.149 GC
N
/f1805490129{4.117 10.856 M
4.117 10.137 4.242 9.45 QT
4.367 8.762 4.61 8.083 QT
4.852 7.403 5.196 6.755 QT
5.539 6.106 5.961 5.528 QT
7.149 3.887 L
5.664 3.887 L
3.352 3.887 3.274 3.95 QT
3.102 4.153 2.961 5.137 QT
2.586 5.137 L
3.008 2.419 L
3.383 2.419 L
3.383 2.45 L
3.383 2.684 4.18 2.755 QT
4.977 2.825 5.742 2.825 QT
8.149 2.825 L
8.149 3.169 L
8.149 3.169 8.149 3.177 QT
8.149 3.184 8.149 3.2 QT
6.352 5.716 L
5.696 6.7 5.532 7.887 QT
5.367 9.075 5.367 10.856 QT
5.367 11.122 5.18 11.302 QT
4.992 11.481 4.742 11.481 QT
4.477 11.481 4.297 11.302 QT
4.117 11.122 4.117 10.856 QT
cp}def
f1805490129
f
GR
GS
[0.75 0 0 0.75 307.91668 284.49998] CT
0.149 GC
N
f42842187
f
GR
GS
[0.75 0 0 0.75 307.91668 284.49998] CT
0.149 GC
N
f-1562952851
f
GR
GS
[0.75 0 0 0.75 307.91668 284.49998] CT
0.149 GC
N
/f-1131117543{2.399 9.231 M
2.399 8.45 2.914 7.848 QT
3.43 7.247 4.227 6.841 QT
3.742 6.528 L
3.305 6.247 3.024 5.762 QT
2.742 5.278 2.742 4.731 QT
2.742 4.122 3.071 3.614 QT
3.399 3.106 3.946 2.825 QT
4.492 2.544 5.102 2.544 QT
5.68 2.544 6.219 2.778 QT
6.758 3.012 7.102 3.45 QT
7.446 3.887 7.446 4.497 QT
7.446 4.934 7.242 5.309 QT
7.039 5.684 6.68 5.981 QT
6.321 6.278 5.914 6.481 QT
6.649 6.966 L
7.164 7.294 7.477 7.841 QT
7.789 8.387 7.789 8.997 QT
7.789 9.7 7.414 10.278 QT
7.039 10.856 6.414 11.169 QT
5.789 11.481 5.102 11.481 QT
4.43 11.481 3.805 11.208 QT
3.18 10.934 2.789 10.419 QT
2.399 9.903 2.399 9.231 QT
cp
3.102 9.231 M
3.102 9.747 3.383 10.169 QT
3.664 10.591 4.133 10.833 QT
4.602 11.075 5.102 11.075 QT
5.852 11.075 6.469 10.63 QT
7.086 10.184 7.086 9.466 QT
7.086 9.216 6.992 8.973 QT
6.899 8.731 6.719 8.528 QT
6.539 8.325 6.321 8.2 QT
4.586 7.075 L
4.18 7.278 3.836 7.614 QT
3.492 7.95 3.297 8.356 QT
3.102 8.762 3.102 9.231 QT
cp
3.992 5.262 M
5.571 6.278 L
6.117 5.95 6.469 5.505 QT
6.821 5.059 6.821 4.497 QT
6.821 4.059 6.571 3.692 QT
6.321 3.325 5.93 3.122 QT
5.539 2.919 5.086 2.919 QT
4.696 2.919 4.297 3.067 QT
3.899 3.216 3.641 3.52 QT
3.383 3.825 3.383 4.231 QT
3.383 4.841 3.992 5.262 QT
cp}def
f-1131117543
f
GR
GS
[0.75 0 0 0.75 344.08333 284.49998] CT
0.149 GC
N
f42842187
f
GR
GS
[0.75 0 0 0.75 344.08333 284.49998] CT
0.149 GC
N
f-1562952851
f
GR
GS
[0.75 0 0 0.75 344.08333 284.49998] CT
0.149 GC
N
/f324282055{3.321 10.653 M
3.68 11.075 4.555 11.075 QT
5.055 11.075 5.485 10.739 QT
5.914 10.403 6.149 9.919 QT
6.414 9.356 6.492 8.731 QT
6.571 8.106 6.571 7.184 QT
6.352 7.716 5.93 8.052 QT
5.508 8.387 4.977 8.387 QT
4.227 8.387 3.633 7.973 QT
3.039 7.559 2.719 6.887 QT
2.399 6.216 2.399 5.466 QT
2.399 4.684 2.75 4.012 QT
3.102 3.341 3.735 2.942 QT
4.367 2.544 5.164 2.544 QT
5.946 2.544 6.477 2.973 QT
7.008 3.403 7.289 4.075 QT
7.571 4.747 7.68 5.505 QT
7.789 6.262 7.789 6.997 QT
7.789 7.997 7.422 9.044 QT
7.055 10.091 6.321 10.786 QT
5.586 11.481 4.555 11.481 QT
3.789 11.481 3.258 11.122 QT
2.727 10.762 2.727 10.028 QT
2.727 9.762 2.907 9.583 QT
3.086 9.403 3.352 9.403 QT
3.617 9.403 3.797 9.583 QT
3.977 9.762 3.977 10.028 QT
3.977 10.278 3.789 10.466 QT
3.602 10.653 3.352 10.653 QT
3.321 10.653 L
cp
5.024 8.044 M
5.555 8.044 5.899 7.684 QT
6.242 7.325 6.391 6.794 QT
6.539 6.262 6.539 5.731 QT
6.539 5.481 L
6.539 5.434 L
6.539 4.45 6.258 3.684 QT
5.977 2.919 5.164 2.919 QT
4.649 2.919 4.328 3.145 QT
4.008 3.372 3.86 3.747 QT
3.711 4.122 3.664 4.544 QT
3.617 4.966 3.617 5.466 QT
3.617 6.2 3.688 6.723 QT
3.758 7.247 4.071 7.645 QT
4.383 8.044 5.024 8.044 QT
cp}def
f324282055
f
GR
GS
[0.75 0 0 0.75 380.25 284.49998] CT
0.149 GC
N
/f-1136517822{-2.13 11.2 M
-2.13 10.747 L
-0.505 10.747 -0.505 10.325 QT
-0.505 3.512 L
-1.177 3.825 -2.208 3.825 QT
-2.208 3.372 L
-0.615 3.372 0.198 2.544 QT
0.385 2.544 L
0.432 2.544 0.471 2.575 QT
0.51 2.606 0.51 2.653 QT
0.51 10.325 L
0.51 10.747 2.135 10.747 QT
2.135 11.2 L
-2.13 11.2 L
cp}def
f-1136517822
f
GR
GS
[0.75 0 0 0.75 0 0] CT
0.149 GC
2 setlinecap
1 LJ
0.667 LW
N
73 374 M
73 31 L
S
GR
GS
[0.75 0 0 0.75 0 0] CT
0.149 GC
2 setlinecap
1 LJ
0.667 LW
N
73 374 M
77.34 374 L
S
GR
GS
[0.75 0 0 0.75 0 0] CT
0.149 GC
2 setlinecap
1 LJ
0.667 LW
N
73 331.125 M
77.34 331.125 L
S
GR
GS
[0.75 0 0 0.75 0 0] CT
0.149 GC
2 setlinecap
1 LJ
0.667 LW
N
73 288.25 M
77.34 288.25 L
S
GR
GS
[0.75 0 0 0.75 0 0] CT
0.149 GC
2 setlinecap
1 LJ
0.667 LW
N
73 245.375 M
77.34 245.375 L
S
GR
GS
[0.75 0 0 0.75 0 0] CT
0.149 GC
2 setlinecap
1 LJ
0.667 LW
N
73 202.5 M
77.34 202.5 L
S
GR
GS
[0.75 0 0 0.75 0 0] CT
0.149 GC
2 setlinecap
1 LJ
0.667 LW
N
73 159.625 M
77.34 159.625 L
S
GR
GS
[0.75 0 0 0.75 0 0] CT
0.149 GC
2 setlinecap
1 LJ
0.667 LW
N
73 116.75 M
77.34 116.75 L
S
GR
GS
[0.75 0 0 0.75 0 0] CT
0.149 GC
2 setlinecap
1 LJ
0.667 LW
N
73 73.875 M
77.34 73.875 L
S
GR
GS
[0.75 0 0 0.75 0 0] CT
0.149 GC
2 setlinecap
1 LJ
0.667 LW
N
73 31 M
77.34 31 L
S
GR
GS
[0.75 0 0 0.75 50.75 280.49998] CT
0.149 GC
N
/f-1217475840{-13.787 3.481 M
-15.381 3.481 -15.951 2.169 QT
-16.521 0.856 -16.521 -0.941 QT
-16.521 -2.081 -16.318 -3.073 QT
-16.115 -4.066 -15.506 -4.761 QT
-14.896 -5.456 -13.787 -5.456 QT
-12.928 -5.456 -12.381 -5.042 QT
-11.834 -4.628 -11.553 -3.964 QT
-11.271 -3.3 -11.162 -2.542 QT
-11.053 -1.784 -11.053 -0.941 QT
-11.053 0.169 -11.264 1.145 QT
-11.475 2.122 -12.076 2.802 QT
-12.678 3.481 -13.787 3.481 QT
cp
-13.787 3.153 M
-13.068 3.153 -12.709 2.411 QT
-12.35 1.669 -12.271 0.762 QT
-12.193 -0.144 -12.193 -1.159 QT
-12.193 -2.128 -12.271 -2.956 QT
-12.35 -3.784 -12.701 -4.456 QT
-13.053 -5.128 -13.787 -5.128 QT
-14.521 -5.128 -14.881 -4.448 QT
-15.24 -3.769 -15.318 -2.948 QT
-15.396 -2.128 -15.396 -1.159 QT
-15.396 -0.425 -15.365 0.216 QT
-15.334 0.856 -15.178 1.536 QT
-15.021 2.216 -14.686 2.684 QT
-14.35 3.153 -13.787 3.153 QT
cp}def
f-1217475840
f
GR
GS
[0.75 0 0 0.75 50.75 280.49998] CT
0.149 GC
N
/f-751558118{-9.277 2.481 M
-9.277 2.184 -9.058 1.981 QT
-8.839 1.778 -8.558 1.778 QT
-8.386 1.778 -8.214 1.872 QT
-8.042 1.966 -7.949 2.137 QT
-7.855 2.309 -7.855 2.481 QT
-7.855 2.762 -8.066 2.981 QT
-8.277 3.2 -8.558 3.2 QT
-8.839 3.2 -9.058 2.981 QT
-9.277 2.762 -9.277 2.481 QT
cp}def
f-751558118
f
GR
GS
[0.75 0 0 0.75 50.75 280.49998] CT
0.149 GC
N
/f-2003826503{-3.417 3.481 M
-4.229 3.481 -4.768 3.052 QT
-5.307 2.622 -5.596 1.942 QT
-5.885 1.262 -6.003 0.512 QT
-6.12 -0.238 -6.12 -1.003 QT
-6.12 -2.034 -5.721 -3.066 QT
-5.323 -4.097 -4.542 -4.777 QT
-3.76 -5.456 -2.698 -5.456 QT
-2.26 -5.456 -1.87 -5.292 QT
-1.479 -5.128 -1.26 -4.8 QT
-1.042 -4.472 -1.042 -4.003 QT
-1.042 -3.738 -1.229 -3.558 QT
-1.417 -3.378 -1.682 -3.378 QT
-1.932 -3.378 -2.112 -3.558 QT
-2.292 -3.738 -2.292 -4.003 QT
-2.292 -4.253 -2.112 -4.441 QT
-1.932 -4.628 -1.682 -4.628 QT
-1.604 -4.628 L
-1.776 -4.863 -2.073 -4.972 QT
-2.37 -5.081 -2.698 -5.081 QT
-3.089 -5.081 -3.424 -4.909 QT
-3.76 -4.738 -4.026 -4.448 QT
-4.292 -4.159 -4.471 -3.808 QT
-4.651 -3.456 -4.745 -3.003 QT
-4.839 -2.55 -4.87 -2.159 QT
-4.901 -1.769 -4.901 -1.175 QT
-4.667 -1.706 -4.245 -2.042 QT
-3.823 -2.378 -3.307 -2.378 QT
-2.729 -2.378 -2.253 -2.144 QT
-1.776 -1.909 -1.432 -1.495 QT
-1.089 -1.081 -0.909 -0.55 QT
-0.729 -0.019 -0.729 0.528 QT
-0.729 1.294 -1.065 1.981 QT
-1.401 2.669 -2.018 3.075 QT
-2.635 3.481 -3.417 3.481 QT
cp
-3.417 3.075 M
-2.917 3.075 -2.612 2.848 QT
-2.307 2.622 -2.167 2.239 QT
-2.026 1.856 -1.987 1.473 QT
-1.948 1.091 -1.948 0.528 QT
-1.948 -0.206 -2.018 -0.722 QT
-2.089 -1.238 -2.401 -1.636 QT
-2.714 -2.034 -3.354 -2.034 QT
-3.885 -2.034 -4.221 -1.683 QT
-4.557 -1.331 -4.714 -0.784 QT
-4.87 -0.238 -4.87 0.262 QT
-4.87 0.434 -4.854 0.528 QT
-4.854 0.544 -4.862 0.552 QT
-4.87 0.559 -4.87 0.591 QT
-4.87 1.137 -4.753 1.708 QT
-4.635 2.278 -4.315 2.677 QT
-3.995 3.075 -3.417 3.075 QT
cp}def
f-2003826503
f
GR
GS
[0.75 0 0 0.75 50.75 248.34377] CT
0.149 GC
N
/f1965806447{-20.454 3.481 M
-22.048 3.481 -22.618 2.169 QT
-23.188 0.856 -23.188 -0.941 QT
-23.188 -2.081 -22.985 -3.073 QT
-22.782 -4.066 -22.173 -4.761 QT
-21.563 -5.456 -20.454 -5.456 QT
-19.594 -5.456 -19.048 -5.042 QT
-18.501 -4.628 -18.219 -3.964 QT
-17.938 -3.3 -17.829 -2.542 QT
-17.719 -1.784 -17.719 -0.941 QT
-17.719 0.169 -17.93 1.145 QT
-18.141 2.122 -18.743 2.802 QT
-19.344 3.481 -20.454 3.481 QT
cp
-20.454 3.153 M
-19.735 3.153 -19.376 2.411 QT
-19.016 1.669 -18.938 0.762 QT
-18.86 -0.144 -18.86 -1.159 QT
-18.86 -2.128 -18.938 -2.956 QT
-19.016 -3.784 -19.368 -4.456 QT
-19.719 -5.128 -20.454 -5.128 QT
-21.188 -5.128 -21.548 -4.448 QT
-21.907 -3.769 -21.985 -2.948 QT
-22.063 -2.128 -22.063 -1.159 QT
-22.063 -0.425 -22.032 0.216 QT
-22.001 0.856 -21.844 1.536 QT
-21.688 2.216 -21.352 2.684 QT
-21.016 3.153 -20.454 3.153 QT
cp}def
f1965806447
f
GR
GS
[0.75 0 0 0.75 50.75 248.34377] CT
0.149 GC
N
/f418511279{-15.943 2.481 M
-15.943 2.184 -15.725 1.981 QT
-15.506 1.778 -15.225 1.778 QT
-15.053 1.778 -14.881 1.872 QT
-14.709 1.966 -14.615 2.137 QT
-14.521 2.309 -14.521 2.481 QT
-14.521 2.762 -14.732 2.981 QT
-14.943 3.2 -15.225 3.2 QT
-15.506 3.2 -15.725 2.981 QT
-15.943 2.762 -15.943 2.481 QT
cp}def
f418511279
f
GR
GS
[0.75 0 0 0.75 50.75 248.34377] CT
0.149 GC
N
/f-858803262{-10.083 3.481 M
-10.896 3.481 -11.435 3.052 QT
-11.974 2.622 -12.263 1.942 QT
-12.552 1.262 -12.669 0.512 QT
-12.786 -0.238 -12.786 -1.003 QT
-12.786 -2.034 -12.388 -3.066 QT
-11.99 -4.097 -11.208 -4.777 QT
-10.427 -5.456 -9.365 -5.456 QT
-8.927 -5.456 -8.536 -5.292 QT
-8.146 -5.128 -7.927 -4.8 QT
-7.708 -4.472 -7.708 -4.003 QT
-7.708 -3.738 -7.896 -3.558 QT
-8.083 -3.378 -8.349 -3.378 QT
-8.599 -3.378 -8.779 -3.558 QT
-8.958 -3.738 -8.958 -4.003 QT
-8.958 -4.253 -8.779 -4.441 QT
-8.599 -4.628 -8.349 -4.628 QT
-8.271 -4.628 L
-8.443 -4.863 -8.74 -4.972 QT
-9.036 -5.081 -9.365 -5.081 QT
-9.755 -5.081 -10.091 -4.909 QT
-10.427 -4.738 -10.693 -4.448 QT
-10.958 -4.159 -11.138 -3.808 QT
-11.318 -3.456 -11.411 -3.003 QT
-11.505 -2.55 -11.536 -2.159 QT
-11.568 -1.769 -11.568 -1.175 QT
-11.333 -1.706 -10.911 -2.042 QT
-10.49 -2.378 -9.974 -2.378 QT
-9.396 -2.378 -8.919 -2.144 QT
-8.443 -1.909 -8.099 -1.495 QT
-7.755 -1.081 -7.576 -0.55 QT
-7.396 -0.019 -7.396 0.528 QT
-7.396 1.294 -7.732 1.981 QT
-8.068 2.669 -8.685 3.075 QT
-9.302 3.481 -10.083 3.481 QT
cp
-10.083 3.075 M
-9.583 3.075 -9.279 2.848 QT
-8.974 2.622 -8.833 2.239 QT
-8.693 1.856 -8.654 1.473 QT
-8.615 1.091 -8.615 0.528 QT
-8.615 -0.206 -8.685 -0.722 QT
-8.755 -1.238 -9.068 -1.636 QT
-9.38 -2.034 -10.021 -2.034 QT
-10.552 -2.034 -10.888 -1.683 QT
-11.224 -1.331 -11.38 -0.784 QT
-11.536 -0.238 -11.536 0.262 QT
-11.536 0.434 -11.521 0.528 QT
-11.521 0.544 -11.529 0.552 QT
-11.536 0.559 -11.536 0.591 QT
-11.536 1.137 -11.419 1.708 QT
-11.302 2.278 -10.982 2.677 QT
-10.661 3.075 -10.083 3.075 QT
cp}def
f-858803262
f
GR
GS
[0.75 0 0 0.75 50.75 248.34377] CT
0.149 GC
N
/f1892466823{-5.542 1.716 M
-5.401 2.106 -5.128 2.419 QT
-4.854 2.731 -4.471 2.903 QT
-4.089 3.075 -3.682 3.075 QT
-2.745 3.075 -2.393 2.341 QT
-2.042 1.606 -2.042 0.575 QT
-2.042 0.122 -2.057 -0.183 QT
-2.073 -0.488 -2.135 -0.784 QT
-2.26 -1.238 -2.565 -1.581 QT
-2.87 -1.925 -3.307 -1.925 QT
-3.745 -1.925 -4.057 -1.792 QT
-4.37 -1.659 -4.565 -1.48 QT
-4.76 -1.3 -4.917 -1.105 QT
-5.073 -0.909 -5.104 -0.894 QT
-5.245 -0.894 L
-5.276 -0.894 -5.331 -0.933 QT
-5.385 -0.972 -5.385 -1.019 QT
-5.385 -5.363 L
-5.385 -5.394 -5.339 -5.425 QT
-5.292 -5.456 -5.245 -5.456 QT
-5.214 -5.456 L
-4.339 -5.034 -3.354 -5.034 QT
-2.385 -5.034 -1.495 -5.456 QT
-1.448 -5.456 L
-1.417 -5.456 -1.378 -5.425 QT
-1.339 -5.394 -1.339 -5.363 QT
-1.339 -5.238 L
-1.339 -5.175 -1.354 -5.175 QT
-1.807 -4.581 -2.479 -4.253 QT
-3.151 -3.925 -3.854 -3.925 QT
-4.385 -3.925 -4.932 -4.066 QT
-4.932 -1.613 L
-4.495 -1.956 -4.159 -2.105 QT
-3.823 -2.253 -3.292 -2.253 QT
-2.573 -2.253 -2.003 -1.847 QT
-1.432 -1.441 -1.128 -0.777 QT
-0.823 -0.113 -0.823 0.591 QT
-0.823 1.372 -1.206 2.036 QT
-1.589 2.7 -2.253 3.091 QT
-2.917 3.481 -3.682 3.481 QT
-4.323 3.481 -4.862 3.153 QT
-5.401 2.825 -5.714 2.27 QT
-6.026 1.716 -6.026 1.075 QT
-6.026 0.794 -5.831 0.606 QT
-5.635 0.419 -5.354 0.419 QT
-5.073 0.419 -4.878 0.606 QT
-4.682 0.794 -4.682 1.075 QT
-4.682 1.356 -4.878 1.552 QT
-5.073 1.747 -5.354 1.747 QT
-5.401 1.747 -5.456 1.739 QT
-5.51 1.731 -5.542 1.716 QT
cp}def
f1892466823
f
GR
GS
[0.75 0 0 0.75 50.75 216.1875] CT
0.149 GC
N
f-1217475840
f
GR
GS
[0.75 0 0 0.75 50.75 216.1875] CT
0.149 GC
N
f-751558118
f
GR
GS
[0.75 0 0 0.75 50.75 216.1875] CT
0.149 GC
N
/f-1289850773{-4.401 2.856 M
-4.401 2.137 -4.276 1.45 QT
-4.151 0.762 -3.909 0.083 QT
-3.667 -0.597 -3.323 -1.245 QT
-2.979 -1.894 -2.557 -2.472 QT
-1.37 -4.113 L
-2.854 -4.113 L
-5.167 -4.113 -5.245 -4.05 QT
-5.417 -3.847 -5.557 -2.863 QT
-5.932 -2.863 L
-5.51 -5.581 L
-5.135 -5.581 L
-5.135 -5.55 L
-5.135 -5.316 -4.339 -5.245 QT
-3.542 -5.175 -2.776 -5.175 QT
-0.37 -5.175 L
-0.37 -4.831 L
-0.37 -4.831 -0.37 -4.823 QT
-0.37 -4.816 -0.37 -4.8 QT
-2.167 -2.284 L
-2.823 -1.3 -2.987 -0.113 QT
-3.151 1.075 -3.151 2.856 QT
-3.151 3.122 -3.339 3.302 QT
-3.526 3.481 -3.776 3.481 QT
-4.042 3.481 -4.221 3.302 QT
-4.401 3.122 -4.401 2.856 QT
cp}def
f-1289850773
f
GR
GS
[0.75 0 0 0.75 50.75 184.03125] CT
0.149 GC
N
f1965806447
f
GR
GS
[0.75 0 0 0.75 50.75 184.03125] CT
0.149 GC
N
f418511279
f
GR
GS
[0.75 0 0 0.75 50.75 184.03125] CT
0.149 GC
N
/f2039158625{-11.068 2.856 M
-11.068 2.137 -10.943 1.45 QT
-10.818 0.762 -10.576 0.083 QT
-10.333 -0.597 -9.99 -1.245 QT
-9.646 -1.894 -9.224 -2.472 QT
-8.036 -4.113 L
-9.521 -4.113 L
-11.833 -4.113 -11.911 -4.05 QT
-12.083 -3.847 -12.224 -2.863 QT
-12.599 -2.863 L
-12.177 -5.581 L
-11.802 -5.581 L
-11.802 -5.55 L
-11.802 -5.316 -11.005 -5.245 QT
-10.208 -5.175 -9.443 -5.175 QT
-7.036 -5.175 L
-7.036 -4.831 L
-7.036 -4.831 -7.036 -4.823 QT
-7.036 -4.816 -7.036 -4.8 QT
-8.833 -2.284 L
-9.49 -1.3 -9.654 -0.113 QT
-9.818 1.075 -9.818 2.856 QT
-9.818 3.122 -10.005 3.302 QT
-10.193 3.481 -10.443 3.481 QT
-10.708 3.481 -10.888 3.302 QT
-11.068 3.122 -11.068 2.856 QT
cp}def
f2039158625
f
GR
GS
[0.75 0 0 0.75 50.75 184.03125] CT
0.149 GC
N
f1892466823
f
GR
GS
[0.75 0 0 0.75 50.75 151.87499] CT
0.149 GC
N
f-1217475840
f
GR
GS
[0.75 0 0 0.75 50.75 151.87499] CT
0.149 GC
N
f-751558118
f
GR
GS
[0.75 0 0 0.75 50.75 151.87499] CT
0.149 GC
N
/f-974058328{-6.12 1.231 M
-6.12 0.45 -5.604 -0.152 QT
-5.089 -0.753 -4.292 -1.159 QT
-4.776 -1.472 L
-5.214 -1.753 -5.495 -2.238 QT
-5.776 -2.722 -5.776 -3.269 QT
-5.776 -3.878 -5.448 -4.386 QT
-5.12 -4.894 -4.573 -5.175 QT
-4.026 -5.456 -3.417 -5.456 QT
-2.839 -5.456 -2.299 -5.222 QT
-1.76 -4.988 -1.417 -4.55 QT
-1.073 -4.113 -1.073 -3.503 QT
-1.073 -3.066 -1.276 -2.691 QT
-1.479 -2.316 -1.839 -2.019 QT
-2.198 -1.722 -2.604 -1.519 QT
-1.87 -1.034 L
-1.354 -0.706 -1.042 -0.159 QT
-0.729 0.387 -0.729 0.997 QT
-0.729 1.7 -1.104 2.278 QT
-1.479 2.856 -2.104 3.169 QT
-2.729 3.481 -3.417 3.481 QT
-4.089 3.481 -4.714 3.208 QT
-5.339 2.934 -5.729 2.419 QT
-6.12 1.903 -6.12 1.231 QT
cp
-5.417 1.231 M
-5.417 1.747 -5.135 2.169 QT
-4.854 2.591 -4.385 2.833 QT
-3.917 3.075 -3.417 3.075 QT
-2.667 3.075 -2.049 2.63 QT
-1.432 2.184 -1.432 1.466 QT
-1.432 1.216 -1.526 0.973 QT
-1.62 0.731 -1.799 0.528 QT
-1.979 0.325 -2.198 0.2 QT
-3.932 -0.925 L
-4.339 -0.722 -4.682 -0.386 QT
-5.026 -0.05 -5.221 0.356 QT
-5.417 0.762 -5.417 1.231 QT
cp
-4.526 -2.738 M
-2.948 -1.722 L
-2.401 -2.05 -2.049 -2.495 QT
-1.698 -2.941 -1.698 -3.503 QT
-1.698 -3.941 -1.948 -4.308 QT
-2.198 -4.675 -2.589 -4.878 QT
-2.979 -5.081 -3.432 -5.081 QT
-3.823 -5.081 -4.221 -4.933 QT
-4.62 -4.784 -4.878 -4.48 QT
-5.135 -4.175 -5.135 -3.769 QT
-5.135 -3.159 -4.526 -2.738 QT
cp}def
f-974058328
f
GR
GS
[0.75 0 0 0.75 50.75 119.71874] CT
0.149 GC
N
f1965806447
f
GR
GS
[0.75 0 0 0.75 50.75 119.71874] CT
0.149 GC
N
f418511279
f
GR
GS
[0.75 0 0 0.75 50.75 119.71874] CT
0.149 GC
N
/f84713511{-12.786 1.231 M
-12.786 0.45 -12.271 -0.152 QT
-11.755 -0.753 -10.958 -1.159 QT
-11.443 -1.472 L
-11.88 -1.753 -12.161 -2.238 QT
-12.443 -2.722 -12.443 -3.269 QT
-12.443 -3.878 -12.115 -4.386 QT
-11.786 -4.894 -11.24 -5.175 QT
-10.693 -5.456 -10.083 -5.456 QT
-9.505 -5.456 -8.966 -5.222 QT
-8.427 -4.988 -8.083 -4.55 QT
-7.74 -4.113 -7.74 -3.503 QT
-7.74 -3.066 -7.943 -2.691 QT
-8.146 -2.316 -8.505 -2.019 QT
-8.865 -1.722 -9.271 -1.519 QT
-8.536 -1.034 L
-8.021 -0.706 -7.708 -0.159 QT
-7.396 0.387 -7.396 0.997 QT
-7.396 1.7 -7.771 2.278 QT
-8.146 2.856 -8.771 3.169 QT
-9.396 3.481 -10.083 3.481 QT
-10.755 3.481 -11.38 3.208 QT
-12.005 2.934 -12.396 2.419 QT
-12.786 1.903 -12.786 1.231 QT
cp
-12.083 1.231 M
-12.083 1.747 -11.802 2.169 QT
-11.521 2.591 -11.052 2.833 QT
-10.583 3.075 -10.083 3.075 QT
-9.333 3.075 -8.716 2.63 QT
-8.099 2.184 -8.099 1.466 QT
-8.099 1.216 -8.193 0.973 QT
-8.286 0.731 -8.466 0.528 QT
-8.646 0.325 -8.865 0.2 QT
-10.599 -0.925 L
-11.005 -0.722 -11.349 -0.386 QT
-11.693 -0.05 -11.888 0.356 QT
-12.083 0.762 -12.083 1.231 QT
cp
-11.193 -2.738 M
-9.615 -1.722 L
-9.068 -2.05 -8.716 -2.495 QT
-8.365 -2.941 -8.365 -3.503 QT
-8.365 -3.941 -8.615 -4.308 QT
-8.865 -4.675 -9.255 -4.878 QT
-9.646 -5.081 -10.099 -5.081 QT
-10.49 -5.081 -10.888 -4.933 QT
-11.286 -4.784 -11.544 -4.48 QT
-11.802 -4.175 -11.802 -3.769 QT
-11.802 -3.159 -11.193 -2.738 QT
cp}def
f84713511
f
GR
GS
[0.75 0 0 0.75 50.75 119.71874] CT
0.149 GC
N
f1892466823
f
GR
GS
[0.75 0 0 0.75 50.75 87.56252] CT
0.149 GC
N
f-1217475840
f
GR
GS
[0.75 0 0 0.75 50.75 87.56252] CT
0.149 GC
N
f-751558118
f
GR
GS
[0.75 0 0 0.75 50.75 87.56252] CT
0.149 GC
N
/f1012835229{-5.198 2.653 M
-4.839 3.075 -3.964 3.075 QT
-3.464 3.075 -3.034 2.739 QT
-2.604 2.403 -2.37 1.919 QT
-2.104 1.356 -2.026 0.731 QT
-1.948 0.106 -1.948 -0.816 QT
-2.167 -0.284 -2.589 0.052 QT
-3.01 0.387 -3.542 0.387 QT
-4.292 0.387 -4.885 -0.027 QT
-5.479 -0.441 -5.799 -1.113 QT
-6.12 -1.784 -6.12 -2.534 QT
-6.12 -3.316 -5.768 -3.988 QT
-5.417 -4.659 -4.784 -5.058 QT
-4.151 -5.456 -3.354 -5.456 QT
-2.573 -5.456 -2.042 -5.027 QT
-1.51 -4.597 -1.229 -3.925 QT
-0.948 -3.253 -0.839 -2.495 QT
-0.729 -1.738 -0.729 -1.003 QT
-0.729 -0.003 -1.096 1.044 QT
-1.464 2.091 -2.198 2.786 QT
-2.932 3.481 -3.964 3.481 QT
-4.729 3.481 -5.26 3.122 QT
-5.792 2.762 -5.792 2.028 QT
-5.792 1.762 -5.612 1.583 QT
-5.432 1.403 -5.167 1.403 QT
-4.901 1.403 -4.721 1.583 QT
-4.542 1.762 -4.542 2.028 QT
-4.542 2.278 -4.729 2.466 QT
-4.917 2.653 -5.167 2.653 QT
-5.198 2.653 L
cp
-3.495 0.044 M
-2.964 0.044 -2.62 -0.316 QT
-2.276 -0.675 -2.128 -1.206 QT
-1.979 -1.738 -1.979 -2.269 QT
-1.979 -2.519 L
-1.979 -2.566 L
-1.979 -3.55 -2.26 -4.316 QT
-2.542 -5.081 -3.354 -5.081 QT
-3.87 -5.081 -4.19 -4.855 QT
-4.51 -4.628 -4.659 -4.253 QT
-4.807 -3.878 -4.854 -3.456 QT
-4.901 -3.034 -4.901 -2.534 QT
-4.901 -1.8 -4.831 -1.277 QT
-4.76 -0.753 -4.448 -0.355 QT
-4.135 0.044 -3.495 0.044 QT
cp}def
f1012835229
f
GR
GS
[0.75 0 0 0.75 50.75 55.40626] CT
0.149 GC
N
f1965806447
f
GR
GS
[0.75 0 0 0.75 50.75 55.40626] CT
0.149 GC
N
f418511279
f
GR
GS
[0.75 0 0 0.75 50.75 55.40626] CT
0.149 GC
N
/f725925667{-11.865 2.653 M
-11.505 3.075 -10.63 3.075 QT
-10.13 3.075 -9.701 2.739 QT
-9.271 2.403 -9.036 1.919 QT
-8.771 1.356 -8.693 0.731 QT
-8.615 0.106 -8.615 -0.816 QT
-8.833 -0.284 -9.255 0.052 QT
-9.677 0.387 -10.208 0.387 QT
-10.958 0.387 -11.552 -0.027 QT
-12.146 -0.441 -12.466 -1.113 QT
-12.786 -1.784 -12.786 -2.534 QT
-12.786 -3.316 -12.435 -3.988 QT
-12.083 -4.659 -11.451 -5.058 QT
-10.818 -5.456 -10.021 -5.456 QT
-9.24 -5.456 -8.708 -5.027 QT
-8.177 -4.597 -7.896 -3.925 QT
-7.615 -3.253 -7.505 -2.495 QT
-7.396 -1.738 -7.396 -1.003 QT
-7.396 -0.003 -7.763 1.044 QT
-8.13 2.091 -8.865 2.786 QT
-9.599 3.481 -10.63 3.481 QT
-11.396 3.481 -11.927 3.122 QT
-12.458 2.762 -12.458 2.028 QT
-12.458 1.762 -12.279 1.583 QT
-12.099 1.403 -11.833 1.403 QT
-11.568 1.403 -11.388 1.583 QT
-11.208 1.762 -11.208 2.028 QT
-11.208 2.278 -11.396 2.466 QT
-11.583 2.653 -11.833 2.653 QT
-11.865 2.653 L
cp
-10.161 0.044 M
-9.63 0.044 -9.286 -0.316 QT
-8.943 -0.675 -8.794 -1.206 QT
-8.646 -1.738 -8.646 -2.269 QT
-8.646 -2.519 L
-8.646 -2.566 L
-8.646 -3.55 -8.927 -4.316 QT
-9.208 -5.081 -10.021 -5.081 QT
-10.536 -5.081 -10.857 -4.855 QT
-11.177 -4.628 -11.326 -4.253 QT
-11.474 -3.878 -11.521 -3.456 QT
-11.568 -3.034 -11.568 -2.534 QT
-11.568 -1.8 -11.497 -1.277 QT
-11.427 -0.753 -11.115 -0.355 QT
-10.802 0.044 -10.161 0.044 QT
cp}def
f725925667
f
GR
GS
[0.75 0 0 0.75 50.75 55.40626] CT
0.149 GC
N
f1892466823
f
GR
GS
[0.75 0 0 0.75 50.75 23.25] CT
0.149 GC
N
/f-1405947355{-5.464 3.2 M
-5.464 2.747 L
-3.839 2.747 -3.839 2.325 QT
-3.839 -4.488 L
-4.51 -4.175 -5.542 -4.175 QT
-5.542 -4.628 L
-3.948 -4.628 -3.135 -5.456 QT
-2.948 -5.456 L
-2.901 -5.456 -2.862 -5.425 QT
-2.823 -5.394 -2.823 -5.347 QT
-2.823 2.325 L
-2.823 2.747 -1.198 2.747 QT
-1.198 3.2 L
-5.464 3.2 L
cp}def
f-1405947355
f
GR
GS
[0.75 0 0 0.75 0 0] CT
0 0.447 0.741 RC
1 LJ
2.667 LW
N
73 31 M
121.222 31 L
169.444 31 L
217.667 31 L
265.889 31 L
314.111 31 L
362.333 31 L
410.556 31 L
458.778 31 L
507 31 L
S
GR
GS
[0.75 0 0 0.75 0 0] CT
0.851 0.325 0.098 RC
1 LJ
2.667 LW
N
73 31 M
121.222 31 L
169.444 31 L
217.667 31 L
265.889 31 L
314.111 31 L
362.333 31 L
410.556 31 L
458.778 31 L
507 31 L
S
GR
GS
[0.75 0 0 0.75 0 0] CT
0.929 0.694 0.125 RC
1 LJ
2.667 LW
N
73 159.625 M
121.222 176.775 L
169.444 108.175 L
217.667 99.6 L
265.889 82.45 L
314.111 116.75 L
362.333 73.875 L
410.556 82.45 L
458.778 73.875 L
507 91.025 L
S
GR
GS
[0.75 0 0 0.75 0 0] CT
0.494 0.184 0.557 RC
1 LJ
2.667 LW
N
73 348.275 M
121.222 262.525 L
169.444 185.35 L
217.667 279.675 L
265.889 133.9 L
314.111 133.9 L
362.333 185.35 L
410.556 133.9 L
458.778 176.775 L
507 151.05 L
S
GR
%%Trailer
%%Pages: 1
%%EOF
