%!PS-Adobe-3.0 EPSF-3.0
%%Creator: (MATLAB, The Mathworks, Inc. Version 9.3.0.713579 \(R2017b\). Operating System: Linux)
%%Title: ./0convergenceTestRRTKstd.eps
%%CreationDate: 2021-01-08T17:26:19
%%Pages: (atend)
%%BoundingBox:    25     5   382   296
%%LanguageLevel: 3
%%EndComments
%%BeginProlog
%%BeginResource: procset (Apache XML Graphics Std ProcSet) 1.2 0
%%Version: 1.2 0
%%Copyright: (Copyright 2001-2003,2010 The Apache Software Foundation. License terms: http://www.apache.org/licenses/LICENSE-2.0)
/bd{bind def}bind def
/ld{load def}bd
/GR/grestore ld
/GS/gsave ld
/RM/rmoveto ld
/C/curveto ld
/t/show ld
/L/lineto ld
/ML/setmiterlimit ld
/CT/concat ld
/f/fill ld
/N/newpath ld
/S/stroke ld
/CC/setcmykcolor ld
/A/ashow ld
/cp/closepath ld
/RC/setrgbcolor ld
/LJ/setlinejoin ld
/GC/setgray ld
/LW/setlinewidth ld
/M/moveto ld
/re {4 2 roll M
1 index 0 rlineto
0 exch rlineto
neg 0 rlineto
cp } bd
/_ctm matrix def
/_tm matrix def
/BT { _ctm currentmatrix pop matrix _tm copy pop 0 0 moveto } bd
/ET { _ctm setmatrix } bd
/iTm { _ctm setmatrix _tm concat } bd
/Tm { _tm astore pop iTm 0 0 moveto } bd
/ux 0.0 def
/uy 0.0 def
/F {
  /Tp exch def
  /Tf exch def
  Tf findfont Tp scalefont setfont
  /cf Tf def  /cs Tp def
} bd
/ULS {currentpoint /uy exch def /ux exch def} bd
/ULE {
  /Tcx currentpoint pop def
  gsave
  newpath
  cf findfont cs scalefont dup
  /FontMatrix get 0 get /Ts exch def /FontInfo get dup
  /UnderlinePosition get Ts mul /To exch def
  /UnderlineThickness get Ts mul /Tt exch def
  ux uy To add moveto  Tcx uy To add lineto
  Tt setlinewidth stroke
  grestore
} bd
/OLE {
  /Tcx currentpoint pop def
  gsave
  newpath
  cf findfont cs scalefont dup
  /FontMatrix get 0 get /Ts exch def /FontInfo get dup
  /UnderlinePosition get Ts mul /To exch def
  /UnderlineThickness get Ts mul /Tt exch def
  ux uy To add cs add moveto Tcx uy To add cs add lineto
  Tt setlinewidth stroke
  grestore
} bd
/SOE {
  /Tcx currentpoint pop def
  gsave
  newpath
  cf findfont cs scalefont dup
  /FontMatrix get 0 get /Ts exch def /FontInfo get dup
  /UnderlinePosition get Ts mul /To exch def
  /UnderlineThickness get Ts mul /Tt exch def
  ux uy To add cs 10 mul 26 idiv add moveto Tcx uy To add cs 10 mul 26 idiv add lineto
  Tt setlinewidth stroke
  grestore
} bd
/QT {
/Y22 exch store
/X22 exch store
/Y21 exch store
/X21 exch store
currentpoint
/Y21 load 2 mul add 3 div exch
/X21 load 2 mul add 3 div exch
/X21 load 2 mul /X22 load add 3 div
/Y21 load 2 mul /Y22 load add 3 div
/X22 load /Y22 load curveto
} bd
/SSPD {
dup length /d exch dict def
{
/v exch def
/k exch def
currentpagedevice k known {
/cpdv currentpagedevice k get def
v cpdv ne {
/upd false def
/nullv v type /nulltype eq def
/nullcpdv cpdv type /nulltype eq def
nullv nullcpdv or
{
/upd true def
} {
/sametype v type cpdv type eq def
sametype {
v type /arraytype eq {
/vlen v length def
/cpdvlen cpdv length def
vlen cpdvlen eq {
0 1 vlen 1 sub {
/i exch def
/obj v i get def
/cpdobj cpdv i get def
obj cpdobj ne {
/upd true def
exit
} if
} for
} {
/upd true def
} ifelse
} {
v type /dicttype eq {
v {
/dv exch def
/dk exch def
/cpddv cpdv dk get def
dv cpddv ne {
/upd true def
exit
} if
} forall
} {
/upd true def
} ifelse
} ifelse
} if
} ifelse
upd true eq {
d k v put
} if
} if
} if
} forall
d length 0 gt {
d setpagedevice
} if
} bd
/RE { % /NewFontName [NewEncodingArray] /FontName RE -
  findfont dup length dict begin
  {
    1 index /FID ne
    {def} {pop pop} ifelse
  } forall
  /Encoding exch def
  /FontName 1 index def
  currentdict definefont pop
  end
} bind def
%%EndResource
%%BeginResource: procset (Apache XML Graphics EPS ProcSet) 1.0 0
%%Version: 1.0 0
%%Copyright: (Copyright 2002-2003 The Apache Software Foundation. License terms: http://www.apache.org/licenses/LICENSE-2.0)
/BeginEPSF { %def
/b4_Inc_state save def         % Save state for cleanup
/dict_count countdictstack def % Count objects on dict stack
/op_count count 1 sub def      % Count objects on operand stack
userdict begin                 % Push userdict on dict stack
/showpage { } def              % Redefine showpage, { } = null proc
0 setgray 0 setlinecap         % Prepare graphics state
1 setlinewidth 0 setlinejoin
10 setmiterlimit [ ] 0 setdash newpath
/languagelevel where           % If level not equal to 1 then
{pop languagelevel             % set strokeadjust and
1 ne                           % overprint to their defaults.
{false setstrokeadjust false setoverprint
} if
} if
} bd
/EndEPSF { %def
count op_count sub {pop} repeat            % Clean up stacks
countdictstack dict_count sub {end} repeat
b4_Inc_state restore
} bd
%%EndResource
%FOPBeginFontDict
%%IncludeResource: font Courier-Oblique
%%IncludeResource: font Courier-BoldOblique
%%IncludeResource: font Courier-Bold
%%IncludeResource: font ZapfDingbats
%%IncludeResource: font Symbol
%%IncludeResource: font Helvetica
%%IncludeResource: font Helvetica-Oblique
%%IncludeResource: font Helvetica-Bold
%%IncludeResource: font Helvetica-BoldOblique
%%IncludeResource: font Times-Roman
%%IncludeResource: font Times-Italic
%%IncludeResource: font Times-Bold
%%IncludeResource: font Times-BoldItalic
%%IncludeResource: font Courier
%FOPEndFontDict
%%BeginResource: encoding WinAnsiEncoding
/WinAnsiEncoding [
/.notdef /.notdef /.notdef /.notdef /.notdef
/.notdef /.notdef /.notdef /.notdef /.notdef
/.notdef /.notdef /.notdef /.notdef /.notdef
/.notdef /.notdef /.notdef /.notdef /.notdef
/.notdef /.notdef /.notdef /.notdef /.notdef
/.notdef /.notdef /.notdef /.notdef /.notdef
/.notdef /.notdef /space /exclam /quotedbl
/numbersign /dollar /percent /ampersand /quotesingle
/parenleft /parenright /asterisk /plus /comma
/hyphen /period /slash /zero /one
/two /three /four /five /six
/seven /eight /nine /colon /semicolon
/less /equal /greater /question /at
/A /B /C /D /E
/F /G /H /I /J
/K /L /M /N /O
/P /Q /R /S /T
/U /V /W /X /Y
/Z /bracketleft /backslash /bracketright /asciicircum
/underscore /quoteleft /a /b /c
/d /e /f /g /h
/i /j /k /l /m
/n /o /p /q /r
/s /t /u /v /w
/x /y /z /braceleft /bar
/braceright /asciitilde /bullet /Euro /bullet
/quotesinglbase /florin /quotedblbase /ellipsis /dagger
/daggerdbl /circumflex /perthousand /Scaron /guilsinglleft
/OE /bullet /Zcaron /bullet /bullet
/quoteleft /quoteright /quotedblleft /quotedblright /bullet
/endash /emdash /asciitilde /trademark /scaron
/guilsinglright /oe /bullet /zcaron /Ydieresis
/space /exclamdown /cent /sterling /currency
/yen /brokenbar /section /dieresis /copyright
/ordfeminine /guillemotleft /logicalnot /sfthyphen /registered
/macron /degree /plusminus /twosuperior /threesuperior
/acute /mu /paragraph /middot /cedilla
/onesuperior /ordmasculine /guillemotright /onequarter /onehalf
/threequarters /questiondown /Agrave /Aacute /Acircumflex
/Atilde /Adieresis /Aring /AE /Ccedilla
/Egrave /Eacute /Ecircumflex /Edieresis /Igrave
/Iacute /Icircumflex /Idieresis /Eth /Ntilde
/Ograve /Oacute /Ocircumflex /Otilde /Odieresis
/multiply /Oslash /Ugrave /Uacute /Ucircumflex
/Udieresis /Yacute /Thorn /germandbls /agrave
/aacute /acircumflex /atilde /adieresis /aring
/ae /ccedilla /egrave /eacute /ecircumflex
/edieresis /igrave /iacute /icircumflex /idieresis
/eth /ntilde /ograve /oacute /ocircumflex
/otilde /odieresis /divide /oslash /ugrave
/uacute /ucircumflex /udieresis /yacute /thorn
/ydieresis
] def
%%EndResource
%FOPBeginFontReencode
/Courier-Oblique findfont
dup length dict begin
  {1 index /FID ne {def} {pop pop} ifelse} forall
  /Encoding WinAnsiEncoding def
  currentdict
end
/Courier-Oblique exch definefont pop
/Courier-BoldOblique findfont
dup length dict begin
  {1 index /FID ne {def} {pop pop} ifelse} forall
  /Encoding WinAnsiEncoding def
  currentdict
end
/Courier-BoldOblique exch definefont pop
/Courier-Bold findfont
dup length dict begin
  {1 index /FID ne {def} {pop pop} ifelse} forall
  /Encoding WinAnsiEncoding def
  currentdict
end
/Courier-Bold exch definefont pop
/Helvetica findfont
dup length dict begin
  {1 index /FID ne {def} {pop pop} ifelse} forall
  /Encoding WinAnsiEncoding def
  currentdict
end
/Helvetica exch definefont pop
/Helvetica-Oblique findfont
dup length dict begin
  {1 index /FID ne {def} {pop pop} ifelse} forall
  /Encoding WinAnsiEncoding def
  currentdict
end
/Helvetica-Oblique exch definefont pop
/Helvetica-Bold findfont
dup length dict begin
  {1 index /FID ne {def} {pop pop} ifelse} forall
  /Encoding WinAnsiEncoding def
  currentdict
end
/Helvetica-Bold exch definefont pop
/Helvetica-BoldOblique findfont
dup length dict begin
  {1 index /FID ne {def} {pop pop} ifelse} forall
  /Encoding WinAnsiEncoding def
  currentdict
end
/Helvetica-BoldOblique exch definefont pop
/Times-Roman findfont
dup length dict begin
  {1 index /FID ne {def} {pop pop} ifelse} forall
  /Encoding WinAnsiEncoding def
  currentdict
end
/Times-Roman exch definefont pop
/Times-Italic findfont
dup length dict begin
  {1 index /FID ne {def} {pop pop} ifelse} forall
  /Encoding WinAnsiEncoding def
  currentdict
end
/Times-Italic exch definefont pop
/Times-Bold findfont
dup length dict begin
  {1 index /FID ne {def} {pop pop} ifelse} forall
  /Encoding WinAnsiEncoding def
  currentdict
end
/Times-Bold exch definefont pop
/Times-BoldItalic findfont
dup length dict begin
  {1 index /FID ne {def} {pop pop} ifelse} forall
  /Encoding WinAnsiEncoding def
  currentdict
end
/Times-BoldItalic exch definefont pop
/Courier findfont
dup length dict begin
  {1 index /FID ne {def} {pop pop} ifelse} forall
  /Encoding WinAnsiEncoding def
  currentdict
end
/Courier exch definefont pop
%FOPEndFontReencode
%%EndProlog
%%Page: 1 1
%%PageBoundingBox: 0 0 420 315
%%BeginPageSetup
[1 0 0 -1 0 315] CT
%%EndPageSetup
GS
[0.75 0 0 0.75 0 0] CT
1 GC
N
0 0 560 420 re
f
GR
GS
[0.75 0 0 0.75 0 0] CT
1 GC
N
0 0 560 420 re
f
GR
GS
[0.75 0 0 0.75 0 0] CT
1 GC
N
73 374 M
507 374 L
507 31 L
73 31 L
cp
f
GR
GS
[0.75 0 0 0.75 0 0] CT
0.873 GC
1 LJ
0.667 LW
N
73 374 M
73 31 L
S
GR
GS
[0.75 0 0 0.75 0 0] CT
0.873 GC
1 LJ
0.667 LW
N
159.8 374 M
159.8 31 L
S
GR
GS
[0.75 0 0 0.75 0 0] CT
0.873 GC
1 LJ
0.667 LW
N
246.6 374 M
246.6 31 L
S
GR
GS
[0.75 0 0 0.75 0 0] CT
0.873 GC
1 LJ
0.667 LW
N
333.4 374 M
333.4 31 L
S
GR
GS
[0.75 0 0 0.75 0 0] CT
0.873 GC
1 LJ
0.667 LW
N
420.2 374 M
420.2 31 L
S
GR
GS
[0.75 0 0 0.75 0 0] CT
0.873 GC
1 LJ
0.667 LW
N
507 374 M
507 31 L
S
GR
GS
[0.75 0 0 0.75 0 0] CT
0.873 GC
1 LJ
0.667 LW
N
507 374 M
73 374 L
S
GR
GS
[0.75 0 0 0.75 0 0] CT
0.873 GC
1 LJ
0.667 LW
N
507 316.833 M
73 316.833 L
S
GR
GS
[0.75 0 0 0.75 0 0] CT
0.873 GC
1 LJ
0.667 LW
N
507 259.667 M
73 259.667 L
S
GR
GS
[0.75 0 0 0.75 0 0] CT
0.873 GC
1 LJ
0.667 LW
N
507 202.5 M
73 202.5 L
S
GR
GS
[0.75 0 0 0.75 0 0] CT
0.873 GC
1 LJ
0.667 LW
N
507 145.333 M
73 145.333 L
S
GR
GS
[0.75 0 0 0.75 0 0] CT
0.873 GC
1 LJ
0.667 LW
N
507 88.167 M
73 88.167 L
S
GR
GS
[0.75 0 0 0.75 0 0] CT
0.873 GC
1 LJ
0.667 LW
N
507 31 M
73 31 L
S
GR
GS
[0.75 0 0 0.75 0 0] CT
0.149 GC
2 setlinecap
1 LJ
0.667 LW
N
73 374 M
507 374 L
S
GR
GS
[0.75 0 0 0.75 0 0] CT
0.149 GC
2 setlinecap
1 LJ
0.667 LW
N
73 374 M
73 369.66 L
S
GR
GS
[0.75 0 0 0.75 0 0] CT
0.149 GC
2 setlinecap
1 LJ
0.667 LW
N
159.8 374 M
159.8 369.66 L
S
GR
GS
[0.75 0 0 0.75 0 0] CT
0.149 GC
2 setlinecap
1 LJ
0.667 LW
N
246.6 374 M
246.6 369.66 L
S
GR
GS
[0.75 0 0 0.75 0 0] CT
0.149 GC
2 setlinecap
1 LJ
0.667 LW
N
333.4 374 M
333.4 369.66 L
S
GR
GS
[0.75 0 0 0.75 0 0] CT
0.149 GC
2 setlinecap
1 LJ
0.667 LW
N
420.2 374 M
420.2 369.66 L
S
GR
GS
[0.75 0 0 0.75 0 0] CT
0.149 GC
2 setlinecap
1 LJ
0.667 LW
N
507 374 M
507 369.66 L
S
GR
GS
[0.75 0 0 0.75 54.75 284.50001] CT
0.149 GC
N
-0.083 11.481 M
-1.677 11.481 -2.247 10.169 QT
-2.818 8.856 -2.818 7.059 QT
-2.818 5.919 -2.615 4.927 QT
-2.411 3.934 -1.802 3.239 QT
-1.193 2.544 -0.083 2.544 QT
0.776 2.544 1.323 2.958 QT
1.87 3.372 2.151 4.036 QT
2.432 4.7 2.542 5.458 QT
2.651 6.216 2.651 7.059 QT
2.651 8.169 2.44 9.145 QT
2.229 10.122 1.628 10.802 QT
1.026 11.481 -0.083 11.481 QT
cp
-0.083 11.153 M
0.635 11.153 0.995 10.411 QT
1.354 9.669 1.432 8.762 QT
1.51 7.856 1.51 6.841 QT
1.51 5.872 1.432 5.044 QT
1.354 4.216 1.003 3.544 QT
0.651 2.872 -0.083 2.872 QT
-0.818 2.872 -1.177 3.552 QT
-1.536 4.231 -1.615 5.052 QT
-1.693 5.872 -1.693 6.841 QT
-1.693 7.575 -1.661 8.216 QT
-1.63 8.856 -1.474 9.536 QT
-1.318 10.216 -0.982 10.684 QT
-0.646 11.153 -0.083 11.153 QT
cp
f
GR
GS
[0.75 0 0 0.75 119.85 284.50001] CT
0.149 GC
N
-5.269 11.481 M
-6.862 11.481 -7.433 10.169 QT
-8.003 8.856 -8.003 7.059 QT
-8.003 5.919 -7.8 4.927 QT
-7.597 3.934 -6.987 3.239 QT
-6.378 2.544 -5.269 2.544 QT
-4.409 2.544 -3.862 2.958 QT
-3.315 3.372 -3.034 4.036 QT
-2.753 4.7 -2.644 5.458 QT
-2.534 6.216 -2.534 7.059 QT
-2.534 8.169 -2.745 9.145 QT
-2.956 10.122 -3.558 10.802 QT
-4.159 11.481 -5.269 11.481 QT
cp
-5.269 11.153 M
-4.55 11.153 -4.19 10.411 QT
-3.831 9.669 -3.753 8.762 QT
-3.675 7.856 -3.675 6.841 QT
-3.675 5.872 -3.753 5.044 QT
-3.831 4.216 -4.183 3.544 QT
-4.534 2.872 -5.269 2.872 QT
-6.003 2.872 -6.362 3.552 QT
-6.722 4.231 -6.8 5.052 QT
-6.878 5.872 -6.878 6.841 QT
-6.878 7.575 -6.847 8.216 QT
-6.815 8.856 -6.659 9.536 QT
-6.503 10.216 -6.167 10.684 QT
-5.831 11.153 -5.269 11.153 QT
cp
f
GR
GS
[0.75 0 0 0.75 119.85 284.50001] CT
0.149 GC
N
-0.758 10.481 M
-0.758 10.184 -0.539 9.981 QT
-0.321 9.778 -0.039 9.778 QT
0.133 9.778 0.304 9.872 QT
0.476 9.966 0.57 10.137 QT
0.664 10.309 0.664 10.481 QT
0.664 10.762 0.453 10.981 QT
0.242 11.2 -0.039 11.2 QT
-0.321 11.2 -0.539 10.981 QT
-0.758 10.762 -0.758 10.481 QT
cp
f
GR
GS
[0.75 0 0 0.75 119.85 284.50001] CT
0.149 GC
N
2.492 11.2 M
2.492 10.856 L
2.492 10.825 2.524 10.778 QT
4.539 8.544 L
5.008 8.044 5.289 7.708 QT
5.571 7.372 5.852 6.934 QT
6.133 6.497 6.297 6.044 QT
6.461 5.591 6.461 5.091 QT
6.461 4.559 6.258 4.067 QT
6.055 3.575 5.664 3.286 QT
5.274 2.997 4.727 2.997 QT
4.164 2.997 3.711 3.341 QT
3.258 3.684 3.071 4.216 QT
3.133 4.2 3.211 4.2 QT
3.508 4.2 3.711 4.395 QT
3.914 4.591 3.914 4.903 QT
3.914 5.2 3.711 5.411 QT
3.508 5.622 3.211 5.622 QT
2.914 5.622 2.703 5.411 QT
2.492 5.2 2.492 4.903 QT
2.492 4.419 2.68 3.989 QT
2.867 3.559 3.211 3.231 QT
3.555 2.903 3.992 2.723 QT
4.43 2.544 4.914 2.544 QT
5.664 2.544 6.305 2.856 QT
6.946 3.169 7.321 3.747 QT
7.696 4.325 7.696 5.091 QT
7.696 5.653 7.446 6.161 QT
7.196 6.669 6.813 7.083 QT
6.43 7.497 5.821 8.028 QT
5.211 8.559 5.024 8.731 QT
3.555 10.153 L
4.805 10.153 L
5.727 10.153 6.344 10.137 QT
6.961 10.122 6.992 10.075 QT
7.149 9.919 7.305 8.887 QT
7.696 8.887 L
7.321 11.2 L
2.492 11.2 L
cp
f
GR
GS
[0.75 0 0 0.75 184.95 284.50001] CT
0.149 GC
N
/f42842187{-5.269 11.481 M
-6.862 11.481 -7.433 10.169 QT
-8.003 8.856 -8.003 7.059 QT
-8.003 5.919 -7.8 4.927 QT
-7.597 3.934 -6.987 3.239 QT
-6.378 2.544 -5.269 2.544 QT
-4.409 2.544 -3.862 2.958 QT
-3.315 3.372 -3.034 4.036 QT
-2.753 4.7 -2.644 5.458 QT
-2.534 6.216 -2.534 7.059 QT
-2.534 8.169 -2.745 9.145 QT
-2.956 10.122 -3.558 10.802 QT
-4.159 11.481 -5.269 11.481 QT
cp
-5.269 11.153 M
-4.55 11.153 -4.19 10.411 QT
-3.831 9.669 -3.753 8.762 QT
-3.675 7.856 -3.675 6.841 QT
-3.675 5.872 -3.753 5.044 QT
-3.831 4.216 -4.183 3.544 QT
-4.534 2.872 -5.269 2.872 QT
-6.003 2.872 -6.362 3.552 QT
-6.722 4.231 -6.8 5.052 QT
-6.878 5.872 -6.878 6.841 QT
-6.878 7.575 -6.847 8.216 QT
-6.815 8.856 -6.659 9.536 QT
-6.503 10.216 -6.167 10.684 QT
-5.831 11.153 -5.269 11.153 QT
cp}def
f42842187
f
GR
GS
[0.75 0 0 0.75 184.95 284.50001] CT
0.149 GC
N
/f-1562952851{-0.758 10.481 M
-0.758 10.184 -0.539 9.981 QT
-0.321 9.778 -0.039 9.778 QT
0.133 9.778 0.304 9.872 QT
0.476 9.966 0.57 10.137 QT
0.664 10.309 0.664 10.481 QT
0.664 10.762 0.453 10.981 QT
0.242 11.2 -0.039 11.2 QT
-0.321 11.2 -0.539 10.981 QT
-0.758 10.762 -0.758 10.481 QT
cp}def
f-1562952851
f
GR
GS
[0.75 0 0 0.75 184.95 284.50001] CT
0.149 GC
N
/f-789665990{2.211 9.059 M
2.211 8.591 L
6.227 2.606 L
6.274 2.544 6.367 2.544 QT
6.555 2.544 L
6.696 2.544 6.696 2.684 QT
6.696 8.591 L
7.977 8.591 L
7.977 9.059 L
6.696 9.059 L
6.696 10.325 L
6.696 10.591 7.078 10.669 QT
7.461 10.747 7.961 10.747 QT
7.961 11.2 L
4.383 11.2 L
4.383 10.747 L
4.883 10.747 5.266 10.669 QT
5.649 10.591 5.649 10.325 QT
5.649 9.059 L
2.211 9.059 L
cp
2.649 8.591 M
5.727 8.591 L
5.727 3.997 L
2.649 8.591 L
cp}def
f-789665990
f
GR
GS
[0.75 0 0 0.75 250.05002 284.50001] CT
0.149 GC
N
f42842187
f
GR
GS
[0.75 0 0 0.75 250.05002 284.50001] CT
0.149 GC
N
f-1562952851
f
GR
GS
[0.75 0 0 0.75 250.05002 284.50001] CT
0.149 GC
N
/f-1079660156{5.102 11.481 M
4.289 11.481 3.75 11.052 QT
3.211 10.622 2.922 9.942 QT
2.633 9.262 2.516 8.512 QT
2.399 7.762 2.399 6.997 QT
2.399 5.966 2.797 4.934 QT
3.196 3.903 3.977 3.223 QT
4.758 2.544 5.821 2.544 QT
6.258 2.544 6.649 2.708 QT
7.039 2.872 7.258 3.2 QT
7.477 3.528 7.477 3.997 QT
7.477 4.262 7.289 4.442 QT
7.102 4.622 6.836 4.622 QT
6.586 4.622 6.407 4.442 QT
6.227 4.262 6.227 3.997 QT
6.227 3.747 6.407 3.559 QT
6.586 3.372 6.836 3.372 QT
6.914 3.372 L
6.742 3.137 6.446 3.028 QT
6.149 2.919 5.821 2.919 QT
5.43 2.919 5.094 3.091 QT
4.758 3.262 4.492 3.552 QT
4.227 3.841 4.047 4.192 QT
3.867 4.544 3.774 4.997 QT
3.68 5.45 3.649 5.841 QT
3.617 6.231 3.617 6.825 QT
3.852 6.294 4.274 5.958 QT
4.696 5.622 5.211 5.622 QT
5.789 5.622 6.266 5.856 QT
6.742 6.091 7.086 6.505 QT
7.43 6.919 7.61 7.45 QT
7.789 7.981 7.789 8.528 QT
7.789 9.294 7.453 9.981 QT
7.117 10.669 6.5 11.075 QT
5.883 11.481 5.102 11.481 QT
cp
5.102 11.075 M
5.602 11.075 5.907 10.848 QT
6.211 10.622 6.352 10.239 QT
6.492 9.856 6.532 9.473 QT
6.571 9.091 6.571 8.528 QT
6.571 7.794 6.5 7.278 QT
6.43 6.762 6.117 6.364 QT
5.805 5.966 5.164 5.966 QT
4.633 5.966 4.297 6.317 QT
3.961 6.669 3.805 7.216 QT
3.649 7.762 3.649 8.262 QT
3.649 8.434 3.664 8.528 QT
3.664 8.544 3.657 8.552 QT
3.649 8.559 3.649 8.591 QT
3.649 9.137 3.766 9.708 QT
3.883 10.278 4.203 10.677 QT
4.524 11.075 5.102 11.075 QT
cp}def
f-1079660156
f
GR
GS
[0.75 0 0 0.75 315.15001 284.50001] CT
0.149 GC
N
f42842187
f
GR
GS
[0.75 0 0 0.75 315.15001 284.50001] CT
0.149 GC
N
f-1562952851
f
GR
GS
[0.75 0 0 0.75 315.15001 284.50001] CT
0.149 GC
N
/f-1131117543{2.399 9.231 M
2.399 8.45 2.914 7.848 QT
3.43 7.247 4.227 6.841 QT
3.742 6.528 L
3.305 6.247 3.024 5.762 QT
2.742 5.278 2.742 4.731 QT
2.742 4.122 3.071 3.614 QT
3.399 3.106 3.946 2.825 QT
4.492 2.544 5.102 2.544 QT
5.68 2.544 6.219 2.778 QT
6.758 3.012 7.102 3.45 QT
7.446 3.887 7.446 4.497 QT
7.446 4.934 7.242 5.309 QT
7.039 5.684 6.68 5.981 QT
6.321 6.278 5.914 6.481 QT
6.649 6.966 L
7.164 7.294 7.477 7.841 QT
7.789 8.387 7.789 8.997 QT
7.789 9.7 7.414 10.278 QT
7.039 10.856 6.414 11.169 QT
5.789 11.481 5.102 11.481 QT
4.43 11.481 3.805 11.208 QT
3.18 10.934 2.789 10.419 QT
2.399 9.903 2.399 9.231 QT
cp
3.102 9.231 M
3.102 9.747 3.383 10.169 QT
3.664 10.591 4.133 10.833 QT
4.602 11.075 5.102 11.075 QT
5.852 11.075 6.469 10.63 QT
7.086 10.184 7.086 9.466 QT
7.086 9.216 6.992 8.973 QT
6.899 8.731 6.719 8.528 QT
6.539 8.325 6.321 8.2 QT
4.586 7.075 L
4.18 7.278 3.836 7.614 QT
3.492 7.95 3.297 8.356 QT
3.102 8.762 3.102 9.231 QT
cp
3.992 5.262 M
5.571 6.278 L
6.117 5.95 6.469 5.505 QT
6.821 5.059 6.821 4.497 QT
6.821 4.059 6.571 3.692 QT
6.321 3.325 5.93 3.122 QT
5.539 2.919 5.086 2.919 QT
4.696 2.919 4.297 3.067 QT
3.899 3.216 3.641 3.52 QT
3.383 3.825 3.383 4.231 QT
3.383 4.841 3.992 5.262 QT
cp}def
f-1131117543
f
GR
GS
[0.75 0 0 0.75 380.25 284.50001] CT
0.149 GC
N
/f-1136517822{-2.13 11.2 M
-2.13 10.747 L
-0.505 10.747 -0.505 10.325 QT
-0.505 3.512 L
-1.177 3.825 -2.208 3.825 QT
-2.208 3.372 L
-0.615 3.372 0.198 2.544 QT
0.385 2.544 L
0.432 2.544 0.471 2.575 QT
0.51 2.606 0.51 2.653 QT
0.51 10.325 L
0.51 10.747 2.135 10.747 QT
2.135 11.2 L
-2.13 11.2 L
cp}def
f-1136517822
f
GR
GS
[0.75 0 0 0.75 217.50016 297.49999] CT
0.149 GC
N
/f155634886{-53.421 12.32 M
-53.421 11.789 L
-51.874 11.789 -51.874 11.32 QT
-51.874 3.07 L
-51.874 2.601 -53.421 2.601 QT
-53.421 2.07 L
-48.077 2.07 L
-47.264 2.07 -46.444 2.406 QT
-45.624 2.742 -45.092 3.39 QT
-44.561 4.039 -44.561 4.898 QT
-44.561 5.726 -45.092 6.359 QT
-45.624 6.992 -46.436 7.312 QT
-47.249 7.632 -48.077 7.632 QT
-50.483 7.632 L
-50.483 11.32 L
-50.483 11.789 -48.936 11.789 QT
-48.936 12.32 L
-53.421 12.32 L
cp
-50.53 7.195 M
-48.499 7.195 L
-47.671 7.195 -47.155 6.953 QT
-46.639 6.711 -46.405 6.211 QT
-46.171 5.711 -46.171 4.898 QT
-46.171 3.664 -46.702 3.132 QT
-47.233 2.601 -48.499 2.601 QT
-49.764 2.601 L
-50.046 2.601 -50.194 2.625 QT
-50.342 2.648 -50.436 2.75 QT
-50.53 2.851 -50.53 3.07 QT
-50.53 7.195 L
cp}def
f155634886
f
GR
GS
[0.75 0 0 0.75 217.50016 297.49999] CT
0.149 GC
N
/f1261371238{-43.47 12.32 M
-43.47 11.789 L
-42.97 11.789 -42.634 11.711 QT
-42.298 11.632 -42.298 11.32 QT
-42.298 3.445 L
-42.298 3.039 -42.423 2.859 QT
-42.548 2.679 -42.775 2.64 QT
-43.001 2.601 -43.47 2.601 QT
-43.47 2.07 L
-41.251 1.914 L
-41.251 11.32 L
-41.251 11.632 -40.923 11.711 QT
-40.595 11.789 -40.08 11.789 QT
-40.08 12.32 L
-43.47 12.32 L
cp}def
f1261371238
f
GR
GS
[0.75 0 0 0.75 217.50016 297.49999] CT
0.149 GC
N
/f-1709183727{-39.271 10.851 M
-39.271 9.961 -38.568 9.398 QT
-37.865 8.836 -36.873 8.601 QT
-35.881 8.367 -35.006 8.367 QT
-35.006 7.757 L
-35.006 7.32 -35.193 6.914 QT
-35.381 6.507 -35.74 6.25 QT
-36.099 5.992 -36.537 5.992 QT
-37.521 5.992 -38.052 6.445 QT
-37.756 6.445 -37.576 6.656 QT
-37.396 6.867 -37.396 7.164 QT
-37.396 7.461 -37.607 7.672 QT
-37.818 7.882 -38.099 7.882 QT
-38.412 7.882 -38.623 7.672 QT
-38.834 7.461 -38.834 7.164 QT
-38.834 6.367 -38.115 5.984 QT
-37.396 5.601 -36.537 5.601 QT
-35.927 5.601 -35.31 5.859 QT
-34.693 6.117 -34.302 6.601 QT
-33.912 7.086 -33.912 7.726 QT
-33.912 11.101 L
-33.912 11.398 -33.787 11.64 QT
-33.662 11.882 -33.396 11.882 QT
-33.146 11.882 -33.029 11.632 QT
-32.912 11.382 -32.912 11.101 QT
-32.912 10.148 L
-32.474 10.148 L
-32.474 11.101 L
-32.474 11.445 -32.646 11.75 QT
-32.818 12.054 -33.115 12.234 QT
-33.412 12.414 -33.756 12.414 QT
-34.193 12.414 -34.513 12.07 QT
-34.834 11.726 -34.865 11.257 QT
-35.146 11.82 -35.685 12.156 QT
-36.224 12.492 -36.849 12.492 QT
-37.412 12.492 -37.966 12.32 QT
-38.521 12.148 -38.896 11.789 QT
-39.271 11.429 -39.271 10.851 QT
cp
-38.052 10.851 M
-38.052 11.382 -37.662 11.734 QT
-37.271 12.086 -36.74 12.086 QT
-36.256 12.086 -35.865 11.851 QT
-35.474 11.617 -35.24 11.195 QT
-35.006 10.773 -35.006 10.32 QT
-35.006 8.757 L
-35.677 8.757 -36.396 8.976 QT
-37.115 9.195 -37.584 9.672 QT
-38.052 10.148 -38.052 10.851 QT
cp}def
f-1709183727
f
GR
GS
[0.75 0 0 0.75 217.50016 297.49999] CT
0.149 GC
N
/f1986819592{-32.078 12.32 M
-32.078 11.789 L
-31.578 11.789 -31.242 11.711 QT
-30.907 11.632 -30.907 11.32 QT
-30.907 7.226 L
-30.907 6.82 -31.032 6.64 QT
-31.157 6.461 -31.383 6.422 QT
-31.61 6.382 -32.078 6.382 QT
-32.078 5.851 L
-29.907 5.695 L
-29.907 7.164 L
-29.61 6.507 -29.016 6.101 QT
-28.422 5.695 -27.735 5.695 QT
-26.688 5.695 -26.164 6.195 QT
-25.641 6.695 -25.641 7.711 QT
-25.641 11.32 L
-25.641 11.632 -25.313 11.711 QT
-24.985 11.789 -24.469 11.789 QT
-24.469 12.32 L
-27.907 12.32 L
-27.907 11.789 L
-27.391 11.789 -27.063 11.711 QT
-26.735 11.632 -26.735 11.32 QT
-26.735 7.757 L
-26.735 7.023 -26.946 6.554 QT
-27.157 6.086 -27.828 6.086 QT
-28.688 6.086 -29.25 6.781 QT
-29.813 7.476 -29.813 8.351 QT
-29.813 11.32 L
-29.813 11.632 -29.485 11.711 QT
-29.157 11.789 -28.657 11.789 QT
-28.657 12.32 L
-32.078 12.32 L
cp}def
f1986819592
f
GR
GS
[0.75 0 0 0.75 217.50016 297.49999] CT
0.149 GC
N
/f-846006003{-23.93 12.32 M
-23.93 11.789 L
-23.43 11.789 -23.094 11.711 QT
-22.758 11.632 -22.758 11.32 QT
-22.758 7.226 L
-22.758 6.82 -22.883 6.64 QT
-23.008 6.461 -23.235 6.422 QT
-23.462 6.382 -23.93 6.382 QT
-23.93 5.851 L
-21.758 5.695 L
-21.758 7.164 L
-21.462 6.507 -20.868 6.101 QT
-20.274 5.695 -19.587 5.695 QT
-18.54 5.695 -18.016 6.195 QT
-17.493 6.695 -17.493 7.711 QT
-17.493 11.32 L
-17.493 11.632 -17.165 11.711 QT
-16.837 11.789 -16.321 11.789 QT
-16.321 12.32 L
-19.758 12.32 L
-19.758 11.789 L
-19.243 11.789 -18.915 11.711 QT
-18.587 11.632 -18.587 11.32 QT
-18.587 7.757 L
-18.587 7.023 -18.797 6.554 QT
-19.008 6.086 -19.68 6.086 QT
-20.54 6.086 -21.102 6.781 QT
-21.665 7.476 -21.665 8.351 QT
-21.665 11.32 L
-21.665 11.632 -21.337 11.711 QT
-21.008 11.789 -20.508 11.789 QT
-20.508 12.32 L
-23.93 12.32 L
cp}def
f-846006003
f
GR
GS
[0.75 0 0 0.75 217.50016 297.49999] CT
0.149 GC
N
/f-2050123754{-15.766 12.32 M
-15.766 11.789 L
-15.266 11.789 -14.931 11.711 QT
-14.595 11.632 -14.595 11.32 QT
-14.595 7.226 L
-14.595 6.648 -14.821 6.515 QT
-15.048 6.382 -15.704 6.382 QT
-15.704 5.851 L
-13.548 5.695 L
-13.548 11.32 L
-13.548 11.632 -13.259 11.711 QT
-12.97 11.789 -12.501 11.789 QT
-12.501 12.32 L
-15.766 12.32 L
cp
-15.141 3.117 M
-15.141 2.789 -14.891 2.539 QT
-14.641 2.289 -14.313 2.289 QT
-14.11 2.289 -13.907 2.398 QT
-13.704 2.507 -13.595 2.703 QT
-13.485 2.898 -13.485 3.117 QT
-13.485 3.429 -13.735 3.679 QT
-13.985 3.929 -14.313 3.929 QT
-14.641 3.929 -14.891 3.679 QT
-15.141 3.429 -15.141 3.117 QT
cp}def
f-2050123754
f
GR
GS
[0.75 0 0 0.75 217.50016 297.49999] CT
0.149 GC
N
/f-950638345{-11.708 12.32 M
-11.708 11.789 L
-11.208 11.789 -10.872 11.711 QT
-10.536 11.632 -10.536 11.32 QT
-10.536 7.226 L
-10.536 6.82 -10.661 6.64 QT
-10.786 6.461 -11.013 6.422 QT
-11.239 6.382 -11.708 6.382 QT
-11.708 5.851 L
-9.536 5.695 L
-9.536 7.164 L
-9.239 6.507 -8.645 6.101 QT
-8.052 5.695 -7.364 5.695 QT
-6.317 5.695 -5.794 6.195 QT
-5.27 6.695 -5.27 7.711 QT
-5.27 11.32 L
-5.27 11.632 -4.942 11.711 QT
-4.614 11.789 -4.099 11.789 QT
-4.099 12.32 L
-7.536 12.32 L
-7.536 11.789 L
-7.02 11.789 -6.692 11.711 QT
-6.364 11.632 -6.364 11.32 QT
-6.364 7.757 L
-6.364 7.023 -6.575 6.554 QT
-6.786 6.086 -7.458 6.086 QT
-8.317 6.086 -8.88 6.781 QT
-9.442 7.476 -9.442 8.351 QT
-9.442 11.32 L
-9.442 11.632 -9.114 11.711 QT
-8.786 11.789 -8.286 11.789 QT
-8.286 12.32 L
-11.708 12.32 L
cp}def
f-950638345
f
GR
GS
[0.75 0 0 0.75 217.50016 297.49999] CT
0.149 GC
N
/f-1242814656{-3.591 13.492 M
-3.591 12.961 -3.208 12.562 QT
-2.825 12.164 -2.279 11.992 QT
-2.591 11.757 -2.747 11.414 QT
-2.904 11.07 -2.904 10.679 QT
-2.904 9.976 -2.45 9.445 QT
-3.138 8.773 -3.138 7.898 QT
-3.138 7.429 -2.935 7.015 QT
-2.732 6.601 -2.372 6.304 QT
-2.013 6.007 -1.575 5.851 QT
-1.138 5.695 -0.685 5.695 QT
0.206 5.695 0.925 6.211 QT
1.237 5.882 1.659 5.703 QT
2.081 5.523 2.534 5.523 QT
2.846 5.523 3.05 5.757 QT
3.253 5.992 3.253 6.304 QT
3.253 6.492 3.12 6.632 QT
2.987 6.773 2.8 6.773 QT
2.612 6.773 2.471 6.632 QT
2.331 6.492 2.331 6.304 QT
2.331 6.023 2.518 5.914 QT
1.737 5.914 1.175 6.461 QT
1.456 6.726 1.62 7.117 QT
1.784 7.507 1.784 7.898 QT
1.784 8.539 1.432 9.047 QT
1.081 9.554 0.503 9.836 QT
-0.075 10.117 -0.685 10.117 QT
-1.497 10.117 -2.185 9.664 QT
-2.388 9.961 -2.388 10.32 QT
-2.388 10.726 -2.13 11.023 QT
-1.872 11.32 -1.482 11.32 QT
-0.247 11.32 L
0.643 11.32 1.362 11.476 QT
2.081 11.632 2.565 12.117 QT
3.05 12.601 3.05 13.492 QT
3.05 14.148 2.495 14.586 QT
1.94 15.023 1.167 15.218 QT
0.393 15.414 -0.263 15.414 QT
-0.935 15.414 -1.708 15.218 QT
-2.482 15.023 -3.036 14.586 QT
-3.591 14.148 -3.591 13.492 QT
cp
-2.747 13.492 M
-2.747 13.992 -2.341 14.336 QT
-1.935 14.679 -1.357 14.843 QT
-0.779 15.007 -0.263 15.007 QT
0.237 15.007 0.815 14.843 QT
1.393 14.679 1.8 14.336 QT
2.206 13.992 2.206 13.492 QT
2.206 12.711 1.495 12.476 QT
0.784 12.242 -0.247 12.242 QT
-1.482 12.242 L
-1.825 12.242 -2.115 12.406 QT
-2.404 12.57 -2.575 12.867 QT
-2.747 13.164 -2.747 13.492 QT
cp
-0.685 9.711 M
0.596 9.711 0.596 7.898 QT
0.596 7.117 0.323 6.609 QT
0.05 6.101 -0.685 6.101 QT
-1.419 6.101 -1.685 6.609 QT
-1.95 7.117 -1.95 7.898 QT
-1.95 8.398 -1.849 8.797 QT
-1.747 9.195 -1.474 9.453 QT
-1.2 9.711 -0.685 9.711 QT
cp}def
f-1242814656
f
GR
GS
[0.75 0 0 0.75 217.50016 297.49999] CT
0.149 GC
N
/f-1103503373{9.741 10.523 M
9.741 6.382 L
8.491 6.382 L
8.491 5.992 L
9.475 5.992 9.936 5.078 QT
10.397 4.164 10.397 3.086 QT
10.834 3.086 L
10.834 5.851 L
12.944 5.851 L
12.944 6.382 L
10.834 6.382 L
10.834 10.492 L
10.834 11.117 11.045 11.586 QT
11.256 12.054 11.787 12.054 QT
12.303 12.054 12.53 11.554 QT
12.756 11.054 12.756 10.492 QT
12.756 9.601 L
13.194 9.601 L
13.194 10.523 L
13.194 10.992 13.022 11.445 QT
12.85 11.898 12.514 12.195 QT
12.178 12.492 11.694 12.492 QT
10.787 12.492 10.264 11.953 QT
9.741 11.414 9.741 10.523 QT
cp}def
f-1103503373
f
GR
GS
[0.75 0 0 0.75 217.50016 297.49999] CT
0.149 GC
N
/f-1897526652{14.382 12.32 M
14.382 11.789 L
14.882 11.789 15.218 11.711 QT
15.554 11.632 15.554 11.32 QT
15.554 7.226 L
15.554 6.648 15.327 6.515 QT
15.101 6.382 14.444 6.382 QT
14.444 5.851 L
16.601 5.695 L
16.601 11.32 L
16.601 11.632 16.89 11.711 QT
17.179 11.789 17.647 11.789 QT
17.647 12.32 L
14.382 12.32 L
cp
15.007 3.117 M
15.007 2.789 15.257 2.539 QT
15.507 2.289 15.835 2.289 QT
16.038 2.289 16.241 2.398 QT
16.444 2.507 16.554 2.703 QT
16.663 2.898 16.663 3.117 QT
16.663 3.429 16.413 3.679 QT
16.163 3.929 15.835 3.929 QT
15.507 3.929 15.257 3.679 QT
15.007 3.429 15.007 3.117 QT
cp}def
f-1897526652
f
GR
GS
[0.75 0 0 0.75 217.50016 297.49999] CT
0.149 GC
N
/f-1128640668{18.44 12.32 M
18.44 11.789 L
18.94 11.789 19.276 11.711 QT
19.612 11.632 19.612 11.32 QT
19.612 7.226 L
19.612 6.82 19.487 6.64 QT
19.362 6.461 19.136 6.422 QT
18.909 6.382 18.44 6.382 QT
18.44 5.851 L
20.612 5.695 L
20.612 7.164 L
20.909 6.507 21.503 6.101 QT
22.096 5.695 22.784 5.695 QT
24.518 5.695 24.815 7.101 QT
25.112 6.461 25.69 6.078 QT
26.268 5.695 26.956 5.695 QT
27.643 5.695 28.104 5.914 QT
28.565 6.132 28.8 6.586 QT
29.034 7.039 29.034 7.711 QT
29.034 11.32 L
29.034 11.632 29.37 11.711 QT
29.706 11.789 30.206 11.789 QT
30.206 12.32 L
26.784 12.32 L
26.784 11.789 L
27.284 11.789 27.62 11.711 QT
27.956 11.632 27.956 11.32 QT
27.956 7.757 L
27.956 7.007 27.737 6.547 QT
27.518 6.086 26.862 6.086 QT
26.003 6.086 25.44 6.781 QT
24.878 7.476 24.878 8.351 QT
24.878 11.32 L
24.878 11.632 25.206 11.711 QT
25.534 11.789 26.05 11.789 QT
26.05 12.32 L
22.612 12.32 L
22.612 11.789 L
23.128 11.789 23.456 11.711 QT
23.784 11.632 23.784 11.32 QT
23.784 7.757 L
23.784 7.023 23.573 6.554 QT
23.362 6.086 22.69 6.086 QT
21.831 6.086 21.268 6.781 QT
20.706 7.476 20.706 8.351 QT
20.706 11.32 L
20.706 11.632 21.034 11.711 QT
21.362 11.789 21.862 11.789 QT
21.862 12.32 L
18.44 12.32 L
cp}def
f-1128640668
f
GR
GS
[0.75 0 0 0.75 217.50016 297.49999] CT
0.149 GC
N
/f-722817047{33.944 12.492 M
33.022 12.492 32.264 12.007 QT
31.506 11.523 31.069 10.726 QT
30.631 9.929 30.631 9.039 QT
30.631 8.148 31.03 7.359 QT
31.428 6.57 32.139 6.086 QT
32.85 5.601 33.725 5.601 QT
34.428 5.601 34.936 5.828 QT
35.444 6.054 35.772 6.468 QT
36.1 6.882 36.264 7.437 QT
36.428 7.992 36.428 8.664 QT
36.428 8.851 36.287 8.851 QT
31.944 8.851 L
31.944 9.023 L
31.944 10.257 32.444 11.156 QT
32.944 12.054 34.084 12.054 QT
34.537 12.054 34.928 11.843 QT
35.319 11.632 35.608 11.273 QT
35.897 10.914 36.006 10.492 QT
36.022 10.445 36.061 10.398 QT
36.1 10.351 36.147 10.351 QT
36.287 10.351 L
36.428 10.351 36.428 10.554 QT
36.225 11.398 35.522 11.945 QT
34.819 12.492 33.944 12.492 QT
cp
31.959 8.476 M
35.366 8.476 L
35.366 7.914 35.209 7.336 QT
35.053 6.757 34.686 6.375 QT
34.319 5.992 33.725 5.992 QT
32.881 5.992 32.42 6.789 QT
31.959 7.586 31.959 8.476 QT
cp}def
f-722817047
f
GR
GS
[0.75 0 0 0.75 217.50016 297.49999] CT
0.149 GC
N
/f296502512{41.384 16.039 M
40.54 15.382 39.939 14.531 QT
39.337 13.679 38.954 12.711 QT
38.572 11.742 38.376 10.687 QT
38.181 9.632 38.181 8.57 QT
38.181 7.492 38.376 6.437 QT
38.572 5.382 38.962 4.406 QT
39.353 3.429 39.962 2.586 QT
40.572 1.742 41.384 1.101 QT
41.384 1.07 41.447 1.07 QT
41.587 1.07 L
41.634 1.07 41.673 1.109 QT
41.712 1.148 41.712 1.195 QT
41.712 1.273 41.681 1.304 QT
40.947 2.007 40.462 2.828 QT
39.978 3.648 39.681 4.578 QT
39.384 5.507 39.251 6.5 QT
39.118 7.492 39.118 8.57 QT
39.118 13.336 41.665 15.82 QT
41.712 15.851 41.712 15.945 QT
41.712 15.976 41.673 16.023 QT
41.634 16.07 41.587 16.07 QT
41.447 16.07 L
41.384 16.07 41.384 16.039 QT
cp}def
f296502512
f
GR
GS
[0.75 0 0 0.75 217.50016 297.49999] CT
0.149 GC
N
/f-984119629{42.932 12.367 M
42.932 9.914 L
42.932 9.804 43.057 9.804 QT
43.244 9.804 L
43.338 9.804 43.369 9.914 QT
43.775 12.086 45.385 12.086 QT
46.088 12.086 46.572 11.765 QT
47.057 11.445 47.057 10.773 QT
47.057 10.289 46.682 9.953 QT
46.307 9.617 45.791 9.492 QT
44.791 9.289 L
44.291 9.179 43.877 8.953 QT
43.463 8.726 43.197 8.351 QT
42.932 7.976 42.932 7.476 QT
42.932 6.804 43.275 6.39 QT
43.619 5.976 44.182 5.789 QT
44.744 5.601 45.385 5.601 QT
46.15 5.601 46.728 6.007 QT
47.15 5.632 L
47.15 5.601 47.228 5.601 QT
47.338 5.601 L
47.385 5.601 47.424 5.64 QT
47.463 5.679 47.463 5.726 QT
47.463 7.679 L
47.463 7.82 47.338 7.82 QT
47.15 7.82 L
47.025 7.82 47.025 7.679 QT
47.025 6.898 46.588 6.422 QT
46.15 5.945 45.369 5.945 QT
44.697 5.945 44.205 6.195 QT
43.713 6.445 43.713 7.054 QT
43.713 7.476 44.064 7.742 QT
44.416 8.007 44.9 8.117 QT
45.916 8.32 L
46.416 8.429 46.861 8.711 QT
47.307 8.992 47.564 9.414 QT
47.822 9.836 47.822 10.367 QT
47.822 10.914 47.643 11.312 QT
47.463 11.711 47.127 11.976 QT
46.791 12.242 46.338 12.367 QT
45.885 12.492 45.385 12.492 QT
44.447 12.492 43.775 11.851 QT
43.228 12.445 L
43.228 12.492 43.15 12.492 QT
43.057 12.492 L
42.932 12.492 42.932 12.367 QT
cp}def
f-984119629
f
GR
GS
[0.75 0 0 0.75 217.50016 297.49999] CT
0.149 GC
N
/f1531609816{49.186 16.07 M
49.061 16.07 49.061 15.945 QT
49.061 15.867 49.092 15.836 QT
51.654 13.336 51.654 8.57 QT
51.654 3.804 49.123 1.32 QT
49.061 1.289 49.061 1.195 QT
49.061 1.148 49.1 1.109 QT
49.139 1.07 49.186 1.07 QT
49.326 1.07 L
49.373 1.07 49.404 1.101 QT
50.482 1.945 51.201 3.164 QT
51.92 4.382 52.248 5.757 QT
52.576 7.132 52.576 8.57 QT
52.576 9.632 52.396 10.664 QT
52.217 11.695 51.826 12.695 QT
51.436 13.695 50.834 14.539 QT
50.232 15.382 49.404 16.039 QT
49.373 16.07 49.326 16.07 QT
49.186 16.07 L
cp}def
f1531609816
f
GR
GS
[0.75 0 0 0.75 0 0] CT
0.149 GC
2 setlinecap
1 LJ
0.667 LW
N
73 374 M
73 31 L
S
GR
GS
[0.75 0 0 0.75 0 0] CT
0.149 GC
2 setlinecap
1 LJ
0.667 LW
N
73 374 M
77.34 374 L
S
GR
GS
[0.75 0 0 0.75 0 0] CT
0.149 GC
2 setlinecap
1 LJ
0.667 LW
N
73 316.833 M
77.34 316.833 L
S
GR
GS
[0.75 0 0 0.75 0 0] CT
0.149 GC
2 setlinecap
1 LJ
0.667 LW
N
73 259.667 M
77.34 259.667 L
S
GR
GS
[0.75 0 0 0.75 0 0] CT
0.149 GC
2 setlinecap
1 LJ
0.667 LW
N
73 202.5 M
77.34 202.5 L
S
GR
GS
[0.75 0 0 0.75 0 0] CT
0.149 GC
2 setlinecap
1 LJ
0.667 LW
N
73 145.333 M
77.34 145.333 L
S
GR
GS
[0.75 0 0 0.75 0 0] CT
0.149 GC
2 setlinecap
1 LJ
0.667 LW
N
73 88.167 M
77.34 88.167 L
S
GR
GS
[0.75 0 0 0.75 0 0] CT
0.149 GC
2 setlinecap
1 LJ
0.667 LW
N
73 31 M
77.34 31 L
S
GR
GS
[0.75 0 0 0.75 50.75 280.5] CT
0.149 GC
N
/f-2026418800{-3.417 3.481 M
-5.01 3.481 -5.581 2.169 QT
-6.151 0.856 -6.151 -0.941 QT
-6.151 -2.081 -5.948 -3.073 QT
-5.745 -4.066 -5.135 -4.761 QT
-4.526 -5.456 -3.417 -5.456 QT
-2.557 -5.456 -2.01 -5.042 QT
-1.464 -4.628 -1.182 -3.964 QT
-0.901 -3.3 -0.792 -2.542 QT
-0.682 -1.784 -0.682 -0.941 QT
-0.682 0.169 -0.893 1.145 QT
-1.104 2.122 -1.706 2.802 QT
-2.307 3.481 -3.417 3.481 QT
cp
-3.417 3.153 M
-2.698 3.153 -2.339 2.411 QT
-1.979 1.669 -1.901 0.762 QT
-1.823 -0.144 -1.823 -1.159 QT
-1.823 -2.128 -1.901 -2.956 QT
-1.979 -3.784 -2.331 -4.456 QT
-2.682 -5.128 -3.417 -5.128 QT
-4.151 -5.128 -4.51 -4.448 QT
-4.87 -3.769 -4.948 -2.948 QT
-5.026 -2.128 -5.026 -1.159 QT
-5.026 -0.425 -4.995 0.216 QT
-4.964 0.856 -4.807 1.536 QT
-4.651 2.216 -4.315 2.684 QT
-3.979 3.153 -3.417 3.153 QT
cp}def
f-2026418800
f
GR
GS
[0.75 0 0 0.75 50.75 237.62501] CT
0.149 GC
N
/f1892466823{-5.542 1.716 M
-5.401 2.106 -5.128 2.419 QT
-4.854 2.731 -4.471 2.903 QT
-4.089 3.075 -3.682 3.075 QT
-2.745 3.075 -2.393 2.341 QT
-2.042 1.606 -2.042 0.575 QT
-2.042 0.122 -2.057 -0.183 QT
-2.073 -0.488 -2.135 -0.784 QT
-2.26 -1.238 -2.565 -1.581 QT
-2.87 -1.925 -3.307 -1.925 QT
-3.745 -1.925 -4.057 -1.792 QT
-4.37 -1.659 -4.565 -1.48 QT
-4.76 -1.3 -4.917 -1.105 QT
-5.073 -0.909 -5.104 -0.894 QT
-5.245 -0.894 L
-5.276 -0.894 -5.331 -0.933 QT
-5.385 -0.972 -5.385 -1.019 QT
-5.385 -5.363 L
-5.385 -5.394 -5.339 -5.425 QT
-5.292 -5.456 -5.245 -5.456 QT
-5.214 -5.456 L
-4.339 -5.034 -3.354 -5.034 QT
-2.385 -5.034 -1.495 -5.456 QT
-1.448 -5.456 L
-1.417 -5.456 -1.378 -5.425 QT
-1.339 -5.394 -1.339 -5.363 QT
-1.339 -5.238 L
-1.339 -5.175 -1.354 -5.175 QT
-1.807 -4.581 -2.479 -4.253 QT
-3.151 -3.925 -3.854 -3.925 QT
-4.385 -3.925 -4.932 -4.066 QT
-4.932 -1.613 L
-4.495 -1.956 -4.159 -2.105 QT
-3.823 -2.253 -3.292 -2.253 QT
-2.573 -2.253 -2.003 -1.847 QT
-1.432 -1.441 -1.128 -0.777 QT
-0.823 -0.113 -0.823 0.591 QT
-0.823 1.372 -1.206 2.036 QT
-1.589 2.7 -2.253 3.091 QT
-2.917 3.481 -3.682 3.481 QT
-4.323 3.481 -4.862 3.153 QT
-5.401 2.825 -5.714 2.27 QT
-6.026 1.716 -6.026 1.075 QT
-6.026 0.794 -5.831 0.606 QT
-5.635 0.419 -5.354 0.419 QT
-5.073 0.419 -4.878 0.606 QT
-4.682 0.794 -4.682 1.075 QT
-4.682 1.356 -4.878 1.552 QT
-5.073 1.747 -5.354 1.747 QT
-5.401 1.747 -5.456 1.739 QT
-5.51 1.731 -5.542 1.716 QT
cp}def
f1892466823
f
GR
GS
[0.75 0 0 0.75 50.75 194.74999] CT
0.149 GC
N
/f1525863041{-12.13 3.2 M
-12.13 2.747 L
-10.505 2.747 -10.505 2.325 QT
-10.505 -4.488 L
-11.177 -4.175 -12.208 -4.175 QT
-12.208 -4.628 L
-10.615 -4.628 -9.802 -5.456 QT
-9.615 -5.456 L
-9.568 -5.456 -9.529 -5.425 QT
-9.49 -5.394 -9.49 -5.347 QT
-9.49 2.325 L
-9.49 2.747 -7.865 2.747 QT
-7.865 3.2 L
-12.13 3.2 L
cp}def
f1525863041
f
GR
GS
[0.75 0 0 0.75 50.75 194.74999] CT
0.149 GC
N
f-2026418800
f
GR
GS
[0.75 0 0 0.75 50.75 151.875] CT
0.149 GC
N
f1525863041
f
GR
GS
[0.75 0 0 0.75 50.75 151.875] CT
0.149 GC
N
f1892466823
f
GR
GS
[0.75 0 0 0.75 50.75 109] CT
0.149 GC
N
/f1626408430{-12.693 3.2 M
-12.693 2.856 L
-12.693 2.825 -12.661 2.778 QT
-10.646 0.544 L
-10.177 0.044 -9.896 -0.292 QT
-9.615 -0.628 -9.333 -1.066 QT
-9.052 -1.503 -8.888 -1.956 QT
-8.724 -2.409 -8.724 -2.909 QT
-8.724 -3.441 -8.927 -3.933 QT
-9.13 -4.425 -9.521 -4.714 QT
-9.911 -5.003 -10.458 -5.003 QT
-11.021 -5.003 -11.474 -4.659 QT
-11.927 -4.316 -12.115 -3.784 QT
-12.052 -3.8 -11.974 -3.8 QT
-11.677 -3.8 -11.474 -3.605 QT
-11.271 -3.409 -11.271 -3.097 QT
-11.271 -2.8 -11.474 -2.589 QT
-11.677 -2.378 -11.974 -2.378 QT
-12.271 -2.378 -12.482 -2.589 QT
-12.693 -2.8 -12.693 -3.097 QT
-12.693 -3.581 -12.505 -4.011 QT
-12.318 -4.441 -11.974 -4.769 QT
-11.63 -5.097 -11.193 -5.277 QT
-10.755 -5.456 -10.271 -5.456 QT
-9.521 -5.456 -8.88 -5.144 QT
-8.24 -4.831 -7.865 -4.253 QT
-7.49 -3.675 -7.49 -2.909 QT
-7.49 -2.347 -7.74 -1.839 QT
-7.99 -1.331 -8.372 -0.917 QT
-8.755 -0.503 -9.365 0.028 QT
-9.974 0.559 -10.161 0.731 QT
-11.63 2.153 L
-10.38 2.153 L
-9.458 2.153 -8.841 2.137 QT
-8.224 2.122 -8.193 2.075 QT
-8.036 1.919 -7.88 0.887 QT
-7.49 0.887 L
-7.865 3.2 L
-12.693 3.2 L
cp}def
f1626408430
f
GR
GS
[0.75 0 0 0.75 50.75 109] CT
0.149 GC
N
f-2026418800
f
GR
GS
[0.75 0 0 0.75 50.75 66.125] CT
0.149 GC
N
f1626408430
f
GR
GS
[0.75 0 0 0.75 50.75 66.125] CT
0.149 GC
N
f1892466823
f
GR
GS
[0.75 0 0 0.75 50.75 23.25] CT
0.149 GC
N
/f1940848200{-12.099 2.2 M
-11.786 2.637 -11.271 2.856 QT
-10.755 3.075 -10.177 3.075 QT
-9.411 3.075 -9.099 2.427 QT
-8.786 1.778 -8.786 0.966 QT
-8.786 0.591 -8.849 0.223 QT
-8.911 -0.144 -9.076 -0.456 QT
-9.24 -0.769 -9.513 -0.964 QT
-9.786 -1.159 -10.177 -1.159 QT
-11.052 -1.159 L
-11.161 -1.159 -11.161 -1.269 QT
-11.161 -1.394 L
-11.161 -1.488 -11.052 -1.488 QT
-10.333 -1.55 L
-9.88 -1.55 -9.576 -1.894 QT
-9.271 -2.238 -9.13 -2.73 QT
-8.99 -3.222 -8.99 -3.659 QT
-8.99 -4.284 -9.279 -4.683 QT
-9.568 -5.081 -10.177 -5.081 QT
-10.661 -5.081 -11.115 -4.894 QT
-11.568 -4.706 -11.833 -4.331 QT
-11.802 -4.331 -11.786 -4.339 QT
-11.771 -4.347 -11.74 -4.347 QT
-11.458 -4.347 -11.263 -4.144 QT
-11.068 -3.941 -11.068 -3.644 QT
-11.068 -3.363 -11.263 -3.159 QT
-11.458 -2.956 -11.74 -2.956 QT
-12.036 -2.956 -12.24 -3.159 QT
-12.443 -3.363 -12.443 -3.644 QT
-12.443 -4.206 -12.107 -4.62 QT
-11.771 -5.034 -11.24 -5.245 QT
-10.708 -5.456 -10.177 -5.456 QT
-9.771 -5.456 -9.333 -5.339 QT
-8.896 -5.222 -8.544 -5.003 QT
-8.193 -4.784 -7.966 -4.441 QT
-7.74 -4.097 -7.74 -3.659 QT
-7.74 -3.113 -7.982 -2.652 QT
-8.224 -2.191 -8.654 -1.855 QT
-9.083 -1.519 -9.583 -1.347 QT
-9.021 -1.238 -8.513 -0.925 QT
-8.005 -0.613 -7.701 -0.113 QT
-7.396 0.387 -7.396 0.95 QT
-7.396 1.669 -7.786 2.247 QT
-8.177 2.825 -8.818 3.153 QT
-9.458 3.481 -10.177 3.481 QT
-10.786 3.481 -11.396 3.255 QT
-12.005 3.028 -12.396 2.559 QT
-12.786 2.091 -12.786 1.45 QT
-12.786 1.122 -12.568 0.911 QT
-12.349 0.7 -12.036 0.7 QT
-11.818 0.7 -11.646 0.794 QT
-11.474 0.887 -11.372 1.067 QT
-11.271 1.247 -11.271 1.45 QT
-11.271 1.762 -11.497 1.981 QT
-11.724 2.2 -12.036 2.2 QT
-12.099 2.2 L
cp}def
f1940848200
f
GR
GS
[0.75 0 0 0.75 50.75 23.25] CT
0.149 GC
N
f-2026418800
f
GR
GS
[0 -0.75 0.75 0 37.74997 151.87487] CT
0.149 GC
N
/f-1152140532{-69.088 -5.061 M
-69.088 -8.561 L
-69.088 -8.686 -68.963 -8.686 QT
-68.775 -8.686 L
-68.729 -8.686 -68.689 -8.647 QT
-68.65 -8.608 -68.65 -8.561 QT
-68.65 -7.093 -67.744 -6.288 QT
-66.838 -5.483 -65.354 -5.483 QT
-64.838 -5.483 -64.393 -5.78 QT
-63.947 -6.077 -63.705 -6.561 QT
-63.463 -7.046 -63.463 -7.577 QT
-63.463 -8.03 -63.65 -8.46 QT
-63.838 -8.889 -64.182 -9.202 QT
-64.525 -9.514 -64.947 -9.624 QT
-66.9 -10.093 L
-67.869 -10.343 -68.479 -11.139 QT
-69.088 -11.936 -69.088 -12.921 QT
-69.088 -13.702 -68.689 -14.382 QT
-68.291 -15.061 -67.627 -15.46 QT
-66.963 -15.858 -66.182 -15.858 QT
-64.682 -15.858 -63.791 -14.843 QT
-63.182 -15.811 L
-63.135 -15.858 -63.072 -15.858 QT
-62.979 -15.858 L
-62.932 -15.858 -62.893 -15.827 QT
-62.854 -15.796 -62.854 -15.733 QT
-62.854 -12.249 L
-62.854 -12.124 -62.979 -12.124 QT
-63.15 -12.124 L
-63.291 -12.124 -63.291 -12.249 QT
-63.291 -12.639 -63.416 -13.093 QT
-63.541 -13.546 -63.768 -13.96 QT
-63.994 -14.374 -64.26 -14.639 QT
-64.994 -15.374 -66.182 -15.374 QT
-66.697 -15.374 -67.127 -15.116 QT
-67.557 -14.858 -67.814 -14.405 QT
-68.072 -13.952 -68.072 -13.468 QT
-68.072 -12.827 -67.674 -12.303 QT
-67.275 -11.78 -66.635 -11.608 QT
-64.682 -11.139 L
-64.197 -11.014 -63.768 -10.71 QT
-63.338 -10.405 -63.057 -10.007 QT
-62.775 -9.608 -62.611 -9.108 QT
-62.447 -8.608 -62.447 -8.093 QT
-62.447 -7.28 -62.822 -6.553 QT
-63.197 -5.827 -63.869 -5.389 QT
-64.541 -4.952 -65.354 -4.952 QT
-65.854 -4.952 -66.369 -5.061 QT
-66.885 -5.171 -67.33 -5.397 QT
-67.775 -5.624 -68.135 -5.983 QT
-68.76 -4.999 L
-68.807 -4.952 -68.869 -4.952 QT
-68.963 -4.952 L
-69.088 -4.952 -69.088 -5.061 QT
cp}def
f-1152140532
f
GR
GS
[0 -0.75 0.75 0 37.74997 151.87487] CT
0.149 GC
N
/f1328896724{-60.252 -7.077 M
-60.252 -11.218 L
-61.502 -11.218 L
-61.502 -11.608 L
-60.518 -11.608 -60.057 -12.522 QT
-59.596 -13.436 -59.596 -14.514 QT
-59.158 -14.514 L
-59.158 -11.749 L
-57.049 -11.749 L
-57.049 -11.218 L
-59.158 -11.218 L
-59.158 -7.108 L
-59.158 -6.483 -58.948 -6.014 QT
-58.737 -5.546 -58.205 -5.546 QT
-57.69 -5.546 -57.463 -6.046 QT
-57.237 -6.546 -57.237 -7.108 QT
-57.237 -7.999 L
-56.799 -7.999 L
-56.799 -7.077 L
-56.799 -6.608 -56.971 -6.155 QT
-57.143 -5.702 -57.479 -5.405 QT
-57.815 -5.108 -58.299 -5.108 QT
-59.205 -5.108 -59.729 -5.647 QT
-60.252 -6.186 -60.252 -7.077 QT
cp}def
f1328896724
f
GR
GS
[0 -0.75 0.75 0 37.74997 151.87487] CT
0.149 GC
N
/f1321906734{-55.486 -6.749 M
-55.486 -7.639 -54.783 -8.202 QT
-54.08 -8.764 -53.088 -8.999 QT
-52.095 -9.233 -51.22 -9.233 QT
-51.22 -9.843 L
-51.22 -10.28 -51.408 -10.686 QT
-51.595 -11.093 -51.955 -11.35 QT
-52.314 -11.608 -52.752 -11.608 QT
-53.736 -11.608 -54.267 -11.155 QT
-53.97 -11.155 -53.791 -10.944 QT
-53.611 -10.733 -53.611 -10.436 QT
-53.611 -10.139 -53.822 -9.928 QT
-54.033 -9.718 -54.314 -9.718 QT
-54.627 -9.718 -54.838 -9.928 QT
-55.049 -10.139 -55.049 -10.436 QT
-55.049 -11.233 -54.33 -11.616 QT
-53.611 -11.999 -52.752 -11.999 QT
-52.142 -11.999 -51.525 -11.741 QT
-50.908 -11.483 -50.517 -10.999 QT
-50.127 -10.514 -50.127 -9.874 QT
-50.127 -6.499 L
-50.127 -6.202 -50.002 -5.96 QT
-49.877 -5.718 -49.611 -5.718 QT
-49.361 -5.718 -49.244 -5.968 QT
-49.127 -6.218 -49.127 -6.499 QT
-49.127 -7.452 L
-48.689 -7.452 L
-48.689 -6.499 L
-48.689 -6.155 -48.861 -5.85 QT
-49.033 -5.546 -49.33 -5.366 QT
-49.627 -5.186 -49.97 -5.186 QT
-50.408 -5.186 -50.728 -5.53 QT
-51.049 -5.874 -51.08 -6.343 QT
-51.361 -5.78 -51.9 -5.444 QT
-52.439 -5.108 -53.064 -5.108 QT
-53.627 -5.108 -54.181 -5.28 QT
-54.736 -5.452 -55.111 -5.811 QT
-55.486 -6.171 -55.486 -6.749 QT
cp
-54.267 -6.749 M
-54.267 -6.218 -53.877 -5.866 QT
-53.486 -5.514 -52.955 -5.514 QT
-52.47 -5.514 -52.08 -5.749 QT
-51.689 -5.983 -51.455 -6.405 QT
-51.22 -6.827 -51.22 -7.28 QT
-51.22 -8.843 L
-51.892 -8.843 -52.611 -8.624 QT
-53.33 -8.405 -53.799 -7.928 QT
-54.267 -7.452 -54.267 -6.749 QT
cp}def
f1321906734
f
GR
GS
[0 -0.75 0.75 0 37.74997 151.87487] CT
0.149 GC
N
/f-1596973844{-48.293 -5.28 M
-48.293 -5.811 L
-47.793 -5.811 -47.457 -5.889 QT
-47.121 -5.968 -47.121 -6.28 QT
-47.121 -10.374 L
-47.121 -10.78 -47.246 -10.96 QT
-47.371 -11.139 -47.598 -11.178 QT
-47.825 -11.218 -48.293 -11.218 QT
-48.293 -11.749 L
-46.121 -11.905 L
-46.121 -10.436 L
-45.825 -11.093 -45.231 -11.499 QT
-44.637 -11.905 -43.95 -11.905 QT
-42.903 -11.905 -42.379 -11.405 QT
-41.856 -10.905 -41.856 -9.889 QT
-41.856 -6.28 L
-41.856 -5.968 -41.528 -5.889 QT
-41.2 -5.811 -40.684 -5.811 QT
-40.684 -5.28 L
-44.121 -5.28 L
-44.121 -5.811 L
-43.606 -5.811 -43.278 -5.889 QT
-42.95 -5.968 -42.95 -6.28 QT
-42.95 -9.843 L
-42.95 -10.577 -43.16 -11.046 QT
-43.371 -11.514 -44.043 -11.514 QT
-44.903 -11.514 -45.465 -10.819 QT
-46.028 -10.124 -46.028 -9.249 QT
-46.028 -6.28 L
-46.028 -5.968 -45.7 -5.889 QT
-45.371 -5.811 -44.871 -5.811 QT
-44.871 -5.28 L
-48.293 -5.28 L
cp}def
f-1596973844
f
GR
GS
[0 -0.75 0.75 0 37.74997 151.87487] CT
0.149 GC
N
/f724945674{-36.942 -5.108 M
-37.817 -5.108 -38.551 -5.593 QT
-39.286 -6.077 -39.692 -6.858 QT
-40.098 -7.639 -40.098 -8.514 QT
-40.098 -9.421 -39.653 -10.202 QT
-39.208 -10.983 -38.45 -11.444 QT
-37.692 -11.905 -36.77 -11.905 QT
-36.223 -11.905 -35.731 -11.678 QT
-35.239 -11.452 -34.879 -11.03 QT
-34.879 -14.155 L
-34.879 -14.561 -35.004 -14.741 QT
-35.129 -14.921 -35.348 -14.96 QT
-35.567 -14.999 -36.051 -14.999 QT
-36.051 -15.53 L
-33.833 -15.686 L
-33.833 -6.639 L
-33.833 -6.249 -33.708 -6.069 QT
-33.583 -5.889 -33.364 -5.85 QT
-33.145 -5.811 -32.661 -5.811 QT
-32.661 -5.28 L
-34.926 -5.108 L
-34.926 -6.061 L
-35.317 -5.608 -35.848 -5.358 QT
-36.379 -5.108 -36.942 -5.108 QT
cp
-38.473 -6.577 M
-38.208 -6.093 -37.778 -5.803 QT
-37.348 -5.514 -36.848 -5.514 QT
-36.223 -5.514 -35.708 -5.866 QT
-35.192 -6.218 -34.926 -6.796 QT
-34.926 -10.389 L
-35.098 -10.718 -35.372 -10.983 QT
-35.645 -11.249 -35.973 -11.382 QT
-36.301 -11.514 -36.676 -11.514 QT
-37.458 -11.514 -37.934 -11.077 QT
-38.411 -10.639 -38.606 -9.952 QT
-38.801 -9.264 -38.801 -8.499 QT
-38.801 -7.905 -38.739 -7.46 QT
-38.676 -7.014 -38.473 -6.577 QT
cp}def
f724945674
f
GR
GS
[0 -0.75 0.75 0 37.74997 151.87487] CT
0.149 GC
N
/f-2085506054{-31.856 -6.749 M
-31.856 -7.639 -31.153 -8.202 QT
-30.45 -8.764 -29.458 -8.999 QT
-28.466 -9.233 -27.591 -9.233 QT
-27.591 -9.843 L
-27.591 -10.28 -27.778 -10.686 QT
-27.966 -11.093 -28.325 -11.35 QT
-28.684 -11.608 -29.122 -11.608 QT
-30.106 -11.608 -30.638 -11.155 QT
-30.341 -11.155 -30.161 -10.944 QT
-29.981 -10.733 -29.981 -10.436 QT
-29.981 -10.139 -30.192 -9.928 QT
-30.403 -9.718 -30.684 -9.718 QT
-30.997 -9.718 -31.208 -9.928 QT
-31.419 -10.139 -31.419 -10.436 QT
-31.419 -11.233 -30.7 -11.616 QT
-29.981 -11.999 -29.122 -11.999 QT
-28.513 -11.999 -27.895 -11.741 QT
-27.278 -11.483 -26.888 -10.999 QT
-26.497 -10.514 -26.497 -9.874 QT
-26.497 -6.499 L
-26.497 -6.202 -26.372 -5.96 QT
-26.247 -5.718 -25.981 -5.718 QT
-25.731 -5.718 -25.614 -5.968 QT
-25.497 -6.218 -25.497 -6.499 QT
-25.497 -7.452 L
-25.059 -7.452 L
-25.059 -6.499 L
-25.059 -6.155 -25.231 -5.85 QT
-25.403 -5.546 -25.7 -5.366 QT
-25.997 -5.186 -26.341 -5.186 QT
-26.778 -5.186 -27.099 -5.53 QT
-27.419 -5.874 -27.45 -6.343 QT
-27.731 -5.78 -28.27 -5.444 QT
-28.809 -5.108 -29.434 -5.108 QT
-29.997 -5.108 -30.552 -5.28 QT
-31.106 -5.452 -31.481 -5.811 QT
-31.856 -6.171 -31.856 -6.749 QT
cp
-30.638 -6.749 M
-30.638 -6.218 -30.247 -5.866 QT
-29.856 -5.514 -29.325 -5.514 QT
-28.841 -5.514 -28.45 -5.749 QT
-28.059 -5.983 -27.825 -6.405 QT
-27.591 -6.827 -27.591 -7.28 QT
-27.591 -8.843 L
-28.263 -8.843 -28.981 -8.624 QT
-29.7 -8.405 -30.169 -7.928 QT
-30.638 -7.452 -30.638 -6.749 QT
cp}def
f-2085506054
f
GR
GS
[0 -0.75 0.75 0 37.74997 151.87487] CT
0.149 GC
N
/f559655124{-24.726 -5.28 M
-24.726 -5.811 L
-24.21 -5.811 -23.882 -5.889 QT
-23.554 -5.968 -23.554 -6.28 QT
-23.554 -10.374 L
-23.554 -10.78 -23.679 -10.96 QT
-23.804 -11.139 -24.031 -11.178 QT
-24.257 -11.218 -24.726 -11.218 QT
-24.726 -11.749 L
-22.585 -11.905 L
-22.585 -10.436 L
-22.335 -11.093 -21.89 -11.499 QT
-21.445 -11.905 -20.804 -11.905 QT
-20.367 -11.905 -20.015 -11.639 QT
-19.664 -11.374 -19.664 -10.952 QT
-19.664 -10.671 -19.859 -10.475 QT
-20.054 -10.28 -20.335 -10.28 QT
-20.617 -10.28 -20.812 -10.475 QT
-21.007 -10.671 -21.007 -10.952 QT
-21.007 -11.358 -20.726 -11.514 QT
-20.804 -11.514 L
-21.414 -11.514 -21.796 -11.077 QT
-22.179 -10.639 -22.343 -9.991 QT
-22.507 -9.343 -22.507 -8.749 QT
-22.507 -6.28 L
-22.507 -5.811 -21.054 -5.811 QT
-21.054 -5.28 L
-24.726 -5.28 L
cp}def
f559655124
f
GR
GS
[0 -0.75 0.75 0 37.74997 151.87487] CT
0.149 GC
N
/f1033962974{-15.716 -5.108 M
-16.591 -5.108 -17.325 -5.593 QT
-18.06 -6.077 -18.466 -6.858 QT
-18.872 -7.639 -18.872 -8.514 QT
-18.872 -9.421 -18.427 -10.202 QT
-17.982 -10.983 -17.224 -11.444 QT
-16.466 -11.905 -15.544 -11.905 QT
-14.997 -11.905 -14.505 -11.678 QT
-14.013 -11.452 -13.654 -11.03 QT
-13.654 -14.155 L
-13.654 -14.561 -13.779 -14.741 QT
-13.904 -14.921 -14.122 -14.96 QT
-14.341 -14.999 -14.825 -14.999 QT
-14.825 -15.53 L
-12.607 -15.686 L
-12.607 -6.639 L
-12.607 -6.249 -12.482 -6.069 QT
-12.357 -5.889 -12.138 -5.85 QT
-11.919 -5.811 -11.435 -5.811 QT
-11.435 -5.28 L
-13.7 -5.108 L
-13.7 -6.061 L
-14.091 -5.608 -14.622 -5.358 QT
-15.154 -5.108 -15.716 -5.108 QT
cp
-17.247 -6.577 M
-16.982 -6.093 -16.552 -5.803 QT
-16.122 -5.514 -15.622 -5.514 QT
-14.997 -5.514 -14.482 -5.866 QT
-13.966 -6.218 -13.7 -6.796 QT
-13.7 -10.389 L
-13.872 -10.718 -14.146 -10.983 QT
-14.419 -11.249 -14.747 -11.382 QT
-15.075 -11.514 -15.45 -11.514 QT
-16.232 -11.514 -16.708 -11.077 QT
-17.185 -10.639 -17.38 -9.952 QT
-17.575 -9.264 -17.575 -8.499 QT
-17.575 -7.905 -17.513 -7.46 QT
-17.45 -7.014 -17.247 -6.577 QT
cp}def
f1033962974
f
GR
GS
[0 -0.75 0.75 0 37.74997 151.87487] CT
0.149 GC
N
/f1989599838{-2.679 -5.108 M
-3.554 -5.108 -4.288 -5.593 QT
-5.023 -6.077 -5.429 -6.858 QT
-5.835 -7.639 -5.835 -8.514 QT
-5.835 -9.421 -5.39 -10.202 QT
-4.945 -10.983 -4.187 -11.444 QT
-3.429 -11.905 -2.507 -11.905 QT
-1.96 -11.905 -1.468 -11.678 QT
-0.976 -11.452 -0.616 -11.03 QT
-0.616 -14.155 L
-0.616 -14.561 -0.741 -14.741 QT
-0.866 -14.921 -1.085 -14.96 QT
-1.304 -14.999 -1.788 -14.999 QT
-1.788 -15.53 L
0.43 -15.686 L
0.43 -6.639 L
0.43 -6.249 0.555 -6.069 QT
0.68 -5.889 0.899 -5.85 QT
1.118 -5.811 1.602 -5.811 QT
1.602 -5.28 L
-0.663 -5.108 L
-0.663 -6.061 L
-1.054 -5.608 -1.585 -5.358 QT
-2.116 -5.108 -2.679 -5.108 QT
cp
-4.21 -6.577 M
-3.945 -6.093 -3.515 -5.803 QT
-3.085 -5.514 -2.585 -5.514 QT
-1.96 -5.514 -1.445 -5.866 QT
-0.929 -6.218 -0.663 -6.796 QT
-0.663 -10.389 L
-0.835 -10.718 -1.109 -10.983 QT
-1.382 -11.249 -1.71 -11.382 QT
-2.038 -11.514 -2.413 -11.514 QT
-3.195 -11.514 -3.671 -11.077 QT
-4.148 -10.639 -4.343 -9.952 QT
-4.538 -9.264 -4.538 -8.499 QT
-4.538 -7.905 -4.476 -7.46 QT
-4.413 -7.014 -4.21 -6.577 QT
cp}def
f1989599838
f
GR
GS
[0 -0.75 0.75 0 37.74997 151.87487] CT
0.149 GC
N
/f1012562479{5.547 -5.108 M
4.625 -5.108 3.868 -5.593 QT
3.11 -6.077 2.672 -6.874 QT
2.235 -7.671 2.235 -8.561 QT
2.235 -9.452 2.633 -10.241 QT
3.032 -11.03 3.743 -11.514 QT
4.454 -11.999 5.329 -11.999 QT
6.032 -11.999 6.54 -11.772 QT
7.047 -11.546 7.375 -11.132 QT
7.704 -10.718 7.868 -10.163 QT
8.032 -9.608 8.032 -8.936 QT
8.032 -8.749 7.891 -8.749 QT
3.547 -8.749 L
3.547 -8.577 L
3.547 -7.343 4.047 -6.444 QT
4.547 -5.546 5.688 -5.546 QT
6.141 -5.546 6.532 -5.757 QT
6.922 -5.968 7.211 -6.327 QT
7.5 -6.686 7.61 -7.108 QT
7.625 -7.155 7.665 -7.202 QT
7.704 -7.249 7.75 -7.249 QT
7.891 -7.249 L
8.032 -7.249 8.032 -7.046 QT
7.829 -6.202 7.125 -5.655 QT
6.422 -5.108 5.547 -5.108 QT
cp
3.563 -9.124 M
6.969 -9.124 L
6.969 -9.686 6.813 -10.264 QT
6.657 -10.843 6.29 -11.225 QT
5.922 -11.608 5.329 -11.608 QT
4.485 -11.608 4.024 -10.811 QT
3.563 -10.014 3.563 -9.124 QT
cp}def
f1012562479
f
GR
GS
[0 -0.75 0.75 0 37.74997 151.87487] CT
0.149 GC
N
/f80353889{11.988 -5.28 M
9.8 -10.796 L
9.66 -11.061 9.371 -11.139 QT
9.081 -11.218 8.613 -11.218 QT
8.613 -11.749 L
11.769 -11.749 L
11.769 -11.218 L
10.925 -11.218 10.925 -10.858 QT
10.925 -10.796 10.941 -10.78 QT
12.628 -6.546 L
14.144 -10.358 L
14.191 -10.483 14.191 -10.608 QT
14.191 -10.889 13.972 -11.053 QT
13.753 -11.218 13.456 -11.218 QT
13.456 -11.749 L
15.956 -11.749 L
15.956 -11.218 L
15.488 -11.218 15.136 -11.007 QT
14.785 -10.796 14.597 -10.374 QT
12.581 -5.28 L
12.519 -5.108 12.331 -5.108 QT
12.222 -5.108 L
12.05 -5.108 11.988 -5.28 QT
cp}def
f80353889
f
GR
GS
[0 -0.75 0.75 0 37.74997 151.87487] CT
0.149 GC
N
/f619504276{16.541 -5.28 M
16.541 -5.811 L
17.041 -5.811 17.377 -5.889 QT
17.713 -5.968 17.713 -6.28 QT
17.713 -10.374 L
17.713 -10.952 17.486 -11.085 QT
17.26 -11.218 16.604 -11.218 QT
16.604 -11.749 L
18.76 -11.905 L
18.76 -6.28 L
18.76 -5.968 19.049 -5.889 QT
19.338 -5.811 19.807 -5.811 QT
19.807 -5.28 L
16.541 -5.28 L
cp
17.166 -14.483 M
17.166 -14.811 17.416 -15.061 QT
17.666 -15.311 17.994 -15.311 QT
18.197 -15.311 18.4 -15.202 QT
18.604 -15.093 18.713 -14.897 QT
18.822 -14.702 18.822 -14.483 QT
18.822 -14.171 18.572 -13.921 QT
18.322 -13.671 17.994 -13.671 QT
17.666 -13.671 17.416 -13.921 QT
17.166 -14.171 17.166 -14.483 QT
cp}def
f619504276
f
GR
GS
[0 -0.75 0.75 0 37.74997 151.87487] CT
0.149 GC
N
/f-497992194{20.74 -6.749 M
20.74 -7.639 21.443 -8.202 QT
22.146 -8.764 23.139 -8.999 QT
24.131 -9.233 25.006 -9.233 QT
25.006 -9.843 L
25.006 -10.28 24.818 -10.686 QT
24.631 -11.093 24.271 -11.35 QT
23.912 -11.608 23.474 -11.608 QT
22.49 -11.608 21.959 -11.155 QT
22.256 -11.155 22.435 -10.944 QT
22.615 -10.733 22.615 -10.436 QT
22.615 -10.139 22.404 -9.928 QT
22.193 -9.718 21.912 -9.718 QT
21.599 -9.718 21.389 -9.928 QT
21.178 -10.139 21.178 -10.436 QT
21.178 -11.233 21.896 -11.616 QT
22.615 -11.999 23.474 -11.999 QT
24.084 -11.999 24.701 -11.741 QT
25.318 -11.483 25.709 -10.999 QT
26.099 -10.514 26.099 -9.874 QT
26.099 -6.499 L
26.099 -6.202 26.224 -5.96 QT
26.349 -5.718 26.615 -5.718 QT
26.865 -5.718 26.982 -5.968 QT
27.099 -6.218 27.099 -6.499 QT
27.099 -7.452 L
27.537 -7.452 L
27.537 -6.499 L
27.537 -6.155 27.365 -5.85 QT
27.193 -5.546 26.896 -5.366 QT
26.599 -5.186 26.256 -5.186 QT
25.818 -5.186 25.498 -5.53 QT
25.178 -5.874 25.146 -6.343 QT
24.865 -5.78 24.326 -5.444 QT
23.787 -5.108 23.162 -5.108 QT
22.599 -5.108 22.045 -5.28 QT
21.49 -5.452 21.115 -5.811 QT
20.74 -6.171 20.74 -6.749 QT
cp
21.959 -6.749 M
21.959 -6.218 22.349 -5.866 QT
22.74 -5.514 23.271 -5.514 QT
23.756 -5.514 24.146 -5.749 QT
24.537 -5.983 24.771 -6.405 QT
25.006 -6.827 25.006 -7.28 QT
25.006 -8.843 L
24.334 -8.843 23.615 -8.624 QT
22.896 -8.405 22.428 -7.928 QT
21.959 -7.452 21.959 -6.749 QT
cp}def
f-497992194
f
GR
GS
[0 -0.75 0.75 0 37.74997 151.87487] CT
0.149 GC
N
/f-225543046{29.011 -7.077 M
29.011 -11.218 L
27.761 -11.218 L
27.761 -11.608 L
28.745 -11.608 29.206 -12.522 QT
29.667 -13.436 29.667 -14.514 QT
30.105 -14.514 L
30.105 -11.749 L
32.214 -11.749 L
32.214 -11.218 L
30.105 -11.218 L
30.105 -7.108 L
30.105 -6.483 30.316 -6.014 QT
30.527 -5.546 31.058 -5.546 QT
31.573 -5.546 31.8 -6.046 QT
32.027 -6.546 32.027 -7.108 QT
32.027 -7.999 L
32.464 -7.999 L
32.464 -7.077 L
32.464 -6.608 32.292 -6.155 QT
32.12 -5.702 31.784 -5.405 QT
31.448 -5.108 30.964 -5.108 QT
30.058 -5.108 29.534 -5.647 QT
29.011 -6.186 29.011 -7.077 QT
cp}def
f-225543046
f
GR
GS
[0 -0.75 0.75 0 37.74997 151.87487] CT
0.149 GC
N
/f21596495{33.652 -5.28 M
33.652 -5.811 L
34.152 -5.811 34.488 -5.889 QT
34.824 -5.968 34.824 -6.28 QT
34.824 -10.374 L
34.824 -10.952 34.597 -11.085 QT
34.371 -11.218 33.715 -11.218 QT
33.715 -11.749 L
35.871 -11.905 L
35.871 -6.28 L
35.871 -5.968 36.16 -5.889 QT
36.449 -5.811 36.918 -5.811 QT
36.918 -5.28 L
33.652 -5.28 L
cp
34.277 -14.483 M
34.277 -14.811 34.527 -15.061 QT
34.777 -15.311 35.105 -15.311 QT
35.308 -15.311 35.512 -15.202 QT
35.715 -15.093 35.824 -14.897 QT
35.933 -14.702 35.933 -14.483 QT
35.933 -14.171 35.683 -13.921 QT
35.433 -13.671 35.105 -13.671 QT
34.777 -13.671 34.527 -13.921 QT
34.277 -14.171 34.277 -14.483 QT
cp}def
f21596495
f
GR
GS
[0 -0.75 0.75 0 37.74997 151.87487] CT
0.149 GC
N
/f489259538{41.008 -5.108 M
40.101 -5.108 39.336 -5.569 QT
38.57 -6.03 38.125 -6.796 QT
37.679 -7.561 37.679 -8.468 QT
37.679 -9.155 37.922 -9.796 QT
38.164 -10.436 38.625 -10.936 QT
39.086 -11.436 39.695 -11.718 QT
40.304 -11.999 41.008 -11.999 QT
41.929 -11.999 42.687 -11.514 QT
43.445 -11.03 43.883 -10.21 QT
44.32 -9.389 44.32 -8.468 QT
44.32 -7.577 43.875 -6.803 QT
43.429 -6.03 42.664 -5.569 QT
41.898 -5.108 41.008 -5.108 QT
cp
41.008 -5.546 M
42.211 -5.546 42.609 -6.421 QT
43.008 -7.296 43.008 -8.639 QT
43.008 -9.389 42.929 -9.889 QT
42.851 -10.389 42.586 -10.796 QT
42.414 -11.03 42.156 -11.218 QT
41.898 -11.405 41.609 -11.507 QT
41.32 -11.608 41.008 -11.608 QT
40.539 -11.608 40.117 -11.397 QT
39.695 -11.186 39.414 -10.796 QT
39.133 -10.358 39.062 -9.85 QT
38.992 -9.343 38.992 -8.639 QT
38.992 -7.796 39.133 -7.124 QT
39.273 -6.452 39.718 -5.999 QT
40.164 -5.546 41.008 -5.546 QT
cp}def
f489259538
f
GR
GS
[0 -0.75 0.75 0 37.74997 151.87487] CT
0.149 GC
N
/f1939767348{45.044 -5.28 M
45.044 -5.811 L
45.544 -5.811 45.88 -5.889 QT
46.216 -5.968 46.216 -6.28 QT
46.216 -10.374 L
46.216 -10.78 46.091 -10.96 QT
45.966 -11.139 45.739 -11.178 QT
45.513 -11.218 45.044 -11.218 QT
45.044 -11.749 L
47.216 -11.905 L
47.216 -10.436 L
47.513 -11.093 48.106 -11.499 QT
48.7 -11.905 49.388 -11.905 QT
50.435 -11.905 50.958 -11.405 QT
51.481 -10.905 51.481 -9.889 QT
51.481 -6.28 L
51.481 -5.968 51.81 -5.889 QT
52.138 -5.811 52.653 -5.811 QT
52.653 -5.28 L
49.216 -5.28 L
49.216 -5.811 L
49.731 -5.811 50.06 -5.889 QT
50.388 -5.968 50.388 -6.28 QT
50.388 -9.843 L
50.388 -10.577 50.177 -11.046 QT
49.966 -11.514 49.294 -11.514 QT
48.435 -11.514 47.872 -10.819 QT
47.31 -10.124 47.31 -9.249 QT
47.31 -6.28 L
47.31 -5.968 47.638 -5.889 QT
47.966 -5.811 48.466 -5.811 QT
48.466 -5.28 L
45.044 -5.28 L
cp}def
f1939767348
f
GR
GS
[0 -0.75 0.75 0 37.74997 151.87487] CT
0.149 GC
N
/f-1127173710{57.395 -1.561 M
56.552 -2.218 55.95 -3.069 QT
55.348 -3.921 54.966 -4.889 QT
54.583 -5.858 54.387 -6.913 QT
54.192 -7.968 54.192 -9.03 QT
54.192 -10.108 54.387 -11.163 QT
54.583 -12.218 54.973 -13.194 QT
55.364 -14.171 55.973 -15.014 QT
56.583 -15.858 57.395 -16.499 QT
57.395 -16.53 57.458 -16.53 QT
57.598 -16.53 L
57.645 -16.53 57.684 -16.491 QT
57.723 -16.452 57.723 -16.405 QT
57.723 -16.327 57.692 -16.296 QT
56.958 -15.593 56.473 -14.772 QT
55.989 -13.952 55.692 -13.022 QT
55.395 -12.093 55.262 -11.1 QT
55.13 -10.108 55.13 -9.03 QT
55.13 -4.264 57.677 -1.78 QT
57.723 -1.749 57.723 -1.655 QT
57.723 -1.624 57.684 -1.577 QT
57.645 -1.53 57.598 -1.53 QT
57.458 -1.53 L
57.395 -1.53 57.395 -1.561 QT
cp}def
f-1127173710
f
GR
GS
[0 -0.75 0.75 0 37.74997 151.87487] CT
0.149 GC
N
/f1300833252{58.943 -5.233 M
58.943 -7.686 L
58.943 -7.796 59.068 -7.796 QT
59.255 -7.796 L
59.349 -7.796 59.38 -7.686 QT
59.787 -5.514 61.396 -5.514 QT
62.099 -5.514 62.583 -5.835 QT
63.068 -6.155 63.068 -6.827 QT
63.068 -7.311 62.693 -7.647 QT
62.318 -7.983 61.802 -8.108 QT
60.802 -8.311 L
60.302 -8.421 59.888 -8.647 QT
59.474 -8.874 59.208 -9.249 QT
58.943 -9.624 58.943 -10.124 QT
58.943 -10.796 59.287 -11.21 QT
59.63 -11.624 60.193 -11.811 QT
60.755 -11.999 61.396 -11.999 QT
62.162 -11.999 62.74 -11.593 QT
63.162 -11.968 L
63.162 -11.999 63.24 -11.999 QT
63.349 -11.999 L
63.396 -11.999 63.435 -11.96 QT
63.474 -11.921 63.474 -11.874 QT
63.474 -9.921 L
63.474 -9.78 63.349 -9.78 QT
63.162 -9.78 L
63.037 -9.78 63.037 -9.921 QT
63.037 -10.702 62.599 -11.178 QT
62.162 -11.655 61.38 -11.655 QT
60.708 -11.655 60.216 -11.405 QT
59.724 -11.155 59.724 -10.546 QT
59.724 -10.124 60.076 -9.858 QT
60.427 -9.593 60.912 -9.483 QT
61.927 -9.28 L
62.427 -9.171 62.872 -8.889 QT
63.318 -8.608 63.576 -8.186 QT
63.833 -7.764 63.833 -7.233 QT
63.833 -6.686 63.654 -6.288 QT
63.474 -5.889 63.138 -5.624 QT
62.802 -5.358 62.349 -5.233 QT
61.896 -5.108 61.396 -5.108 QT
60.458 -5.108 59.787 -5.749 QT
59.24 -5.155 L
59.24 -5.108 59.162 -5.108 QT
59.068 -5.108 L
58.943 -5.108 58.943 -5.233 QT
cp}def
f1300833252
f
GR
GS
[0 -0.75 0.75 0 37.74997 151.87487] CT
0.149 GC
N
/f2103119831{65.197 -1.53 M
65.072 -1.53 65.072 -1.655 QT
65.072 -1.733 65.103 -1.764 QT
67.665 -4.264 67.665 -9.03 QT
67.665 -13.796 65.134 -16.28 QT
65.072 -16.311 65.072 -16.405 QT
65.072 -16.452 65.111 -16.491 QT
65.15 -16.53 65.197 -16.53 QT
65.337 -16.53 L
65.384 -16.53 65.415 -16.499 QT
66.494 -15.655 67.212 -14.436 QT
67.931 -13.218 68.259 -11.843 QT
68.587 -10.468 68.587 -9.03 QT
68.587 -7.968 68.408 -6.936 QT
68.228 -5.905 67.837 -4.905 QT
67.447 -3.905 66.845 -3.061 QT
66.244 -2.218 65.415 -1.561 QT
65.384 -1.53 65.337 -1.53 QT
65.197 -1.53 L
cp}def
f2103119831
f
GR
GS
[0.75 0 0 0.75 0 0] CT
0 0 1 RC
1 LJ
2.667 LW
N
77.34 346.194 M
86.02 358.391 L
94.7 356.848 L
116.4 359.795 L
203.2 360.291 L
290 359.959 L
507 360.463 L
S
GR
GS
[0.75 0 0 0.75 0 0] CT
0 0 1 RC
1 LJ
0.667 LW
N
77.34 352.677 M
86.02 358.964 L
94.7 358.675 L
116.4 360.304 L
203.2 360.757 L
290 360.516 L
507 361.101 L
S
GR
GS
[0.75 0 0 0.75 58.005 264.50798] CT
0 0 1 RC
N
1.333 0 M
1.333 0.736 0.736 1.333 0 1.333 C
-0.736 1.333 -1.333 0.736 -1.333 0 C
-1.333 -0.736 -0.736 -1.333 0 -1.333 C
0.736 -1.333 1.333 -0.736 1.333 0 C
cp
f
GR
GS
[0.75 0 0 0.75 64.515 269.22301] CT
0 0 1 RC
N
/f-1057828618{1.333 0 M
1.333 0.736 0.736 1.333 0 1.333 C
-0.736 1.333 -1.333 0.736 -1.333 0 C
-1.333 -0.736 -0.736 -1.333 0 -1.333 C
0.736 -1.333 1.333 -0.736 1.333 0 C
cp}def
f-1057828618
f
GR
GS
[0.75 0 0 0.75 71.025 269.00631] CT
0 0 1 RC
N
f-1057828618
f
GR
GS
[0.75 0 0 0.75 87.3 270.22797] CT
0 0 1 RC
N
f-1057828618
f
GR
GS
[0.75 0 0 0.75 152.40001 270.56781] CT
0 0 1 RC
N
f-1057828618
f
GR
GS
[0.75 0 0 0.75 217.5 270.38729] CT
0 0 1 RC
N
f-1057828618
f
GR
GS
[0.75 0 0 0.75 380.25 270.82587] CT
0 0 1 RC
N
f-1057828618
f
GR
GS
[0.75 0 0 0.75 0 0] CT
0 0 1 RC
1 LJ
0.667 LW
N
77.34 333.707 M
86.02 357.272 L
94.7 350.971 L
116.4 359.099 L
203.2 359.617 L
290 359.505 L
507 359.834 L
S
GR
GS
[0.75 0 0 0.75 58.005 250.28027] CT
0 0 1 RC
N
f-1057828618
f
GR
GS
[0.75 0 0 0.75 64.515 267.95391] CT
0 0 1 RC
N
f-1057828618
f
GR
GS
[0.75 0 0 0.75 71.025 263.22828] CT
0 0 1 RC
N
f-1057828618
f
GR
GS
[0.75 0 0 0.75 87.3 269.32411] CT
0 0 1 RC
N
f-1057828618
f
GR
GS
[0.75 0 0 0.75 152.40001 269.71307] CT
0 0 1 RC
N
f-1057828618
f
GR
GS
[0.75 0 0 0.75 217.5 269.62907] CT
0 0 1 RC
N
f-1057828618
f
GR
GS
[0.75 0 0 0.75 380.25 269.87514] CT
0 0 1 RC
N
f-1057828618
f
GR
GS
[0.75 0 0 0.75 0 0] CT
1 0 0 RC
1 LJ
2.667 LW
N
77.34 339.957 M
86.02 354.845 L
94.7 351.272 L
116.4 359.477 L
203.2 313.788 L
290 360.091 L
507 360.61 L
S
GR
GS
[0.75 0 0 0.75 0 0] CT
1 0 0 RC
1 LJ
0.667 LW
N
77.34 351.663 M
86.02 358.468 L
94.7 358.853 L
116.4 360.216 L
203.2 360.248 L
290 360.67 L
507 361.09 L
S
GR
GS
[0.75 0 0 0.75 58.005 263.74727] CT
1 0 0 RC
N
f-1057828618
f
GR
GS
[0.75 0 0 0.75 64.515 268.85076] CT
1 0 0 RC
N
f-1057828618
f
GR
GS
[0.75 0 0 0.75 71.025 269.13961] CT
1 0 0 RC
N
f-1057828618
f
GR
GS
[0.75 0 0 0.75 87.3 270.16221] CT
1 0 0 RC
N
f-1057828618
f
GR
GS
[0.75 0 0 0.75 152.40001 270.18569] CT
1 0 0 RC
N
f-1057828618
f
GR
GS
[0.75 0 0 0.75 217.5 270.50267] CT
1 0 0 RC
N
f-1057828618
f
GR
GS
[0.75 0 0 0.75 380.25 270.81718] CT
1 0 0 RC
N
f-1057828618
f
GR
GS
[0.75 0 0 0.75 0 0] CT
1 0 0 RC
1 LJ
0.667 LW
N
77.34 324.454 M
86.02 348.272 L
94.7 342.705 L
116.4 358.535 L
203.2 256.214 L
290 359.385 L
507 359.986 L
S
GR
GS
[0.75 0 0 0.75 58.005 243.34055] CT
1 0 0 RC
N
f-1057828618
f
GR
GS
[0.75 0 0 0.75 64.515 261.20421] CT
1 0 0 RC
N
f-1057828618
f
GR
GS
[0.75 0 0 0.75 71.025 257.02844] CT
1 0 0 RC
N
f-1057828618
f
GR
GS
[0.75 0 0 0.75 87.3 268.90155] CT
1 0 0 RC
N
f-1057828618
f
GR
GS
[0.75 0 0 0.75 152.40001 192.16074] CT
1 0 0 RC
N
f-1057828618
f
GR
GS
[0.75 0 0 0.75 217.5 269.53853] CT
1 0 0 RC
N
f-1057828618
f
GR
GS
[0.75 0 0 0.75 380.25 269.98943] CT
1 0 0 RC
N
f-1057828618
f
GR
GS
[0.75 0 0 0.75 0 0] CT
0 1 0 RC
1 LJ
2.667 LW
N
77.34 309.405 M
86.02 269.285 L
94.7 261.493 L
116.4 355.393 L
203.2 358.36 L
290 358.651 L
507 359.53 L
S
GR
GS
[0.75 0 0 0.75 0 0] CT
0 1 0 RC
1 LJ
0.667 LW
N
77.34 336.547 M
86.02 351.53 L
94.7 353.598 L
116.4 356.204 L
203.2 359.034 L
290 359.409 L
507 360.119 L
S
GR
GS
[0.75 0 0 0.75 58.005 252.41004] CT
0 1 0 RC
N
f-1057828618
f
GR
GS
[0.75 0 0 0.75 64.515 263.64722] CT
0 1 0 RC
N
f-1057828618
f
GR
GS
[0.75 0 0 0.75 71.025 265.19865] CT
0 1 0 RC
N
f-1057828618
f
GR
GS
[0.75 0 0 0.75 87.3 267.15335] CT
0 1 0 RC
N
f-1057828618
f
GR
GS
[0.75 0 0 0.75 152.40001 269.27557] CT
0 1 0 RC
N
f-1057828618
f
GR
GS
[0.75 0 0 0.75 217.5 269.55702] CT
0 1 0 RC
N
f-1057828618
f
GR
GS
[0.75 0 0 0.75 380.25 270.08915] CT
0 1 0 RC
N
f-1057828618
f
GR
GS
[0.75 0 0 0.75 0 0] CT
0 1 0 RC
1 LJ
0.667 LW
N
77.34 273.628 M
86.02 145.04 L
94.7 153.967 L
116.4 354.401 L
203.2 357.468 L
290 357.73 L
507 358.626 L
S
GR
GS
[0.75 0 0 0.75 58.005 205.22136] CT
0 1 0 RC
N
f-1057828618
f
GR
GS
[0.75 0 0 0.75 64.515 108.77966] CT
0 1 0 RC
N
f-1057828618
f
GR
GS
[0.75 0 0 0.75 71.025 115.47505] CT
0 1 0 RC
N
f-1057828618
f
GR
GS
[0.75 0 0 0.75 87.3 265.80107] CT
0 1 0 RC
N
f-1057828618
f
GR
GS
[0.75 0 0 0.75 152.40001 268.10131] CT
0 1 0 RC
N
f-1057828618
f
GR
GS
[0.75 0 0 0.75 217.5 268.29776] CT
0 1 0 RC
N
f-1057828618
f
GR
GS
[0.75 0 0 0.75 380.25 268.96944] CT
0 1 0 RC
N
f-1057828618
f
GR
GS
[0.75 0 0 0.75 0 0] CT
1 0 1 RC
1 LJ
2.667 LW
N
77.34 350.729 M
86.02 343.349 L
94.7 206.677 L
116.4 352.274 L
203.2 355.798 L
290 355.397 L
507 357.647 L
S
GR
GS
[0.75 0 0 0.75 0 0] CT
1 0 1 RC
1 LJ
0.667 LW
N
77.34 352.983 M
86.02 349.353 L
94.7 350.616 L
116.4 353.596 L
203.2 356.87 L
290 356.284 L
507 358.483 L
S
GR
GS
[0.75 0 0 0.75 58.005 264.73693] CT
1 0 1 RC
N
f-1057828618
f
GR
GS
[0.75 0 0 0.75 64.515 262.01443] CT
1 0 1 RC
N
f-1057828618
f
GR
GS
[0.75 0 0 0.75 71.025 262.96168] CT
1 0 1 RC
N
f-1057828618
f
GR
GS
[0.75 0 0 0.75 87.3 265.19737] CT
1 0 1 RC
N
f-1057828618
f
GR
GS
[0.75 0 0 0.75 152.40001 267.65277] CT
1 0 1 RC
N
f-1057828618
f
GR
GS
[0.75 0 0 0.75 217.5 267.21329] CT
1 0 1 RC
N
f-1057828618
f
GR
GS
[0.75 0 0 0.75 380.25 268.86218] CT
1 0 1 RC
N
f-1057828618
f
GR
GS
[0.75 0 0 0.75 0 0] CT
1 0 1 RC
1 LJ
0.667 LW
N
77.34 348.718 M
86.02 333.57 L
94.7 42.933 L
116.4 350.966 L
203.2 355.029 L
290 354.005 L
507 356.95 L
S
GR
GS
[0.75 0 0 0.75 58.005 261.53872] CT
1 0 1 RC
N
f-1057828618
f
GR
GS
[0.75 0 0 0.75 64.515 250.17751] CT
1 0 1 RC
N
f-1057828618
f
GR
GS
[0.75 0 0 0.75 71.025 32.20011] CT
1 0 1 RC
N
f-1057828618
f
GR
GS
[0.75 0 0 0.75 87.3 263.22448] CT
1 0 1 RC
N
f-1057828618
f
GR
GS
[0.75 0 0 0.75 152.40001 266.27145] CT
1 0 1 RC
N
f-1057828618
f
GR
GS
[0.75 0 0 0.75 217.5 265.5035] CT
1 0 1 RC
N
f-1057828618
f
GR
GS
[0.75 0 0 0.75 380.25 267.71249] CT
1 0 1 RC
N
f-1057828618
f
GR
GS
[0.75 0 0 0.75 0 0] CT
1 GC
N
485 106 M
485 43 L
384 43 L
384 106 L
cp
f
GR
GS
[0.75 0 0 0.75 323.48417 39.13906] CT
N
/f1944532930{0.375 2.88 M
0.375 2.458 L
1.609 2.458 1.609 1.755 QT
1.609 -4.823 L
1.219 -4.901 0.375 -4.901 QT
0.375 -5.323 L
2.672 -5.323 L
2.719 -5.323 2.75 -5.276 QT
7 0.974 L
7 -4.183 L
7 -4.901 5.766 -4.901 QT
5.766 -5.323 L
8.609 -5.323 L
8.609 -4.901 L
7.391 -4.901 7.391 -4.183 QT
7.391 2.771 L
7.391 2.802 7.344 2.841 QT
7.297 2.88 7.266 2.88 QT
7.109 2.88 L
7.063 2.88 7.031 2.833 QT
2 -4.589 L
2 1.755 L
2 2.458 3.234 2.458 QT
3.234 2.88 L
0.375 2.88 L
cp}def
f1944532930
f
GR
GS
[0.75 0 0 0.75 323.48417 39.13906] CT
N
/f-357217629{13.672 3.146 M
12.531 3.146 11.617 2.536 QT
10.703 1.927 10.188 0.927 QT
9.672 -0.073 9.672 -1.183 QT
9.672 -2.011 9.969 -2.815 QT
10.266 -3.62 10.797 -4.237 QT
11.328 -4.854 12.07 -5.222 QT
12.813 -5.589 13.672 -5.589 QT
14.516 -5.589 15.266 -5.222 QT
16.016 -4.854 16.547 -4.222 QT
17.078 -3.589 17.367 -2.815 QT
17.656 -2.042 17.656 -1.183 QT
17.656 -0.073 17.141 0.927 QT
16.625 1.927 15.711 2.536 QT
14.797 3.146 13.672 3.146 QT
cp
11.672 1.583 M
12.031 2.13 12.547 2.458 QT
13.063 2.786 13.672 2.786 QT
14.063 2.786 14.438 2.63 QT
14.813 2.474 15.125 2.192 QT
15.438 1.911 15.656 1.583 QT
16.359 0.505 16.359 -1.386 QT
16.359 -3.104 15.656 -4.12 QT
15.297 -4.62 14.773 -4.925 QT
14.25 -5.229 13.672 -5.229 QT
13.078 -5.229 12.555 -4.925 QT
12.031 -4.62 11.672 -4.12 QT
11.391 -3.729 11.242 -3.284 QT
11.094 -2.839 11.023 -2.362 QT
10.953 -1.886 10.953 -1.386 QT
10.953 -0.839 11.016 -0.315 QT
11.078 0.208 11.25 0.7 QT
11.422 1.192 11.672 1.583 QT
cp}def
f-357217629
f
GR
GS
[0.75 0 0 0.75 323.48417 39.13906] CT
N
/f1694350474{19.005 5.646 M
19.005 5.599 19.021 5.599 QT
23.193 -5.979 L
23.208 -6.042 23.271 -6.081 QT
23.333 -6.12 23.412 -6.12 QT
23.521 -6.12 23.583 -6.058 QT
23.646 -5.995 23.646 -5.886 QT
23.646 -5.839 L
19.474 5.739 L
19.412 5.88 19.255 5.88 QT
19.146 5.88 19.076 5.81 QT
19.005 5.739 19.005 5.646 QT
cp}def
f1694350474
f
GR
GS
[0.75 0 0 0.75 323.48417 39.13906] CT
N
/f-856223217{24.708 2.88 M
24.708 2.458 L
25.943 2.458 25.943 1.755 QT
25.943 -4.823 L
25.552 -4.901 24.708 -4.901 QT
24.708 -5.323 L
27.005 -5.323 L
27.052 -5.323 27.083 -5.276 QT
31.333 0.974 L
31.333 -4.183 L
31.333 -4.901 30.099 -4.901 QT
30.099 -5.323 L
32.943 -5.323 L
32.943 -4.901 L
31.724 -4.901 31.724 -4.183 QT
31.724 2.771 L
31.724 2.802 31.677 2.841 QT
31.63 2.88 31.599 2.88 QT
31.443 2.88 L
31.396 2.88 31.365 2.833 QT
26.333 -4.589 L
26.333 1.755 L
26.333 2.458 27.568 2.458 QT
27.568 2.88 L
24.708 2.88 L
cp}def
f-856223217
f
GR
GS
[0.75 0 0 0.75 323.48417 39.13906] CT
N
/f-1958184410{38.005 3.146 M
36.865 3.146 35.951 2.536 QT
35.037 1.927 34.521 0.927 QT
34.005 -0.073 34.005 -1.183 QT
34.005 -2.011 34.302 -2.815 QT
34.599 -3.62 35.13 -4.237 QT
35.662 -4.854 36.404 -5.222 QT
37.146 -5.589 38.005 -5.589 QT
38.849 -5.589 39.599 -5.222 QT
40.349 -4.854 40.88 -4.222 QT
41.412 -3.589 41.701 -2.815 QT
41.99 -2.042 41.99 -1.183 QT
41.99 -0.073 41.474 0.927 QT
40.958 1.927 40.044 2.536 QT
39.13 3.146 38.005 3.146 QT
cp
36.005 1.583 M
36.365 2.13 36.88 2.458 QT
37.396 2.786 38.005 2.786 QT
38.396 2.786 38.771 2.63 QT
39.146 2.474 39.458 2.192 QT
39.771 1.911 39.99 1.583 QT
40.693 0.505 40.693 -1.386 QT
40.693 -3.104 39.99 -4.12 QT
39.63 -4.62 39.107 -4.925 QT
38.583 -5.229 38.005 -5.229 QT
37.412 -5.229 36.888 -4.925 QT
36.365 -4.62 36.005 -4.12 QT
35.724 -3.729 35.576 -3.284 QT
35.427 -2.839 35.357 -2.362 QT
35.287 -1.886 35.287 -1.386 QT
35.287 -0.839 35.349 -0.315 QT
35.412 0.208 35.583 0.7 QT
35.755 1.192 36.005 1.583 QT
cp}def
f-1958184410
f
GR
GS
[0.75 0 0 0.75 323.48417 39.13906] CT
N
/f-2101553479{43.917 2.88 M
43.917 -4.229 L
43.917 -4.542 43.823 -4.69 QT
43.729 -4.839 43.542 -4.87 QT
43.354 -4.901 42.979 -4.901 QT
42.979 -5.323 L
44.761 -5.448 L
44.761 -1.698 L
44.948 -1.917 45.214 -2.081 QT
45.479 -2.245 45.784 -2.331 QT
46.089 -2.417 46.417 -2.417 QT
46.948 -2.417 47.409 -2.206 QT
47.87 -1.995 48.214 -1.612 QT
48.557 -1.229 48.745 -0.737 QT
48.932 -0.245 48.932 0.286 QT
48.932 1.021 48.581 1.646 QT
48.229 2.271 47.612 2.646 QT
46.995 3.021 46.261 3.021 QT
45.807 3.021 45.378 2.786 QT
44.948 2.552 44.667 2.161 QT
44.261 2.88 L
43.917 2.88 L
cp
44.792 1.708 M
44.995 2.146 45.37 2.419 QT
45.745 2.692 46.198 2.692 QT
46.823 2.692 47.206 2.341 QT
47.589 1.989 47.737 1.442 QT
47.886 0.896 47.886 0.286 QT
47.886 -0.729 47.62 -1.245 QT
47.511 -1.479 47.307 -1.683 QT
47.104 -1.886 46.854 -2.003 QT
46.604 -2.12 46.323 -2.12 QT
45.854 -2.12 45.44 -1.862 QT
45.026 -1.604 44.792 -1.183 QT
44.792 1.708 L
cp}def
f-2101553479
f
GR
GS
[0.75 0 0 0.75 0 0] CT
0 0 1 RC
1 LJ
2.667 LW
N
388.027 52.185 M
428.292 52.185 L
S
GR
GS
[0.75 0 0 0.75 323.48417 50.29635] CT
N
/f629474577{4.672 3.146 M
3.531 3.146 2.617 2.536 QT
1.703 1.927 1.188 0.927 QT
0.672 -0.073 0.672 -1.183 QT
0.672 -2.011 0.969 -2.815 QT
1.266 -3.62 1.797 -4.237 QT
2.328 -4.854 3.07 -5.222 QT
3.813 -5.589 4.672 -5.589 QT
5.516 -5.589 6.266 -5.222 QT
7.016 -4.854 7.547 -4.222 QT
8.078 -3.589 8.367 -2.815 QT
8.656 -2.042 8.656 -1.183 QT
8.656 -0.073 8.141 0.927 QT
7.625 1.927 6.711 2.536 QT
5.797 3.146 4.672 3.146 QT
cp
2.672 1.583 M
3.031 2.13 3.547 2.458 QT
4.063 2.786 4.672 2.786 QT
5.063 2.786 5.438 2.63 QT
5.813 2.474 6.125 2.192 QT
6.438 1.911 6.656 1.583 QT
7.359 0.505 7.359 -1.386 QT
7.359 -3.104 6.656 -4.12 QT
6.297 -4.62 5.773 -4.925 QT
5.25 -5.229 4.672 -5.229 QT
4.078 -5.229 3.555 -4.925 QT
3.031 -4.62 2.672 -4.12 QT
2.391 -3.729 2.242 -3.284 QT
2.094 -2.839 2.023 -2.362 QT
1.953 -1.886 1.953 -1.386 QT
1.953 -0.839 2.016 -0.315 QT
2.078 0.208 2.25 0.7 QT
2.422 1.192 2.672 1.583 QT
cp}def
f629474577
f
GR
GS
[0.75 0 0 0.75 323.48417 50.29635] CT
N
/f1700453028{10.005 5.646 M
10.005 5.599 10.021 5.599 QT
14.193 -5.979 L
14.208 -6.042 14.271 -6.081 QT
14.333 -6.12 14.411 -6.12 QT
14.521 -6.12 14.583 -6.058 QT
14.646 -5.995 14.646 -5.886 QT
14.646 -5.839 L
10.474 5.739 L
10.411 5.88 10.255 5.88 QT
10.146 5.88 10.076 5.81 QT
10.005 5.739 10.005 5.646 QT
cp}def
f1700453028
f
GR
GS
[0.75 0 0 0.75 323.48417 50.29635] CT
N
/f-643772201{15.708 2.88 M
15.708 2.458 L
16.943 2.458 16.943 1.755 QT
16.943 -4.823 L
16.552 -4.901 15.708 -4.901 QT
15.708 -5.323 L
18.005 -5.323 L
18.052 -5.323 18.083 -5.276 QT
22.333 0.974 L
22.333 -4.183 L
22.333 -4.901 21.099 -4.901 QT
21.099 -5.323 L
23.943 -5.323 L
23.943 -4.901 L
22.724 -4.901 22.724 -4.183 QT
22.724 2.771 L
22.724 2.802 22.677 2.841 QT
22.63 2.88 22.599 2.88 QT
22.443 2.88 L
22.396 2.88 22.365 2.833 QT
17.333 -4.589 L
17.333 1.755 L
17.333 2.458 18.568 2.458 QT
18.568 2.88 L
15.708 2.88 L
cp}def
f-643772201
f
GR
GS
[0.75 0 0 0.75 323.48417 50.29635] CT
N
/f350596035{29.005 3.146 M
27.865 3.146 26.951 2.536 QT
26.037 1.927 25.521 0.927 QT
25.005 -0.073 25.005 -1.183 QT
25.005 -2.011 25.302 -2.815 QT
25.599 -3.62 26.13 -4.237 QT
26.662 -4.854 27.404 -5.222 QT
28.146 -5.589 29.005 -5.589 QT
29.849 -5.589 30.599 -5.222 QT
31.349 -4.854 31.88 -4.222 QT
32.412 -3.589 32.701 -2.815 QT
32.99 -2.042 32.99 -1.183 QT
32.99 -0.073 32.474 0.927 QT
31.958 1.927 31.044 2.536 QT
30.13 3.146 29.005 3.146 QT
cp
27.005 1.583 M
27.365 2.13 27.88 2.458 QT
28.396 2.786 29.005 2.786 QT
29.396 2.786 29.771 2.63 QT
30.146 2.474 30.458 2.192 QT
30.771 1.911 30.99 1.583 QT
31.693 0.505 31.693 -1.386 QT
31.693 -3.104 30.99 -4.12 QT
30.63 -4.62 30.107 -4.925 QT
29.583 -5.229 29.005 -5.229 QT
28.412 -5.229 27.888 -4.925 QT
27.365 -4.62 27.005 -4.12 QT
26.724 -3.729 26.576 -3.284 QT
26.427 -2.839 26.357 -2.362 QT
26.287 -1.886 26.287 -1.386 QT
26.287 -0.839 26.349 -0.315 QT
26.412 0.208 26.583 0.7 QT
26.755 1.192 27.005 1.583 QT
cp}def
f350596035
f
GR
GS
[0.75 0 0 0.75 323.48417 50.29635] CT
N
/f-1234088681{34.917 2.88 M
34.917 -4.229 L
34.917 -4.542 34.823 -4.69 QT
34.729 -4.839 34.542 -4.87 QT
34.354 -4.901 33.979 -4.901 QT
33.979 -5.323 L
35.761 -5.448 L
35.761 -1.698 L
35.948 -1.917 36.214 -2.081 QT
36.479 -2.245 36.784 -2.331 QT
37.089 -2.417 37.417 -2.417 QT
37.948 -2.417 38.409 -2.206 QT
38.87 -1.995 39.214 -1.612 QT
39.557 -1.229 39.745 -0.737 QT
39.932 -0.245 39.932 0.286 QT
39.932 1.021 39.581 1.646 QT
39.229 2.271 38.612 2.646 QT
37.995 3.021 37.261 3.021 QT
36.807 3.021 36.378 2.786 QT
35.948 2.552 35.667 2.161 QT
35.261 2.88 L
34.917 2.88 L
cp
35.792 1.708 M
35.995 2.146 36.37 2.419 QT
36.745 2.692 37.198 2.692 QT
37.823 2.692 38.206 2.341 QT
38.589 1.989 38.737 1.442 QT
38.886 0.896 38.886 0.286 QT
38.886 -0.729 38.62 -1.245 QT
38.511 -1.479 38.307 -1.683 QT
38.104 -1.886 37.854 -2.003 QT
37.604 -2.12 37.323 -2.12 QT
36.854 -2.12 36.44 -1.862 QT
36.026 -1.604 35.792 -1.183 QT
35.792 1.708 L
cp}def
f-1234088681
f
GR
GS
[0.75 0 0 0.75 0 0] CT
1 0 0 RC
1 LJ
2.667 LW
N
388.027 67.062 M
428.292 67.062 L
S
GR
GS
[0.75 0 0 0.75 323.48417 61.45365] CT
N
f1944532930
f
GR
GS
[0.75 0 0 0.75 323.48417 61.45365] CT
N
f-357217629
f
GR
GS
[0.75 0 0 0.75 323.48417 61.45365] CT
N
f1694350474
f
GR
GS
[0.75 0 0 0.75 323.48417 61.45365] CT
N
f350596035
f
GR
GS
[0.75 0 0 0.75 323.48417 61.45365] CT
N
f-1234088681
f
GR
GS
[0.75 0 0 0.75 323.48417 61.45365] CT
N
/f666931537{40.74 2.911 M
40.74 0.958 L
40.74 0.864 40.833 0.864 QT
40.99 0.864 L
41.052 0.864 41.083 0.958 QT
41.412 2.692 42.693 2.692 QT
43.271 2.692 43.654 2.435 QT
44.037 2.177 44.037 1.646 QT
44.037 1.255 43.732 0.982 QT
43.427 0.708 43.021 0.614 QT
42.224 0.458 L
41.818 0.364 41.49 0.185 QT
41.162 0.005 40.951 -0.3 QT
40.74 -0.604 40.74 -0.995 QT
40.74 -1.526 41.013 -1.862 QT
41.287 -2.198 41.732 -2.347 QT
42.177 -2.495 42.693 -2.495 QT
43.318 -2.495 43.771 -2.167 QT
44.115 -2.464 L
44.115 -2.495 44.177 -2.495 QT
44.255 -2.495 L
44.302 -2.495 44.326 -2.464 QT
44.349 -2.433 44.349 -2.401 QT
44.349 -0.823 L
44.349 -0.714 44.255 -0.714 QT
44.115 -0.714 L
44.005 -0.714 44.005 -0.823 QT
44.005 -1.464 43.662 -1.839 QT
43.318 -2.214 42.677 -2.214 QT
42.146 -2.214 41.748 -2.018 QT
41.349 -1.823 41.349 -1.339 QT
41.349 -0.995 41.638 -0.784 QT
41.927 -0.573 42.302 -0.479 QT
43.115 -0.323 L
43.521 -0.229 43.88 -0.011 QT
44.24 0.208 44.443 0.552 QT
44.646 0.896 44.646 1.317 QT
44.646 1.755 44.498 2.075 QT
44.349 2.396 44.083 2.607 QT
43.818 2.817 43.458 2.919 QT
43.099 3.021 42.693 3.021 QT
41.943 3.021 41.412 2.505 QT
40.974 2.989 L
40.974 3.021 40.912 3.021 QT
40.833 3.021 L
40.74 3.021 40.74 2.911 QT
cp}def
f666931537
f
GR
GS
[0.75 0 0 0.75 0 0] CT
0 1 0 RC
1 LJ
2.667 LW
N
388.027 81.938 M
428.292 81.938 L
S
GR
GS
[0.75 0 0 0.75 323.48417 72.61094] CT
N
f629474577
f
GR
GS
[0.75 0 0 0.75 323.48417 72.61094] CT
N
f1700453028
f
GR
GS
[0.75 0 0 0.75 323.48417 72.61094] CT
N
/f1405228822{20.005 3.146 M
18.865 3.146 17.951 2.536 QT
17.037 1.927 16.521 0.927 QT
16.005 -0.073 16.005 -1.183 QT
16.005 -2.011 16.302 -2.815 QT
16.599 -3.62 17.13 -4.237 QT
17.662 -4.854 18.404 -5.222 QT
19.146 -5.589 20.005 -5.589 QT
20.849 -5.589 21.599 -5.222 QT
22.349 -4.854 22.88 -4.222 QT
23.412 -3.589 23.701 -2.815 QT
23.99 -2.042 23.99 -1.183 QT
23.99 -0.073 23.474 0.927 QT
22.958 1.927 22.044 2.536 QT
21.13 3.146 20.005 3.146 QT
cp
18.005 1.583 M
18.365 2.13 18.88 2.458 QT
19.396 2.786 20.005 2.786 QT
20.396 2.786 20.771 2.63 QT
21.146 2.474 21.458 2.192 QT
21.771 1.911 21.99 1.583 QT
22.693 0.505 22.693 -1.386 QT
22.693 -3.104 21.99 -4.12 QT
21.63 -4.62 21.107 -4.925 QT
20.583 -5.229 20.005 -5.229 QT
19.412 -5.229 18.888 -4.925 QT
18.365 -4.62 18.005 -4.12 QT
17.724 -3.729 17.576 -3.284 QT
17.427 -2.839 17.357 -2.362 QT
17.287 -1.886 17.287 -1.386 QT
17.287 -0.839 17.349 -0.315 QT
17.412 0.208 17.583 0.7 QT
17.755 1.192 18.005 1.583 QT
cp}def
f1405228822
f
GR
GS
[0.75 0 0 0.75 323.48417 72.61094] CT
N
/f-2017356293{25.917 2.88 M
25.917 -4.229 L
25.917 -4.542 25.823 -4.69 QT
25.729 -4.839 25.542 -4.87 QT
25.354 -4.901 24.979 -4.901 QT
24.979 -5.323 L
26.76 -5.448 L
26.76 -1.698 L
26.948 -1.917 27.214 -2.081 QT
27.479 -2.245 27.784 -2.331 QT
28.089 -2.417 28.417 -2.417 QT
28.948 -2.417 29.409 -2.206 QT
29.87 -1.995 30.214 -1.612 QT
30.557 -1.229 30.745 -0.737 QT
30.932 -0.245 30.932 0.286 QT
30.932 1.021 30.581 1.646 QT
30.229 2.271 29.612 2.646 QT
28.995 3.021 28.26 3.021 QT
27.807 3.021 27.378 2.786 QT
26.948 2.552 26.667 2.161 QT
26.26 2.88 L
25.917 2.88 L
cp
26.792 1.708 M
26.995 2.146 27.37 2.419 QT
27.745 2.692 28.198 2.692 QT
28.823 2.692 29.206 2.341 QT
29.589 1.989 29.737 1.442 QT
29.885 0.896 29.885 0.286 QT
29.885 -0.729 29.62 -1.245 QT
29.51 -1.479 29.307 -1.683 QT
29.104 -1.886 28.854 -2.003 QT
28.604 -2.12 28.323 -2.12 QT
27.854 -2.12 27.44 -1.862 QT
27.026 -1.604 26.792 -1.183 QT
26.792 1.708 L
cp}def
f-2017356293
f
GR
GS
[0.75 0 0 0.75 323.48417 72.61094] CT
N
/f-145492987{31.74 2.911 M
31.74 0.958 L
31.74 0.864 31.833 0.864 QT
31.99 0.864 L
32.052 0.864 32.083 0.958 QT
32.412 2.692 33.693 2.692 QT
34.271 2.692 34.654 2.435 QT
35.037 2.177 35.037 1.646 QT
35.037 1.255 34.732 0.982 QT
34.427 0.708 34.021 0.614 QT
33.224 0.458 L
32.818 0.364 32.49 0.185 QT
32.162 0.005 31.951 -0.3 QT
31.74 -0.604 31.74 -0.995 QT
31.74 -1.526 32.013 -1.862 QT
32.287 -2.198 32.732 -2.347 QT
33.177 -2.495 33.693 -2.495 QT
34.318 -2.495 34.771 -2.167 QT
35.115 -2.464 L
35.115 -2.495 35.177 -2.495 QT
35.255 -2.495 L
35.302 -2.495 35.326 -2.464 QT
35.349 -2.433 35.349 -2.401 QT
35.349 -0.823 L
35.349 -0.714 35.255 -0.714 QT
35.115 -0.714 L
35.005 -0.714 35.005 -0.823 QT
35.005 -1.464 34.662 -1.839 QT
34.318 -2.214 33.677 -2.214 QT
33.146 -2.214 32.747 -2.018 QT
32.349 -1.823 32.349 -1.339 QT
32.349 -0.995 32.638 -0.784 QT
32.927 -0.573 33.302 -0.479 QT
34.115 -0.323 L
34.521 -0.229 34.88 -0.011 QT
35.24 0.208 35.443 0.552 QT
35.646 0.896 35.646 1.317 QT
35.646 1.755 35.497 2.075 QT
35.349 2.396 35.083 2.607 QT
34.818 2.817 34.458 2.919 QT
34.099 3.021 33.693 3.021 QT
32.943 3.021 32.412 2.505 QT
31.974 2.989 L
31.974 3.021 31.912 3.021 QT
31.833 3.021 L
31.74 3.021 31.74 2.911 QT
cp}def
f-145492987
f
GR
GS
[0.75 0 0 0.75 0 0] CT
1 0 1 RC
1 LJ
2.667 LW
N
388.027 96.815 M
428.292 96.815 L
S
GR
GS
[0.75 0 0 0.75 0 0] CT
0.149 GC
10.0 ML
0.667 LW
N
384 106 M
384 43 L
485 43 L
485 106 L
cp
S
GR
%%Trailer
%%Pages: 1
%%EOF
