%!PS-Adobe-3.0 EPSF-3.0
%%Creator: (MATLAB, The Mathworks, Inc. Version 9.3.0.713579 \(R2017b\). Operating System: Linux)
%%Title: ./sampleTuning.eps
%%CreationDate: 2020-08-19T11:32:49
%%Pages: (atend)
%%BoundingBox:    15     5   389   296
%%LanguageLevel: 3
%%EndComments
%%BeginProlog
%%BeginResource: procset (Apache XML Graphics Std ProcSet) 1.2 0
%%Version: 1.2 0
%%Copyright: (Copyright 2001-2003,2010 The Apache Software Foundation. License terms: http://www.apache.org/licenses/LICENSE-2.0)
/bd{bind def}bind def
/ld{load def}bd
/GR/grestore ld
/GS/gsave ld
/RM/rmoveto ld
/C/curveto ld
/t/show ld
/L/lineto ld
/ML/setmiterlimit ld
/CT/concat ld
/f/fill ld
/N/newpath ld
/S/stroke ld
/CC/setcmykcolor ld
/A/ashow ld
/cp/closepath ld
/RC/setrgbcolor ld
/LJ/setlinejoin ld
/GC/setgray ld
/LW/setlinewidth ld
/M/moveto ld
/re {4 2 roll M
1 index 0 rlineto
0 exch rlineto
neg 0 rlineto
cp } bd
/_ctm matrix def
/_tm matrix def
/BT { _ctm currentmatrix pop matrix _tm copy pop 0 0 moveto } bd
/ET { _ctm setmatrix } bd
/iTm { _ctm setmatrix _tm concat } bd
/Tm { _tm astore pop iTm 0 0 moveto } bd
/ux 0.0 def
/uy 0.0 def
/F {
  /Tp exch def
  /Tf exch def
  Tf findfont Tp scalefont setfont
  /cf Tf def  /cs Tp def
} bd
/ULS {currentpoint /uy exch def /ux exch def} bd
/ULE {
  /Tcx currentpoint pop def
  gsave
  newpath
  cf findfont cs scalefont dup
  /FontMatrix get 0 get /Ts exch def /FontInfo get dup
  /UnderlinePosition get Ts mul /To exch def
  /UnderlineThickness get Ts mul /Tt exch def
  ux uy To add moveto  Tcx uy To add lineto
  Tt setlinewidth stroke
  grestore
} bd
/OLE {
  /Tcx currentpoint pop def
  gsave
  newpath
  cf findfont cs scalefont dup
  /FontMatrix get 0 get /Ts exch def /FontInfo get dup
  /UnderlinePosition get Ts mul /To exch def
  /UnderlineThickness get Ts mul /Tt exch def
  ux uy To add cs add moveto Tcx uy To add cs add lineto
  Tt setlinewidth stroke
  grestore
} bd
/SOE {
  /Tcx currentpoint pop def
  gsave
  newpath
  cf findfont cs scalefont dup
  /FontMatrix get 0 get /Ts exch def /FontInfo get dup
  /UnderlinePosition get Ts mul /To exch def
  /UnderlineThickness get Ts mul /Tt exch def
  ux uy To add cs 10 mul 26 idiv add moveto Tcx uy To add cs 10 mul 26 idiv add lineto
  Tt setlinewidth stroke
  grestore
} bd
/QT {
/Y22 exch store
/X22 exch store
/Y21 exch store
/X21 exch store
currentpoint
/Y21 load 2 mul add 3 div exch
/X21 load 2 mul add 3 div exch
/X21 load 2 mul /X22 load add 3 div
/Y21 load 2 mul /Y22 load add 3 div
/X22 load /Y22 load curveto
} bd
/SSPD {
dup length /d exch dict def
{
/v exch def
/k exch def
currentpagedevice k known {
/cpdv currentpagedevice k get def
v cpdv ne {
/upd false def
/nullv v type /nulltype eq def
/nullcpdv cpdv type /nulltype eq def
nullv nullcpdv or
{
/upd true def
} {
/sametype v type cpdv type eq def
sametype {
v type /arraytype eq {
/vlen v length def
/cpdvlen cpdv length def
vlen cpdvlen eq {
0 1 vlen 1 sub {
/i exch def
/obj v i get def
/cpdobj cpdv i get def
obj cpdobj ne {
/upd true def
exit
} if
} for
} {
/upd true def
} ifelse
} {
v type /dicttype eq {
v {
/dv exch def
/dk exch def
/cpddv cpdv dk get def
dv cpddv ne {
/upd true def
exit
} if
} forall
} {
/upd true def
} ifelse
} ifelse
} if
} ifelse
upd true eq {
d k v put
} if
} if
} if
} forall
d length 0 gt {
d setpagedevice
} if
} bd
/RE { % /NewFontName [NewEncodingArray] /FontName RE -
  findfont dup length dict begin
  {
    1 index /FID ne
    {def} {pop pop} ifelse
  } forall
  /Encoding exch def
  /FontName 1 index def
  currentdict definefont pop
  end
} bind def
%%EndResource
%%BeginResource: procset (Apache XML Graphics EPS ProcSet) 1.0 0
%%Version: 1.0 0
%%Copyright: (Copyright 2002-2003 The Apache Software Foundation. License terms: http://www.apache.org/licenses/LICENSE-2.0)
/BeginEPSF { %def
/b4_Inc_state save def         % Save state for cleanup
/dict_count countdictstack def % Count objects on dict stack
/op_count count 1 sub def      % Count objects on operand stack
userdict begin                 % Push userdict on dict stack
/showpage { } def              % Redefine showpage, { } = null proc
0 setgray 0 setlinecap         % Prepare graphics state
1 setlinewidth 0 setlinejoin
10 setmiterlimit [ ] 0 setdash newpath
/languagelevel where           % If level not equal to 1 then
{pop languagelevel             % set strokeadjust and
1 ne                           % overprint to their defaults.
{false setstrokeadjust false setoverprint
} if
} if
} bd
/EndEPSF { %def
count op_count sub {pop} repeat            % Clean up stacks
countdictstack dict_count sub {end} repeat
b4_Inc_state restore
} bd
%%EndResource
%FOPBeginFontDict
%%IncludeResource: font Courier-Oblique
%%IncludeResource: font Courier-BoldOblique
%%IncludeResource: font Courier-Bold
%%IncludeResource: font ZapfDingbats
%%IncludeResource: font Symbol
%%IncludeResource: font Helvetica
%%IncludeResource: font Helvetica-Oblique
%%IncludeResource: font Helvetica-Bold
%%IncludeResource: font Helvetica-BoldOblique
%%IncludeResource: font Times-Roman
%%IncludeResource: font Times-Italic
%%IncludeResource: font Times-Bold
%%IncludeResource: font Times-BoldItalic
%%IncludeResource: font Courier
%FOPEndFontDict
%%BeginResource: encoding WinAnsiEncoding
/WinAnsiEncoding [
/.notdef /.notdef /.notdef /.notdef /.notdef
/.notdef /.notdef /.notdef /.notdef /.notdef
/.notdef /.notdef /.notdef /.notdef /.notdef
/.notdef /.notdef /.notdef /.notdef /.notdef
/.notdef /.notdef /.notdef /.notdef /.notdef
/.notdef /.notdef /.notdef /.notdef /.notdef
/.notdef /.notdef /space /exclam /quotedbl
/numbersign /dollar /percent /ampersand /quotesingle
/parenleft /parenright /asterisk /plus /comma
/hyphen /period /slash /zero /one
/two /three /four /five /six
/seven /eight /nine /colon /semicolon
/less /equal /greater /question /at
/A /B /C /D /E
/F /G /H /I /J
/K /L /M /N /O
/P /Q /R /S /T
/U /V /W /X /Y
/Z /bracketleft /backslash /bracketright /asciicircum
/underscore /quoteleft /a /b /c
/d /e /f /g /h
/i /j /k /l /m
/n /o /p /q /r
/s /t /u /v /w
/x /y /z /braceleft /bar
/braceright /asciitilde /bullet /Euro /bullet
/quotesinglbase /florin /quotedblbase /ellipsis /dagger
/daggerdbl /circumflex /perthousand /Scaron /guilsinglleft
/OE /bullet /Zcaron /bullet /bullet
/quoteleft /quoteright /quotedblleft /quotedblright /bullet
/endash /emdash /asciitilde /trademark /scaron
/guilsinglright /oe /bullet /zcaron /Ydieresis
/space /exclamdown /cent /sterling /currency
/yen /brokenbar /section /dieresis /copyright
/ordfeminine /guillemotleft /logicalnot /sfthyphen /registered
/macron /degree /plusminus /twosuperior /threesuperior
/acute /mu /paragraph /middot /cedilla
/onesuperior /ordmasculine /guillemotright /onequarter /onehalf
/threequarters /questiondown /Agrave /Aacute /Acircumflex
/Atilde /Adieresis /Aring /AE /Ccedilla
/Egrave /Eacute /Ecircumflex /Edieresis /Igrave
/Iacute /Icircumflex /Idieresis /Eth /Ntilde
/Ograve /Oacute /Ocircumflex /Otilde /Odieresis
/multiply /Oslash /Ugrave /Uacute /Ucircumflex
/Udieresis /Yacute /Thorn /germandbls /agrave
/aacute /acircumflex /atilde /adieresis /aring
/ae /ccedilla /egrave /eacute /ecircumflex
/edieresis /igrave /iacute /icircumflex /idieresis
/eth /ntilde /ograve /oacute /ocircumflex
/otilde /odieresis /divide /oslash /ugrave
/uacute /ucircumflex /udieresis /yacute /thorn
/ydieresis
] def
%%EndResource
%FOPBeginFontReencode
/Courier-Oblique findfont
dup length dict begin
  {1 index /FID ne {def} {pop pop} ifelse} forall
  /Encoding WinAnsiEncoding def
  currentdict
end
/Courier-Oblique exch definefont pop
/Courier-BoldOblique findfont
dup length dict begin
  {1 index /FID ne {def} {pop pop} ifelse} forall
  /Encoding WinAnsiEncoding def
  currentdict
end
/Courier-BoldOblique exch definefont pop
/Courier-Bold findfont
dup length dict begin
  {1 index /FID ne {def} {pop pop} ifelse} forall
  /Encoding WinAnsiEncoding def
  currentdict
end
/Courier-Bold exch definefont pop
/Helvetica findfont
dup length dict begin
  {1 index /FID ne {def} {pop pop} ifelse} forall
  /Encoding WinAnsiEncoding def
  currentdict
end
/Helvetica exch definefont pop
/Helvetica-Oblique findfont
dup length dict begin
  {1 index /FID ne {def} {pop pop} ifelse} forall
  /Encoding WinAnsiEncoding def
  currentdict
end
/Helvetica-Oblique exch definefont pop
/Helvetica-Bold findfont
dup length dict begin
  {1 index /FID ne {def} {pop pop} ifelse} forall
  /Encoding WinAnsiEncoding def
  currentdict
end
/Helvetica-Bold exch definefont pop
/Helvetica-BoldOblique findfont
dup length dict begin
  {1 index /FID ne {def} {pop pop} ifelse} forall
  /Encoding WinAnsiEncoding def
  currentdict
end
/Helvetica-BoldOblique exch definefont pop
/Times-Roman findfont
dup length dict begin
  {1 index /FID ne {def} {pop pop} ifelse} forall
  /Encoding WinAnsiEncoding def
  currentdict
end
/Times-Roman exch definefont pop
/Times-Italic findfont
dup length dict begin
  {1 index /FID ne {def} {pop pop} ifelse} forall
  /Encoding WinAnsiEncoding def
  currentdict
end
/Times-Italic exch definefont pop
/Times-Bold findfont
dup length dict begin
  {1 index /FID ne {def} {pop pop} ifelse} forall
  /Encoding WinAnsiEncoding def
  currentdict
end
/Times-Bold exch definefont pop
/Times-BoldItalic findfont
dup length dict begin
  {1 index /FID ne {def} {pop pop} ifelse} forall
  /Encoding WinAnsiEncoding def
  currentdict
end
/Times-BoldItalic exch definefont pop
/Courier findfont
dup length dict begin
  {1 index /FID ne {def} {pop pop} ifelse} forall
  /Encoding WinAnsiEncoding def
  currentdict
end
/Courier exch definefont pop
%FOPEndFontReencode
%%EndProlog
%%Page: 1 1
%%PageBoundingBox: 0 0 420 315
%%BeginPageSetup
[1 0 0 -1 0 315] CT
%%EndPageSetup
GS
[0.75 0 0 0.75 0 0] CT
1 GC
N
0 0 560 420 re
f
GR
GS
[0.75 0 0 0.75 0 0] CT
1 GC
N
0 0 560 420 re
f
GR
GS
[0.75 0 0 0.75 0 0] CT
1 GC
N
73 374 M
507 374 L
507 31 L
73 31 L
cp
f
GR
GS
[0.75 0 0 0.75 0 0] CT
0.873 GC
1 LJ
0.667 LW
N
73 374 M
73 31 L
S
GR
GS
[0.75 0 0 0.75 0 0] CT
0.873 GC
1 LJ
0.667 LW
N
127.25 374 M
127.25 31 L
S
GR
GS
[0.75 0 0 0.75 0 0] CT
0.873 GC
1 LJ
0.667 LW
N
181.5 374 M
181.5 31 L
S
GR
GS
[0.75 0 0 0.75 0 0] CT
0.873 GC
1 LJ
0.667 LW
N
235.75 374 M
235.75 31 L
S
GR
GS
[0.75 0 0 0.75 0 0] CT
0.873 GC
1 LJ
0.667 LW
N
290 374 M
290 31 L
S
GR
GS
[0.75 0 0 0.75 0 0] CT
0.873 GC
1 LJ
0.667 LW
N
344.25 374 M
344.25 31 L
S
GR
GS
[0.75 0 0 0.75 0 0] CT
0.873 GC
1 LJ
0.667 LW
N
398.5 374 M
398.5 31 L
S
GR
GS
[0.75 0 0 0.75 0 0] CT
0.873 GC
1 LJ
0.667 LW
N
452.75 374 M
452.75 31 L
S
GR
GS
[0.75 0 0 0.75 0 0] CT
0.873 GC
1 LJ
0.667 LW
N
507 374 M
507 31 L
S
GR
GS
[0.75 0 0 0.75 0 0] CT
0.873 GC
1 LJ
0.667 LW
N
507 374 M
73 374 L
S
GR
GS
[0.75 0 0 0.75 0 0] CT
0.873 GC
1 LJ
0.667 LW
N
507 339.7 M
73 339.7 L
S
GR
GS
[0.75 0 0 0.75 0 0] CT
0.873 GC
1 LJ
0.667 LW
N
507 305.4 M
73 305.4 L
S
GR
GS
[0.75 0 0 0.75 0 0] CT
0.873 GC
1 LJ
0.667 LW
N
507 271.1 M
73 271.1 L
S
GR
GS
[0.75 0 0 0.75 0 0] CT
0.873 GC
1 LJ
0.667 LW
N
507 236.8 M
73 236.8 L
S
GR
GS
[0.75 0 0 0.75 0 0] CT
0.873 GC
1 LJ
0.667 LW
N
507 202.5 M
73 202.5 L
S
GR
GS
[0.75 0 0 0.75 0 0] CT
0.873 GC
1 LJ
0.667 LW
N
507 168.2 M
73 168.2 L
S
GR
GS
[0.75 0 0 0.75 0 0] CT
0.873 GC
1 LJ
0.667 LW
N
507 133.9 M
73 133.9 L
S
GR
GS
[0.75 0 0 0.75 0 0] CT
0.873 GC
1 LJ
0.667 LW
N
507 99.6 M
73 99.6 L
S
GR
GS
[0.75 0 0 0.75 0 0] CT
0.873 GC
1 LJ
0.667 LW
N
507 65.3 M
73 65.3 L
S
GR
GS
[0.75 0 0 0.75 0 0] CT
0.873 GC
1 LJ
0.667 LW
N
507 31 M
73 31 L
S
GR
GS
[0.75 0 0 0.75 0 0] CT
0.149 GC
2 setlinecap
1 LJ
0.667 LW
N
73 374 M
507 374 L
S
GR
GS
[0.75 0 0 0.75 0 0] CT
0.149 GC
2 setlinecap
1 LJ
0.667 LW
N
73 374 M
73 369.66 L
S
GR
GS
[0.75 0 0 0.75 0 0] CT
0.149 GC
2 setlinecap
1 LJ
0.667 LW
N
127.25 374 M
127.25 369.66 L
S
GR
GS
[0.75 0 0 0.75 0 0] CT
0.149 GC
2 setlinecap
1 LJ
0.667 LW
N
181.5 374 M
181.5 369.66 L
S
GR
GS
[0.75 0 0 0.75 0 0] CT
0.149 GC
2 setlinecap
1 LJ
0.667 LW
N
235.75 374 M
235.75 369.66 L
S
GR
GS
[0.75 0 0 0.75 0 0] CT
0.149 GC
2 setlinecap
1 LJ
0.667 LW
N
290 374 M
290 369.66 L
S
GR
GS
[0.75 0 0 0.75 0 0] CT
0.149 GC
2 setlinecap
1 LJ
0.667 LW
N
344.25 374 M
344.25 369.66 L
S
GR
GS
[0.75 0 0 0.75 0 0] CT
0.149 GC
2 setlinecap
1 LJ
0.667 LW
N
398.5 374 M
398.5 369.66 L
S
GR
GS
[0.75 0 0 0.75 0 0] CT
0.149 GC
2 setlinecap
1 LJ
0.667 LW
N
452.75 374 M
452.75 369.66 L
S
GR
GS
[0.75 0 0 0.75 0 0] CT
0.149 GC
2 setlinecap
1 LJ
0.667 LW
N
507 374 M
507 369.66 L
S
GR
GS
[0.75 0 0 0.75 54.75 284.50001] CT
0.149 GC
/Helvetica 13.333 F
GS
[1 0 0 1 0 0] CT
-4.5 13 moveto 
1 -1 scale
(0) t 
GR
GR
GS
[0.75 0 0 0.75 95.4375 284.50001] CT
0.149 GC
/Helvetica 13.333 F
GS
[1 0 0 1 0 0] CT
-13 13 moveto 
1 -1 scale
(100) t 
GR
GR
GS
[0.75 0 0 0.75 136.125 284.50001] CT
0.149 GC
/Helvetica 13.333 F
GS
[1 0 0 1 0 0] CT
-13 13 moveto 
1 -1 scale
(200) t 
GR
GR
GS
[0.75 0 0 0.75 176.8125 284.50001] CT
0.149 GC
/Helvetica 13.333 F
GS
[1 0 0 1 0 0] CT
-13 13 moveto 
1 -1 scale
(300) t 
GR
GR
GS
[0.75 0 0 0.75 217.5 284.50001] CT
0.149 GC
/Helvetica 13.333 F
GS
[1 0 0 1 0 0] CT
-13 13 moveto 
1 -1 scale
(400) t 
GR
GR
GS
[0.75 0 0 0.75 258.1875 284.50001] CT
0.149 GC
/Helvetica 13.333 F
GS
[1 0 0 1 0 0] CT
-13 13 moveto 
1 -1 scale
(500) t 
GR
GR
GS
[0.75 0 0 0.75 298.875 284.50001] CT
0.149 GC
/Helvetica 13.333 F
GS
[1 0 0 1 0 0] CT
-13 13 moveto 
1 -1 scale
(600) t 
GR
GR
GS
[0.75 0 0 0.75 339.5625 284.50001] CT
0.149 GC
/Helvetica 13.333 F
GS
[1 0 0 1 0 0] CT
-13 13 moveto 
1 -1 scale
(700) t 
GR
GR
GS
[0.75 0 0 0.75 380.25 284.50001] CT
0.149 GC
/Helvetica 13.333 F
GS
[1 0 0 1 0 0] CT
-13 13 moveto 
1 -1 scale
(800) t 
GR
GR
GS
[0.75 0 0 0.75 217.50016 298.24999] CT
0.149 GC
N
-58.292 12.539 M
-58.292 9.039 L
-58.292 8.914 -58.167 8.914 QT
-57.979 8.914 L
-57.932 8.914 -57.893 8.953 QT
-57.854 8.992 -57.854 9.039 QT
-57.854 10.507 -56.948 11.312 QT
-56.042 12.117 -54.557 12.117 QT
-54.042 12.117 -53.596 11.82 QT
-53.151 11.523 -52.909 11.039 QT
-52.667 10.554 -52.667 10.023 QT
-52.667 9.57 -52.854 9.14 QT
-53.042 8.711 -53.385 8.398 QT
-53.729 8.086 -54.151 7.976 QT
-56.104 7.507 L
-57.073 7.257 -57.682 6.461 QT
-58.292 5.664 -58.292 4.679 QT
-58.292 3.898 -57.893 3.218 QT
-57.495 2.539 -56.831 2.14 QT
-56.167 1.742 -55.385 1.742 QT
-53.885 1.742 -52.995 2.757 QT
-52.385 1.789 L
-52.338 1.742 -52.276 1.742 QT
-52.182 1.742 L
-52.135 1.742 -52.096 1.773 QT
-52.057 1.804 -52.057 1.867 QT
-52.057 5.351 L
-52.057 5.476 -52.182 5.476 QT
-52.354 5.476 L
-52.495 5.476 -52.495 5.351 QT
-52.495 4.961 -52.62 4.507 QT
-52.745 4.054 -52.971 3.64 QT
-53.198 3.226 -53.463 2.961 QT
-54.198 2.226 -55.385 2.226 QT
-55.901 2.226 -56.331 2.484 QT
-56.76 2.742 -57.018 3.195 QT
-57.276 3.648 -57.276 4.132 QT
-57.276 4.773 -56.877 5.297 QT
-56.479 5.82 -55.838 5.992 QT
-53.885 6.461 L
-53.401 6.586 -52.971 6.89 QT
-52.542 7.195 -52.26 7.593 QT
-51.979 7.992 -51.815 8.492 QT
-51.651 8.992 -51.651 9.507 QT
-51.651 10.32 -52.026 11.047 QT
-52.401 11.773 -53.073 12.211 QT
-53.745 12.648 -54.557 12.648 QT
-55.057 12.648 -55.573 12.539 QT
-56.088 12.429 -56.534 12.203 QT
-56.979 11.976 -57.338 11.617 QT
-57.963 12.601 L
-58.01 12.648 -58.073 12.648 QT
-58.167 12.648 L
-58.292 12.648 -58.292 12.539 QT
cp
f
GR
GS
[0.75 0 0 0.75 217.50016 298.24999] CT
0.149 GC
N
-50.393 10.851 M
-50.393 9.961 -49.69 9.398 QT
-48.987 8.836 -47.995 8.601 QT
-47.003 8.367 -46.128 8.367 QT
-46.128 7.757 L
-46.128 7.32 -46.315 6.914 QT
-46.503 6.507 -46.862 6.25 QT
-47.221 5.992 -47.659 5.992 QT
-48.643 5.992 -49.175 6.445 QT
-48.878 6.445 -48.698 6.656 QT
-48.518 6.867 -48.518 7.164 QT
-48.518 7.461 -48.729 7.672 QT
-48.94 7.882 -49.221 7.882 QT
-49.534 7.882 -49.745 7.672 QT
-49.956 7.461 -49.956 7.164 QT
-49.956 6.367 -49.237 5.984 QT
-48.518 5.601 -47.659 5.601 QT
-47.05 5.601 -46.432 5.859 QT
-45.815 6.117 -45.425 6.601 QT
-45.034 7.086 -45.034 7.726 QT
-45.034 11.101 L
-45.034 11.398 -44.909 11.64 QT
-44.784 11.882 -44.518 11.882 QT
-44.268 11.882 -44.151 11.632 QT
-44.034 11.382 -44.034 11.101 QT
-44.034 10.148 L
-43.596 10.148 L
-43.596 11.101 L
-43.596 11.445 -43.768 11.75 QT
-43.94 12.054 -44.237 12.234 QT
-44.534 12.414 -44.878 12.414 QT
-45.315 12.414 -45.636 12.07 QT
-45.956 11.726 -45.987 11.257 QT
-46.268 11.82 -46.807 12.156 QT
-47.346 12.492 -47.971 12.492 QT
-48.534 12.492 -49.089 12.32 QT
-49.643 12.148 -50.018 11.789 QT
-50.393 11.429 -50.393 10.851 QT
cp
-49.175 10.851 M
-49.175 11.382 -48.784 11.734 QT
-48.393 12.086 -47.862 12.086 QT
-47.378 12.086 -46.987 11.851 QT
-46.596 11.617 -46.362 11.195 QT
-46.128 10.773 -46.128 10.32 QT
-46.128 8.757 L
-46.8 8.757 -47.518 8.976 QT
-48.237 9.195 -48.706 9.672 QT
-49.175 10.148 -49.175 10.851 QT
cp
f
GR
GS
[0.75 0 0 0.75 217.50016 298.24999] CT
0.149 GC
N
-43.201 12.32 M
-43.201 11.789 L
-42.701 11.789 -42.365 11.711 QT
-42.029 11.632 -42.029 11.32 QT
-42.029 7.226 L
-42.029 6.82 -42.154 6.64 QT
-42.279 6.461 -42.505 6.422 QT
-42.732 6.382 -43.201 6.382 QT
-43.201 5.851 L
-41.029 5.695 L
-41.029 7.164 L
-40.732 6.507 -40.138 6.101 QT
-39.544 5.695 -38.857 5.695 QT
-37.123 5.695 -36.826 7.101 QT
-36.529 6.461 -35.951 6.078 QT
-35.373 5.695 -34.685 5.695 QT
-33.998 5.695 -33.537 5.914 QT
-33.076 6.132 -32.841 6.586 QT
-32.607 7.039 -32.607 7.711 QT
-32.607 11.32 L
-32.607 11.632 -32.271 11.711 QT
-31.935 11.789 -31.435 11.789 QT
-31.435 12.32 L
-34.857 12.32 L
-34.857 11.789 L
-34.357 11.789 -34.021 11.711 QT
-33.685 11.632 -33.685 11.32 QT
-33.685 7.757 L
-33.685 7.007 -33.904 6.547 QT
-34.123 6.086 -34.779 6.086 QT
-35.638 6.086 -36.201 6.781 QT
-36.763 7.476 -36.763 8.351 QT
-36.763 11.32 L
-36.763 11.632 -36.435 11.711 QT
-36.107 11.789 -35.591 11.789 QT
-35.591 12.32 L
-39.029 12.32 L
-39.029 11.789 L
-38.513 11.789 -38.185 11.711 QT
-37.857 11.632 -37.857 11.32 QT
-37.857 7.757 L
-37.857 7.023 -38.068 6.554 QT
-38.279 6.086 -38.951 6.086 QT
-39.81 6.086 -40.373 6.781 QT
-40.935 7.476 -40.935 8.351 QT
-40.935 11.32 L
-40.935 11.632 -40.607 11.711 QT
-40.279 11.789 -39.779 11.789 QT
-39.779 12.32 L
-43.201 12.32 L
cp
f
GR
GS
[0.75 0 0 0.75 217.50016 298.24999] CT
0.149 GC
N
-31.041 15.226 M
-31.041 14.711 L
-30.525 14.711 -30.197 14.625 QT
-29.869 14.539 -29.869 14.226 QT
-29.869 6.992 L
-29.869 6.586 -30.166 6.484 QT
-30.463 6.382 -31.041 6.382 QT
-31.041 5.851 L
-28.822 5.695 L
-28.822 6.617 L
-28.416 6.164 -27.869 5.929 QT
-27.322 5.695 -26.713 5.695 QT
-25.822 5.695 -25.111 6.172 QT
-24.4 6.648 -24.002 7.429 QT
-23.603 8.211 -23.603 9.086 QT
-23.603 9.992 -24.049 10.773 QT
-24.494 11.554 -25.26 12.023 QT
-26.025 12.492 -26.932 12.492 QT
-28.025 12.492 -28.775 11.601 QT
-28.775 14.226 L
-28.775 14.539 -28.447 14.625 QT
-28.119 14.711 -27.603 14.711 QT
-27.603 15.226 L
-31.041 15.226 L
cp
-28.775 10.867 M
-28.51 11.398 -28.041 11.742 QT
-27.572 12.086 -27.025 12.086 QT
-26.51 12.086 -26.103 11.812 QT
-25.697 11.539 -25.432 11.07 QT
-25.166 10.601 -25.033 10.086 QT
-24.9 9.57 -24.9 9.086 QT
-24.9 8.476 -25.119 7.781 QT
-25.338 7.086 -25.783 6.601 QT
-26.228 6.117 -26.853 6.117 QT
-27.463 6.117 -27.971 6.429 QT
-28.478 6.742 -28.775 7.273 QT
-28.775 10.867 L
cp
f
GR
GS
[0.75 0 0 0.75 217.50016 298.24999] CT
0.149 GC
N
-22.815 12.32 M
-22.815 11.789 L
-22.315 11.789 -21.979 11.711 QT
-21.643 11.632 -21.643 11.32 QT
-21.643 3.445 L
-21.643 3.039 -21.768 2.859 QT
-21.893 2.679 -22.119 2.64 QT
-22.346 2.601 -22.815 2.601 QT
-22.815 2.07 L
-20.596 1.914 L
-20.596 11.32 L
-20.596 11.632 -20.268 11.711 QT
-19.94 11.789 -19.424 11.789 QT
-19.424 12.32 L
-22.815 12.32 L
cp
f
GR
GS
[0.75 0 0 0.75 217.50016 298.24999] CT
0.149 GC
N
-15.475 12.492 M
-16.397 12.492 -17.155 12.007 QT
-17.912 11.523 -18.35 10.726 QT
-18.787 9.929 -18.787 9.039 QT
-18.787 8.148 -18.389 7.359 QT
-17.99 6.57 -17.28 6.086 QT
-16.569 5.601 -15.694 5.601 QT
-14.99 5.601 -14.483 5.828 QT
-13.975 6.054 -13.647 6.468 QT
-13.319 6.882 -13.155 7.437 QT
-12.99 7.992 -12.99 8.664 QT
-12.99 8.851 -13.131 8.851 QT
-17.475 8.851 L
-17.475 9.023 L
-17.475 10.257 -16.975 11.156 QT
-16.475 12.054 -15.334 12.054 QT
-14.881 12.054 -14.49 11.843 QT
-14.1 11.632 -13.811 11.273 QT
-13.522 10.914 -13.412 10.492 QT
-13.397 10.445 -13.358 10.398 QT
-13.319 10.351 -13.272 10.351 QT
-13.131 10.351 L
-12.99 10.351 -12.99 10.554 QT
-13.194 11.398 -13.897 11.945 QT
-14.6 12.492 -15.475 12.492 QT
cp
-17.459 8.476 M
-14.053 8.476 L
-14.053 7.914 -14.209 7.336 QT
-14.365 6.757 -14.733 6.375 QT
-15.1 5.992 -15.694 5.992 QT
-16.537 5.992 -16.998 6.789 QT
-17.459 7.586 -17.459 8.476 QT
cp
f
GR
GS
[0.75 0 0 0.75 217.50016 298.24999] CT
0.149 GC
N
-12.191 12.367 M
-12.191 9.914 L
-12.191 9.804 -12.066 9.804 QT
-11.878 9.804 L
-11.784 9.804 -11.753 9.914 QT
-11.347 12.086 -9.738 12.086 QT
-9.034 12.086 -8.55 11.765 QT
-8.066 11.445 -8.066 10.773 QT
-8.066 10.289 -8.441 9.953 QT
-8.816 9.617 -9.331 9.492 QT
-10.331 9.289 L
-10.831 9.179 -11.245 8.953 QT
-11.659 8.726 -11.925 8.351 QT
-12.191 7.976 -12.191 7.476 QT
-12.191 6.804 -11.847 6.39 QT
-11.503 5.976 -10.941 5.789 QT
-10.378 5.601 -9.738 5.601 QT
-8.972 5.601 -8.394 6.007 QT
-7.972 5.632 L
-7.972 5.601 -7.894 5.601 QT
-7.784 5.601 L
-7.738 5.601 -7.699 5.64 QT
-7.659 5.679 -7.659 5.726 QT
-7.659 7.679 L
-7.659 7.82 -7.784 7.82 QT
-7.972 7.82 L
-8.097 7.82 -8.097 7.679 QT
-8.097 6.898 -8.534 6.422 QT
-8.972 5.945 -9.753 5.945 QT
-10.425 5.945 -10.917 6.195 QT
-11.409 6.445 -11.409 7.054 QT
-11.409 7.476 -11.058 7.742 QT
-10.706 8.007 -10.222 8.117 QT
-9.206 8.32 L
-8.706 8.429 -8.261 8.711 QT
-7.816 8.992 -7.558 9.414 QT
-7.3 9.836 -7.3 10.367 QT
-7.3 10.914 -7.48 11.312 QT
-7.659 11.711 -7.995 11.976 QT
-8.331 12.242 -8.784 12.367 QT
-9.238 12.492 -9.738 12.492 QT
-10.675 12.492 -11.347 11.851 QT
-11.894 12.445 L
-11.894 12.492 -11.972 12.492 QT
-12.066 12.492 L
-12.191 12.492 -12.191 12.367 QT
cp
f
GR
GS
[0.75 0 0 0.75 217.50016 298.24999] CT
0.149 GC
N
-1.626 15.226 M
-1.626 14.711 L
-1.11 14.711 -0.782 14.625 QT
-0.454 14.539 -0.454 14.226 QT
-0.454 6.992 L
-0.454 6.586 -0.751 6.484 QT
-1.048 6.382 -1.626 6.382 QT
-1.626 5.851 L
0.593 5.695 L
0.593 6.617 L
0.999 6.164 1.546 5.929 QT
2.093 5.695 2.702 5.695 QT
3.593 5.695 4.304 6.172 QT
5.015 6.648 5.413 7.429 QT
5.811 8.211 5.811 9.086 QT
5.811 9.992 5.366 10.773 QT
4.921 11.554 4.155 12.023 QT
3.39 12.492 2.483 12.492 QT
1.39 12.492 0.64 11.601 QT
0.64 14.226 L
0.64 14.539 0.968 14.625 QT
1.296 14.711 1.811 14.711 QT
1.811 15.226 L
-1.626 15.226 L
cp
0.64 10.867 M
0.905 11.398 1.374 11.742 QT
1.843 12.086 2.39 12.086 QT
2.905 12.086 3.311 11.812 QT
3.718 11.539 3.983 11.07 QT
4.249 10.601 4.382 10.086 QT
4.515 9.57 4.515 9.086 QT
4.515 8.476 4.296 7.781 QT
4.077 7.086 3.632 6.601 QT
3.186 6.117 2.561 6.117 QT
1.952 6.117 1.444 6.429 QT
0.936 6.742 0.64 7.273 QT
0.64 10.867 L
cp
f
GR
GS
[0.75 0 0 0.75 217.50016 298.24999] CT
0.149 GC
N
10.273 12.492 M
9.351 12.492 8.594 12.007 QT
7.836 11.523 7.398 10.726 QT
6.961 9.929 6.961 9.039 QT
6.961 8.148 7.359 7.359 QT
7.758 6.57 8.469 6.086 QT
9.18 5.601 10.055 5.601 QT
10.758 5.601 11.265 5.828 QT
11.773 6.054 12.101 6.468 QT
12.43 6.882 12.594 7.437 QT
12.758 7.992 12.758 8.664 QT
12.758 8.851 12.617 8.851 QT
8.273 8.851 L
8.273 9.023 L
8.273 10.257 8.773 11.156 QT
9.273 12.054 10.414 12.054 QT
10.867 12.054 11.258 11.843 QT
11.648 11.632 11.937 11.273 QT
12.226 10.914 12.336 10.492 QT
12.351 10.445 12.39 10.398 QT
12.43 10.351 12.476 10.351 QT
12.617 10.351 L
12.758 10.351 12.758 10.554 QT
12.555 11.398 11.851 11.945 QT
11.148 12.492 10.273 12.492 QT
cp
8.289 8.476 M
11.695 8.476 L
11.695 7.914 11.539 7.336 QT
11.383 6.757 11.015 6.375 QT
10.648 5.992 10.055 5.992 QT
9.211 5.992 8.75 6.789 QT
8.289 7.586 8.289 8.476 QT
cp
f
GR
GS
[0.75 0 0 0.75 217.50016 298.24999] CT
0.149 GC
N
13.448 12.32 M
13.448 11.789 L
13.964 11.789 14.292 11.711 QT
14.62 11.632 14.62 11.32 QT
14.62 7.226 L
14.62 6.82 14.495 6.64 QT
14.37 6.461 14.143 6.422 QT
13.917 6.382 13.448 6.382 QT
13.448 5.851 L
15.589 5.695 L
15.589 7.164 L
15.839 6.507 16.284 6.101 QT
16.729 5.695 17.37 5.695 QT
17.807 5.695 18.159 5.961 QT
18.511 6.226 18.511 6.648 QT
18.511 6.929 18.315 7.125 QT
18.12 7.32 17.839 7.32 QT
17.557 7.32 17.362 7.125 QT
17.167 6.929 17.167 6.648 QT
17.167 6.242 17.448 6.086 QT
17.37 6.086 L
16.761 6.086 16.378 6.523 QT
15.995 6.961 15.831 7.609 QT
15.667 8.257 15.667 8.851 QT
15.667 11.32 L
15.667 11.789 17.12 11.789 QT
17.12 12.32 L
13.448 12.32 L
cp
f
GR
GS
[0.75 0 0 0.75 217.50016 298.24999] CT
0.149 GC
N
25.253 12.32 M
25.253 3.445 L
25.253 3.039 25.128 2.859 QT
25.003 2.679 24.777 2.64 QT
24.55 2.601 24.081 2.601 QT
24.081 2.07 L
26.3 1.914 L
26.3 6.601 L
26.55 6.336 26.878 6.125 QT
27.206 5.914 27.589 5.804 QT
27.972 5.695 28.378 5.695 QT
29.05 5.695 29.62 5.961 QT
30.191 6.226 30.62 6.703 QT
31.05 7.179 31.285 7.804 QT
31.519 8.429 31.519 9.086 QT
31.519 9.992 31.074 10.773 QT
30.628 11.554 29.863 12.023 QT
29.097 12.492 28.191 12.492 QT
27.613 12.492 27.081 12.195 QT
26.55 11.898 26.191 11.414 QT
25.691 12.32 L
25.253 12.32 L
cp
26.347 10.851 M
26.597 11.398 27.066 11.742 QT
27.535 12.086 28.097 12.086 QT
28.878 12.086 29.355 11.64 QT
29.831 11.195 30.027 10.515 QT
30.222 9.836 30.222 9.086 QT
30.222 7.82 29.894 7.164 QT
29.738 6.867 29.488 6.617 QT
29.238 6.367 28.925 6.226 QT
28.613 6.086 28.269 6.086 QT
27.675 6.086 27.16 6.398 QT
26.644 6.711 26.347 7.257 QT
26.347 10.851 L
cp
f
GR
GS
[0.75 0 0 0.75 217.50016 298.24999] CT
0.149 GC
N
32.433 10.851 M
32.433 9.961 33.136 9.398 QT
33.839 8.836 34.831 8.601 QT
35.823 8.367 36.698 8.367 QT
36.698 7.757 L
36.698 7.32 36.511 6.914 QT
36.323 6.507 35.964 6.25 QT
35.605 5.992 35.167 5.992 QT
34.183 5.992 33.651 6.445 QT
33.948 6.445 34.128 6.656 QT
34.308 6.867 34.308 7.164 QT
34.308 7.461 34.097 7.672 QT
33.886 7.882 33.605 7.882 QT
33.292 7.882 33.081 7.672 QT
32.87 7.461 32.87 7.164 QT
32.87 6.367 33.589 5.984 QT
34.308 5.601 35.167 5.601 QT
35.776 5.601 36.394 5.859 QT
37.011 6.117 37.401 6.601 QT
37.792 7.086 37.792 7.726 QT
37.792 11.101 L
37.792 11.398 37.917 11.64 QT
38.042 11.882 38.308 11.882 QT
38.558 11.882 38.675 11.632 QT
38.792 11.382 38.792 11.101 QT
38.792 10.148 L
39.23 10.148 L
39.23 11.101 L
39.23 11.445 39.058 11.75 QT
38.886 12.054 38.589 12.234 QT
38.292 12.414 37.948 12.414 QT
37.511 12.414 37.191 12.07 QT
36.87 11.726 36.839 11.257 QT
36.558 11.82 36.019 12.156 QT
35.48 12.492 34.855 12.492 QT
34.292 12.492 33.737 12.32 QT
33.183 12.148 32.808 11.789 QT
32.433 11.429 32.433 10.851 QT
cp
33.651 10.851 M
33.651 11.382 34.042 11.734 QT
34.433 12.086 34.964 12.086 QT
35.448 12.086 35.839 11.851 QT
36.23 11.617 36.464 11.195 QT
36.698 10.773 36.698 10.32 QT
36.698 8.757 L
36.026 8.757 35.308 8.976 QT
34.589 9.195 34.12 9.672 QT
33.651 10.148 33.651 10.851 QT
cp
f
GR
GS
[0.75 0 0 0.75 217.50016 298.24999] CT
0.149 GC
N
40.704 10.523 M
40.704 6.382 L
39.454 6.382 L
39.454 5.992 L
40.438 5.992 40.899 5.078 QT
41.36 4.164 41.36 3.086 QT
41.797 3.086 L
41.797 5.851 L
43.907 5.851 L
43.907 6.382 L
41.797 6.382 L
41.797 10.492 L
41.797 11.117 42.008 11.586 QT
42.219 12.054 42.75 12.054 QT
43.266 12.054 43.493 11.554 QT
43.719 11.054 43.719 10.492 QT
43.719 9.601 L
44.157 9.601 L
44.157 10.523 L
44.157 10.992 43.985 11.445 QT
43.813 11.898 43.477 12.195 QT
43.141 12.492 42.657 12.492 QT
41.75 12.492 41.227 11.953 QT
40.704 11.414 40.704 10.523 QT
cp
f
GR
GS
[0.75 0 0 0.75 217.50016 298.24999] CT
0.149 GC
N
48.61 12.492 M
47.704 12.492 46.962 12.015 QT
46.22 11.539 45.798 10.757 QT
45.376 9.976 45.376 9.086 QT
45.376 8.195 45.798 7.382 QT
46.22 6.57 46.962 6.086 QT
47.704 5.601 48.61 5.601 QT
49.485 5.601 50.212 5.945 QT
50.939 6.289 50.939 7.07 QT
50.939 7.367 50.728 7.578 QT
50.517 7.789 50.22 7.789 QT
49.923 7.789 49.712 7.578 QT
49.501 7.367 49.501 7.07 QT
49.501 6.804 49.665 6.609 QT
49.829 6.414 50.079 6.367 QT
49.564 6.039 48.626 6.039 QT
47.907 6.039 47.47 6.515 QT
47.032 6.992 46.853 7.695 QT
46.673 8.398 46.673 9.086 QT
46.673 9.804 46.892 10.484 QT
47.11 11.164 47.587 11.609 QT
48.064 12.054 48.798 12.054 QT
49.501 12.054 50.001 11.617 QT
50.501 11.179 50.689 10.476 QT
50.689 10.382 50.798 10.382 QT
50.985 10.382 L
51.032 10.382 51.064 10.422 QT
51.095 10.461 51.095 10.523 QT
51.095 10.554 L
50.876 11.445 50.204 11.968 QT
49.532 12.492 48.61 12.492 QT
cp
f
GR
GS
[0.75 0 0 0.75 217.50016 298.24999] CT
0.149 GC
N
51.44 12.32 M
51.44 11.789 L
51.94 11.789 52.276 11.711 QT
52.612 11.632 52.612 11.32 QT
52.612 3.445 L
52.612 3.039 52.487 2.859 QT
52.362 2.679 52.136 2.64 QT
51.909 2.601 51.44 2.601 QT
51.44 2.07 L
53.659 1.914 L
53.659 7.07 L
53.971 6.445 54.534 6.07 QT
55.096 5.695 55.784 5.695 QT
56.831 5.695 57.354 6.195 QT
57.878 6.695 57.878 7.711 QT
57.878 11.32 L
57.878 11.632 58.206 11.711 QT
58.534 11.789 59.05 11.789 QT
59.05 12.32 L
55.612 12.32 L
55.612 11.789 L
56.128 11.789 56.456 11.711 QT
56.784 11.632 56.784 11.32 QT
56.784 7.757 L
56.784 7.023 56.573 6.554 QT
56.362 6.086 55.69 6.086 QT
54.831 6.086 54.268 6.781 QT
53.706 7.476 53.706 8.351 QT
53.706 11.32 L
53.706 11.632 54.034 11.711 QT
54.362 11.789 54.862 11.789 QT
54.862 12.32 L
51.44 12.32 L
cp
f
GR
GS
[0.75 0 0 0.75 0 0] CT
0.149 GC
2 setlinecap
1 LJ
0.667 LW
N
73 374 M
73 31 L
S
GR
GS
[0.75 0 0 0.75 0 0] CT
0.149 GC
2 setlinecap
1 LJ
0.667 LW
N
73 374 M
77.34 374 L
S
GR
GS
[0.75 0 0 0.75 0 0] CT
0.149 GC
2 setlinecap
1 LJ
0.667 LW
N
73 339.7 M
77.34 339.7 L
S
GR
GS
[0.75 0 0 0.75 0 0] CT
0.149 GC
2 setlinecap
1 LJ
0.667 LW
N
73 305.4 M
77.34 305.4 L
S
GR
GS
[0.75 0 0 0.75 0 0] CT
0.149 GC
2 setlinecap
1 LJ
0.667 LW
N
73 271.1 M
77.34 271.1 L
S
GR
GS
[0.75 0 0 0.75 0 0] CT
0.149 GC
2 setlinecap
1 LJ
0.667 LW
N
73 236.8 M
77.34 236.8 L
S
GR
GS
[0.75 0 0 0.75 0 0] CT
0.149 GC
2 setlinecap
1 LJ
0.667 LW
N
73 202.5 M
77.34 202.5 L
S
GR
GS
[0.75 0 0 0.75 0 0] CT
0.149 GC
2 setlinecap
1 LJ
0.667 LW
N
73 168.2 M
77.34 168.2 L
S
GR
GS
[0.75 0 0 0.75 0 0] CT
0.149 GC
2 setlinecap
1 LJ
0.667 LW
N
73 133.9 M
77.34 133.9 L
S
GR
GS
[0.75 0 0 0.75 0 0] CT
0.149 GC
2 setlinecap
1 LJ
0.667 LW
N
73 99.6 M
77.34 99.6 L
S
GR
GS
[0.75 0 0 0.75 0 0] CT
0.149 GC
2 setlinecap
1 LJ
0.667 LW
N
73 65.3 M
77.34 65.3 L
S
GR
GS
[0.75 0 0 0.75 0 0] CT
0.149 GC
2 setlinecap
1 LJ
0.667 LW
N
73 31 M
77.34 31 L
S
GR
GS
[0.75 0 0 0.75 50.75 280.5] CT
0.149 GC
/Helvetica 13.333 F
GS
[1 0 0 1 0 0] CT
-9 4.5 moveto 
1 -1 scale
(0) t 
GR
GR
GS
[0.75 0 0 0.75 50.75 254.77501] CT
0.149 GC
/Helvetica 13.333 F
GS
[1 0 0 1 0 0] CT
-17 4.5 moveto 
1 -1 scale
(10) t 
GR
GR
GS
[0.75 0 0 0.75 50.75 229.05] CT
0.149 GC
/Helvetica 13.333 F
GS
[1 0 0 1 0 0] CT
-17 4.5 moveto 
1 -1 scale
(20) t 
GR
GR
GS
[0.75 0 0 0.75 50.75 203.325] CT
0.149 GC
/Helvetica 13.333 F
GS
[1 0 0 1 0 0] CT
-17 4.5 moveto 
1 -1 scale
(30) t 
GR
GR
GS
[0.75 0 0 0.75 50.75 177.6] CT
0.149 GC
/Helvetica 13.333 F
GS
[1 0 0 1 0 0] CT
-17 4.5 moveto 
1 -1 scale
(40) t 
GR
GR
GS
[0.75 0 0 0.75 50.75 151.875] CT
0.149 GC
/Helvetica 13.333 F
GS
[1 0 0 1 0 0] CT
-17 4.5 moveto 
1 -1 scale
(50) t 
GR
GR
GS
[0.75 0 0 0.75 50.75 126.15] CT
0.149 GC
/Helvetica 13.333 F
GS
[1 0 0 1 0 0] CT
-17 4.5 moveto 
1 -1 scale
(60) t 
GR
GR
GS
[0.75 0 0 0.75 50.75 100.425] CT
0.149 GC
/Helvetica 13.333 F
GS
[1 0 0 1 0 0] CT
-17 4.5 moveto 
1 -1 scale
(70) t 
GR
GR
GS
[0.75 0 0 0.75 50.75 74.7] CT
0.149 GC
/Helvetica 13.333 F
GS
[1 0 0 1 0 0] CT
-17 4.5 moveto 
1 -1 scale
(80) t 
GR
GR
GS
[0.75 0 0 0.75 50.75 48.975] CT
0.149 GC
/Helvetica 13.333 F
GS
[1 0 0 1 0 0] CT
-17 4.5 moveto 
1 -1 scale
(90) t 
GR
GR
GS
[0.75 0 0 0.75 50.75 23.25] CT
0.149 GC
/Helvetica 13.333 F
GS
[1 0 0 1 0 0] CT
-26 4.5 moveto 
1 -1 scale
(100) t 
GR
GR
GS
[0 -0.75 0.75 0 28.25 151.87489] CT
0.149 GC
N
-72.184 -5.061 M
-72.184 -8.561 L
-72.184 -8.686 -72.059 -8.686 QT
-71.872 -8.686 L
-71.825 -8.686 -71.786 -8.647 QT
-71.747 -8.608 -71.747 -8.561 QT
-71.747 -7.093 -70.84 -6.288 QT
-69.934 -5.483 -68.45 -5.483 QT
-67.934 -5.483 -67.489 -5.78 QT
-67.044 -6.077 -66.801 -6.561 QT
-66.559 -7.046 -66.559 -7.577 QT
-66.559 -8.03 -66.747 -8.46 QT
-66.934 -8.889 -67.278 -9.202 QT
-67.622 -9.514 -68.044 -9.624 QT
-69.997 -10.093 L
-70.965 -10.343 -71.575 -11.139 QT
-72.184 -11.936 -72.184 -12.921 QT
-72.184 -13.702 -71.786 -14.382 QT
-71.387 -15.061 -70.723 -15.46 QT
-70.059 -15.858 -69.278 -15.858 QT
-67.778 -15.858 -66.887 -14.843 QT
-66.278 -15.811 L
-66.231 -15.858 -66.169 -15.858 QT
-66.075 -15.858 L
-66.028 -15.858 -65.989 -15.827 QT
-65.95 -15.796 -65.95 -15.733 QT
-65.95 -12.249 L
-65.95 -12.124 -66.075 -12.124 QT
-66.247 -12.124 L
-66.387 -12.124 -66.387 -12.249 QT
-66.387 -12.639 -66.512 -13.093 QT
-66.637 -13.546 -66.864 -13.96 QT
-67.09 -14.374 -67.356 -14.639 QT
-68.09 -15.374 -69.278 -15.374 QT
-69.794 -15.374 -70.223 -15.116 QT
-70.653 -14.858 -70.911 -14.405 QT
-71.169 -13.952 -71.169 -13.468 QT
-71.169 -12.827 -70.77 -12.303 QT
-70.372 -11.78 -69.731 -11.608 QT
-67.778 -11.139 L
-67.294 -11.014 -66.864 -10.71 QT
-66.434 -10.405 -66.153 -10.007 QT
-65.872 -9.608 -65.708 -9.108 QT
-65.544 -8.608 -65.544 -8.093 QT
-65.544 -7.28 -65.919 -6.553 QT
-66.294 -5.827 -66.965 -5.389 QT
-67.637 -4.952 -68.45 -4.952 QT
-68.95 -4.952 -69.465 -5.061 QT
-69.981 -5.171 -70.426 -5.397 QT
-70.872 -5.624 -71.231 -5.983 QT
-71.856 -4.999 L
-71.903 -4.952 -71.965 -4.952 QT
-72.059 -4.952 L
-72.184 -4.952 -72.184 -5.061 QT
cp
f
GR
GS
[0 -0.75 0.75 0 28.25 151.87489] CT
0.149 GC
N
-63.255 -7.061 M
-63.255 -10.374 L
-63.255 -10.78 -63.38 -10.96 QT
-63.505 -11.139 -63.731 -11.178 QT
-63.958 -11.218 -64.427 -11.218 QT
-64.427 -11.749 L
-62.161 -11.905 L
-62.161 -7.061 L
-62.161 -6.483 -62.075 -6.155 QT
-61.989 -5.827 -61.716 -5.671 QT
-61.442 -5.514 -60.848 -5.514 QT
-60.036 -5.514 -59.559 -6.186 QT
-59.083 -6.858 -59.083 -7.718 QT
-59.083 -10.374 L
-59.083 -10.78 -59.208 -10.96 QT
-59.333 -11.139 -59.559 -11.178 QT
-59.786 -11.218 -60.255 -11.218 QT
-60.255 -11.749 L
-57.989 -11.905 L
-57.989 -6.639 L
-57.989 -6.249 -57.872 -6.069 QT
-57.755 -5.889 -57.528 -5.85 QT
-57.302 -5.811 -56.817 -5.811 QT
-56.817 -5.28 L
-59.036 -5.108 L
-59.036 -6.374 L
-59.317 -5.811 -59.817 -5.46 QT
-60.317 -5.108 -60.911 -5.108 QT
-61.989 -5.108 -62.622 -5.569 QT
-63.255 -6.03 -63.255 -7.061 QT
cp
f
GR
GS
[0 -0.75 0.75 0 28.25 151.87489] CT
0.149 GC
N
-52.997 -5.108 M
-53.903 -5.108 -54.646 -5.585 QT
-55.388 -6.061 -55.81 -6.843 QT
-56.232 -7.624 -56.232 -8.514 QT
-56.232 -9.405 -55.81 -10.218 QT
-55.388 -11.03 -54.646 -11.514 QT
-53.903 -11.999 -52.997 -11.999 QT
-52.122 -11.999 -51.396 -11.655 QT
-50.669 -11.311 -50.669 -10.53 QT
-50.669 -10.233 -50.88 -10.022 QT
-51.091 -9.811 -51.388 -9.811 QT
-51.685 -9.811 -51.896 -10.022 QT
-52.107 -10.233 -52.107 -10.53 QT
-52.107 -10.796 -51.943 -10.991 QT
-51.778 -11.186 -51.528 -11.233 QT
-52.044 -11.561 -52.982 -11.561 QT
-53.7 -11.561 -54.138 -11.085 QT
-54.575 -10.608 -54.755 -9.905 QT
-54.935 -9.202 -54.935 -8.514 QT
-54.935 -7.796 -54.716 -7.116 QT
-54.497 -6.436 -54.021 -5.991 QT
-53.544 -5.546 -52.81 -5.546 QT
-52.107 -5.546 -51.607 -5.983 QT
-51.107 -6.421 -50.919 -7.124 QT
-50.919 -7.218 -50.81 -7.218 QT
-50.622 -7.218 L
-50.575 -7.218 -50.544 -7.178 QT
-50.513 -7.139 -50.513 -7.077 QT
-50.513 -7.046 L
-50.732 -6.155 -51.403 -5.632 QT
-52.075 -5.108 -52.997 -5.108 QT
cp
f
GR
GS
[0 -0.75 0.75 0 28.25 151.87489] CT
0.149 GC
N
-46.479 -5.108 M
-47.385 -5.108 -48.127 -5.585 QT
-48.869 -6.061 -49.291 -6.843 QT
-49.713 -7.624 -49.713 -8.514 QT
-49.713 -9.405 -49.291 -10.218 QT
-48.869 -11.03 -48.127 -11.514 QT
-47.385 -11.999 -46.479 -11.999 QT
-45.604 -11.999 -44.877 -11.655 QT
-44.151 -11.311 -44.151 -10.53 QT
-44.151 -10.233 -44.361 -10.022 QT
-44.572 -9.811 -44.869 -9.811 QT
-45.166 -9.811 -45.377 -10.022 QT
-45.588 -10.233 -45.588 -10.53 QT
-45.588 -10.796 -45.424 -10.991 QT
-45.26 -11.186 -45.01 -11.233 QT
-45.526 -11.561 -46.463 -11.561 QT
-47.182 -11.561 -47.619 -11.085 QT
-48.057 -10.608 -48.236 -9.905 QT
-48.416 -9.202 -48.416 -8.514 QT
-48.416 -7.796 -48.197 -7.116 QT
-47.979 -6.436 -47.502 -5.991 QT
-47.026 -5.546 -46.291 -5.546 QT
-45.588 -5.546 -45.088 -5.983 QT
-44.588 -6.421 -44.401 -7.124 QT
-44.401 -7.218 -44.291 -7.218 QT
-44.104 -7.218 L
-44.057 -7.218 -44.026 -7.178 QT
-43.994 -7.139 -43.994 -7.077 QT
-43.994 -7.046 L
-44.213 -6.155 -44.885 -5.632 QT
-45.557 -5.108 -46.479 -5.108 QT
cp
f
GR
GS
[0 -0.75 0.75 0 28.25 151.87489] CT
0.149 GC
N
-39.96 -5.108 M
-40.882 -5.108 -41.64 -5.593 QT
-42.398 -6.077 -42.835 -6.874 QT
-43.273 -7.671 -43.273 -8.561 QT
-43.273 -9.452 -42.874 -10.241 QT
-42.476 -11.03 -41.765 -11.514 QT
-41.054 -11.999 -40.179 -11.999 QT
-39.476 -11.999 -38.968 -11.772 QT
-38.46 -11.546 -38.132 -11.132 QT
-37.804 -10.718 -37.64 -10.163 QT
-37.476 -9.608 -37.476 -8.936 QT
-37.476 -8.749 -37.616 -8.749 QT
-41.96 -8.749 L
-41.96 -8.577 L
-41.96 -7.343 -41.46 -6.444 QT
-40.96 -5.546 -39.82 -5.546 QT
-39.366 -5.546 -38.976 -5.757 QT
-38.585 -5.968 -38.296 -6.327 QT
-38.007 -6.686 -37.898 -7.108 QT
-37.882 -7.155 -37.843 -7.202 QT
-37.804 -7.249 -37.757 -7.249 QT
-37.616 -7.249 L
-37.476 -7.249 -37.476 -7.046 QT
-37.679 -6.202 -38.382 -5.655 QT
-39.085 -5.108 -39.96 -5.108 QT
cp
-41.945 -9.124 M
-38.538 -9.124 L
-38.538 -9.686 -38.695 -10.264 QT
-38.851 -10.843 -39.218 -11.225 QT
-39.585 -11.608 -40.179 -11.608 QT
-41.023 -11.608 -41.484 -10.811 QT
-41.945 -10.014 -41.945 -9.124 QT
cp
f
GR
GS
[0 -0.75 0.75 0 28.25 151.87489] CT
0.149 GC
N
-36.676 -5.233 M
-36.676 -7.686 L
-36.676 -7.796 -36.551 -7.796 QT
-36.364 -7.796 L
-36.27 -7.796 -36.239 -7.686 QT
-35.832 -5.514 -34.223 -5.514 QT
-33.52 -5.514 -33.035 -5.835 QT
-32.551 -6.155 -32.551 -6.827 QT
-32.551 -7.311 -32.926 -7.647 QT
-33.301 -7.983 -33.817 -8.108 QT
-34.817 -8.311 L
-35.317 -8.421 -35.731 -8.647 QT
-36.145 -8.874 -36.41 -9.249 QT
-36.676 -9.624 -36.676 -10.124 QT
-36.676 -10.796 -36.332 -11.21 QT
-35.989 -11.624 -35.426 -11.811 QT
-34.864 -11.999 -34.223 -11.999 QT
-33.457 -11.999 -32.879 -11.593 QT
-32.457 -11.968 L
-32.457 -11.999 -32.379 -11.999 QT
-32.27 -11.999 L
-32.223 -11.999 -32.184 -11.96 QT
-32.145 -11.921 -32.145 -11.874 QT
-32.145 -9.921 L
-32.145 -9.78 -32.27 -9.78 QT
-32.457 -9.78 L
-32.582 -9.78 -32.582 -9.921 QT
-32.582 -10.702 -33.02 -11.178 QT
-33.457 -11.655 -34.239 -11.655 QT
-34.91 -11.655 -35.403 -11.405 QT
-35.895 -11.155 -35.895 -10.546 QT
-35.895 -10.124 -35.543 -9.858 QT
-35.192 -9.593 -34.707 -9.483 QT
-33.692 -9.28 L
-33.192 -9.171 -32.746 -8.889 QT
-32.301 -8.608 -32.043 -8.186 QT
-31.785 -7.764 -31.785 -7.233 QT
-31.785 -6.686 -31.965 -6.288 QT
-32.145 -5.889 -32.481 -5.624 QT
-32.817 -5.358 -33.27 -5.233 QT
-33.723 -5.108 -34.223 -5.108 QT
-35.16 -5.108 -35.832 -5.749 QT
-36.379 -5.155 L
-36.379 -5.108 -36.457 -5.108 QT
-36.551 -5.108 L
-36.676 -5.108 -36.676 -5.233 QT
cp
f
GR
GS
[0 -0.75 0.75 0 28.25 151.87489] CT
0.149 GC
N
-30.891 -5.233 M
-30.891 -7.686 L
-30.891 -7.796 -30.766 -7.796 QT
-30.578 -7.796 L
-30.485 -7.796 -30.453 -7.686 QT
-30.047 -5.514 -28.438 -5.514 QT
-27.735 -5.514 -27.25 -5.835 QT
-26.766 -6.155 -26.766 -6.827 QT
-26.766 -7.311 -27.141 -7.647 QT
-27.516 -7.983 -28.031 -8.108 QT
-29.031 -8.311 L
-29.531 -8.421 -29.946 -8.647 QT
-30.36 -8.874 -30.625 -9.249 QT
-30.891 -9.624 -30.891 -10.124 QT
-30.891 -10.796 -30.547 -11.21 QT
-30.203 -11.624 -29.641 -11.811 QT
-29.078 -11.999 -28.438 -11.999 QT
-27.672 -11.999 -27.094 -11.593 QT
-26.672 -11.968 L
-26.672 -11.999 -26.594 -11.999 QT
-26.485 -11.999 L
-26.438 -11.999 -26.399 -11.96 QT
-26.36 -11.921 -26.36 -11.874 QT
-26.36 -9.921 L
-26.36 -9.78 -26.485 -9.78 QT
-26.672 -9.78 L
-26.797 -9.78 -26.797 -9.921 QT
-26.797 -10.702 -27.235 -11.178 QT
-27.672 -11.655 -28.453 -11.655 QT
-29.125 -11.655 -29.617 -11.405 QT
-30.11 -11.155 -30.11 -10.546 QT
-30.11 -10.124 -29.758 -9.858 QT
-29.406 -9.593 -28.922 -9.483 QT
-27.906 -9.28 L
-27.406 -9.171 -26.961 -8.889 QT
-26.516 -8.608 -26.258 -8.186 QT
-26 -7.764 -26 -7.233 QT
-26 -6.686 -26.18 -6.288 QT
-26.36 -5.889 -26.696 -5.624 QT
-27.031 -5.358 -27.485 -5.233 QT
-27.938 -5.108 -28.438 -5.108 QT
-29.375 -5.108 -30.047 -5.749 QT
-30.594 -5.155 L
-30.594 -5.108 -30.672 -5.108 QT
-30.766 -5.108 L
-30.891 -5.108 -30.891 -5.233 QT
cp
f
GR
GS
[0 -0.75 0.75 0 28.25 151.87489] CT
0.149 GC
N
-20.326 -2.374 M
-20.326 -2.889 L
-19.811 -2.889 -19.482 -2.975 QT
-19.154 -3.061 -19.154 -3.374 QT
-19.154 -10.608 L
-19.154 -11.014 -19.451 -11.116 QT
-19.748 -11.218 -20.326 -11.218 QT
-20.326 -11.749 L
-18.107 -11.905 L
-18.107 -10.983 L
-17.701 -11.436 -17.154 -11.671 QT
-16.607 -11.905 -15.998 -11.905 QT
-15.107 -11.905 -14.396 -11.428 QT
-13.686 -10.952 -13.287 -10.171 QT
-12.889 -9.389 -12.889 -8.514 QT
-12.889 -7.608 -13.334 -6.827 QT
-13.779 -6.046 -14.545 -5.577 QT
-15.311 -5.108 -16.217 -5.108 QT
-17.311 -5.108 -18.061 -5.999 QT
-18.061 -3.374 L
-18.061 -3.061 -17.732 -2.975 QT
-17.404 -2.889 -16.889 -2.889 QT
-16.889 -2.374 L
-20.326 -2.374 L
cp
-18.061 -6.733 M
-17.795 -6.202 -17.326 -5.858 QT
-16.857 -5.514 -16.311 -5.514 QT
-15.795 -5.514 -15.389 -5.788 QT
-14.982 -6.061 -14.717 -6.53 QT
-14.451 -6.999 -14.318 -7.514 QT
-14.186 -8.03 -14.186 -8.514 QT
-14.186 -9.124 -14.404 -9.819 QT
-14.623 -10.514 -15.068 -10.999 QT
-15.514 -11.483 -16.139 -11.483 QT
-16.748 -11.483 -17.256 -11.171 QT
-17.764 -10.858 -18.061 -10.327 QT
-18.061 -6.733 L
cp
f
GR
GS
[0 -0.75 0.75 0 28.25 151.87489] CT
0.149 GC
N
-12.178 -5.28 M
-12.178 -5.811 L
-11.662 -5.811 -11.334 -5.889 QT
-11.006 -5.968 -11.006 -6.28 QT
-11.006 -10.374 L
-11.006 -10.78 -11.131 -10.96 QT
-11.256 -11.139 -11.483 -11.178 QT
-11.709 -11.218 -12.178 -11.218 QT
-12.178 -11.749 L
-10.037 -11.905 L
-10.037 -10.436 L
-9.787 -11.093 -9.342 -11.499 QT
-8.897 -11.905 -8.256 -11.905 QT
-7.819 -11.905 -7.467 -11.639 QT
-7.115 -11.374 -7.115 -10.952 QT
-7.115 -10.671 -7.311 -10.475 QT
-7.506 -10.28 -7.787 -10.28 QT
-8.069 -10.28 -8.264 -10.475 QT
-8.459 -10.671 -8.459 -10.952 QT
-8.459 -11.358 -8.178 -11.514 QT
-8.256 -11.514 L
-8.865 -11.514 -9.248 -11.077 QT
-9.631 -10.639 -9.795 -9.991 QT
-9.959 -9.343 -9.959 -8.749 QT
-9.959 -6.28 L
-9.959 -5.811 -8.506 -5.811 QT
-8.506 -5.28 L
-12.178 -5.28 L
cp
f
GR
GS
[0 -0.75 0.75 0 28.25 151.87489] CT
0.149 GC
N
-3.074 -5.108 M
-3.98 -5.108 -4.746 -5.569 QT
-5.512 -6.03 -5.957 -6.796 QT
-6.402 -7.561 -6.402 -8.468 QT
-6.402 -9.155 -6.16 -9.796 QT
-5.918 -10.436 -5.457 -10.936 QT
-4.996 -11.436 -4.387 -11.718 QT
-3.777 -11.999 -3.074 -11.999 QT
-2.152 -11.999 -1.394 -11.514 QT
-0.637 -11.03 -0.199 -10.21 QT
0.238 -9.389 0.238 -8.468 QT
0.238 -7.577 -0.207 -6.803 QT
-0.652 -6.03 -1.418 -5.569 QT
-2.184 -5.108 -3.074 -5.108 QT
cp
-3.074 -5.546 M
-1.871 -5.546 -1.473 -6.421 QT
-1.074 -7.296 -1.074 -8.639 QT
-1.074 -9.389 -1.152 -9.889 QT
-1.23 -10.389 -1.496 -10.796 QT
-1.668 -11.03 -1.926 -11.218 QT
-2.184 -11.405 -2.473 -11.507 QT
-2.762 -11.608 -3.074 -11.608 QT
-3.543 -11.608 -3.965 -11.397 QT
-4.387 -11.186 -4.668 -10.796 QT
-4.949 -10.358 -5.019 -9.85 QT
-5.09 -9.343 -5.09 -8.639 QT
-5.09 -7.796 -4.949 -7.124 QT
-4.809 -6.452 -4.363 -5.999 QT
-3.918 -5.546 -3.074 -5.546 QT
cp
f
GR
GS
[0 -0.75 0.75 0 28.25 151.87489] CT
0.149 GC
N
2.072 -5.28 M
2.072 -14.155 L
2.072 -14.561 1.947 -14.741 QT
1.822 -14.921 1.595 -14.96 QT
1.369 -14.999 0.9 -14.999 QT
0.9 -15.53 L
3.119 -15.686 L
3.119 -10.999 L
3.369 -11.264 3.697 -11.475 QT
4.025 -11.686 4.408 -11.796 QT
4.79 -11.905 5.197 -11.905 QT
5.869 -11.905 6.439 -11.639 QT
7.009 -11.374 7.439 -10.897 QT
7.869 -10.421 8.103 -9.796 QT
8.337 -9.171 8.337 -8.514 QT
8.337 -7.608 7.892 -6.827 QT
7.447 -6.046 6.681 -5.577 QT
5.915 -5.108 5.009 -5.108 QT
4.431 -5.108 3.9 -5.405 QT
3.369 -5.702 3.009 -6.186 QT
2.509 -5.28 L
2.072 -5.28 L
cp
3.165 -6.749 M
3.415 -6.202 3.884 -5.858 QT
4.353 -5.514 4.915 -5.514 QT
5.697 -5.514 6.173 -5.96 QT
6.65 -6.405 6.845 -7.085 QT
7.04 -7.764 7.04 -8.514 QT
7.04 -9.78 6.712 -10.436 QT
6.556 -10.733 6.306 -10.983 QT
6.056 -11.233 5.744 -11.374 QT
5.431 -11.514 5.087 -11.514 QT
4.494 -11.514 3.978 -11.202 QT
3.462 -10.889 3.165 -10.343 QT
3.165 -6.749 L
cp
f
GR
GS
[0 -0.75 0.75 0 28.25 151.87489] CT
0.149 GC
N
9.251 -6.749 M
9.251 -7.639 9.954 -8.202 QT
10.657 -8.764 11.65 -8.999 QT
12.642 -9.233 13.517 -9.233 QT
13.517 -9.843 L
13.517 -10.28 13.329 -10.686 QT
13.142 -11.093 12.782 -11.35 QT
12.423 -11.608 11.986 -11.608 QT
11.001 -11.608 10.47 -11.155 QT
10.767 -11.155 10.946 -10.944 QT
11.126 -10.733 11.126 -10.436 QT
11.126 -10.139 10.915 -9.928 QT
10.704 -9.718 10.423 -9.718 QT
10.111 -9.718 9.9 -9.928 QT
9.689 -10.139 9.689 -10.436 QT
9.689 -11.233 10.407 -11.616 QT
11.126 -11.999 11.986 -11.999 QT
12.595 -11.999 13.212 -11.741 QT
13.829 -11.483 14.22 -10.999 QT
14.611 -10.514 14.611 -9.874 QT
14.611 -6.499 L
14.611 -6.202 14.736 -5.96 QT
14.861 -5.718 15.126 -5.718 QT
15.376 -5.718 15.493 -5.968 QT
15.611 -6.218 15.611 -6.499 QT
15.611 -7.452 L
16.048 -7.452 L
16.048 -6.499 L
16.048 -6.155 15.876 -5.85 QT
15.704 -5.546 15.407 -5.366 QT
15.111 -5.186 14.767 -5.186 QT
14.329 -5.186 14.009 -5.53 QT
13.689 -5.874 13.657 -6.343 QT
13.376 -5.78 12.837 -5.444 QT
12.298 -5.108 11.673 -5.108 QT
11.111 -5.108 10.556 -5.28 QT
10.001 -5.452 9.626 -5.811 QT
9.251 -6.171 9.251 -6.749 QT
cp
10.47 -6.749 M
10.47 -6.218 10.861 -5.866 QT
11.251 -5.514 11.782 -5.514 QT
12.267 -5.514 12.657 -5.749 QT
13.048 -5.983 13.282 -6.405 QT
13.517 -6.827 13.517 -7.28 QT
13.517 -8.843 L
12.845 -8.843 12.126 -8.624 QT
11.407 -8.405 10.939 -7.928 QT
10.47 -7.452 10.47 -6.749 QT
cp
f
GR
GS
[0 -0.75 0.75 0 28.25 151.87489] CT
0.149 GC
N
17.553 -5.28 M
17.553 -14.155 L
17.553 -14.561 17.428 -14.741 QT
17.303 -14.921 17.077 -14.96 QT
16.85 -14.999 16.381 -14.999 QT
16.381 -15.53 L
18.6 -15.686 L
18.6 -10.999 L
18.85 -11.264 19.178 -11.475 QT
19.506 -11.686 19.889 -11.796 QT
20.272 -11.905 20.678 -11.905 QT
21.35 -11.905 21.92 -11.639 QT
22.491 -11.374 22.92 -10.897 QT
23.35 -10.421 23.584 -9.796 QT
23.819 -9.171 23.819 -8.514 QT
23.819 -7.608 23.374 -6.827 QT
22.928 -6.046 22.163 -5.577 QT
21.397 -5.108 20.491 -5.108 QT
19.913 -5.108 19.381 -5.405 QT
18.85 -5.702 18.491 -6.186 QT
17.991 -5.28 L
17.553 -5.28 L
cp
18.647 -6.749 M
18.897 -6.202 19.366 -5.858 QT
19.834 -5.514 20.397 -5.514 QT
21.178 -5.514 21.655 -5.96 QT
22.131 -6.405 22.327 -7.085 QT
22.522 -7.764 22.522 -8.514 QT
22.522 -9.78 22.194 -10.436 QT
22.038 -10.733 21.788 -10.983 QT
21.538 -11.233 21.225 -11.374 QT
20.913 -11.514 20.569 -11.514 QT
19.975 -11.514 19.459 -11.202 QT
18.944 -10.889 18.647 -10.343 QT
18.647 -6.749 L
cp
f
GR
GS
[0 -0.75 0.75 0 28.25 151.87489] CT
0.149 GC
N
24.608 -5.28 M
24.608 -5.811 L
25.108 -5.811 25.444 -5.889 QT
25.78 -5.968 25.78 -6.28 QT
25.78 -10.374 L
25.78 -10.952 25.553 -11.085 QT
25.326 -11.218 24.67 -11.218 QT
24.67 -11.749 L
26.826 -11.905 L
26.826 -6.28 L
26.826 -5.968 27.115 -5.889 QT
27.405 -5.811 27.873 -5.811 QT
27.873 -5.28 L
24.608 -5.28 L
cp
25.233 -14.483 M
25.233 -14.811 25.483 -15.061 QT
25.733 -15.311 26.061 -15.311 QT
26.264 -15.311 26.467 -15.202 QT
26.67 -15.093 26.78 -14.897 QT
26.889 -14.702 26.889 -14.483 QT
26.889 -14.171 26.639 -13.921 QT
26.389 -13.671 26.061 -13.671 QT
25.733 -13.671 25.483 -13.921 QT
25.233 -14.171 25.233 -14.483 QT
cp
f
GR
GS
[0 -0.75 0.75 0 28.25 151.87489] CT
0.149 GC
N
28.682 -5.28 M
28.682 -5.811 L
29.182 -5.811 29.518 -5.889 QT
29.854 -5.968 29.854 -6.28 QT
29.854 -14.155 L
29.854 -14.561 29.729 -14.741 QT
29.604 -14.921 29.377 -14.96 QT
29.15 -14.999 28.682 -14.999 QT
28.682 -15.53 L
30.9 -15.686 L
30.9 -6.28 L
30.9 -5.968 31.229 -5.889 QT
31.557 -5.811 32.072 -5.811 QT
32.072 -5.28 L
28.682 -5.28 L
cp
f
GR
GS
[0 -0.75 0.75 0 28.25 151.87489] CT
0.149 GC
N
32.756 -5.28 M
32.756 -5.811 L
33.256 -5.811 33.592 -5.889 QT
33.928 -5.968 33.928 -6.28 QT
33.928 -10.374 L
33.928 -10.952 33.701 -11.085 QT
33.475 -11.218 32.818 -11.218 QT
32.818 -11.749 L
34.975 -11.905 L
34.975 -6.28 L
34.975 -5.968 35.264 -5.889 QT
35.553 -5.811 36.021 -5.811 QT
36.021 -5.28 L
32.756 -5.28 L
cp
33.381 -14.483 M
33.381 -14.811 33.631 -15.061 QT
33.881 -15.311 34.209 -15.311 QT
34.412 -15.311 34.615 -15.202 QT
34.818 -15.093 34.928 -14.897 QT
35.037 -14.702 35.037 -14.483 QT
35.037 -14.171 34.787 -13.921 QT
34.537 -13.671 34.209 -13.671 QT
33.881 -13.671 33.631 -13.921 QT
33.381 -14.171 33.381 -14.483 QT
cp
f
GR
GS
[0 -0.75 0.75 0 28.25 151.87489] CT
0.149 GC
N
37.892 -7.077 M
37.892 -11.218 L
36.642 -11.218 L
36.642 -11.608 L
37.627 -11.608 38.088 -12.522 QT
38.549 -13.436 38.549 -14.514 QT
38.986 -14.514 L
38.986 -11.749 L
41.096 -11.749 L
41.096 -11.218 L
38.986 -11.218 L
38.986 -7.108 L
38.986 -6.483 39.197 -6.014 QT
39.408 -5.546 39.939 -5.546 QT
40.455 -5.546 40.681 -6.046 QT
40.908 -6.546 40.908 -7.108 QT
40.908 -7.999 L
41.346 -7.999 L
41.346 -7.077 L
41.346 -6.608 41.174 -6.155 QT
41.002 -5.702 40.666 -5.405 QT
40.33 -5.108 39.846 -5.108 QT
38.939 -5.108 38.416 -5.647 QT
37.892 -6.186 37.892 -7.077 QT
cp
f
GR
GS
[0 -0.75 0.75 0 28.25 151.87489] CT
0.149 GC
N
42.689 -2.811 M
42.97 -2.593 43.314 -2.593 QT
44.267 -2.593 44.861 -4.014 QT
45.376 -5.28 L
43.126 -10.796 L
42.986 -11.061 42.704 -11.139 QT
42.423 -11.218 41.939 -11.218 QT
41.939 -11.749 L
45.095 -11.749 L
45.095 -11.218 L
44.267 -11.218 44.267 -10.858 QT
44.267 -10.796 44.282 -10.78 QT
45.954 -6.671 L
47.454 -10.358 L
47.501 -10.483 47.501 -10.624 QT
47.501 -10.796 47.4 -10.936 QT
47.298 -11.077 47.142 -11.147 QT
46.986 -11.218 46.782 -11.218 QT
46.782 -11.749 L
49.282 -11.749 L
49.282 -11.218 L
48.814 -11.218 48.462 -11.007 QT
48.111 -10.796 47.923 -10.374 QT
45.329 -4.014 L
45.126 -3.53 44.853 -3.124 QT
44.579 -2.718 44.181 -2.46 QT
43.782 -2.202 43.314 -2.202 QT
42.767 -2.202 42.353 -2.569 QT
41.939 -2.936 41.939 -3.468 QT
41.939 -3.749 42.134 -3.936 QT
42.329 -4.124 42.595 -4.124 QT
42.798 -4.124 42.947 -4.038 QT
43.095 -3.952 43.181 -3.803 QT
43.267 -3.655 43.267 -3.468 QT
43.267 -3.218 43.103 -3.03 QT
42.939 -2.843 42.689 -2.811 QT
cp
f
GR
GS
[0 -0.75 0.75 0 28.25 151.87489] CT
0.149 GC
N
54.054 -1.561 M
53.211 -2.218 52.609 -3.069 QT
52.008 -3.921 51.625 -4.889 QT
51.242 -5.858 51.047 -6.913 QT
50.851 -7.968 50.851 -9.03 QT
50.851 -10.108 51.047 -11.163 QT
51.242 -12.218 51.633 -13.194 QT
52.023 -14.171 52.633 -15.014 QT
53.242 -15.858 54.054 -16.499 QT
54.054 -16.53 54.117 -16.53 QT
54.258 -16.53 L
54.304 -16.53 54.344 -16.491 QT
54.383 -16.452 54.383 -16.405 QT
54.383 -16.327 54.351 -16.296 QT
53.617 -15.593 53.133 -14.772 QT
52.648 -13.952 52.351 -13.022 QT
52.054 -12.093 51.922 -11.1 QT
51.789 -10.108 51.789 -9.03 QT
51.789 -4.264 54.336 -1.78 QT
54.383 -1.749 54.383 -1.655 QT
54.383 -1.624 54.344 -1.577 QT
54.304 -1.53 54.258 -1.53 QT
54.117 -1.53 L
54.054 -1.53 54.054 -1.561 QT
cp
f
GR
GS
[0 -0.75 0.75 0 28.25 151.87489] CT
0.149 GC
N
57.196 -4.733 M
57.196 -4.827 57.227 -4.889 QT
64.024 -15.014 L
63.133 -14.514 62.039 -14.514 QT
60.868 -14.514 59.789 -15.124 QT
60.102 -14.405 60.102 -13.514 QT
60.102 -13.03 59.985 -12.514 QT
59.868 -11.999 59.633 -11.538 QT
59.399 -11.077 59.032 -10.78 QT
58.664 -10.483 58.164 -10.483 QT
57.461 -10.483 56.954 -10.952 QT
56.446 -11.421 56.196 -12.124 QT
55.946 -12.827 55.946 -13.514 QT
55.946 -14.186 56.196 -14.889 QT
56.446 -15.593 56.954 -16.061 QT
57.461 -16.53 58.164 -16.53 QT
58.727 -16.53 59.18 -16.077 QT
60.383 -14.889 62.039 -14.889 QT
62.93 -14.889 63.704 -15.288 QT
64.477 -15.686 64.961 -16.421 QT
65.039 -16.53 65.196 -16.53 QT
65.321 -16.53 65.407 -16.452 QT
65.493 -16.374 65.493 -16.233 QT
65.493 -16.155 65.446 -16.077 QT
57.711 -4.53 L
57.649 -4.436 57.493 -4.436 QT
57.368 -4.436 57.282 -4.53 QT
57.196 -4.624 57.196 -4.733 QT
cp
58.164 -10.874 M
58.899 -10.874 59.282 -11.757 QT
59.664 -12.639 59.664 -13.514 QT
59.664 -13.999 59.508 -14.624 QT
59.352 -15.249 59.016 -15.694 QT
58.68 -16.139 58.164 -16.139 QT
57.414 -16.139 57.172 -15.311 QT
56.93 -14.483 56.93 -13.499 QT
56.93 -12.546 57.18 -11.71 QT
57.43 -10.874 58.164 -10.874 QT
cp
64.805 -4.436 M
64.102 -4.436 63.594 -4.905 QT
63.086 -5.374 62.836 -6.085 QT
62.586 -6.796 62.586 -7.468 QT
62.586 -8.139 62.836 -8.843 QT
63.086 -9.546 63.594 -10.014 QT
64.102 -10.483 64.805 -10.483 QT
65.461 -10.483 65.899 -9.991 QT
66.336 -9.499 66.539 -8.803 QT
66.743 -8.108 66.743 -7.468 QT
66.743 -6.983 66.625 -6.475 QT
66.508 -5.968 66.282 -5.499 QT
66.055 -5.03 65.68 -4.733 QT
65.305 -4.436 64.805 -4.436 QT
cp
64.805 -4.827 M
65.305 -4.827 65.657 -5.28 QT
66.008 -5.733 66.157 -6.358 QT
66.305 -6.983 66.305 -7.468 QT
66.305 -8.327 65.922 -9.21 QT
65.539 -10.093 64.805 -10.093 QT
64.055 -10.093 63.813 -9.264 QT
63.571 -8.436 63.571 -7.452 QT
63.571 -6.499 63.821 -5.663 QT
64.071 -4.827 64.805 -4.827 QT
cp
f
GR
GS
[0 -0.75 0.75 0 28.25 151.87489] CT
0.149 GC
N
68.293 -1.53 M
68.168 -1.53 68.168 -1.655 QT
68.168 -1.733 68.199 -1.764 QT
70.762 -4.264 70.762 -9.03 QT
70.762 -13.796 68.23 -16.28 QT
68.168 -16.311 68.168 -16.405 QT
68.168 -16.452 68.207 -16.491 QT
68.246 -16.53 68.293 -16.53 QT
68.434 -16.53 L
68.48 -16.53 68.512 -16.499 QT
69.59 -15.655 70.309 -14.436 QT
71.027 -13.218 71.355 -11.843 QT
71.684 -10.468 71.684 -9.03 QT
71.684 -7.968 71.504 -6.936 QT
71.324 -5.905 70.934 -4.905 QT
70.543 -3.905 69.941 -3.061 QT
69.34 -2.218 68.512 -1.561 QT
68.48 -1.53 68.434 -1.53 QT
68.293 -1.53 L
cp
f
GR
GS
[0.75 0 0 0.75 58.81875 23.25] CT
0 0 1 RC
10.0 ML
2 LW
N
4 0 M
4 -2.209 2.209 -4 0 -4 C
-2.209 -4 -4 -2.209 -4 0 C
-4 2.209 -2.209 4 0 4 C
2.209 4 4 2.209 4 0 C
S
GR
GS
[0.75 0 0 0.75 62.8875 23.25] CT
0 0 1 RC
10.0 ML
2 LW
N
4 0 M
4 -2.209 2.209 -4 0 -4 C
-2.209 -4 -4 -2.209 -4 0 C
-4 2.209 -2.209 4 0 4 C
2.209 4 4 2.209 4 0 C
S
GR
GS
[0.75 0 0 0.75 66.95625 23.25] CT
0 0 1 RC
10.0 ML
2 LW
N
4 0 M
4 -2.209 2.209 -4 0 -4 C
-2.209 -4 -4 -2.209 -4 0 C
-4 2.209 -2.209 4 0 4 C
2.209 4 4 2.209 4 0 C
S
GR
GS
[0.75 0 0 0.75 71.025 23.25] CT
0 0 1 RC
10.0 ML
2 LW
N
4 0 M
4 -2.209 2.209 -4 0 -4 C
-2.209 -4 -4 -2.209 -4 0 C
-4 2.209 -2.209 4 0 4 C
2.209 4 4 2.209 4 0 C
S
GR
GS
[0.75 0 0 0.75 75.09375 23.25] CT
0 0 1 RC
10.0 ML
2 LW
N
4 0 M
4 -2.209 2.209 -4 0 -4 C
-2.209 -4 -4 -2.209 -4 0 C
-4 2.209 -2.209 4 0 4 C
2.209 4 4 2.209 4 0 C
S
GR
GS
[0.75 0 0 0.75 79.1625 23.25] CT
0 0 1 RC
10.0 ML
2 LW
N
4 0 M
4 -2.209 2.209 -4 0 -4 C
-2.209 -4 -4 -2.209 -4 0 C
-4 2.209 -2.209 4 0 4 C
2.209 4 4 2.209 4 0 C
S
GR
GS
[0.75 0 0 0.75 83.23125 23.25] CT
0 0 1 RC
10.0 ML
2 LW
N
4 0 M
4 -2.209 2.209 -4 0 -4 C
-2.209 -4 -4 -2.209 -4 0 C
-4 2.209 -2.209 4 0 4 C
2.209 4 4 2.209 4 0 C
S
GR
GS
[0.75 0 0 0.75 87.3 23.25] CT
0 0 1 RC
10.0 ML
2 LW
N
4 0 M
4 -2.209 2.209 -4 0 -4 C
-2.209 -4 -4 -2.209 -4 0 C
-4 2.209 -2.209 4 0 4 C
2.209 4 4 2.209 4 0 C
S
GR
GS
[0.75 0 0 0.75 91.36875 23.25] CT
0 0 1 RC
10.0 ML
2 LW
N
4 0 M
4 -2.209 2.209 -4 0 -4 C
-2.209 -4 -4 -2.209 -4 0 C
-4 2.209 -2.209 4 0 4 C
2.209 4 4 2.209 4 0 C
S
GR
GS
[0.75 0 0 0.75 95.4375 23.25] CT
0 0 1 RC
10.0 ML
2 LW
N
4 0 M
4 -2.209 2.209 -4 0 -4 C
-2.209 -4 -4 -2.209 -4 0 C
-4 2.209 -2.209 4 0 4 C
2.209 4 4 2.209 4 0 C
S
GR
GS
[0.75 0 0 0.75 99.50625 23.25] CT
0 0 1 RC
10.0 ML
2 LW
N
4 0 M
4 -2.209 2.209 -4 0 -4 C
-2.209 -4 -4 -2.209 -4 0 C
-4 2.209 -2.209 4 0 4 C
2.209 4 4 2.209 4 0 C
S
GR
GS
[0.75 0 0 0.75 103.575 23.25] CT
0 0 1 RC
10.0 ML
2 LW
N
4 0 M
4 -2.209 2.209 -4 0 -4 C
-2.209 -4 -4 -2.209 -4 0 C
-4 2.209 -2.209 4 0 4 C
2.209 4 4 2.209 4 0 C
S
GR
GS
[0.75 0 0 0.75 107.64375 23.25] CT
0 0 1 RC
10.0 ML
2 LW
N
4 0 M
4 -2.209 2.209 -4 0 -4 C
-2.209 -4 -4 -2.209 -4 0 C
-4 2.209 -2.209 4 0 4 C
2.209 4 4 2.209 4 0 C
S
GR
GS
[0.75 0 0 0.75 111.7125 23.25] CT
0 0 1 RC
10.0 ML
2 LW
N
4 0 M
4 -2.209 2.209 -4 0 -4 C
-2.209 -4 -4 -2.209 -4 0 C
-4 2.209 -2.209 4 0 4 C
2.209 4 4 2.209 4 0 C
S
GR
GS
[0.75 0 0 0.75 115.78125 23.25] CT
0 0 1 RC
10.0 ML
2 LW
N
4 0 M
4 -2.209 2.209 -4 0 -4 C
-2.209 -4 -4 -2.209 -4 0 C
-4 2.209 -2.209 4 0 4 C
2.209 4 4 2.209 4 0 C
S
GR
GS
[0.75 0 0 0.75 119.85 23.25] CT
0 0 1 RC
10.0 ML
2 LW
N
4 0 M
4 -2.209 2.209 -4 0 -4 C
-2.209 -4 -4 -2.209 -4 0 C
-4 2.209 -2.209 4 0 4 C
2.209 4 4 2.209 4 0 C
S
GR
GS
[0.75 0 0 0.75 123.91875 23.25] CT
0 0 1 RC
10.0 ML
2 LW
N
4 0 M
4 -2.209 2.209 -4 0 -4 C
-2.209 -4 -4 -2.209 -4 0 C
-4 2.209 -2.209 4 0 4 C
2.209 4 4 2.209 4 0 C
S
GR
GS
[0.75 0 0 0.75 127.9875 23.25] CT
0 0 1 RC
10.0 ML
2 LW
N
4 0 M
4 -2.209 2.209 -4 0 -4 C
-2.209 -4 -4 -2.209 -4 0 C
-4 2.209 -2.209 4 0 4 C
2.209 4 4 2.209 4 0 C
S
GR
GS
[0.75 0 0 0.75 132.05625 23.25] CT
0 0 1 RC
10.0 ML
2 LW
N
4 0 M
4 -2.209 2.209 -4 0 -4 C
-2.209 -4 -4 -2.209 -4 0 C
-4 2.209 -2.209 4 0 4 C
2.209 4 4 2.209 4 0 C
S
GR
GS
[0.75 0 0 0.75 136.125 23.25] CT
0 0 1 RC
10.0 ML
2 LW
N
4 0 M
4 -2.209 2.209 -4 0 -4 C
-2.209 -4 -4 -2.209 -4 0 C
-4 2.209 -2.209 4 0 4 C
2.209 4 4 2.209 4 0 C
S
GR
GS
[0.75 0 0 0.75 140.19375 23.26286] CT
0 0 1 RC
10.0 ML
2 LW
N
4 0 M
4 -2.209 2.209 -4 0 -4 C
-2.209 -4 -4 -2.209 -4 0 C
-4 2.209 -2.209 4 0 4 C
2.209 4 4 2.209 4 0 C
S
GR
GS
[0.75 0 0 0.75 144.2625 23.26286] CT
0 0 1 RC
10.0 ML
2 LW
N
4 0 M
4 -2.209 2.209 -4 0 -4 C
-2.209 -4 -4 -2.209 -4 0 C
-4 2.209 -2.209 4 0 4 C
2.209 4 4 2.209 4 0 C
S
GR
GS
[0.75 0 0 0.75 148.33125 23.27573] CT
0 0 1 RC
10.0 ML
2 LW
N
4 0 M
4 -2.209 2.209 -4 0 -4 C
-2.209 -4 -4 -2.209 -4 0 C
-4 2.209 -2.209 4 0 4 C
2.209 4 4 2.209 4 0 C
S
GR
GS
[0.75 0 0 0.75 152.4 23.25] CT
0 0 1 RC
10.0 ML
2 LW
N
4 0 M
4 -2.209 2.209 -4 0 -4 C
-2.209 -4 -4 -2.209 -4 0 C
-4 2.209 -2.209 4 0 4 C
2.209 4 4 2.209 4 0 C
S
GR
GS
[0.75 0 0 0.75 156.46875 23.27573] CT
0 0 1 RC
10.0 ML
2 LW
N
4 0 M
4 -2.209 2.209 -4 0 -4 C
-2.209 -4 -4 -2.209 -4 0 C
-4 2.209 -2.209 4 0 4 C
2.209 4 4 2.209 4 0 C
S
GR
GS
[0.75 0 0 0.75 160.5375 23.27573] CT
0 0 1 RC
10.0 ML
2 LW
N
4 0 M
4 -2.209 2.209 -4 0 -4 C
-2.209 -4 -4 -2.209 -4 0 C
-4 2.209 -2.209 4 0 4 C
2.209 4 4 2.209 4 0 C
S
GR
GS
[0.75 0 0 0.75 164.60625 23.25] CT
0 0 1 RC
10.0 ML
2 LW
N
4 0 M
4 -2.209 2.209 -4 0 -4 C
-2.209 -4 -4 -2.209 -4 0 C
-4 2.209 -2.209 4 0 4 C
2.209 4 4 2.209 4 0 C
S
GR
GS
[0.75 0 0 0.75 168.675 23.37863] CT
0 0 1 RC
10.0 ML
2 LW
N
4 0 M
4 -2.209 2.209 -4 0 -4 C
-2.209 -4 -4 -2.209 -4 0 C
-4 2.209 -2.209 4 0 4 C
2.209 4 4 2.209 4 0 C
S
GR
GS
[0.75 0 0 0.75 172.74375 23.30144] CT
0 0 1 RC
10.0 ML
2 LW
N
4 0 M
4 -2.209 2.209 -4 0 -4 C
-2.209 -4 -4 -2.209 -4 0 C
-4 2.209 -2.209 4 0 4 C
2.209 4 4 2.209 4 0 C
S
GR
GS
[0.75 0 0 0.75 176.8125 23.3529] CT
0 0 1 RC
10.0 ML
2 LW
N
4 0 M
4 -2.209 2.209 -4 0 -4 C
-2.209 -4 -4 -2.209 -4 0 C
-4 2.209 -2.209 4 0 4 C
2.209 4 4 2.209 4 0 C
S
GR
GS
[0.75 0 0 0.75 180.88125 24.80637] CT
0 0 1 RC
10.0 ML
2 LW
N
4 0 M
4 -2.209 2.209 -4 0 -4 C
-2.209 -4 -4 -2.209 -4 0 C
-4 2.209 -2.209 4 0 4 C
2.209 4 4 2.209 4 0 C
S
GR
GS
[0.75 0 0 0.75 184.95 23.46866] CT
0 0 1 RC
10.0 ML
2 LW
N
4 0 M
4 -2.209 2.209 -4 0 -4 C
-2.209 -4 -4 -2.209 -4 0 C
-4 2.209 -2.209 4 0 4 C
2.209 4 4 2.209 4 0 C
S
GR
GS
[0.75 0 0 0.75 189.01875 24.51052] CT
0 0 1 RC
10.0 ML
2 LW
N
4 0 M
4 -2.209 2.209 -4 0 -4 C
-2.209 -4 -4 -2.209 -4 0 C
-4 2.209 -2.209 4 0 4 C
2.209 4 4 2.209 4 0 C
S
GR
GS
[0.75 0 0 0.75 193.08751 28.07344] CT
0 0 1 RC
10.0 ML
2 LW
N
4 0 M
4 -2.209 2.209 -4 0 -4 C
-2.209 -4 -4 -2.209 -4 0 C
-4 2.209 -2.209 4 0 4 C
2.209 4 4 2.209 4 0 C
S
GR
GS
[0.75 0 0 0.75 197.15625 25.35945] CT
0 0 1 RC
10.0 ML
2 LW
N
4 0 M
4 -2.209 2.209 -4 0 -4 C
-2.209 -4 -4 -2.209 -4 0 C
-4 2.209 -2.209 4 0 4 C
2.209 4 4 2.209 4 0 C
S
GR
GS
[0.75 0 0 0.75 201.22499 31.00609] CT
0 0 1 RC
10.0 ML
2 LW
N
4 0 M
4 -2.209 2.209 -4 0 -4 C
-2.209 -4 -4 -2.209 -4 0 C
-4 2.209 -2.209 4 0 4 C
2.209 4 4 2.209 4 0 C
S
GR
GS
[0.75 0 0 0.75 205.29375 29.46259] CT
0 0 1 RC
10.0 ML
2 LW
N
4 0 M
4 -2.209 2.209 -4 0 -4 C
-2.209 -4 -4 -2.209 -4 0 C
-4 2.209 -2.209 4 0 4 C
2.209 4 4 2.209 4 0 C
S
GR
GS
[0.75 0 0 0.75 209.3625 32.96119] CT
0 0 1 RC
10.0 ML
2 LW
N
4 0 M
4 -2.209 2.209 -4 0 -4 C
-2.209 -4 -4 -2.209 -4 0 C
-4 2.209 -2.209 4 0 4 C
2.209 4 4 2.209 4 0 C
S
GR
GS
[0.75 0 0 0.75 213.43126 29.37254] CT
0 0 1 RC
10.0 ML
2 LW
N
4 0 M
4 -2.209 2.209 -4 0 -4 C
-2.209 -4 -4 -2.209 -4 0 C
-4 2.209 -2.209 4 0 4 C
2.209 4 4 2.209 4 0 C
S
GR
GS
[0.75 0 0 0.75 217.5 27.61039] CT
0 0 1 RC
10.0 ML
2 LW
N
4 0 M
4 -2.209 2.209 -4 0 -4 C
-2.209 -4 -4 -2.209 -4 0 C
-4 2.209 -2.209 4 0 4 C
2.209 4 4 2.209 4 0 C
S
GR
GS
[0.75 0 0 0.75 221.56874 24.96071] CT
0 0 1 RC
10.0 ML
2 LW
N
4 0 M
4 -2.209 2.209 -4 0 -4 C
-2.209 -4 -4 -2.209 -4 0 C
-4 2.209 -2.209 4 0 4 C
2.209 4 4 2.209 4 0 C
S
GR
GS
[0.75 0 0 0.75 225.6375 34.4661] CT
0 0 1 RC
10.0 ML
2 LW
N
4 0 M
4 -2.209 2.209 -4 0 -4 C
-2.209 -4 -4 -2.209 -4 0 C
-4 2.209 -2.209 4 0 4 C
2.209 4 4 2.209 4 0 C
S
GR
GS
[0.75 0 0 0.75 229.70625 60.11393] CT
0 0 1 RC
10.0 ML
2 LW
N
4 0 M
4 -2.209 2.209 -4 0 -4 C
-2.209 -4 -4 -2.209 -4 0 C
-4 2.209 -2.209 4 0 4 C
2.209 4 4 2.209 4 0 C
S
GR
GS
[0.75 0 0 0.75 233.77501 30.35011] CT
0 0 1 RC
10.0 ML
2 LW
N
4 0 M
4 -2.209 2.209 -4 0 -4 C
-2.209 -4 -4 -2.209 -4 0 C
-4 2.209 -2.209 4 0 4 C
2.209 4 4 2.209 4 0 C
S
GR
GS
[0.75 0 0 0.75 237.84375 28.08629] CT
0 0 1 RC
10.0 ML
2 LW
N
4 0 M
4 -2.209 2.209 -4 0 -4 C
-2.209 -4 -4 -2.209 -4 0 C
-4 2.209 -2.209 4 0 4 C
2.209 4 4 2.209 4 0 C
S
GR
GS
[0.75 0 0 0.75 241.91249 30.7617] CT
0 0 1 RC
10.0 ML
2 LW
N
4 0 M
4 -2.209 2.209 -4 0 -4 C
-2.209 -4 -4 -2.209 -4 0 C
-4 2.209 -2.209 4 0 4 C
2.209 4 4 2.209 4 0 C
S
GR
GS
[0.75 0 0 0.75 245.98125 61.1172] CT
0 0 1 RC
10.0 ML
2 LW
N
4 0 M
4 -2.209 2.209 -4 0 -4 C
-2.209 -4 -4 -2.209 -4 0 C
-4 2.209 -2.209 4 0 4 C
2.209 4 4 2.209 4 0 C
S
GR
GS
[0.75 0 0 0.75 250.05 69.23344] CT
0 0 1 RC
10.0 ML
2 LW
N
4 0 M
4 -2.209 2.209 -4 0 -4 C
-2.209 -4 -4 -2.209 -4 0 C
-4 2.209 -2.209 4 0 4 C
2.209 4 4 2.209 4 0 C
S
GR
GS
[0.75 0 0 0.75 254.11876 63.9341] CT
0 0 1 RC
10.0 ML
2 LW
N
4 0 M
4 -2.209 2.209 -4 0 -4 C
-2.209 -4 -4 -2.209 -4 0 C
-4 2.209 -2.209 4 0 4 C
2.209 4 4 2.209 4 0 C
S
GR
GS
[0.75 0 0 0.75 258.1875 46.23528] CT
0 0 1 RC
10.0 ML
2 LW
N
4 0 M
4 -2.209 2.209 -4 0 -4 C
-2.209 -4 -4 -2.209 -4 0 C
-4 2.209 -2.209 4 0 4 C
2.209 4 4 2.209 4 0 C
S
GR
GS
[0.75 0 0 0.75 262.25624 70.0052] CT
0 0 1 RC
10.0 ML
2 LW
N
4 0 M
4 -2.209 2.209 -4 0 -4 C
-2.209 -4 -4 -2.209 -4 0 C
-4 2.209 -2.209 4 0 4 C
2.209 4 4 2.209 4 0 C
S
GR
GS
[0.75 0 0 0.75 266.325 72.96355] CT
0 0 1 RC
10.0 ML
2 LW
N
4 0 M
4 -2.209 2.209 -4 0 -4 C
-2.209 -4 -4 -2.209 -4 0 C
-4 2.209 -2.209 4 0 4 C
2.209 4 4 2.209 4 0 C
S
GR
GS
[0.75 0 0 0.75 270.39375 97.91682] CT
0 0 1 RC
10.0 ML
2 LW
N
4 0 M
4 -2.209 2.209 -4 0 -4 C
-2.209 -4 -4 -2.209 -4 0 C
-4 2.209 -2.209 4 0 4 C
2.209 4 4 2.209 4 0 C
S
GR
GS
[0.75 0 0 0.75 274.46251 102.16144] CT
0 0 1 RC
10.0 ML
2 LW
N
4 0 M
4 -2.209 2.209 -4 0 -4 C
-2.209 -4 -4 -2.209 -4 0 C
-4 2.209 -2.209 4 0 4 C
2.209 4 4 2.209 4 0 C
S
GR
GS
[0.75 0 0 0.75 278.53125 89.28607] CT
0 0 1 RC
10.0 ML
2 LW
N
4 0 M
4 -2.209 2.209 -4 0 -4 C
-2.209 -4 -4 -2.209 -4 0 C
-4 2.209 -2.209 4 0 4 C
2.209 4 4 2.209 4 0 C
S
GR
GS
[0.75 0 0 0.75 282.59999 56.02365] CT
0 0 1 RC
10.0 ML
2 LW
N
4 0 M
4 -2.209 2.209 -4 0 -4 C
-2.209 -4 -4 -2.209 -4 0 C
-4 2.209 -2.209 4 0 4 C
2.209 4 4 2.209 4 0 C
S
GR
GS
[0.75 0 0 0.75 286.66875 69.90229] CT
0 0 1 RC
10.0 ML
2 LW
N
4 0 M
4 -2.209 2.209 -4 0 -4 C
-2.209 -4 -4 -2.209 -4 0 C
-4 2.209 -2.209 4 0 4 C
2.209 4 4 2.209 4 0 C
S
GR
GS
[0.75 0 0 0.75 290.7375 64.16561] CT
0 0 1 RC
10.0 ML
2 LW
N
4 0 M
4 -2.209 2.209 -4 0 -4 C
-2.209 -4 -4 -2.209 -4 0 C
-4 2.209 -2.209 4 0 4 C
2.209 4 4 2.209 4 0 C
S
GR
GS
[0.75 0 0 0.75 294.80626 79.51058] CT
0 0 1 RC
10.0 ML
2 LW
N
4 0 M
4 -2.209 2.209 -4 0 -4 C
-2.209 -4 -4 -2.209 -4 0 C
-4 2.209 -2.209 4 0 4 C
2.209 4 4 2.209 4 0 C
S
GR
GS
[0.75 0 0 0.75 298.875 112.59294] CT
0 0 1 RC
10.0 ML
2 LW
N
4 0 M
4 -2.209 2.209 -4 0 -4 C
-2.209 -4 -4 -2.209 -4 0 C
-4 2.209 -2.209 4 0 4 C
2.209 4 4 2.209 4 0 C
S
GR
GS
[0.75 0 0 0.75 302.94374 86.95796] CT
0 0 1 RC
10.0 ML
2 LW
N
4 0 M
4 -2.209 2.209 -4 0 -4 C
-2.209 -4 -4 -2.209 -4 0 C
-4 2.209 -2.209 4 0 4 C
2.209 4 4 2.209 4 0 C
S
GR
GS
[0.75 0 0 0.75 307.0125 134.93509] CT
0 0 1 RC
10.0 ML
2 LW
N
4 0 M
4 -2.209 2.209 -4 0 -4 C
-2.209 -4 -4 -2.209 -4 0 C
-4 2.209 -2.209 4 0 4 C
2.209 4 4 2.209 4 0 C
S
GR
GS
[0.75 0 0 0.75 311.08125 116.92759] CT
0 0 1 RC
10.0 ML
2 LW
N
4 0 M
4 -2.209 2.209 -4 0 -4 C
-2.209 -4 -4 -2.209 -4 0 C
-4 2.209 -2.209 4 0 4 C
2.209 4 4 2.209 4 0 C
S
GR
GS
[0.75 0 0 0.75 315.15001 121.005] CT
0 0 1 RC
10.0 ML
2 LW
N
4 0 M
4 -2.209 2.209 -4 0 -4 C
-2.209 -4 -4 -2.209 -4 0 C
-4 2.209 -2.209 4 0 4 C
2.209 4 4 2.209 4 0 C
S
GR
GS
[0.75 0 0 0.75 319.21875 89.69768] CT
0 0 1 RC
10.0 ML
2 LW
N
4 0 M
4 -2.209 2.209 -4 0 -4 C
-2.209 -4 -4 -2.209 -4 0 C
-4 2.209 -2.209 4 0 4 C
2.209 4 4 2.209 4 0 C
S
GR
GS
[0.75 0 0 0.75 323.28749 122.79288] CT
0 0 1 RC
10.0 ML
2 LW
N
4 0 M
4 -2.209 2.209 -4 0 -4 C
-2.209 -4 -4 -2.209 -4 0 C
-4 2.209 -2.209 4 0 4 C
2.209 4 4 2.209 4 0 C
S
GR
GS
[0.75 0 0 0.75 327.35625 146.22836] CT
0 0 1 RC
10.0 ML
2 LW
N
4 0 M
4 -2.209 2.209 -4 0 -4 C
-2.209 -4 -4 -2.209 -4 0 C
-4 2.209 -2.209 4 0 4 C
2.209 4 4 2.209 4 0 C
S
GR
GS
[0.75 0 0 0.75 331.425 132.51693] CT
0 0 1 RC
10.0 ML
2 LW
N
4 0 M
4 -2.209 2.209 -4 0 -4 C
-2.209 -4 -4 -2.209 -4 0 C
-4 2.209 -2.209 4 0 4 C
2.209 4 4 2.209 4 0 C
S
GR
GS
[0.75 0 0 0.75 335.49376 131.88667] CT
0 0 1 RC
10.0 ML
2 LW
N
4 0 M
4 -2.209 2.209 -4 0 -4 C
-2.209 -4 -4 -2.209 -4 0 C
-4 2.209 -2.209 4 0 4 C
2.209 4 4 2.209 4 0 C
S
GR
GS
[0.75 0 0 0.75 339.5625 134.21479] CT
0 0 1 RC
10.0 ML
2 LW
N
4 0 M
4 -2.209 2.209 -4 0 -4 C
-2.209 -4 -4 -2.209 -4 0 C
-4 2.209 -2.209 4 0 4 C
2.209 4 4 2.209 4 0 C
S
GR
GS
[0.75 0 0 0.75 343.63124 138.89675] CT
0 0 1 RC
10.0 ML
2 LW
N
4 0 M
4 -2.209 2.209 -4 0 -4 C
-2.209 -4 -4 -2.209 -4 0 C
-4 2.209 -2.209 4 0 4 C
2.209 4 4 2.209 4 0 C
S
GR
GS
[0.75 0 0 0.75 347.7 145.31513] CT
0 0 1 RC
10.0 ML
2 LW
N
4 0 M
4 -2.209 2.209 -4 0 -4 C
-2.209 -4 -4 -2.209 -4 0 C
-4 2.209 -2.209 4 0 4 C
2.209 4 4 2.209 4 0 C
S
GR
GS
[0.75 0 0 0.75 351.76875 132.20824] CT
0 0 1 RC
10.0 ML
2 LW
N
4 0 M
4 -2.209 2.209 -4 0 -4 C
-2.209 -4 -4 -2.209 -4 0 C
-4 2.209 -2.209 4 0 4 C
2.209 4 4 2.209 4 0 C
S
GR
GS
[0.75 0 0 0.75 355.83751 175.94073] CT
0 0 1 RC
10.0 ML
2 LW
N
4 0 M
4 -2.209 2.209 -4 0 -4 C
-2.209 -4 -4 -2.209 -4 0 C
-4 2.209 -2.209 4 0 4 C
2.209 4 4 2.209 4 0 C
S
GR
GS
[0.75 0 0 0.75 359.90625 132.6327] CT
0 0 1 RC
10.0 ML
2 LW
N
4 0 M
4 -2.209 2.209 -4 0 -4 C
-2.209 -4 -4 -2.209 -4 0 C
-4 2.209 -2.209 4 0 4 C
2.209 4 4 2.209 4 0 C
S
GR
GS
[0.75 0 0 0.75 363.97499 156.5055] CT
0 0 1 RC
10.0 ML
2 LW
N
4 0 M
4 -2.209 2.209 -4 0 -4 C
-2.209 -4 -4 -2.209 -4 0 C
-4 2.209 -2.209 4 0 4 C
2.209 4 4 2.209 4 0 C
S
GR
GS
[0.75 0 0 0.75 368.04375 128.46525] CT
0 0 1 RC
10.0 ML
2 LW
N
4 0 M
4 -2.209 2.209 -4 0 -4 C
-2.209 -4 -4 -2.209 -4 0 C
-4 2.209 -2.209 4 0 4 C
2.209 4 4 2.209 4 0 C
S
GR
GS
[0.75 0 0 0.75 372.1125 169.21366] CT
0 0 1 RC
10.0 ML
2 LW
N
4 0 M
4 -2.209 2.209 -4 0 -4 C
-2.209 -4 -4 -2.209 -4 0 C
-4 2.209 -2.209 4 0 4 C
2.209 4 4 2.209 4 0 C
S
GR
GS
[0.75 0 0 0.75 376.18126 160.53147] CT
0 0 1 RC
10.0 ML
2 LW
N
4 0 M
4 -2.209 2.209 -4 0 -4 C
-2.209 -4 -4 -2.209 -4 0 C
-4 2.209 -2.209 4 0 4 C
2.209 4 4 2.209 4 0 C
S
GR
GS
[0.75 0 0 0.75 380.25 160.01697] CT
0 0 1 RC
10.0 ML
2 LW
N
4 0 M
4 -2.209 2.209 -4 0 -4 C
-2.209 -4 -4 -2.209 -4 0 C
-4 2.209 -2.209 4 0 4 C
2.209 4 4 2.209 4 0 C
S
GR
GS
[0.75 0 0 0.75 58.81875 23.25] CT
1 0 0 RC
10.0 ML
2 LW
N
4 0 M
4 -2.209 2.209 -4 0 -4 C
-2.209 -4 -4 -2.209 -4 0 C
-4 2.209 -2.209 4 0 4 C
2.209 4 4 2.209 4 0 C
S
GR
GS
[0.75 0 0 0.75 62.8875 23.25] CT
1 0 0 RC
10.0 ML
2 LW
N
4 0 M
4 -2.209 2.209 -4 0 -4 C
-2.209 -4 -4 -2.209 -4 0 C
-4 2.209 -2.209 4 0 4 C
2.209 4 4 2.209 4 0 C
S
GR
GS
[0.75 0 0 0.75 66.95625 23.25] CT
1 0 0 RC
10.0 ML
2 LW
N
4 0 M
4 -2.209 2.209 -4 0 -4 C
-2.209 -4 -4 -2.209 -4 0 C
-4 2.209 -2.209 4 0 4 C
2.209 4 4 2.209 4 0 C
S
GR
GS
[0.75 0 0 0.75 71.025 23.25] CT
1 0 0 RC
10.0 ML
2 LW
N
4 0 M
4 -2.209 2.209 -4 0 -4 C
-2.209 -4 -4 -2.209 -4 0 C
-4 2.209 -2.209 4 0 4 C
2.209 4 4 2.209 4 0 C
S
GR
GS
[0.75 0 0 0.75 75.09375 23.25] CT
1 0 0 RC
10.0 ML
2 LW
N
4 0 M
4 -2.209 2.209 -4 0 -4 C
-2.209 -4 -4 -2.209 -4 0 C
-4 2.209 -2.209 4 0 4 C
2.209 4 4 2.209 4 0 C
S
GR
GS
[0.75 0 0 0.75 79.1625 23.25] CT
1 0 0 RC
10.0 ML
2 LW
N
4 0 M
4 -2.209 2.209 -4 0 -4 C
-2.209 -4 -4 -2.209 -4 0 C
-4 2.209 -2.209 4 0 4 C
2.209 4 4 2.209 4 0 C
S
GR
GS
[0.75 0 0 0.75 83.23125 23.25] CT
1 0 0 RC
10.0 ML
2 LW
N
4 0 M
4 -2.209 2.209 -4 0 -4 C
-2.209 -4 -4 -2.209 -4 0 C
-4 2.209 -2.209 4 0 4 C
2.209 4 4 2.209 4 0 C
S
GR
GS
[0.75 0 0 0.75 87.3 23.25] CT
1 0 0 RC
10.0 ML
2 LW
N
4 0 M
4 -2.209 2.209 -4 0 -4 C
-2.209 -4 -4 -2.209 -4 0 C
-4 2.209 -2.209 4 0 4 C
2.209 4 4 2.209 4 0 C
S
GR
GS
[0.75 0 0 0.75 91.36875 23.25] CT
1 0 0 RC
10.0 ML
2 LW
N
4 0 M
4 -2.209 2.209 -4 0 -4 C
-2.209 -4 -4 -2.209 -4 0 C
-4 2.209 -2.209 4 0 4 C
2.209 4 4 2.209 4 0 C
S
GR
GS
[0.75 0 0 0.75 95.4375 23.25] CT
1 0 0 RC
10.0 ML
2 LW
N
4 0 M
4 -2.209 2.209 -4 0 -4 C
-2.209 -4 -4 -2.209 -4 0 C
-4 2.209 -2.209 4 0 4 C
2.209 4 4 2.209 4 0 C
S
GR
GS
[0.75 0 0 0.75 99.50625 23.26286] CT
1 0 0 RC
10.0 ML
2 LW
N
4 0 M
4 -2.209 2.209 -4 0 -4 C
-2.209 -4 -4 -2.209 -4 0 C
-4 2.209 -2.209 4 0 4 C
2.209 4 4 2.209 4 0 C
S
GR
GS
[0.75 0 0 0.75 103.575 23.25] CT
1 0 0 RC
10.0 ML
2 LW
N
4 0 M
4 -2.209 2.209 -4 0 -4 C
-2.209 -4 -4 -2.209 -4 0 C
-4 2.209 -2.209 4 0 4 C
2.209 4 4 2.209 4 0 C
S
GR
GS
[0.75 0 0 0.75 107.64375 23.25] CT
1 0 0 RC
10.0 ML
2 LW
N
4 0 M
4 -2.209 2.209 -4 0 -4 C
-2.209 -4 -4 -2.209 -4 0 C
-4 2.209 -2.209 4 0 4 C
2.209 4 4 2.209 4 0 C
S
GR
GS
[0.75 0 0 0.75 111.7125 23.25] CT
1 0 0 RC
10.0 ML
2 LW
N
4 0 M
4 -2.209 2.209 -4 0 -4 C
-2.209 -4 -4 -2.209 -4 0 C
-4 2.209 -2.209 4 0 4 C
2.209 4 4 2.209 4 0 C
S
GR
GS
[0.75 0 0 0.75 115.78125 23.25] CT
1 0 0 RC
10.0 ML
2 LW
N
4 0 M
4 -2.209 2.209 -4 0 -4 C
-2.209 -4 -4 -2.209 -4 0 C
-4 2.209 -2.209 4 0 4 C
2.209 4 4 2.209 4 0 C
S
GR
GS
[0.75 0 0 0.75 119.85 23.25] CT
1 0 0 RC
10.0 ML
2 LW
N
4 0 M
4 -2.209 2.209 -4 0 -4 C
-2.209 -4 -4 -2.209 -4 0 C
-4 2.209 -2.209 4 0 4 C
2.209 4 4 2.209 4 0 C
S
GR
GS
[0.75 0 0 0.75 123.91875 23.25] CT
1 0 0 RC
10.0 ML
2 LW
N
4 0 M
4 -2.209 2.209 -4 0 -4 C
-2.209 -4 -4 -2.209 -4 0 C
-4 2.209 -2.209 4 0 4 C
2.209 4 4 2.209 4 0 C
S
GR
GS
[0.75 0 0 0.75 127.9875 23.25] CT
1 0 0 RC
10.0 ML
2 LW
N
4 0 M
4 -2.209 2.209 -4 0 -4 C
-2.209 -4 -4 -2.209 -4 0 C
-4 2.209 -2.209 4 0 4 C
2.209 4 4 2.209 4 0 C
S
GR
GS
[0.75 0 0 0.75 132.05625 23.25] CT
1 0 0 RC
10.0 ML
2 LW
N
4 0 M
4 -2.209 2.209 -4 0 -4 C
-2.209 -4 -4 -2.209 -4 0 C
-4 2.209 -2.209 4 0 4 C
2.209 4 4 2.209 4 0 C
S
GR
GS
[0.75 0 0 0.75 136.125 23.26286] CT
1 0 0 RC
10.0 ML
2 LW
N
4 0 M
4 -2.209 2.209 -4 0 -4 C
-2.209 -4 -4 -2.209 -4 0 C
-4 2.209 -2.209 4 0 4 C
2.209 4 4 2.209 4 0 C
S
GR
GS
[0.75 0 0 0.75 140.19375 23.28859] CT
1 0 0 RC
10.0 ML
2 LW
N
4 0 M
4 -2.209 2.209 -4 0 -4 C
-2.209 -4 -4 -2.209 -4 0 C
-4 2.209 -2.209 4 0 4 C
2.209 4 4 2.209 4 0 C
S
GR
GS
[0.75 0 0 0.75 144.2625 23.25] CT
1 0 0 RC
10.0 ML
2 LW
N
4 0 M
4 -2.209 2.209 -4 0 -4 C
-2.209 -4 -4 -2.209 -4 0 C
-4 2.209 -2.209 4 0 4 C
2.209 4 4 2.209 4 0 C
S
GR
GS
[0.75 0 0 0.75 148.33125 23.59729] CT
1 0 0 RC
10.0 ML
2 LW
N
4 0 M
4 -2.209 2.209 -4 0 -4 C
-2.209 -4 -4 -2.209 -4 0 C
-4 2.209 -2.209 4 0 4 C
2.209 4 4 2.209 4 0 C
S
GR
GS
[0.75 0 0 0.75 152.4 26.16979] CT
1 0 0 RC
10.0 ML
2 LW
N
4 0 M
4 -2.209 2.209 -4 0 -4 C
-2.209 -4 -4 -2.209 -4 0 C
-4 2.209 -2.209 4 0 4 C
2.209 4 4 2.209 4 0 C
S
GR
GS
[0.75 0 0 0.75 156.46875 27.53321] CT
1 0 0 RC
10.0 ML
2 LW
N
4 0 M
4 -2.209 2.209 -4 0 -4 C
-2.209 -4 -4 -2.209 -4 0 C
-4 2.209 -2.209 4 0 4 C
2.209 4 4 2.209 4 0 C
S
GR
GS
[0.75 0 0 0.75 160.5375 27.93195] CT
1 0 0 RC
10.0 ML
2 LW
N
4 0 M
4 -2.209 2.209 -4 0 -4 C
-2.209 -4 -4 -2.209 -4 0 C
-4 2.209 -2.209 4 0 4 C
2.209 4 4 2.209 4 0 C
S
GR
GS
[0.75 0 0 0.75 164.60625 28.87091] CT
1 0 0 RC
10.0 ML
2 LW
N
4 0 M
4 -2.209 2.209 -4 0 -4 C
-2.209 -4 -4 -2.209 -4 0 C
-4 2.209 -2.209 4 0 4 C
2.209 4 4 2.209 4 0 C
S
GR
GS
[0.75 0 0 0.75 168.675 30.09286] CT
1 0 0 RC
10.0 ML
2 LW
N
4 0 M
4 -2.209 2.209 -4 0 -4 C
-2.209 -4 -4 -2.209 -4 0 C
-4 2.209 -2.209 4 0 4 C
2.209 4 4 2.209 4 0 C
S
GR
GS
[0.75 0 0 0.75 172.74375 34.69762] CT
1 0 0 RC
10.0 ML
2 LW
N
4 0 M
4 -2.209 2.209 -4 0 -4 C
-2.209 -4 -4 -2.209 -4 0 C
-4 2.209 -2.209 4 0 4 C
2.209 4 4 2.209 4 0 C
S
GR
GS
[0.75 0 0 0.75 176.8125 34.18312] CT
1 0 0 RC
10.0 ML
2 LW
N
4 0 M
4 -2.209 2.209 -4 0 -4 C
-2.209 -4 -4 -2.209 -4 0 C
-4 2.209 -2.209 4 0 4 C
2.209 4 4 2.209 4 0 C
S
GR
GS
[0.75 0 0 0.75 180.88125 37.46307] CT
1 0 0 RC
10.0 ML
2 LW
N
4 0 M
4 -2.209 2.209 -4 0 -4 C
-2.209 -4 -4 -2.209 -4 0 C
-4 2.209 -2.209 4 0 4 C
2.209 4 4 2.209 4 0 C
S
GR
GS
[0.75 0 0 0.75 184.95 37.88753] CT
1 0 0 RC
10.0 ML
2 LW
N
4 0 M
4 -2.209 2.209 -4 0 -4 C
-2.209 -4 -4 -2.209 -4 0 C
-4 2.209 -2.209 4 0 4 C
2.209 4 4 2.209 4 0 C
S
GR
GS
[0.75 0 0 0.75 189.01875 148.1706] CT
1 0 0 RC
10.0 ML
2 LW
N
4 0 M
4 -2.209 2.209 -4 0 -4 C
-2.209 -4 -4 -2.209 -4 0 C
-4 2.209 -2.209 4 0 4 C
2.209 4 4 2.209 4 0 C
S
GR
GS
[0.75 0 0 0.75 193.08751 273.06548] CT
1 0 0 RC
10.0 ML
2 LW
N
4 0 M
4 -2.209 2.209 -4 0 -4 C
-2.209 -4 -4 -2.209 -4 0 C
-4 2.209 -2.209 4 0 4 C
2.209 4 4 2.209 4 0 C
S
GR
GS
[0.75 0 0 0.75 197.15625 279.844] CT
1 0 0 RC
10.0 ML
2 LW
N
4 0 M
4 -2.209 2.209 -4 0 -4 C
-2.209 -4 -4 -2.209 -4 0 C
-4 2.209 -2.209 4 0 4 C
2.209 4 4 2.209 4 0 C
S
GR
GS
[0.75 0 0 0.75 201.22499 280.5] CT
1 0 0 RC
10.0 ML
2 LW
N
4 0 M
4 -2.209 2.209 -4 0 -4 C
-2.209 -4 -4 -2.209 -4 0 C
-4 2.209 -2.209 4 0 4 C
2.209 4 4 2.209 4 0 C
S
GR
GS
[0.75 0 0 0.75 205.29375 280.5] CT
1 0 0 RC
10.0 ML
2 LW
N
4 0 M
4 -2.209 2.209 -4 0 -4 C
-2.209 -4 -4 -2.209 -4 0 C
-4 2.209 -2.209 4 0 4 C
2.209 4 4 2.209 4 0 C
S
GR
GS
[0.75 0 0 0.75 209.3625 280.5] CT
1 0 0 RC
10.0 ML
2 LW
N
4 0 M
4 -2.209 2.209 -4 0 -4 C
-2.209 -4 -4 -2.209 -4 0 C
-4 2.209 -2.209 4 0 4 C
2.209 4 4 2.209 4 0 C
S
GR
GS
[0.75 0 0 0.75 213.43126 280.5] CT
1 0 0 RC
10.0 ML
2 LW
N
4 0 M
4 -2.209 2.209 -4 0 -4 C
-2.209 -4 -4 -2.209 -4 0 C
-4 2.209 -2.209 4 0 4 C
2.209 4 4 2.209 4 0 C
S
GR
GS
[0.75 0 0 0.75 217.5 280.5] CT
1 0 0 RC
10.0 ML
2 LW
N
4 0 M
4 -2.209 2.209 -4 0 -4 C
-2.209 -4 -4 -2.209 -4 0 C
-4 2.209 -2.209 4 0 4 C
2.209 4 4 2.209 4 0 C
S
GR
GS
[0.75 0 0 0.75 0 0] CT
1 GC
N
494 78 M
494 44 L
415 44 L
415 78 L
cp
f
GR
GS
[0.75 0 0 0.75 346.72449 40.04505] CT
N
0.406 2.88 M
0.406 2.458 L
1.641 2.458 1.641 2.083 QT
1.641 -4.511 L
1.641 -4.901 0.406 -4.901 QT
0.406 -5.323 L
4.828 -5.323 L
5.438 -5.323 6.055 -5.081 QT
6.672 -4.839 7.078 -4.378 QT
7.484 -3.917 7.484 -3.276 QT
7.484 -2.542 6.883 -2.05 QT
6.281 -1.558 5.484 -1.401 QT
6 -1.401 6.555 -1.112 QT
7.109 -0.823 7.461 -0.347 QT
7.813 0.13 7.813 0.677 QT
7.813 1.333 7.422 1.833 QT
7.031 2.333 6.414 2.607 QT
5.797 2.88 5.156 2.88 QT
0.406 2.88 L
cp
2.688 2.083 M
2.688 2.333 2.836 2.396 QT
2.984 2.458 3.297 2.458 QT
4.828 2.458 L
5.297 2.458 5.695 2.208 QT
6.094 1.958 6.328 1.552 QT
6.563 1.146 6.563 0.677 QT
6.563 0.208 6.367 -0.229 QT
6.172 -0.667 5.813 -0.948 QT
5.453 -1.229 5 -1.229 QT
2.688 -1.229 L
2.688 2.083 L
cp
2.688 -1.542 M
4.484 -1.542 L
4.859 -1.542 5.172 -1.675 QT
5.484 -1.808 5.742 -2.058 QT
6 -2.308 6.141 -2.62 QT
6.281 -2.933 6.281 -3.276 QT
6.281 -3.589 6.18 -3.878 QT
6.078 -4.167 5.875 -4.401 QT
5.672 -4.636 5.406 -4.768 QT
5.141 -4.901 4.828 -4.901 QT
3.297 -4.901 L
3.078 -4.901 2.961 -4.878 QT
2.844 -4.854 2.766 -4.776 QT
2.688 -4.698 2.688 -4.511 QT
2.688 -1.542 L
cp
f
GR
GS
[0.75 0 0 0.75 346.72449 40.04505] CT
N
8.813 2.88 M
8.813 2.458 L
10.109 2.458 10.109 2.083 QT
10.109 -4.511 L
10.109 -4.901 8.813 -4.901 QT
8.813 -5.323 L
12.516 -5.323 L
12.516 -4.901 L
11.219 -4.901 11.219 -4.511 QT
11.219 2.083 L
11.219 2.458 12.516 2.458 QT
12.516 2.88 L
8.813 2.88 L
cp
f
GR
GS
[0.75 0 0 0.75 346.72449 40.04505] CT
N
14.865 2.88 M
14.865 2.458 L
15.458 2.458 16.029 2.388 QT
16.599 2.317 16.599 2.083 QT
16.599 -4.511 L
16.599 -4.776 16.458 -4.839 QT
16.318 -4.901 15.99 -4.901 QT
15.49 -4.901 L
14.505 -4.901 14.083 -4.464 QT
13.865 -4.245 13.771 -3.768 QT
13.677 -3.292 13.615 -2.573 QT
13.271 -2.573 L
13.49 -5.323 L
20.833 -5.323 L
21.052 -2.573 L
20.708 -2.573 L
20.63 -3.339 20.544 -3.792 QT
20.458 -4.245 20.24 -4.464 QT
19.818 -4.901 18.833 -4.901 QT
18.333 -4.901 L
18.115 -4.901 17.997 -4.878 QT
17.88 -4.854 17.802 -4.776 QT
17.724 -4.698 17.724 -4.511 QT
17.724 2.083 L
17.724 2.317 18.294 2.388 QT
18.865 2.458 19.458 2.458 QT
19.458 2.88 L
14.865 2.88 L
cp
f
GR
GS
[0.75 0 0 0.75 329.36462 40.04505] CT
0 0 1 RC
10.0 ML
2 LW
N
4 0 M
4 -2.209 2.209 -4 0 -4 C
-2.209 -4 -4 -2.209 -4 0 C
-4 2.209 -2.209 4 0 4 C
2.209 4 4 2.209 4 0 C
S
GR
GS
[0.75 0 0 0.75 346.72449 51.45495] CT
N
0.375 2.88 M
0.375 2.458 L
1.609 2.458 1.609 2.083 QT
1.609 -4.511 L
1.609 -4.901 0.375 -4.901 QT
0.375 -5.323 L
6.984 -5.323 L
7.313 -2.573 L
6.969 -2.573 L
6.891 -3.323 6.75 -3.761 QT
6.609 -4.198 6.352 -4.448 QT
6.094 -4.698 5.648 -4.8 QT
5.203 -4.901 4.438 -4.901 QT
3.328 -4.901 L
3.125 -4.901 3 -4.878 QT
2.875 -4.854 2.797 -4.776 QT
2.719 -4.698 2.719 -4.511 QT
2.719 -1.433 L
3.578 -1.433 L
4.188 -1.433 4.477 -1.542 QT
4.766 -1.651 4.875 -1.933 QT
4.984 -2.214 4.984 -2.839 QT
5.328 -2.839 L
5.328 0.396 L
4.984 0.396 L
4.984 -0.214 4.875 -0.503 QT
4.766 -0.792 4.477 -0.901 QT
4.188 -1.011 3.578 -1.011 QT
2.719 -1.011 L
2.719 2.083 L
2.719 2.458 4.266 2.458 QT
4.266 2.88 L
0.375 2.88 L
cp
f
GR
GS
[0.75 0 0 0.75 346.72449 51.45495] CT
N
8.255 2.88 M
8.255 2.458 L
9.49 2.458 9.49 1.755 QT
9.49 -4.511 L
9.49 -4.901 8.255 -4.901 QT
8.255 -5.323 L
10.521 -5.323 L
10.677 -5.323 10.724 -5.183 QT
13.333 1.614 L
15.943 -5.183 L
15.99 -5.323 16.13 -5.323 QT
18.411 -5.323 L
18.411 -4.901 L
17.161 -4.901 17.161 -4.511 QT
17.161 2.083 L
17.161 2.458 18.411 2.458 QT
18.411 2.88 L
14.911 2.88 L
14.911 2.458 L
16.146 2.458 16.146 2.083 QT
16.146 -4.901 L
13.193 2.739 L
13.146 2.88 12.99 2.88 QT
12.849 2.88 12.786 2.739 QT
9.88 -4.808 L
9.88 1.755 L
9.88 2.458 11.115 2.458 QT
11.115 2.88 L
8.255 2.88 L
cp
f
GR
GS
[0.75 0 0 0.75 346.72449 51.45495] CT
N
20.865 2.88 M
20.865 2.458 L
21.458 2.458 22.029 2.388 QT
22.599 2.317 22.599 2.083 QT
22.599 -4.511 L
22.599 -4.776 22.458 -4.839 QT
22.318 -4.901 21.99 -4.901 QT
21.49 -4.901 L
20.505 -4.901 20.083 -4.464 QT
19.865 -4.245 19.771 -3.768 QT
19.677 -3.292 19.615 -2.573 QT
19.271 -2.573 L
19.49 -5.323 L
26.833 -5.323 L
27.052 -2.573 L
26.708 -2.573 L
26.63 -3.339 26.544 -3.792 QT
26.458 -4.245 26.24 -4.464 QT
25.818 -4.901 24.833 -4.901 QT
24.333 -4.901 L
24.115 -4.901 23.997 -4.878 QT
23.88 -4.854 23.802 -4.776 QT
23.724 -4.698 23.724 -4.511 QT
23.724 2.083 L
23.724 2.317 24.294 2.388 QT
24.865 2.458 25.458 2.458 QT
25.458 2.88 L
20.865 2.88 L
cp
f
GR
GS
[0.75 0 0 0.75 329.36462 51.45495] CT
1 0 0 RC
10.0 ML
2 LW
N
4 0 M
4 -2.209 2.209 -4 0 -4 C
-2.209 -4 -4 -2.209 -4 0 C
-4 2.209 -2.209 4 0 4 C
2.209 4 4 2.209 4 0 C
S
GR
GS
[0.75 0 0 0.75 0 0] CT
0.149 GC
10.0 ML
0.667 LW
N
415 78 M
415 44 L
494 44 L
494 78 L
cp
S
GR
%%Trailer
%%Pages: 1
%%EOF
