0.0005 0.4216 7.09544 7.88481 0.994402
0.000537975 0.4191 7.10268 7.87215 1.00325
0.000575949 0.4192 7.09799 8.07006 1.14638
0.000613924 0.4201 7.0974 8.05893 1.02327
0.000651899 0.42 7.10117 8.48505 1.16091
0.000689873 0.4179 7.10196 8.19771 1.03628
0.000727848 0.4193 7.0952 8.06161 0.910587
0.000765823 0.419 7.09895 7.96834 0.907684
0.000803797 0.4195 7.09901 8.1483 1.05757
0.000841772 0.4204 7.0975 7.93234 1.10924
0.000879747 0.4202 7.10218 8.30042 1.19306
0.000917722 0.4198 7.09758 8.1141 1.00939
0.000955696 0.4237 7.09757 7.7751 0.904943
0.000993671 0.4235 7.09629 7.77407 0.836712
0.00103165 0.4229 7.09808 8.22179 1.21752
0.00106962 0.4312 7.09581 7.45325 0.718582
0.00110759 0.4847 7.09178 7.37862 0.577103
0.00114557 0.976 7.09235 7.24975 0.284023
0.00118354 0.9987 7.09189 7.25809 0.283552
0.00122152 0.9997 7.09245 7.26036 0.286873
0.00125949 0.9997 7.09299 7.25406 0.278478
0.00129747 0.9997 7.09085 7.25262 0.268541
0.00133544 0.9998 7.09218 7.24769 0.263949
0.00137342 1 7.09257 7.24166 0.258807
0.00141139 0.9998 7.09199 7.24531 0.260682
0.00144937 0.9998 7.09089 7.24134 0.253536
0.00148734 1 7.09233 7.24586 0.257024
0.00152532 0.9998 7.09147 7.23767 0.251103
0.00156329 0.9998 7.09248 7.23639 0.243673
0.00160127 1 7.09237 7.23444 0.246506
0.00163924 0.9999 7.09179 7.2415 0.250159
0.00167722 0.9999 7.09176 7.24043 0.254621
0.00171519 0.9997 7.09173 7.24168 0.251867
0.00175316 1 7.0922 7.23965 0.254526
0.00179114 0.9999 7.09319 7.23403 0.240316
0.00182911 0.9997 7.09269 7.23961 0.249368
0.00186709 0.9997 7.09175 7.23613 0.244839
0.00190506 1 7.09163 7.24007 0.247636
0.00194304 1 7.09254 7.23617 0.240823
0.00198101 1 7.09301 7.23167 0.242504
0.00201899 0.9998 7.09115 7.2339 0.24399
0.00205696 0.9999 7.09243 7.23783 0.246666
0.00209494 0.9999 7.09165 7.23844 0.245491
0.00213291 0.9998 7.09168 7.23505 0.250276
0.00217089 0.9999 7.09202 7.23536 0.240681
0.00220886 0.9999 7.09272 7.22872 0.241409
0.00224684 0.9999 7.09197 7.22683 0.24125
0.00228481 0.9997 7.09219 7.22254 0.229155
0.00232278 0.9998 7.09193 7.2201 0.235719
0.00236076 0.9999 7.09224 7.21893 0.227
0.00239873 0.9999 7.09218 7.21742 0.226108
0.00243671 0.9999 7.09207 7.21941 0.224443
0.00247468 0.9998 7.09256 7.21757 0.223479
0.00251266 0.9999 7.09093 7.21175 0.220089
0.00255063 1 7.09211 7.2153 0.224937
0.00258861 1 7.09173 7.21909 0.23099
0.00262658 0.9998 7.09129 7.21763 0.224638
0.00266456 1 7.09173 7.2141 0.228711
0.00270253 1 7.09187 7.21868 0.227494
0.00274051 1 7.09163 7.21253 0.218842
0.00277848 1 7.09204 7.21569 0.211832
0.00281646 0.9999 7.09129 7.21546 0.224679
0.00285443 0.9999 7.091 7.21367 0.218443
0.00289241 1 7.0905 7.2118 0.211668
0.00293038 1 7.0926 7.2125 0.221493
0.00296835 0.9999 7.09264 7.21326 0.223537
0.00300633 0.9999 7.09232 7.21231 0.216073
0.0030443 0.9999 7.09091 7.2142 0.221543
0.00308228 1 7.09189 7.2113 0.213578
0.00312025 0.9999 7.0912 7.21141 0.216123
0.00315823 1 7.09155 7.21442 0.226741
0.0031962 1 7.0925 7.21152 0.218823
0.00323418 0.9999 7.09149 7.21293 0.216868
0.00327215 1 7.092 7.21308 0.213494
0.00331013 0.9998 7.09138 7.21135 0.215279
0.0033481 0.9998 7.09224 7.21164 0.215365
0.00338608 1 7.09255 7.21222 0.219615
0.00342405 0.9998 7.09092 7.21161 0.214768
0.00346203 0.9998 7.09217 7.20995 0.214857
0.0035 1 7.09172 7.20846 0.21176
