%!PS-Adobe-3.0 EPSF-3.0
%%Creator: (MATLAB, The Mathworks, Inc. Version 9.3.0.713579 \(R2017b\). Operating System: Linux)
%%Title: ./0convergenceTestRRTK.eps
%%CreationDate: 2021-01-08T17:31:22
%%Pages: (atend)
%%BoundingBox:   151    51  1260   677
%%LanguageLevel: 3
%%EndComments
%%BeginProlog
%%BeginResource: procset (Apache XML Graphics Std ProcSet) 1.2 0
%%Version: 1.2 0
%%Copyright: (Copyright 2001-2003,2010 The Apache Software Foundation. License terms: http://www.apache.org/licenses/LICENSE-2.0)
/bd{bind def}bind def
/ld{load def}bd
/GR/grestore ld
/GS/gsave ld
/RM/rmoveto ld
/C/curveto ld
/t/show ld
/L/lineto ld
/ML/setmiterlimit ld
/CT/concat ld
/f/fill ld
/N/newpath ld
/S/stroke ld
/CC/setcmykcolor ld
/A/ashow ld
/cp/closepath ld
/RC/setrgbcolor ld
/LJ/setlinejoin ld
/GC/setgray ld
/LW/setlinewidth ld
/M/moveto ld
/re {4 2 roll M
1 index 0 rlineto
0 exch rlineto
neg 0 rlineto
cp } bd
/_ctm matrix def
/_tm matrix def
/BT { _ctm currentmatrix pop matrix _tm copy pop 0 0 moveto } bd
/ET { _ctm setmatrix } bd
/iTm { _ctm setmatrix _tm concat } bd
/Tm { _tm astore pop iTm 0 0 moveto } bd
/ux 0.0 def
/uy 0.0 def
/F {
  /Tp exch def
  /Tf exch def
  Tf findfont Tp scalefont setfont
  /cf Tf def  /cs Tp def
} bd
/ULS {currentpoint /uy exch def /ux exch def} bd
/ULE {
  /Tcx currentpoint pop def
  gsave
  newpath
  cf findfont cs scalefont dup
  /FontMatrix get 0 get /Ts exch def /FontInfo get dup
  /UnderlinePosition get Ts mul /To exch def
  /UnderlineThickness get Ts mul /Tt exch def
  ux uy To add moveto  Tcx uy To add lineto
  Tt setlinewidth stroke
  grestore
} bd
/OLE {
  /Tcx currentpoint pop def
  gsave
  newpath
  cf findfont cs scalefont dup
  /FontMatrix get 0 get /Ts exch def /FontInfo get dup
  /UnderlinePosition get Ts mul /To exch def
  /UnderlineThickness get Ts mul /Tt exch def
  ux uy To add cs add moveto Tcx uy To add cs add lineto
  Tt setlinewidth stroke
  grestore
} bd
/SOE {
  /Tcx currentpoint pop def
  gsave
  newpath
  cf findfont cs scalefont dup
  /FontMatrix get 0 get /Ts exch def /FontInfo get dup
  /UnderlinePosition get Ts mul /To exch def
  /UnderlineThickness get Ts mul /Tt exch def
  ux uy To add cs 10 mul 26 idiv add moveto Tcx uy To add cs 10 mul 26 idiv add lineto
  Tt setlinewidth stroke
  grestore
} bd
/QT {
/Y22 exch store
/X22 exch store
/Y21 exch store
/X21 exch store
currentpoint
/Y21 load 2 mul add 3 div exch
/X21 load 2 mul add 3 div exch
/X21 load 2 mul /X22 load add 3 div
/Y21 load 2 mul /Y22 load add 3 div
/X22 load /Y22 load curveto
} bd
/SSPD {
dup length /d exch dict def
{
/v exch def
/k exch def
currentpagedevice k known {
/cpdv currentpagedevice k get def
v cpdv ne {
/upd false def
/nullv v type /nulltype eq def
/nullcpdv cpdv type /nulltype eq def
nullv nullcpdv or
{
/upd true def
} {
/sametype v type cpdv type eq def
sametype {
v type /arraytype eq {
/vlen v length def
/cpdvlen cpdv length def
vlen cpdvlen eq {
0 1 vlen 1 sub {
/i exch def
/obj v i get def
/cpdobj cpdv i get def
obj cpdobj ne {
/upd true def
exit
} if
} for
} {
/upd true def
} ifelse
} {
v type /dicttype eq {
v {
/dv exch def
/dk exch def
/cpddv cpdv dk get def
dv cpddv ne {
/upd true def
exit
} if
} forall
} {
/upd true def
} ifelse
} ifelse
} if
} ifelse
upd true eq {
d k v put
} if
} if
} if
} forall
d length 0 gt {
d setpagedevice
} if
} bd
/RE { % /NewFontName [NewEncodingArray] /FontName RE -
  findfont dup length dict begin
  {
    1 index /FID ne
    {def} {pop pop} ifelse
  } forall
  /Encoding exch def
  /FontName 1 index def
  currentdict definefont pop
  end
} bind def
%%EndResource
%%BeginResource: procset (Apache XML Graphics EPS ProcSet) 1.0 0
%%Version: 1.0 0
%%Copyright: (Copyright 2002-2003 The Apache Software Foundation. License terms: http://www.apache.org/licenses/LICENSE-2.0)
/BeginEPSF { %def
/b4_Inc_state save def         % Save state for cleanup
/dict_count countdictstack def % Count objects on dict stack
/op_count count 1 sub def      % Count objects on operand stack
userdict begin                 % Push userdict on dict stack
/showpage { } def              % Redefine showpage, { } = null proc
0 setgray 0 setlinecap         % Prepare graphics state
1 setlinewidth 0 setlinejoin
10 setmiterlimit [ ] 0 setdash newpath
/languagelevel where           % If level not equal to 1 then
{pop languagelevel             % set strokeadjust and
1 ne                           % overprint to their defaults.
{false setstrokeadjust false setoverprint
} if
} if
} bd
/EndEPSF { %def
count op_count sub {pop} repeat            % Clean up stacks
countdictstack dict_count sub {end} repeat
b4_Inc_state restore
} bd
%%EndResource
%FOPBeginFontDict
%%IncludeResource: font Courier-Oblique
%%IncludeResource: font Courier-BoldOblique
%%IncludeResource: font Courier-Bold
%%IncludeResource: font ZapfDingbats
%%IncludeResource: font Symbol
%%IncludeResource: font Helvetica
%%IncludeResource: font Helvetica-Oblique
%%IncludeResource: font Helvetica-Bold
%%IncludeResource: font Helvetica-BoldOblique
%%IncludeResource: font Times-Roman
%%IncludeResource: font Times-Italic
%%IncludeResource: font Times-Bold
%%IncludeResource: font Times-BoldItalic
%%IncludeResource: font Courier
%FOPEndFontDict
%%BeginResource: encoding WinAnsiEncoding
/WinAnsiEncoding [
/.notdef /.notdef /.notdef /.notdef /.notdef
/.notdef /.notdef /.notdef /.notdef /.notdef
/.notdef /.notdef /.notdef /.notdef /.notdef
/.notdef /.notdef /.notdef /.notdef /.notdef
/.notdef /.notdef /.notdef /.notdef /.notdef
/.notdef /.notdef /.notdef /.notdef /.notdef
/.notdef /.notdef /space /exclam /quotedbl
/numbersign /dollar /percent /ampersand /quotesingle
/parenleft /parenright /asterisk /plus /comma
/hyphen /period /slash /zero /one
/two /three /four /five /six
/seven /eight /nine /colon /semicolon
/less /equal /greater /question /at
/A /B /C /D /E
/F /G /H /I /J
/K /L /M /N /O
/P /Q /R /S /T
/U /V /W /X /Y
/Z /bracketleft /backslash /bracketright /asciicircum
/underscore /quoteleft /a /b /c
/d /e /f /g /h
/i /j /k /l /m
/n /o /p /q /r
/s /t /u /v /w
/x /y /z /braceleft /bar
/braceright /asciitilde /bullet /Euro /bullet
/quotesinglbase /florin /quotedblbase /ellipsis /dagger
/daggerdbl /circumflex /perthousand /Scaron /guilsinglleft
/OE /bullet /Zcaron /bullet /bullet
/quoteleft /quoteright /quotedblleft /quotedblright /bullet
/endash /emdash /asciitilde /trademark /scaron
/guilsinglright /oe /bullet /zcaron /Ydieresis
/space /exclamdown /cent /sterling /currency
/yen /brokenbar /section /dieresis /copyright
/ordfeminine /guillemotleft /logicalnot /sfthyphen /registered
/macron /degree /plusminus /twosuperior /threesuperior
/acute /mu /paragraph /middot /cedilla
/onesuperior /ordmasculine /guillemotright /onequarter /onehalf
/threequarters /questiondown /Agrave /Aacute /Acircumflex
/Atilde /Adieresis /Aring /AE /Ccedilla
/Egrave /Eacute /Ecircumflex /Edieresis /Igrave
/Iacute /Icircumflex /Idieresis /Eth /Ntilde
/Ograve /Oacute /Ocircumflex /Otilde /Odieresis
/multiply /Oslash /Ugrave /Uacute /Ucircumflex
/Udieresis /Yacute /Thorn /germandbls /agrave
/aacute /acircumflex /atilde /adieresis /aring
/ae /ccedilla /egrave /eacute /ecircumflex
/edieresis /igrave /iacute /icircumflex /idieresis
/eth /ntilde /ograve /oacute /ocircumflex
/otilde /odieresis /divide /oslash /ugrave
/uacute /ucircumflex /udieresis /yacute /thorn
/ydieresis
] def
%%EndResource
%FOPBeginFontReencode
/Courier-Oblique findfont
dup length dict begin
  {1 index /FID ne {def} {pop pop} ifelse} forall
  /Encoding WinAnsiEncoding def
  currentdict
end
/Courier-Oblique exch definefont pop
/Courier-BoldOblique findfont
dup length dict begin
  {1 index /FID ne {def} {pop pop} ifelse} forall
  /Encoding WinAnsiEncoding def
  currentdict
end
/Courier-BoldOblique exch definefont pop
/Courier-Bold findfont
dup length dict begin
  {1 index /FID ne {def} {pop pop} ifelse} forall
  /Encoding WinAnsiEncoding def
  currentdict
end
/Courier-Bold exch definefont pop
/Helvetica findfont
dup length dict begin
  {1 index /FID ne {def} {pop pop} ifelse} forall
  /Encoding WinAnsiEncoding def
  currentdict
end
/Helvetica exch definefont pop
/Helvetica-Oblique findfont
dup length dict begin
  {1 index /FID ne {def} {pop pop} ifelse} forall
  /Encoding WinAnsiEncoding def
  currentdict
end
/Helvetica-Oblique exch definefont pop
/Helvetica-Bold findfont
dup length dict begin
  {1 index /FID ne {def} {pop pop} ifelse} forall
  /Encoding WinAnsiEncoding def
  currentdict
end
/Helvetica-Bold exch definefont pop
/Helvetica-BoldOblique findfont
dup length dict begin
  {1 index /FID ne {def} {pop pop} ifelse} forall
  /Encoding WinAnsiEncoding def
  currentdict
end
/Helvetica-BoldOblique exch definefont pop
/Times-Roman findfont
dup length dict begin
  {1 index /FID ne {def} {pop pop} ifelse} forall
  /Encoding WinAnsiEncoding def
  currentdict
end
/Times-Roman exch definefont pop
/Times-Italic findfont
dup length dict begin
  {1 index /FID ne {def} {pop pop} ifelse} forall
  /Encoding WinAnsiEncoding def
  currentdict
end
/Times-Italic exch definefont pop
/Times-Bold findfont
dup length dict begin
  {1 index /FID ne {def} {pop pop} ifelse} forall
  /Encoding WinAnsiEncoding def
  currentdict
end
/Times-Bold exch definefont pop
/Times-BoldItalic findfont
dup length dict begin
  {1 index /FID ne {def} {pop pop} ifelse} forall
  /Encoding WinAnsiEncoding def
  currentdict
end
/Times-BoldItalic exch definefont pop
/Courier findfont
dup length dict begin
  {1 index /FID ne {def} {pop pop} ifelse} forall
  /Encoding WinAnsiEncoding def
  currentdict
end
/Courier exch definefont pop
%FOPEndFontReencode
%%EndProlog
%%Page: 1 1
%%PageBoundingBox: 0 0 1390 728
%%BeginPageSetup
[1 0 0 -1 0 728] CT
%%EndPageSetup
GS
[0.75 0 0 0.75 0 0.5] CT
1 GC
N
0 0 1853 970 re
f
GR
GS
[0.75 0 0 0.75 0 0.5] CT
1 GC
N
0 0 1853 970 re
f
GR
GS
[0.75 0 0 0.75 0 0.5] CT
1 GC
N
241 863 M
1677 863 L
1677 73 L
241 73 L
cp
f
GR
GS
[0.75 0 0 0.75 0 0.5] CT
0.873 GC
1 LJ
0.667 LW
N
241 863 M
241 73 L
S
GR
GS
[0.75 0 0 0.75 0 0.5] CT
0.873 GC
1 LJ
0.667 LW
N
384.6 863 M
384.6 73 L
S
GR
GS
[0.75 0 0 0.75 0 0.5] CT
0.873 GC
1 LJ
0.667 LW
N
528.2 863 M
528.2 73 L
S
GR
GS
[0.75 0 0 0.75 0 0.5] CT
0.873 GC
1 LJ
0.667 LW
N
671.8 863 M
671.8 73 L
S
GR
GS
[0.75 0 0 0.75 0 0.5] CT
0.873 GC
1 LJ
0.667 LW
N
815.4 863 M
815.4 73 L
S
GR
GS
[0.75 0 0 0.75 0 0.5] CT
0.873 GC
1 LJ
0.667 LW
N
959 863 M
959 73 L
S
GR
GS
[0.75 0 0 0.75 0 0.5] CT
0.873 GC
1 LJ
0.667 LW
N
1102.6 863 M
1102.6 73 L
S
GR
GS
[0.75 0 0 0.75 0 0.5] CT
0.873 GC
1 LJ
0.667 LW
N
1246.2 863 M
1246.2 73 L
S
GR
GS
[0.75 0 0 0.75 0 0.5] CT
0.873 GC
1 LJ
0.667 LW
N
1389.8 863 M
1389.8 73 L
S
GR
GS
[0.75 0 0 0.75 0 0.5] CT
0.873 GC
1 LJ
0.667 LW
N
1533.4 863 M
1533.4 73 L
S
GR
GS
[0.75 0 0 0.75 0 0.5] CT
0.873 GC
1 LJ
0.667 LW
N
1677 863 M
1677 73 L
S
GR
GS
[0.75 0 0 0.75 0 0.5] CT
0.873 GC
1 LJ
0.667 LW
N
1677 863 M
241 863 L
S
GR
GS
[0.75 0 0 0.75 0 0.5] CT
0.873 GC
1 LJ
0.667 LW
N
1677 731.333 M
241 731.333 L
S
GR
GS
[0.75 0 0 0.75 0 0.5] CT
0.873 GC
1 LJ
0.667 LW
N
1677 599.667 M
241 599.667 L
S
GR
GS
[0.75 0 0 0.75 0 0.5] CT
0.873 GC
1 LJ
0.667 LW
N
1677 468 M
241 468 L
S
GR
GS
[0.75 0 0 0.75 0 0.5] CT
0.873 GC
1 LJ
0.667 LW
N
1677 336.333 M
241 336.333 L
S
GR
GS
[0.75 0 0 0.75 0 0.5] CT
0.873 GC
1 LJ
0.667 LW
N
1677 204.667 M
241 204.667 L
S
GR
GS
[0.75 0 0 0.75 0 0.5] CT
0.873 GC
1 LJ
0.667 LW
N
1677 73 M
241 73 L
S
GR
GS
[0.75 0 0 0.75 0 0.5] CT
0.149 GC
2 setlinecap
1 LJ
0.667 LW
N
241 863 M
1677 863 L
S
GR
GS
[0.75 0 0 0.75 0 0.5] CT
0.149 GC
2 setlinecap
1 LJ
0.667 LW
N
241 863 M
241 848.64 L
S
GR
GS
[0.75 0 0 0.75 0 0.5] CT
0.149 GC
2 setlinecap
1 LJ
0.667 LW
N
384.6 863 M
384.6 848.64 L
S
GR
GS
[0.75 0 0 0.75 0 0.5] CT
0.149 GC
2 setlinecap
1 LJ
0.667 LW
N
528.2 863 M
528.2 848.64 L
S
GR
GS
[0.75 0 0 0.75 0 0.5] CT
0.149 GC
2 setlinecap
1 LJ
0.667 LW
N
671.8 863 M
671.8 848.64 L
S
GR
GS
[0.75 0 0 0.75 0 0.5] CT
0.149 GC
2 setlinecap
1 LJ
0.667 LW
N
815.4 863 M
815.4 848.64 L
S
GR
GS
[0.75 0 0 0.75 0 0.5] CT
0.149 GC
2 setlinecap
1 LJ
0.667 LW
N
959 863 M
959 848.64 L
S
GR
GS
[0.75 0 0 0.75 0 0.5] CT
0.149 GC
2 setlinecap
1 LJ
0.667 LW
N
1102.6 863 M
1102.6 848.64 L
S
GR
GS
[0.75 0 0 0.75 0 0.5] CT
0.149 GC
2 setlinecap
1 LJ
0.667 LW
N
1246.2 863 M
1246.2 848.64 L
S
GR
GS
[0.75 0 0 0.75 0 0.5] CT
0.149 GC
2 setlinecap
1 LJ
0.667 LW
N
1389.8 863 M
1389.8 848.64 L
S
GR
GS
[0.75 0 0 0.75 0 0.5] CT
0.149 GC
2 setlinecap
1 LJ
0.667 LW
N
1533.4 863 M
1533.4 848.64 L
S
GR
GS
[0.75 0 0 0.75 0 0.5] CT
0.149 GC
2 setlinecap
1 LJ
0.667 LW
N
1677 863 M
1677 848.64 L
S
GR
GS
[0.75 0 0 0.75 180.75 651.74998] CT
0.149 GC
N
-0.083 11.481 M
-1.677 11.481 -2.247 10.169 QT
-2.818 8.856 -2.818 7.059 QT
-2.818 5.919 -2.615 4.927 QT
-2.411 3.934 -1.802 3.239 QT
-1.193 2.544 -0.083 2.544 QT
0.776 2.544 1.323 2.958 QT
1.87 3.372 2.151 4.036 QT
2.432 4.7 2.542 5.458 QT
2.651 6.216 2.651 7.059 QT
2.651 8.169 2.44 9.145 QT
2.229 10.122 1.628 10.802 QT
1.026 11.481 -0.083 11.481 QT
cp
-0.083 11.153 M
0.635 11.153 0.995 10.411 QT
1.354 9.669 1.432 8.762 QT
1.51 7.856 1.51 6.841 QT
1.51 5.872 1.432 5.044 QT
1.354 4.216 1.003 3.544 QT
0.651 2.872 -0.083 2.872 QT
-0.818 2.872 -1.177 3.552 QT
-1.536 4.231 -1.615 5.052 QT
-1.693 5.872 -1.693 6.841 QT
-1.693 7.575 -1.661 8.216 QT
-1.63 8.856 -1.474 9.536 QT
-1.318 10.216 -0.982 10.684 QT
-0.646 11.153 -0.083 11.153 QT
cp
f
GR
GS
[0.75 0 0 0.75 288.45 651.74998] CT
0.149 GC
N
-5.269 11.481 M
-6.862 11.481 -7.433 10.169 QT
-8.003 8.856 -8.003 7.059 QT
-8.003 5.919 -7.8 4.927 QT
-7.597 3.934 -6.987 3.239 QT
-6.378 2.544 -5.269 2.544 QT
-4.409 2.544 -3.862 2.958 QT
-3.315 3.372 -3.034 4.036 QT
-2.753 4.7 -2.644 5.458 QT
-2.534 6.216 -2.534 7.059 QT
-2.534 8.169 -2.745 9.145 QT
-2.956 10.122 -3.558 10.802 QT
-4.159 11.481 -5.269 11.481 QT
cp
-5.269 11.153 M
-4.55 11.153 -4.19 10.411 QT
-3.831 9.669 -3.753 8.762 QT
-3.675 7.856 -3.675 6.841 QT
-3.675 5.872 -3.753 5.044 QT
-3.831 4.216 -4.183 3.544 QT
-4.534 2.872 -5.269 2.872 QT
-6.003 2.872 -6.362 3.552 QT
-6.722 4.231 -6.8 5.052 QT
-6.878 5.872 -6.878 6.841 QT
-6.878 7.575 -6.847 8.216 QT
-6.815 8.856 -6.659 9.536 QT
-6.503 10.216 -6.167 10.684 QT
-5.831 11.153 -5.269 11.153 QT
cp
f
GR
GS
[0.75 0 0 0.75 288.45 651.74998] CT
0.149 GC
N
-0.758 10.481 M
-0.758 10.184 -0.539 9.981 QT
-0.321 9.778 -0.039 9.778 QT
0.133 9.778 0.304 9.872 QT
0.476 9.966 0.57 10.137 QT
0.664 10.309 0.664 10.481 QT
0.664 10.762 0.453 10.981 QT
0.242 11.2 -0.039 11.2 QT
-0.321 11.2 -0.539 10.981 QT
-0.758 10.762 -0.758 10.481 QT
cp
f
GR
GS
[0.75 0 0 0.75 288.45 651.74998] CT
0.149 GC
N
3.055 11.2 M
3.055 10.747 L
4.68 10.747 4.68 10.325 QT
4.68 3.512 L
4.008 3.825 2.977 3.825 QT
2.977 3.372 L
4.571 3.372 5.383 2.544 QT
5.571 2.544 L
5.617 2.544 5.657 2.575 QT
5.696 2.606 5.696 2.653 QT
5.696 10.325 L
5.696 10.747 7.321 10.747 QT
7.321 11.2 L
3.055 11.2 L
cp
f
GR
GS
[0.75 0 0 0.75 396.15001 651.74998] CT
0.149 GC
N
/f42842187{-5.269 11.481 M
-6.862 11.481 -7.433 10.169 QT
-8.003 8.856 -8.003 7.059 QT
-8.003 5.919 -7.8 4.927 QT
-7.597 3.934 -6.987 3.239 QT
-6.378 2.544 -5.269 2.544 QT
-4.409 2.544 -3.862 2.958 QT
-3.315 3.372 -3.034 4.036 QT
-2.753 4.7 -2.644 5.458 QT
-2.534 6.216 -2.534 7.059 QT
-2.534 8.169 -2.745 9.145 QT
-2.956 10.122 -3.558 10.802 QT
-4.159 11.481 -5.269 11.481 QT
cp
-5.269 11.153 M
-4.55 11.153 -4.19 10.411 QT
-3.831 9.669 -3.753 8.762 QT
-3.675 7.856 -3.675 6.841 QT
-3.675 5.872 -3.753 5.044 QT
-3.831 4.216 -4.183 3.544 QT
-4.534 2.872 -5.269 2.872 QT
-6.003 2.872 -6.362 3.552 QT
-6.722 4.231 -6.8 5.052 QT
-6.878 5.872 -6.878 6.841 QT
-6.878 7.575 -6.847 8.216 QT
-6.815 8.856 -6.659 9.536 QT
-6.503 10.216 -6.167 10.684 QT
-5.831 11.153 -5.269 11.153 QT
cp}def
f42842187
f
GR
GS
[0.75 0 0 0.75 396.15001 651.74998] CT
0.149 GC
N
/f-1562952851{-0.758 10.481 M
-0.758 10.184 -0.539 9.981 QT
-0.321 9.778 -0.039 9.778 QT
0.133 9.778 0.304 9.872 QT
0.476 9.966 0.57 10.137 QT
0.664 10.309 0.664 10.481 QT
0.664 10.762 0.453 10.981 QT
0.242 11.2 -0.039 11.2 QT
-0.321 11.2 -0.539 10.981 QT
-0.758 10.762 -0.758 10.481 QT
cp}def
f-1562952851
f
GR
GS
[0.75 0 0 0.75 396.15001 651.74998] CT
0.149 GC
N
/f-1025728929{2.492 11.2 M
2.492 10.856 L
2.492 10.825 2.524 10.778 QT
4.539 8.544 L
5.008 8.044 5.289 7.708 QT
5.571 7.372 5.852 6.934 QT
6.133 6.497 6.297 6.044 QT
6.461 5.591 6.461 5.091 QT
6.461 4.559 6.258 4.067 QT
6.055 3.575 5.664 3.286 QT
5.274 2.997 4.727 2.997 QT
4.164 2.997 3.711 3.341 QT
3.258 3.684 3.071 4.216 QT
3.133 4.2 3.211 4.2 QT
3.508 4.2 3.711 4.395 QT
3.914 4.591 3.914 4.903 QT
3.914 5.2 3.711 5.411 QT
3.508 5.622 3.211 5.622 QT
2.914 5.622 2.703 5.411 QT
2.492 5.2 2.492 4.903 QT
2.492 4.419 2.68 3.989 QT
2.867 3.559 3.211 3.231 QT
3.555 2.903 3.992 2.723 QT
4.43 2.544 4.914 2.544 QT
5.664 2.544 6.305 2.856 QT
6.946 3.169 7.321 3.747 QT
7.696 4.325 7.696 5.091 QT
7.696 5.653 7.446 6.161 QT
7.196 6.669 6.813 7.083 QT
6.43 7.497 5.821 8.028 QT
5.211 8.559 5.024 8.731 QT
3.555 10.153 L
4.805 10.153 L
5.727 10.153 6.344 10.137 QT
6.961 10.122 6.992 10.075 QT
7.149 9.919 7.305 8.887 QT
7.696 8.887 L
7.321 11.2 L
2.492 11.2 L
cp}def
f-1025728929
f
GR
GS
[0.75 0 0 0.75 503.84999 651.74998] CT
0.149 GC
N
f42842187
f
GR
GS
[0.75 0 0 0.75 503.84999 651.74998] CT
0.149 GC
N
f-1562952851
f
GR
GS
[0.75 0 0 0.75 503.84999 651.74998] CT
0.149 GC
N
/f114940892{3.086 10.2 M
3.399 10.637 3.914 10.856 QT
4.43 11.075 5.008 11.075 QT
5.774 11.075 6.086 10.427 QT
6.399 9.778 6.399 8.966 QT
6.399 8.591 6.336 8.223 QT
6.274 7.856 6.11 7.544 QT
5.946 7.231 5.672 7.036 QT
5.399 6.841 5.008 6.841 QT
4.133 6.841 L
4.024 6.841 4.024 6.731 QT
4.024 6.606 L
4.024 6.512 4.133 6.512 QT
4.852 6.45 L
5.305 6.45 5.61 6.106 QT
5.914 5.762 6.055 5.27 QT
6.196 4.778 6.196 4.341 QT
6.196 3.716 5.907 3.317 QT
5.617 2.919 5.008 2.919 QT
4.524 2.919 4.071 3.106 QT
3.617 3.294 3.352 3.669 QT
3.383 3.669 3.399 3.661 QT
3.414 3.653 3.446 3.653 QT
3.727 3.653 3.922 3.856 QT
4.117 4.059 4.117 4.356 QT
4.117 4.637 3.922 4.841 QT
3.727 5.044 3.446 5.044 QT
3.149 5.044 2.946 4.841 QT
2.742 4.637 2.742 4.356 QT
2.742 3.794 3.078 3.38 QT
3.414 2.966 3.946 2.755 QT
4.477 2.544 5.008 2.544 QT
5.414 2.544 5.852 2.661 QT
6.289 2.778 6.641 2.997 QT
6.992 3.216 7.219 3.559 QT
7.446 3.903 7.446 4.341 QT
7.446 4.887 7.203 5.348 QT
6.961 5.809 6.532 6.145 QT
6.102 6.481 5.602 6.653 QT
6.164 6.762 6.672 7.075 QT
7.18 7.387 7.485 7.887 QT
7.789 8.387 7.789 8.95 QT
7.789 9.669 7.399 10.247 QT
7.008 10.825 6.367 11.153 QT
5.727 11.481 5.008 11.481 QT
4.399 11.481 3.789 11.255 QT
3.18 11.028 2.789 10.559 QT
2.399 10.091 2.399 9.45 QT
2.399 9.122 2.617 8.911 QT
2.836 8.7 3.149 8.7 QT
3.367 8.7 3.539 8.794 QT
3.711 8.887 3.813 9.067 QT
3.914 9.247 3.914 9.45 QT
3.914 9.762 3.688 9.981 QT
3.461 10.2 3.149 10.2 QT
3.086 10.2 L
cp}def
f114940892
f
GR
GS
[0.75 0 0 0.75 611.55002 651.74998] CT
0.149 GC
N
f42842187
f
GR
GS
[0.75 0 0 0.75 611.55002 651.74998] CT
0.149 GC
N
f-1562952851
f
GR
GS
[0.75 0 0 0.75 611.55002 651.74998] CT
0.149 GC
N
/f-789665990{2.211 9.059 M
2.211 8.591 L
6.227 2.606 L
6.274 2.544 6.367 2.544 QT
6.555 2.544 L
6.696 2.544 6.696 2.684 QT
6.696 8.591 L
7.977 8.591 L
7.977 9.059 L
6.696 9.059 L
6.696 10.325 L
6.696 10.591 7.078 10.669 QT
7.461 10.747 7.961 10.747 QT
7.961 11.2 L
4.383 11.2 L
4.383 10.747 L
4.883 10.747 5.266 10.669 QT
5.649 10.591 5.649 10.325 QT
5.649 9.059 L
2.211 9.059 L
cp
2.649 8.591 M
5.727 8.591 L
5.727 3.997 L
2.649 8.591 L
cp}def
f-789665990
f
GR
GS
[0.75 0 0 0.75 719.25 651.74998] CT
0.149 GC
N
f42842187
f
GR
GS
[0.75 0 0 0.75 719.25 651.74998] CT
0.149 GC
N
f-1562952851
f
GR
GS
[0.75 0 0 0.75 719.25 651.74998] CT
0.149 GC
N
/f-266042818{2.977 9.716 M
3.117 10.106 3.391 10.419 QT
3.664 10.731 4.047 10.903 QT
4.43 11.075 4.836 11.075 QT
5.774 11.075 6.125 10.341 QT
6.477 9.606 6.477 8.575 QT
6.477 8.122 6.461 7.817 QT
6.446 7.512 6.383 7.216 QT
6.258 6.762 5.953 6.419 QT
5.649 6.075 5.211 6.075 QT
4.774 6.075 4.461 6.208 QT
4.149 6.341 3.953 6.52 QT
3.758 6.7 3.602 6.895 QT
3.446 7.091 3.414 7.106 QT
3.274 7.106 L
3.242 7.106 3.188 7.067 QT
3.133 7.028 3.133 6.981 QT
3.133 2.637 L
3.133 2.606 3.18 2.575 QT
3.227 2.544 3.274 2.544 QT
3.305 2.544 L
4.18 2.966 5.164 2.966 QT
6.133 2.966 7.024 2.544 QT
7.071 2.544 L
7.102 2.544 7.141 2.575 QT
7.18 2.606 7.18 2.637 QT
7.18 2.762 L
7.18 2.825 7.164 2.825 QT
6.711 3.419 6.039 3.747 QT
5.367 4.075 4.664 4.075 QT
4.133 4.075 3.586 3.934 QT
3.586 6.387 L
4.024 6.044 4.36 5.895 QT
4.696 5.747 5.227 5.747 QT
5.946 5.747 6.516 6.153 QT
7.086 6.559 7.391 7.223 QT
7.696 7.887 7.696 8.591 QT
7.696 9.372 7.313 10.036 QT
6.93 10.7 6.266 11.091 QT
5.602 11.481 4.836 11.481 QT
4.196 11.481 3.657 11.153 QT
3.117 10.825 2.805 10.27 QT
2.492 9.716 2.492 9.075 QT
2.492 8.794 2.688 8.606 QT
2.883 8.419 3.164 8.419 QT
3.446 8.419 3.641 8.606 QT
3.836 8.794 3.836 9.075 QT
3.836 9.356 3.641 9.552 QT
3.446 9.747 3.164 9.747 QT
3.117 9.747 3.063 9.739 QT
3.008 9.731 2.977 9.716 QT
cp}def
f-266042818
f
GR
GS
[0.75 0 0 0.75 826.94998 651.74998] CT
0.149 GC
N
f42842187
f
GR
GS
[0.75 0 0 0.75 826.94998 651.74998] CT
0.149 GC
N
f-1562952851
f
GR
GS
[0.75 0 0 0.75 826.94998 651.74998] CT
0.149 GC
N
/f-1079660156{5.102 11.481 M
4.289 11.481 3.75 11.052 QT
3.211 10.622 2.922 9.942 QT
2.633 9.262 2.516 8.512 QT
2.399 7.762 2.399 6.997 QT
2.399 5.966 2.797 4.934 QT
3.196 3.903 3.977 3.223 QT
4.758 2.544 5.821 2.544 QT
6.258 2.544 6.649 2.708 QT
7.039 2.872 7.258 3.2 QT
7.477 3.528 7.477 3.997 QT
7.477 4.262 7.289 4.442 QT
7.102 4.622 6.836 4.622 QT
6.586 4.622 6.407 4.442 QT
6.227 4.262 6.227 3.997 QT
6.227 3.747 6.407 3.559 QT
6.586 3.372 6.836 3.372 QT
6.914 3.372 L
6.742 3.137 6.446 3.028 QT
6.149 2.919 5.821 2.919 QT
5.43 2.919 5.094 3.091 QT
4.758 3.262 4.492 3.552 QT
4.227 3.841 4.047 4.192 QT
3.867 4.544 3.774 4.997 QT
3.68 5.45 3.649 5.841 QT
3.617 6.231 3.617 6.825 QT
3.852 6.294 4.274 5.958 QT
4.696 5.622 5.211 5.622 QT
5.789 5.622 6.266 5.856 QT
6.742 6.091 7.086 6.505 QT
7.43 6.919 7.61 7.45 QT
7.789 7.981 7.789 8.528 QT
7.789 9.294 7.453 9.981 QT
7.117 10.669 6.5 11.075 QT
5.883 11.481 5.102 11.481 QT
cp
5.102 11.075 M
5.602 11.075 5.907 10.848 QT
6.211 10.622 6.352 10.239 QT
6.492 9.856 6.532 9.473 QT
6.571 9.091 6.571 8.528 QT
6.571 7.794 6.5 7.278 QT
6.43 6.762 6.117 6.364 QT
5.805 5.966 5.164 5.966 QT
4.633 5.966 4.297 6.317 QT
3.961 6.669 3.805 7.216 QT
3.649 7.762 3.649 8.262 QT
3.649 8.434 3.664 8.528 QT
3.664 8.544 3.657 8.552 QT
3.649 8.559 3.649 8.591 QT
3.649 9.137 3.766 9.708 QT
3.883 10.278 4.203 10.677 QT
4.524 11.075 5.102 11.075 QT
cp}def
f-1079660156
f
GR
GS
[0.75 0 0 0.75 934.64996 651.74998] CT
0.149 GC
N
f42842187
f
GR
GS
[0.75 0 0 0.75 934.64996 651.74998] CT
0.149 GC
N
f-1562952851
f
GR
GS
[0.75 0 0 0.75 934.64996 651.74998] CT
0.149 GC
N
/f1805490129{4.117 10.856 M
4.117 10.137 4.242 9.45 QT
4.367 8.762 4.61 8.083 QT
4.852 7.403 5.196 6.755 QT
5.539 6.106 5.961 5.528 QT
7.149 3.887 L
5.664 3.887 L
3.352 3.887 3.274 3.95 QT
3.102 4.153 2.961 5.137 QT
2.586 5.137 L
3.008 2.419 L
3.383 2.419 L
3.383 2.45 L
3.383 2.684 4.18 2.755 QT
4.977 2.825 5.742 2.825 QT
8.149 2.825 L
8.149 3.169 L
8.149 3.169 8.149 3.177 QT
8.149 3.184 8.149 3.2 QT
6.352 5.716 L
5.696 6.7 5.532 7.887 QT
5.367 9.075 5.367 10.856 QT
5.367 11.122 5.18 11.302 QT
4.992 11.481 4.742 11.481 QT
4.477 11.481 4.297 11.302 QT
4.117 11.122 4.117 10.856 QT
cp}def
f1805490129
f
GR
GS
[0.75 0 0 0.75 1042.35004 651.74998] CT
0.149 GC
N
f42842187
f
GR
GS
[0.75 0 0 0.75 1042.35004 651.74998] CT
0.149 GC
N
f-1562952851
f
GR
GS
[0.75 0 0 0.75 1042.35004 651.74998] CT
0.149 GC
N
/f-1131117543{2.399 9.231 M
2.399 8.45 2.914 7.848 QT
3.43 7.247 4.227 6.841 QT
3.742 6.528 L
3.305 6.247 3.024 5.762 QT
2.742 5.278 2.742 4.731 QT
2.742 4.122 3.071 3.614 QT
3.399 3.106 3.946 2.825 QT
4.492 2.544 5.102 2.544 QT
5.68 2.544 6.219 2.778 QT
6.758 3.012 7.102 3.45 QT
7.446 3.887 7.446 4.497 QT
7.446 4.934 7.242 5.309 QT
7.039 5.684 6.68 5.981 QT
6.321 6.278 5.914 6.481 QT
6.649 6.966 L
7.164 7.294 7.477 7.841 QT
7.789 8.387 7.789 8.997 QT
7.789 9.7 7.414 10.278 QT
7.039 10.856 6.414 11.169 QT
5.789 11.481 5.102 11.481 QT
4.43 11.481 3.805 11.208 QT
3.18 10.934 2.789 10.419 QT
2.399 9.903 2.399 9.231 QT
cp
3.102 9.231 M
3.102 9.747 3.383 10.169 QT
3.664 10.591 4.133 10.833 QT
4.602 11.075 5.102 11.075 QT
5.852 11.075 6.469 10.63 QT
7.086 10.184 7.086 9.466 QT
7.086 9.216 6.992 8.973 QT
6.899 8.731 6.719 8.528 QT
6.539 8.325 6.321 8.2 QT
4.586 7.075 L
4.18 7.278 3.836 7.614 QT
3.492 7.95 3.297 8.356 QT
3.102 8.762 3.102 9.231 QT
cp
3.992 5.262 M
5.571 6.278 L
6.117 5.95 6.469 5.505 QT
6.821 5.059 6.821 4.497 QT
6.821 4.059 6.571 3.692 QT
6.321 3.325 5.93 3.122 QT
5.539 2.919 5.086 2.919 QT
4.696 2.919 4.297 3.067 QT
3.899 3.216 3.641 3.52 QT
3.383 3.825 3.383 4.231 QT
3.383 4.841 3.992 5.262 QT
cp}def
f-1131117543
f
GR
GS
[0.75 0 0 0.75 1150.05002 651.74998] CT
0.149 GC
N
f42842187
f
GR
GS
[0.75 0 0 0.75 1150.05002 651.74998] CT
0.149 GC
N
f-1562952851
f
GR
GS
[0.75 0 0 0.75 1150.05002 651.74998] CT
0.149 GC
N
/f324282055{3.321 10.653 M
3.68 11.075 4.555 11.075 QT
5.055 11.075 5.485 10.739 QT
5.914 10.403 6.149 9.919 QT
6.414 9.356 6.492 8.731 QT
6.571 8.106 6.571 7.184 QT
6.352 7.716 5.93 8.052 QT
5.508 8.387 4.977 8.387 QT
4.227 8.387 3.633 7.973 QT
3.039 7.559 2.719 6.887 QT
2.399 6.216 2.399 5.466 QT
2.399 4.684 2.75 4.012 QT
3.102 3.341 3.735 2.942 QT
4.367 2.544 5.164 2.544 QT
5.946 2.544 6.477 2.973 QT
7.008 3.403 7.289 4.075 QT
7.571 4.747 7.68 5.505 QT
7.789 6.262 7.789 6.997 QT
7.789 7.997 7.422 9.044 QT
7.055 10.091 6.321 10.786 QT
5.586 11.481 4.555 11.481 QT
3.789 11.481 3.258 11.122 QT
2.727 10.762 2.727 10.028 QT
2.727 9.762 2.907 9.583 QT
3.086 9.403 3.352 9.403 QT
3.617 9.403 3.797 9.583 QT
3.977 9.762 3.977 10.028 QT
3.977 10.278 3.789 10.466 QT
3.602 10.653 3.352 10.653 QT
3.321 10.653 L
cp
5.024 8.044 M
5.555 8.044 5.899 7.684 QT
6.242 7.325 6.391 6.794 QT
6.539 6.262 6.539 5.731 QT
6.539 5.481 L
6.539 5.434 L
6.539 4.45 6.258 3.684 QT
5.977 2.919 5.164 2.919 QT
4.649 2.919 4.328 3.145 QT
4.008 3.372 3.86 3.747 QT
3.711 4.122 3.664 4.544 QT
3.617 4.966 3.617 5.466 QT
3.617 6.2 3.688 6.723 QT
3.758 7.247 4.071 7.645 QT
4.383 8.044 5.024 8.044 QT
cp}def
f324282055
f
GR
GS
[0.75 0 0 0.75 1257.75 651.74998] CT
0.149 GC
N
/f-1136517822{-2.13 11.2 M
-2.13 10.747 L
-0.505 10.747 -0.505 10.325 QT
-0.505 3.512 L
-1.177 3.825 -2.208 3.825 QT
-2.208 3.372 L
-0.615 3.372 0.198 2.544 QT
0.385 2.544 L
0.432 2.544 0.471 2.575 QT
0.51 2.606 0.51 2.653 QT
0.51 10.325 L
0.51 10.747 2.135 10.747 QT
2.135 11.2 L
-2.13 11.2 L
cp}def
f-1136517822
f
GR
GS
[0.75 0 0 0.75 719.2505 664.74997] CT
0.149 GC
N
/f155634886{-53.421 12.32 M
-53.421 11.789 L
-51.874 11.789 -51.874 11.32 QT
-51.874 3.07 L
-51.874 2.601 -53.421 2.601 QT
-53.421 2.07 L
-48.077 2.07 L
-47.264 2.07 -46.444 2.406 QT
-45.624 2.742 -45.092 3.39 QT
-44.561 4.039 -44.561 4.898 QT
-44.561 5.726 -45.092 6.359 QT
-45.624 6.992 -46.436 7.312 QT
-47.249 7.632 -48.077 7.632 QT
-50.483 7.632 L
-50.483 11.32 L
-50.483 11.789 -48.936 11.789 QT
-48.936 12.32 L
-53.421 12.32 L
cp
-50.53 7.195 M
-48.499 7.195 L
-47.671 7.195 -47.155 6.953 QT
-46.639 6.711 -46.405 6.211 QT
-46.171 5.711 -46.171 4.898 QT
-46.171 3.664 -46.702 3.132 QT
-47.233 2.601 -48.499 2.601 QT
-49.764 2.601 L
-50.046 2.601 -50.194 2.625 QT
-50.342 2.648 -50.436 2.75 QT
-50.53 2.851 -50.53 3.07 QT
-50.53 7.195 L
cp}def
f155634886
f
GR
GS
[0.75 0 0 0.75 719.2505 664.74997] CT
0.149 GC
N
/f1261371238{-43.47 12.32 M
-43.47 11.789 L
-42.97 11.789 -42.634 11.711 QT
-42.298 11.632 -42.298 11.32 QT
-42.298 3.445 L
-42.298 3.039 -42.423 2.859 QT
-42.548 2.679 -42.775 2.64 QT
-43.001 2.601 -43.47 2.601 QT
-43.47 2.07 L
-41.251 1.914 L
-41.251 11.32 L
-41.251 11.632 -40.923 11.711 QT
-40.595 11.789 -40.08 11.789 QT
-40.08 12.32 L
-43.47 12.32 L
cp}def
f1261371238
f
GR
GS
[0.75 0 0 0.75 719.2505 664.74997] CT
0.149 GC
N
/f-1709183727{-39.271 10.851 M
-39.271 9.961 -38.568 9.398 QT
-37.865 8.836 -36.873 8.601 QT
-35.881 8.367 -35.006 8.367 QT
-35.006 7.757 L
-35.006 7.32 -35.193 6.914 QT
-35.381 6.507 -35.74 6.25 QT
-36.099 5.992 -36.537 5.992 QT
-37.521 5.992 -38.052 6.445 QT
-37.756 6.445 -37.576 6.656 QT
-37.396 6.867 -37.396 7.164 QT
-37.396 7.461 -37.607 7.672 QT
-37.818 7.882 -38.099 7.882 QT
-38.412 7.882 -38.623 7.672 QT
-38.834 7.461 -38.834 7.164 QT
-38.834 6.367 -38.115 5.984 QT
-37.396 5.601 -36.537 5.601 QT
-35.927 5.601 -35.31 5.859 QT
-34.693 6.117 -34.302 6.601 QT
-33.912 7.086 -33.912 7.726 QT
-33.912 11.101 L
-33.912 11.398 -33.787 11.64 QT
-33.662 11.882 -33.396 11.882 QT
-33.146 11.882 -33.029 11.632 QT
-32.912 11.382 -32.912 11.101 QT
-32.912 10.148 L
-32.474 10.148 L
-32.474 11.101 L
-32.474 11.445 -32.646 11.75 QT
-32.818 12.054 -33.115 12.234 QT
-33.412 12.414 -33.756 12.414 QT
-34.193 12.414 -34.513 12.07 QT
-34.834 11.726 -34.865 11.257 QT
-35.146 11.82 -35.685 12.156 QT
-36.224 12.492 -36.849 12.492 QT
-37.412 12.492 -37.966 12.32 QT
-38.521 12.148 -38.896 11.789 QT
-39.271 11.429 -39.271 10.851 QT
cp
-38.052 10.851 M
-38.052 11.382 -37.662 11.734 QT
-37.271 12.086 -36.74 12.086 QT
-36.256 12.086 -35.865 11.851 QT
-35.474 11.617 -35.24 11.195 QT
-35.006 10.773 -35.006 10.32 QT
-35.006 8.757 L
-35.677 8.757 -36.396 8.976 QT
-37.115 9.195 -37.584 9.672 QT
-38.052 10.148 -38.052 10.851 QT
cp}def
f-1709183727
f
GR
GS
[0.75 0 0 0.75 719.2505 664.74997] CT
0.149 GC
N
/f1986819592{-32.078 12.32 M
-32.078 11.789 L
-31.578 11.789 -31.242 11.711 QT
-30.907 11.632 -30.907 11.32 QT
-30.907 7.226 L
-30.907 6.82 -31.032 6.64 QT
-31.157 6.461 -31.383 6.422 QT
-31.61 6.382 -32.078 6.382 QT
-32.078 5.851 L
-29.907 5.695 L
-29.907 7.164 L
-29.61 6.507 -29.016 6.101 QT
-28.422 5.695 -27.735 5.695 QT
-26.688 5.695 -26.164 6.195 QT
-25.641 6.695 -25.641 7.711 QT
-25.641 11.32 L
-25.641 11.632 -25.313 11.711 QT
-24.985 11.789 -24.469 11.789 QT
-24.469 12.32 L
-27.907 12.32 L
-27.907 11.789 L
-27.391 11.789 -27.063 11.711 QT
-26.735 11.632 -26.735 11.32 QT
-26.735 7.757 L
-26.735 7.023 -26.946 6.554 QT
-27.157 6.086 -27.828 6.086 QT
-28.688 6.086 -29.25 6.781 QT
-29.813 7.476 -29.813 8.351 QT
-29.813 11.32 L
-29.813 11.632 -29.485 11.711 QT
-29.157 11.789 -28.657 11.789 QT
-28.657 12.32 L
-32.078 12.32 L
cp}def
f1986819592
f
GR
GS
[0.75 0 0 0.75 719.2505 664.74997] CT
0.149 GC
N
/f-846006003{-23.93 12.32 M
-23.93 11.789 L
-23.43 11.789 -23.094 11.711 QT
-22.758 11.632 -22.758 11.32 QT
-22.758 7.226 L
-22.758 6.82 -22.883 6.64 QT
-23.008 6.461 -23.235 6.422 QT
-23.462 6.382 -23.93 6.382 QT
-23.93 5.851 L
-21.758 5.695 L
-21.758 7.164 L
-21.462 6.507 -20.868 6.101 QT
-20.274 5.695 -19.587 5.695 QT
-18.54 5.695 -18.016 6.195 QT
-17.493 6.695 -17.493 7.711 QT
-17.493 11.32 L
-17.493 11.632 -17.165 11.711 QT
-16.837 11.789 -16.321 11.789 QT
-16.321 12.32 L
-19.758 12.32 L
-19.758 11.789 L
-19.243 11.789 -18.915 11.711 QT
-18.587 11.632 -18.587 11.32 QT
-18.587 7.757 L
-18.587 7.023 -18.797 6.554 QT
-19.008 6.086 -19.68 6.086 QT
-20.54 6.086 -21.102 6.781 QT
-21.665 7.476 -21.665 8.351 QT
-21.665 11.32 L
-21.665 11.632 -21.337 11.711 QT
-21.008 11.789 -20.508 11.789 QT
-20.508 12.32 L
-23.93 12.32 L
cp}def
f-846006003
f
GR
GS
[0.75 0 0 0.75 719.2505 664.74997] CT
0.149 GC
N
/f-2050123754{-15.766 12.32 M
-15.766 11.789 L
-15.266 11.789 -14.931 11.711 QT
-14.595 11.632 -14.595 11.32 QT
-14.595 7.226 L
-14.595 6.648 -14.821 6.515 QT
-15.048 6.382 -15.704 6.382 QT
-15.704 5.851 L
-13.548 5.695 L
-13.548 11.32 L
-13.548 11.632 -13.259 11.711 QT
-12.97 11.789 -12.501 11.789 QT
-12.501 12.32 L
-15.766 12.32 L
cp
-15.141 3.117 M
-15.141 2.789 -14.891 2.539 QT
-14.641 2.289 -14.313 2.289 QT
-14.11 2.289 -13.907 2.398 QT
-13.704 2.507 -13.595 2.703 QT
-13.485 2.898 -13.485 3.117 QT
-13.485 3.429 -13.735 3.679 QT
-13.985 3.929 -14.313 3.929 QT
-14.641 3.929 -14.891 3.679 QT
-15.141 3.429 -15.141 3.117 QT
cp}def
f-2050123754
f
GR
GS
[0.75 0 0 0.75 719.2505 664.74997] CT
0.149 GC
N
/f-950638345{-11.708 12.32 M
-11.708 11.789 L
-11.208 11.789 -10.872 11.711 QT
-10.536 11.632 -10.536 11.32 QT
-10.536 7.226 L
-10.536 6.82 -10.661 6.64 QT
-10.786 6.461 -11.013 6.422 QT
-11.239 6.382 -11.708 6.382 QT
-11.708 5.851 L
-9.536 5.695 L
-9.536 7.164 L
-9.239 6.507 -8.645 6.101 QT
-8.052 5.695 -7.364 5.695 QT
-6.317 5.695 -5.794 6.195 QT
-5.27 6.695 -5.27 7.711 QT
-5.27 11.32 L
-5.27 11.632 -4.942 11.711 QT
-4.614 11.789 -4.099 11.789 QT
-4.099 12.32 L
-7.536 12.32 L
-7.536 11.789 L
-7.02 11.789 -6.692 11.711 QT
-6.364 11.632 -6.364 11.32 QT
-6.364 7.757 L
-6.364 7.023 -6.575 6.554 QT
-6.786 6.086 -7.458 6.086 QT
-8.317 6.086 -8.88 6.781 QT
-9.442 7.476 -9.442 8.351 QT
-9.442 11.32 L
-9.442 11.632 -9.114 11.711 QT
-8.786 11.789 -8.286 11.789 QT
-8.286 12.32 L
-11.708 12.32 L
cp}def
f-950638345
f
GR
GS
[0.75 0 0 0.75 719.2505 664.74997] CT
0.149 GC
N
/f-1242814656{-3.591 13.492 M
-3.591 12.961 -3.208 12.562 QT
-2.825 12.164 -2.279 11.992 QT
-2.591 11.757 -2.747 11.414 QT
-2.904 11.07 -2.904 10.679 QT
-2.904 9.976 -2.45 9.445 QT
-3.138 8.773 -3.138 7.898 QT
-3.138 7.429 -2.935 7.015 QT
-2.732 6.601 -2.372 6.304 QT
-2.013 6.007 -1.575 5.851 QT
-1.138 5.695 -0.685 5.695 QT
0.206 5.695 0.925 6.211 QT
1.237 5.882 1.659 5.703 QT
2.081 5.523 2.534 5.523 QT
2.846 5.523 3.05 5.757 QT
3.253 5.992 3.253 6.304 QT
3.253 6.492 3.12 6.632 QT
2.987 6.773 2.8 6.773 QT
2.612 6.773 2.471 6.632 QT
2.331 6.492 2.331 6.304 QT
2.331 6.023 2.518 5.914 QT
1.737 5.914 1.175 6.461 QT
1.456 6.726 1.62 7.117 QT
1.784 7.507 1.784 7.898 QT
1.784 8.539 1.432 9.047 QT
1.081 9.554 0.503 9.836 QT
-0.075 10.117 -0.685 10.117 QT
-1.497 10.117 -2.185 9.664 QT
-2.388 9.961 -2.388 10.32 QT
-2.388 10.726 -2.13 11.023 QT
-1.872 11.32 -1.482 11.32 QT
-0.247 11.32 L
0.643 11.32 1.362 11.476 QT
2.081 11.632 2.565 12.117 QT
3.05 12.601 3.05 13.492 QT
3.05 14.148 2.495 14.586 QT
1.94 15.023 1.167 15.218 QT
0.393 15.414 -0.263 15.414 QT
-0.935 15.414 -1.708 15.218 QT
-2.482 15.023 -3.036 14.586 QT
-3.591 14.148 -3.591 13.492 QT
cp
-2.747 13.492 M
-2.747 13.992 -2.341 14.336 QT
-1.935 14.679 -1.357 14.843 QT
-0.779 15.007 -0.263 15.007 QT
0.237 15.007 0.815 14.843 QT
1.393 14.679 1.8 14.336 QT
2.206 13.992 2.206 13.492 QT
2.206 12.711 1.495 12.476 QT
0.784 12.242 -0.247 12.242 QT
-1.482 12.242 L
-1.825 12.242 -2.115 12.406 QT
-2.404 12.57 -2.575 12.867 QT
-2.747 13.164 -2.747 13.492 QT
cp
-0.685 9.711 M
0.596 9.711 0.596 7.898 QT
0.596 7.117 0.323 6.609 QT
0.05 6.101 -0.685 6.101 QT
-1.419 6.101 -1.685 6.609 QT
-1.95 7.117 -1.95 7.898 QT
-1.95 8.398 -1.849 8.797 QT
-1.747 9.195 -1.474 9.453 QT
-1.2 9.711 -0.685 9.711 QT
cp}def
f-1242814656
f
GR
GS
[0.75 0 0 0.75 719.2505 664.74997] CT
0.149 GC
N
/f-1103503373{9.741 10.523 M
9.741 6.382 L
8.491 6.382 L
8.491 5.992 L
9.475 5.992 9.936 5.078 QT
10.397 4.164 10.397 3.086 QT
10.834 3.086 L
10.834 5.851 L
12.944 5.851 L
12.944 6.382 L
10.834 6.382 L
10.834 10.492 L
10.834 11.117 11.045 11.586 QT
11.256 12.054 11.787 12.054 QT
12.303 12.054 12.53 11.554 QT
12.756 11.054 12.756 10.492 QT
12.756 9.601 L
13.194 9.601 L
13.194 10.523 L
13.194 10.992 13.022 11.445 QT
12.85 11.898 12.514 12.195 QT
12.178 12.492 11.694 12.492 QT
10.787 12.492 10.264 11.953 QT
9.741 11.414 9.741 10.523 QT
cp}def
f-1103503373
f
GR
GS
[0.75 0 0 0.75 719.2505 664.74997] CT
0.149 GC
N
/f-1897526652{14.382 12.32 M
14.382 11.789 L
14.882 11.789 15.218 11.711 QT
15.554 11.632 15.554 11.32 QT
15.554 7.226 L
15.554 6.648 15.327 6.515 QT
15.101 6.382 14.444 6.382 QT
14.444 5.851 L
16.601 5.695 L
16.601 11.32 L
16.601 11.632 16.89 11.711 QT
17.179 11.789 17.647 11.789 QT
17.647 12.32 L
14.382 12.32 L
cp
15.007 3.117 M
15.007 2.789 15.257 2.539 QT
15.507 2.289 15.835 2.289 QT
16.038 2.289 16.241 2.398 QT
16.444 2.507 16.554 2.703 QT
16.663 2.898 16.663 3.117 QT
16.663 3.429 16.413 3.679 QT
16.163 3.929 15.835 3.929 QT
15.507 3.929 15.257 3.679 QT
15.007 3.429 15.007 3.117 QT
cp}def
f-1897526652
f
GR
GS
[0.75 0 0 0.75 719.2505 664.74997] CT
0.149 GC
N
/f-1128640668{18.44 12.32 M
18.44 11.789 L
18.94 11.789 19.276 11.711 QT
19.612 11.632 19.612 11.32 QT
19.612 7.226 L
19.612 6.82 19.487 6.64 QT
19.362 6.461 19.136 6.422 QT
18.909 6.382 18.44 6.382 QT
18.44 5.851 L
20.612 5.695 L
20.612 7.164 L
20.909 6.507 21.503 6.101 QT
22.096 5.695 22.784 5.695 QT
24.518 5.695 24.815 7.101 QT
25.112 6.461 25.69 6.078 QT
26.268 5.695 26.956 5.695 QT
27.643 5.695 28.104 5.914 QT
28.565 6.132 28.8 6.586 QT
29.034 7.039 29.034 7.711 QT
29.034 11.32 L
29.034 11.632 29.37 11.711 QT
29.706 11.789 30.206 11.789 QT
30.206 12.32 L
26.784 12.32 L
26.784 11.789 L
27.284 11.789 27.62 11.711 QT
27.956 11.632 27.956 11.32 QT
27.956 7.757 L
27.956 7.007 27.737 6.547 QT
27.518 6.086 26.862 6.086 QT
26.003 6.086 25.44 6.781 QT
24.878 7.476 24.878 8.351 QT
24.878 11.32 L
24.878 11.632 25.206 11.711 QT
25.534 11.789 26.05 11.789 QT
26.05 12.32 L
22.612 12.32 L
22.612 11.789 L
23.128 11.789 23.456 11.711 QT
23.784 11.632 23.784 11.32 QT
23.784 7.757 L
23.784 7.023 23.573 6.554 QT
23.362 6.086 22.69 6.086 QT
21.831 6.086 21.268 6.781 QT
20.706 7.476 20.706 8.351 QT
20.706 11.32 L
20.706 11.632 21.034 11.711 QT
21.362 11.789 21.862 11.789 QT
21.862 12.32 L
18.44 12.32 L
cp}def
f-1128640668
f
GR
GS
[0.75 0 0 0.75 719.2505 664.74997] CT
0.149 GC
N
/f-722817047{33.944 12.492 M
33.022 12.492 32.264 12.007 QT
31.506 11.523 31.069 10.726 QT
30.631 9.929 30.631 9.039 QT
30.631 8.148 31.03 7.359 QT
31.428 6.57 32.139 6.086 QT
32.85 5.601 33.725 5.601 QT
34.428 5.601 34.936 5.828 QT
35.444 6.054 35.772 6.468 QT
36.1 6.882 36.264 7.437 QT
36.428 7.992 36.428 8.664 QT
36.428 8.851 36.287 8.851 QT
31.944 8.851 L
31.944 9.023 L
31.944 10.257 32.444 11.156 QT
32.944 12.054 34.084 12.054 QT
34.537 12.054 34.928 11.843 QT
35.319 11.632 35.608 11.273 QT
35.897 10.914 36.006 10.492 QT
36.022 10.445 36.061 10.398 QT
36.1 10.351 36.147 10.351 QT
36.287 10.351 L
36.428 10.351 36.428 10.554 QT
36.225 11.398 35.522 11.945 QT
34.819 12.492 33.944 12.492 QT
cp
31.959 8.476 M
35.366 8.476 L
35.366 7.914 35.209 7.336 QT
35.053 6.757 34.686 6.375 QT
34.319 5.992 33.725 5.992 QT
32.881 5.992 32.42 6.789 QT
31.959 7.586 31.959 8.476 QT
cp}def
f-722817047
f
GR
GS
[0.75 0 0 0.75 719.2505 664.74997] CT
0.149 GC
N
/f296502512{41.384 16.039 M
40.54 15.382 39.939 14.531 QT
39.337 13.679 38.954 12.711 QT
38.572 11.742 38.376 10.687 QT
38.181 9.632 38.181 8.57 QT
38.181 7.492 38.376 6.437 QT
38.572 5.382 38.962 4.406 QT
39.353 3.429 39.962 2.586 QT
40.572 1.742 41.384 1.101 QT
41.384 1.07 41.447 1.07 QT
41.587 1.07 L
41.634 1.07 41.673 1.109 QT
41.712 1.148 41.712 1.195 QT
41.712 1.273 41.681 1.304 QT
40.947 2.007 40.462 2.828 QT
39.978 3.648 39.681 4.578 QT
39.384 5.507 39.251 6.5 QT
39.118 7.492 39.118 8.57 QT
39.118 13.336 41.665 15.82 QT
41.712 15.851 41.712 15.945 QT
41.712 15.976 41.673 16.023 QT
41.634 16.07 41.587 16.07 QT
41.447 16.07 L
41.384 16.07 41.384 16.039 QT
cp}def
f296502512
f
GR
GS
[0.75 0 0 0.75 719.2505 664.74997] CT
0.149 GC
N
/f-984119629{42.932 12.367 M
42.932 9.914 L
42.932 9.804 43.057 9.804 QT
43.244 9.804 L
43.338 9.804 43.369 9.914 QT
43.775 12.086 45.385 12.086 QT
46.088 12.086 46.572 11.765 QT
47.057 11.445 47.057 10.773 QT
47.057 10.289 46.682 9.953 QT
46.307 9.617 45.791 9.492 QT
44.791 9.289 L
44.291 9.179 43.877 8.953 QT
43.463 8.726 43.197 8.351 QT
42.932 7.976 42.932 7.476 QT
42.932 6.804 43.275 6.39 QT
43.619 5.976 44.182 5.789 QT
44.744 5.601 45.385 5.601 QT
46.15 5.601 46.728 6.007 QT
47.15 5.632 L
47.15 5.601 47.228 5.601 QT
47.338 5.601 L
47.385 5.601 47.424 5.64 QT
47.463 5.679 47.463 5.726 QT
47.463 7.679 L
47.463 7.82 47.338 7.82 QT
47.15 7.82 L
47.025 7.82 47.025 7.679 QT
47.025 6.898 46.588 6.422 QT
46.15 5.945 45.369 5.945 QT
44.697 5.945 44.205 6.195 QT
43.713 6.445 43.713 7.054 QT
43.713 7.476 44.064 7.742 QT
44.416 8.007 44.9 8.117 QT
45.916 8.32 L
46.416 8.429 46.861 8.711 QT
47.307 8.992 47.564 9.414 QT
47.822 9.836 47.822 10.367 QT
47.822 10.914 47.643 11.312 QT
47.463 11.711 47.127 11.976 QT
46.791 12.242 46.338 12.367 QT
45.885 12.492 45.385 12.492 QT
44.447 12.492 43.775 11.851 QT
43.228 12.445 L
43.228 12.492 43.15 12.492 QT
43.057 12.492 L
42.932 12.492 42.932 12.367 QT
cp}def
f-984119629
f
GR
GS
[0.75 0 0 0.75 719.2505 664.74997] CT
0.149 GC
N
/f1531609816{49.186 16.07 M
49.061 16.07 49.061 15.945 QT
49.061 15.867 49.092 15.836 QT
51.654 13.336 51.654 8.57 QT
51.654 3.804 49.123 1.32 QT
49.061 1.289 49.061 1.195 QT
49.061 1.148 49.1 1.109 QT
49.139 1.07 49.186 1.07 QT
49.326 1.07 L
49.373 1.07 49.404 1.101 QT
50.482 1.945 51.201 3.164 QT
51.92 4.382 52.248 5.757 QT
52.576 7.132 52.576 8.57 QT
52.576 9.632 52.396 10.664 QT
52.217 11.695 51.826 12.695 QT
51.436 13.695 50.834 14.539 QT
50.232 15.382 49.404 16.039 QT
49.373 16.07 49.326 16.07 QT
49.186 16.07 L
cp}def
f1531609816
f
GR
GS
[0.75 0 0 0.75 0 0.5] CT
0.149 GC
2 setlinecap
1 LJ
0.667 LW
N
241 863 M
241 73 L
S
GR
GS
[0.75 0 0 0.75 0 0.5] CT
0.149 GC
2 setlinecap
1 LJ
0.667 LW
N
241 863 M
255.36 863 L
S
GR
GS
[0.75 0 0 0.75 0 0.5] CT
0.149 GC
2 setlinecap
1 LJ
0.667 LW
N
241 731.333 M
255.36 731.333 L
S
GR
GS
[0.75 0 0 0.75 0 0.5] CT
0.149 GC
2 setlinecap
1 LJ
0.667 LW
N
241 599.667 M
255.36 599.667 L
S
GR
GS
[0.75 0 0 0.75 0 0.5] CT
0.149 GC
2 setlinecap
1 LJ
0.667 LW
N
241 468 M
255.36 468 L
S
GR
GS
[0.75 0 0 0.75 0 0.5] CT
0.149 GC
2 setlinecap
1 LJ
0.667 LW
N
241 336.333 M
255.36 336.333 L
S
GR
GS
[0.75 0 0 0.75 0 0.5] CT
0.149 GC
2 setlinecap
1 LJ
0.667 LW
N
241 204.667 M
255.36 204.667 L
S
GR
GS
[0.75 0 0 0.75 0 0.5] CT
0.149 GC
2 setlinecap
1 LJ
0.667 LW
N
241 73 M
255.36 73 L
S
GR
GS
[0.75 0 0 0.75 176.75 647.75] CT
0.149 GC
N
/f-1633144563{-6.307 1.059 M
-6.307 0.591 L
-2.292 -5.394 L
-2.245 -5.456 -2.151 -5.456 QT
-1.964 -5.456 L
-1.823 -5.456 -1.823 -5.316 QT
-1.823 0.591 L
-0.542 0.591 L
-0.542 1.059 L
-1.823 1.059 L
-1.823 2.325 L
-1.823 2.591 -1.44 2.669 QT
-1.057 2.747 -0.557 2.747 QT
-0.557 3.2 L
-4.135 3.2 L
-4.135 2.747 L
-3.635 2.747 -3.253 2.669 QT
-2.87 2.591 -2.87 2.325 QT
-2.87 1.059 L
-6.307 1.059 L
cp
-5.87 0.591 M
-2.792 0.591 L
-2.792 -4.003 L
-5.87 0.591 L
cp}def
f-1633144563
f
GR
GS
[0.75 0 0 0.75 176.75 548.99998] CT
0.149 GC
N
/f1892466823{-5.542 1.716 M
-5.401 2.106 -5.128 2.419 QT
-4.854 2.731 -4.471 2.903 QT
-4.089 3.075 -3.682 3.075 QT
-2.745 3.075 -2.393 2.341 QT
-2.042 1.606 -2.042 0.575 QT
-2.042 0.122 -2.057 -0.183 QT
-2.073 -0.488 -2.135 -0.784 QT
-2.26 -1.238 -2.565 -1.581 QT
-2.87 -1.925 -3.307 -1.925 QT
-3.745 -1.925 -4.057 -1.792 QT
-4.37 -1.659 -4.565 -1.48 QT
-4.76 -1.3 -4.917 -1.105 QT
-5.073 -0.909 -5.104 -0.894 QT
-5.245 -0.894 L
-5.276 -0.894 -5.331 -0.933 QT
-5.385 -0.972 -5.385 -1.019 QT
-5.385 -5.363 L
-5.385 -5.394 -5.339 -5.425 QT
-5.292 -5.456 -5.245 -5.456 QT
-5.214 -5.456 L
-4.339 -5.034 -3.354 -5.034 QT
-2.385 -5.034 -1.495 -5.456 QT
-1.448 -5.456 L
-1.417 -5.456 -1.378 -5.425 QT
-1.339 -5.394 -1.339 -5.363 QT
-1.339 -5.238 L
-1.339 -5.175 -1.354 -5.175 QT
-1.807 -4.581 -2.479 -4.253 QT
-3.151 -3.925 -3.854 -3.925 QT
-4.385 -3.925 -4.932 -4.066 QT
-4.932 -1.613 L
-4.495 -1.956 -4.159 -2.105 QT
-3.823 -2.253 -3.292 -2.253 QT
-2.573 -2.253 -2.003 -1.847 QT
-1.432 -1.441 -1.128 -0.777 QT
-0.823 -0.113 -0.823 0.591 QT
-0.823 1.372 -1.206 2.036 QT
-1.589 2.7 -2.253 3.091 QT
-2.917 3.481 -3.682 3.481 QT
-4.323 3.481 -4.862 3.153 QT
-5.401 2.825 -5.714 2.27 QT
-6.026 1.716 -6.026 1.075 QT
-6.026 0.794 -5.831 0.606 QT
-5.635 0.419 -5.354 0.419 QT
-5.073 0.419 -4.878 0.606 QT
-4.682 0.794 -4.682 1.075 QT
-4.682 1.356 -4.878 1.552 QT
-5.073 1.747 -5.354 1.747 QT
-5.401 1.747 -5.456 1.739 QT
-5.51 1.731 -5.542 1.716 QT
cp}def
f1892466823
f
GR
GS
[0.75 0 0 0.75 176.75 450.25002] CT
0.149 GC
N
/f-2003826503{-3.417 3.481 M
-4.229 3.481 -4.768 3.052 QT
-5.307 2.622 -5.596 1.942 QT
-5.885 1.262 -6.003 0.512 QT
-6.12 -0.238 -6.12 -1.003 QT
-6.12 -2.034 -5.721 -3.066 QT
-5.323 -4.097 -4.542 -4.777 QT
-3.76 -5.456 -2.698 -5.456 QT
-2.26 -5.456 -1.87 -5.292 QT
-1.479 -5.128 -1.26 -4.8 QT
-1.042 -4.472 -1.042 -4.003 QT
-1.042 -3.738 -1.229 -3.558 QT
-1.417 -3.378 -1.682 -3.378 QT
-1.932 -3.378 -2.112 -3.558 QT
-2.292 -3.738 -2.292 -4.003 QT
-2.292 -4.253 -2.112 -4.441 QT
-1.932 -4.628 -1.682 -4.628 QT
-1.604 -4.628 L
-1.776 -4.863 -2.073 -4.972 QT
-2.37 -5.081 -2.698 -5.081 QT
-3.089 -5.081 -3.424 -4.909 QT
-3.76 -4.738 -4.026 -4.448 QT
-4.292 -4.159 -4.471 -3.808 QT
-4.651 -3.456 -4.745 -3.003 QT
-4.839 -2.55 -4.87 -2.159 QT
-4.901 -1.769 -4.901 -1.175 QT
-4.667 -1.706 -4.245 -2.042 QT
-3.823 -2.378 -3.307 -2.378 QT
-2.729 -2.378 -2.253 -2.144 QT
-1.776 -1.909 -1.432 -1.495 QT
-1.089 -1.081 -0.909 -0.55 QT
-0.729 -0.019 -0.729 0.528 QT
-0.729 1.294 -1.065 1.981 QT
-1.401 2.669 -2.018 3.075 QT
-2.635 3.481 -3.417 3.481 QT
cp
-3.417 3.075 M
-2.917 3.075 -2.612 2.848 QT
-2.307 2.622 -2.167 2.239 QT
-2.026 1.856 -1.987 1.473 QT
-1.948 1.091 -1.948 0.528 QT
-1.948 -0.206 -2.018 -0.722 QT
-2.089 -1.238 -2.401 -1.636 QT
-2.714 -2.034 -3.354 -2.034 QT
-3.885 -2.034 -4.221 -1.683 QT
-4.557 -1.331 -4.714 -0.784 QT
-4.87 -0.238 -4.87 0.262 QT
-4.87 0.434 -4.854 0.528 QT
-4.854 0.544 -4.862 0.552 QT
-4.87 0.559 -4.87 0.591 QT
-4.87 1.137 -4.753 1.708 QT
-4.635 2.278 -4.315 2.677 QT
-3.995 3.075 -3.417 3.075 QT
cp}def
f-2003826503
f
GR
GS
[0.75 0 0 0.75 176.75 351.5] CT
0.149 GC
N
/f-1289850773{-4.401 2.856 M
-4.401 2.137 -4.276 1.45 QT
-4.151 0.762 -3.909 0.083 QT
-3.667 -0.597 -3.323 -1.245 QT
-2.979 -1.894 -2.557 -2.472 QT
-1.37 -4.113 L
-2.854 -4.113 L
-5.167 -4.113 -5.245 -4.05 QT
-5.417 -3.847 -5.557 -2.863 QT
-5.932 -2.863 L
-5.51 -5.581 L
-5.135 -5.581 L
-5.135 -5.55 L
-5.135 -5.316 -4.339 -5.245 QT
-3.542 -5.175 -2.776 -5.175 QT
-0.37 -5.175 L
-0.37 -4.831 L
-0.37 -4.831 -0.37 -4.823 QT
-0.37 -4.816 -0.37 -4.8 QT
-2.167 -2.284 L
-2.823 -1.3 -2.987 -0.113 QT
-3.151 1.075 -3.151 2.856 QT
-3.151 3.122 -3.339 3.302 QT
-3.526 3.481 -3.776 3.481 QT
-4.042 3.481 -4.221 3.302 QT
-4.401 3.122 -4.401 2.856 QT
cp}def
f-1289850773
f
GR
GS
[0.75 0 0 0.75 176.75 252.75001] CT
0.149 GC
N
/f-974058328{-6.12 1.231 M
-6.12 0.45 -5.604 -0.152 QT
-5.089 -0.753 -4.292 -1.159 QT
-4.776 -1.472 L
-5.214 -1.753 -5.495 -2.238 QT
-5.776 -2.722 -5.776 -3.269 QT
-5.776 -3.878 -5.448 -4.386 QT
-5.12 -4.894 -4.573 -5.175 QT
-4.026 -5.456 -3.417 -5.456 QT
-2.839 -5.456 -2.299 -5.222 QT
-1.76 -4.988 -1.417 -4.55 QT
-1.073 -4.113 -1.073 -3.503 QT
-1.073 -3.066 -1.276 -2.691 QT
-1.479 -2.316 -1.839 -2.019 QT
-2.198 -1.722 -2.604 -1.519 QT
-1.87 -1.034 L
-1.354 -0.706 -1.042 -0.159 QT
-0.729 0.387 -0.729 0.997 QT
-0.729 1.7 -1.104 2.278 QT
-1.479 2.856 -2.104 3.169 QT
-2.729 3.481 -3.417 3.481 QT
-4.089 3.481 -4.714 3.208 QT
-5.339 2.934 -5.729 2.419 QT
-6.12 1.903 -6.12 1.231 QT
cp
-5.417 1.231 M
-5.417 1.747 -5.135 2.169 QT
-4.854 2.591 -4.385 2.833 QT
-3.917 3.075 -3.417 3.075 QT
-2.667 3.075 -2.049 2.63 QT
-1.432 2.184 -1.432 1.466 QT
-1.432 1.216 -1.526 0.973 QT
-1.62 0.731 -1.799 0.528 QT
-1.979 0.325 -2.198 0.2 QT
-3.932 -0.925 L
-4.339 -0.722 -4.682 -0.386 QT
-5.026 -0.05 -5.221 0.356 QT
-5.417 0.762 -5.417 1.231 QT
cp
-4.526 -2.738 M
-2.948 -1.722 L
-2.401 -2.05 -2.049 -2.495 QT
-1.698 -2.941 -1.698 -3.503 QT
-1.698 -3.941 -1.948 -4.308 QT
-2.198 -4.675 -2.589 -4.878 QT
-2.979 -5.081 -3.432 -5.081 QT
-3.823 -5.081 -4.221 -4.933 QT
-4.62 -4.784 -4.878 -4.48 QT
-5.135 -4.175 -5.135 -3.769 QT
-5.135 -3.159 -4.526 -2.738 QT
cp}def
f-974058328
f
GR
GS
[0.75 0 0 0.75 176.75 154] CT
0.149 GC
N
/f1012835229{-5.198 2.653 M
-4.839 3.075 -3.964 3.075 QT
-3.464 3.075 -3.034 2.739 QT
-2.604 2.403 -2.37 1.919 QT
-2.104 1.356 -2.026 0.731 QT
-1.948 0.106 -1.948 -0.816 QT
-2.167 -0.284 -2.589 0.052 QT
-3.01 0.387 -3.542 0.387 QT
-4.292 0.387 -4.885 -0.027 QT
-5.479 -0.441 -5.799 -1.113 QT
-6.12 -1.784 -6.12 -2.534 QT
-6.12 -3.316 -5.768 -3.988 QT
-5.417 -4.659 -4.784 -5.058 QT
-4.151 -5.456 -3.354 -5.456 QT
-2.573 -5.456 -2.042 -5.027 QT
-1.51 -4.597 -1.229 -3.925 QT
-0.948 -3.253 -0.839 -2.495 QT
-0.729 -1.738 -0.729 -1.003 QT
-0.729 -0.003 -1.096 1.044 QT
-1.464 2.091 -2.198 2.786 QT
-2.932 3.481 -3.964 3.481 QT
-4.729 3.481 -5.26 3.122 QT
-5.792 2.762 -5.792 2.028 QT
-5.792 1.762 -5.612 1.583 QT
-5.432 1.403 -5.167 1.403 QT
-4.901 1.403 -4.721 1.583 QT
-4.542 1.762 -4.542 2.028 QT
-4.542 2.278 -4.729 2.466 QT
-4.917 2.653 -5.167 2.653 QT
-5.198 2.653 L
cp
-3.495 0.044 M
-2.964 0.044 -2.62 -0.316 QT
-2.276 -0.675 -2.128 -1.206 QT
-1.979 -1.738 -1.979 -2.269 QT
-1.979 -2.519 L
-1.979 -2.566 L
-1.979 -3.55 -2.26 -4.316 QT
-2.542 -5.081 -3.354 -5.081 QT
-3.87 -5.081 -4.19 -4.855 QT
-4.51 -4.628 -4.659 -4.253 QT
-4.807 -3.878 -4.854 -3.456 QT
-4.901 -3.034 -4.901 -2.534 QT
-4.901 -1.8 -4.831 -1.277 QT
-4.76 -0.753 -4.448 -0.355 QT
-4.135 0.044 -3.495 0.044 QT
cp}def
f1012835229
f
GR
GS
[0.75 0 0 0.75 176.75 55.25] CT
0.149 GC
N
/f1525863041{-12.13 3.2 M
-12.13 2.747 L
-10.505 2.747 -10.505 2.325 QT
-10.505 -4.488 L
-11.177 -4.175 -12.208 -4.175 QT
-12.208 -4.628 L
-10.615 -4.628 -9.802 -5.456 QT
-9.615 -5.456 L
-9.568 -5.456 -9.529 -5.425 QT
-9.49 -5.394 -9.49 -5.347 QT
-9.49 2.325 L
-9.49 2.747 -7.865 2.747 QT
-7.865 3.2 L
-12.13 3.2 L
cp}def
f1525863041
f
GR
GS
[0.75 0 0 0.75 176.75 55.25] CT
0.149 GC
N
/f-2026418800{-3.417 3.481 M
-5.01 3.481 -5.581 2.169 QT
-6.151 0.856 -6.151 -0.941 QT
-6.151 -2.081 -5.948 -3.073 QT
-5.745 -4.066 -5.135 -4.761 QT
-4.526 -5.456 -3.417 -5.456 QT
-2.557 -5.456 -2.01 -5.042 QT
-1.464 -4.628 -1.182 -3.964 QT
-0.901 -3.3 -0.792 -2.542 QT
-0.682 -1.784 -0.682 -0.941 QT
-0.682 0.169 -0.893 1.145 QT
-1.104 2.122 -1.706 2.802 QT
-2.307 3.481 -3.417 3.481 QT
cp
-3.417 3.153 M
-2.698 3.153 -2.339 2.411 QT
-1.979 1.669 -1.901 0.762 QT
-1.823 -0.144 -1.823 -1.159 QT
-1.823 -2.128 -1.901 -2.956 QT
-1.979 -3.784 -2.331 -4.456 QT
-2.682 -5.128 -3.417 -5.128 QT
-4.151 -5.128 -4.51 -4.448 QT
-4.87 -3.769 -4.948 -2.948 QT
-5.026 -2.128 -5.026 -1.159 QT
-5.026 -0.425 -4.995 0.216 QT
-4.964 0.856 -4.807 1.536 QT
-4.651 2.216 -4.315 2.684 QT
-3.979 3.153 -3.417 3.153 QT
cp}def
f-2026418800
f
GR
GS
[0 -0.75 0.75 0 163.74997 351.49973] CT
0.149 GC
N
/f-605089754{-66.229 -5.28 M
-66.229 -5.811 L
-64.885 -5.811 -64.588 -6.686 QT
-61.432 -15.858 L
-61.385 -16.014 -61.197 -16.014 QT
-60.994 -16.014 L
-60.807 -16.014 -60.76 -15.858 QT
-57.463 -6.28 L
-57.338 -5.968 -56.94 -5.889 QT
-56.541 -5.811 -55.963 -5.811 QT
-55.963 -5.28 L
-60.151 -5.28 L
-60.151 -5.811 L
-58.901 -5.811 -58.901 -6.218 QT
-58.901 -6.28 L
-59.713 -8.624 L
-63.354 -8.624 L
-64.026 -6.686 L
-64.041 -6.639 -64.041 -6.546 QT
-64.041 -6.171 -63.682 -5.991 QT
-63.322 -5.811 -62.916 -5.811 QT
-62.916 -5.28 L
-66.229 -5.28 L
cp
-63.182 -9.155 M
-59.885 -9.155 L
-61.541 -13.936 L
-63.182 -9.155 L
cp}def
f-605089754
f
GR
GS
[0 -0.75 0.75 0 163.74997 351.49973] CT
0.149 GC
N
/f1228818102{-52.057 -5.28 M
-54.244 -10.796 L
-54.385 -11.061 -54.674 -11.139 QT
-54.963 -11.218 -55.432 -11.218 QT
-55.432 -11.749 L
-52.276 -11.749 L
-52.276 -11.218 L
-53.119 -11.218 -53.119 -10.858 QT
-53.119 -10.796 -53.104 -10.78 QT
-51.416 -6.546 L
-49.901 -10.358 L
-49.854 -10.483 -49.854 -10.608 QT
-49.854 -10.889 -50.072 -11.053 QT
-50.291 -11.218 -50.588 -11.218 QT
-50.588 -11.749 L
-48.088 -11.749 L
-48.088 -11.218 L
-48.557 -11.218 -48.908 -11.007 QT
-49.26 -10.796 -49.447 -10.374 QT
-51.463 -5.28 L
-51.526 -5.108 -51.713 -5.108 QT
-51.822 -5.108 L
-51.994 -5.108 -52.057 -5.28 QT
cp}def
f1228818102
f
GR
GS
[0 -0.75 0.75 0 163.74997 351.49973] CT
0.149 GC
N
/f-1239543789{-44.645 -5.108 M
-45.567 -5.108 -46.325 -5.593 QT
-47.083 -6.077 -47.52 -6.874 QT
-47.958 -7.671 -47.958 -8.561 QT
-47.958 -9.452 -47.559 -10.241 QT
-47.161 -11.03 -46.45 -11.514 QT
-45.739 -11.999 -44.864 -11.999 QT
-44.161 -11.999 -43.653 -11.772 QT
-43.145 -11.546 -42.817 -11.132 QT
-42.489 -10.718 -42.325 -10.163 QT
-42.161 -9.608 -42.161 -8.936 QT
-42.161 -8.749 -42.302 -8.749 QT
-46.645 -8.749 L
-46.645 -8.577 L
-46.645 -7.343 -46.145 -6.444 QT
-45.645 -5.546 -44.505 -5.546 QT
-44.052 -5.546 -43.661 -5.757 QT
-43.27 -5.968 -42.981 -6.327 QT
-42.692 -6.686 -42.583 -7.108 QT
-42.567 -7.155 -42.528 -7.202 QT
-42.489 -7.249 -42.442 -7.249 QT
-42.302 -7.249 L
-42.161 -7.249 -42.161 -7.046 QT
-42.364 -6.202 -43.067 -5.655 QT
-43.77 -5.108 -44.645 -5.108 QT
cp
-46.63 -9.124 M
-43.223 -9.124 L
-43.223 -9.686 -43.38 -10.264 QT
-43.536 -10.843 -43.903 -11.225 QT
-44.27 -11.608 -44.864 -11.608 QT
-45.708 -11.608 -46.169 -10.811 QT
-46.63 -10.014 -46.63 -9.124 QT
cp}def
f-1239543789
f
GR
GS
[0 -0.75 0.75 0 163.74997 351.49973] CT
0.149 GC
N
/f-605267881{-41.471 -5.28 M
-41.471 -5.811 L
-40.955 -5.811 -40.627 -5.889 QT
-40.299 -5.968 -40.299 -6.28 QT
-40.299 -10.374 L
-40.299 -10.78 -40.424 -10.96 QT
-40.549 -11.139 -40.775 -11.178 QT
-41.002 -11.218 -41.471 -11.218 QT
-41.471 -11.749 L
-39.33 -11.905 L
-39.33 -10.436 L
-39.08 -11.093 -38.635 -11.499 QT
-38.189 -11.905 -37.549 -11.905 QT
-37.111 -11.905 -36.76 -11.639 QT
-36.408 -11.374 -36.408 -10.952 QT
-36.408 -10.671 -36.603 -10.475 QT
-36.799 -10.28 -37.08 -10.28 QT
-37.361 -10.28 -37.556 -10.475 QT
-37.752 -10.671 -37.752 -10.952 QT
-37.752 -11.358 -37.471 -11.514 QT
-37.549 -11.514 L
-38.158 -11.514 -38.541 -11.077 QT
-38.924 -10.639 -39.088 -9.991 QT
-39.252 -9.343 -39.252 -8.749 QT
-39.252 -6.28 L
-39.252 -5.811 -37.799 -5.811 QT
-37.799 -5.28 L
-41.471 -5.28 L
cp}def
f-605267881
f
GR
GS
[0 -0.75 0.75 0 163.74997 351.49973] CT
0.149 GC
N
/f-1876007463{-35.523 -6.749 M
-35.523 -7.639 -34.82 -8.202 QT
-34.117 -8.764 -33.125 -8.999 QT
-32.132 -9.233 -31.257 -9.233 QT
-31.257 -9.843 L
-31.257 -10.28 -31.445 -10.686 QT
-31.632 -11.093 -31.992 -11.35 QT
-32.351 -11.608 -32.789 -11.608 QT
-33.773 -11.608 -34.304 -11.155 QT
-34.007 -11.155 -33.828 -10.944 QT
-33.648 -10.733 -33.648 -10.436 QT
-33.648 -10.139 -33.859 -9.928 QT
-34.07 -9.718 -34.351 -9.718 QT
-34.664 -9.718 -34.875 -9.928 QT
-35.085 -10.139 -35.085 -10.436 QT
-35.085 -11.233 -34.367 -11.616 QT
-33.648 -11.999 -32.789 -11.999 QT
-32.179 -11.999 -31.562 -11.741 QT
-30.945 -11.483 -30.554 -10.999 QT
-30.164 -10.514 -30.164 -9.874 QT
-30.164 -6.499 L
-30.164 -6.202 -30.039 -5.96 QT
-29.914 -5.718 -29.648 -5.718 QT
-29.398 -5.718 -29.281 -5.968 QT
-29.164 -6.218 -29.164 -6.499 QT
-29.164 -7.452 L
-28.726 -7.452 L
-28.726 -6.499 L
-28.726 -6.155 -28.898 -5.85 QT
-29.07 -5.546 -29.367 -5.366 QT
-29.664 -5.186 -30.007 -5.186 QT
-30.445 -5.186 -30.765 -5.53 QT
-31.085 -5.874 -31.117 -6.343 QT
-31.398 -5.78 -31.937 -5.444 QT
-32.476 -5.108 -33.101 -5.108 QT
-33.664 -5.108 -34.218 -5.28 QT
-34.773 -5.452 -35.148 -5.811 QT
-35.523 -6.171 -35.523 -6.749 QT
cp
-34.304 -6.749 M
-34.304 -6.218 -33.914 -5.866 QT
-33.523 -5.514 -32.992 -5.514 QT
-32.507 -5.514 -32.117 -5.749 QT
-31.726 -5.983 -31.492 -6.405 QT
-31.257 -6.827 -31.257 -7.28 QT
-31.257 -8.843 L
-31.929 -8.843 -32.648 -8.624 QT
-33.367 -8.405 -33.835 -7.928 QT
-34.304 -7.452 -34.304 -6.749 QT
cp}def
f-1876007463
f
GR
GS
[0 -0.75 0.75 0 163.74997 351.49973] CT
0.149 GC
N
/f1577068491{-28.362 -4.108 M
-28.362 -4.639 -27.979 -5.038 QT
-27.596 -5.436 -27.049 -5.608 QT
-27.362 -5.843 -27.518 -6.186 QT
-27.674 -6.53 -27.674 -6.921 QT
-27.674 -7.624 -27.221 -8.155 QT
-27.908 -8.827 -27.908 -9.702 QT
-27.908 -10.171 -27.705 -10.585 QT
-27.502 -10.999 -27.143 -11.296 QT
-26.783 -11.593 -26.346 -11.749 QT
-25.908 -11.905 -25.455 -11.905 QT
-24.565 -11.905 -23.846 -11.389 QT
-23.533 -11.718 -23.112 -11.897 QT
-22.69 -12.077 -22.237 -12.077 QT
-21.924 -12.077 -21.721 -11.843 QT
-21.518 -11.608 -21.518 -11.296 QT
-21.518 -11.108 -21.651 -10.968 QT
-21.783 -10.827 -21.971 -10.827 QT
-22.158 -10.827 -22.299 -10.968 QT
-22.44 -11.108 -22.44 -11.296 QT
-22.44 -11.577 -22.252 -11.686 QT
-23.033 -11.686 -23.596 -11.139 QT
-23.315 -10.874 -23.151 -10.483 QT
-22.987 -10.093 -22.987 -9.702 QT
-22.987 -9.061 -23.338 -8.553 QT
-23.69 -8.046 -24.268 -7.764 QT
-24.846 -7.483 -25.455 -7.483 QT
-26.268 -7.483 -26.955 -7.936 QT
-27.158 -7.639 -27.158 -7.28 QT
-27.158 -6.874 -26.901 -6.577 QT
-26.643 -6.28 -26.252 -6.28 QT
-25.018 -6.28 L
-24.127 -6.28 -23.408 -6.124 QT
-22.69 -5.968 -22.205 -5.483 QT
-21.721 -4.999 -21.721 -4.108 QT
-21.721 -3.452 -22.276 -3.014 QT
-22.83 -2.577 -23.604 -2.382 QT
-24.377 -2.186 -25.033 -2.186 QT
-25.705 -2.186 -26.479 -2.382 QT
-27.252 -2.577 -27.807 -3.014 QT
-28.362 -3.452 -28.362 -4.108 QT
cp
-27.518 -4.108 M
-27.518 -3.608 -27.112 -3.264 QT
-26.705 -2.921 -26.127 -2.757 QT
-25.549 -2.593 -25.033 -2.593 QT
-24.533 -2.593 -23.955 -2.757 QT
-23.377 -2.921 -22.971 -3.264 QT
-22.565 -3.608 -22.565 -4.108 QT
-22.565 -4.889 -23.276 -5.124 QT
-23.987 -5.358 -25.018 -5.358 QT
-26.252 -5.358 L
-26.596 -5.358 -26.885 -5.194 QT
-27.174 -5.03 -27.346 -4.733 QT
-27.518 -4.436 -27.518 -4.108 QT
cp
-25.455 -7.889 M
-24.174 -7.889 -24.174 -9.702 QT
-24.174 -10.483 -24.447 -10.991 QT
-24.721 -11.499 -25.455 -11.499 QT
-26.19 -11.499 -26.455 -10.991 QT
-26.721 -10.483 -26.721 -9.702 QT
-26.721 -9.202 -26.619 -8.803 QT
-26.518 -8.405 -26.244 -8.147 QT
-25.971 -7.889 -25.455 -7.889 QT
cp}def
f1577068491
f
GR
GS
[0 -0.75 0.75 0 163.74997 351.49973] CT
0.149 GC
N
/f-638719989{-17.716 -5.108 M
-18.638 -5.108 -19.395 -5.593 QT
-20.153 -6.077 -20.591 -6.874 QT
-21.028 -7.671 -21.028 -8.561 QT
-21.028 -9.452 -20.63 -10.241 QT
-20.231 -11.03 -19.52 -11.514 QT
-18.809 -11.999 -17.934 -11.999 QT
-17.231 -11.999 -16.723 -11.772 QT
-16.216 -11.546 -15.888 -11.132 QT
-15.559 -10.718 -15.395 -10.163 QT
-15.231 -9.608 -15.231 -8.936 QT
-15.231 -8.749 -15.372 -8.749 QT
-19.716 -8.749 L
-19.716 -8.577 L
-19.716 -7.343 -19.216 -6.444 QT
-18.716 -5.546 -17.575 -5.546 QT
-17.122 -5.546 -16.731 -5.757 QT
-16.341 -5.968 -16.052 -6.327 QT
-15.763 -6.686 -15.653 -7.108 QT
-15.638 -7.155 -15.598 -7.202 QT
-15.559 -7.249 -15.513 -7.249 QT
-15.372 -7.249 L
-15.231 -7.249 -15.231 -7.046 QT
-15.434 -6.202 -16.138 -5.655 QT
-16.841 -5.108 -17.716 -5.108 QT
cp
-19.7 -9.124 M
-16.294 -9.124 L
-16.294 -9.686 -16.45 -10.264 QT
-16.606 -10.843 -16.973 -11.225 QT
-17.341 -11.608 -17.934 -11.608 QT
-18.778 -11.608 -19.239 -10.811 QT
-19.7 -10.014 -19.7 -9.124 QT
cp}def
f-638719989
f
GR
GS
[0 -0.75 0.75 0 163.74997 351.49973] CT
0.149 GC
N
/f-935399765{-9.652 -2.374 M
-9.652 -2.889 L
-9.136 -2.889 -8.808 -2.975 QT
-8.48 -3.061 -8.48 -3.374 QT
-8.48 -10.608 L
-8.48 -11.014 -8.777 -11.116 QT
-9.074 -11.218 -9.652 -11.218 QT
-9.652 -11.749 L
-7.433 -11.905 L
-7.433 -10.983 L
-7.027 -11.436 -6.48 -11.671 QT
-5.933 -11.905 -5.324 -11.905 QT
-4.433 -11.905 -3.722 -11.428 QT
-3.011 -10.952 -2.613 -10.171 QT
-2.215 -9.389 -2.215 -8.514 QT
-2.215 -7.608 -2.66 -6.827 QT
-3.105 -6.046 -3.871 -5.577 QT
-4.636 -5.108 -5.543 -5.108 QT
-6.636 -5.108 -7.386 -5.999 QT
-7.386 -3.374 L
-7.386 -3.061 -7.058 -2.975 QT
-6.73 -2.889 -6.215 -2.889 QT
-6.215 -2.374 L
-9.652 -2.374 L
cp
-7.386 -6.733 M
-7.121 -6.202 -6.652 -5.858 QT
-6.183 -5.514 -5.636 -5.514 QT
-5.121 -5.514 -4.715 -5.788 QT
-4.308 -6.061 -4.043 -6.53 QT
-3.777 -6.999 -3.644 -7.514 QT
-3.511 -8.03 -3.511 -8.514 QT
-3.511 -9.124 -3.73 -9.819 QT
-3.949 -10.514 -4.394 -10.999 QT
-4.84 -11.483 -5.465 -11.483 QT
-6.074 -11.483 -6.582 -11.171 QT
-7.09 -10.858 -7.386 -10.327 QT
-7.386 -6.733 L
cp}def
f-935399765
f
GR
GS
[0 -0.75 0.75 0 163.74997 351.49973] CT
0.149 GC
N
/f-254185636{-1.301 -6.749 M
-1.301 -7.639 -0.598 -8.202 QT
0.106 -8.764 1.098 -8.999 QT
2.09 -9.233 2.965 -9.233 QT
2.965 -9.843 L
2.965 -10.28 2.777 -10.686 QT
2.59 -11.093 2.231 -11.35 QT
1.871 -11.608 1.434 -11.608 QT
0.449 -11.608 -0.082 -11.155 QT
0.215 -11.155 0.395 -10.944 QT
0.574 -10.733 0.574 -10.436 QT
0.574 -10.139 0.363 -9.928 QT
0.152 -9.718 -0.129 -9.718 QT
-0.441 -9.718 -0.652 -9.928 QT
-0.863 -10.139 -0.863 -10.436 QT
-0.863 -11.233 -0.144 -11.616 QT
0.574 -11.999 1.434 -11.999 QT
2.043 -11.999 2.66 -11.741 QT
3.277 -11.483 3.668 -10.999 QT
4.059 -10.514 4.059 -9.874 QT
4.059 -6.499 L
4.059 -6.202 4.184 -5.96 QT
4.309 -5.718 4.574 -5.718 QT
4.824 -5.718 4.941 -5.968 QT
5.059 -6.218 5.059 -6.499 QT
5.059 -7.452 L
5.496 -7.452 L
5.496 -6.499 L
5.496 -6.155 5.324 -5.85 QT
5.152 -5.546 4.856 -5.366 QT
4.559 -5.186 4.215 -5.186 QT
3.777 -5.186 3.457 -5.53 QT
3.137 -5.874 3.106 -6.343 QT
2.824 -5.78 2.285 -5.444 QT
1.746 -5.108 1.121 -5.108 QT
0.559 -5.108 0.004 -5.28 QT
-0.551 -5.452 -0.926 -5.811 QT
-1.301 -6.171 -1.301 -6.749 QT
cp
-0.082 -6.749 M
-0.082 -6.218 0.309 -5.866 QT
0.699 -5.514 1.231 -5.514 QT
1.715 -5.514 2.106 -5.749 QT
2.496 -5.983 2.731 -6.405 QT
2.965 -6.827 2.965 -7.28 QT
2.965 -8.843 L
2.293 -8.843 1.574 -8.624 QT
0.856 -8.405 0.387 -7.928 QT
-0.082 -7.452 -0.082 -6.749 QT
cp}def
f-254185636
f
GR
GS
[0 -0.75 0.75 0 163.74997 351.49973] CT
0.149 GC
N
/f974022148{6.97 -7.077 M
6.97 -11.218 L
5.72 -11.218 L
5.72 -11.608 L
6.705 -11.608 7.165 -12.522 QT
7.626 -13.436 7.626 -14.514 QT
8.064 -14.514 L
8.064 -11.749 L
10.173 -11.749 L
10.173 -11.218 L
8.064 -11.218 L
8.064 -7.108 L
8.064 -6.483 8.275 -6.014 QT
8.486 -5.546 9.017 -5.546 QT
9.533 -5.546 9.759 -6.046 QT
9.986 -6.546 9.986 -7.108 QT
9.986 -7.999 L
10.423 -7.999 L
10.423 -7.077 L
10.423 -6.608 10.251 -6.155 QT
10.08 -5.702 9.744 -5.405 QT
9.408 -5.108 8.923 -5.108 QT
8.017 -5.108 7.494 -5.647 QT
6.97 -6.186 6.97 -7.077 QT
cp}def
f974022148
f
GR
GS
[0 -0.75 0.75 0 163.74997 351.49973] CT
0.149 GC
N
/f927731015{11.596 -5.28 M
11.596 -5.811 L
12.096 -5.811 12.432 -5.889 QT
12.768 -5.968 12.768 -6.28 QT
12.768 -14.155 L
12.768 -14.561 12.643 -14.741 QT
12.518 -14.921 12.291 -14.96 QT
12.064 -14.999 11.596 -14.999 QT
11.596 -15.53 L
13.814 -15.686 L
13.814 -10.53 L
14.127 -11.155 14.689 -11.53 QT
15.252 -11.905 15.939 -11.905 QT
16.986 -11.905 17.51 -11.405 QT
18.033 -10.905 18.033 -9.889 QT
18.033 -6.28 L
18.033 -5.968 18.361 -5.889 QT
18.689 -5.811 19.205 -5.811 QT
19.205 -5.28 L
15.768 -5.28 L
15.768 -5.811 L
16.283 -5.811 16.611 -5.889 QT
16.939 -5.968 16.939 -6.28 QT
16.939 -9.843 L
16.939 -10.577 16.729 -11.046 QT
16.518 -11.514 15.846 -11.514 QT
14.986 -11.514 14.424 -10.819 QT
13.861 -10.124 13.861 -9.249 QT
13.861 -6.28 L
13.861 -5.968 14.189 -5.889 QT
14.518 -5.811 15.018 -5.811 QT
15.018 -5.28 L
11.596 -5.28 L
cp}def
f927731015
f
GR
GS
[0 -0.75 0.75 0 163.74997 351.49973] CT
0.149 GC
N
/f-1975566550{27.914 -5.108 M
27.008 -5.108 26.266 -5.585 QT
25.523 -6.061 25.102 -6.843 QT
24.68 -7.624 24.68 -8.514 QT
24.68 -9.405 25.102 -10.218 QT
25.523 -11.03 26.266 -11.514 QT
27.008 -11.999 27.914 -11.999 QT
28.789 -11.999 29.516 -11.655 QT
30.242 -11.311 30.242 -10.53 QT
30.242 -10.233 30.031 -10.022 QT
29.82 -9.811 29.523 -9.811 QT
29.227 -9.811 29.016 -10.022 QT
28.805 -10.233 28.805 -10.53 QT
28.805 -10.796 28.969 -10.991 QT
29.133 -11.186 29.383 -11.233 QT
28.867 -11.561 27.93 -11.561 QT
27.211 -11.561 26.773 -11.085 QT
26.336 -10.608 26.156 -9.905 QT
25.977 -9.202 25.977 -8.514 QT
25.977 -7.796 26.195 -7.116 QT
26.414 -6.436 26.891 -5.991 QT
27.367 -5.546 28.102 -5.546 QT
28.805 -5.546 29.305 -5.983 QT
29.805 -6.421 29.992 -7.124 QT
29.992 -7.218 30.102 -7.218 QT
30.289 -7.218 L
30.336 -7.218 30.367 -7.178 QT
30.398 -7.139 30.398 -7.077 QT
30.398 -7.046 L
30.18 -6.155 29.508 -5.632 QT
28.836 -5.108 27.914 -5.108 QT
cp}def
f-1975566550
f
GR
GS
[0 -0.75 0.75 0 163.74997 351.49973] CT
0.149 GC
N
/f711680412{34.448 -5.108 M
33.542 -5.108 32.776 -5.569 QT
32.011 -6.03 31.565 -6.796 QT
31.12 -7.561 31.12 -8.468 QT
31.12 -9.155 31.362 -9.796 QT
31.604 -10.436 32.065 -10.936 QT
32.526 -11.436 33.136 -11.718 QT
33.745 -11.999 34.448 -11.999 QT
35.37 -11.999 36.128 -11.514 QT
36.886 -11.03 37.323 -10.21 QT
37.761 -9.389 37.761 -8.468 QT
37.761 -7.577 37.315 -6.803 QT
36.87 -6.03 36.104 -5.569 QT
35.339 -5.108 34.448 -5.108 QT
cp
34.448 -5.546 M
35.651 -5.546 36.05 -6.421 QT
36.448 -7.296 36.448 -8.639 QT
36.448 -9.389 36.37 -9.889 QT
36.292 -10.389 36.026 -10.796 QT
35.854 -11.03 35.597 -11.218 QT
35.339 -11.405 35.05 -11.507 QT
34.761 -11.608 34.448 -11.608 QT
33.979 -11.608 33.558 -11.397 QT
33.136 -11.186 32.854 -10.796 QT
32.573 -10.358 32.503 -9.85 QT
32.433 -9.343 32.433 -8.639 QT
32.433 -7.796 32.573 -7.124 QT
32.714 -6.452 33.159 -5.999 QT
33.604 -5.546 34.448 -5.546 QT
cp}def
f711680412
f
GR
GS
[0 -0.75 0.75 0 163.74997 351.49973] CT
0.149 GC
N
/f2145157921{38.532 -5.233 M
38.532 -7.686 L
38.532 -7.796 38.657 -7.796 QT
38.844 -7.796 L
38.938 -7.796 38.969 -7.686 QT
39.375 -5.514 40.985 -5.514 QT
41.688 -5.514 42.172 -5.835 QT
42.657 -6.155 42.657 -6.827 QT
42.657 -7.311 42.282 -7.647 QT
41.907 -7.983 41.391 -8.108 QT
40.391 -8.311 L
39.891 -8.421 39.477 -8.647 QT
39.063 -8.874 38.797 -9.249 QT
38.532 -9.624 38.532 -10.124 QT
38.532 -10.796 38.875 -11.21 QT
39.219 -11.624 39.782 -11.811 QT
40.344 -11.999 40.985 -11.999 QT
41.75 -11.999 42.328 -11.593 QT
42.75 -11.968 L
42.75 -11.999 42.828 -11.999 QT
42.938 -11.999 L
42.985 -11.999 43.024 -11.96 QT
43.063 -11.921 43.063 -11.874 QT
43.063 -9.921 L
43.063 -9.78 42.938 -9.78 QT
42.75 -9.78 L
42.625 -9.78 42.625 -9.921 QT
42.625 -10.702 42.188 -11.178 QT
41.75 -11.655 40.969 -11.655 QT
40.297 -11.655 39.805 -11.405 QT
39.313 -11.155 39.313 -10.546 QT
39.313 -10.124 39.664 -9.858 QT
40.016 -9.593 40.5 -9.483 QT
41.516 -9.28 L
42.016 -9.171 42.461 -8.889 QT
42.907 -8.608 43.164 -8.186 QT
43.422 -7.764 43.422 -7.233 QT
43.422 -6.686 43.242 -6.288 QT
43.063 -5.889 42.727 -5.624 QT
42.391 -5.358 41.938 -5.233 QT
41.485 -5.108 40.985 -5.108 QT
40.047 -5.108 39.375 -5.749 QT
38.828 -5.155 L
38.828 -5.108 38.75 -5.108 QT
38.657 -5.108 L
38.532 -5.108 38.532 -5.233 QT
cp}def
f2145157921
f
GR
GS
[0 -0.75 0.75 0 163.74997 351.49973] CT
0.149 GC
N
/f-954027740{45.348 -7.077 M
45.348 -11.218 L
44.098 -11.218 L
44.098 -11.608 L
45.082 -11.608 45.543 -12.522 QT
46.004 -13.436 46.004 -14.514 QT
46.442 -14.514 L
46.442 -11.749 L
48.551 -11.749 L
48.551 -11.218 L
46.442 -11.218 L
46.442 -7.108 L
46.442 -6.483 46.653 -6.014 QT
46.864 -5.546 47.395 -5.546 QT
47.91 -5.546 48.137 -6.046 QT
48.364 -6.546 48.364 -7.108 QT
48.364 -7.999 L
48.801 -7.999 L
48.801 -7.077 L
48.801 -6.608 48.629 -6.155 QT
48.457 -5.702 48.121 -5.405 QT
47.785 -5.108 47.301 -5.108 QT
46.395 -5.108 45.871 -5.647 QT
45.348 -6.186 45.348 -7.077 QT
cp}def
f-954027740
f
GR
GS
[0 -0.75 0.75 0 163.74997 351.49973] CT
0.149 GC
N
/f-1549647278{54.177 -1.561 M
53.333 -2.218 52.731 -3.069 QT
52.13 -3.921 51.747 -4.889 QT
51.364 -5.858 51.169 -6.913 QT
50.974 -7.968 50.974 -9.03 QT
50.974 -10.108 51.169 -11.163 QT
51.364 -12.218 51.755 -13.194 QT
52.145 -14.171 52.755 -15.014 QT
53.364 -15.858 54.177 -16.499 QT
54.177 -16.53 54.239 -16.53 QT
54.38 -16.53 L
54.427 -16.53 54.466 -16.491 QT
54.505 -16.452 54.505 -16.405 QT
54.505 -16.327 54.474 -16.296 QT
53.739 -15.593 53.255 -14.772 QT
52.77 -13.952 52.474 -13.022 QT
52.177 -12.093 52.044 -11.1 QT
51.911 -10.108 51.911 -9.03 QT
51.911 -4.264 54.458 -1.78 QT
54.505 -1.749 54.505 -1.655 QT
54.505 -1.624 54.466 -1.577 QT
54.427 -1.53 54.38 -1.53 QT
54.239 -1.53 L
54.177 -1.53 54.177 -1.561 QT
cp}def
f-1549647278
f
GR
GS
[0 -0.75 0.75 0 163.74997 351.49973] CT
0.149 GC
N
/f-2040139191{55.724 -5.233 M
55.724 -7.686 L
55.724 -7.796 55.849 -7.796 QT
56.037 -7.796 L
56.13 -7.796 56.162 -7.686 QT
56.568 -5.514 58.177 -5.514 QT
58.88 -5.514 59.365 -5.835 QT
59.849 -6.155 59.849 -6.827 QT
59.849 -7.311 59.474 -7.647 QT
59.099 -7.983 58.584 -8.108 QT
57.584 -8.311 L
57.084 -8.421 56.669 -8.647 QT
56.255 -8.874 55.99 -9.249 QT
55.724 -9.624 55.724 -10.124 QT
55.724 -10.796 56.068 -11.21 QT
56.412 -11.624 56.974 -11.811 QT
57.537 -11.999 58.177 -11.999 QT
58.943 -11.999 59.521 -11.593 QT
59.943 -11.968 L
59.943 -11.999 60.021 -11.999 QT
60.13 -11.999 L
60.177 -11.999 60.216 -11.96 QT
60.255 -11.921 60.255 -11.874 QT
60.255 -9.921 L
60.255 -9.78 60.13 -9.78 QT
59.943 -9.78 L
59.818 -9.78 59.818 -9.921 QT
59.818 -10.702 59.38 -11.178 QT
58.943 -11.655 58.162 -11.655 QT
57.49 -11.655 56.998 -11.405 QT
56.505 -11.155 56.505 -10.546 QT
56.505 -10.124 56.857 -9.858 QT
57.209 -9.593 57.693 -9.483 QT
58.709 -9.28 L
59.209 -9.171 59.654 -8.889 QT
60.099 -8.608 60.357 -8.186 QT
60.615 -7.764 60.615 -7.233 QT
60.615 -6.686 60.435 -6.288 QT
60.255 -5.889 59.919 -5.624 QT
59.584 -5.358 59.13 -5.233 QT
58.677 -5.108 58.177 -5.108 QT
57.24 -5.108 56.568 -5.749 QT
56.021 -5.155 L
56.021 -5.108 55.943 -5.108 QT
55.849 -5.108 L
55.724 -5.108 55.724 -5.233 QT
cp}def
f-2040139191
f
GR
GS
[0 -0.75 0.75 0 163.74997 351.49973] CT
0.149 GC
N
/f-548611893{61.978 -1.53 M
61.853 -1.53 61.853 -1.655 QT
61.853 -1.733 61.884 -1.764 QT
64.447 -4.264 64.447 -9.03 QT
64.447 -13.796 61.916 -16.28 QT
61.853 -16.311 61.853 -16.405 QT
61.853 -16.452 61.892 -16.491 QT
61.931 -16.53 61.978 -16.53 QT
62.119 -16.53 L
62.166 -16.53 62.197 -16.499 QT
63.275 -15.655 63.994 -14.436 QT
64.712 -13.218 65.041 -11.843 QT
65.369 -10.468 65.369 -9.03 QT
65.369 -7.968 65.189 -6.936 QT
65.009 -5.905 64.619 -4.905 QT
64.228 -3.905 63.627 -3.061 QT
63.025 -2.218 62.197 -1.561 QT
62.166 -1.53 62.119 -1.53 QT
61.978 -1.53 L
cp}def
f-548611893
f
GR
GS
[0.75 0 0 0.75 0 0.5] CT
0 0 1 RC
1 LJ
2.667 LW
N
255.36 709.152 M
284.08 748.794 L
312.8 753.729 L
384.6 769.401 L
671.8 783.708 L
959 787.984 L
1677 793.856 L
S
GR
GS
[0.75 0 0 0.75 0 0.5] CT
0 0 1 RC
1 LJ
0.667 LW
N
255.36 723.594 M
284.08 759.476 L
312.8 769.651 L
384.6 779.373 L
671.8 791.125 L
959 797.255 L
1677 802.457 L
S
GR
GS
[0.75 0 0 0.75 191.52 543.19586] CT
0 0 1 RC
N
1.333 0 M
1.333 0.736 0.736 1.333 0 1.333 C
-0.736 1.333 -1.333 0.736 -1.333 0 C
-1.333 -0.736 -0.736 -1.333 0 -1.333 C
0.736 -1.333 1.333 -0.736 1.333 0 C
cp
f
GR
GS
[0.75 0 0 0.75 213.05999 570.1071] CT
0 0 1 RC
N
/f-1057828618{1.333 0 M
1.333 0.736 0.736 1.333 0 1.333 C
-0.736 1.333 -1.333 0.736 -1.333 0 C
-1.333 -0.736 -0.736 -1.333 0 -1.333 C
0.736 -1.333 1.333 -0.736 1.333 0 C
cp}def
f-1057828618
f
GR
GS
[0.75 0 0 0.75 234.59999 577.73816] CT
0 0 1 RC
N
f-1057828618
f
GR
GS
[0.75 0 0 0.75 288.45 585.02969] CT
0 0 1 RC
N
f-1057828618
f
GR
GS
[0.75 0 0 0.75 503.84999 593.8438] CT
0 0 1 RC
N
f-1057828618
f
GR
GS
[0.75 0 0 0.75 719.25 598.44139] CT
0 0 1 RC
N
f-1057828618
f
GR
GS
[0.75 0 0 0.75 1257.75 602.343] CT
0 0 1 RC
N
f-1057828618
f
GR
GS
[0.75 0 0 0.75 0 0.5] CT
0 0 1 RC
1 LJ
0.667 LW
N
255.36 684.039 M
284.08 737.099 L
312.8 743.184 L
384.6 758.772 L
671.8 773.738 L
959 779.057 L
1677 783.303 L
S
GR
GS
[0.75 0 0 0.75 191.52 513.52902] CT
0 0 1 RC
N
f-1057828618
f
GR
GS
[0.75 0 0 0.75 213.05999 553.32443] CT
0 0 1 RC
N
f-1057828618
f
GR
GS
[0.75 0 0 0.75 234.59999 557.88788] CT
0 0 1 RC
N
f-1057828618
f
GR
GS
[0.75 0 0 0.75 288.45 569.57889] CT
0 0 1 RC
N
f-1057828618
f
GR
GS
[0.75 0 0 0.75 503.84999 580.80385] CT
0 0 1 RC
N
f-1057828618
f
GR
GS
[0.75 0 0 0.75 719.25 584.79239] CT
0 0 1 RC
N
f-1057828618
f
GR
GS
[0.75 0 0 0.75 1257.75 587.97751] CT
0 0 1 RC
N
f-1057828618
f
GR
GS
[0.75 0 0 0.75 0 0.5] CT
1 0 0 RC
1 LJ
2.667 LW
N
255.36 770.298 M
284.08 798.659 L
312.8 806.953 L
384.6 821.01 L
671.8 802.902 L
959 834.327 L
1677 838.626 L
S
GR
GS
[0.75 0 0 0.75 0 0.5] CT
1 0 0 RC
1 LJ
0.667 LW
N
255.36 792.871 M
284.08 807.291 L
312.8 823.135 L
384.6 830.789 L
671.8 824.829 L
959 845.045 L
1677 849.71 L
S
GR
GS
[0.75 0 0 0.75 191.52 595.1535] CT
1 0 0 RC
N
f-1057828618
f
GR
GS
[0.75 0 0 0.75 213.05999 605.96826] CT
1 0 0 RC
N
f-1057828618
f
GR
GS
[0.75 0 0 0.75 234.59999 617.85117] CT
1 0 0 RC
N
f-1057828618
f
GR
GS
[0.75 0 0 0.75 288.45 623.59198] CT
1 0 0 RC
N
f-1057828618
f
GR
GS
[0.75 0 0 0.75 503.84999 619.1221] CT
1 0 0 RC
N
f-1057828618
f
GR
GS
[0.75 0 0 0.75 719.25 634.28355] CT
1 0 0 RC
N
f-1057828618
f
GR
GS
[0.75 0 0 0.75 1257.75 637.78238] CT
1 0 0 RC
N
f-1057828618
f
GR
GS
[0.75 0 0 0.75 0 0.5] CT
1 0 0 RC
1 LJ
0.667 LW
N
255.36 736.809 M
284.08 782.87 L
312.8 787.085 L
384.6 811.037 L
671.8 717.69 L
959 821.675 L
1677 831.022 L
S
GR
GS
[0.75 0 0 0.75 191.52 553.10681] CT
1 0 0 RC
N
f-1057828618
f
GR
GS
[0.75 0 0 0.75 213.05999 587.65286] CT
1 0 0 RC
N
f-1057828618
f
GR
GS
[0.75 0 0 0.75 234.59999 590.8134] CT
1 0 0 RC
N
f-1057828618
f
GR
GS
[0.75 0 0 0.75 288.45 608.77788] CT
1 0 0 RC
N
f-1057828618
f
GR
GS
[0.75 0 0 0.75 503.84999 538.76773] CT
1 0 0 RC
N
f-1057828618
f
GR
GS
[0.75 0 0 0.75 719.25 616.75601] CT
1 0 0 RC
N
f-1057828618
f
GR
GS
[0.75 0 0 0.75 1257.75 623.76643] CT
1 0 0 RC
N
f-1057828618
f
GR
GS
[0.75 0 0 0.75 0 0.5] CT
0 1 0 RC
1 LJ
2.667 LW
N
255.36 248.221 M
284.08 401.138 L
312.8 449.411 L
384.6 530.705 L
671.8 599.115 L
959 632.8 L
1677 659.212 L
S
GR
GS
[0.75 0 0 0.75 0 0.5] CT
0 1 0 RC
1 LJ
0.667 LW
N
255.36 293.72 M
284.08 449.048 L
312.8 500.911 L
384.6 545.542 L
671.8 612.255 L
959 643.099 L
1677 668.329 L
S
GR
GS
[0.75 0 0 0.75 191.52 220.78982] CT
0 1 0 RC
N
f-1057828618
f
GR
GS
[0.75 0 0 0.75 213.05999 337.28589] CT
0 1 0 RC
N
f-1057828618
f
GR
GS
[0.75 0 0 0.75 234.59999 376.18298] CT
0 1 0 RC
N
f-1057828618
f
GR
GS
[0.75 0 0 0.75 288.45 409.65686] CT
0 1 0 RC
N
f-1057828618
f
GR
GS
[0.75 0 0 0.75 503.84999 459.69121] CT
0 1 0 RC
N
f-1057828618
f
GR
GS
[0.75 0 0 0.75 719.25 482.82425] CT
0 1 0 RC
N
f-1057828618
f
GR
GS
[0.75 0 0 0.75 1257.75 501.74706] CT
0 1 0 RC
N
f-1057828618
f
GR
GS
[0.75 0 0 0.75 0 0.5] CT
0 1 0 RC
1 LJ
0.667 LW
N
255.36 131.627 M
284.08 233.548 L
312.8 269.128 L
384.6 514.753 L
671.8 589.723 L
959 621.423 L
1677 651.435 L
S
GR
GS
[0.75 0 0 0.75 191.52 99.22027] CT
0 1 0 RC
N
f-1057828618
f
GR
GS
[0.75 0 0 0.75 213.05999 175.66099] CT
0 1 0 RC
N
f-1057828618
f
GR
GS
[0.75 0 0 0.75 234.59999 202.34595] CT
0 1 0 RC
N
f-1057828618
f
GR
GS
[0.75 0 0 0.75 288.45 386.56456] CT
0 1 0 RC
N
f-1057828618
f
GR
GS
[0.75 0 0 0.75 503.84999 442.7924] CT
0 1 0 RC
N
f-1057828618
f
GR
GS
[0.75 0 0 0.75 719.25 466.56718] CT
0 1 0 RC
N
f-1057828618
f
GR
GS
[0.75 0 0 0.75 1257.75 489.07661] CT
0 1 0 RC
N
f-1057828618
f
GR
GS
[0.75 0 0 0.75 0 0.5] CT
1 0 1 RC
1 LJ
2.667 LW
N
255.36 591.677 M
284.08 495.556 L
312.8 421.883 L
384.6 533.948 L
671.8 573.968 L
959 595.89 L
1677 629.232 L
S
GR
GS
[0.75 0 0 0.75 0 0.5] CT
1 0 1 RC
1 LJ
0.667 LW
N
255.36 636.892 M
284.08 532.75 L
312.8 520.331 L
384.6 553.792 L
671.8 588.772 L
959 612.114 L
1677 640.291 L
S
GR
GS
[0.75 0 0 0.75 191.52 478.1687] CT
1 0 1 RC
N
f-1057828618
f
GR
GS
[0.75 0 0 0.75 213.05999 400.06223] CT
1 0 1 RC
N
f-1057828618
f
GR
GS
[0.75 0 0 0.75 234.59999 390.74792] CT
1 0 1 RC
N
f-1057828618
f
GR
GS
[0.75 0 0 0.75 288.45 415.84377] CT
1 0 1 RC
N
f-1057828618
f
GR
GS
[0.75 0 0 0.75 503.84999 442.07925] CT
1 0 1 RC
N
f-1057828618
f
GR
GS
[0.75 0 0 0.75 719.25 459.58533] CT
1 0 1 RC
N
f-1057828618
f
GR
GS
[0.75 0 0 0.75 1257.75 480.71794] CT
1 0 1 RC
N
f-1057828618
f
GR
GS
[0.75 0 0 0.75 0 0.5] CT
1 0 1 RC
1 LJ
0.667 LW
N
255.36 557.302 M
284.08 449.694 L
312.8 243.339 L
384.6 514.583 L
671.8 560.935 L
959 583.038 L
1677 615.54 L
S
GR
GS
[0.75 0 0 0.75 191.52 418.47627] CT
1 0 1 RC
N
f-1057828618
f
GR
GS
[0.75 0 0 0.75 213.05999 337.77013] CT
1 0 1 RC
N
f-1057828618
f
GR
GS
[0.75 0 0 0.75 234.59999 183.00449] CT
1 0 1 RC
N
f-1057828618
f
GR
GS
[0.75 0 0 0.75 288.45 386.43726] CT
1 0 1 RC
N
f-1057828618
f
GR
GS
[0.75 0 0 0.75 503.84999 421.20093] CT
1 0 1 RC
N
f-1057828618
f
GR
GS
[0.75 0 0 0.75 719.25 437.77838] CT
1 0 1 RC
N
f-1057828618
f
GR
GS
[0.75 0 0 0.75 1257.75 462.1548] CT
1 0 1 RC
N
f-1057828618
f
GR
GS
[0.75 0 0 0.75 0 0.5] CT
1 GC
N
1655 148 M
1655 85 L
1555 85 L
1555 148 L
cp
f
GR
GS
[0.75 0 0 0.75 1201.38281 71.13906] CT
N
/f1944532930{0.375 2.88 M
0.375 2.458 L
1.609 2.458 1.609 1.755 QT
1.609 -4.823 L
1.219 -4.901 0.375 -4.901 QT
0.375 -5.323 L
2.672 -5.323 L
2.719 -5.323 2.75 -5.276 QT
7 0.974 L
7 -4.183 L
7 -4.901 5.766 -4.901 QT
5.766 -5.323 L
8.609 -5.323 L
8.609 -4.901 L
7.391 -4.901 7.391 -4.183 QT
7.391 2.771 L
7.391 2.802 7.344 2.841 QT
7.297 2.88 7.266 2.88 QT
7.109 2.88 L
7.063 2.88 7.031 2.833 QT
2 -4.589 L
2 1.755 L
2 2.458 3.234 2.458 QT
3.234 2.88 L
0.375 2.88 L
cp}def
f1944532930
f
GR
GS
[0.75 0 0 0.75 1201.38281 71.13906] CT
N
/f-357217629{13.672 3.146 M
12.531 3.146 11.617 2.536 QT
10.703 1.927 10.188 0.927 QT
9.672 -0.073 9.672 -1.183 QT
9.672 -2.011 9.969 -2.815 QT
10.266 -3.62 10.797 -4.237 QT
11.328 -4.854 12.07 -5.222 QT
12.813 -5.589 13.672 -5.589 QT
14.516 -5.589 15.266 -5.222 QT
16.016 -4.854 16.547 -4.222 QT
17.078 -3.589 17.367 -2.815 QT
17.656 -2.042 17.656 -1.183 QT
17.656 -0.073 17.141 0.927 QT
16.625 1.927 15.711 2.536 QT
14.797 3.146 13.672 3.146 QT
cp
11.672 1.583 M
12.031 2.13 12.547 2.458 QT
13.063 2.786 13.672 2.786 QT
14.063 2.786 14.438 2.63 QT
14.813 2.474 15.125 2.192 QT
15.438 1.911 15.656 1.583 QT
16.359 0.505 16.359 -1.386 QT
16.359 -3.104 15.656 -4.12 QT
15.297 -4.62 14.773 -4.925 QT
14.25 -5.229 13.672 -5.229 QT
13.078 -5.229 12.555 -4.925 QT
12.031 -4.62 11.672 -4.12 QT
11.391 -3.729 11.242 -3.284 QT
11.094 -2.839 11.023 -2.362 QT
10.953 -1.886 10.953 -1.386 QT
10.953 -0.839 11.016 -0.315 QT
11.078 0.208 11.25 0.7 QT
11.422 1.192 11.672 1.583 QT
cp}def
f-357217629
f
GR
GS
[0.75 0 0 0.75 1201.38281 71.13906] CT
N
/f1694350474{19.005 5.646 M
19.005 5.599 19.021 5.599 QT
23.193 -5.979 L
23.208 -6.042 23.271 -6.081 QT
23.333 -6.12 23.412 -6.12 QT
23.521 -6.12 23.583 -6.058 QT
23.646 -5.995 23.646 -5.886 QT
23.646 -5.839 L
19.474 5.739 L
19.412 5.88 19.255 5.88 QT
19.146 5.88 19.076 5.81 QT
19.005 5.739 19.005 5.646 QT
cp}def
f1694350474
f
GR
GS
[0.75 0 0 0.75 1201.38281 71.13906] CT
N
/f-856223217{24.708 2.88 M
24.708 2.458 L
25.943 2.458 25.943 1.755 QT
25.943 -4.823 L
25.552 -4.901 24.708 -4.901 QT
24.708 -5.323 L
27.005 -5.323 L
27.052 -5.323 27.083 -5.276 QT
31.333 0.974 L
31.333 -4.183 L
31.333 -4.901 30.099 -4.901 QT
30.099 -5.323 L
32.943 -5.323 L
32.943 -4.901 L
31.724 -4.901 31.724 -4.183 QT
31.724 2.771 L
31.724 2.802 31.677 2.841 QT
31.63 2.88 31.599 2.88 QT
31.443 2.88 L
31.396 2.88 31.365 2.833 QT
26.333 -4.589 L
26.333 1.755 L
26.333 2.458 27.568 2.458 QT
27.568 2.88 L
24.708 2.88 L
cp}def
f-856223217
f
GR
GS
[0.75 0 0 0.75 1201.38281 71.13906] CT
N
/f-1958184410{38.005 3.146 M
36.865 3.146 35.951 2.536 QT
35.037 1.927 34.521 0.927 QT
34.005 -0.073 34.005 -1.183 QT
34.005 -2.011 34.302 -2.815 QT
34.599 -3.62 35.13 -4.237 QT
35.662 -4.854 36.404 -5.222 QT
37.146 -5.589 38.005 -5.589 QT
38.849 -5.589 39.599 -5.222 QT
40.349 -4.854 40.88 -4.222 QT
41.412 -3.589 41.701 -2.815 QT
41.99 -2.042 41.99 -1.183 QT
41.99 -0.073 41.474 0.927 QT
40.958 1.927 40.044 2.536 QT
39.13 3.146 38.005 3.146 QT
cp
36.005 1.583 M
36.365 2.13 36.88 2.458 QT
37.396 2.786 38.005 2.786 QT
38.396 2.786 38.771 2.63 QT
39.146 2.474 39.458 2.192 QT
39.771 1.911 39.99 1.583 QT
40.693 0.505 40.693 -1.386 QT
40.693 -3.104 39.99 -4.12 QT
39.63 -4.62 39.107 -4.925 QT
38.583 -5.229 38.005 -5.229 QT
37.412 -5.229 36.888 -4.925 QT
36.365 -4.62 36.005 -4.12 QT
35.724 -3.729 35.576 -3.284 QT
35.427 -2.839 35.357 -2.362 QT
35.287 -1.886 35.287 -1.386 QT
35.287 -0.839 35.349 -0.315 QT
35.412 0.208 35.583 0.7 QT
35.755 1.192 36.005 1.583 QT
cp}def
f-1958184410
f
GR
GS
[0.75 0 0 0.75 1201.38281 71.13906] CT
N
/f-2101553479{43.917 2.88 M
43.917 -4.229 L
43.917 -4.542 43.823 -4.69 QT
43.729 -4.839 43.542 -4.87 QT
43.354 -4.901 42.979 -4.901 QT
42.979 -5.323 L
44.761 -5.448 L
44.761 -1.698 L
44.948 -1.917 45.214 -2.081 QT
45.479 -2.245 45.784 -2.331 QT
46.089 -2.417 46.417 -2.417 QT
46.948 -2.417 47.409 -2.206 QT
47.87 -1.995 48.214 -1.612 QT
48.557 -1.229 48.745 -0.737 QT
48.932 -0.245 48.932 0.286 QT
48.932 1.021 48.581 1.646 QT
48.229 2.271 47.612 2.646 QT
46.995 3.021 46.261 3.021 QT
45.807 3.021 45.378 2.786 QT
44.948 2.552 44.667 2.161 QT
44.261 2.88 L
43.917 2.88 L
cp
44.792 1.708 M
44.995 2.146 45.37 2.419 QT
45.745 2.692 46.198 2.692 QT
46.823 2.692 47.206 2.341 QT
47.589 1.989 47.737 1.442 QT
47.886 0.896 47.886 0.286 QT
47.886 -0.729 47.62 -1.245 QT
47.511 -1.479 47.307 -1.683 QT
47.104 -1.886 46.854 -2.003 QT
46.604 -2.12 46.323 -2.12 QT
45.854 -2.12 45.44 -1.862 QT
45.026 -1.604 44.792 -1.183 QT
44.792 1.708 L
cp}def
f-2101553479
f
GR
GS
[0.75 0 0 0.75 0 0.5] CT
0 0 1 RC
1 LJ
2.667 LW
N
1558.987 94.185 M
1598.854 94.185 L
S
GR
GS
[0.75 0 0 0.75 1201.38281 82.29635] CT
N
/f629474577{4.672 3.146 M
3.531 3.146 2.617 2.536 QT
1.703 1.927 1.188 0.927 QT
0.672 -0.073 0.672 -1.183 QT
0.672 -2.011 0.969 -2.815 QT
1.266 -3.62 1.797 -4.237 QT
2.328 -4.854 3.07 -5.222 QT
3.813 -5.589 4.672 -5.589 QT
5.516 -5.589 6.266 -5.222 QT
7.016 -4.854 7.547 -4.222 QT
8.078 -3.589 8.367 -2.815 QT
8.656 -2.042 8.656 -1.183 QT
8.656 -0.073 8.141 0.927 QT
7.625 1.927 6.711 2.536 QT
5.797 3.146 4.672 3.146 QT
cp
2.672 1.583 M
3.031 2.13 3.547 2.458 QT
4.063 2.786 4.672 2.786 QT
5.063 2.786 5.438 2.63 QT
5.813 2.474 6.125 2.192 QT
6.438 1.911 6.656 1.583 QT
7.359 0.505 7.359 -1.386 QT
7.359 -3.104 6.656 -4.12 QT
6.297 -4.62 5.773 -4.925 QT
5.25 -5.229 4.672 -5.229 QT
4.078 -5.229 3.555 -4.925 QT
3.031 -4.62 2.672 -4.12 QT
2.391 -3.729 2.242 -3.284 QT
2.094 -2.839 2.023 -2.362 QT
1.953 -1.886 1.953 -1.386 QT
1.953 -0.839 2.016 -0.315 QT
2.078 0.208 2.25 0.7 QT
2.422 1.192 2.672 1.583 QT
cp}def
f629474577
f
GR
GS
[0.75 0 0 0.75 1201.38281 82.29635] CT
N
/f1700453028{10.005 5.646 M
10.005 5.599 10.021 5.599 QT
14.193 -5.979 L
14.208 -6.042 14.271 -6.081 QT
14.333 -6.12 14.411 -6.12 QT
14.521 -6.12 14.583 -6.058 QT
14.646 -5.995 14.646 -5.886 QT
14.646 -5.839 L
10.474 5.739 L
10.411 5.88 10.255 5.88 QT
10.146 5.88 10.076 5.81 QT
10.005 5.739 10.005 5.646 QT
cp}def
f1700453028
f
GR
GS
[0.75 0 0 0.75 1201.38281 82.29635] CT
N
/f-643772201{15.708 2.88 M
15.708 2.458 L
16.943 2.458 16.943 1.755 QT
16.943 -4.823 L
16.552 -4.901 15.708 -4.901 QT
15.708 -5.323 L
18.005 -5.323 L
18.052 -5.323 18.083 -5.276 QT
22.333 0.974 L
22.333 -4.183 L
22.333 -4.901 21.099 -4.901 QT
21.099 -5.323 L
23.943 -5.323 L
23.943 -4.901 L
22.724 -4.901 22.724 -4.183 QT
22.724 2.771 L
22.724 2.802 22.677 2.841 QT
22.63 2.88 22.599 2.88 QT
22.443 2.88 L
22.396 2.88 22.365 2.833 QT
17.333 -4.589 L
17.333 1.755 L
17.333 2.458 18.568 2.458 QT
18.568 2.88 L
15.708 2.88 L
cp}def
f-643772201
f
GR
GS
[0.75 0 0 0.75 1201.38281 82.29635] CT
N
/f350596035{29.005 3.146 M
27.865 3.146 26.951 2.536 QT
26.037 1.927 25.521 0.927 QT
25.005 -0.073 25.005 -1.183 QT
25.005 -2.011 25.302 -2.815 QT
25.599 -3.62 26.13 -4.237 QT
26.662 -4.854 27.404 -5.222 QT
28.146 -5.589 29.005 -5.589 QT
29.849 -5.589 30.599 -5.222 QT
31.349 -4.854 31.88 -4.222 QT
32.412 -3.589 32.701 -2.815 QT
32.99 -2.042 32.99 -1.183 QT
32.99 -0.073 32.474 0.927 QT
31.958 1.927 31.044 2.536 QT
30.13 3.146 29.005 3.146 QT
cp
27.005 1.583 M
27.365 2.13 27.88 2.458 QT
28.396 2.786 29.005 2.786 QT
29.396 2.786 29.771 2.63 QT
30.146 2.474 30.458 2.192 QT
30.771 1.911 30.99 1.583 QT
31.693 0.505 31.693 -1.386 QT
31.693 -3.104 30.99 -4.12 QT
30.63 -4.62 30.107 -4.925 QT
29.583 -5.229 29.005 -5.229 QT
28.412 -5.229 27.888 -4.925 QT
27.365 -4.62 27.005 -4.12 QT
26.724 -3.729 26.576 -3.284 QT
26.427 -2.839 26.357 -2.362 QT
26.287 -1.886 26.287 -1.386 QT
26.287 -0.839 26.349 -0.315 QT
26.412 0.208 26.583 0.7 QT
26.755 1.192 27.005 1.583 QT
cp}def
f350596035
f
GR
GS
[0.75 0 0 0.75 1201.38281 82.29635] CT
N
/f-1234088681{34.917 2.88 M
34.917 -4.229 L
34.917 -4.542 34.823 -4.69 QT
34.729 -4.839 34.542 -4.87 QT
34.354 -4.901 33.979 -4.901 QT
33.979 -5.323 L
35.761 -5.448 L
35.761 -1.698 L
35.948 -1.917 36.214 -2.081 QT
36.479 -2.245 36.784 -2.331 QT
37.089 -2.417 37.417 -2.417 QT
37.948 -2.417 38.409 -2.206 QT
38.87 -1.995 39.214 -1.612 QT
39.557 -1.229 39.745 -0.737 QT
39.932 -0.245 39.932 0.286 QT
39.932 1.021 39.581 1.646 QT
39.229 2.271 38.612 2.646 QT
37.995 3.021 37.261 3.021 QT
36.807 3.021 36.378 2.786 QT
35.948 2.552 35.667 2.161 QT
35.261 2.88 L
34.917 2.88 L
cp
35.792 1.708 M
35.995 2.146 36.37 2.419 QT
36.745 2.692 37.198 2.692 QT
37.823 2.692 38.206 2.341 QT
38.589 1.989 38.737 1.442 QT
38.886 0.896 38.886 0.286 QT
38.886 -0.729 38.62 -1.245 QT
38.511 -1.479 38.307 -1.683 QT
38.104 -1.886 37.854 -2.003 QT
37.604 -2.12 37.323 -2.12 QT
36.854 -2.12 36.44 -1.862 QT
36.026 -1.604 35.792 -1.183 QT
35.792 1.708 L
cp}def
f-1234088681
f
GR
GS
[0.75 0 0 0.75 0 0.5] CT
1 0 0 RC
1 LJ
2.667 LW
N
1558.987 109.062 M
1598.854 109.062 L
S
GR
GS
[0.75 0 0 0.75 1201.38281 93.45365] CT
N
f1944532930
f
GR
GS
[0.75 0 0 0.75 1201.38281 93.45365] CT
N
f-357217629
f
GR
GS
[0.75 0 0 0.75 1201.38281 93.45365] CT
N
f1694350474
f
GR
GS
[0.75 0 0 0.75 1201.38281 93.45365] CT
N
f350596035
f
GR
GS
[0.75 0 0 0.75 1201.38281 93.45365] CT
N
f-1234088681
f
GR
GS
[0.75 0 0 0.75 1201.38281 93.45365] CT
N
/f666931537{40.74 2.911 M
40.74 0.958 L
40.74 0.864 40.833 0.864 QT
40.99 0.864 L
41.052 0.864 41.083 0.958 QT
41.412 2.692 42.693 2.692 QT
43.271 2.692 43.654 2.435 QT
44.037 2.177 44.037 1.646 QT
44.037 1.255 43.732 0.982 QT
43.427 0.708 43.021 0.614 QT
42.224 0.458 L
41.818 0.364 41.49 0.185 QT
41.162 0.005 40.951 -0.3 QT
40.74 -0.604 40.74 -0.995 QT
40.74 -1.526 41.013 -1.862 QT
41.287 -2.198 41.732 -2.347 QT
42.177 -2.495 42.693 -2.495 QT
43.318 -2.495 43.771 -2.167 QT
44.115 -2.464 L
44.115 -2.495 44.177 -2.495 QT
44.255 -2.495 L
44.302 -2.495 44.326 -2.464 QT
44.349 -2.433 44.349 -2.401 QT
44.349 -0.823 L
44.349 -0.714 44.255 -0.714 QT
44.115 -0.714 L
44.005 -0.714 44.005 -0.823 QT
44.005 -1.464 43.662 -1.839 QT
43.318 -2.214 42.677 -2.214 QT
42.146 -2.214 41.748 -2.018 QT
41.349 -1.823 41.349 -1.339 QT
41.349 -0.995 41.638 -0.784 QT
41.927 -0.573 42.302 -0.479 QT
43.115 -0.323 L
43.521 -0.229 43.88 -0.011 QT
44.24 0.208 44.443 0.552 QT
44.646 0.896 44.646 1.317 QT
44.646 1.755 44.498 2.075 QT
44.349 2.396 44.083 2.607 QT
43.818 2.817 43.458 2.919 QT
43.099 3.021 42.693 3.021 QT
41.943 3.021 41.412 2.505 QT
40.974 2.989 L
40.974 3.021 40.912 3.021 QT
40.833 3.021 L
40.74 3.021 40.74 2.911 QT
cp}def
f666931537
f
GR
GS
[0.75 0 0 0.75 0 0.5] CT
0 1 0 RC
1 LJ
2.667 LW
N
1558.987 123.938 M
1598.854 123.938 L
S
GR
GS
[0.75 0 0 0.75 1201.38281 104.61093] CT
N
f629474577
f
GR
GS
[0.75 0 0 0.75 1201.38281 104.61093] CT
N
f1700453028
f
GR
GS
[0.75 0 0 0.75 1201.38281 104.61093] CT
N
/f1405228822{20.005 3.146 M
18.865 3.146 17.951 2.536 QT
17.037 1.927 16.521 0.927 QT
16.005 -0.073 16.005 -1.183 QT
16.005 -2.011 16.302 -2.815 QT
16.599 -3.62 17.13 -4.237 QT
17.662 -4.854 18.404 -5.222 QT
19.146 -5.589 20.005 -5.589 QT
20.849 -5.589 21.599 -5.222 QT
22.349 -4.854 22.88 -4.222 QT
23.412 -3.589 23.701 -2.815 QT
23.99 -2.042 23.99 -1.183 QT
23.99 -0.073 23.474 0.927 QT
22.958 1.927 22.044 2.536 QT
21.13 3.146 20.005 3.146 QT
cp
18.005 1.583 M
18.365 2.13 18.88 2.458 QT
19.396 2.786 20.005 2.786 QT
20.396 2.786 20.771 2.63 QT
21.146 2.474 21.458 2.192 QT
21.771 1.911 21.99 1.583 QT
22.693 0.505 22.693 -1.386 QT
22.693 -3.104 21.99 -4.12 QT
21.63 -4.62 21.107 -4.925 QT
20.583 -5.229 20.005 -5.229 QT
19.412 -5.229 18.888 -4.925 QT
18.365 -4.62 18.005 -4.12 QT
17.724 -3.729 17.576 -3.284 QT
17.427 -2.839 17.357 -2.362 QT
17.287 -1.886 17.287 -1.386 QT
17.287 -0.839 17.349 -0.315 QT
17.412 0.208 17.583 0.7 QT
17.755 1.192 18.005 1.583 QT
cp}def
f1405228822
f
GR
GS
[0.75 0 0 0.75 1201.38281 104.61093] CT
N
/f-2017356293{25.917 2.88 M
25.917 -4.229 L
25.917 -4.542 25.823 -4.69 QT
25.729 -4.839 25.542 -4.87 QT
25.354 -4.901 24.979 -4.901 QT
24.979 -5.323 L
26.76 -5.448 L
26.76 -1.698 L
26.948 -1.917 27.214 -2.081 QT
27.479 -2.245 27.784 -2.331 QT
28.089 -2.417 28.417 -2.417 QT
28.948 -2.417 29.409 -2.206 QT
29.87 -1.995 30.214 -1.612 QT
30.557 -1.229 30.745 -0.737 QT
30.932 -0.245 30.932 0.286 QT
30.932 1.021 30.581 1.646 QT
30.229 2.271 29.612 2.646 QT
28.995 3.021 28.26 3.021 QT
27.807 3.021 27.378 2.786 QT
26.948 2.552 26.667 2.161 QT
26.26 2.88 L
25.917 2.88 L
cp
26.792 1.708 M
26.995 2.146 27.37 2.419 QT
27.745 2.692 28.198 2.692 QT
28.823 2.692 29.206 2.341 QT
29.589 1.989 29.737 1.442 QT
29.885 0.896 29.885 0.286 QT
29.885 -0.729 29.62 -1.245 QT
29.51 -1.479 29.307 -1.683 QT
29.104 -1.886 28.854 -2.003 QT
28.604 -2.12 28.323 -2.12 QT
27.854 -2.12 27.44 -1.862 QT
27.026 -1.604 26.792 -1.183 QT
26.792 1.708 L
cp}def
f-2017356293
f
GR
GS
[0.75 0 0 0.75 1201.38281 104.61093] CT
N
/f-145492987{31.74 2.911 M
31.74 0.958 L
31.74 0.864 31.833 0.864 QT
31.99 0.864 L
32.052 0.864 32.083 0.958 QT
32.412 2.692 33.693 2.692 QT
34.271 2.692 34.654 2.435 QT
35.037 2.177 35.037 1.646 QT
35.037 1.255 34.732 0.982 QT
34.427 0.708 34.021 0.614 QT
33.224 0.458 L
32.818 0.364 32.49 0.185 QT
32.162 0.005 31.951 -0.3 QT
31.74 -0.604 31.74 -0.995 QT
31.74 -1.526 32.013 -1.862 QT
32.287 -2.198 32.732 -2.347 QT
33.177 -2.495 33.693 -2.495 QT
34.318 -2.495 34.771 -2.167 QT
35.115 -2.464 L
35.115 -2.495 35.177 -2.495 QT
35.255 -2.495 L
35.302 -2.495 35.326 -2.464 QT
35.349 -2.433 35.349 -2.401 QT
35.349 -0.823 L
35.349 -0.714 35.255 -0.714 QT
35.115 -0.714 L
35.005 -0.714 35.005 -0.823 QT
35.005 -1.464 34.662 -1.839 QT
34.318 -2.214 33.677 -2.214 QT
33.146 -2.214 32.747 -2.018 QT
32.349 -1.823 32.349 -1.339 QT
32.349 -0.995 32.638 -0.784 QT
32.927 -0.573 33.302 -0.479 QT
34.115 -0.323 L
34.521 -0.229 34.88 -0.011 QT
35.24 0.208 35.443 0.552 QT
35.646 0.896 35.646 1.317 QT
35.646 1.755 35.497 2.075 QT
35.349 2.396 35.083 2.607 QT
34.818 2.817 34.458 2.919 QT
34.099 3.021 33.693 3.021 QT
32.943 3.021 32.412 2.505 QT
31.974 2.989 L
31.974 3.021 31.912 3.021 QT
31.833 3.021 L
31.74 3.021 31.74 2.911 QT
cp}def
f-145492987
f
GR
GS
[0.75 0 0 0.75 0 0.5] CT
1 0 1 RC
1 LJ
2.667 LW
N
1558.987 138.815 M
1598.854 138.815 L
S
GR
GS
[0.75 0 0 0.75 0 0.5] CT
0.149 GC
10.0 ML
0.667 LW
N
1555 148 M
1555 85 L
1655 85 L
1655 148 L
cp
S
GR
%%Trailer
%%Pages: 1
%%EOF
