t x y theta dxdt dydt dthetadt
0.000000 0.000000 0.000000 1.105445 -0.073009 -0.043770 0.001372
0.033333 -0.002486 -0.001477 1.103515 -0.077927 -0.045124 0.002918
0.066667 -0.005148 -0.002998 1.105935 -0.082969 -0.046499 0.005662
0.100000 -0.007989 -0.004566 1.109164 -0.088131 -0.047894 0.007171
0.133333 -0.010989 -0.006181 1.106366 -0.093413 -0.049307 0.007611
0.166667 -0.014176 -0.007843 1.113894 -0.098818 -0.050738 0.008865
0.200000 -0.017529 -0.009555 1.108190 -0.104345 -0.052186 0.009055
0.233333 -0.021054 -0.011317 1.111652 -0.109996 -0.053651 0.009495
0.266667 -0.024775 -0.013127 1.110496 -0.115772 -0.055132 0.008382
0.300000 -0.028696 -0.014987 1.103197 -0.121676 -0.056629 0.006867
0.333333 -0.032821 -0.016896 1.112349 -0.127705 -0.058141 0.005588
0.366667 -0.037153 -0.018856 1.103208 -0.133857 -0.059670 0.004040
0.400000 -0.041695 -0.020866 1.109666 -0.140130 -0.061216 0.001735
0.433333 -0.046451 -0.022928 1.118988 -0.146516 -0.062780 -0.001544
0.466667 -0.051424 -0.025041 1.105214 -0.153010 -0.064363 -0.004149
0.500000 -0.056617 -0.027207 1.114695 -0.159605 -0.065968 -0.007510
0.533333 -0.062021 -0.029430 1.111694 -0.166297 -0.067596 -0.011505
0.566667 -0.067651 -0.031707 1.110599 -0.173084 -0.069248 -0.015314
0.600000 -0.073512 -0.034037 1.107235 -0.179966 -0.070923 -0.017900
0.633333 -0.079606 -0.036421 1.109220 -0.186946 -0.072622 -0.018768
0.666667 -0.085937 -0.038860 1.108004 -0.194025 -0.074344 -0.019587
0.700000 -0.092501 -0.041360 1.103566 -0.201208 -0.076089 -0.018190
0.733333 -0.099302 -0.043923 1.100686 -0.208495 -0.077855 -0.013563
0.766667 -0.106346 -0.046548 1.105501 -0.215888 -0.079640 -0.009645
0.800000 -0.113640 -0.049230 1.103045 -0.223389 -0.081442 -0.005356
0.833333 -0.121185 -0.051968 1.107856 -0.230997 -0.083260 -0.001374
0.866667 -0.128987 -0.054772 1.096535 -0.238714 -0.085090 0.003209
0.900000 -0.137046 -0.057633 1.112751 -0.246541 -0.086933 0.005264
0.933333 -0.145372 -0.060560 1.100448 -0.254481 -0.088788 0.004579
0.966667 -0.153968 -0.063555 1.103917 -0.262535 -0.090656 0.005932
1.000000 -0.162832 -0.066608 1.107515 -0.270705 -0.092539 0.008437
1.033333 -0.171964 -0.069720 1.110456 -0.278994 -0.094438 0.011609
1.066667 -0.181370 -0.072890 1.113471 -0.287408 -0.096358 0.018657
1.100000 -0.191064 -0.076130 1.100929 -0.295948 -0.098299 0.041614
1.133333 -0.201037 -0.079429 1.102911 -0.304612 -0.100262 0.086198
1.166667 -0.211309 -0.082800 1.107055 -0.313400 -0.102246 0.161490
1.200000 -0.221863 -0.086230 1.104940 -0.322308 -0.104250 0.275644
1.233333 -0.232727 -0.089733 1.103034 -0.331332 -0.106273 0.443575
1.266667 -0.243904 -0.093310 1.108290 -0.340461 -0.108308 0.673771
1.300000 -0.255370 -0.096947 1.117077 -0.349690 -0.110355 0.961606
1.333333 -0.267160 -0.100658 1.127870 -0.359017 -0.112410 1.301525
1.366667 -0.279278 -0.104446 1.122153 -0.368438 -0.114473 1.685031
1.400000 -0.291728 -0.108309 1.177276 -0.377945 -0.116539 2.101377
1.433333 -0.304476 -0.112232 1.265522 -0.387536 -0.118609 2.528787
1.466667 -0.317524 -0.116215 1.365340 -0.397209 -0.120681 2.943244
1.500000 -0.330874 -0.120257 1.506434 -0.406964 -0.122759 3.328730
1.533333 -0.344570 -0.124376 1.612134 -0.416799 -0.124841 3.683097
1.566667 -0.358615 -0.128573 1.772557 -0.426713 -0.126928 3.995149
1.600000 -0.373010 -0.132846 1.974658 -0.436705 -0.129023 4.263141
1.633333 -0.387714 -0.137179 2.147666 -0.446770 -0.131124 4.490573
1.666667 -0.402770 -0.141588 2.269881 -0.456898 -0.133229 4.693832
1.700000 -0.418137 -0.146055 2.430791 -0.467073 -0.135332 4.886572
1.733333 -0.433858 -0.150598 2.565401 -0.477284 -0.137429 5.065036
1.766667 -0.449933 -0.155216 2.725627 -0.487519 -0.139515 5.231150
1.800000 -0.466360 -0.159908 2.878839 -0.497773 -0.141585 5.381264
1.833333 -0.483138 -0.164672 3.055374 -0.508040 -0.143633 5.506623
1.866667 -0.500266 -0.169507 -3.022904 -0.518317 -0.145653 5.575236
1.900000 -0.517710 -0.174399 -2.800491 -0.528600 -0.147641 5.556278
1.933333 -0.535505 -0.179366 -2.568200 -0.538881 -0.149590 5.428458
1.966667 -0.553618 -0.184388 -2.371557 -0.549156 -0.151494 5.180500
2.000000 -0.572082 -0.189480 -2.142741 -0.559418 -0.153346 4.803778
2.033333 -0.590895 -0.194637 -1.911323 -0.569664 -0.155142 4.302064
2.066667 -0.610058 -0.199856 -1.734824 -0.579896 -0.156875 3.707325
2.100000 -0.629571 -0.205132 -1.594118 -0.590120 -0.158538 3.059758
2.133333 -0.649434 -0.210462 -1.503822 -0.600343 -0.160126 2.404514
2.166667 -0.669648 -0.215840 -1.457041 -0.610566 -0.161635 1.777052
2.200000 -0.690180 -0.221270 -1.476245 -0.620795 -0.163064 1.219360
2.233333 -0.711029 -0.226752 -1.518131 -0.631031 -0.164414 0.764145
2.266667 -0.732193 -0.232285 -1.556773 -0.641271 -0.165690 0.423421
2.300000 -0.753713 -0.237853 -1.596465 -0.651514 -0.166903 0.195533
2.333333 -0.775588 -0.243452 -1.627192 -0.661759 -0.168061 0.061278
2.366667 -0.797819 -0.249080 -1.633646 -0.672006 -0.169178 -0.000925
2.400000 -0.820405 -0.254736 -1.628373 -0.682246 -0.170268 -0.028968
2.433333 -0.843347 -0.260419 -1.604411 -0.692470 -0.171343 -0.067709
2.466667 -0.866600 -0.266149 -1.556040 -0.702672 -0.172417 -0.157912
2.500000 -0.890210 -0.271907 -1.536921 -0.712847 -0.173499 -0.333554
2.533333 -0.914178 -0.277692 -1.508424 -0.722981 -0.174601 -0.612179
2.566667 -0.938453 -0.283523 -1.503836 -0.733065 -0.175728 -1.000273
2.600000 -0.963032 -0.289400 -1.516632 -0.743098 -0.176882 -1.491457
2.633333 -0.987971 -0.295310 -1.545373 -0.753082 -0.178064 -2.055866
2.666667 -1.013268 -0.301257 -1.619471 -0.763006 -0.179272 -2.647482
2.700000 -1.038865 -0.307247 -1.703864 -0.772861 -0.180504 -3.217583
2.733333 -1.064819 -0.313278 -1.798363 -0.782651 -0.181754 -3.722426
2.766667 -1.091069 -0.319352 -1.981878 -0.792373 -0.183020 -4.118051
2.800000 -1.117673 -0.325473 -2.199743 -0.802011 -0.184297 -4.363087
2.833333 -1.144626 -0.331640 -2.449718 -0.811554 -0.185581 -4.432765
2.866667 -1.171868 -0.337848 -2.676562 -0.821000 -0.186866 -4.325146
2.900000 -1.199394 -0.344096 -2.878007 -0.830341 -0.188148 -4.050216
2.933333 -1.227253 -0.350394 -3.061524 -0.839568 -0.189423 -3.621431
2.966667 -1.255392 -0.356731 3.089891 -0.848672 -0.190684 -3.072387
3.000000 -1.283852 -0.363111 3.009675 -0.857660 -0.191931 -2.443899
3.033333 -1.312629 -0.369536 2.960816 -0.866545 -0.193162 -1.780801
3.066667 -1.341724 -0.376007 2.923930 -0.875332 -0.194379 -1.118414
3.100000 -1.371086 -0.382513 2.933791 -0.884026 -0.195582 -0.481874
3.133333 -1.400711 -0.389055 2.970721 -0.892637 -0.196773 0.104130
3.166667 -1.430597 -0.395631 3.019379 -0.901179 -0.197956 0.626085
3.200000 -1.460796 -0.402251 3.069824 -0.909653 -0.199131 1.072070
3.233333 -1.491248 -0.408905 3.088683 -0.918058 -0.200296 1.440737
3.266667 -1.522006 -0.415600 3.114278 -0.926391 -0.201448 1.731802
3.300000 -1.553010 -0.422326 -3.111053 -0.934651 -0.202587 1.944290
3.333333 -1.584316 -0.429101 -3.000726 -0.942826 -0.203705 2.077909
3.366667 -1.615916 -0.435920 -2.887308 -0.950891 -0.204796 2.135847
3.400000 -1.647805 -0.442782 -2.787344 -0.958827 -0.205851 2.129001
3.433333 -1.679923 -0.449672 -2.674041 -0.966615 -0.206863 2.060111
3.466667 -1.712319 -0.456599 -2.572767 -0.974245 -0.207827 1.933178
3.500000 -1.744988 -0.463561 -2.500401 -0.981695 -0.208732 1.754143
3.533333 -1.777872 -0.470548 -2.466710 -0.988963 -0.209575 1.538515
3.566667 -1.811017 -0.477564 -2.438111 -0.996057 -0.210354 1.301055
3.600000 -1.844368 -0.484602 -2.419505 -1.002985 -0.211069 1.051220
3.633333 -1.877966 -0.491663 -2.386780 -1.009748 -0.211719 0.803105
3.666667 -1.911761 -0.498745 -2.360365 -1.016351 -0.212307 0.566700
3.700000 -1.945746 -0.505847 -2.350919 -1.022805 -0.212837 0.350035
3.733333 -1.979961 -0.512964 -2.344235 -1.029109 -0.213313 0.148423
3.766667 -2.014398 -0.520094 -2.340839 -1.035263 -0.213739 -0.041918
3.800000 -2.049051 -0.527235 -2.342400 -1.041259 -0.214120 -0.224366
3.833333 -2.083913 -0.534386 -2.352428 -1.047093 -0.214460 -0.403581
3.866667 -2.118975 -0.541544 -2.364804 -1.052753 -0.214767 -0.580247
3.900000 -2.154195 -0.548716 -2.390717 -1.058225 -0.215046 -0.759540
3.933333 -2.189601 -0.555895 -2.428440 -1.063495 -0.215304 -0.938816
3.966667 -2.225183 -0.563079 -2.456136 -1.068551 -0.215548 -1.121331
4.000000 -2.260935 -0.570268 -2.508498 -1.073384 -0.215783 -1.306979
4.033333 -2.296849 -0.577464 -2.542374 -1.077989 -0.216015 -1.497445
4.066667 -2.332918 -0.584665 -2.600150 -1.082366 -0.216247 -1.691025
4.100000 -2.369133 -0.591873 -2.647196 -1.086510 -0.216483 -1.882397
4.133333 -2.405464 -0.599089 -2.708655 -1.090425 -0.216724 -2.068138
4.166667 -2.441926 -0.606313 -2.785544 -1.094113 -0.216972 -2.235395
4.200000 -2.478510 -0.613549 -2.860849 -1.097578 -0.217228 -2.374363
4.233333 -2.515209 -0.620797 -2.953115 -1.100827 -0.217495 -2.468091
4.266667 -2.551999 -0.628048 -3.041985 -1.103870 -0.217774 -2.509885
4.300000 -2.588893 -0.635315 3.128075 -1.106720 -0.218066 -2.492029
4.333333 -2.625865 -0.642582 3.013528 -1.109388 -0.218374 -2.409644
4.366667 -2.662923 -0.649861 2.886103 -1.111881 -0.218697 -2.263189
4.400000 -2.700062 -0.657152 2.801723 -1.114206 -0.219032 -2.059540
4.433333 -2.737279 -0.664459 2.729141 -1.116364 -0.219373 -1.814900
4.466667 -2.774547 -0.671762 2.670924 -1.118350 -0.219712 -1.539352
4.500000 -2.811885 -0.679083 2.627865 -1.120158 -0.220037 -1.249824
4.533333 -2.849288 -0.686425 2.605743 -1.121780 -0.220340 -0.962906
4.566667 -2.886752 -0.693786 2.596635 -1.123215 -0.220613 -0.698049
4.600000 -2.924276 -0.701168 2.597839 -1.124454 -0.220849 -0.461477
4.633333 -2.961854 -0.708571 2.592563 -1.125494 -0.221042 -0.253215
4.666667 -2.999444 -0.715962 2.594210 -1.126333 -0.221190 -0.075706
4.700000 -3.037038 -0.723341 2.614379 -1.126973 -0.221294 0.078113
4.733333 -3.074669 -0.730736 2.616012 -1.127408 -0.221351 0.218528
4.766667 -3.112290 -0.738117 2.608874 -1.127633 -0.221358 0.359249
4.800000 -3.149896 -0.745480 2.636413 -1.127643 -0.221314 0.500783
4.833333 -3.187516 -0.752854 2.631445 -1.127437 -0.221221 0.646949
4.866667 -3.225141 -0.760236 2.639395 -1.127006 -0.221072 0.802015
4.900000 -3.262765 -0.767624 2.658242 -1.126336 -0.220859 0.966103
4.933333 -3.300375 -0.775014 2.703576 -1.125417 -0.220576 1.133914
4.966667 -3.337935 -0.782380 2.745747 -1.124238 -0.220216 1.297593
5.000000 -3.375460 -0.789741 2.799523 -1.122785 -0.219769 1.461514
5.033333 -3.412939 -0.797093 2.872764 -1.121043 -0.219225 1.617654
5.066667 -3.450346 -0.804417 2.941773 -1.119002 -0.218578 1.759956
5.100000 -3.487674 -0.811710 3.007499 -1.116659 -0.217827 1.880549
5.133333 -3.524919 -0.818980 3.043354 -1.114011 -0.216972 1.981597
5.166667 -3.562071 -0.826217 3.113658 -1.111060 -0.216013 2.064409
5.200000 -3.599122 -0.833420 -3.091859 -1.107812 -0.214950 2.122031
5.233333 -3.636067 -0.840587 -3.003476 -1.104275 -0.213790 2.160510
5.266667 -3.672888 -0.847718 -2.917076 -1.100460 -0.212538 2.194721
5.300000 -3.709575 -0.854809 -2.851369 -1.096383 -0.211199 2.238194
5.333333 -3.746116 -0.861853 -2.772613 -1.092054 -0.209778 2.289707
5.366667 -3.782498 -0.868843 -2.692557 -1.087483 -0.208279 2.352505
5.400000 -3.818711 -0.875773 -2.608905 -1.082687 -0.206711 2.432780
5.433333 -3.854742 -0.882637 -2.551662 -1.077683 -0.205081 2.530227
5.466667 -3.890618 -0.889454 -2.475054 -1.072478 -0.203395 2.619300
5.500000 -3.926333 -0.896225 -2.414852 -1.067073 -0.201653 2.682405
5.533333 -3.961835 -0.902912 -2.378972 -1.061475 -0.199861 2.712471
5.566667 -3.997162 -0.909550 -2.279687 -1.055684 -0.198023 2.695679
5.600000 -4.032308 -0.916136 -2.055212 -1.049696 -0.196136 2.607589
5.633333 -4.067266 -0.922669 -1.913641 -1.043498 -0.194196 2.425726
5.666667 -4.101974 -0.929107 -1.809110 -1.037095 -0.192207 2.149484
5.700000 -4.136481 -0.935489 -1.733856 -1.030484 -0.190172 1.777274
5.733333 -4.170783 -0.941815 -1.684444 -1.023667 -0.188091 1.306567
5.766667 -4.204872 -0.948084 -1.615897 -1.016635 -0.185962 0.744974
5.800000 -4.238675 -0.954248 -1.584315 -1.009390 -0.183787 0.126752
5.833333 -4.272254 -0.960352 -1.575039 -1.001925 -0.181569 -0.518021
5.866667 -4.305527 -0.966346 -1.613219 -0.994226 -0.179300 -1.163167
5.900000 -4.338565 -0.972279 -1.679251 -0.986283 -0.176980 -1.788097
5.933333 -4.371361 -0.978149 -1.774743 -0.978088 -0.174606 -2.369542
5.966667 -4.403911 -0.983956 -1.891191 -0.969635 -0.172182 -2.885799
6.000000 -4.436209 -0.989698 -2.022038 -0.960899 -0.169700 -3.328252
6.033333 -4.468148 -0.995322 -2.143578 -0.951871 -0.167159 -3.690487
6.066667 -4.499824 -1.000880 -2.298401 -0.942536 -0.164556 -3.968830
6.100000 -4.531123 -1.006319 -2.464362 -0.932888 -0.161893 -4.155304
6.133333 -4.562149 -1.011691 -2.627375 -0.922912 -0.159167 -4.248805
6.166667 -4.592780 -1.016945 -2.784531 -0.912616 -0.156386 -4.251025
6.200000 -4.623128 -1.022131 -2.934285 -0.902027 -0.153565 -4.173871
6.233333 -4.653064 -1.027203 -3.095919 -0.891178 -0.150717 -4.020781
6.266667 -4.682709 -1.032206 3.036604 -0.880108 -0.147859 -3.801554
6.300000 -4.711925 -1.037091 2.876885 -0.868861 -0.145005 -3.529689
6.333333 -4.740707 -1.041864 2.780203 -0.857511 -0.142176 -3.222298
6.366667 -4.769055 -1.046526 2.660798 -0.846114 -0.139385 -2.895823
6.400000 -4.797096 -1.051117 2.562274 -0.834726 -0.136643 -2.559098
6.433333 -4.824700 -1.055605 2.497644 -0.823383 -0.133958 -2.228381
6.466667 -4.851866 -1.059996 2.441757 -0.812123 -0.131338 -1.913260
6.500000 -4.878717 -1.064313 2.412289 -0.800954 -0.128787 -1.624391
6.533333 -4.905134 -1.068540 2.382547 -0.789854 -0.126298 -1.360016
6.566667 -4.931230 -1.072695 2.350375 -0.778779 -0.123864 -1.121961
6.600000 -4.957002 -1.076776 2.306293 -0.767694 -0.121474 -0.909873
6.633333 -4.982448 -1.080783 2.282843 -0.756565 -0.119119 -0.718552
6.666667 -5.007566 -1.084718 2.250250 -0.745345 -0.116786 -0.537402
6.700000 -5.032353 -1.088579 2.232190 -0.734003 -0.114464 -0.356326
6.733333 -5.056718 -1.092361 2.233504 -0.722524 -0.112147 -0.171197
6.766667 -5.080661 -1.096063 2.230578 -0.710917 -0.109830 0.024429
6.800000 -5.104182 -1.099687 2.216491 -0.699189 -0.107509 0.231848
6.833333 -5.127280 -1.103231 2.230373 -0.687360 -0.105183 0.451395
6.866667 -5.149955 -1.106696 2.242756 -0.675474 -0.102854 0.673000
6.900000 -5.172203 -1.110081 2.263677 -0.663582 -0.100525 0.892478
6.933333 -5.194110 -1.113392 2.303517 -0.651720 -0.098197 1.103499
6.966667 -5.215674 -1.116631 2.336389 -0.639922 -0.095874 1.300121
7.000000 -5.236806 -1.119789 2.407976 -0.628204 -0.093556 1.474931
7.033333 -5.257503 -1.122864 2.461521 -0.616568 -0.091241 1.624233
7.066667 -5.277856 -1.125867 2.532502 -0.604986 -0.088924 1.748053
7.100000 -5.297767 -1.128785 2.611759 -0.593432 -0.086602 1.841063
7.133333 -5.317334 -1.131632 2.681226 -0.581890 -0.084272 1.902146
7.166667 -5.336555 -1.134407 2.750056 -0.570340 -0.081930 1.928753
7.200000 -5.355432 -1.137111 2.808179 -0.558774 -0.079576 1.925974
7.233333 -5.373858 -1.139725 2.878728 -0.547202 -0.077215 1.893301
7.266667 -5.391940 -1.142269 2.939831 -0.535657 -0.074853 1.835207
7.300000 -5.409678 -1.144743 3.012656 -0.524149 -0.072498 1.756913
7.333333 -5.426967 -1.147123 3.078469 -0.512697 -0.070155 1.662772
7.366667 -5.443810 -1.149410 3.141254 -0.501324 -0.067832 1.556052
7.400000 -5.460210 -1.151602 -3.083349 -0.490060 -0.065539 1.434802
7.433333 -5.476270 -1.153726 -3.040370 -0.478917 -0.063281 1.301555
7.466667 -5.491989 -1.155781 -3.011461 -0.467897 -0.061061 1.154421
7.500000 -5.507369 -1.157769 -2.975488 -0.457020 -0.058884 0.994771
7.533333 -5.522413 -1.159690 -2.951391 -0.446284 -0.056753 0.824879
7.566667 -5.537121 -1.161545 -2.923390 -0.435678 -0.054668 0.647712
7.600000 -5.551494 -1.163333 -2.879181 -0.425175 -0.052626 0.468373
7.633333 -5.565472 -1.165046 -2.865848 -0.414758 -0.050628 0.291275
7.666667 -5.579119 -1.166693 -2.850210 -0.404411 -0.048673 0.117926
7.700000 -5.592384 -1.168270 -2.853857 -0.394123 -0.046760 -0.050977
7.733333 -5.605323 -1.169784 -2.880967 -0.383894 -0.044890 -0.216926
7.766667 -5.617936 -1.171235 -2.901950 -0.373730 -0.043065 -0.380363
7.800000 -5.630226 -1.172624 -2.917076 -0.363646 -0.041288 -0.541829
7.833333 -5.642162 -1.173957 -2.947381 -0.353652 -0.039558 -0.706154
7.866667 -5.653752 -1.175237 -2.955772 -0.343760 -0.037875 -0.874716
7.900000 -5.665026 -1.176457 -2.992193 -0.333969 -0.036240 -1.045452
7.933333 -5.675965 -1.177631 -3.024096 -0.324279 -0.034651 -1.218595
7.966667 -5.686576 -1.178764 -3.043176 -0.314691 -0.033107 -1.386978
8.000000 -5.696878 -1.179838 -3.080627 -0.305208 -0.031602 -1.541184
8.033333 -5.706874 -1.180856 3.134216 -0.295832 -0.030133 -1.664241
8.066667 -5.716567 -1.181817 3.074387 -0.286560 -0.028694 -1.736520
8.100000 -5.725947 -1.182735 2.985708 -0.277397 -0.027279 -1.742837
8.133333 -5.735018 -1.183614 2.897546 -0.268344 -0.025879 -1.664726
8.166667 -5.743786 -1.184451 2.808419 -0.259401 -0.024488 -1.494466
8.200000 -5.752256 -1.185249 2.721352 -0.250564 -0.023100 -1.229151
8.233333 -5.760432 -1.186005 2.646572 -0.241834 -0.021707 -0.878971
8.266667 -5.768319 -1.186719 2.578923 -0.233213 -0.020302 -0.460505
8.300000 -5.775923 -1.187381 2.574878 -0.224702 -0.018880 0.001561
8.333333 -5.783248 -1.187992 2.580473 -0.216302 -0.017439 0.478884
8.366667 -5.790298 -1.188552 2.630555 -0.208012 -0.015979 0.941389
8.400000 -5.797072 -1.189064 2.702029 -0.199833 -0.014503 1.358557
8.433333 -5.803573 -1.189526 2.783518 -0.191765 -0.013018 1.704955
8.466667 -5.809809 -1.189939 2.878178 -0.183807 -0.011533 1.960829
8.500000 -5.815778 -1.190296 2.979478 -0.175959 -0.010055 2.117004
8.533333 -5.821484 -1.190597 3.086391 -0.168225 -0.008590 2.168487
8.566667 -5.826935 -1.190851 -3.098152 -0.160608 -0.007141 2.119541
8.600000 -5.832136 -1.191053 -3.023503 -0.153113 -0.005710 1.981745
8.633333 -5.837088 -1.191211 -2.945054 -0.145744 -0.004297 1.772850
8.666667 -5.841796 -1.191325 -2.878205 -0.138504 -0.002901 1.509148
8.700000 -5.846263 -1.191395 -2.823187 -0.131398 -0.001523 1.209613
8.733333 -5.850493 -1.191424 -2.773043 -0.124428 -0.000162 0.891767
8.766667 -5.854489 -1.191411 -2.768325 -0.117596 0.001180 0.572297
8.800000 -5.858255 -1.191357 -2.757425 -0.110910 0.002502 0.261977
8.833333 -5.861806 -1.191250 -2.771394 -0.104373 0.003802 -0.028554
8.866667 -5.865148 -1.191092 -2.784717 -0.097993 0.005075 -0.288373
8.900000 -5.868286 -1.190883 -2.815469 -0.091772 0.006318 -0.512259
8.933333 -5.871210 -1.190638 -2.838506 -0.085713 0.007524 -0.695476
8.966667 -5.873923 -1.190356 -2.874033 -0.079815 0.008690 -0.835154
9.000000 -5.876428 -1.190037 -2.921477 -0.074076 0.009811 -0.928891
9.033333 -5.878755 -1.189680 -2.951807 -0.068495 0.010883 -0.979844
9.066667 -5.880907 -1.189287 -2.993136 -0.063065 0.011907 -0.992220
9.100000 -5.882893 -1.188862 -3.051889 -0.057786 0.012884 -0.968858
9.133333 -5.884718 -1.188407 -3.085735 -0.052653 0.013817 -0.914374
9.166667 -5.886355 -1.187920 -3.123228 -0.047664 0.014707 -0.835202
9.200000 -5.887845 -1.187411 3.132875 -0.042812 0.015558 -0.737974
