t x y theta dxdt dydt dthetadt
0.000000 0.000000 0.000000 -0.147948 -0.018488 0.151794 0.002097
0.033333 -0.000622 0.005110 -0.142980 -0.018800 0.154982 0.003729
0.066667 -0.001252 0.010320 -0.136546 -0.019111 0.158187 0.001317
0.100000 -0.001895 0.015641 -0.141087 -0.019422 0.161407 0.000067
0.133333 -0.002548 0.021075 -0.148785 -0.019732 0.164642 -0.002574
0.166667 -0.003213 0.026622 -0.141133 -0.020042 0.167891 -0.005076
0.200000 -0.003886 0.032271 -0.134882 -0.020351 0.171154 -0.009894
0.233333 -0.004571 0.038034 -0.144504 -0.020660 0.174431 -0.014075
0.266667 -0.005265 0.043898 -0.138552 -0.020968 0.177719 -0.014910
0.300000 -0.005967 0.049864 -0.140951 -0.021274 0.181016 -0.015995
0.333333 -0.006681 0.055946 -0.145488 -0.021578 0.184315 -0.015393
0.366667 -0.007406 0.062147 -0.149679 -0.021880 0.187613 -0.013582
0.400000 -0.008140 0.068449 -0.149659 -0.022178 0.190908 -0.009390
0.433333 -0.008885 0.074871 -0.142170 -0.022474 0.194198 -0.005212
0.466667 -0.009642 0.081413 -0.152241 -0.022765 0.197480 -0.001241
0.500000 -0.010407 0.088055 -0.147828 -0.023054 0.200758 0.003243
0.533333 -0.011184 0.094818 -0.145673 -0.023339 0.204034 0.006417
0.566667 -0.011968 0.101681 -0.150051 -0.023623 0.207309 0.008653
0.600000 -0.012760 0.108644 -0.141059 -0.023904 0.210584 0.009027
0.633333 -0.013560 0.115704 -0.138433 -0.024183 0.213865 0.008560
0.666667 -0.014367 0.122864 -0.139518 -0.024463 0.217156 0.004350
0.700000 -0.015186 0.130147 -0.146179 -0.024742 0.220457 -0.007675
0.733333 -0.016017 0.137555 -0.145121 -0.025021 0.223769 -0.011949
0.766667 -0.016854 0.145060 -0.146743 -0.025301 0.227094 0.014477
0.800000 -0.017703 0.152690 -0.146618 -0.025581 0.230431 0.107201
0.833333 -0.018564 0.160445 -0.135560 -0.025859 0.233768 0.300518
0.866667 -0.019431 0.168296 -0.145991 -0.026134 0.237094 0.631055
0.900000 -0.020305 0.176240 -0.147615 -0.026405 0.240398 1.129360
0.933333 -0.021190 0.184310 -0.143535 -0.026670 0.243671 1.789500
0.966667 -0.022087 0.192507 -0.152127 -0.026925 0.246897 2.582891
1.000000 -0.022990 0.200794 -0.170671 -0.027171 0.250069 3.448487
1.033333 -0.023904 0.209209 -0.217946 -0.027406 0.253184 4.326409
1.066667 -0.024823 0.217712 -0.058717 -0.027630 0.256245 5.134607
1.100000 -0.025754 0.226342 0.223029 -0.027843 0.259256 5.795753
1.133333 -0.026690 0.235059 0.639472 -0.028044 0.262231 6.238328
1.166667 -0.027631 0.243861 1.048738 -0.028236 0.265188 6.408285
1.200000 -0.028577 0.252747 1.432710 -0.028418 0.268148 6.284505
1.233333 -0.029527 0.261716 1.709816 -0.028593 0.271138 5.854462
1.266667 -0.030482 0.270766 1.971604 -0.028759 0.274178 5.153287
1.300000 -0.031445 0.279951 2.183983 -0.028920 0.277283 4.238218
1.333333 -0.032413 0.289215 2.270462 -0.029075 0.280455 3.203776
1.366667 -0.033384 0.298556 2.312247 -0.029224 0.283692 2.141981
1.400000 -0.034362 0.308031 2.293145 -0.029367 0.286980 1.137838
1.433333 -0.035345 0.317640 2.245040 -0.029502 0.290287 0.263240
1.466667 -0.036334 0.327381 2.160500 -0.029630 0.293589 -0.437063
1.500000 -0.037327 0.337251 2.079760 -0.029750 0.296858 -0.942940
1.533333 -0.038323 0.347247 2.004045 -0.029860 0.300064 -1.269113
1.566667 -0.039323 0.357366 1.910749 -0.029961 0.303172 -1.433751
1.600000 -0.040325 0.367549 1.843044 -0.030053 0.306161 -1.469936
1.633333 -0.041331 0.377849 1.803848 -0.030135 0.309018 -1.410888
1.666667 -0.042337 0.388209 1.764896 -0.030207 0.311731 -1.289373
1.700000 -0.043347 0.398679 1.709951 -0.030270 0.314295 -1.133772
1.733333 -0.044358 0.409205 1.686497 -0.030324 0.316718 -0.964980
1.766667 -0.045372 0.419835 1.671267 -0.030369 0.319018 -0.801663
1.800000 -0.046389 0.430566 1.643055 -0.030405 0.321199 -0.650972
1.833333 -0.047406 0.441344 1.630583 -0.030432 0.323268 -0.514575
1.866667 -0.048423 0.452168 1.628330 -0.030449 0.325231 -0.395566
1.900000 -0.049439 0.463034 1.613563 -0.030457 0.327095 -0.295396
1.933333 -0.050456 0.473981 1.599848 -0.030455 0.328855 -0.209045
1.966667 -0.051474 0.485004 1.598163 -0.030441 0.330505 -0.136887
2.000000 -0.052490 0.496062 1.608172 -0.030416 0.332051 -0.078789
2.033333 -0.053506 0.507184 1.600774 -0.030379 0.333489 -0.035525
2.066667 -0.054522 0.518364 1.598905 -0.030330 0.334815 -0.002936
2.100000 -0.055535 0.529570 1.613507 -0.030268 0.336019 0.020341
2.133333 -0.056546 0.540823 1.611789 -0.030193 0.337099 0.031222
2.166667 -0.057555 0.552115 1.621466 -0.030105 0.338048 0.034907
2.200000 -0.058560 0.563424 1.623664 -0.030004 0.338858 0.034180
2.233333 -0.059562 0.574761 1.618322 -0.029889 0.339525 0.031303
2.266667 -0.060559 0.586121 1.634552 -0.029762 0.340046 0.023082
2.300000 -0.061552 0.597498 1.609507 -0.029621 0.340422 0.014424
2.333333 -0.062539 0.608887 1.620124 -0.029468 0.340652 0.007625
2.366667 -0.063520 0.620282 1.610208 -0.029302 0.340736 0.003375
2.400000 -0.064496 0.631675 1.618206 -0.029123 0.340675 -0.000423
2.433333 -0.065467 0.643062 1.620458 -0.028932 0.340474 -0.003222
2.466667 -0.066433 0.654442 1.620029 -0.028730 0.340133 -0.001366
2.500000 -0.067391 0.665805 1.615568 -0.028516 0.339654 0.000382
2.533333 -0.068341 0.677147 1.625887 -0.028291 0.339040 0.001818
2.566667 -0.069282 0.688463 1.620511 -0.028054 0.338291 0.001459
2.600000 -0.070213 0.699748 1.613687 -0.027805 0.337407 0.001913
2.633333 -0.071138 0.711008 1.613414 -0.027544 0.336386 0.001315
2.666667 -0.072053 0.722227 1.624193 -0.027272 0.335232 -0.000391
2.700000 -0.072961 0.733416 1.617669 -0.026988 0.333946 -0.000818
2.733333 -0.073861 0.744572 1.616113 -0.026694 0.332530 -0.000583
2.766667 -0.074750 0.755671 1.627398 -0.026390 0.330988 -0.001905
2.800000 -0.075627 0.766710 1.614861 -0.026077 0.329326 -0.004601
2.833333 -0.076493 0.777684 1.615125 -0.025757 0.327551 -0.007807
2.866667 -0.077346 0.788588 1.622057 -0.025429 0.325672 -0.012167
2.900000 -0.078187 0.799418 1.619770 -0.025095 0.323702 -0.019179
2.933333 -0.079019 0.810196 1.617057 -0.024757 0.321647 -0.026828
2.966667 -0.079838 0.820892 1.612469 -0.024417 0.319522 -0.031110
3.000000 -0.080648 0.831529 1.621431 -0.024076 0.317333 -0.035205
3.033333 -0.081444 0.842076 1.628209 -0.023733 0.315084 -0.039747
3.066667 -0.082230 0.852559 1.612344 -0.023388 0.312774 -0.044333
3.100000 -0.083002 0.862943 1.599761 -0.023042 0.310399 -0.046531
3.133333 -0.083764 0.873257 1.607219 -0.022693 0.307959 -0.048758
3.166667 -0.084516 0.883500 1.600164 -0.022341 0.305451 -0.060394
3.200000 -0.085257 0.893667 1.607850 -0.021986 0.302873 -0.101589
3.233333 -0.085988 0.903757 1.609479 -0.021628 0.300222 -0.191770
3.266667 -0.086703 0.913730 1.605696 -0.021265 0.297497 -0.354424
3.300000 -0.087407 0.923619 1.598337 -0.020899 0.294691 -0.626890
3.333333 -0.088099 0.933423 1.605025 -0.020526 0.291791 -1.037646
3.366667 -0.088776 0.943098 1.593869 -0.020148 0.288787 -1.587704
3.400000 -0.089441 0.952683 1.586168 -0.019762 0.285662 -2.236186
3.433333 -0.090094 0.962174 1.597297 -0.019369 0.282410 -2.942127
3.466667 -0.090735 0.971569 1.587903 -0.018968 0.279021 -3.659287
3.500000 -0.091365 0.980865 1.486644 -0.018559 0.275494 -4.305601
3.533333 -0.091982 0.990059 1.227962 -0.018143 0.271830 -4.790948
3.566667 -0.092583 0.999111 0.967940 -0.017721 0.268036 -5.062127
3.600000 -0.093168 1.008017 0.697868 -0.017294 0.264125 -5.109415
3.633333 -0.093737 1.016776 0.285959 -0.016863 0.260112 -4.918443
3.666667 -0.094291 1.025384 -0.081723 -0.016428 0.256012 -4.483482
3.700000 -0.094830 1.033839 -0.290677 -0.015993 0.251847 -3.845621
3.733333 -0.095353 1.042138 -0.338276 -0.015558 0.247646 -3.090653
3.766667 -0.095864 1.050321 -0.340954 -0.015124 0.243429 -2.291512
3.800000 -0.096361 1.058383 -0.336199 -0.014693 0.239209 -1.502224
3.833333 -0.096844 1.066288 -0.285492 -0.014265 0.234996 -0.795476
3.866667 -0.097311 1.074034 -0.194629 -0.013839 0.230799 -0.237935
3.900000 -0.097765 1.081654 -0.117603 -0.013416 0.226613 0.140173
3.933333 -0.098206 1.089147 -0.084458 -0.012993 0.222422 0.357792
3.966667 -0.098631 1.096480 -0.089873 -0.012571 0.218217 0.444553
4.000000 -0.099043 1.103682 -0.094230 -0.012148 0.213989 0.425499
4.033333 -0.099441 1.110751 -0.087767 -0.011724 0.209726 0.342254
4.066667 -0.099825 1.117686 -0.091440 -0.011298 0.205415 0.239749
4.100000 -0.100196 1.124485 -0.097408 -0.010870 0.201048 0.150188
4.133333 -0.100552 1.131146 -0.094652 -0.010440 0.196625 0.082803
4.166667 -0.100894 1.137643 -0.089380 -0.010008 0.192142 0.034928
4.200000 -0.101221 1.143998 -0.086016 -0.009573 0.187597 0.007450
4.233333 -0.101534 1.150188 -0.092858 -0.009137 0.182995 -0.002965
4.266667 -0.101831 1.156212 -0.094058 -0.008699 0.178343 -0.003808
4.300000 -0.102114 1.162090 -0.087522 -0.008259 0.173648 -0.003133
4.333333 -0.102382 1.167801 -0.098609 -0.007819 0.168918 -0.002915
4.366667 -0.102634 1.173343 -0.089991 -0.007378 0.164158 -0.001753
4.400000 -0.102873 1.178736 -0.092823 -0.006937 0.159373 -0.000093
4.433333 -0.103097 1.183979 -0.095501 -0.006496 0.154565 0.000916
4.466667 -0.103306 1.189052 -0.094588 -0.006055 0.149734 0.000893
