t x y theta dxdt dydt dthetadt
0.000000 0.000000 0.000000 0.152484 -0.002603 -0.003858 -0.001415
0.033333 -0.000188 0.000163 0.164931 -0.002853 -0.008615 -0.005667
0.066667 -0.000225 -0.000020 0.158449 -0.003635 -0.014260 -0.012332
0.100000 -0.000106 -0.000560 0.145196 -0.005072 -0.021213 -0.022786
0.133333 0.000175 -0.001469 0.150176 -0.007150 -0.029919 -0.037913
0.166667 0.000623 -0.002758 0.155086 -0.010067 -0.040867 -0.061288
0.200000 0.000738 -0.003864 0.156734 -0.014075 -0.054802 -0.089507
0.233333 0.000094 -0.004968 0.155620 -0.019343 -0.072554 -0.118864
0.266667 -0.000990 -0.006591 0.159594 -0.025850 -0.094718 -0.147826
0.300000 -0.001881 -0.008639 0.158629 -0.033461 -0.121453 -0.173117
0.333333 -0.002573 -0.011122 0.139571 -0.042078 -0.153055 -0.193302
0.366667 -0.003056 -0.014052 0.127628 -0.051235 -0.189538 -0.202347
0.400000 -0.004662 -0.019379 0.120886 -0.060050 -0.230248 -0.199081
0.433333 -0.007184 -0.027525 0.090966 -0.067703 -0.274266 -0.184367
0.466667 -0.009470 -0.036144 0.096811 -0.073084 -0.320359 -0.162016
0.500000 -0.012724 -0.047970 0.074169 -0.074672 -0.366932 -0.127520
0.533333 -0.016882 -0.062789 0.070043 -0.070890 -0.411922 -0.081842
0.566667 -0.020766 -0.078092 0.071652 -0.060312 -0.452892 -0.031117
0.600000 -0.024924 -0.095600 0.094227 -0.042017 -0.487484 0.015933
0.633333 -0.028782 -0.113589 0.090652 -0.015216 -0.513531 0.052423
0.666667 -0.032125 -0.133608 0.090783 0.019925 -0.529093 0.075532
0.700000 -0.034019 -0.154899 0.095577 0.061961 -0.533155 0.066130
0.733333 -0.033229 -0.176841 0.108166 0.108891 -0.525145 0.015939
0.766667 -0.032092 -0.199245 0.097705 0.158350 -0.505409 -0.073668
0.800000 -0.025625 -0.219703 0.095277 0.207525 -0.475307 -0.192196
0.833333 -0.013942 -0.236668 0.138191 0.253308 -0.436834 -0.334546
0.866667 -0.001907 -0.254080 0.160014 0.293258 -0.392415 -0.491790
0.900000 0.012220 -0.266340 0.149041 0.325750 -0.344810 -0.642580
0.933333 0.028154 -0.275073 0.111374 0.349915 -0.297230 -0.775648
0.966667 0.044340 -0.281343 0.061378 0.365363 -0.252863 -0.889663
1.000000 0.059574 -0.285917 -0.007498 0.372825 -0.214201 -0.983954
1.033333 0.073187 -0.289330 -0.098529 0.373944 -0.183270 -1.051086
1.066667 0.085000 -0.292086 -0.152575 0.370356 -0.162204 -1.091167
1.100000 0.095190 -0.294173 -0.188458 0.363931 -0.152441 -1.110821
1.133333 0.105693 -0.296806 -0.204770 0.356377 -0.154842 -1.109336
1.166667 0.116510 -0.300003 -0.212945 0.349228 -0.169666 -1.080665
1.200000 0.127641 -0.303782 -0.213758 0.343458 -0.197417 -1.026792
1.233333 0.138371 -0.308269 -0.225736 0.339492 -0.238016 -0.948283
1.266667 0.149693 -0.314576 -0.287404 0.337754 -0.290967 -0.835771
1.300000 0.161332 -0.321515 -0.359720 0.338313 -0.355291 -0.675608
1.333333 0.173289 -0.329103 -0.388035 0.341125 -0.429606 -0.459993
1.366667 0.184861 -0.341025 -0.445625 0.346208 -0.512460 -0.183414
1.400000 0.195908 -0.357555 -0.477231 0.353703 -0.601740 0.159961
1.433333 0.206253 -0.379235 -0.498774 0.363817 -0.695413 0.565994
1.466667 0.216989 -0.406530 -0.487912 0.376424 -0.790566 1.013156
1.500000 0.228063 -0.434503 -0.442758 0.391056 -0.884758 1.468765
1.533333 0.240310 -0.468172 -0.372354 0.406914 -0.975717 1.899588
1.566667 0.252902 -0.502502 -0.273161 0.423077 -1.061788 2.266566
1.600000 0.268710 -0.544028 -0.154914 0.438369 -1.141262 2.536057
1.633333 0.284867 -0.586185 -0.033761 0.451503 -1.213178 2.683374
1.666667 0.301372 -0.628953 0.109884 0.462241 -1.278359 2.699501
1.700000 0.318224 -0.672314 0.247425 0.471169 -1.337639 2.595335
1.733333 0.336479 -0.720249 0.387650 0.479457 -1.392004 2.391978
1.766667 0.355077 -0.768731 0.505384 0.488336 -1.442137 2.124922
1.800000 0.374017 -0.817737 0.595261 0.499207 -1.489660 1.828000
1.833333 0.388385 -0.867238 0.620837 0.513964 -1.535825 1.538169
1.866667 0.399886 -0.919353 0.609197 0.533735 -1.580261 1.289634
1.900000 0.411733 -0.971918 0.576625 0.559732 -1.622525 1.104012
1.933333 0.426733 -1.025880 0.563585 0.592766 -1.662522 0.992998
1.966667 0.442086 -1.080231 0.555901 0.633640 -1.700157 0.953290
2.000000 0.467668 -1.141106 0.569455 0.682450 -1.734309 0.976600
2.033333 0.493600 -1.202300 0.605132 0.738465 -1.763858 1.041997
2.066667 0.519871 -1.263775 0.662548 0.799950 -1.788500 1.120923
2.100000 0.546473 -1.325497 0.747525 0.864167 -1.808083 1.185433
2.133333 0.573395 -1.387426 0.808981 0.928755 -1.822288 1.214033
2.166667 0.600629 -1.449528 0.881092 0.991369 -1.830933 1.190770
2.200000 0.635621 -1.511706 0.940722 1.050434 -1.834975 1.113027
2.233333 0.676873 -1.573099 0.983393 1.104289 -1.835448 0.983935
2.266667 0.718384 -1.634544 1.027130 1.152249 -1.833349 0.815571
2.300000 0.760130 -1.696006 1.046074 1.194136 -1.829603 0.624105
2.333333 0.803636 -1.756832 1.034612 1.229413 -1.825107 0.423029
2.366667 0.847326 -1.817601 1.041021 1.257140 -1.820397 0.230393
2.400000 0.890679 -1.877442 1.028365 1.276971 -1.815505 0.051773
2.433333 0.934164 -1.937157 1.030378 1.289284 -1.810346 -0.107460
2.466667 0.977756 -1.996710 1.030248 1.294420 -1.804766 -0.244345
2.500000 1.021641 -2.057583 0.996930 1.292713 -1.798482 -0.357073
2.533333 1.065584 -2.118223 1.003565 1.284347 -1.791001 -0.450373
2.566667 1.109556 -2.178594 0.978729 1.270289 -1.782168 -0.530418
2.600000 1.153533 -2.238660 0.955968 1.250538 -1.771701 -0.599270
2.633333 1.197489 -2.298384 0.927788 1.224841 -1.759238 -0.655821
2.666667 1.241399 -2.357732 0.898298 1.192950 -1.744422 -0.701131
2.700000 1.280694 -2.415369 0.883789 1.154833 -1.727297 -0.741259
2.733333 1.319896 -2.472562 0.857088 1.110884 -1.708161 -0.775192
2.766667 1.355579 -2.529644 0.817818 1.060972 -1.686874 -0.802090
2.800000 1.391131 -2.586216 0.790266 1.005555 -1.663365 -0.822956
2.833333 1.426537 -2.642245 0.767401 0.945464 -1.637772 -0.842089
2.866667 1.456849 -2.696360 0.742804 0.881947 -1.610348 -0.862407
2.900000 1.486985 -2.749869 0.707480 0.815531 -1.580470 -0.883873
2.933333 1.513682 -2.802762 0.684888 0.746864 -1.546985 -0.904726
2.966667 1.536278 -2.853918 0.654950 0.677003 -1.509089 -0.927321
3.000000 1.558677 -2.904381 0.624384 0.606734 -1.465980 -0.952439
3.033333 1.578409 -2.954623 0.605197 0.536498 -1.416083 -0.979323
3.066667 1.594681 -3.003799 0.546223 0.466188 -1.357630 -1.004494
3.100000 1.605512 -3.048614 0.516968 0.397023 -1.290210 -1.025922
3.133333 1.616155 -3.092631 0.491778 0.329884 -1.213621 -1.046335
3.166667 1.626618 -3.135826 0.455072 0.265299 -1.127968 -1.065008
3.200000 1.636912 -3.178175 0.420738 0.203854 -1.032875 -1.080193
3.233333 1.642725 -3.214261 0.366044 0.146527 -0.929809 -1.086834
3.266667 1.644986 -3.243825 0.331289 0.094441 -0.820771 -1.086848
3.300000 1.644386 -3.267641 0.303582 0.048105 -0.707037 -1.076468
3.333333 1.643670 -3.290563 0.268219 0.008661 -0.590848 -1.049545
3.366667 1.640190 -3.304784 0.232192 -0.021958 -0.474825 -1.002668
3.400000 1.636633 -3.318110 0.196552 -0.041451 -0.362682 -0.936517
3.433333 1.633023 -3.330548 0.157611 -0.048266 -0.256534 -0.857104
3.466667 1.628289 -3.333480 0.107619 -0.040741 -0.158513 -0.766972
3.500000 1.623545 -3.335543 0.074071 -0.017779 -0.070713 -0.672920
3.533333 1.619561 -3.330845 0.048752 0.020606 0.004991 -0.582307
3.566667 1.615613 -3.325315 0.034881 0.072990 0.068137 -0.502572
3.600000 1.611724 -3.318977 0.033541 0.137144 0.118601 -0.435544
3.633333 1.612666 -3.310774 0.051045 0.210868 0.155372 -0.383226
3.666667 1.619340 -3.301720 0.051996 0.290932 0.178851 -0.345669
3.700000 1.631843 -3.292502 0.061019 0.373836 0.189478 -0.323133
3.733333 1.650438 -3.283821 0.040020 0.456038 0.188623 -0.311381
3.766667 1.669154 -3.274439 0.027448 0.534697 0.176966 -0.304273
3.800000 1.691907 -3.266990 -0.009585 0.606858 0.156061 -0.294262
3.833333 1.717821 -3.262538 -0.024606 0.669960 0.128665 -0.269789
3.866667 1.743848 -3.257448 -0.040797 0.722360 0.097066 -0.216450
3.900000 1.769980 -3.251737 -0.056996 0.763440 0.063775 -0.115234
3.933333 1.797929 -3.249921 -0.060031 0.793645 0.031339 0.052249
3.966667 1.826881 -3.251803 -0.054630 0.812770 0.003194 0.299711
4.000000 1.855916 -3.253108 -0.061811 0.821416 -0.018042 0.633562
4.033333 1.886189 -3.257574 -0.064045 0.820284 -0.030502 1.052254
4.066667 1.914925 -3.263654 -0.052251 0.810374 -0.032683 1.539644
4.100000 1.943714 -3.269180 -0.040868 0.792312 -0.023079 2.067619
4.133333 1.972544 -3.274158 -0.005371 0.766616 -0.000911 2.591592
4.166667 2.001405 -3.278593 0.067763 0.735648 0.032884 3.074653
4.200000 2.024968 -3.277152 0.195181 0.702571 0.077090 3.478902
4.233333 2.048542 -3.275188 0.366069 0.670490 0.130164 3.771363
4.266667 2.072122 -3.272712 0.640199 0.642315 0.189924 3.925134
4.300000 2.088681 -3.263389 0.860351 0.621550 0.253093 3.929865
4.333333 2.105237 -3.253589 1.076854 0.611721 0.316314 3.792461
4.366667 2.121792 -3.243330 1.244475 0.614653 0.376977 3.517597
4.400000 2.135261 -3.228344 1.357879 0.630176 0.433092 3.123945
4.433333 2.148668 -3.209581 1.417345 0.658292 0.482329 2.641316
4.466667 2.164829 -3.189136 1.439339 0.699040 0.522432 2.115255
4.500000 2.187185 -3.167501 1.475095 0.750757 0.552426 1.577834
4.533333 2.217660 -3.146019 1.522547 0.810056 0.571969 1.055254
4.566667 2.248119 -3.124226 1.549291 0.874132 0.580382 0.577163
4.600000 2.278550 -3.102152 1.560195 0.940794 0.576849 0.157500
4.633333 2.308939 -3.079826 1.565232 1.007293 0.561865 -0.201981
4.666667 2.346852 -3.060137 1.560432 1.069718 0.536752 -0.513061
4.700000 2.384688 -3.040248 1.494629 1.125781 0.502448 -0.776842
4.733333 2.422424 -3.020185 1.448493 1.175182 0.459578 -0.990448
4.766667 2.463324 -3.004438 1.407541 1.217047 0.409683 -1.161059
4.800000 2.508934 -2.992920 1.348027 1.250322 0.355079 -1.288392
4.833333 2.554371 -2.981290 1.290322 1.274243 0.297432 -1.372508
4.866667 2.599605 -2.969563 1.223075 1.289547 0.238105 -1.410668
4.900000 2.645434 -2.962700 1.176140 1.296084 0.178791 -1.412370
4.933333 2.691222 -2.960330 1.115200 1.292679 0.121643 -1.388649
4.966667 2.736718 -2.957899 1.084585 1.278758 0.068346 -1.344523
5.000000 2.779756 -2.959820 1.038623 1.254759 0.019843 -1.287342
5.033333 2.822446 -2.961690 0.987792 1.221130 -0.022926 -1.223115
5.066667 2.864758 -2.963510 0.968069 1.177710 -0.058705 -1.161905
5.100000 2.904618 -2.968756 0.927022 1.124871 -0.086453 -1.103424
5.133333 2.944048 -2.973953 0.886766 1.063703 -0.105969 -1.049936
5.166667 2.983023 -2.979098 0.857428 0.995315 -0.116874 -1.004643
5.200000 3.017899 -2.985301 0.822249 0.920362 -0.119076 -0.968346
5.233333 3.048555 -2.991632 0.784731 0.839724 -0.112227 -0.940807
5.266667 3.074656 -2.997460 0.758890 0.755096 -0.096503 -0.916901
5.300000 3.095787 -3.001845 0.741573 0.668646 -0.072927 -0.897705
5.333333 3.116377 -3.006171 0.717743 0.582190 -0.042116 -0.884544
5.366667 3.136418 -3.010437 0.687208 0.497779 -0.005296 -0.875265
5.400000 3.150951 -3.011419 0.652024 0.417454 0.036101 -0.870882
5.433333 3.160072 -3.008794 0.618286 0.343221 0.079656 -0.873303
5.466667 3.168633 -3.006117 0.594668 0.276085 0.122980 -0.885242
5.500000 3.173223 -2.999341 0.553570 0.216340 0.164074 -0.902770
5.533333 3.177262 -2.992527 0.533804 0.164226 0.200849 -0.922386
5.566667 3.179611 -2.982719 0.511359 0.119659 0.231344 -0.942606
5.600000 3.180871 -2.971024 0.484034 0.082069 0.254240 -0.960158
5.633333 3.181714 -2.958778 0.458979 0.050310 0.269313 -0.972045
5.666667 3.182040 -2.946541 0.417454 0.023671 0.276361 -0.974035
5.700000 3.182287 -2.934863 0.375908 0.001450 0.275648 -0.967966
5.733333 3.182092 -2.924602 0.337261 -0.016970 0.267739 -0.951581
5.766667 3.181303 -2.916324 0.290486 -0.031896 0.253684 -0.922648
5.800000 3.180040 -2.908101 0.246777 -0.042992 0.234371 -0.880179
5.833333 3.178314 -2.899944 0.230055 -0.049343 0.210265 -0.821997
5.866667 3.175576 -2.892923 0.200267 -0.050287 0.182134 -0.748831
5.900000 3.171725 -2.886687 0.185370 -0.045120 0.150711 -0.663264
5.933333 3.167496 -2.881349 0.174967 -0.033250 0.116540 -0.569706
5.966667 3.163112 -2.876631 0.144736 -0.015049 0.080303 -0.475584
6.000000 3.160068 -2.873248 0.115282 0.008356 0.043022 -0.386092
6.033333 3.159556 -2.872261 0.108181 0.035175 0.006120 -0.307519
6.066667 3.158667 -2.871378 0.094269 0.063215 -0.028791 -0.244240
6.100000 3.161596 -2.873591 0.100387 0.089792 -0.060016 -0.195623
6.133333 3.168116 -2.878666 0.105844 0.111754 -0.085336 -0.161379
6.166667 3.176802 -2.885624 0.117924 0.126658 -0.103006 -0.138618
6.200000 3.185127 -2.892666 0.123621 0.132682 -0.111724 -0.126197
6.233333 3.194494 -2.900379 0.122238 0.128597 -0.110681 -0.118052
6.266667 3.202758 -2.907474 0.118422 0.114194 -0.099991 -0.111674
6.300000 3.207576 -2.911999 0.097290 0.090405 -0.080484 -0.103938
6.333333 3.212026 -2.916582 0.086920 0.059362 -0.054533 -0.091455
6.366667 3.216108 -2.921220 0.067138 0.023337 -0.024859 -0.071407
6.400000 3.214391 -2.920257 0.059614 -0.015079 0.005442 -0.040614
6.433333 3.212311 -2.919348 0.065908 -0.053516 0.033157 -0.002841
6.466667 3.206692 -2.913285 0.063271 -0.090172 0.055072 0.042157
6.500000 3.200725 -2.907284 0.075328 -0.124106 0.068666 0.089188
6.533333 3.194422 -2.901351 0.083762 -0.155609 0.072703 0.133425
6.566667 3.187792 -2.895493 0.100957 -0.185163 0.066724 0.168655
6.600000 3.180849 -2.889714 0.104570 -0.214160 0.051225 0.190448
6.633333 3.173602 -2.884022 0.107748 -0.243682 0.027184 0.198177
6.666667 3.166861 -2.882358 0.115281 -0.274824 -0.002960 0.190363
6.700000 3.159720 -2.884513 0.120185 -0.308414 -0.036673 0.170832
6.733333 3.152315 -2.886758 0.137190 -0.344208 -0.071649 0.140862
6.766667 3.142111 -2.891645 0.148152 -0.382185 -0.105698 0.106532
6.800000 3.128527 -2.898493 0.156923 -0.421611 -0.136943 0.069452
6.833333 3.114724 -2.905420 0.155124 -0.462321 -0.163753 0.031850
6.866667 3.094685 -2.912976 0.149513 -0.503508 -0.185704 -0.005584
6.900000 3.074469 -2.920598 0.141573 -0.544384 -0.202995 -0.042855
6.933333 3.054099 -2.928277 0.138336 -0.584833 -0.215914 -0.077588
6.966667 3.033601 -2.936006 0.124751 -0.624374 -0.225156 -0.111380
7.000000 3.012998 -2.943775 0.129925 -0.663052 -0.231731 -0.143101
7.033333 2.992314 -2.951576 0.128709 -0.699950 -0.236589 -0.173449
7.066667 2.971574 -2.959401 0.115054 -0.735223 -0.240448 -0.200024
7.100000 2.945644 -2.967431 0.124025 -0.768588 -0.243699 -0.225028
7.133333 2.919711 -2.975469 0.113879 -0.799432 -0.246660 -0.248097
7.166667 2.889527 -2.983881 0.100619 -0.826857 -0.249407 -0.271528
7.200000 2.859403 -2.992285 0.087170 -0.848829 -0.251794 -0.296813
7.233333 2.829375 -3.000672 0.080787 -0.863348 -0.253644 -0.324877
7.266667 2.797490 -3.009478 0.058754 -0.866958 -0.254596 -0.359901
7.300000 2.764878 -3.018341 0.047177 -0.857004 -0.254311 -0.398362
7.333333 2.732466 -3.027160 0.034930 -0.830362 -0.252191 -0.438112
7.366667 2.703284 -3.035917 0.019173 -0.784403 -0.247261 -0.471022
7.400000 2.674372 -3.044608 0.020996 -0.718273 -0.238672 -0.490135
7.433333 2.645762 -3.053224 0.012783 -0.632547 -0.225706 -0.488221
7.466667 2.617486 -3.061754 0.000072 -0.529734 -0.207923 -0.460259
7.500000 2.589577 -3.070189 -0.034750 -0.412082 -0.184891 -0.405448
7.533333 2.572586 -3.077760 -0.082016 -0.283689 -0.156283 -0.326463
7.566667 2.565964 -3.084448 -0.117138 -0.149762 -0.122713 -0.231174
7.600000 2.569261 -3.089804 -0.150536 -0.015355 -0.084484 -0.126599
7.633333 2.572981 -3.095015 -0.155758 0.115307 -0.041848 -0.020794
7.666667 2.584878 -3.096517 -0.128580 0.238384 0.004910 0.078535
7.700000 2.603908 -3.092469 -0.091905 0.349578 0.055101 0.162205
7.733333 2.623329 -3.088265 -0.056820 0.446342 0.107342 0.221435
7.766667 2.643121 -3.083907 -0.021211 0.527964 0.160692 0.251792
7.800000 2.663268 -3.079401 -0.011872 0.595188 0.213700 0.251881
7.833333 2.683749 -3.074751 -0.007185 0.648772 0.264921 0.221163
7.866667 2.708514 -3.063285 -0.005151 0.689981 0.312383 0.166044
7.900000 2.733568 -3.051689 -0.008265 0.721173 0.354924 0.095861
7.933333 2.759754 -3.035749 -0.025555 0.743734 0.391181 0.022916
7.966667 2.786177 -3.019705 -0.011062 0.758529 0.419998 -0.043754
8.000000 2.813650 -3.002032 -0.020894 0.765449 0.440053 -0.098905
8.033333 2.841550 -2.983717 -0.021745 0.764230 0.449742 -0.138118
8.066667 2.869610 -2.965349 -0.032856 0.755290 0.448820 -0.160698
8.100000 2.896008 -2.948545 -0.038868 0.738664 0.436784 -0.167925
8.133333 2.922515 -2.931725 -0.047313 0.715247 0.414418 -0.163724
8.166667 2.949105 -2.914906 -0.053472 0.685740 0.382334 -0.150846
8.200000 2.971772 -2.901771 -0.070645 0.651621 0.342296 -0.131032
8.233333 2.994479 -2.888668 -0.076289 0.614700 0.296652 -0.106335
8.266667 3.012815 -2.879810 -0.087629 0.576486 0.247697 -0.079437
8.300000 3.031156 -2.871010 -0.079946 0.538186 0.197459 -0.053524
8.333333 3.047149 -2.865887 -0.078536 0.500644 0.147904 -0.029833
8.366667 3.061400 -2.863725 -0.067757 0.464728 0.101441 -0.007251
8.400000 3.074701 -2.864140 -0.071935 0.430441 0.059753 0.013443
8.433333 3.087959 -2.864628 -0.060847 0.397619 0.024233 0.029693
8.466667 3.100851 -2.866714 -0.058283 0.365576 -0.004548 0.041844
8.500000 3.113104 -2.869497 -0.069458 0.333799 -0.025847 0.052088
8.533333 3.124189 -2.872612 -0.067250 0.301816 -0.039801 0.061400
8.566667 3.135193 -2.875789 -0.063443 0.269221 -0.047277 0.067808
8.600000 3.144212 -2.878655 -0.073870 0.236240 -0.049442 0.070048
8.633333 3.153135 -2.881575 -0.067701 0.203101 -0.047472 0.072027
8.666667 3.159845 -2.883615 -0.065078 0.170472 -0.042548 0.074117
8.700000 3.163927 -2.884508 -0.044137 0.139215 -0.036055 0.073307
8.733333 3.165583 -2.884654 -0.030168 0.110182 -0.029074 0.067746
8.766667 3.167130 -2.884848 -0.042472 0.084233 -0.022368 0.059137
8.800000 3.167881 -2.884749 -0.040870 0.061842 -0.016365 0.049188
8.833333 3.168317 -2.884751 -0.045876 0.043496 -0.011486 0.037205
8.866667 3.168771 -2.884952 -0.040553 0.029301 -0.007836 0.022579
8.900000 3.168902 -2.885014 -0.035053 0.018916 -0.005296 0.008776
8.933333 3.168934 -2.885119 -0.043751 0.011754 -0.003631 -0.000206
8.966667 3.168867 -2.885266 -0.046934 0.007114 -0.002574 -0.006735
9.000000 3.168621 -2.885397 -0.042671 0.004362 -0.001896 -0.011920
9.033333 3.168845 -2.885630 -0.044017 0.002809 -0.001385 -0.014991
