t x y theta dxdt dydt dthetadt
0.000000 0.000000 0.000000 1.436355 -0.119295 -0.045081 2.033605
0.033333 -0.004022 -0.001297 1.481587 -0.122506 -0.049410 1.816780
0.066667 -0.008234 -0.002630 1.509738 -0.125981 -0.055046 1.615908
0.100000 -0.012640 -0.003998 1.507870 -0.129738 -0.062055 1.447890
0.133333 -0.017036 -0.005637 1.502843 -0.133783 -0.070376 1.324604
0.166667 -0.021475 -0.007642 1.486426 -0.138135 -0.079819 1.246617
0.200000 -0.025985 -0.010092 1.536112 -0.142839 -0.090085 1.205555
0.233333 -0.030615 -0.013055 1.647050 -0.147952 -0.100779 1.180072
0.266667 -0.035416 -0.016598 1.716763 -0.153523 -0.111498 1.158294
0.300000 -0.040433 -0.020757 1.772897 -0.159637 -0.121822 1.131202
0.333333 -0.045729 -0.025536 1.822664 -0.166423 -0.131365 1.087845
0.366667 -0.051356 -0.030918 1.863952 -0.174031 -0.139778 1.010434
0.400000 -0.057212 -0.036319 1.882221 -0.182656 -0.146797 0.889734
0.433333 -0.063302 -0.041734 1.895579 -0.192418 -0.152263 0.721428
0.466667 -0.069630 -0.047158 1.901832 -0.203428 -0.156105 0.490379
0.500000 -0.076199 -0.052586 1.916949 -0.215706 -0.158363 0.181110
0.533333 -0.083012 -0.058016 1.933400 -0.229196 -0.159179 -0.214366
0.566667 -0.090476 -0.063620 1.954829 -0.243785 -0.158745 -0.691565
0.600000 -0.098191 -0.069215 1.983762 -0.259244 -0.157278 -1.244376
0.633333 -0.106695 -0.074758 2.003765 -0.275395 -0.154920 -1.858466
0.666667 -0.116074 -0.080129 1.999109 -0.292012 -0.151780 -2.507642
0.700000 -0.126405 -0.085215 1.914014 -0.308853 -0.147940 -3.150601
0.733333 -0.137740 -0.089918 1.771029 -0.325693 -0.143399 -3.752530
0.766667 -0.149332 -0.094590 1.557491 -0.342323 -0.138177 -4.277452
0.800000 -0.161180 -0.099228 1.310440 -0.358596 -0.132266 -4.690832
0.833333 -0.173285 -0.103830 1.052333 -0.374360 -0.125724 -4.963357
0.866667 -0.185644 -0.108390 0.852815 -0.389564 -0.118584 -5.079506
0.900000 -0.199031 -0.112265 0.643758 -0.404213 -0.110861 -5.045557
0.933333 -0.212670 -0.116093 0.456736 -0.418370 -0.102609 -4.873885
0.966667 -0.227201 -0.119212 0.284467 -0.432023 -0.093959 -4.587275
1.000000 -0.241979 -0.122279 0.128302 -0.445151 -0.085030 -4.215461
1.033333 -0.257002 -0.125291 0.028509 -0.457716 -0.075945 -3.796997
1.066667 -0.272653 -0.127660 -0.074231 -0.469590 -0.066878 -3.358832
1.100000 -0.288874 -0.129416 -0.190616 -0.480687 -0.058023 -2.920264
1.133333 -0.305330 -0.131116 -0.293926 -0.490893 -0.049554 -2.493472
1.166667 -0.322148 -0.132310 -0.357905 -0.500210 -0.041520 -2.088202
1.200000 -0.339192 -0.133446 -0.420902 -0.508645 -0.033999 -1.710836
1.233333 -0.356471 -0.134175 -0.461454 -0.516223 -0.027089 -1.360465
1.266667 -0.373968 -0.134846 -0.500520 -0.523033 -0.020815 -1.038081
1.300000 -0.391679 -0.135460 -0.521426 -0.529158 -0.015131 -0.745377
1.333333 -0.409505 -0.135814 -0.530954 -0.534688 -0.010009 -0.485452
1.366667 -0.427458 -0.135931 -0.512864 -0.539702 -0.005428 -0.260571
1.400000 -0.445552 -0.135842 -0.514463 -0.544289 -0.001372 -0.068005
1.433333 -0.463841 -0.135700 -0.510680 -0.548548 0.002242 0.094566
1.466667 -0.482322 -0.135507 -0.504500 -0.552563 0.005463 0.226579
1.500000 -0.500884 -0.135198 -0.479850 -0.556388 0.008284 0.329310
1.533333 -0.519519 -0.134792 -0.469902 -0.560071 0.010731 0.405472
1.566667 -0.538234 -0.134311 -0.457896 -0.563644 0.012828 0.462170
1.600000 -0.557005 -0.133779 -0.443114 -0.567143 0.014636 0.498222
1.633333 -0.575946 -0.133203 -0.412492 -0.570597 0.016186 0.511409
1.666667 -0.595052 -0.132585 -0.388206 -0.574009 0.017511 0.504322
1.700000 -0.614263 -0.131947 -0.371383 -0.577392 0.018658 0.480189
1.733333 -0.633548 -0.131306 -0.340977 -0.580755 0.019671 0.442126
1.766667 -0.652985 -0.130628 -0.322142 -0.584091 0.020578 0.390352
1.800000 -0.672571 -0.129916 -0.316151 -0.587373 0.021396 0.332782
1.833333 -0.692170 -0.129192 -0.293297 -0.590572 0.022136 0.278302
1.866667 -0.711910 -0.128436 -0.292672 -0.593670 0.022807 0.230743
1.900000 -0.731785 -0.127652 -0.286547 -0.596628 0.023400 0.193428
1.933333 -0.751792 -0.126841 -0.294905 -0.599399 0.023896 0.169992
1.966667 -0.771926 -0.126004 -0.313335 -0.601947 0.024276 0.165392
2.000000 -0.792011 -0.125172 -0.312221 -0.604257 0.024521 0.173122
2.033333 -0.812216 -0.124319 -0.311751 -0.606322 0.024622 0.190740
2.066667 -0.832535 -0.123446 -0.296422 -0.608142 0.024572 0.214640
2.100000 -0.852966 -0.122555 -0.285468 -0.609746 0.024382 0.243437
2.133333 -0.873505 -0.121648 -0.262764 -0.611172 0.024064 0.268564
2.166667 -0.893981 -0.120804 -0.246440 -0.612458 0.023628 0.280719
2.200000 -0.914382 -0.120035 -0.245998 -0.613629 0.023085 0.286308
2.233333 -0.934713 -0.119337 -0.230913 -0.614719 0.022451 0.281719
2.266667 -0.955137 -0.118630 -0.216481 -0.615769 0.021750 0.268827
2.300000 -0.975649 -0.117917 -0.185297 -0.616805 0.021003 0.243325
2.333333 -0.996247 -0.117197 -0.205690 -0.617842 0.020218 0.215672
2.366667 -1.016926 -0.116473 -0.198555 -0.618883 0.019404 0.190591
2.400000 -1.037567 -0.115857 -0.203660 -0.619925 0.018565 0.162605
2.433333 -1.058283 -0.115239 -0.175075 -0.620929 0.017682 0.132690
2.466667 -1.079070 -0.114623 -0.194511 -0.621845 0.016728 0.101545
2.500000 -1.099769 -0.114122 -0.182695 -0.622637 0.015684 0.072653
2.533333 -1.120533 -0.113626 -0.165123 -0.623282 0.014540 0.037774
2.566667 -1.141359 -0.113134 -0.173513 -0.623782 0.013299 -0.007133
2.600000 -1.162243 -0.112648 -0.177261 -0.624124 0.011946 -0.056780
2.633333 -1.183184 -0.112169 -0.171476 -0.624330 0.010491 -0.110008
2.666667 -1.204048 -0.111798 -0.173410 -0.624427 0.008941 -0.168293
2.700000 -1.224826 -0.111550 -0.168246 -0.624418 0.007288 -0.229743
2.733333 -1.245650 -0.111314 -0.183302 -0.624312 0.005533 -0.292122
2.766667 -1.266403 -0.111202 -0.196616 -0.624111 0.003671 -0.349329
2.800000 -1.287197 -0.111103 -0.223592 -0.623843 0.001725 -0.404351
2.833333 -1.308031 -0.111018 -0.238414 -0.623528 -0.000290 -0.454123
2.866667 -1.328811 -0.111063 -0.240657 -0.623178 -0.002354 -0.499386
2.900000 -1.349625 -0.111123 -0.296978 -0.622805 -0.004444 -0.539601
2.933333 -1.370370 -0.111319 -0.274292 -0.622421 -0.006534 -0.572353
2.966667 -1.391143 -0.111532 -0.314934 -0.622032 -0.008605 -0.602083
3.000000 -1.411878 -0.111869 -0.331479 -0.621629 -0.010642 -0.631905
3.033333 -1.432549 -0.112329 -0.331479 -0.621196 -0.012630 -0.667277
3.066667 -1.453241 -0.112807 -0.377798 -0.620703 -0.014569 -0.703130
3.100000 -1.473897 -0.113392 -0.411796 -0.620137 -0.016444 -0.742371
3.133333 -1.494571 -0.113994 -0.411796 -0.619467 -0.018259 -0.788006
3.166667 -1.515260 -0.114615 -0.440782 -0.618669 -0.020015 -0.831899
3.200000 -1.535919 -0.115313 -0.473608 -0.617710 -0.021728 -0.870066
3.233333 -1.556533 -0.116087 -0.507151 -0.616575 -0.023415 -0.893622
3.266667 -1.577157 -0.116878 -0.498198 -0.615263 -0.025085 -0.907672
3.300000 -1.597790 -0.117687 -0.585560 -0.613757 -0.026766 -0.905947
3.333333 -1.618327 -0.118575 -0.611961 -0.612040 -0.028488 -0.883668
3.366667 -1.638699 -0.119566 -0.659355 -0.610086 -0.030283 -0.845891
3.400000 -1.658903 -0.120658 -0.691410 -0.607912 -0.032160 -0.790030
3.433333 -1.679108 -0.121768 -0.709555 -0.605492 -0.034150 -0.723670
3.466667 -1.699315 -0.122893 -0.741837 -0.602829 -0.036263 -0.642367
3.500000 -1.719521 -0.124034 -0.745954 -0.599928 -0.038501 -0.560062
3.533333 -1.739509 -0.125330 -0.777658 -0.596836 -0.040838 -0.477912
3.566667 -1.759495 -0.126640 -0.785193 -0.593612 -0.043237 -0.400023
3.600000 -1.779243 -0.128124 -0.778410 -0.590292 -0.045667 -0.334074
3.633333 -1.798987 -0.129621 -0.781598 -0.586964 -0.048066 -0.280389
3.666667 -1.818488 -0.131290 -0.801492 -0.583716 -0.050374 -0.243572
3.700000 -1.837738 -0.133128 -0.813100 -0.580654 -0.052517 -0.214736
3.733333 -1.856983 -0.134976 -0.802015 -0.577840 -0.054452 -0.200150
3.766667 -1.875944 -0.136987 -0.811779 -0.575344 -0.056125 -0.194959
3.800000 -1.894899 -0.139005 -0.809332 -0.573211 -0.057499 -0.195597
3.833333 -1.913848 -0.141028 -0.828259 -0.571456 -0.058536 -0.198542
3.866667 -1.932793 -0.143055 -0.828524 -0.570058 -0.059229 -0.205910
3.900000 -1.951732 -0.145084 -0.838649 -0.568952 -0.059595 -0.218983
3.933333 -1.970666 -0.147114 -0.838855 -0.568090 -0.059627 -0.233873
3.966667 -1.989596 -0.149144 -0.855172 -0.567388 -0.059340 -0.254184
4.000000 -2.008520 -0.151172 -0.858678 -0.566788 -0.058745 -0.278961
4.033333 -2.027440 -0.153195 -0.877451 -0.566237 -0.057877 -0.310546
4.066667 -2.046356 -0.155214 -0.885217 -0.565702 -0.056744 -0.342878
4.100000 -2.065206 -0.157182 -0.877683 -0.565175 -0.055337 -0.374998
4.133333 -2.084010 -0.159066 -0.889559 -0.564651 -0.053680 -0.402957
4.166667 -2.102780 -0.160823 -0.900872 -0.564148 -0.051815 -0.423134
4.200000 -2.121546 -0.162569 -0.928468 -0.563682 -0.049772 -0.431457
4.233333 -2.140308 -0.164303 -0.953518 -0.563264 -0.047566 -0.424243
4.266667 -2.159061 -0.165864 -0.976187 -0.562908 -0.045246 -0.400934
4.300000 -2.177806 -0.167250 -0.998584 -0.562617 -0.042883 -0.359352
4.333333 -2.196547 -0.168622 -1.012275 -0.562389 -0.040521 -0.302229
4.366667 -2.215284 -0.169978 -1.030795 -0.562217 -0.038168 -0.230774
4.400000 -2.234017 -0.171187 -1.036886 -0.562100 -0.035854 -0.151223
4.433333 -2.252747 -0.172260 -1.040536 -0.562038 -0.033629 -0.068729
4.466667 -2.271473 -0.173315 -1.031073 -0.562035 -0.031502 0.009899
4.500000 -2.290195 -0.174352 -1.028428 -0.562105 -0.029455 0.080931
4.533333 -2.308917 -0.175280 -1.013166 -0.562265 -0.027485 0.139518
4.566667 -2.327648 -0.176113 -1.001165 -0.562523 -0.025612 0.181890
4.600000 -2.346373 -0.176926 -0.986434 -0.562891 -0.023831 0.206613
4.633333 -2.365099 -0.177667 -0.990143 -0.563368 -0.022119 0.214447
4.666667 -2.383818 -0.178388 -0.971481 -0.563946 -0.020473 0.206295
4.700000 -2.402583 -0.179038 -0.970506 -0.564615 -0.018903 0.183065
4.733333 -2.421389 -0.179628 -0.955540 -0.565374 -0.017402 0.148496
4.766667 -2.440242 -0.180162 -0.947171 -0.566225 -0.015951 0.107369
4.800000 -2.459149 -0.180645 -0.946278 -0.567151 -0.014546 0.065038
4.833333 -2.478116 -0.181073 -0.939854 -0.568135 -0.013188 0.022497
4.866667 -2.497072 -0.181482 -0.939404 -0.569165 -0.011871 -0.013614
4.900000 -2.516017 -0.181873 -0.947615 -0.570213 -0.010592 -0.042213
4.933333 -2.535050 -0.182192 -0.950829 -0.571249 -0.009358 -0.060970
4.966667 -2.554069 -0.182492 -0.958435 -0.572248 -0.008177 -0.069854
5.000000 -2.573071 -0.182775 -0.983478 -0.573204 -0.007048 -0.069881
5.033333 -2.592219 -0.182979 -0.982724 -0.574110 -0.005973 -0.059781
5.066667 -2.611514 -0.183102 -0.984887 -0.574943 -0.004959 -0.043559
5.100000 -2.630785 -0.183208 -0.979053 -0.575691 -0.004013 -0.022647
5.133333 -2.650033 -0.183298 -0.970858 -0.576324 -0.003137 0.000377
5.166667 -2.669253 -0.183373 -0.972325 -0.576808 -0.002333 0.022676
5.200000 -2.688443 -0.183432 -0.971046 -0.577127 -0.001607 0.042527
5.233333 -2.707601 -0.183477 -0.970470 -0.577311 -0.000958 0.058177
5.266667 -2.726990 -0.183477 -0.965182 -0.577418 -0.000374 0.069772
5.300000 -2.746341 -0.183464 -0.957263 -0.577507 0.000156 0.076750
5.333333 -2.765650 -0.183439 -0.961976 -0.577650 0.000640 0.078893
5.366667 -2.784916 -0.183401 -0.957837 -0.577943 0.001089 0.077556
5.400000 -2.804133 -0.183352 -0.962723 -0.578430 0.001512 0.073891
5.433333 -2.823299 -0.183293 -0.956260 -0.579099 0.001911 0.068674
5.466667 -2.842410 -0.183223 -0.944866 -0.579942 0.002288 0.061437
5.500000 -2.861462 -0.183144 -0.946808 -0.580976 0.002647 0.054208
5.533333 -2.880741 -0.183047 -0.932831 -0.582220 0.002991 0.047082
5.566667 -2.900235 -0.182937 -0.938645 -0.583653 0.003322 0.040698
5.600000 -2.919939 -0.182813 -0.937867 -0.585280 0.003644 0.032717
5.633333 -2.939566 -0.182683 -0.944216 -0.587132 0.003961 0.023274
5.666667 -2.959111 -0.182547 -0.953674 -0.589221 0.004277 0.014556
5.700000 -2.978850 -0.182393 -0.949734 -0.591488 0.004591 0.006223
5.733333 -2.998495 -0.182235 -0.935724 -0.593868 0.004903 -0.002278
5.766667 -3.018043 -0.182075 -0.936123 -0.596347 0.005217 -0.012309
5.800000 -3.037776 -0.181902 -0.936635 -0.598878 0.005533 -0.020986
5.833333 -3.057692 -0.181716 -0.943423 -0.601388 0.005850 -0.027556
5.866667 -3.077814 -0.181518 -0.940974 -0.603788 0.006168 -0.032898
5.900000 -3.098153 -0.181306 -0.939051 -0.606081 0.006494 -0.037674
5.933333 -3.118702 -0.181075 -0.941262 -0.608295 0.006840 -0.039175
5.966667 -3.139110 -0.180846 -0.953302 -0.610440 0.007219 -0.036126
6.000000 -3.159744 -0.180588 -0.955827 -0.612547 0.007640 -0.030202
6.033333 -3.180221 -0.180336 -0.951382 -0.614697 0.008119 -0.023933
6.066667 -3.200532 -0.180089 -0.962340 -0.616957 0.008660 -0.018639
6.100000 -3.221139 -0.179800 -0.963401 -0.619351 0.009264 -0.013995
6.133333 -3.241561 -0.179519 -0.954174 -0.621853 0.009920 -0.012376
6.166667 -3.261789 -0.179247 -0.956439 -0.624369 0.010609 -0.015608
6.200000 -3.282390 -0.178913 -0.938781 -0.626796 0.011311 -0.024507
6.233333 -3.303375 -0.178521 -0.938943 -0.628953 0.011998 -0.036223
6.266667 -3.324761 -0.178066 -0.947035 -0.630633 0.012641 -0.050957
6.300000 -3.346555 -0.177545 -0.952861 -0.631551 0.013202 -0.067454
6.333333 -3.368098 -0.177040 -0.953016 -0.631451 0.013648 -0.083240
6.366667 -3.389378 -0.176552 -0.964186 -0.630127 0.013952 -0.094563
6.400000 -3.410381 -0.176083 -0.967498 -0.627442 0.014096 -0.097595
6.433333 -3.431813 -0.175540 -0.969324 -0.623368 0.014075 -0.092286
6.466667 -3.452942 -0.175020 -0.975416 -0.617981 0.013897 -0.076796
6.500000 -3.473753 -0.174522 -0.986496 -0.611555 0.013594 -0.052707
6.533333 -3.494234 -0.174049 -0.983620 -0.604366 0.013198 -0.023133
6.566667 -3.514369 -0.173602 -0.985337 -0.596689 0.012743 0.007484
6.600000 -3.534146 -0.173183 -0.995765 -0.588819 0.012262 0.035938
6.633333 -3.553550 -0.172793 -0.985972 -0.580985 0.011786 0.059638
6.666667 -3.572567 -0.172435 -0.981189 -0.573362 0.011337 0.075701
6.700000 -3.591183 -0.172108 -0.971190 -0.565938 0.010914 0.082000
6.733333 -3.609385 -0.171816 -0.960504 -0.558765 0.010525 0.079120
6.766667 -3.627969 -0.171465 -0.949209 -0.551825 0.010170 0.067473
6.800000 -3.646110 -0.171151 -0.945541 -0.544970 0.009832 0.047902
6.833333 -3.664606 -0.170779 -0.943608 -0.537990 0.009487 0.021565
6.866667 -3.682630 -0.170446 -0.952910 -0.530729 0.009115 -0.007566
6.900000 -3.700164 -0.170156 -0.956758 -0.523101 0.008707 -0.034768
6.933333 -3.717990 -0.169811 -0.962897 -0.514822 0.008227 -0.056217
6.966667 -3.735294 -0.169512 -0.956403 -0.505790 0.007663 -0.068200
7.000000 -3.752062 -0.169259 -0.964344 -0.495972 0.007006 -0.070495
7.033333 -3.768278 -0.169056 -0.969476 -0.485469 0.006266 -0.061255
7.066667 -3.784712 -0.168808 -0.981060 -0.474208 0.005434 -0.043023
7.100000 -3.800560 -0.168612 -0.990254 -0.462117 0.004498 -0.018497
7.133333 -3.815807 -0.168470 -0.981883 -0.449344 0.003472 0.007033
7.166667 -3.830435 -0.168383 -0.985778 -0.435874 0.002350 0.031089
7.200000 -3.845090 -0.168279 -0.982624 -0.421638 0.001126 0.052177
7.233333 -3.859094 -0.168233 -0.973070 -0.406500 -0.000220 0.067661
7.266667 -3.872430 -0.168248 -0.965688 -0.390506 -0.001689 0.076450
7.300000 -3.885653 -0.168279 -0.953485 -0.373640 -0.003294 0.079016
7.333333 -3.898174 -0.168374 -0.953624 -0.355778 -0.005054 0.079297
7.366667 -3.909977 -0.168535 -0.944975 -0.336809 -0.006996 0.077575
7.400000 -3.921044 -0.168762 -0.949429 -0.316693 -0.009146 0.076984
7.433333 -3.931361 -0.169059 -0.949054 -0.295390 -0.011530 0.078371
7.466667 -3.941172 -0.169445 -0.954877 -0.272716 -0.014188 0.084978
7.500000 -3.950199 -0.169903 -0.956564 -0.248531 -0.017152 0.094205
7.533333 -3.958428 -0.170434 -0.960473 -0.222718 -0.020458 0.102752
7.566667 -3.965842 -0.171039 -0.949142 -0.195230 -0.024118 0.104803
7.600000 -3.972360 -0.171799 -0.953058 -0.166055 -0.028115 0.091154
7.633333 -3.977861 -0.172735 -0.929437 -0.135076 -0.032454 0.051124
7.666667 -3.982502 -0.173748 -0.924243 -0.102351 -0.037112 -0.029059
7.700000 -3.985876 -0.174982 -0.913509 -0.068073 -0.042025 -0.158517
7.733333 -3.987842 -0.176456 -0.902265 -0.032480 -0.047117 -0.349477
7.766667 -3.988909 -0.178010 -0.901974 0.004220 -0.052321 -0.597217
7.800000 -3.988243 -0.179866 -0.898598 0.041944 -0.057609 -0.905432
7.833333 -3.985683 -0.182049 -0.918231 0.080444 -0.062917 -1.262648
7.866667 -3.982193 -0.184312 -0.936881 0.119700 -0.068221 -1.655705
7.900000 -3.977763 -0.186655 -0.993367 0.159839 -0.073542 -2.063798
7.933333 -3.972386 -0.189078 -1.069292 0.201215 -0.078947 -2.457859
7.966667 -3.964554 -0.191934 -1.175773 0.244191 -0.084488 -2.827235
8.000000 -3.955761 -0.194870 -1.306154 0.288988 -0.090191 -3.136324
8.033333 -3.946002 -0.197883 -1.452194 0.335815 -0.096087 -3.367584
8.066667 -3.935270 -0.200973 -1.622477 0.384742 -0.102174 -3.500294
8.100000 -3.923563 -0.204139 -1.703264 0.435936 -0.108452 -3.535071
8.133333 -3.909212 -0.207742 -1.903917 0.489100 -0.114837 -3.471976
8.166667 -3.892213 -0.211736 -2.045992 0.543767 -0.121246 -3.312210
8.200000 -3.872562 -0.216091 -2.187087 0.599529 -0.127590 -3.075730
8.233333 -3.851933 -0.220515 -2.289492 0.656030 -0.133787 -2.779928
8.266667 -3.828647 -0.225234 -2.364915 0.712759 -0.139739 -2.452209
8.300000 -3.802721 -0.230223 -2.437918 0.768905 -0.145308 -2.098207
8.333333 -3.775835 -0.235272 -2.477112 0.824080 -0.150439 -1.744442
8.366667 -3.747996 -0.240379 -2.527427 0.878285 -0.155119 -1.405412
8.400000 -3.717561 -0.245708 -2.558386 0.931508 -0.159353 -1.094525
8.433333 -3.684571 -0.251246 -2.581632 0.983599 -0.163133 -0.819717
8.466667 -3.650662 -0.256832 -2.600488 1.034593 -0.166492 -0.578969
8.500000 -3.615849 -0.262462 -2.608949 1.084711 -0.169501 -0.382489
8.533333 -3.578617 -0.268240 -2.603104 1.133907 -0.172190 -0.222109
8.566667 -3.540513 -0.274056 -2.600333 1.181858 -0.174556 -0.096099
8.600000 -3.500133 -0.279979 -2.603531 1.228250 -0.176598 0.001925
8.633333 -3.457547 -0.285994 -2.583134 1.272930 -0.178333 0.077352
8.666667 -3.414145 -0.292035 -2.577467 1.315770 -0.179765 0.131326
8.700000 -3.368726 -0.298124 -2.568015 1.356551 -0.180881 0.169873
8.733333 -3.321391 -0.304250 -2.557178 1.395235 -0.181679 0.195902
8.766667 -3.273311 -0.310389 -2.561037 1.431792 -0.182163 0.214677
8.800000 -3.224509 -0.316537 -2.550524 1.466272 -0.182345 0.224272
8.833333 -3.175013 -0.322688 -2.552235 1.498848 -0.182233 0.228608
8.866667 -3.124847 -0.328838 -2.540437 1.529595 -0.181844 0.228442
8.900000 -3.073281 -0.334950 -2.530998 1.558668 -0.181208 0.223662
8.933333 -3.020434 -0.341014 -2.520929 1.586195 -0.180367 0.213642
8.966667 -2.966999 -0.347065 -2.502257 1.612315 -0.179367 0.192686
9.000000 -2.912431 -0.353071 -2.496373 1.637060 -0.178254 0.166765
9.033333 -2.856946 -0.359007 -2.494490 1.660271 -0.177073 0.130434
9.066667 -2.800689 -0.364865 -2.481702 1.681813 -0.175869 0.085254
9.100000 -2.743658 -0.370666 -2.468822 1.701585 -0.174693 0.030375
9.133333 -2.686190 -0.376434 -2.496699 1.719507 -0.173574 -0.032268
9.166667 -2.628037 -0.382174 -2.474181 1.735503 -0.172536 -0.098140
9.200000 -2.569511 -0.387871 -2.482227 1.749585 -0.171598 -0.168005
9.233333 -2.510644 -0.393523 -2.496045 1.761842 -0.170797 -0.237670
9.266667 -2.451361 -0.399194 -2.495511 1.772378 -0.170172 -0.308281
9.300000 -2.391802 -0.404810 -2.518399 1.781287 -0.169731 -0.373741
9.333333 -2.331986 -0.410479 -2.530910 1.788616 -0.169480 -0.434602
9.366667 -2.271960 -0.416084 -2.544170 1.794441 -0.169451 -0.489868
9.400000 -2.211754 -0.421622 -2.552573 1.798782 -0.169671 -0.539111
9.433333 -2.151408 -0.427276 -2.588824 1.801650 -0.170108 -0.579870
9.466667 -2.090947 -0.432854 -2.614506 1.803102 -0.170709 -0.617730
9.500000 -2.030406 -0.438351 -2.637427 1.803122 -0.171451 -0.655213
9.533333 -1.969914 -0.444004 -2.653036 1.801668 -0.172323 -0.694180
9.566667 -1.909542 -0.449824 -2.671071 1.798677 -0.173254 -0.732179
9.600000 -1.849480 -0.455792 -2.706813 1.794119 -0.174139 -0.769166
9.633333 -1.789466 -0.461660 -2.731542 1.787908 -0.174934 -0.810056
9.666667 -1.729531 -0.467424 -2.736753 1.779871 -0.175609 -0.837802
9.700000 -1.669940 -0.473366 -2.787383 1.769950 -0.176083 -0.851905
9.733333 -1.610815 -0.479453 -2.787383 1.758179 -0.176258 -0.849546
9.766667 -1.551864 -0.485419 -2.787383 1.744642 -0.176081 -0.833115
9.800000 -1.493115 -0.491258 -2.931458 1.729355 -0.175528 -0.791728
9.833333 -1.435157 -0.497132 -2.939175 1.712476 -0.174534 -0.725374
9.866667 -1.377949 -0.503032 -2.964726 1.694226 -0.172995 -0.640626
9.900000 -1.321572 -0.508920 -2.982646 1.674788 -0.170860 -0.540248
9.933333 -1.265995 -0.514778 -2.993469 1.654199 -0.168077 -0.422709
9.966667 -1.211326 -0.520552 -3.000469 1.632399 -0.164544 -0.287332
10.000000 -1.157658 -0.526194 -3.001629 1.609511 -0.160174 -0.159013
10.033333 -1.104386 -0.531670 -3.014015 1.585392 -0.154873 -0.033018
10.066667 -1.051538 -0.536975 -3.007373 1.559796 -0.148577 0.082836
10.100000 -0.999136 -0.542103 -2.998468 1.532406 -0.141217 0.186797
10.133333 -0.948087 -0.546884 -2.970482 1.502976 -0.132745 0.270641
10.166667 -0.897532 -0.551478 -2.978868 1.471394 -0.123191 0.330980
10.200000 -0.848480 -0.555636 -2.956797 1.437451 -0.112601 0.377582
10.233333 -0.799965 -0.559596 -2.946607 1.401245 -0.101088 0.403488
10.266667 -0.753219 -0.563015 -2.915821 1.363209 -0.088848 0.409058
10.300000 -0.708380 -0.565821 -2.897020 1.323932 -0.076102 0.395393
10.333333 -0.664135 -0.568418 -2.877702 1.283933 -0.063050 0.367126
10.366667 -0.622041 -0.570311 -2.852366 1.243626 -0.049833 0.323305
10.400000 -0.582208 -0.571459 -2.848334 1.203286 -0.036532 0.268145
10.433333 -0.543012 -0.572390 -2.842470 1.163060 -0.023190 0.205696
10.466667 -0.506278 -0.572485 -2.836606 1.122906 -0.009798 0.143209
10.500000 -0.470201 -0.572360 -2.842938 1.082410 0.003773 0.084850
10.533333 -0.434790 -0.572015 -2.834764 1.041418 0.017572 0.033762
10.566667 -0.400051 -0.571449 -2.831972 0.999716 0.031659 -0.004669
10.600000 -0.365994 -0.570662 -2.849694 0.957233 0.046042 -0.029349
10.633333 -0.332625 -0.569653 -2.851889 0.913781 0.060775 -0.038912
10.666667 -0.301964 -0.567706 -2.862829 0.869037 0.075967 -0.035144
10.700000 -0.274015 -0.564817 -2.870592 0.823257 0.091524 -0.021654
10.733333 -0.248742 -0.560996 -2.864280 0.776617 0.107391 -0.002171
10.766667 -0.224169 -0.556958 -2.862302 0.729455 0.123470 0.019400
10.800000 -0.200294 -0.552707 -2.863847 0.682086 0.139683 0.036382
10.833333 -0.178913 -0.547582 -2.859140 0.635200 0.155801 0.044631
10.866667 -0.158224 -0.542251 -2.851655 0.589477 0.171624 0.037666
10.900000 -0.139838 -0.536125 -2.852451 0.545247 0.187076 0.015766
10.933333 -0.122131 -0.529802 -2.838624 0.502663 0.202122 -0.021565
10.966667 -0.106476 -0.522744 -2.824769 0.461979 0.216699 -0.072782
11.000000 -0.092727 -0.514988 -2.823475 0.423546 0.230745 -0.132442
11.033333 -0.079628 -0.507051 -2.831462 0.387303 0.244395 -0.197613
11.066667 -0.068107 -0.498468 -2.841018 0.353405 0.257685 -0.260649
11.100000 -0.058016 -0.489243 -2.859975 0.321984 0.270692 -0.319387
11.133333 -0.048536 -0.479860 -2.880826 0.293275 0.283510 -0.369132
11.166667 -0.039653 -0.470325 -2.889872 0.267239 0.296271 -0.408306
11.200000 -0.031767 -0.460139 -2.928271 0.243668 0.309066 -0.434971
11.233333 -0.024448 -0.449819 -2.937207 0.222497 0.321842 -0.451634
11.266667 -0.017677 -0.439374 -2.960384 0.203489 0.334612 -0.470718
11.300000 -0.011578 -0.428272 -2.966265 0.186368 0.347258 -0.515073
11.333333 -0.006050 -0.416536 -2.969818 0.170816 0.359542 -0.611436
11.366667 -0.000988 -0.404191 -2.986185 0.156604 0.371150 -0.785916
11.400000 0.003703 -0.391273 -3.007979 0.143516 0.381785 -1.069840
11.433333 0.008102 -0.377802 -3.017038 0.131321 0.391156 -1.485621
11.466667 0.012294 -0.363807 -3.039702 0.119783 0.398863 -2.038620
11.500000 0.016056 -0.349763 -3.048334 0.108794 0.404651 -2.712711
11.533333 0.019407 -0.335685 -3.053868 0.098282 0.408379 -3.485336
11.566667 0.022364 -0.321585 -3.095900 0.088206 0.410056 -4.326901
11.600000 0.025462 -0.307166 3.036445 0.078546 0.409765 -5.192101
11.633333 0.027897 -0.293178 2.784301 0.069386 0.407687 -6.025695
11.666667 0.029991 -0.279207 2.493267 0.060929 0.404128 -6.775751
11.700000 0.031611 -0.265656 2.184175 0.053335 0.399380 -7.398368
11.733333 0.032853 -0.252483 1.857038 0.046802 0.393725 -7.854365
11.766667 0.033810 -0.239364 1.521191 0.041601 0.387329 -8.116243
11.800000 0.034650 -0.226557 1.191113 0.038155 0.380325 -8.180349
11.833333 0.035475 -0.214042 0.873572 0.036702 0.372787 -8.060968
11.866667 0.036384 -0.201810 0.565597 0.037323 0.364793 -7.787353
11.900000 0.037080 -0.189678 0.292801 0.040092 0.356337 -7.386122
11.933333 0.037582 -0.177657 0.042101 0.044937 0.347406 -6.880605
11.966667 0.038509 -0.165981 -0.167656 0.051552 0.338079 -6.287137
12.000000 0.039992 -0.154698 -0.322652 0.059363 0.328473 -5.606021
12.033333 0.041331 -0.143559 -0.476499 0.067995 0.318655 -4.834594
12.066667 0.043498 -0.132957 -0.650865 0.077103 0.308674 -3.957341
12.100000 0.046626 -0.122969 -0.825530 0.086342 0.298620 -2.964739
12.133333 0.050805 -0.113635 -1.006138 0.095425 0.288594 -1.858324
12.166667 0.054899 -0.104481 -1.083539 0.104318 0.278597 -0.647726
12.200000 0.058921 -0.095517 -1.163077 0.113249 0.268540 0.650790
12.233333 0.062883 -0.086750 -1.135855 0.122252 0.258410 2.001562
12.266667 0.066797 -0.078190 -1.058573 0.131545 0.248118 3.356364
12.300000 0.070675 -0.069843 -0.911189 0.141420 0.237519 4.653966
12.333333 0.074530 -0.061718 -0.671041 0.152267 0.226409 5.837847
12.366667 0.079410 -0.054163 -0.355022 0.164255 0.214643 6.851008
12.400000 0.084290 -0.046846 -0.022394 0.177375 0.202148 7.635363
12.433333 0.090082 -0.040085 0.362026 0.191628 0.188852 8.160571
12.466667 0.096717 -0.033890 0.666176 0.206804 0.174748 8.413435
12.500000 0.104140 -0.028258 1.026311 0.222555 0.159879 8.399073
12.533333 0.112292 -0.023193 1.392398 0.238359 0.144398 8.132325
12.566667 0.120485 -0.018394 1.691297 0.253844 0.128451 7.650544
12.600000 0.129319 -0.014208 1.975397 0.268677 0.112137 6.997751
12.633333 0.138772 -0.010675 2.206183 0.282654 0.095484 6.220520
12.666667 0.148809 -0.007834 2.409608 0.295665 0.078520 5.353666
12.700000 0.159411 -0.005733 2.559568 0.307669 0.061329 4.442160
12.733333 0.170077 -0.003917 2.691276 0.318806 0.043866 3.529142
12.766667 0.180808 -0.002388 2.785094 0.329172 0.026074 2.639409
12.800000 0.192048 -0.001735 2.837507 0.338907 0.007947 1.798359
12.833333 0.203771 -0.001981 2.866798 0.348118 -0.010448 1.022553
12.866667 0.215567 -0.002519 2.852747 0.356961 -0.029082 0.335683
12.900000 0.227434 -0.003347 2.830230 0.365649 -0.048022 -0.259141
12.933333 0.239690 -0.005075 2.795113 0.374317 -0.067216 -0.758807
12.966667 0.252342 -0.007710 2.731916 0.383130 -0.086607 -1.158390
13.000000 0.265375 -0.011242 2.642825 0.392275 -0.106167 -1.457540
13.033333 0.278482 -0.015060 2.587349 0.401917 -0.125901 -1.662722
13.066667 0.291937 -0.019723 2.513169 0.412089 -0.145694 -1.787454
13.100000 0.305464 -0.024665 2.427795 0.422781 -0.165392 -1.838800
13.133333 0.319429 -0.030420 2.347472 0.433922 -0.184850 -1.831506
13.166667 0.333897 -0.036976 2.278116 0.445408 -0.203938 -1.780487
13.200000 0.348956 -0.044340 2.215086 0.457020 -0.222478 -1.702381
13.233333 0.364077 -0.051963 2.149856 0.468537 -0.240288 -1.603158
13.266667 0.379897 -0.060406 2.120434 0.479777 -0.257274 -1.488011
13.300000 0.396447 -0.069672 2.079394 0.490502 -0.273300 -1.361580
13.333333 0.413760 -0.079775 2.048233 0.500559 -0.288289 -1.224915
13.366667 0.431116 -0.090108 2.011870 0.509828 -0.302169 -1.077924
13.400000 0.448506 -0.100662 1.970028 0.518308 -0.314956 -0.917761
13.433333 0.465925 -0.111428 1.919892 0.526002 -0.326671 -0.748237
13.466667 0.483365 -0.122398 1.879904 0.532995 -0.337380 -0.570750
13.500000 0.501602 -0.134181 1.855083 0.539455 -0.347193 -0.391090
13.533333 0.519845 -0.146148 1.840970 0.545521 -0.356224 -0.215060
13.566667 0.538087 -0.158289 1.840988 0.551249 -0.364556 -0.050425
13.600000 0.556320 -0.170594 1.862891 0.556663 -0.372205 0.091274
13.633333 0.574536 -0.183053 1.879385 0.561786 -0.379188 0.201255
13.666667 0.593423 -0.195957 1.910570 0.566531 -0.385451 0.271292
13.700000 0.612954 -0.209239 1.942254 0.570764 -0.390984 0.299013
13.733333 0.632440 -0.222643 1.974447 0.574337 -0.395713 0.284397
13.766667 0.651872 -0.236157 1.989963 0.577139 -0.399545 0.230727
13.800000 0.671239 -0.249772 2.003513 0.579009 -0.402383 0.148967
13.833333 0.690916 -0.263425 1.989042 0.579721 -0.404084 0.053276
13.866667 0.710509 -0.277155 1.989661 0.579119 -0.404504 -0.044448
13.900000 0.730006 -0.290953 1.988036 0.577086 -0.403431 -0.131076
13.933333 0.749527 -0.304553 1.970622 0.573520 -0.400751 -0.197125
13.966667 0.768932 -0.318198 1.947781 0.568294 -0.396373 -0.235210
14.000000 0.788209 -0.331877 1.935996 0.561347 -0.390281 -0.243251
14.033333 0.807348 -0.345578 1.902394 0.552685 -0.382489 -0.225094
14.066667 0.826184 -0.358833 1.901439 0.542353 -0.373133 -0.183605
14.100000 0.844618 -0.371589 1.885041 0.530453 -0.362479 -0.124204
14.133333 0.862546 -0.383781 1.877469 0.517040 -0.350701 -0.053521
14.166667 0.879847 -0.395343 1.888595 0.502328 -0.338111 0.021028
14.200000 0.896448 -0.406245 1.892496 0.486543 -0.325024 0.093724
14.233333 0.912306 -0.416465 1.907524 0.469960 -0.311842 0.158427
14.266667 0.927960 -0.426647 1.922855 0.452785 -0.298835 0.210995
14.300000 0.942579 -0.436030 1.926454 0.435129 -0.286151 0.247142
14.333333 0.956978 -0.445361 1.936716 0.417127 -0.273946 0.266521
14.366667 0.970222 -0.453871 1.947473 0.398850 -0.262275 0.271889
14.400000 0.983235 -0.462320 1.961671 0.380224 -0.251052 0.265166
14.433333 0.996011 -0.470702 1.978818 0.361175 -0.240128 0.249879
14.466667 1.007524 -0.478296 1.990331 0.341728 -0.229447 0.229305
14.500000 1.018791 -0.485816 1.997244 0.321914 -0.218947 0.204375
14.533333 1.029807 -0.493259 1.997759 0.301858 -0.208628 0.175092
14.566667 1.039546 -0.499983 2.002203 0.281624 -0.198458 0.139991
14.600000 1.049028 -0.506624 1.994866 0.261444 -0.188516 0.099922
14.633333 1.057276 -0.512626 1.997460 0.241590 -0.178932 0.057039
14.666667 1.064354 -0.518050 2.009001 0.222239 -0.169755 0.011671
14.700000 1.071173 -0.523386 2.017961 0.203625 -0.161085 -0.033828
14.733333 1.076986 -0.528248 2.026387 0.185967 -0.153014 -0.077635
14.766667 1.082540 -0.533019 2.020340 0.169443 -0.145617 -0.118933
14.800000 1.087835 -0.537699 2.010668 0.154163 -0.138935 -0.158636
14.833333 1.092387 -0.542051 1.993199 0.140110 -0.132934 -0.195878
14.866667 1.096684 -0.546310 1.977240 0.127199 -0.127552 -0.229547
14.900000 1.100372 -0.550309 1.964716 0.115357 -0.122724 -0.259191
14.933333 1.103811 -0.554217 1.959420 0.104385 -0.118322 -0.282964
14.966667 1.107002 -0.558034 1.952055 0.094151 -0.114255 -0.297094
15.000000 1.109948 -0.561760 1.947838 0.084532 -0.110438 -0.299865
15.033333 1.112512 -0.565348 1.937300 0.075422 -0.106801 -0.293806
15.066667 1.114837 -0.568846 1.933365 0.066797 -0.103317 -0.279755
15.100000 1.116851 -0.572246 1.904985 0.058574 -0.099942 -0.254707
15.133333 1.118572 -0.575540 1.894201 0.050736 -0.096663 -0.221057
15.166667 1.120041 -0.578714 1.890393 0.043265 -0.093471 -0.182901
15.200000 1.121267 -0.581755 1.877461 0.036150 -0.090367 -0.142376
15.233333 1.122278 -0.584652 1.855730 0.029395 -0.087368 -0.097304
15.266667 1.123072 -0.587464 1.864350 0.022996 -0.084495 -0.050247
15.300000 1.123654 -0.590195 1.874553 0.016957 -0.081780 -0.008057
15.333333 1.124028 -0.592844 1.886656 0.011275 -0.079265 0.026726
15.366667 1.124199 -0.595414 1.883055 0.005930 -0.076983 0.052747
15.400000 1.124233 -0.597878 1.890871 0.000885 -0.074947 0.068227
15.433333 1.124139 -0.600269 1.899636 -0.003903 -0.073167 0.066035
15.466667 1.123855 -0.602585 1.900311 -0.008472 -0.071646 0.047801
