t x y theta dxdt dydt dthetadt
0.000000 0.000000 0.000000 -0.734695 0.004381 -0.002813 -0.012917
0.033333 0.000553 -0.000214 -0.744385 0.006118 -0.003326 -0.013501
0.066667 0.000540 -0.000229 -0.739018 0.008602 -0.004050 -0.012234
0.100000 0.000108 -0.000158 -0.740025 0.012751 -0.005249 -0.009198
0.133333 0.000050 -0.000193 -0.736835 0.019368 -0.007166 -0.005738
0.166667 -0.000183 -0.000192 -0.743109 0.030286 -0.010238 -0.004691
0.200000 -0.000019 -0.000302 -0.744426 0.047261 -0.014889 -0.006107
0.233333 0.000550 -0.000526 -0.742581 0.071718 -0.021439 -0.015154
0.266667 0.001535 -0.000866 -0.743923 0.104918 -0.030156 -0.033927
0.300000 0.002945 -0.001326 -0.745980 0.147018 -0.040973 -0.064190
0.333333 0.005200 -0.001978 -0.734223 0.198175 -0.053825 -0.105671
0.366667 0.009042 -0.003126 -0.736829 0.256384 -0.068225 -0.157026
0.400000 0.013336 -0.004400 -0.734591 0.319667 -0.083689 -0.217831
0.433333 0.023881 -0.007605 -0.737283 0.385700 -0.099628 -0.282007
0.466667 0.034886 -0.010936 -0.746614 0.453236 -0.115589 -0.343012
0.500000 0.058128 -0.016584 -0.764306 0.520596 -0.131101 -0.396424
0.533333 0.081820 -0.022350 -0.777689 0.586167 -0.145706 -0.437287
0.566667 0.105950 -0.028232 -0.809698 0.649555 -0.159203 -0.461551
0.600000 0.130504 -0.034228 -0.846361 0.710976 -0.171416 -0.461794
0.633333 0.155470 -0.040334 -0.867573 0.771611 -0.182468 -0.437750
0.666667 0.180835 -0.046548 -0.880747 0.831010 -0.192297 -0.392626
0.700000 0.206585 -0.052869 -0.897931 0.890689 -0.201209 -0.328466
0.733333 0.232706 -0.059292 -0.914988 0.952271 -0.209521 -0.247499
0.766667 0.259185 -0.065815 -0.919528 1.017322 -0.217582 -0.153329
0.800000 0.298077 -0.073744 -0.917864 1.085147 -0.225736 -0.054442
0.833333 0.337285 -0.081760 -0.919124 1.154565 -0.234179 0.047909
0.866667 0.376782 -0.089861 -0.910366 1.224458 -0.243295 0.153146
0.900000 0.416540 -0.098042 -0.911511 1.292727 -0.253287 0.262373
0.933333 0.463793 -0.106546 -0.885649 1.356030 -0.264378 0.371690
0.966667 0.511244 -0.115118 -0.873505 1.410953 -0.276671 0.480324
1.000000 0.563426 -0.124133 -0.867841 1.456316 -0.290373 0.588922
1.033333 0.615729 -0.133205 -0.857540 1.490951 -0.305694 0.692762
1.066667 0.669832 -0.142543 -0.832135 1.513772 -0.322592 0.790550
1.100000 0.724452 -0.152675 -0.803619 1.523663 -0.340965 0.876517
1.133333 0.778569 -0.164612 -0.759440 1.521624 -0.360460 0.952245
1.166667 0.832639 -0.176582 -0.707183 1.508184 -0.380739 1.012593
1.200000 0.884476 -0.190302 -0.678661 1.483961 -0.401030 1.053780
1.233333 0.936184 -0.204037 -0.628030 1.448931 -0.420301 1.075845
1.266667 0.983499 -0.218742 -0.586190 1.404277 -0.437496 1.079093
1.300000 1.030611 -0.233443 -0.548059 1.351270 -0.451686 1.065763
1.333333 1.076407 -0.250472 -0.512145 1.289734 -0.461827 1.040819
1.366667 1.121932 -0.267473 -0.484831 1.220032 -0.466668 1.013465
1.400000 1.160856 -0.284777 -0.454243 1.142230 -0.465385 0.994174
1.433333 1.199447 -0.302028 -0.418904 1.057699 -0.457682 0.987116
1.466667 1.237679 -0.319213 -0.366240 0.966709 -0.443362 0.989781
1.500000 1.269311 -0.335780 -0.356767 0.869781 -0.422051 1.003294
1.533333 1.300538 -0.352256 -0.355613 0.768312 -0.394180 1.019624
1.566667 1.323556 -0.365509 -0.324030 0.664848 -0.361003 1.032091
1.600000 1.342362 -0.377862 -0.287908 0.561597 -0.323805 1.028832
1.633333 1.360723 -0.390098 -0.261055 0.460447 -0.283680 1.006287
1.666667 1.372581 -0.398886 -0.164557 0.364836 -0.242351 0.965968
1.700000 1.377912 -0.403940 -0.138377 0.278424 -0.202205 0.906720
1.733333 1.382795 -0.408866 -0.067077 0.204657 -0.165230 0.821226
1.766667 1.387237 -0.413661 -0.036821 0.145164 -0.132589 0.714505
1.800000 1.386879 -0.415809 -0.030901 0.101384 -0.105389 0.592920
1.833333 1.383287 -0.415850 -0.037282 0.074202 -0.084552 0.462424
1.866667 1.379286 -0.415767 -0.019852 0.062553 -0.070074 0.331529
1.900000 1.374894 -0.415562 -0.027875 0.064043 -0.060978 0.206991
1.933333 1.372735 -0.415838 -0.025345 0.075551 -0.056017 0.107050
1.966667 1.374154 -0.416769 -0.032331 0.094113 -0.054060 0.034208
2.000000 1.378575 -0.418510 -0.005440 0.116183 -0.053614 -0.009954
2.033333 1.386143 -0.421625 -0.013555 0.138015 -0.053229 -0.028631
2.066667 1.395855 -0.425524 -0.058099 0.156432 -0.051749 -0.022602
2.100000 1.405223 -0.429305 -0.045688 0.169056 -0.048445 -0.001466
2.133333 1.414250 -0.432967 -0.071300 0.174339 -0.042938 0.031926
2.166667 1.421527 -0.433909 -0.068865 0.171809 -0.035391 0.070206
2.200000 1.428464 -0.434733 -0.041723 0.162156 -0.026327 0.108091
2.233333 1.435062 -0.435442 -0.021450 0.146777 -0.016472 0.144979
2.266667 1.440309 -0.435267 -0.047976 0.127621 -0.006800 0.168132
2.300000 1.443440 -0.434055 -0.021047 0.106790 0.001701 0.181685
2.333333 1.445047 -0.432979 -0.004626 0.086242 0.008240 0.179478
2.366667 1.446333 -0.431801 0.000364 0.067230 0.012676 0.163766
2.400000 1.447228 -0.430695 0.035513 0.050569 0.015021 0.139942
2.433333 1.447817 -0.429494 0.023631 0.036802 0.015363 0.107055
2.466667 1.448251 -0.428735 0.021521 0.026000 0.014157 0.072159
2.500000 1.448358 -0.428342 0.021231 0.017977 0.011909 0.036731
2.533333 1.448557 -0.428327 -0.004427 0.012175 0.009176 0.006940
2.566667 1.448483 -0.428230 0.026002 0.008185 0.006257 -0.017367
2.600000 1.448564 -0.428841 -0.003707 0.005580 0.003446 -0.033964
