t x y theta dxdt dydt dthetadt
0.000000 0.000000 0.000000 -0.667927 0.090523 -0.120789 -0.240483
0.033333 0.003010 -0.003988 -0.676738 0.093346 -0.122532 -0.338468
0.066667 0.006092 -0.007998 -0.671253 0.096269 -0.124323 -0.433393
0.100000 0.009335 -0.012175 -0.679837 0.099316 -0.126202 -0.498458
0.133333 0.012652 -0.016367 -0.674403 0.102489 -0.128180 -0.521161
0.166667 0.016140 -0.020732 -0.672059 0.105785 -0.130259 -0.498739
0.200000 0.019702 -0.025108 -0.746170 0.109182 -0.132405 -0.431689
0.233333 0.023339 -0.029490 -0.888550 0.112660 -0.134590 -0.315455
0.266667 0.027161 -0.034041 -0.943510 0.116173 -0.136743 -0.157132
0.300000 0.031058 -0.038592 -0.938394 0.119682 -0.138806 0.023126
0.333333 0.035136 -0.043305 -0.883445 0.123144 -0.140719 0.212559
0.366667 0.039289 -0.048012 -0.833522 0.126536 -0.142450 0.400227
0.400000 0.043607 -0.052872 -0.785102 0.129835 -0.143969 0.571380
0.433333 0.048086 -0.057887 -0.740284 0.133010 -0.145228 0.697213
0.466667 0.052640 -0.062884 -0.705129 0.136056 -0.146239 0.767522
0.500000 0.057268 -0.067858 -0.664635 0.138965 -0.146984 0.782873
0.533333 0.061972 -0.072806 -0.636967 0.141743 -0.147472 0.749832
0.566667 0.066749 -0.077722 -0.604372 0.144390 -0.147701 0.677925
0.600000 0.071601 -0.082602 -0.591143 0.146920 -0.147695 0.578682
0.633333 0.076562 -0.087624 -0.581299 0.149357 -0.147506 0.476453
0.666667 0.081597 -0.092602 -0.565237 0.151712 -0.147156 0.380823
0.700000 0.086706 -0.097530 -0.572459 0.153998 -0.146685 0.298331
0.733333 0.091888 -0.102403 -0.549362 0.156217 -0.146130 0.229188
0.766667 0.097142 -0.107218 -0.558980 0.158369 -0.145531 0.175331
0.800000 0.102468 -0.112152 -0.552829 0.160443 -0.144913 0.135864
0.833333 0.107867 -0.117016 -0.549507 0.162434 -0.144288 0.104328
0.866667 0.113338 -0.121806 -0.550512 0.164335 -0.143668 0.079412
0.900000 0.118881 -0.126518 -0.556072 0.166140 -0.143064 0.058632
0.933333 0.124496 -0.131145 -0.556900 0.167854 -0.142461 0.042732
0.966667 0.130146 -0.135859 -0.538699 0.169482 -0.141824 0.025857
1.000000 0.135826 -0.140653 -0.533809 0.171036 -0.141123 0.008292
1.033333 0.141577 -0.145347 -0.541639 0.172515 -0.140341 -0.006043
1.066667 0.147349 -0.150112 -0.534487 0.173931 -0.139430 -0.017429
1.100000 0.153192 -0.154765 -0.540001 0.175295 -0.138343 -0.026261
1.133333 0.159045 -0.159477 -0.547407 0.176613 -0.137049 -0.034287
1.166667 0.164970 -0.164065 -0.550430 0.177881 -0.135543 -0.036162
1.200000 0.170891 -0.168700 -0.560519 0.179097 -0.133824 -0.031505
1.233333 0.176883 -0.173199 -0.559937 0.180266 -0.131873 -0.025149
1.266667 0.182947 -0.177555 -0.555042 0.181366 -0.129730 -0.016264
1.300000 0.189084 -0.181762 -0.560730 0.182366 -0.127452 -0.005925
1.333333 0.195201 -0.185989 -0.565499 0.183248 -0.125080 0.004566
1.366667 0.201298 -0.190231 -0.547320 0.183999 -0.122640 0.008917
1.400000 0.207467 -0.194304 -0.550541 0.184604 -0.120157 0.006694
1.433333 0.213710 -0.198202 -0.547909 0.185052 -0.117656 -0.001111
1.466667 0.219919 -0.202093 -0.548887 0.185354 -0.115115 -0.015181
1.500000 0.226204 -0.205796 -0.539667 0.185530 -0.112495 -0.035206
1.533333 0.232447 -0.209478 -0.550944 0.185580 -0.109785 -0.059255
1.566667 0.238648 -0.213134 -0.549978 0.185509 -0.106970 -0.084753
1.600000 0.244804 -0.216754 -0.546793 0.185328 -0.104021 -0.112398
1.633333 0.250912 -0.220331 -0.555236 0.185061 -0.100895 -0.138915
1.666667 0.257100 -0.223683 -0.568501 0.184719 -0.097575 -0.161761
1.700000 0.263239 -0.226969 -0.577427 0.184325 -0.094027 -0.178952
1.733333 0.269461 -0.230015 -0.578592 0.183907 -0.090216 -0.189011
1.766667 0.275633 -0.232969 -0.589298 0.183501 -0.086104 -0.183909
1.800000 0.281757 -0.235819 -0.591514 0.183126 -0.081676 -0.159552
1.833333 0.287832 -0.238554 -0.592239 0.182802 -0.076926 -0.114534
1.866667 0.293861 -0.241159 -0.603743 0.182574 -0.071816 -0.047988
1.900000 0.299843 -0.243623 -0.638348 0.182479 -0.066323 0.046176
1.933333 0.305919 -0.245799 -0.638228 0.182566 -0.060405 0.169675
1.966667 0.311968 -0.247798 -0.634443 0.182880 -0.054023 0.314774
2.000000 0.318005 -0.249600 -0.617954 0.183472 -0.047127 0.477848
2.033333 0.324047 -0.251185 -0.620198 0.184378 -0.039678 0.654728
2.066667 0.330112 -0.252529 -0.595605 0.185613 -0.031653 0.837671
2.100000 0.336214 -0.253609 -0.554007 0.187180 -0.023043 1.012486
2.133333 0.342369 -0.254401 -0.515260 0.189083 -0.013830 1.170548
2.166667 0.348636 -0.254847 -0.461348 0.191310 -0.004013 1.309721
2.200000 0.354977 -0.254953 -0.401671 0.193843 0.006392 1.427164
2.233333 0.361436 -0.254698 -0.339916 0.196660 0.017382 1.521678
2.266667 0.367988 -0.254048 -0.267425 0.199736 0.028929 1.596790
2.300000 0.374662 -0.253022 -0.216304 0.203045 0.041030 1.658785
2.333333 0.381447 -0.251543 -0.158304 0.206549 0.053666 1.711780
2.366667 0.388360 -0.249672 -0.113530 0.210221 0.066827 1.759332
2.400000 0.395398 -0.247294 -0.069259 0.214034 0.080508 1.806614
2.433333 0.402571 -0.244509 -0.011910 0.217970 0.094671 1.854963
2.466667 0.409882 -0.241162 0.042336 0.222010 0.109316 1.904657
2.500000 0.417333 -0.237397 0.112957 0.226139 0.124405 1.953996
2.533333 0.424926 -0.233207 0.180622 0.230349 0.139908 2.000016
2.566667 0.432665 -0.228365 0.267386 0.234629 0.155777 2.034657
2.600000 0.440552 -0.223087 0.350366 0.238969 0.172011 2.048261
2.633333 0.448581 -0.217107 0.412048 0.243364 0.188635 2.037065
2.666667 0.456747 -0.210400 0.478086 0.247816 0.205650 1.997663
2.700000 0.465069 -0.203243 0.551627 0.252331 0.223103 1.928885
2.733333 0.473550 -0.195631 0.632439 0.256921 0.241006 1.831549
2.766667 0.482192 -0.187560 0.708827 0.261600 0.259437 1.712336
2.800000 0.490962 -0.178686 0.767720 0.266394 0.278410 1.578739
2.833333 0.499897 -0.169346 0.823292 0.271326 0.297925 1.433096
2.866667 0.508975 -0.159193 0.855990 0.276413 0.317954 1.280324
2.900000 0.518223 -0.148570 0.886831 0.281666 0.338405 1.125871
2.933333 0.527640 -0.137124 0.919044 0.287094 0.359189 0.974665
2.966667 0.537239 -0.124848 0.948604 0.292704 0.380140 0.830040
3.000000 0.547035 -0.111737 0.972601 0.298487 0.401084 0.694166
3.033333 0.557043 -0.097783 0.991435 0.304429 0.421823 0.572660
3.066667 0.567234 -0.083354 1.004078 0.310528 0.442267 0.467157
3.100000 0.577670 -0.068066 1.020049 0.316783 0.462327 0.378339
3.133333 0.588368 -0.051908 1.030757 0.323200 0.481985 0.308512
3.166667 0.599253 -0.035280 1.031120 0.329790 0.501288 0.257673
3.200000 0.610328 -0.018184 1.034097 0.336574 0.520345 0.223951
3.233333 0.621594 -0.000622 1.035924 0.343602 0.539383 0.204018
3.266667 0.633052 0.017402 1.025930 0.350896 0.558512 0.194480
3.300000 0.644839 0.036357 1.030565 0.358476 0.577864 0.191448
3.333333 0.656822 0.055768 1.035023 0.366366 0.597576 0.189699
3.366667 0.669000 0.075630 1.042938 0.374562 0.617689 0.186189
3.400000 0.681552 0.096470 1.057818 0.383069 0.638236 0.183507
3.433333 0.694301 0.117753 1.078648 0.391873 0.659168 0.182326
3.466667 0.707460 0.140045 1.100774 0.400985 0.680493 0.186158
3.500000 0.721047 0.163365 1.111693 0.410438 0.702275 0.197251
3.533333 0.734831 0.187107 1.101294 0.420228 0.724472 0.216190
3.566667 0.749078 0.211912 1.096570 0.430346 0.747037 0.241461
3.600000 0.763522 0.237124 1.080053 0.440758 0.769887 0.264947
3.633333 0.778164 0.262734 1.076729 0.451398 0.792874 0.278957
3.666667 0.793311 0.289450 1.083583 0.462185 0.815813 0.272466
3.700000 0.808653 0.316546 1.100981 0.473032 0.838514 0.236060
3.733333 0.824510 0.344744 1.139728 0.483877 0.860838 0.160751
3.766667 0.840881 0.374031 1.166442 0.494700 0.882737 0.041398
3.800000 0.857767 0.404387 1.215444 0.505486 0.904170 -0.123528
3.833333 0.875168 0.435783 1.232543 0.516221 0.925097 -0.324910
3.866667 0.892755 0.467496 1.222562 0.526917 0.945548 -0.550919
3.900000 0.910522 0.499510 1.208059 0.537562 0.965507 -0.785725
3.933333 0.928468 0.531811 1.155264 0.548148 0.984978 -1.007415
3.966667 0.946588 0.564383 1.077955 0.558663 1.003977 -1.196642
4.000000 0.965203 0.597845 1.012792 0.569082 1.022493 -1.331965
4.033333 0.984295 0.632162 0.937537 0.579407 1.040584 -1.406012
4.066667 1.003848 0.667298 0.866865 0.589576 1.058160 -1.414643
4.100000 1.023844 0.703220 0.802845 0.599493 1.075049 -1.359919
4.133333 1.044260 0.739889 0.737090 0.609044 1.091047 -1.253754
4.166667 1.064823 0.776726 0.709716 0.618089 1.105883 -1.111526
4.200000 1.085769 0.814247 0.670787 0.626519 1.119335 -0.949238
4.233333 1.107070 0.852410 0.654761 0.634229 1.131182 -0.782141
4.266667 1.128502 0.890678 0.645660 0.641187 1.141350 -0.623099
4.300000 1.150236 0.929494 0.628836 0.647410 1.149877 -0.482445
4.333333 1.172087 0.968372 0.627715 0.652949 1.156855 -0.366189
4.366667 1.194048 1.007291 0.625963 0.657855 1.162375 -0.274831
4.400000 1.216112 1.046229 0.619108 0.662193 1.166565 -0.211427
4.433333 1.238272 1.085164 0.619951 0.666039 1.169588 -0.173467
4.466667 1.260603 1.124373 0.608030 0.669437 1.171533 -0.155481
4.500000 1.283091 1.163817 0.607841 0.672427 1.172470 -0.155291
4.533333 1.305656 1.203190 0.619703 0.675024 1.172420 -0.168723
4.566667 1.328288 1.242470 0.612158 0.677256 1.171420 -0.192010
4.600000 1.350981 1.281634 0.605251 0.679131 1.169462 -0.222128
4.633333 1.373735 1.320794 0.595690 0.680622 1.166464 -0.254818
4.666667 1.396528 1.359891 0.586416 0.681720 1.162387 -0.290813
4.700000 1.419339 1.398861 0.572571 0.682426 1.157219 -0.326528
4.733333 1.442181 1.437622 0.566552 0.682737 1.150941 -0.360267
4.766667 1.465047 1.476152 0.541007 0.682628 1.143507 -0.390948
4.800000 1.487931 1.514429 0.535275 0.682077 1.134873 -0.416671
4.833333 1.510754 1.552368 0.510888 0.681068 1.125021 -0.437351
4.866667 1.533489 1.589901 0.502710 0.679590 1.113936 -0.454018
4.900000 1.556219 1.627113 0.488981 0.677584 1.101536 -0.465345
4.933333 1.578937 1.663982 0.469247 0.675024 1.087793 -0.471021
4.966667 1.601473 1.700236 0.449546 0.671908 1.072712 -0.473727
5.000000 1.623983 1.736103 0.441658 0.668230 1.056298 -0.475573
5.033333 1.646461 1.771562 0.415172 0.664011 1.038600 -0.478699
5.066667 1.668668 1.806210 0.397566 0.659238 1.019603 -0.481494
5.100000 1.690588 1.840001 0.384751 0.653975 0.999422 -0.488525
5.133333 1.712455 1.873321 0.375315 0.648269 0.978142 -0.502640
5.166667 1.733974 1.905653 0.358057 0.642209 0.955929 -0.521019
5.200000 1.755428 1.937477 0.334103 0.635839 0.932864 -0.536653
5.233333 1.776472 1.968177 0.335223 0.629166 0.908951 -0.544447
5.266667 1.797438 1.998333 0.316083 0.622242 0.884278 -0.532062
5.300000 1.817936 2.027232 0.295850 0.615040 0.858773 -0.481905
5.333333 1.838346 2.055552 0.268051 0.607530 0.832368 -0.379737
5.366667 1.858664 2.083277 0.240307 0.599619 0.804874 -0.220311
5.400000 1.878433 2.109562 0.209075 0.591338 0.776345 -0.011057
5.433333 1.898100 2.135221 0.183809 0.582722 0.746822 0.236079
5.466667 1.917660 2.160240 0.152951 0.573754 0.716215 0.492894
5.500000 1.937109 2.184606 0.155771 0.564432 0.684456 0.722318
5.533333 1.955902 2.207263 0.179773 0.554771 0.651474 0.892256
5.566667 1.974025 2.228143 0.232419 0.544859 0.617334 0.976883
5.600000 1.992025 2.248333 0.349841 0.534660 0.581875 0.958711
5.633333 2.009360 2.266638 0.501006 0.524225 0.545108 0.827401
5.666667 2.026568 2.284235 0.600603 0.513667 0.507240 0.586573
5.700000 2.043646 2.301114 0.676533 0.503150 0.468622 0.250600
5.733333 2.060593 2.317269 0.671967 0.492801 0.429543 -0.158681
5.766667 2.076982 2.331516 0.607636 0.482693 0.390140 -0.612795
5.800000 2.092840 2.343874 0.525109 0.472978 0.350652 -1.070725
5.833333 2.108194 2.354372 0.438334 0.463746 0.311282 -1.487805
5.866667 2.123081 2.363037 0.353404 0.455094 0.272171 -1.828052
5.900000 2.137830 2.370959 0.283436 0.447112 0.233314 -2.060010
5.933333 2.152442 2.378134 0.196352 0.439926 0.194797 -2.166408
5.966667 2.166727 2.383579 0.093821 0.433672 0.156773 -2.138774
6.000000 2.180873 2.388279 -0.003060 0.428426 0.119288 -1.985976
6.033333 2.194882 2.392238 -0.105238 0.424229 0.082217 -1.722614
6.066667 2.208740 2.394603 -0.193020 0.421060 0.045399 -1.362184
6.100000 2.222505 2.395426 -0.264557 0.418880 0.008812 -0.923352
6.133333 2.236236 2.394759 -0.290540 0.417615 -0.027509 -0.429557
6.166667 2.249829 2.393367 -0.309664 0.417176 -0.063603 0.088944
6.200000 2.263486 2.390595 -0.304092 0.417464 -0.099361 0.601486
6.233333 2.277240 2.386491 -0.263198 0.418415 -0.134554 1.072761
6.266667 2.291121 2.381110 -0.200530 0.419947 -0.168962 1.465396
6.300000 2.305149 2.374501 -0.093200 0.421932 -0.202440 1.744948
6.333333 2.319336 2.366714 0.021106 0.424226 -0.234934 1.889979
6.366667 2.333381 2.358256 0.132710 0.426676 -0.266296 1.890389
6.400000 2.347587 2.348715 0.260471 0.429123 -0.296444 1.747131
6.433333 2.361944 2.338134 0.364769 0.431382 -0.325323 1.475608
6.466667 2.376439 2.326561 0.440232 0.433279 -0.352872 1.103454
6.500000 2.391047 2.314039 0.484973 0.434688 -0.379055 0.669720
6.533333 2.405758 2.300606 0.488374 0.435509 -0.403829 0.219369
6.566667 2.420545 2.286310 0.465487 0.435656 -0.427152 -0.203543
6.600000 2.435387 2.271200 0.420270 0.435091 -0.448990 -0.556494
6.633333 2.450066 2.255534 0.355091 0.433835 -0.469335 -0.808693
6.666667 2.464756 2.239162 0.265283 0.431945 -0.488181 -0.940106
6.700000 2.479277 2.222266 0.173549 0.429500 -0.505534 -0.944734
6.733333 2.493624 2.204863 0.097213 0.426586 -0.521436 -0.835244
6.766667 2.507794 2.186970 0.045024 0.423312 -0.535966 -0.631075
6.800000 2.521783 2.168606 0.020771 0.419778 -0.549208 -0.363441
6.833333 2.535587 2.149787 0.013265 0.416046 -0.561216 -0.063088
6.866667 2.549340 2.130594 0.046548 0.412155 -0.572051 0.234999
6.900000 2.563032 2.111081 0.081797 0.408113 -0.581757 0.501636
6.933333 2.576647 2.091301 0.140819 0.403908 -0.590359 0.717670
6.966667 2.590168 2.071306 0.195947 0.399504 -0.597916 0.870214
7.000000 2.603573 2.051147 0.254995 0.394848 -0.604523 0.958156
7.033333 2.616768 2.030643 0.303261 0.389890 -0.610312 0.983864
7.066667 2.629750 2.009810 0.338796 0.384590 -0.615393 0.960532
7.100000 2.642551 1.988957 0.372947 0.378926 -0.619882 0.900605
7.133333 2.655154 1.968118 0.386718 0.372888 -0.623855 0.819188
7.166667 2.667553 1.947315 0.407347 0.366486 -0.627362 0.730275
7.200000 2.679725 1.926593 0.418232 0.359736 -0.630377 0.644675
7.233333 2.691662 1.905632 0.435539 0.352660 -0.632848 0.570475
7.266667 2.703360 1.884448 0.458571 0.345278 -0.634783 0.511382
7.300000 2.714814 1.863057 0.473599 0.337600 -0.636103 0.469641
7.333333 2.726021 1.841478 0.491115 0.329643 -0.636776 0.441962
7.366667 2.736976 1.819727 0.503773 0.321419 -0.636733 0.424529
7.400000 2.747597 1.798326 0.503958 0.312946 -0.635950 0.412507
7.433333 2.757957 1.776786 0.511580 0.304245 -0.634403 0.404284
7.466667 2.767968 1.755655 0.522773 0.295326 -0.632020 0.396744
7.500000 2.777711 1.734418 0.544764 0.286217 -0.628851 0.389489
7.533333 2.787086 1.713649 0.564283 0.276941 -0.624975 0.383557
7.566667 2.796187 1.692806 0.579277 0.267516 -0.620446 0.378544
7.600000 2.805009 1.671903 0.598511 0.257945 -0.615267 0.373538
7.633333 2.813440 1.651551 0.605336 0.248243 -0.609491 0.366633
7.666667 2.821585 1.631170 0.614216 0.238420 -0.603143 0.357835
7.700000 2.829441 1.610772 0.623914 0.228480 -0.596194 0.342043
7.733333 2.836895 1.590986 0.624869 0.218417 -0.588579 0.316004
7.766667 2.844054 1.571213 0.644131 0.208238 -0.580292 0.277776
7.800000 2.850809 1.552091 0.645682 0.197967 -0.571440 0.228775
7.833333 2.857262 1.533008 0.673026 0.187611 -0.562029 0.165912
7.866667 2.863411 1.513976 0.690307 0.177185 -0.552120 0.089932
7.900000 2.869156 1.495630 0.693182 0.166706 -0.541802 0.008349
7.933333 2.874501 1.477966 0.694343 0.156191 -0.531130 -0.072713
7.966667 2.879534 1.460388 0.703928 0.145650 -0.520165 -0.148522
8.000000 2.884175 1.443468 0.697377 0.135085 -0.508912 -0.216033
8.033333 2.888501 1.426655 0.664770 0.124503 -0.497401 -0.266233
8.066667 2.892508 1.409958 0.630848 0.113909 -0.485660 -0.294411
8.100000 2.896138 1.393864 0.605543 0.103301 -0.473687 -0.302326
8.133333 2.899397 1.378344 0.587155 0.092679 -0.461502 -0.292227
8.166667 2.902332 1.362967 0.571319 0.082040 -0.449117 -0.262837
8.200000 2.904901 1.348102 0.576301 0.071382 -0.436540 -0.218809
8.233333 2.907105 1.333726 0.579410 0.060706 -0.423837 -0.167156
8.266667 2.908950 1.319821 0.586518 0.050017 -0.411106 -0.117751
8.300000 2.910437 1.306375 0.575891 0.039323 -0.398452 -0.072839
8.333333 2.911565 1.293379 0.584063 0.028631 -0.385974 -0.036278
8.366667 2.912337 1.280817 0.570504 0.017950 -0.373803 -0.011971
8.400000 2.912753 1.268680 0.583928 0.007292 -0.362049 0.001081
8.433333 2.912811 1.256956 0.580314 -0.003341 -0.350786 0.005216
8.466667 2.912511 1.245630 0.581681 -0.013949 -0.340032 0.006324
8.500000 2.911853 1.234694 0.585333 -0.024537 -0.329792 0.003425
8.533333 2.910857 1.223967 0.583856 -0.035115 -0.320059 0.000521
8.566667 2.909499 1.213610 0.584078 -0.045692 -0.310783 -0.003537
8.600000 2.907803 1.203470 0.579707 -0.056282 -0.301903 -0.005437
8.633333 2.905769 1.193550 0.585299 -0.066899 -0.293349 -0.006712
8.666667 2.903364 1.183969 0.580722 -0.077562 -0.285051 -0.007627
8.700000 2.900620 1.174614 0.579516 -0.088294 -0.276943 -0.006864
8.733333 2.897538 1.165489 0.577288 -0.099113 -0.268980 -0.006082
8.766667 2.894073 1.156671 0.576914 -0.110049 -0.261116 -0.002185
8.800000 2.890270 1.148088 0.578664 -0.121140 -0.253334 0.000438
8.833333 2.886071 1.139792 0.581285 -0.132417 -0.245632 0.003668
8.866667 2.881475 1.131773 0.582585 -0.143908 -0.238016 0.005265
8.900000 2.876541 1.123998 0.574249 -0.155628 -0.230500 0.006264
8.933333 2.871270 1.116467 0.584778 -0.167578 -0.223091 0.006369
8.966667 2.865580 1.109189 0.581323 -0.179751 -0.215796 0.004987
9.000000 2.859463 1.102155 0.585813 -0.192113 -0.208618 0.005630
9.033333 2.852912 1.095357 0.582154 -0.204614 -0.201541 0.011658
9.066667 2.845918 1.088788 0.578323 -0.217184 -0.194538 0.028489
9.100000 2.838473 1.082440 0.585614 -0.229749 -0.187585 0.054116
9.133333 2.830569 1.076307 0.580159 -0.242254 -0.180660 0.091226
9.166667 2.822194 1.070381 0.584018 -0.254634 -0.173739 0.138527
9.200000 2.813340 1.064656 0.576184 -0.266837 -0.166798 0.194914
9.233333 2.804162 1.059189 0.576386 -0.278835 -0.159821 0.252186
9.266667 2.794663 1.053983 0.577409 -0.290629 -0.152807 0.302314
9.300000 2.784650 1.048958 0.590692 -0.302230 -0.145758 0.343621
9.333333 2.774322 1.044195 0.608048 -0.313650 -0.138678 0.370590
9.366667 2.763681 1.039696 0.656212 -0.324898 -0.131572 0.377358
9.400000 2.752730 1.035461 0.690059 -0.336005 -0.124453 0.357992
9.433333 2.741472 1.031491 0.692812 -0.346999 -0.117345 0.316173
9.466667 2.729702 1.027703 0.702173 -0.357891 -0.110272 0.257621
9.500000 2.717439 1.024100 0.716358 -0.368678 -0.103249 0.188617
9.533333 2.704879 1.020764 0.728196 -0.379350 -0.096291 0.115769
9.566667 2.692027 1.017697 0.732373 -0.389905 -0.089415 0.051490
9.600000 2.678886 1.014898 0.721559 -0.400324 -0.082635 0.006729
9.633333 2.665330 1.012282 0.697105 -0.410570 -0.075948 -0.016595
9.666667 2.651379 1.009847 0.687381 -0.420619 -0.069350 -0.021666
9.700000 2.637151 1.007682 0.669119 -0.430474 -0.062848 -0.009974
9.733333 2.622651 1.005787 0.658235 -0.440136 -0.056447 0.012552
9.766667 2.607785 1.004043 0.661284 -0.449597 -0.050141 0.037334
9.800000 2.592556 1.002436 0.677949 -0.458846 -0.043926 0.053540
9.833333 2.577068 1.001102 0.696563 -0.467890 -0.037796 0.055412
9.866667 2.561229 0.999893 0.718716 -0.476729 -0.031741 0.042067
9.900000 2.545142 0.998957 0.728687 -0.485348 -0.025743 0.008402
9.933333 2.528812 0.998295 0.740105 -0.493729 -0.019772 -0.041483
9.966667 2.512169 0.997757 0.735299 -0.501867 -0.013804 -0.102334
10.000000 2.495228 0.997341 0.713832 -0.509759 -0.007799 -0.163576
10.033333 2.478059 0.997200 0.724270 -0.517398 -0.001724 -0.219560
10.066667 2.460612 0.997181 0.689951 -0.524777 0.004466 -0.261167
10.100000 2.442949 0.997439 0.668070 -0.531890 0.010805 -0.282604
10.133333 2.425026 0.997817 0.643962 -0.538732 0.017314 -0.283011
10.166667 2.406899 0.998474 0.632462 -0.545297 0.023992 -0.264846
10.200000 2.388534 0.999249 0.613242 -0.551583 0.030813 -0.234134
10.233333 2.369975 1.000303 0.614949 -0.557585 0.037745 -0.191257
10.266667 2.351229 1.001636 0.618373 -0.563297 0.044718 -0.147408
10.300000 2.332302 1.003250 0.620955 -0.568715 0.051689 -0.108524
10.333333 2.313198 1.005145 0.622632 -0.573841 0.058597 -0.079218
10.366667 2.293924 1.007321 0.620962 -0.578671 0.065414 -0.059493
10.400000 2.274485 1.009778 0.625077 -0.583206 0.072110 -0.049413
10.433333 2.254895 1.012388 0.627482 -0.587455 0.078687 -0.048469
10.466667 2.235166 1.015154 0.621152 -0.591428 0.085179 -0.049160
10.500000 2.215312 1.018088 0.619837 -0.595130 0.091617 -0.046874
10.533333 2.195349 1.021199 0.615407 -0.598574 0.098053 -0.038223
10.566667 2.175291 1.024493 0.618408 -0.601783 0.104554 -0.024460
10.600000 2.155151 1.027983 0.605763 -0.604778 0.111193 -0.005318
10.633333 2.134888 1.031757 0.593933 -0.607577 0.118018 0.016359
10.666667 2.114558 1.035742 0.583816 -0.610197 0.125063 0.035456
10.700000 2.094173 1.039946 0.595073 -0.612658 0.132361 0.049246
10.733333 2.073682 1.044437 0.604886 -0.614960 0.139930 0.054924
10.766667 2.053091 1.049215 0.628058 -0.617092 0.147762 0.051073
10.800000 2.032455 1.054231 0.641191 -0.619042 0.155840 0.035806
10.833333 2.011785 1.059497 0.642111 -0.620789 0.164171 0.009969
10.866667 1.991031 1.065050 0.636960 -0.622316 0.172747 -0.024576
10.900000 1.970197 1.070892 0.640598 -0.623610 0.181545 -0.064998
10.933333 1.949291 1.077022 0.627771 -0.624678 0.190537 -0.107426
10.966667 1.928316 1.083440 0.622036 -0.625516 0.199719 -0.147162
11.000000 1.907364 1.090193 0.605546 -0.626109 0.209102 -0.178737
11.033333 1.886450 1.097303 0.602962 -0.626449 0.218683 -0.201209
11.066667 1.865590 1.104781 0.589469 -0.626532 0.228459 -0.213086
11.100000 1.844682 1.112547 0.583972 -0.626352 0.238443 -0.215965
11.133333 1.823732 1.120598 0.568411 -0.625878 0.248675 -0.209420
11.166667 1.802879 1.129069 0.570895 -0.625101 0.259180 -0.193997
11.200000 1.781993 1.137824 0.555900 -0.624014 0.269983 -0.171040
11.233333 1.761078 1.146862 0.563565 -0.622601 0.281125 -0.142625
11.266667 1.740139 1.156182 0.551313 -0.620829 0.292659 -0.106936
11.300000 1.719346 1.165988 0.543975 -0.618680 0.304622 -0.060209
11.333333 1.698715 1.176299 0.535924 -0.616183 0.316980 -0.005603
11.366667 1.678255 1.187130 0.541653 -0.613366 0.329699 0.052020
11.400000 1.657788 1.198235 0.532749 -0.610285 0.342706 0.106937
11.433333 1.637318 1.209613 0.530009 -0.607009 0.355918 0.159811
11.466667 1.617051 1.221563 0.543993 -0.603634 0.369219 0.202044
11.500000 1.596990 1.234103 0.565386 -0.600247 0.382503 0.227309
11.533333 1.577139 1.247246 0.579855 -0.596902 0.395694 0.236435
11.566667 1.557502 1.261008 0.577657 -0.593660 0.408711 0.238397
11.600000 1.537878 1.275026 0.606224 -0.590558 0.421534 0.239682
11.633333 1.518268 1.289293 0.645533 -0.587636 0.434132 0.243732
11.666667 1.498676 1.303805 0.658094 -0.584898 0.446526 0.260773
11.700000 1.479280 1.318995 0.644892 -0.582345 0.458736 0.297501
11.733333 1.459907 1.334421 0.617819 -0.579957 0.470820 0.357051
11.766667 1.440697 1.350535 0.594990 -0.577703 0.482829 0.436668
11.800000 1.421513 1.366872 0.582843 -0.575564 0.494769 0.537300
11.833333 1.402356 1.383427 0.618842 -0.573516 0.506636 0.655896
11.866667 1.383229 1.400194 0.654947 -0.571554 0.518404 0.785124
11.900000 1.364210 1.417607 0.703682 -0.569665 0.530074 0.913742
11.933333 1.345285 1.435650 0.744273 -0.567859 0.541583 1.030180
11.966667 1.326447 1.454297 0.794600 -0.566139 0.552875 1.120396
12.000000 1.307644 1.473126 0.836759 -0.564504 0.563876 1.171844
12.033333 1.288878 1.492130 0.886495 -0.562948 0.574509 1.180920
12.066667 1.270151 1.511301 0.919705 -0.561466 0.584701 1.148318
12.100000 1.251471 1.530967 0.984602 -0.560054 0.594354 1.080899
12.133333 1.232834 1.551096 1.026046 -0.558698 0.603415 0.986704
12.166667 1.214235 1.571652 1.067556 -0.557387 0.611833 0.879667
12.200000 1.195680 1.592339 1.101026 -0.556107 0.619586 0.775045
12.233333 1.177161 1.613378 1.126098 -0.554843 0.626638 0.680705
12.266667 1.158687 1.634529 1.126802 -0.553576 0.632929 0.604799
12.300000 1.140249 1.655950 1.133130 -0.552290 0.638417 0.550597
12.333333 1.121860 1.677463 1.119903 -0.550974 0.643080 0.525090
12.366667 1.103511 1.699154 1.126393 -0.549615 0.646898 0.526663
12.400000 1.085201 1.720983 1.133067 -0.548200 0.649845 0.549104
12.433333 1.066935 1.742903 1.170022 -0.546710 0.651911 0.586507
12.466667 1.048708 1.764870 1.167904 -0.545131 0.653121 0.633972
12.500000 1.030537 1.786818 1.200895 -0.543444 0.653475 0.687637
12.533333 1.012418 1.808797 1.253099 -0.541630 0.652943 0.734074
12.566667 0.994353 1.830797 1.280561 -0.539674 0.651502 0.775210
12.600000 0.976373 1.852609 1.328654 -0.537554 0.649118 0.808728
12.633333 0.958447 1.874423 1.342005 -0.535265 0.645807 0.843560
12.666667 0.940577 1.896227 1.365434 -0.532791 0.641529 0.874914
12.700000 0.922828 1.917689 1.379488 -0.530128 0.636283 0.906713
12.733333 0.905136 1.939124 1.404490 -0.527264 0.630030 0.951958
12.766667 0.887585 1.960131 1.418607 -0.524205 0.622804 1.005076
12.800000 0.870092 1.981091 1.478976 -0.520964 0.614643 1.064577
12.833333 0.852769 2.001542 1.507631 -0.517555 0.605588 1.116450
12.866667 0.835503 2.021928 1.515563 -0.514012 0.595763 1.161259
12.900000 0.818396 2.041794 1.589806 -0.510376 0.585324 1.186969
12.933333 0.801461 2.061109 1.628007 -0.506716 0.574546 1.182889
12.966667 0.784584 2.080338 1.700477 -0.503081 0.563601 1.141654
13.000000 0.767885 2.098984 1.743994 -0.499538 0.552728 1.068317
13.033333 0.751358 2.117051 1.789430 -0.496147 0.542131 0.969564
13.066667 0.734997 2.134538 1.845230 -0.492976 0.531991 0.844175
13.100000 0.718692 2.151914 1.878479 -0.490070 0.522399 0.705607
13.133333 0.702524 2.168726 1.882859 -0.487467 0.513346 0.559288
13.166667 0.686409 2.185418 1.884458 -0.485225 0.504840 0.423464
13.200000 0.670347 2.201986 1.876837 -0.483365 0.496818 0.299776
13.233333 0.654337 2.218425 1.873764 -0.481899 0.489177 0.192148
13.266667 0.638378 2.234732 1.889542 -0.480820 0.481763 0.110252
13.300000 0.622469 2.250902 1.865116 -0.480131 0.474465 0.052883
13.333333 0.606548 2.266625 1.867188 -0.479801 0.467192 0.023314
13.366667 0.590675 2.282205 1.879619 -0.479792 0.459884 0.015323
13.400000 0.574743 2.297372 1.869585 -0.480074 0.452516 0.030208
13.433333 0.558858 2.312389 1.878301 -0.480626 0.445103 0.067514
13.466667 0.542864 2.327031 1.872175 -0.481418 0.437713 0.131439
13.500000 0.526737 2.341319 1.879819 -0.482432 0.430428 0.221628
13.533333 0.510655 2.355449 1.864962 -0.483706 0.423290 0.336993
13.566667 0.494617 2.369417 1.870035 -0.485241 0.416340 0.480433
13.600000 0.478373 2.383087 1.885768 -0.487035 0.409586 0.648427
13.633333 0.462173 2.396591 1.875126 -0.489085 0.403033 0.840810
13.666667 0.446016 2.409929 1.917873 -0.491377 0.396652 1.041112
13.700000 0.429588 2.423015 1.964650 -0.493868 0.390389 1.240814
13.733333 0.413203 2.435932 1.997151 -0.496455 0.384229 1.434371
13.766667 0.396863 2.448678 2.049698 -0.499077 0.378144 1.608864
13.800000 0.380232 2.461193 2.159716 -0.501678 0.372111 1.755468
13.833333 0.363315 2.473474 2.215172 -0.504189 0.366111 1.864358
13.866667 0.346123 2.485521 2.279131 -0.506540 0.360138 1.936995
13.900000 0.328979 2.497393 2.381632 -0.508692 0.354191 1.975214
13.933333 0.311883 2.509088 2.447431 -0.510644 0.348262 1.972566
13.966667 0.294837 2.520606 2.514314 -0.512362 0.342347 1.931387
14.000000 0.277843 2.531946 2.591758 -0.513850 0.336447 1.858043
14.033333 0.260657 2.543063 2.618146 -0.515120 0.330557 1.756259
14.066667 0.243525 2.554002 2.701071 -0.516215 0.324670 1.626390
14.100000 0.226251 2.564723 2.759087 -0.517134 0.318788 1.472092
14.133333 0.209035 2.575265 2.820803 -0.517855 0.312915 1.298518
14.166667 0.191722 2.585598 2.869591 -0.518338 0.307056 1.110309
14.200000 0.174338 2.595723 2.904312 -0.518492 0.301221 0.911210
14.233333 0.156912 2.605645 2.940262 -0.518244 0.295418 0.702924
14.266667 0.139473 2.615369 2.950705 -0.517498 0.289658 0.497359
14.300000 0.122051 2.624900 2.959109 -0.516209 0.283948 0.296657
14.333333 0.104701 2.634252 2.966294 -0.514352 0.278292 0.111323
14.366667 0.087423 2.643426 2.946522 -0.511958 0.272691 -0.051871
14.400000 0.070222 2.652424 2.940516 -0.509106 0.267146 -0.199148
14.433333 0.053162 2.661238 2.929716 -0.505850 0.261650 -0.335573
14.466667 0.036280 2.669865 2.892115 -0.502228 0.256189 -0.484822
14.500000 0.019612 2.678306 2.874163 -0.498280 0.250750 -0.668580
14.533333 0.003195 2.686555 2.861625 -0.494050 0.245322 -0.920624
14.566667 -0.013135 2.694630 2.832351 -0.489559 0.239892 -1.276033
14.600000 -0.029378 2.702533 2.837068 -0.484803 0.234452 -1.747028
14.633333 -0.045531 2.710265 2.800091 -0.479795 0.229006 -2.335356
14.666667 -0.061593 2.717826 2.790063 -0.474568 0.223579 -3.020347
14.700000 -0.077562 2.725218 2.776544 -0.469108 0.218198 -3.772864
14.733333 -0.093437 2.732443 2.671621 -0.463354 0.212898 -4.539369
14.766667 -0.108834 2.739433 2.515729 -0.457278 0.207716 -5.257637
14.800000 -0.123739 2.746192 2.271524 -0.450886 0.202698 -5.870696
14.833333 -0.138545 2.752788 1.971380 -0.444208 0.197884 -6.323948
14.866667 -0.153254 2.759222 1.618415 -0.437295 0.193308 -6.570548
14.900000 -0.167863 2.765496 1.247451 -0.430255 0.188990 -6.556637
14.933333 -0.182372 2.771611 0.954919 -0.423253 0.184942 -6.258762
14.966667 -0.196458 2.777614 0.672044 -0.416423 0.181167 -5.663357
15.000000 -0.210152 2.783530 0.502568 -0.409872 0.177653 -4.788247
15.033333 -0.223490 2.789374 0.319671 -0.403719 0.174371 -3.662424
15.066667 -0.236517 2.795162 0.193575 -0.398087 0.171271 -2.338460
15.100000 -0.249445 2.800800 0.094766 -0.393091 0.168314 -0.898930
15.133333 -0.262276 2.806290 0.038617 -0.388830 0.165455 0.579992
15.166667 -0.274957 2.811743 0.046955 -0.385364 0.162644 2.013555
15.200000 -0.287547 2.817156 0.143850 -0.382730 0.159831 3.339913
15.233333 -0.300042 2.822425 0.362622 -0.380912 0.156986 4.487184
15.266667 -0.312528 2.827630 0.649592 -0.379825 0.154096 5.399869
15.300000 -0.325033 2.832753 0.985386 -0.379359 0.151140 6.044490
15.333333 -0.337570 2.837784 1.275359 -0.379376 0.148098 6.402584
15.366667 -0.350155 2.842710 1.607422 -0.379759 0.144971 6.472266
15.400000 -0.362801 2.847521 1.909635 -0.380386 0.141771 6.268363
15.433333 -0.375517 2.852212 2.168772 -0.381130 0.138504 5.837695
15.466667 -0.388318 2.856784 2.378726 -0.381895 0.135182 5.238625
15.500000 -0.401029 2.861224 2.550274 -0.382593 0.131827 4.531450
15.533333 -0.413840 2.865550 2.635891 -0.383155 0.128467 3.774527
15.566667 -0.426748 2.869767 2.713501 -0.383503 0.125119 3.027264
15.600000 -0.439567 2.873859 2.741243 -0.383597 0.121797 2.334841
15.633333 -0.452465 2.877854 2.801470 -0.383411 0.118513 1.717404
15.666667 -0.465275 2.881726 2.822574 -0.382939 0.115272 1.192456
15.700000 -0.478130 2.885512 2.839773 -0.382162 0.112069 0.766231
15.733333 -0.490896 2.889177 2.837899 -0.381074 0.108897 0.433440
15.766667 -0.503674 2.892761 2.861607 -0.379685 0.105743 0.177424
15.800000 -0.516361 2.896228 2.825139 -0.377991 0.102593 -0.015084
15.833333 -0.529015 2.899610 2.811183 -0.375999 0.099431 -0.149930
15.866667 -0.541577 2.902879 2.793229 -0.373691 0.096231 -0.241827
15.900000 -0.554049 2.906038 2.790804 -0.371063 0.092971 -0.303411
15.933333 -0.566425 2.909098 2.763811 -0.368108 0.089631 -0.341952
15.966667 -0.578709 2.912052 2.736088 -0.364826 0.086193 -0.354380
16.000000 -0.590901 2.914901 2.733633 -0.361197 0.082630 -0.351053
16.033333 -0.603001 2.917646 2.730165 -0.357204 0.078919 -0.339236
16.066667 -0.614933 2.920258 2.726582 -0.352842 0.075039 -0.324136
16.100000 -0.626679 2.922725 2.705158 -0.348127 0.070985 -0.305266
16.133333 -0.638334 2.925096 2.704111 -0.343069 0.066754 -0.285540
16.166667 -0.649774 2.927304 2.679518 -0.337699 0.062359 -0.270368
16.200000 -0.660985 2.929341 2.684334 -0.332092 0.057839 -0.258786
16.233333 -0.671962 2.931197 2.674429 -0.326331 0.053240 -0.246976
16.266667 -0.682849 2.932966 2.660353 -0.320489 0.048604 -0.233993
16.300000 -0.693477 2.934537 2.659250 -0.314602 0.043946 -0.222145
16.333333 -0.703834 2.935902 2.658062 -0.308722 0.039291 -0.209790
16.366667 -0.713910 2.937052 2.634099 -0.302883 0.034656 -0.198855
16.400000 -0.723696 2.937979 2.637127 -0.297075 0.030024 -0.186240
16.433333 -0.733400 2.938833 2.627255 -0.291288 0.025386 -0.169791
16.466667 -0.743023 2.939617 2.618787 -0.285519 0.020736 -0.146344
16.500000 -0.752567 2.940333 2.627635 -0.279792 0.016090 -0.110363
16.533333 -0.762034 2.940984 2.611150 -0.274098 0.011446 -0.042270
16.566667 -0.771177 2.941373 2.616688 -0.268428 0.006799 0.077367
16.600000 -0.779988 2.941491 2.604423 -0.262804 0.002195 0.270155
16.633333 -0.788465 2.941329 2.606194 -0.257253 -0.002306 0.541306
16.666667 -0.796876 2.941118 2.596957 -0.251825 -0.006615 0.900600
16.700000 -0.805223 2.940861 2.590133 -0.246554 -0.010647 1.347911
16.733333 -0.813224 2.940304 2.586489 -0.241503 -0.014282 1.853860
16.766667 -0.821169 2.939709 2.653849 -0.236701 -0.017415 2.381953
16.800000 -0.828768 2.938802 2.680366 -0.232177 -0.019978 2.889294
16.833333 -0.836319 2.937867 2.749829 -0.227935 -0.021941 3.346842
16.866667 -0.843825 2.936908 2.959597 -0.223947 -0.023285 3.715076
16.900000 -0.851291 2.935930 -3.084006 -0.220200 -0.023988 3.966824
16.933333 -0.858560 2.935010 -2.829044 -0.216662 -0.024076 4.087158
16.966667 -0.865649 2.934144 -2.625709 -0.213352 -0.023572 4.078988
17.000000 -0.872711 2.933272 -2.449427 -0.210247 -0.022525 3.947871
17.033333 -0.879624 2.932455 -2.339400 -0.207358 -0.020981 3.705067
17.066667 -0.886405 2.931701 -2.235049 -0.204718 -0.018995 3.375756
17.100000 -0.893070 2.931026 -2.154657 -0.202369 -0.016624 2.974194
17.133333 -0.899726 2.930363 -2.101762 -0.200348 -0.013919 2.516956
17.166667 -0.906296 2.929828 -2.054912 -0.198669 -0.010891 2.005748
17.200000 -0.912794 2.929453 -1.983326 -0.197380 -0.007511 1.441471
17.233333 -0.919238 2.929262 -1.896736 -0.196506 -0.003742 0.811705
17.266667 -0.925644 2.929275 -1.831154 -0.196057 0.000446 0.110437
17.300000 -0.932068 2.929320 -1.800896 -0.196018 0.005065 -0.654216
17.333333 -0.938514 2.929401 -1.772392 -0.196384 0.010136 -1.472045
17.366667 -0.944989 2.929519 -1.774031 -0.197142 0.015637 -2.311004
17.400000 -0.951497 2.929942 -1.829419 -0.198262 0.021486 -3.134733
17.433333 -0.958052 2.930707 -2.000773 -0.199717 0.027602 -3.883143
17.466667 -0.964652 2.931519 -2.235747 -0.201467 0.033884 -4.511645
17.500000 -0.971336 2.932734 -2.527602 -0.203484 0.040212 -4.976619
17.533333 -0.978121 2.934381 -2.767144 -0.205736 0.046431 -5.239436
17.566667 -0.984967 2.936083 -3.030299 -0.208199 0.052402 -5.288172
17.600000 -0.991957 2.938251 3.064993 -0.210851 0.058007 -5.125258
17.633333 -0.999009 2.940513 2.842171 -0.213674 0.063149 -4.782832
17.666667 -1.006143 2.942880 2.606816 -0.216660 0.067749 -4.293403
17.700000 -1.013357 2.945306 2.485406 -0.219799 0.071778 -3.711428
17.733333 -1.020691 2.947847 2.391847 -0.223088 0.075273 -3.086839
17.766667 -1.028161 2.950498 2.353760 -0.226518 0.078268 -2.466363
17.800000 -1.035725 2.953210 2.306616 -0.230089 0.080853 -1.883204
17.833333 -1.043444 2.956005 2.283811 -0.233792 0.083097 -1.360716
17.866667 -1.051267 2.958861 2.267941 -0.237618 0.085071 -0.921391
17.900000 -1.059197 2.961782 2.247058 -0.241555 0.086827 -0.563360
17.933333 -1.067291 2.964739 2.264783 -0.245588 0.088388 -0.288026
17.966667 -1.075550 2.967722 2.272553 -0.249707 0.089776 -0.082729
18.000000 -1.083930 2.970769 2.276257 -0.253901 0.090963 0.061253
18.033333 -1.092473 2.973814 2.292522 -0.258164 0.091944 0.154630
18.066667 -1.101145 2.976926 2.310997 -0.262493 0.092730 0.212220
18.100000 -1.109951 2.980104 2.316499 -0.266889 0.093314 0.232313
18.133333 -1.118895 2.983350 2.320306 -0.271361 0.093706 0.203992
18.166667 -1.127995 2.986552 2.345179 -0.275916 0.093936 0.095784
18.200000 -1.137247 2.989701 2.349689 -0.280562 0.094070 -0.118279
18.233333 -1.146648 2.992920 2.357537 -0.285320 0.094148 -0.471062
18.266667 -1.156209 2.996073 2.358823 -0.290211 0.094213 -0.993232
18.300000 -1.165931 2.999153 2.363408 -0.295263 0.094341 -1.692397
18.333333 -1.175823 3.002154 2.368066 -0.300517 0.094616 -2.540070
18.366667 -1.185879 3.005227 2.377616 -0.306032 0.095102 -3.469369
18.400000 -1.196100 3.008374 2.375617 -0.311890 0.095831 -4.416856
18.433333 -1.206551 3.011461 2.280368 -0.318167 0.096871 -5.281266
18.466667 -1.217175 3.014623 2.008275 -0.324935 0.098262 -5.945471
18.500000 -1.227974 3.017864 1.605497 -0.332242 0.100009 -6.306500
18.533333 -1.238951 3.021182 1.249357 -0.340127 0.102086 -6.294169
18.566667 -1.250254 3.024532 0.801728 -0.348602 0.104474 -5.868809
18.600000 -1.261741 3.027962 0.373670 -0.357664 0.107153 -5.005903
18.633333 -1.273609 3.031490 0.056723 -0.367300 0.110063 -3.748447
18.666667 -1.285884 3.035141 -0.132140 -0.377508 0.113150 -2.201119
18.700000 -1.298589 3.038936 -0.172098 -0.388315 0.116373 -0.490564
18.733333 -1.311744 3.042882 -0.135119 -0.399720 0.119691 1.249018
18.766667 -1.325369 3.046985 0.080582 -0.411688 0.123052 2.868727
18.800000 -1.339186 3.051173 0.375795 -0.424146 0.126407 4.231520
18.833333 -1.353195 3.055448 0.666389 -0.437011 0.129726 5.251073
18.866667 -1.367722 3.059852 1.041278 -0.450146 0.132983 5.897244
18.900000 -1.382777 3.064368 1.398341 -0.463360 0.136157 6.171087
18.933333 -1.398374 3.068984 1.703071 -0.476464 0.139242 6.105094
18.966667 -1.414524 3.073693 1.947568 -0.489304 0.142250 5.771301
19.000000 -1.431241 3.078492 2.066514 -0.501745 0.145194 5.259759
19.033333 -1.448535 3.083387 2.215096 -0.513635 0.148085 4.644040
19.066667 -1.466408 3.088381 2.297255 -0.524878 0.150941 3.996871
19.100000 -1.484460 3.093464 2.385035 -0.535463 0.153777 3.378638
19.133333 -1.502689 3.098637 2.462360 -0.545414 0.156606 2.829023
19.166667 -1.521090 3.103900 2.528976 -0.554803 0.159436 2.365049
19.200000 -1.539659 3.109253 2.590475 -0.563730 0.162275 1.977285
19.233333 -1.558394 3.114697 2.643909 -0.572363 0.165128 1.664210
19.266667 -1.577622 3.120246 2.697867 -0.580838 0.168000 1.404776
19.300000 -1.597006 3.125885 2.746267 -0.589232 0.170885 1.180446
19.333333 -1.616829 3.131628 2.777243 -0.597564 0.173780 0.979286
19.366667 -1.636799 3.137461 2.799317 -0.605797 0.176676 0.792340
19.400000 -1.657155 3.143399 2.819579 -0.613841 0.179562 0.621406
19.433333 -1.677866 3.149440 2.836219 -0.621552 0.182424 0.461107
19.466667 -1.698900 3.155580 2.842987 -0.628813 0.185248 0.315438
19.500000 -1.720223 3.161820 2.849614 -0.635505 0.188021 0.186564
19.533333 -1.741800 3.168154 2.839903 -0.641549 0.190729 0.073933
19.566667 -1.763488 3.174577 2.846012 -0.646884 0.193359 -0.023080
19.600000 -1.785281 3.181089 2.837022 -0.651501 0.195904 -0.105526
19.633333 -1.807228 3.187681 2.824308 -0.655419 0.198360 -0.171274
19.666667 -1.829267 3.194361 2.821753 -0.658659 0.200720 -0.223051
19.700000 -1.851389 3.201128 2.812448 -0.661276 0.202982 -0.260833
19.733333 -1.873577 3.207953 2.799852 -0.663345 0.205156 -0.286809
19.766667 -1.895797 3.214828 2.783828 -0.664924 0.207243 -0.300317
19.800000 -1.918080 3.221788 2.774521 -0.666050 0.209241 -0.302635
19.833333 -1.940419 3.228834 2.756058 -0.666780 0.211160 -0.294908
19.866667 -1.962699 3.235898 2.743219 -0.667138 0.213001 -0.270578
19.900000 -1.985021 3.243047 2.739047 -0.667116 0.214749 -0.224128
19.933333 -2.007379 3.250279 2.722943 -0.666660 0.216366 -0.143047
19.966667 -2.029596 3.257497 2.717791 -0.665761 0.217835 -0.012066
20.000000 -2.051835 3.264798 2.713331 -0.664409 0.219143 0.187160
20.033333 -2.074089 3.272181 2.715228 -0.662566 0.220281 0.467727
20.066667 -2.096350 3.279645 2.703646 -0.660204 0.221271 0.826554
20.100000 -2.118393 3.287059 2.706390 -0.657351 0.222190 1.246047
20.133333 -2.140431 3.294552 2.700372 -0.654068 0.223158 1.688536
20.166667 -2.162456 3.302127 2.715940 -0.650367 0.224294 2.097805
20.200000 -2.184204 3.309623 2.794095 -0.646275 0.225744 2.408102
20.233333 -2.205661 3.317031 2.903590 -0.641859 0.227664 2.563130
20.266667 -2.226818 3.324340 3.042796 -0.637221 0.230187 2.519522
20.300000 -2.247936 3.331727 -3.014516 -0.632425 0.233379 2.254393
20.333333 -2.269011 3.339193 -2.785123 -0.627525 0.237257 1.773164
20.366667 -2.289891 3.346915 -2.565593 -0.622617 0.241795 1.107004
20.400000 -2.310576 3.354885 -2.430241 -0.617779 0.246887 0.312038
20.433333 -2.331072 3.363106 -2.422491 -0.613056 0.252354 -0.554585
20.466667 -2.351384 3.371588 -2.570955 -0.608442 0.257986 -1.418531
20.500000 -2.371524 3.380354 -2.786695 -0.603946 0.263583 -2.202354
20.533333 -2.391506 3.389430 -3.033132 -0.599582 0.268952 -2.837813
20.566667 -2.411345 3.398841 3.085202 -0.595338 0.273925 -3.279763
20.600000 -2.431098 3.408324 2.906892 -0.591187 0.278398 -3.508158
20.633333 -2.450763 3.417875 2.754475 -0.587093 0.282340 -3.521790
20.666667 -2.470225 3.427435 2.608733 -0.583025 0.285776 -3.353701
20.700000 -2.489589 3.437060 2.508628 -0.578943 0.288768 -3.056388
20.733333 -2.508850 3.446748 2.434469 -0.574794 0.291409 -2.691391
20.766667 -2.528004 3.456495 2.361674 -0.570524 0.293831 -2.301169
20.800000 -2.547046 3.466301 2.323236 -0.566097 0.296142 -1.924590
20.833333 -2.565902 3.476180 2.275281 -0.561503 0.298434 -1.585211
20.866667 -2.584569 3.486138 2.239896 -0.556737 0.300760 -1.292070
20.900000 -2.603111 3.496148 2.208837 -0.551805 0.303155 -1.041559
20.933333 -2.621464 3.506255 2.176651 -0.546714 0.305643 -0.822080
20.966667 -2.639624 3.516470 2.151967 -0.541486 0.308213 -0.631189
21.000000 -2.657586 3.526796 2.147302 -0.536139 0.310862 -0.461323
21.033333 -2.675346 3.537238 2.131088 -0.530685 0.313578 -0.308334
21.066667 -2.692964 3.547719 2.115704 -0.525122 0.316373 -0.168416
21.100000 -2.710373 3.558328 2.120596 -0.519456 0.319237 -0.041331
21.133333 -2.727633 3.568970 2.117525 -0.513686 0.322154 0.071315
21.166667 -2.744681 3.579751 2.122870 -0.507810 0.325101 0.168891
21.200000 -2.761572 3.590559 2.151188 -0.501818 0.328052 0.249377
21.233333 -2.778251 3.601509 2.163394 -0.495708 0.330975 0.312342
21.266667 -2.794714 3.612597 2.176902 -0.489497 0.333812 0.356637
21.300000 -2.810955 3.623811 2.203126 -0.483192 0.336518 0.382766
21.333333 -2.826972 3.635149 2.213807 -0.476820 0.339033 0.391425
21.366667 -2.842754 3.646597 2.226259 -0.470403 0.341311 0.383057
21.400000 -2.858296 3.658145 2.242862 -0.463981 0.343288 0.363057
21.433333 -2.873663 3.669695 2.253258 -0.457580 0.344924 0.333678
21.466667 -2.888773 3.681328 2.263521 -0.451216 0.346197 0.299496
21.500000 -2.903703 3.692955 2.285424 -0.444904 0.347098 0.262432
21.533333 -2.918374 3.704647 2.284824 -0.438645 0.347638 0.223986
21.566667 -2.932861 3.716325 2.295897 -0.432437 0.347834 0.186263
21.600000 -2.947161 3.727984 2.295897 -0.426261 0.347725 0.147455
21.633333 -2.961273 3.739622 2.295897 -0.420112 0.347343 0.107427
21.666667 -2.975195 3.751233 2.295897 -0.413981 0.346723 0.065303
21.700000 -2.988925 3.762813 2.295897 -0.407853 0.345884 0.024223
21.733333 -3.002461 3.774359 2.304035 -0.401705 0.344851 -0.014564
21.766667 -3.015723 3.785866 2.310556 -0.395527 0.343639 -0.051825
21.800000 -3.028789 3.797331 2.316722 -0.389314 0.342257 -0.088168
21.833333 -3.041657 3.808748 2.303713 -0.383054 0.340713 -0.122868
21.866667 -3.054325 3.820114 2.286427 -0.376734 0.338999 -0.155396
21.900000 -3.066794 3.831425 2.281290 -0.370355 0.337118 -0.188099
21.933333 -3.079060 3.842677 2.271586 -0.363924 0.335066 -0.221393
21.966667 -3.091124 3.853865 2.263358 -0.357427 0.332829 -0.251192
22.000000 -3.102984 3.864986 2.258151 -0.350850 0.330391 -0.275517
22.033333 -3.114548 3.875970 2.252224 -0.344184 0.327745 -0.293481
22.066667 -3.125906 3.886880 2.252669 -0.337441 0.324899 -0.305750
22.100000 -3.137057 3.897710 2.230017 -0.330614 0.321844 -0.308905
22.133333 -3.148002 3.908458 2.217952 -0.323687 0.318555 -0.301437
22.166667 -3.158739 3.919118 2.201037 -0.316658 0.315015 -0.284852
22.200000 -3.169162 3.929576 2.183806 -0.309524 0.311201 -0.257128
22.233333 -3.179377 3.939939 2.173548 -0.302259 0.307061 -0.220060
22.266667 -3.189383 3.950205 2.160168 -0.294824 0.302534 -0.173675
22.300000 -3.199066 3.960228 2.158815 -0.287202 0.297581 -0.125954
22.333333 -3.208541 3.970146 2.150620 -0.279384 0.292175 -0.081657
22.366667 -3.217806 3.979957 2.155734 -0.271372 0.286311 -0.046840
22.400000 -3.226862 3.989656 2.153527 -0.263171 0.279998 -0.037518
22.433333 -3.235593 3.999072 2.167567 -0.254814 0.273280 -0.073498
22.466667 -3.243996 4.008187 2.173949 -0.246346 0.266216 -0.173203
22.500000 -3.252069 4.016993 2.181902 -0.237812 0.258884 -0.348066
22.533333 -3.259812 4.025475 2.201182 -0.229283 0.251396 -0.609067
22.566667 -3.267224 4.033626 2.195378 -0.220821 0.243858 -0.958346
22.600000 -3.274432 4.041652 2.176304 -0.212488 0.236367 -1.379509
22.633333 -3.281308 4.049329 2.157683 -0.204346 0.229029 -1.839276
22.666667 -3.287851 4.056650 2.132959 -0.196448 0.221941 -2.305174
22.700000 -3.294193 4.063841 2.108238 -0.188822 0.215152 -2.745919
22.733333 -3.300336 4.070901 1.989869 -0.181464 0.208658 -3.122237
22.766667 -3.306164 4.077600 1.764098 -0.174370 0.202458 -3.399198
22.800000 -3.311797 4.084167 1.540658 -0.167531 0.196546 -3.550209
22.833333 -3.317237 4.090599 1.340190 -0.160919 0.190868 -3.553848
22.866667 -3.322486 4.096898 1.176201 -0.154490 0.185342 -3.397803
22.900000 -3.327475 4.102915 1.060200 -0.148225 0.179929 -3.075821
22.933333 -3.332278 4.108797 0.968996 -0.142112 0.174602 -2.609644
22.966667 -3.336896 4.114544 0.865663 -0.136128 0.169311 -2.038149
23.000000 -3.341332 4.120155 0.776676 -0.130256 0.164015 -1.408069
23.033333 -3.345551 4.125539 0.727784 -0.124492 0.158708 -0.777030
23.066667 -3.349593 4.130787 0.730692 -0.118846 0.153408 -0.192044
23.100000 -3.353436 4.135827 0.733519 -0.113317 0.148107 0.305902
23.133333 -3.357089 4.140666 0.801098 -0.107908 0.142807 0.692599
23.166667 -3.360559 4.145307 0.928085 -0.102629 0.137531 0.960239
23.200000 -3.363852 4.149751 1.013132 -0.097491 0.132308 1.110716
23.233333 -3.366981 4.154060 1.132257 -0.092498 0.127148 1.153179
23.266667 -3.369944 4.158172 1.205951 -0.087652 0.122065 1.102732
23.300000 -3.372749 4.162152 1.203502 -0.082955 0.117084 0.978484
23.333333 -3.375402 4.165942 1.207892 -0.078401 0.112220 0.807418
23.366667 -3.377902 4.169602 1.207085 -0.073985 0.107481 0.618216
23.400000 -3.380264 4.173085 1.208220 -0.069699 0.102859 0.432312
23.433333 -3.382494 4.176398 1.213592 -0.065538 0.098364 0.272325
23.466667 -3.384598 4.179549 1.199203 -0.061493 0.093994 0.151744
23.500000 -3.386561 4.182573 1.205664 -0.057562 0.089746 0.071128
23.533333 -3.388386 4.185474 1.209165 -0.053751 0.085614 0.023345
23.566667 -3.390102 4.188224 1.206803 -0.050061 0.081600 -0.001494
23.600000 -3.391687 4.190852 1.209147 -0.046498 0.077702 -0.011037
23.633333 -3.393142 4.193361 1.205983 -0.043065 0.073911 -0.011153
23.666667 -3.394471 4.195751 1.205324 -0.039767 0.070219 -0.010945
