t x y theta dxdt dydt dthetadt
0.000000 0.000000 0.000000 -1.441473 0.011367 0.041313 -0.000374
0.033333 0.000351 0.001299 -1.434468 0.013774 0.045814 0.012467
0.066667 0.000798 0.002861 -1.434493 0.016518 0.050954 0.032272
0.100000 0.001296 0.004447 -1.438178 0.019638 0.056822 0.064198
0.133333 0.001930 0.006371 -1.436252 0.023198 0.063552 0.113882
0.166667 0.002617 0.008317 -1.442767 0.027266 0.071271 0.185697
0.200000 0.003515 0.010681 -1.435019 0.031885 0.080047 0.278848
0.233333 0.004601 0.013476 -1.424704 0.037085 0.089894 0.386853
0.266667 0.005744 0.016287 -1.436158 0.042896 0.100843 0.505605
0.300000 0.006944 0.019110 -1.430314 0.049309 0.112840 0.627560
0.333333 0.008448 0.022555 -1.415171 0.056295 0.125768 0.743832
0.366667 0.010282 0.026679 -1.372894 0.063840 0.139503 0.841963
0.400000 0.012474 0.031522 -1.322734 0.071933 0.153910 0.912729
0.433333 0.015027 0.037062 -1.270152 0.080518 0.168779 0.953717
0.466667 0.017928 0.043293 -1.216237 0.089500 0.183789 0.958045
0.500000 0.020888 0.049510 -1.160646 0.098807 0.198680 0.923200
0.533333 0.024215 0.056378 -1.119252 0.108336 0.213164 0.848895
0.566667 0.027957 0.063962 -1.106463 0.117912 0.226877 0.745334
0.600000 0.032141 0.072234 -1.091152 0.127299 0.239391 0.625026
0.633333 0.036379 0.080462 -1.068548 0.136329 0.250426 0.495211
0.666667 0.041104 0.089270 -1.049166 0.144821 0.259758 0.365511
0.700000 0.046333 0.098623 -1.032302 0.152560 0.267115 0.240130
0.733333 0.052004 0.108441 -1.045901 0.159223 0.272094 0.125501
0.766667 0.057718 0.118177 -1.052563 0.164583 0.274461 0.016372
0.800000 0.063804 0.128228 -1.077907 0.168515 0.274171 -0.087312
0.833333 0.069928 0.138174 -1.075228 0.170872 0.271120 -0.182765
0.866667 0.076187 0.148000 -1.080763 0.171430 0.265043 -0.265620
0.900000 0.082366 0.157399 -1.058479 0.170050 0.255805 -0.338320
0.933333 0.088227 0.165999 -1.054217 0.166759 0.243513 -0.407263
0.966667 0.094110 0.174455 -1.065688 0.161369 0.227938 -0.473981
1.000000 0.100014 0.182757 -1.116140 0.153693 0.208808 -0.551262
1.033333 0.105936 0.190896 -1.171394 0.143544 0.185853 -0.653034
1.066667 0.110383 0.196424 -1.205911 0.131135 0.159455 -0.787288
1.100000 0.114843 0.201775 -1.231186 0.116628 0.129897 -0.939998
1.133333 0.119315 0.206943 -1.215532 0.100169 0.097425 -1.101619
1.166667 0.123798 0.211921 -1.188327 0.082149 0.062628 -1.261238
1.200000 0.126538 0.213730 -1.201865 0.063077 0.026308 -1.397710
1.233333 0.129289 0.215343 -1.300213 0.043464 -0.010728 -1.479142
1.266667 0.130064 0.213699 -1.367654 0.023566 -0.048183 -1.482934
1.300000 0.128777 0.208822 -1.444211 0.003828 -0.085562 -1.403085
1.333333 0.127511 0.203755 -1.555088 -0.015144 -0.122244 -1.225066
1.366667 0.126271 0.198504 -1.694334 -0.032702 -0.157523 -0.938767
1.400000 0.125064 0.193074 -1.770936 -0.048426 -0.191215 -0.553614
1.433333 0.123895 0.187472 -1.797018 -0.061824 -0.223149 -0.101674
1.466667 0.121193 0.179402 -1.789338 -0.072442 -0.253055 0.381598
1.500000 0.117267 0.169146 -1.742728 -0.080085 -0.280838 0.860813
1.533333 0.113402 0.158745 -1.664362 -0.084765 -0.306480 1.290017
1.566667 0.109608 0.148209 -1.572524 -0.086604 -0.330138 1.622855
1.600000 0.105641 0.136244 -1.444923 -0.085695 -0.351567 1.829593
1.633333 0.101877 0.123186 -1.330436 -0.082289 -0.370413 1.900872
1.666667 0.098636 0.109338 -1.211229 -0.076738 -0.386482 1.841011
1.700000 0.095503 0.095411 -1.125261 -0.069423 -0.399747 1.663562
1.733333 0.093304 0.081164 -1.070725 -0.060718 -0.410166 1.397067
1.766667 0.092104 0.066687 -1.017262 -0.051069 -0.417685 1.077918
1.800000 0.091037 0.052178 -1.002857 -0.040898 -0.422491 0.747149
1.833333 0.090109 0.037653 -0.998038 -0.030502 -0.424866 0.436383
1.866667 0.089327 0.023130 -1.002970 -0.020095 -0.425067 0.169943
1.900000 0.088699 0.008625 -1.036361 -0.009780 -0.423186 -0.030559
1.933333 0.088232 -0.005846 -1.095210 0.000383 -0.419375 -0.155208
1.966667 0.087932 -0.020267 -1.124118 0.010481 -0.413823 -0.201950
2.000000 0.088496 -0.034320 -1.134680 0.020582 -0.406511 -0.179442
2.033333 0.089241 -0.048291 -1.160712 0.030680 -0.397522 -0.094961
2.066667 0.090716 -0.061495 -1.160352 0.040748 -0.386910 0.044299
2.100000 0.092384 -0.074584 -1.145865 0.050791 -0.374610 0.222588
2.133333 0.094249 -0.087544 -1.143075 0.060823 -0.360554 0.424587
2.166667 0.096698 -0.099290 -1.125125 0.070782 -0.344660 0.634635
2.200000 0.099354 -0.110877 -1.104440 0.080715 -0.326965 0.838193
2.233333 0.102222 -0.122291 -1.060702 0.090723 -0.307364 1.016507
2.266667 0.105309 -0.132406 -1.025617 0.101022 -0.285700 1.149375
2.300000 0.108618 -0.142323 -0.982598 0.111758 -0.262066 1.221102
2.333333 0.112362 -0.150567 -0.933828 0.122996 -0.236805 1.217907
2.366667 0.116336 -0.158590 -0.877532 0.134811 -0.210269 1.135602
2.400000 0.120543 -0.166381 -0.782500 0.147175 -0.182867 0.975560
2.433333 0.125397 -0.172446 -0.690735 0.159993 -0.155241 0.746034
2.466667 0.130858 -0.176945 -0.629740 0.173066 -0.128073 0.461369
2.500000 0.136908 -0.180078 -0.616906 0.186222 -0.101991 0.147281
2.533333 0.143558 -0.182032 -0.640389 0.199350 -0.077309 -0.162788
2.566667 0.150734 -0.183069 -0.670192 0.212311 -0.054392 -0.442841
2.600000 0.158420 -0.183415 -0.713787 0.224976 -0.033559 -0.668963
2.633333 0.166357 -0.183489 -0.781694 0.237329 -0.014748 -0.815268
2.666667 0.174544 -0.183289 -0.875824 0.249459 0.002336 -0.860198
2.700000 0.182984 -0.182812 -0.951922 0.261520 0.018224 -0.801950
2.733333 0.191676 -0.182057 -0.988092 0.273660 0.033406 -0.650433
2.766667 0.200773 -0.181013 -1.026706 0.286060 0.048485 -0.417196
2.800000 0.210318 -0.179569 -1.045606 0.298979 0.064190 -0.118394
2.833333 0.220370 -0.177578 -1.023287 0.312579 0.080999 0.214861
2.866667 0.230971 -0.174879 -0.989506 0.326878 0.099078 0.546410
2.900000 0.241823 -0.171896 -0.966989 0.341781 0.118334 0.849468
2.933333 0.252925 -0.168628 -0.941845 0.357188 0.138635 1.102203
2.966667 0.264856 -0.164110 -0.886353 0.372951 0.159712 1.285551
3.000000 0.277667 -0.158251 -0.802877 0.388810 0.181043 1.382531
3.033333 0.291348 -0.151006 -0.727457 0.404453 0.202027 1.393976
3.066667 0.305269 -0.143485 -0.625104 0.419670 0.222225 1.323814
3.100000 0.319426 -0.135692 -0.565273 0.434332 0.241268 1.183785
3.133333 0.334412 -0.126801 -0.509348 0.448285 0.258706 0.986837
3.166667 0.350168 -0.117004 -0.483193 0.461415 0.274191 0.754272
3.200000 0.366145 -0.106951 -0.448226 0.473707 0.287638 0.511137
3.233333 0.382339 -0.096648 -0.453565 0.485273 0.299175 0.276691
3.266667 0.398743 -0.086102 -0.470628 0.496204 0.308899 0.074433
3.300000 0.415351 -0.075319 -0.499342 0.506542 0.316957 -0.083960
3.333333 0.432504 -0.064468 -0.538707 0.516366 0.323696 -0.183742
3.366667 0.449849 -0.053393 -0.569035 0.525795 0.329492 -0.224434
3.400000 0.467380 -0.042103 -0.594767 0.534894 0.334637 -0.206888
3.433333 0.485438 -0.030849 -0.601304 0.543647 0.339354 -0.140648
3.466667 0.503950 -0.019602 -0.612922 0.552015 0.343882 -0.036873
3.500000 0.522626 -0.008159 -0.598012 0.559968 0.348425 0.091844
3.533333 0.541661 0.003374 -0.582985 0.567454 0.353027 0.222120
3.566667 0.560844 0.015089 -0.572538 0.574363 0.357640 0.337313
3.600000 0.580169 0.026978 -0.564987 0.580577 0.362161 0.420270
3.633333 0.599741 0.039126 -0.558455 0.586013 0.366401 0.463853
3.666667 0.619582 0.051581 -0.513730 0.590607 0.370089 0.456136
3.700000 0.639540 0.064188 -0.476618 0.594284 0.372923 0.395330
3.733333 0.659617 0.076959 -0.429583 0.596992 0.374647 0.287316
3.766667 0.679794 0.089869 -0.413355 0.598712 0.375082 0.144478
3.800000 0.700063 0.102909 -0.381556 0.599448 0.374129 -0.023978
3.833333 0.720415 0.116073 -0.380898 0.599204 0.371806 -0.203989
3.866667 0.740688 0.128975 -0.410749 0.598018 0.368298 -0.372227
3.900000 0.760832 0.141531 -0.453871 0.595971 0.363921 -0.507574
3.933333 0.780785 0.153680 -0.486700 0.593171 0.359099 -0.587326
3.966667 0.800620 0.165461 -0.536071 0.589719 0.354293 -0.602538
4.000000 0.820277 0.176884 -0.572239 0.585755 0.349973 -0.541366
4.033333 0.839723 0.187965 -0.620343 0.581454 0.346585 -0.407675
4.066667 0.858963 0.198797 -0.676588 0.576992 0.344464 -0.214799
4.100000 0.878224 0.209704 -0.686331 0.572520 0.343785 0.014214
4.133333 0.897254 0.220583 -0.697580 0.568154 0.344547 0.252891
4.166667 0.916057 0.231597 -0.662739 0.564012 0.346591 0.476344
4.200000 0.934657 0.242849 -0.617854 0.560171 0.349656 0.659468
4.233333 0.953073 0.254417 -0.563747 0.556676 0.353375 0.785084
4.266667 0.971420 0.266425 -0.485814 0.553531 0.357339 0.839764
4.300000 0.989667 0.278871 -0.426200 0.550749 0.361167 0.824580
4.333333 1.007894 0.291358 -0.365969 0.548335 0.364505 0.740638
4.366667 1.026096 0.303880 -0.336171 0.546267 0.367107 0.600234
4.400000 1.044267 0.316430 -0.322079 0.544519 0.368750 0.420205
4.433333 1.062402 0.329004 -0.328704 0.543027 0.369328 0.220814
4.466667 1.080448 0.341542 -0.332839 0.541742 0.368834 0.025442
4.500000 1.098409 0.353956 -0.352708 0.540614 0.367293 -0.150681
4.533333 1.116319 0.366376 -0.373237 0.539586 0.364812 -0.289898
4.566667 1.134322 0.378572 -0.403661 0.538609 0.361463 -0.380422
4.600000 1.152264 0.390762 -0.420924 0.537630 0.357395 -0.420965
4.633333 1.170139 0.402942 -0.439437 0.536622 0.352693 -0.414212
4.666667 1.188063 0.414657 -0.462468 0.535544 0.347438 -0.367714
4.700000 1.205909 0.426352 -0.503532 0.534341 0.341746 -0.287053
4.733333 1.223802 0.437503 -0.514609 0.532954 0.335739 -0.185308
4.766667 1.241607 0.448625 -0.525046 0.531326 0.329578 -0.077330
4.800000 1.259321 0.459714 -0.509353 0.529393 0.323405 0.028234
4.833333 1.277044 0.470239 -0.505810 0.527073 0.317474 0.123877
4.866667 1.294665 0.480724 -0.488103 0.524309 0.311973 0.203468
4.900000 1.312212 0.490758 -0.464098 0.521053 0.307088 0.258861
4.933333 1.329647 0.500745 -0.450836 0.517268 0.302961 0.293647
4.966667 1.346951 0.510417 -0.424647 0.512939 0.299763 0.311679
5.000000 1.364135 0.520036 -0.403448 0.508087 0.297620 0.316822
5.033333 1.381193 0.529602 -0.386537 0.502773 0.296494 0.310122
5.066667 1.398122 0.539111 -0.394845 0.497050 0.296380 0.296905
5.100000 1.414683 0.548683 -0.403754 0.490995 0.297194 0.283259
5.133333 1.430896 0.558450 -0.405628 0.484720 0.298837 0.267060
5.166667 1.446823 0.568490 -0.398932 0.478344 0.301056 0.251641
5.200000 1.462605 0.578462 -0.386165 0.471970 0.303623 0.239374
5.233333 1.478239 0.588365 -0.367396 0.465686 0.306406 0.236690
5.266667 1.493592 0.598707 -0.343712 0.459591 0.309235 0.239622
5.300000 1.508684 0.609493 -0.322674 0.453753 0.311948 0.247575
5.333333 1.523621 0.620199 -0.320761 0.448179 0.314375 0.262511
5.366667 1.538399 0.630820 -0.329682 0.442856 0.316474 0.279828
5.400000 1.553017 0.641353 -0.328192 0.437765 0.318203 0.296287
5.433333 1.567473 0.651794 -0.332495 0.432888 0.319464 0.305343
5.466667 1.581823 0.662702 -0.341780 0.428189 0.320195 0.311383
5.500000 1.596007 0.673509 -0.306919 0.423634 0.320411 0.310670
5.533333 1.610023 0.684212 -0.286694 0.419220 0.320139 0.301701
5.566667 1.623956 0.695161 -0.245578 0.414941 0.319321 0.283114
5.600000 1.637717 0.705997 -0.244942 0.410789 0.317881 0.257571
5.633333 1.651305 0.716715 -0.216612 0.406744 0.315764 0.226642
5.666667 1.664718 0.727311 -0.216393 0.402771 0.312950 0.190192
5.700000 1.678028 0.737845 -0.219061 0.398823 0.309335 0.154752
5.733333 1.691161 0.748249 -0.222223 0.394839 0.304850 0.121872
5.766667 1.704264 0.758551 -0.234548 0.390729 0.299479 0.099389
5.800000 1.717317 0.768679 -0.247099 0.386388 0.293252 0.084094
5.833333 1.730191 0.778664 -0.247071 0.381726 0.286203 0.077309
5.866667 1.742978 0.788324 -0.240883 0.376618 0.278333 0.073491
5.900000 1.755635 0.797645 -0.231775 0.370977 0.269731 0.067002
5.933333 1.768130 0.806565 -0.215936 0.364651 0.260431 0.053233
5.966667 1.780442 0.815327 -0.207173 0.357484 0.250438 0.022005
6.000000 1.792445 0.823595 -0.192054 0.349269 0.239697 -0.028763
6.033333 1.804081 0.831335 -0.193302 0.339718 0.228119 -0.101711
6.066667 1.815535 0.838910 -0.204252 0.328556 0.215603 -0.191783
6.100000 1.826478 0.845863 -0.192806 0.315520 0.202023 -0.297524
6.133333 1.837239 0.852649 -0.208787 0.300386 0.187286 -0.408396
6.166667 1.847820 0.859265 -0.224021 0.283051 0.171389 -0.512433
6.200000 1.857583 0.865063 -0.251293 0.263498 0.154418 -0.596481
6.233333 1.867168 0.870691 -0.272149 0.241870 0.136527 -0.649626
6.266667 1.875695 0.875390 -0.313162 0.218424 0.117992 -0.666028
6.300000 1.883103 0.879164 -0.347001 0.193436 0.099090 -0.638914
6.333333 1.889294 0.881983 -0.378922 0.167316 0.080207 -0.575452
6.366667 1.894184 0.883879 -0.422806 0.140369 0.061722 -0.486127
6.400000 1.897669 0.884859 -0.454886 0.113048 0.044015 -0.387597
6.433333 1.901012 0.885685 -0.487345 0.085729 0.027432 -0.295664
6.466667 1.902823 0.885762 -0.482795 0.058878 0.012239 -0.227926
6.500000 1.904513 0.885695 -0.463385 0.032831 -0.001387 -0.197239
6.533333 1.904734 0.884986 -0.423480 0.007859 -0.013338 -0.208886
6.566667 1.904858 0.884145 -0.383366 -0.015827 -0.023581 -0.260791
6.600000 1.903534 0.882814 -0.363103 -0.038173 -0.032170 -0.344082
6.633333 1.902140 0.881364 -0.373522 -0.059126 -0.039160 -0.444867
6.666667 1.899306 0.879607 -0.393528 -0.078883 -0.044615 -0.543677
6.700000 1.894987 0.877678 -0.451351 -0.097438 -0.048534 -0.621559
6.733333 1.890647 0.875652 -0.501924 -0.114876 -0.050997 -0.662574
6.766667 1.886305 0.873539 -0.559446 -0.131083 -0.052109 -0.655562
6.800000 1.881980 0.871344 -0.622390 -0.146068 -0.051974 -0.595188
6.833333 1.877691 0.869076 -0.666484 -0.159853 -0.050669 -0.488694
6.866667 1.872087 0.867224 -0.686701 -0.172289 -0.048348 -0.344515
6.900000 1.865202 0.865802 -0.684194 -0.183344 -0.045193 -0.178019
6.933333 1.858413 0.864329 -0.661623 -0.192832 -0.041345 -0.002965
6.966667 1.851741 0.862811 -0.616425 -0.200642 -0.036880 0.162728
7.000000 1.844151 0.861757 -0.599088 -0.206410 -0.031855 0.305140
7.033333 1.836723 0.860671 -0.579889 -0.209747 -0.026391 0.420186
7.066667 1.828741 0.859980 -0.571346 -0.210328 -0.020533 0.507188
7.100000 1.820969 0.859268 -0.556250 -0.207966 -0.014297 0.568606
7.133333 1.813430 0.858541 -0.532040 -0.202524 -0.007700 0.606211
7.166667 1.805999 0.858169 -0.526742 -0.193862 -0.000827 0.630995
7.200000 1.798796 0.858120 -0.506011 -0.182123 0.006240 0.649221
7.233333 1.792081 0.858420 -0.470365 -0.167401 0.013428 0.661446
7.266667 1.786049 0.859056 -0.434552 -0.149904 0.020654 0.658462
7.300000 1.780857 0.860028 -0.421544 -0.129668 0.027811 0.637746
7.333333 1.776683 0.861346 -0.399235 -0.106821 0.034765 0.599027
7.366667 1.772901 0.862680 -0.385890 -0.081629 0.041433 0.541334
7.400000 1.770391 0.864353 -0.340932 -0.054303 0.047749 0.464608
7.433333 1.768313 0.866048 -0.307071 -0.025179 0.053680 0.377041
7.466667 1.767556 0.867997 -0.294229 0.005463 0.059226 0.299878
7.500000 1.768206 0.870191 -0.294023 0.037179 0.064401 0.246955
7.533333 1.769340 0.872415 -0.275362 0.069536 0.069261 0.231804
7.566667 1.771916 0.874805 -0.294115 0.102109 0.073845 0.262354
7.600000 1.775953 0.877374 -0.336916 0.134546 0.078202 0.349714
7.633333 1.781519 0.880132 -0.349810 0.166473 0.082353 0.494862
7.666667 1.788646 0.883090 -0.366713 0.197430 0.086271 0.685005
7.700000 1.796325 0.886086 -0.343021 0.227160 0.089951 0.900270
7.733333 1.804565 0.889119 -0.307890 0.255557 0.093383 1.118158
7.766667 1.813377 0.892192 -0.278648 0.282804 0.096587 1.314981
7.800000 1.823934 0.895649 -0.204538 0.309211 0.099560 1.463672
7.833333 1.835080 0.899147 -0.108840 0.335251 0.102325 1.544871
7.866667 1.846821 0.902687 0.005127 0.361726 0.104952 1.544888
7.900000 1.859165 0.906269 0.107317 0.389485 0.107509 1.465793
7.933333 1.872117 0.909895 0.180242 0.419136 0.110049 1.315551
7.966667 1.885683 0.913564 0.224230 0.451051 0.112632 1.109572
8.000000 1.899870 0.917279 0.254991 0.485560 0.115395 0.870395
8.033333 1.914682 0.921038 0.257066 0.522906 0.118461 0.622855
8.066667 1.931559 0.924940 0.252038 0.562966 0.121965 0.392718
8.100000 1.950663 0.928981 0.228572 0.605224 0.126000 0.202550
8.133333 1.971992 0.933151 0.219158 0.649272 0.130687 0.067935
8.166667 1.993951 0.937368 0.200900 0.694612 0.136088 -0.003529
8.200000 2.018109 0.941758 0.184667 0.740569 0.142126 -0.010983
8.233333 2.044411 0.946385 0.172962 0.786486 0.148683 0.037142
8.266667 2.071329 0.951058 0.165848 0.831876 0.155561 0.130512
8.300000 2.100179 0.956187 0.168385 0.876701 0.162517 0.250070
8.333333 2.130951 0.961919 0.186853 0.920837 0.169220 0.375651
8.366667 2.162312 0.967693 0.202161 0.964438 0.175322 0.490069
8.400000 2.195465 0.974142 0.198235 1.007788 0.180458 0.579592
8.433333 2.229182 0.980630 0.239413 1.051251 0.184282 0.631272
8.466667 2.264902 0.987492 0.297074 1.095157 0.186416 0.636422
8.500000 2.301157 0.994387 0.339810 1.139674 0.186573 0.590118
8.533333 2.339609 1.001181 0.392810 1.185033 0.184592 0.494752
8.566667 2.380328 1.007699 0.420360 1.231024 0.180405 0.357530
8.600000 2.421526 1.014243 0.421639 1.277417 0.174124 0.182633
8.633333 2.465192 1.020310 0.438674 1.323587 0.165981 -0.017532
8.666667 2.509290 1.026399 0.429362 1.368951 0.156382 -0.230046
8.700000 2.555810 1.031911 0.401868 1.412649 0.145810 -0.437837
8.733333 2.604368 1.036739 0.383920 1.453853 0.134740 -0.626763
8.766667 2.654745 1.040874 0.334997 1.491996 0.123684 -0.786303
8.800000 2.706716 1.044369 0.304097 1.526329 0.113179 -0.903384
8.833333 2.759978 1.047254 0.252101 1.556479 0.103674 -0.965152
8.866667 2.813491 1.050161 0.211168 1.582009 0.095575 -0.966096
8.900000 2.867707 1.052633 0.178584 1.602864 0.089224 -0.904929
8.933333 2.922647 1.054880 0.132773 1.619083 0.084875 -0.780694
8.966667 2.977733 1.057158 0.079231 1.630849 0.082686 -0.595476
9.000000 3.033050 1.059483 0.039432 1.638653 0.082622 -0.357941
9.033333 3.088438 1.061844 0.012832 1.642991 0.084587 -0.087422
9.066667 3.143861 1.064244 0.004509 1.644441 0.088386 0.198056
9.100000 3.199281 1.066686 0.004370 1.643529 0.093699 0.477051
9.133333 3.254331 1.069668 0.050183 1.640799 0.100165 0.721313
9.166667 3.309304 1.072697 0.101392 1.636716 0.107398 0.903866
9.200000 3.363756 1.076331 0.154174 1.631715 0.114992 1.004623
9.233333 3.418035 1.080609 0.233554 1.626150 0.122547 1.010901
9.266667 3.472128 1.084938 0.312404 1.620372 0.129701 0.920124
9.300000 3.525982 1.089755 0.391551 1.614636 0.136149 0.734988
9.333333 3.579621 1.094958 0.448267 1.609018 0.141684 0.473119
9.366667 3.632963 1.100215 0.466668 1.603504 0.146183 0.159247
9.400000 3.685974 1.105526 0.459964 1.597868 0.149702 -0.178813
9.433333 3.738961 1.110860 0.425540 1.591813 0.152440 -0.505987
9.466667 3.791979 1.116125 0.372075 1.584940 0.154622 -0.794827
9.500000 3.845040 1.121273 0.316144 1.576780 0.156617 -1.011259
9.533333 3.898269 1.126325 0.244208 1.566813 0.158870 -1.131273
9.566667 3.950983 1.131433 0.158177 1.554493 0.161830 -1.136943
9.600000 4.003542 1.136517 0.115654 1.539385 0.165830 -1.024015
9.633333 4.055511 1.141658 0.046624 1.521195 0.171060 -0.798386
9.666667 4.106854 1.146855 -0.008389 1.499616 0.177703 -0.472157
9.700000 4.157422 1.152347 -0.040175 1.474415 0.185744 -0.076923
9.733333 4.206975 1.158266 -0.059067 1.445631 0.194961 0.352629
9.766667 4.255307 1.164771 -0.048423 1.413359 0.204965 0.771356
9.800000 4.302871 1.171334 -0.016864 1.377734 0.215384 1.147642
9.833333 4.348978 1.178657 0.074023 1.338882 0.225831 1.441485
9.866667 4.393400 1.186760 0.166018 1.296988 0.235762 1.623982
9.900000 4.435933 1.195598 0.301857 1.252471 0.244677 1.683320
9.933333 4.477568 1.204486 0.410751 1.205268 0.252119 1.619185
9.966667 4.518276 1.213422 0.526472 1.155453 0.257834 1.446163
10.000000 4.556564 1.222651 0.617688 1.102822 0.261451 1.176621
10.033333 4.592293 1.231983 0.648562 1.047195 0.262717 0.846867
10.066667 4.627017 1.241352 0.653028 0.988176 0.261550 0.487794
10.100000 4.658881 1.250412 0.615880 0.924832 0.257909 0.129885
10.133333 4.689695 1.259504 0.583079 0.856886 0.251906 -0.207651
10.166667 4.719439 1.268624 0.518356 0.783558 0.243513 -0.506325
10.200000 4.745411 1.276946 0.470963 0.704802 0.233024 -0.753079
10.233333 4.770278 1.285293 0.443533 0.620029 0.220649 -0.955165
10.266667 4.790275 1.292544 0.431467 0.529308 0.206751 -1.121661
10.300000 4.809142 1.299817 0.404750 0.433010 0.191764 -1.265918
10.333333 4.822386 1.305857 0.364238 0.331570 0.176134 -1.394679
10.366667 4.834488 1.311919 0.334846 0.226221 0.160452 -1.521090
10.400000 4.840639 1.316754 0.285005 0.117672 0.145162 -1.649007
10.433333 4.840803 1.320462 0.224466 0.007850 0.130870 -1.774535
10.466667 4.839835 1.324200 0.156888 -0.101889 0.117937 -1.885850
10.500000 4.833016 1.327094 0.076953 -0.209598 0.106743 -1.970422
10.533333 4.825090 1.330026 -0.012841 -0.314183 0.097443 -2.013756
10.566667 4.812008 1.332568 -0.092221 -0.414610 0.090154 -1.994734
10.600000 4.794135 1.334892 -0.182443 -0.509663 0.084853 -1.902355
10.633333 4.771707 1.337150 -0.252879 -0.598986 0.081299 -1.727522
10.666667 4.748270 1.339468 -0.322906 -0.681890 0.079313 -1.470147
10.700000 4.723856 1.341850 -0.398043 -0.758514 0.078503 -1.135766
10.733333 4.695779 1.344412 -0.447223 -0.828193 0.078537 -0.745340
10.766667 4.666794 1.347049 -0.504667 -0.890947 0.078955 -0.327641
10.800000 4.634926 1.349798 -0.532336 -0.947084 0.079362 0.085054
10.833333 4.600593 1.352580 -0.525980 -0.996963 0.079412 0.457729
10.866667 4.564200 1.355284 -0.466085 -1.041011 0.078752 0.752096
10.900000 4.527061 1.358086 -0.368331 -1.079382 0.077232 0.933069
10.933333 4.489220 1.360992 -0.282796 -1.112791 0.074820 0.984677
10.966667 4.450724 1.364008 -0.185953 -1.141615 0.071626 0.895862
11.000000 4.411615 1.367139 -0.096947 -1.166246 0.067781 0.669594
11.033333 4.371811 1.369598 -0.022194 -1.187049 0.063549 0.317061
11.066667 4.331455 1.371446 0.005959 -1.204565 0.059256 -0.130416
11.100000 4.290626 1.372759 0.003282 -1.219298 0.055195 -0.633650
11.133333 4.249369 1.374212 -0.060858 -1.231528 0.051606 -1.157413
11.166667 4.207728 1.375421 -0.143235 -1.241546 0.048716 -1.663541
11.200000 4.165768 1.376513 -0.264642 -1.249418 0.046765 -2.116363
11.233333 4.123519 1.377770 -0.374418 -1.255009 0.045806 -2.484352
11.266667 4.081006 1.379096 -0.475572 -1.258162 0.045803 -2.753913
11.300000 4.038357 1.380525 -0.579027 -1.258693 0.046662 -2.922559
11.333333 3.995731 1.382055 -0.703067 -1.256441 0.048284 -2.994861
11.366667 3.953002 1.383781 -0.838812 -1.251241 0.050496 -2.977528
11.400000 3.910689 1.385504 -0.956444 -1.243132 0.053144 -2.883889
11.433333 3.868980 1.387163 -1.053834 -1.232097 0.056307 -2.726601
11.466667 3.827304 1.389042 -1.145923 -1.218087 0.060093 -2.512210
11.500000 3.785706 1.391149 -1.225726 -1.200939 0.064786 -2.242152
11.533333 3.745304 1.393184 -1.308677 -1.180240 0.070854 -1.914373
11.566667 3.706137 1.395201 -1.372416 -1.155346 0.079007 -1.529555
11.600000 3.667176 1.397469 -1.420677 -1.125110 0.090126 -1.089121
11.633333 3.630055 1.399982 -1.476193 -1.088884 0.104812 -0.589874
11.666667 3.593219 1.402761 -1.524289 -1.046027 0.123669 -0.030287
11.700000 3.556705 1.405814 -1.535092 -0.996092 0.147200 0.590520
11.733333 3.520552 1.409148 -1.522733 -0.939107 0.175516 1.262713
11.766667 3.488124 1.414029 -1.469424 -0.875552 0.208372 1.970931
11.800000 3.456127 1.419203 -1.388498 -0.806320 0.245299 2.695010
11.833333 3.428394 1.426551 -1.294925 -0.732137 0.285790 3.396789
11.866667 3.404953 1.436257 -1.173418 -0.653702 0.329322 4.034306
11.900000 3.385910 1.448564 -0.998019 -0.571997 0.375070 4.563149
11.933333 3.371479 1.463677 -0.841816 -0.488119 0.422196 4.962239
11.966667 3.357593 1.479081 -0.603626 -0.402599 0.470076 5.212772
12.000000 3.344265 1.494768 -0.340253 -0.315850 0.518102 5.316229
12.033333 3.335323 1.513251 -0.041680 -0.228102 0.565774 5.284359
12.066667 3.326957 1.532001 0.185630 -0.139650 0.612617 5.146146
12.100000 3.322818 1.553208 0.407953 -0.050860 0.658252 4.929027
12.133333 3.322989 1.576817 0.525854 0.038272 0.702541 4.652535
12.166667 3.323739 1.600655 0.598186 0.127002 0.745106 4.350887
12.200000 3.329245 1.626604 0.666092 0.213744 0.785253 4.043086
12.233333 3.339705 1.654637 0.753926 0.296868 0.822397 3.756129
12.266667 3.350716 1.682844 0.882605 0.375070 0.856050 3.486616
12.300000 3.366906 1.713111 0.994046 0.447594 0.885999 3.243102
12.333333 3.388440 1.745556 1.144679 0.513567 0.912019 3.011862
12.366667 3.410460 1.778107 1.248054 0.572729 0.934085 2.769662
12.400000 3.432939 1.810738 1.404490 0.625929 0.952668 2.489934
12.433333 3.455850 1.843423 1.471562 0.674437 0.968346 2.144310
12.466667 3.479162 1.876138 1.553863 0.719049 0.981436 1.730402
12.500000 3.502846 1.908856 1.614273 0.760553 0.992126 1.237314
12.533333 3.526873 1.941551 1.647778 0.800234 1.000766 0.682305
12.566667 3.551211 1.974199 1.690395 0.838937 1.007624 0.073799
12.600000 3.579340 2.008078 1.690161 0.876868 1.012700 -0.565246
12.633333 3.611030 2.043036 1.681292 0.913455 1.015561 -1.215070
12.666667 3.642928 2.077862 1.623574 0.948000 1.015778 -1.865323
12.700000 3.677642 2.113048 1.551030 0.979345 1.012963 -2.504600
12.733333 3.712481 2.148044 1.432593 1.005634 1.006349 -3.135807
12.766667 3.747405 2.182823 1.264010 1.025240 0.995218 -3.745280
12.800000 3.783687 2.216822 1.130718 1.037014 0.979118 -4.330300
12.833333 3.820767 2.249687 0.974993 1.040578 0.958230 -4.891069
12.866667 3.857798 2.282250 0.834507 1.036068 0.933090 -5.428919
12.900000 3.894733 2.314485 0.638304 1.024135 0.904254 -5.938527
12.933333 3.931528 2.346363 0.398199 1.005426 0.872532 -6.407584
12.966667 3.966500 2.375699 0.200379 0.980730 0.838917 -6.838540
13.000000 3.998862 2.402264 -0.035423 0.950353 0.804267 -7.217972
13.033333 4.030952 2.428401 -0.283063 0.914328 0.769022 -7.530300
13.066667 4.059179 2.451556 -0.575998 0.872793 0.733633 -7.750637
13.100000 4.087058 2.474245 -0.882343 0.825252 0.698426 -7.862286
13.133333 4.114552 2.496452 -1.187870 0.771785 0.663776 -7.851872
13.166667 4.141626 2.518158 -1.488274 0.711843 0.629446 -7.687393
13.200000 4.168243 2.539348 -1.785310 0.645369 0.595020 -7.358381
13.233333 4.194369 2.560005 -2.051703 0.572062 0.560034 -6.855437
13.266667 4.212682 2.578054 -2.319098 0.491639 0.523777 -6.181456
13.300000 4.230442 2.595542 -2.583034 0.404663 0.485704 -5.345823
13.333333 4.240234 2.610828 -2.762338 0.312306 0.445246 -4.370501
13.366667 4.249428 2.625528 -2.923442 0.216613 0.402514 -3.298709
13.400000 4.258009 2.639633 -3.052747 0.119596 0.357719 -2.170969
13.433333 4.260948 2.652110 -3.123998 0.023992 0.311226 -1.036979
13.466667 4.259060 2.663004 3.134062 -0.068033 0.263350 0.053786
13.500000 4.252140 2.670269 -3.059975 -0.154424 0.214414 1.050826
13.533333 4.241753 2.675694 -2.946148 -0.234312 0.164655 1.921544
13.566667 4.228453 2.679079 -2.782007 -0.307008 0.114181 2.634000
13.600000 4.214516 2.681839 -2.600329 -0.371897 0.063221 3.162075
13.633333 4.199949 2.683976 -2.436520 -0.429245 0.012059 3.499548
13.666667 4.183520 2.683607 -2.291277 -0.479318 -0.038857 3.648432
13.700000 4.166477 2.682619 -2.125789 -0.523010 -0.089258 3.623132
13.733333 4.147773 2.679007 -1.976124 -0.561011 -0.138638 3.441544
13.766667 4.127597 2.672754 -1.869241 -0.594324 -0.186556 3.149309
13.800000 4.106842 2.665903 -1.753535 -0.624040 -0.232522 2.797385
13.833333 4.084867 2.656548 -1.649981 -0.650683 -0.275830 2.428298
13.866667 4.061865 2.644833 -1.558645 -0.674600 -0.315864 2.089004
13.900000 4.038327 2.632557 -1.514144 -0.695829 -0.351917 1.838146
13.933333 4.014235 2.618421 -1.498820 -0.714389 -0.383563 1.724622
13.966667 3.989640 2.603756 -1.483924 -0.730167 -0.410447 1.767213
14.000000 3.964557 2.588581 -1.481938 -0.742990 -0.432198 1.977199
14.033333 3.939002 2.572911 -1.542523 -0.753112 -0.448952 2.365721
14.066667 3.912995 2.556766 -1.547645 -0.760767 -0.460927 2.909036
14.100000 3.886551 2.540164 -1.458925 -0.766189 -0.468344 3.542726
14.133333 3.859689 2.523122 -1.343403 -0.769535 -0.471483 4.187851
14.166667 3.834472 2.507353 -1.205495 -0.771250 -0.470901 4.766511
14.200000 3.808872 2.491180 -0.978056 -0.772019 -0.467460 5.194147
14.233333 3.782904 2.474621 -0.696359 -0.772363 -0.461921 5.375240
14.266667 3.756585 2.457694 -0.381372 -0.772876 -0.455078 5.256328
14.300000 3.731071 2.442239 -0.057766 -0.774358 -0.447938 4.829125
14.333333 3.705981 2.428038 0.245554 -0.777777 -0.441613 4.112608
14.366667 3.680939 2.414695 0.536287 -0.783690 -0.436876 3.146107
14.400000 3.655586 2.401839 0.661715 -0.792360 -0.434363 2.005366
14.433333 3.629961 2.388688 0.677875 -0.804066 -0.434757 0.791016
14.466667 3.604079 2.375256 0.600225 -0.818905 -0.438742 -0.399729
14.500000 3.577957 2.361553 0.438941 -0.836609 -0.446770 -1.485730
14.533333 3.550223 2.347181 0.254496 -0.856486 -0.459033 -2.395192
14.566667 3.522282 2.332566 0.058262 -0.877987 -0.475881 -3.067422
14.600000 3.492723 2.317139 -0.143291 -0.900587 -0.497742 -3.485241
14.633333 3.461688 2.300780 -0.301451 -0.923576 -0.524916 -3.659306
14.666667 3.429176 2.283260 -0.456404 -0.946135 -0.557321 -3.621595
14.700000 3.396536 2.265558 -0.600820 -0.967561 -0.594699 -3.413783
14.733333 3.363792 2.247691 -0.691543 -0.987475 -0.636653 -3.092553
14.766667 3.330344 2.227924 -0.774998 -1.005406 -0.682294 -2.715259
14.800000 3.296161 2.205966 -0.849715 -1.021012 -0.730267 -2.326335
14.833333 3.261400 2.181604 -0.928300 -1.034126 -0.778992 -1.952948
14.866667 3.226156 2.154678 -0.974590 -1.044801 -0.827146 -1.613677
14.900000 3.190507 2.125054 -1.013600 -1.053105 -0.873377 -1.324721
14.933333 3.154580 2.092693 -1.029418 -1.058960 -0.916337 -1.082523
14.966667 3.118420 2.057555 -1.036775 -1.062402 -0.954961 -0.884318
15.000000 3.082353 2.022461 -1.053055 -1.063490 -0.988708 -0.726356
15.033333 3.046408 1.987445 -1.050399 -1.062197 -1.017192 -0.610508
15.066667 3.010610 1.952544 -1.086752 -1.058388 -1.039984 -0.528526
15.100000 2.974986 1.917794 -1.108831 -1.052001 -1.057104 -0.460606
15.133333 2.939562 1.883230 -1.129164 -1.042964 -1.068708 -0.391665
15.166667 2.904402 1.846905 -1.132522 -1.031037 -1.074856 -0.303931
15.200000 2.869688 1.809225 -1.127329 -1.015764 -1.075013 -0.171442
15.233333 2.835252 1.771845 -1.149302 -0.996846 -1.068780 0.034323
15.266667 2.801679 1.734156 -1.151850 -0.974203 -1.055858 0.326592
15.300000 2.768435 1.696845 -1.160506 -0.947544 -1.035370 0.706300
15.333333 2.735545 1.659949 -1.208727 -0.916828 -1.006706 1.170724
15.366667 2.704251 1.624443 -1.228889 -0.882433 -0.969948 1.715909
15.400000 2.674687 1.590733 -1.201976 -0.845015 -0.925807 2.322927
15.433333 2.645544 1.557549 -1.099398 -0.805135 -0.874923 2.964928
15.466667 2.618745 1.527496 -0.966566 -0.763309 -0.818156 3.614704
15.500000 2.594466 1.501091 -0.820624 -0.720419 -0.757029 4.246155
15.533333 2.572822 1.478830 -0.622179 -0.677226 -0.692837 4.831247
15.566667 2.551669 1.457213 -0.422747 -0.633999 -0.625993 5.344252
15.600000 2.531019 1.436262 -0.191508 -0.590844 -0.556670 5.770982
15.633333 2.512991 1.420347 0.043334 -0.548044 -0.485403 6.103634
15.666667 2.495490 1.405137 0.255491 -0.505563 -0.411978 6.353322
15.700000 2.478523 1.390648 0.487780 -0.463165 -0.335956 6.536751
15.733333 2.464029 1.381054 0.705977 -0.420697 -0.257289 6.674531
15.766667 2.450085 1.372206 0.952003 -0.378361 -0.176426 6.782841
15.800000 2.436698 1.364114 1.162641 -0.336498 -0.094169 6.878718
15.833333 2.425793 1.360654 1.357722 -0.295186 -0.010614 6.985574
15.866667 2.417161 1.361732 1.587355 -0.254807 0.073359 7.100904
15.900000 2.410564 1.367250 1.833648 -0.215770 0.156905 7.217287
15.933333 2.405695 1.377058 2.083946 -0.178291 0.239601 7.322936
15.966667 2.401390 1.387616 2.290648 -0.142324 0.321204 7.415388
16.000000 2.398233 1.402163 2.557985 -0.107643 0.401744 7.482760
16.033333 2.395634 1.417435 2.845531 -0.073906 0.481160 7.504629
16.066667 2.393588 1.433414 3.113044 -0.040610 0.559724 7.483145
16.100000 2.392032 1.452424 -2.888711 -0.007132 0.637776 7.427551
16.133333 2.391020 1.472106 -2.626776 0.027187 0.715905 7.354808
16.166667 2.391449 1.496118 -2.350489 0.062663 0.794054 7.265111
16.200000 2.393480 1.524176 -2.118365 0.099425 0.872077 7.177182
16.233333 2.397371 1.556144 -1.899749 0.137211 0.949177 7.111143
16.266667 2.401776 1.588673 -1.723437 0.175706 1.024527 7.076571
16.300000 2.408245 1.624893 -1.522362 0.214246 1.096984 7.069886
16.333333 2.416758 1.664597 -1.314069 0.251945 1.164862 7.077216
16.366667 2.427235 1.707616 -1.081061 0.288144 1.227146 7.097247
16.400000 2.438176 1.751034 -0.837949 0.322384 1.283077 7.104274
16.433333 2.450728 1.797304 -0.556196 0.354349 1.332246 7.064311
16.466667 2.463710 1.843879 -0.288035 0.383724 1.374252 6.944838
16.500000 2.477103 1.890710 -0.056055 0.410564 1.409148 6.727395
16.533333 2.491639 1.939541 0.231339 0.435098 1.437220 6.399897
16.566667 2.507208 1.989957 0.501144 0.457487 1.458630 5.945526
16.600000 2.523131 2.040473 0.741102 0.477648 1.473250 5.357133
16.633333 2.539387 2.091034 0.927514 0.495510 1.481022 4.644418
16.666667 2.555957 2.141587 1.055785 0.511004 1.481900 3.818332
16.700000 2.573685 2.192397 1.190050 0.523655 1.475515 2.885063
16.733333 2.592466 2.243090 1.294288 0.532764 1.461562 1.857882
16.766667 2.611495 2.293611 1.325104 0.537780 1.440032 0.766896
16.800000 2.630750 2.343906 1.354741 0.538189 1.411007 -0.356377
16.833333 2.650277 2.392781 1.335546 0.533445 1.374587 -1.473594
16.866667 2.669680 2.439865 1.311629 0.523034 1.331002 -2.537238
16.900000 2.688700 2.484989 1.226472 0.507030 1.281034 -3.488829
16.933333 2.706823 2.527724 1.047604 0.486065 1.225837 -4.268600
16.966667 2.723494 2.567674 0.797351 0.460675 1.166140 -4.844268
17.000000 2.740262 2.607101 0.516350 0.431733 1.103004 -5.172211
17.033333 2.754784 2.643246 0.237180 0.400483 1.037443 -5.235530
17.066667 2.766831 2.675931 -0.041937 0.368330 0.970468 -5.040774
17.100000 2.778926 2.707976 -0.260999 0.336326 0.902576 -4.622701
17.133333 2.788554 2.736404 -0.551939 0.305209 0.833511 -4.029728
17.166667 2.795891 2.761016 -0.733409 0.275845 0.763199 -3.304771
17.200000 2.803245 2.784894 -0.767142 0.248815 0.690881 -2.519427
17.233333 2.810609 2.808009 -0.726230 0.224221 0.615562 -1.739878
17.266667 2.817977 2.830337 -0.643297 0.201764 0.535895 -1.025211
17.300000 2.823771 2.847375 -0.650954 0.181320 0.451045 -0.402288
17.333333 2.829556 2.863580 -0.630806 0.162573 0.360720 0.095262
17.366667 2.834200 2.873978 -0.595081 0.145051 0.265228 0.447309
17.400000 2.838826 2.883509 -0.563143 0.128417 0.165764 0.662127
17.433333 2.843432 2.892160 -0.533735 0.112409 0.063804 0.756967
17.466667 2.847149 2.894708 -0.498706 0.097043 -0.038502 0.758825
17.500000 2.850032 2.891090 -0.460113 0.082144 -0.139312 0.667809
17.533333 2.852042 2.881281 -0.430131 0.067741 -0.236532 0.501490
17.566667 2.853060 2.865228 -0.391343 0.053883 -0.328630 0.273434
17.600000 2.854052 2.848299 -0.385511 0.040545 -0.414524 -0.007442
17.633333 2.855020 2.830511 -0.344660 0.028003 -0.492720 -0.334238
17.666667 2.855965 2.811879 -0.337910 0.016387 -0.562602 -0.694562
17.700000 2.856891 2.792419 -0.346216 0.005529 -0.624337 -1.066734
17.733333 2.857799 2.772148 -0.388720 -0.005173 -0.679217 -1.433339
17.766667 2.856415 2.745906 -0.471443 -0.016198 -0.728591 -1.774289
17.800000 2.855021 2.718895 -0.577707 -0.028304 -0.773979 -2.077545
17.833333 2.853622 2.691138 -0.689271 -0.042712 -0.817462 -2.329513
17.866667 2.852224 2.662661 -0.801206 -0.060566 -0.860691 -2.531888
17.900000 2.850831 2.633488 -0.907757 -0.082593 -0.904398 -2.682670
17.933333 2.849450 2.603647 -1.007517 -0.109088 -0.948428 -2.783724
17.966667 2.848087 2.573162 -1.106000 -0.140639 -0.993043 -2.844588
18.000000 2.846748 2.542062 -1.156037 -0.177268 -1.038177 -2.880416
18.033333 2.841913 2.507146 -1.252998 -0.218155 -1.083237 -2.900491
18.066667 2.833626 2.468860 -1.356965 -0.262299 -1.127320 -2.908906
18.100000 2.825393 2.430053 -1.445274 -0.308583 -1.169572 -2.909534
18.133333 2.813859 2.388793 -1.543812 -0.355449 -1.209165 -2.905092
18.166667 2.799160 2.345546 -1.658793 -0.400861 -1.244561 -2.893317
18.200000 2.784568 2.301890 -1.763350 -0.443002 -1.274218 -2.855725
18.233333 2.767204 2.257162 -1.873036 -0.480673 -1.297209 -2.785365
18.266667 2.747308 2.211810 -1.976198 -0.512626 -1.312993 -2.676367
18.300000 2.727595 2.166171 -2.054976 -0.537488 -1.321079 -2.526716
18.333333 2.708092 2.120287 -2.165802 -0.554404 -1.321089 -2.329482
18.366667 2.688828 2.074200 -2.241666 -0.563099 -1.313219 -2.086362
18.400000 2.668442 2.028869 -2.323207 -0.563324 -1.298089 -1.812253
18.433333 2.647442 1.984633 -2.375600 -0.554575 -1.276009 -1.524473
18.466667 2.626768 1.940316 -2.452097 -0.536586 -1.247192 -1.233663
18.500000 2.606637 1.897787 -2.494904 -0.509634 -1.212351 -0.951110
18.533333 2.587676 1.857306 -2.506984 -0.474341 -1.172702 -0.701272
18.566667 2.569129 1.816855 -2.487619 -0.431055 -1.129183 -0.499993
18.600000 2.553217 1.779078 -2.482897 -0.380048 -1.082422 -0.355739
18.633333 2.540412 1.744045 -2.462503 -0.322488 -1.033544 -0.269237
18.666667 2.531412 1.712069 -2.442695 -0.259834 -0.984079 -0.247826
18.700000 2.522921 1.680243 -2.414288 -0.192918 -0.934894 -0.296757
18.733333 2.514956 1.648592 -2.428848 -0.121807 -0.886153 -0.399211
18.766667 2.512068 1.620367 -2.452039 -0.046606 -0.838186 -0.540553
18.800000 2.514644 1.595685 -2.462889 0.032108 -0.791561 -0.708366
18.833333 2.517782 1.571240 -2.478718 0.114649 -0.746239 -0.890115
18.866667 2.521487 1.547050 -2.545070 0.201785 -0.701624 -1.066484
18.900000 2.525763 1.523129 -2.579462 0.293775 -0.657432 -1.217257
18.933333 2.535786 1.502022 -2.634850 0.389654 -0.613990 -1.335127
18.966667 2.546384 1.481214 -2.693814 0.488760 -0.571159 -1.409107
19.000000 2.562371 1.462596 -2.738667 0.590440 -0.528600 -1.425405
19.033333 2.583536 1.445909 -2.818497 0.693438 -0.486329 -1.362453
19.066667 2.609601 1.430963 -2.870407 0.795838 -0.444575 -1.210718
19.100000 2.640316 1.417598 -2.929751 0.895200 -0.403762 -0.960333
19.133333 2.675433 1.405737 -2.978818 0.989986 -0.363869 -0.602149
19.166667 2.711029 1.394218 -3.032116 1.078298 -0.325101 -0.138801
19.200000 2.750659 1.384237 -3.061675 1.158668 -0.287623 0.418743
19.233333 2.794107 1.375947 -3.096911 1.230117 -0.251447 1.038696
19.266667 2.837931 1.368003 -3.085034 1.292343 -0.216622 1.688618
19.300000 2.884960 1.362078 -3.030722 1.345847 -0.182828 2.336361
19.333333 2.932285 1.356493 -2.926386 1.391353 -0.149760 2.938608
19.366667 2.979865 1.351246 -2.742992 1.429540 -0.117413 3.457483
19.400000 3.029813 1.348599 -2.542243 1.461111 -0.085927 3.868517
19.433333 3.079928 1.346278 -2.376633 1.486956 -0.055350 4.167076
19.466667 3.130165 1.344277 -2.144052 1.507706 -0.025637 4.359182
19.500000 3.182255 1.345230 -1.966247 1.523750 0.002818 4.456414
19.533333 3.234376 1.346486 -1.790829 1.535005 0.029480 4.489481
19.566667 3.286478 1.348035 -1.643598 1.541360 0.053969 4.498153
19.600000 3.338515 1.349865 -1.552468 1.542545 0.076103 4.506896
19.633333 3.391157 1.354244 -1.433197 1.537679 0.095312 4.521254
19.666667 3.443639 1.358881 -1.352611 1.526055 0.110986 4.543626
19.700000 3.495912 1.363762 -1.274815 1.506949 0.122949 4.560125
19.733333 3.547929 1.368872 -1.106931 1.479539 0.131036 4.537085
19.766667 3.599642 1.374200 -0.895200 1.443381 0.135224 4.429821
19.800000 3.649986 1.379996 -0.684532 1.397918 0.135376 4.203193
19.833333 3.698551 1.385792 -0.462788 1.343384 0.131932 3.835579
19.866667 3.744891 1.391208 -0.248042 1.280085 0.125407 3.311103
19.900000 3.788553 1.395969 -0.065843 1.208501 0.116281 2.631324
19.933333 3.828986 1.399906 0.048163 1.129996 0.105244 1.828178
19.966667 3.865593 1.402907 0.143744 1.046031 0.093007 0.943540
20.000000 3.901612 1.406034 0.130021 0.958171 0.080335 0.023502
20.033333 3.932514 1.408181 0.064101 0.867794 0.067778 -0.891791
20.066667 3.957969 1.409422 -0.069599 0.776387 0.055875 -1.758767
20.100000 3.982758 1.410762 -0.218555 0.685709 0.045037 -2.541328
20.133333 4.001154 1.411365 -0.350946 0.596756 0.035411 -3.227219
20.166667 4.018854 1.412052 -0.482172 0.509976 0.026964 -3.806388
20.200000 4.035845 1.412815 -0.624643 0.426346 0.019665 -4.284056
20.233333 4.046033 1.413047 -0.755110 0.346401 0.013311 -4.661806
20.266667 4.055498 1.413342 -0.900362 0.269750 0.007536 -4.957014
20.300000 4.064237 1.413693 -1.058624 0.195676 0.001988 -5.184216
20.333333 4.066726 1.413529 -1.228239 0.123967 -0.003520 -5.349657
20.366667 4.068491 1.413409 -1.494667 0.054682 -0.009088 -5.455419
20.400000 4.069538 1.413328 -1.725623 -0.012776 -0.015077 -5.493316
20.433333 4.069871 1.413281 -1.923039 -0.079179 -0.021987 -5.453091
20.466667 4.064836 1.412234 -2.125272 -0.144069 -0.030321 -5.311324
20.500000 4.059105 1.411210 -2.282890 -0.206989 -0.040585 -5.046195
20.533333 4.052691 1.410207 -2.456747 -0.268316 -0.053392 -4.640926
20.566667 4.041911 1.408591 -2.654245 -0.328122 -0.069299 -4.087224
20.600000 4.027219 1.406484 -2.845301 -0.385821 -0.088386 -3.378985
20.633333 4.011895 1.404388 -2.962256 -0.440331 -0.110268 -2.518029
20.666667 3.995963 1.402302 -3.087229 -0.491426 -0.134242 -1.521702
20.700000 3.979446 1.400221 3.105589 -0.538761 -0.159890 -0.423773
20.733333 3.960029 1.395562 3.065995 -0.581341 -0.186529 0.743285
20.766667 3.938304 1.388101 3.058120 -0.618523 -0.213656 1.933140
20.800000 3.914869 1.377505 -3.140637 -0.650305 -0.240806 3.094457
20.833333 3.890956 1.366928 -2.905313 -0.676842 -0.267746 4.167341
20.866667 3.866595 1.356376 -2.718736 -0.698005 -0.294419 5.111140
20.900000 3.841817 1.345859 -2.438171 -0.713908 -0.320200 5.894522
20.933333 3.816654 1.335384 -2.141904 -0.725065 -0.344894 6.491330
20.966667 3.791136 1.324960 -1.834557 -0.732222 -0.368102 6.895242
21.000000 3.765297 1.314595 -1.548576 -0.736062 -0.389909 7.104953
21.033333 3.740607 1.300874 -1.299586 -0.737362 -0.410329 7.149183
21.066667 3.715657 1.287233 -1.052627 -0.736904 -0.429375 7.030958
21.100000 3.691946 1.269964 -0.836424 -0.735474 -0.447041 6.769237
21.133333 3.668034 1.252805 -0.584731 -0.733666 -0.463212 6.376102
21.166667 3.643951 1.235772 -0.409085 -0.731798 -0.477927 5.867640
21.200000 3.619727 1.218883 -0.175092 -0.730086 -0.490962 5.260486
21.233333 3.595391 1.202155 0.015275 -0.728558 -0.502245 4.562819
21.266667 3.570972 1.185604 0.210319 -0.727241 -0.511700 3.806565
21.300000 3.546502 1.169248 0.411902 -0.725918 -0.519877 3.014717
21.333333 3.522008 1.153104 0.529432 -0.724362 -0.527107 2.221748
21.366667 3.497828 1.134642 0.579399 -0.722391 -0.533362 1.453909
21.400000 3.473684 1.116428 0.546550 -0.719820 -0.538617 0.749219
21.433333 3.449604 1.098483 0.470502 -0.716330 -0.542718 0.136202
21.466667 3.425574 1.079503 0.378179 -0.711598 -0.545401 -0.359939
21.500000 3.401765 1.059960 0.311273 -0.705162 -0.545933 -0.715754
21.533333 3.378107 1.040749 0.240722 -0.696286 -0.543584 -0.917900
21.566667 3.354628 1.021891 0.190857 -0.684175 -0.538125 -0.961191
21.600000 3.331359 1.003409 0.161980 -0.667757 -0.529170 -0.857179
21.633333 3.308325 0.985322 0.145176 -0.646426 -0.516452 -0.625008
21.666667 3.285556 0.967653 0.089570 -0.619588 -0.499928 -0.286635
21.700000 3.263080 0.950424 0.075225 -0.587178 -0.479881 0.134846
21.733333 3.240922 0.933654 0.057961 -0.549701 -0.456817 0.614495
21.766667 3.221890 0.918042 0.042748 -0.507748 -0.430832 1.141335
21.800000 3.203229 0.902931 0.084846 -0.462484 -0.402340 1.704352
21.833333 3.188198 0.889398 0.154800 -0.415026 -0.371525 2.306856
21.866667 3.176948 0.877721 0.242119 -0.366733 -0.338310 2.942230
21.900000 3.166127 0.866595 0.368410 -0.318698 -0.302461 3.605940
21.933333 3.159147 0.857938 0.536632 -0.272020 -0.263794 4.295504
21.966667 3.152621 0.849862 0.651982 -0.227678 -0.222534 5.001105
22.000000 3.146561 0.842379 0.825674 -0.186382 -0.178391 5.716643
22.033333 3.140975 0.835503 1.026302 -0.148472 -0.131432 5.896199
22.066667 3.135874 0.829246 1.198628 -0.113806 -0.082032 5.536932
22.100000 3.133341 0.826726 1.468326 -0.082429 -0.030490 4.623955
22.133333 3.131309 0.824844 1.756861 -0.053813 0.023210 3.140618
22.166667 3.130816 0.826798 2.070013 -0.027573 0.079015 1.060948
22.200000 3.131338 0.832539 2.402097 -0.003327 0.135894 -1.635290
22.233333 3.132374 0.838927 2.767074 0.019123 0.192986 -3.901338
22.266667 3.133927 0.845961 3.126809 0.039741 0.249586 -5.756988
22.300000 3.135999 0.853641 -2.765155 0.058918 0.305095 -7.202449
22.333333 3.138379 0.866278 -2.368894 0.076849 0.358634 -7.707114
22.366667 3.141283 0.879551 -2.081860 0.094001 0.410087 -7.242220
22.400000 3.144712 0.893452 -1.683386 0.110909 0.460221 -5.800897
22.433333 3.148484 0.912016 -1.329956 0.128124 0.509472 -3.908128
22.466667 3.152783 0.931187 -1.047756 0.146194 0.558270 -1.558858
22.500000 3.157608 0.950949 -0.779477 0.165384 0.606603 1.248225
22.533333 3.162958 0.971290 -0.491498 0.186041 0.654869 3.464833
22.566667 3.168834 0.992195 -0.202183 0.208511 0.702894 5.069444
22.600000 3.175232 1.013648 0.127578 0.233093 0.750244 6.071775
22.633333 3.182735 1.038794 0.445082 0.260312 0.797014 6.480872
22.666667 3.191596 1.067299 0.721231 0.290942 0.843179 6.309195
22.700000 3.202148 1.099040 0.987822 0.325704 0.888754 5.563648
22.733333 3.213207 1.131244 1.157963 0.365206 0.933365 4.783902
22.766667 3.224769 1.163886 1.257033 0.409590 0.976570 4.000381
22.800000 3.236825 1.196937 1.313818 0.459317 1.017953 3.234201
22.833333 3.249367 1.230371 1.366661 0.514664 1.057059 2.508819
22.866667 3.265531 1.266185 1.407675 0.575134 1.093502 1.843660
22.900000 3.285516 1.304136 1.442703 0.640143 1.127204 1.257624
22.933333 3.305950 1.342378 1.476504 0.708703 1.158106 0.751279
22.966667 3.330488 1.382297 1.469516 0.780090 1.186104 0.316896
23.000000 3.359309 1.423872 1.474333 0.852601 1.210921 -0.058836
23.033333 3.388516 1.465633 1.466587 0.924391 1.231996 -0.392896
23.066667 3.422018 1.508460 1.455803 0.994062 1.248916 -0.700605
23.100000 3.455846 1.551397 1.431834 1.060682 1.261346 -0.995407
23.133333 3.493881 1.594748 1.378400 1.123474 1.268802 -1.283365
23.166667 3.536033 1.638187 1.318111 1.181371 1.271199 -1.569157
23.200000 3.578401 1.681620 1.274986 1.234284 1.268723 -1.863738
23.233333 3.620943 1.725009 1.203578 1.281962 1.261838 -2.169030
23.266667 3.663617 1.768314 1.129295 1.324551 1.250992 -2.497750
23.300000 3.709885 1.810531 1.037782 1.361633 1.236354 -2.857492
23.333333 3.756197 1.852587 0.958368 1.393102 1.218349 -3.254765
23.366667 3.805438 1.892859 0.845133 1.419243 1.197346 -3.689199
23.400000 3.854625 1.932897 0.753536 1.439914 1.173424 -4.145038
23.433333 3.903708 1.972666 0.629694 1.455083 1.146375 -4.617287
23.466667 3.954467 2.009719 0.468269 1.464243 1.116119 -5.077290
23.500000 4.005020 2.046434 0.305840 1.467478 1.082851 -5.502736
23.533333 4.055312 2.082779 0.073006 1.464562 1.046852 -5.867017
23.566667 4.105292 2.118722 -0.119310 1.455228 1.008066 -6.170675
23.600000 4.154907 2.154230 -0.423682 1.439432 0.966795 -6.408601
23.633333 4.204093 2.186689 -0.699643 1.417185 0.923828 -6.573017
23.666667 4.252343 2.216182 -0.965063 1.388844 0.879757 -6.669884
23.700000 4.300071 2.245156 -1.193595 1.354255 0.835037 -6.706036
23.733333 4.345928 2.271458 -1.391323 1.313491 0.790126 -6.699958
23.766667 4.389461 2.295342 -1.591559 1.266957 0.745912 -6.627328
23.800000 4.432325 2.318639 -1.788457 1.214954 0.703101 -6.489268
23.833333 4.474473 2.341329 -1.952179 1.157868 0.661723 -6.286395
23.866667 4.513206 2.362224 -2.129762 1.095838 0.621511 -6.014317
23.900000 4.548560 2.381629 -2.457011 1.029674 0.582276 -5.652873
23.933333 4.583067 2.400374 -2.722638 0.960108 0.543500 -5.177438
23.966667 4.613819 2.417969 -2.937136 0.887467 0.504287 -4.593170
24.000000 4.643651 2.434873 -3.114954 0.812082 0.463741 -3.902326
24.033333 4.669799 2.450990 3.039552 0.734788 0.421494 -3.116082
24.066667 4.691464 2.464467 2.916529 0.656629 0.377707 -2.260053
24.100000 4.712115 2.477213 2.853564 0.577806 0.332397 -1.392844
24.133333 4.731725 2.489216 2.826846 0.498801 0.286007 -0.569270
24.166667 4.747184 2.498406 2.855026 0.420310 0.239292 0.163702
24.200000 4.758624 2.504661 2.940833 0.343273 0.193191 0.770722
24.233333 4.768959 2.510150 3.056499 0.267715 0.148472 1.230420
24.266667 4.775417 2.512442 -3.102631 0.193433 0.105722 1.538879
24.300000 4.778960 2.513554 -2.969573 0.120765 0.065614 1.716005
24.333333 4.781357 2.513894 -2.872851 0.049636 0.028591 1.784134
24.366667 4.782599 2.513459 -2.813303 -0.020623 -0.005279 1.772666
24.400000 4.780598 2.512163 -2.804518 -0.091169 -0.036338 1.716951
24.433333 4.775232 2.510153 -2.784778 -0.162344 -0.064963 1.648667
24.466667 4.768694 2.507370 -2.764614 -0.234441 -0.091799 1.589186
24.500000 4.760981 2.503816 -2.742202 -0.308001 -0.117634 1.555639
24.533333 4.752092 2.499494 -2.701672 -0.383335 -0.143306 1.557785
24.566667 4.739592 2.494595 -2.657923 -0.460073 -0.169535 1.598610
24.600000 4.723585 2.489023 -2.580624 -0.537507 -0.196883 1.663165
24.633333 4.704158 2.482607 -2.486199 -0.615395 -0.225992 1.735355
24.666667 4.681409 2.475158 -2.417385 -0.693280 -0.257268 1.802721
24.700000 4.655501 2.466541 -2.364104 -0.770353 -0.290993 1.852227
24.733333 4.626382 2.456533 -2.296231 -0.845549 -0.327223 1.876150
24.766667 4.596152 2.445783 -2.228421 -0.918144 -0.365801 1.864156
24.800000 4.564831 2.434295 -2.177081 -0.987590 -0.406463 1.820420
24.833333 4.530691 2.421001 -2.109102 -1.053214 -0.448648 1.747249
24.866667 4.493949 2.405823 -2.054160 -1.114579 -0.491739 1.647431
24.900000 4.454750 2.388663 -1.981319 -1.171484 -0.534937 1.522816
24.933333 4.413337 2.369501 -1.919973 -1.223963 -0.577533 1.375209
24.966667 4.369908 2.348296 -1.850633 -1.271888 -0.618828 1.212172
25.000000 4.325544 2.326418 -1.822211 -1.314892 -0.658038 1.027582
25.033333 4.279484 2.302466 -1.795600 -1.352615 -0.694507 0.822477
25.066667 4.232553 2.277875 -1.763678 -1.384710 -0.727704 0.597740
25.100000 4.184784 2.252663 -1.755407 -1.410969 -0.757394 0.356137
25.133333 4.136343 2.225865 -1.744968 -1.431506 -0.783369 0.096408
25.166667 4.087132 2.198484 -1.747536 -1.446624 -0.805563 -0.185969
25.200000 4.037186 2.170537 -1.771123 -1.456964 -0.824071 -0.478318
25.233333 3.986541 2.142046 -1.774969 -1.463436 -0.839121 -0.777979
25.266667 3.936920 2.113080 -1.778287 -1.467111 -0.850949 -1.081427
25.300000 3.886668 2.083609 -1.766366 -1.468948 -0.859686 -1.386270
25.333333 3.837875 2.054091 -1.877262 -1.469829 -0.865700 -1.674047
25.366667 3.789975 2.024633 -1.954227 -1.470682 -0.869349 -1.924628
25.400000 3.742440 1.995317 -2.028359 -1.472360 -0.870902 -2.125279
25.433333 3.694404 1.965574 -2.113597 -1.475460 -0.870681 -2.255525
25.466667 3.646009 1.936276 -2.211672 -1.480246 -0.868951 -2.289604
25.500000 3.597044 1.907594 -2.323784 -1.486970 -0.866061 -2.194887
25.533333 3.547672 1.878539 -2.433007 -1.495521 -0.862073 -1.968597
25.566667 3.497509 1.850400 -2.541528 -1.505459 -0.857205 -1.616145
25.600000 3.447003 1.821922 -2.636134 -1.516144 -0.851780 -1.148623
25.633333 3.396186 1.793123 -2.705840 -1.526998 -0.846016 -0.587200
25.666667 3.345089 1.764019 -2.747558 -1.537578 -0.840147 0.026630
25.700000 3.293380 1.735925 -2.744646 -1.547491 -0.834370 0.632359
25.733333 3.241175 1.708790 -2.697906 -1.556608 -0.829170 1.183561
25.766667 3.188791 1.681396 -2.643230 -1.565108 -0.824786 1.646886
25.800000 3.136052 1.654635 -2.508686 -1.573344 -0.821505 1.986802
25.833333 3.083203 1.627640 -2.298986 -1.581728 -0.819656 2.173005
25.866667 3.030507 1.601147 -2.128026 -1.590621 -0.819606 2.199812
25.900000 2.977769 1.574444 -2.032162 -1.600313 -0.821549 2.084604
25.933333 2.925022 1.547545 -1.932511 -1.611057 -0.825370 1.852852
25.966667 2.871954 1.520490 -1.871739 -1.622868 -0.831002 1.528852
26.000000 2.818392 1.493145 -1.854854 -1.635620 -0.838165 1.154263
26.033333 2.764185 1.465400 -1.852778 -1.648956 -0.846473 0.782900
26.066667 2.709183 1.437157 -1.871982 -1.662453 -0.855395 0.455198
26.100000 2.653304 1.408397 -1.888606 -1.675628 -0.864498 0.197762
26.133333 2.596520 1.379181 -1.912790 -1.687734 -0.873379 0.028638
26.166667 2.538593 1.349360 -1.945706 -1.698054 -0.881620 -0.043405
26.200000 2.480951 1.319444 -1.958366 -1.705853 -0.888875 -0.024255
26.233333 2.423633 1.289448 -1.977397 -1.710454 -0.894841 0.063295
26.266667 2.365574 1.259115 -1.984171 -1.711267 -0.899310 0.197386
26.300000 2.307920 1.228730 -1.978834 -1.707879 -0.902139 0.354004
26.333333 2.250026 1.198236 -1.973758 -1.699985 -0.903236 0.511566
26.366667 2.192172 1.167747 -1.941603 -1.687222 -0.902505 0.652516
26.400000 2.134847 1.137247 -1.901438 -1.669387 -0.899919 0.764012
26.433333 2.078091 1.106753 -1.827748 -1.646472 -0.895523 0.842575
26.466667 2.022440 1.076623 -1.782285 -1.618316 -0.889296 0.890283
26.500000 1.967440 1.046525 -1.749556 -1.584357 -0.881070 0.920068
26.533333 1.914014 1.016902 -1.697756 -1.544487 -0.870835 0.947699
26.566667 1.862582 0.987898 -1.687523 -1.498789 -0.858651 0.992267
26.600000 1.811914 0.958964 -1.654243 -1.447279 -0.844547 1.071747
26.633333 1.762048 0.930112 -1.641572 -1.389545 -0.828404 1.201439
26.666667 1.715382 0.902329 -1.649753 -1.325497 -0.810254 1.388764
26.700000 1.672338 0.875777 -1.641552 -1.255922 -0.790458 1.628739
26.733333 1.630191 0.849339 -1.614769 -1.181209 -0.769219 1.910734
26.766667 1.588968 0.823022 -1.554358 -1.101688 -0.746791 2.211145
26.800000 1.552348 0.798199 -1.463243 -1.017994 -0.723540 2.500258
26.833333 1.520547 0.774913 -1.350972 -0.931746 -0.700153 2.746800
26.866667 1.489738 0.751769 -1.206093 -0.844331 -0.677304 2.919757
26.900000 1.464000 0.730176 -1.080321 -0.756507 -0.655566 3.003304
26.933333 1.439282 0.708734 -0.922575 -0.669108 -0.635545 2.985197
26.966667 1.419539 0.688661 -0.782126 -0.583447 -0.617984 2.874021
27.000000 1.404627 0.669714 -0.650001 -0.500415 -0.603582 2.688085
27.033333 1.390755 0.650925 -0.549837 -0.419928 -0.592698 2.452050
27.066667 1.377924 0.632294 -0.451217 -0.342201 -0.585544 2.194007
27.100000 1.369348 0.613827 -0.419007 -0.267639 -0.582011 1.932589
27.133333 1.361810 0.595518 -0.422153 -0.196647 -0.581987 1.688285
27.166667 1.355304 0.577370 -0.416317 -0.128996 -0.584942 1.465148
27.200000 1.352327 0.558508 -0.408663 -0.064596 -0.590009 1.264991
27.233333 1.352626 0.538756 -0.368383 -0.003859 -0.596351 1.076413
27.266667 1.353930 0.519167 -0.306979 0.052993 -0.603233 0.890410
27.300000 1.358023 0.498472 -0.235467 0.105980 -0.610020 0.697615
27.333333 1.364643 0.476684 -0.196610 0.154960 -0.615989 0.487758
27.366667 1.372223 0.455070 -0.141148 0.199578 -0.620629 0.260282
27.400000 1.380746 0.433634 -0.120222 0.239677 -0.623749 0.020266
27.433333 1.390194 0.412382 -0.127339 0.275437 -0.625321 -0.211660
27.466667 1.400547 0.391318 -0.149143 0.307084 -0.625245 -0.414114
27.500000 1.411787 0.370446 -0.204345 0.334881 -0.623638 -0.563610
27.533333 1.423893 0.349772 -0.267207 0.359386 -0.620768 -0.640841
27.566667 1.436845 0.329298 -0.346719 0.381238 -0.616894 -0.629954
27.600000 1.450371 0.308617 -0.411517 0.400935 -0.612177 -0.530075
27.633333 1.464703 0.288147 -0.445569 0.418846 -0.606721 -0.356593
27.666667 1.479388 0.267669 -0.470932 0.435330 -0.600644 -0.131123
27.700000 1.494370 0.247363 -0.475301 0.450613 -0.593962 0.117558
27.733333 1.509624 0.227418 -0.441170 0.464873 -0.586663 0.357908
27.766667 1.525090 0.207915 -0.395625 0.478269 -0.578766 0.557153
27.800000 1.541257 0.188646 -0.335549 0.490922 -0.570389 0.690698
27.833333 1.558104 0.169613 -0.280719 0.502941 -0.561648 0.748251
27.866667 1.575142 0.151107 -0.221689 0.514425 -0.552715 0.725681
27.900000 1.592817 0.132846 -0.169570 0.525451 -0.543759 0.628316
27.933333 1.610693 0.115037 -0.126974 0.535990 -0.534908 0.473065
27.966667 1.628846 0.097548 -0.120562 0.546007 -0.526244 0.281756
28.000000 1.647251 0.080318 -0.115349 0.555506 -0.517753 0.079240
28.033333 1.665910 0.063283 -0.139417 0.564543 -0.509404 -0.112175
28.066667 1.685103 0.046507 -0.175787 0.573133 -0.501072 -0.271081
28.100000 1.704516 0.029891 -0.200427 0.581288 -0.492583 -0.379586
28.133333 1.724114 0.013462 -0.233928 0.589020 -0.483721 -0.426364
28.166667 1.743872 -0.002747 -0.274314 0.596291 -0.474249 -0.407701
28.200000 1.763755 -0.018613 -0.285587 0.603022 -0.463983 -0.328987
28.233333 1.784072 -0.034208 -0.318972 0.609057 -0.452751 -0.197303
28.266667 1.804565 -0.049384 -0.336365 0.614301 -0.440494 -0.029302
28.300000 1.825452 -0.064284 -0.339997 0.618660 -0.427268 0.159279
28.333333 1.846431 -0.078552 -0.331144 0.622076 -0.413275 0.347933
28.366667 1.867766 -0.092541 -0.318404 0.624548 -0.398791 0.517543
28.400000 1.889092 -0.105786 -0.269054 0.626095 -0.384168 0.654609
28.433333 1.910275 -0.118260 -0.230304 0.626803 -0.369796 0.741251
28.466667 1.931294 -0.129983 -0.177379 0.626787 -0.356031 0.767831
28.500000 1.952133 -0.141076 -0.123085 0.626241 -0.343182 0.727167
28.533333 1.972777 -0.151631 -0.098182 0.625387 -0.331431 0.621238
28.566667 1.993665 -0.161909 -0.047710 0.624438 -0.320925 0.455478
28.600000 2.014434 -0.171954 -0.023205 0.623623 -0.311643 0.243917
28.633333 2.035086 -0.181897 -0.003379 0.623123 -0.303464 0.005981
28.666667 2.055622 -0.191820 -0.007787 0.622992 -0.296169 -0.232776
28.700000 2.076337 -0.201472 -0.025035 0.623180 -0.289491 -0.446894
28.733333 2.096867 -0.211290 -0.068971 0.623586 -0.283135 -0.612205
28.766667 2.117543 -0.220840 -0.113881 0.624110 -0.276807 -0.705553
28.800000 2.138350 -0.230123 -0.178543 0.624592 -0.270293 -0.714835
28.833333 2.159273 -0.239142 -0.226904 0.624857 -0.263448 -0.633453
28.866667 2.180294 -0.247897 -0.291190 0.624790 -0.256223 -0.466401
28.900000 2.201400 -0.256390 -0.330169 0.624266 -0.248588 -0.230534
28.933333 2.222575 -0.264623 -0.360058 0.623103 -0.240605 0.046342
28.966667 2.243804 -0.272597 -0.358303 0.621088 -0.232341 0.330621
29.000000 2.264294 -0.280127 -0.333129 0.618105 -0.223876 0.586407
29.033333 2.284808 -0.287402 -0.273614 0.614040 -0.215289 0.778716
29.066667 2.305333 -0.294425 -0.192664 0.608828 -0.206671 0.877454
29.100000 2.325854 -0.301197 -0.108608 0.602472 -0.198145 0.868618
29.133333 2.346358 -0.307721 -0.043551 0.595050 -0.189801 0.754939
29.166667 2.366832 -0.314000 0.034804 0.586666 -0.181718 0.548825
29.200000 2.386595 -0.319811 0.087333 0.577297 -0.173948 0.276799
29.233333 2.405721 -0.325261 0.102272 0.566965 -0.166504 -0.022969
29.266667 2.424319 -0.330451 0.077669 0.555729 -0.159359 -0.308026
29.300000 2.442476 -0.335460 0.023534 0.543687 -0.152453 -0.541636
29.333333 2.460542 -0.340239 -0.068206 0.530960 -0.145716 -0.697971
29.366667 2.478235 -0.344952 -0.156990 0.517668 -0.139058 -0.755800
29.400000 2.495496 -0.349586 -0.233130 0.504012 -0.132379 -0.708637
29.433333 2.512287 -0.354097 -0.286033 0.490209 -0.125608 -0.568765
29.466667 2.528597 -0.358438 -0.302527 0.476356 -0.118678 -0.359421
29.500000 2.544310 -0.362496 -0.316009 0.462497 -0.111548 -0.111317
29.533333 2.559274 -0.366191 -0.308769 0.448701 -0.104189 0.140403
29.566667 2.573461 -0.369419 -0.259084 0.435140 -0.096667 0.356403
29.600000 2.587489 -0.372440 -0.205262 0.421929 -0.089091 0.502702
29.633333 2.601355 -0.375259 -0.146389 0.409121 -0.081579 0.558590
29.666667 2.615051 -0.377878 -0.096592 0.396834 -0.074267 0.516279
29.700000 2.627738 -0.380027 -0.058377 0.385205 -0.067300 0.379274
29.733333 2.640246 -0.381984 -0.030347 0.374270 -0.060792 0.166956
29.766667 2.652572 -0.383754 -0.012869 0.363897 -0.054778 -0.088739
29.800000 2.664169 -0.385355 0.005739 0.354027 -0.049228 -0.354434
29.833333 2.675578 -0.386777 -0.013297 0.344607 -0.044091 -0.594756
29.866667 2.686794 -0.388024 -0.063181 0.335576 -0.039290 -0.783687
29.900000 2.697815 -0.389099 -0.139680 0.326740 -0.034692 -0.896429
29.933333 2.708516 -0.390221 -0.240008 0.317943 -0.030159 -0.925396
29.966667 2.719017 -0.391181 -0.323638 0.309072 -0.025585 -0.874624
30.000000 2.729264 -0.392127 -0.375518 0.299933 -0.020899 -0.751294
30.033333 2.739308 -0.392919 -0.419358 0.290351 -0.016073 -0.575817
30.066667 2.749087 -0.393531 -0.414527 0.280131 -0.011116 -0.372182
30.100000 2.758527 -0.393954 -0.393213 0.269205 -0.006108 -0.173438
30.133333 2.767516 -0.394097 -0.386530 0.257552 -0.001213 -0.000011
30.166667 2.776018 -0.393926 -0.336488 0.245230 0.003398 0.128141
30.200000 2.784312 -0.393620 -0.312599 0.232362 0.007554 0.202846
30.233333 2.792023 -0.393046 -0.250092 0.219143 0.011096 0.217288
30.266667 2.799149 -0.392270 -0.248655 0.205832 0.013905 0.181389
30.300000 2.805689 -0.391400 -0.246865 0.192698 0.015928 0.112758
30.333333 2.811716 -0.390483 -0.254615 0.180015 0.017211 0.023863
30.366667 2.817214 -0.389621 -0.262721 0.168003 0.017842 -0.065960
30.400000 2.822250 -0.388903 -0.296552 0.156910 0.017936 -0.152033
30.433333 2.826893 -0.388342 -0.311731 0.146899 0.017677 -0.216967
30.466667 2.831227 -0.388004 -0.323466 0.138087 0.017261 -0.259081
30.500000 2.835371 -0.387572 -0.345883 0.130556 0.016856 -0.281235
30.533333 2.839329 -0.387048 -0.319896 0.124305 0.016593 -0.290424
30.566667 2.843177 -0.386671 -0.336782 0.119326 0.016575 -0.292925
