t x y theta dxdt dydt dthetadt
0.000000 0.000000 0.000000 0.928805 -0.008971 -0.004477 -0.002842
0.033333 -0.000269 -0.000246 0.934737 -0.012880 -0.004598 -0.002778
0.066667 -0.000383 -0.000492 0.937697 -0.018537 -0.004183 -0.003001
0.100000 -0.000656 -0.000574 0.931506 -0.026652 -0.003187 -0.001765
0.133333 -0.001540 -0.001109 0.926771 -0.037874 -0.001522 0.003291
0.166667 -0.002589 -0.001471 0.930394 -0.053364 0.000837 0.012268
0.200000 -0.003806 -0.001654 0.925565 -0.074325 0.003860 0.025036
0.233333 -0.005195 -0.001653 0.927125 -0.101294 0.007519 0.042837
0.266667 -0.006757 -0.001465 0.932572 -0.134196 0.011797 0.064856
0.300000 -0.008495 -0.001085 0.927872 -0.172933 0.016696 0.089245
0.333333 -0.010411 -0.000508 0.938333 -0.217713 0.022268 0.112636
0.366667 -0.016639 0.000118 0.931565 -0.267367 0.028688 0.132191
0.400000 -0.028367 0.001328 0.933810 -0.320320 0.036333 0.145270
0.433333 -0.040263 0.002743 0.944288 -0.375336 0.045605 0.151852
0.466667 -0.052316 0.004365 0.956450 -0.431075 0.056779 0.150179
0.500000 -0.070747 0.005644 0.982402 -0.485795 0.070482 0.133389
0.533333 -0.089309 0.007134 0.992638 -0.537295 0.087289 0.099617
0.566667 -0.107985 0.008839 0.979679 -0.584647 0.107928 0.048194
0.600000 -0.130196 0.011762 0.978979 -0.627445 0.132899 -0.020998
0.633333 -0.152483 0.014903 0.983414 -0.665283 0.162695 -0.110587
0.666667 -0.177645 0.020138 0.990987 -0.697616 0.197912 -0.218537
0.700000 -0.202839 0.025592 0.988937 -0.724567 0.238611 -0.332293
0.733333 -0.228546 0.034127 0.980712 -0.746145 0.284578 -0.446612
0.766667 -0.254235 0.042875 0.974606 -0.761661 0.335357 -0.559627
0.800000 -0.279882 0.051831 0.954089 -0.770612 0.390325 -0.667907
0.833333 -0.306892 0.064650 0.899302 -0.772153 0.448952 -0.764367
0.866667 -0.334351 0.080193 0.864478 -0.766267 0.510452 -0.848332
0.900000 -0.362465 0.098664 0.830603 -0.752759 0.573807 -0.926219
0.933333 -0.390385 0.120547 0.792489 -0.732014 0.637951 -1.000913
0.966667 -0.418130 0.142580 0.746721 -0.704951 0.701625 -1.070653
1.000000 -0.443283 0.166887 0.719536 -0.672126 0.763742 -1.137896
1.033333 -0.466555 0.193416 0.697517 -0.634937 0.822842 -1.210198
1.066667 -0.486915 0.222801 0.664978 -0.594665 0.877679 -1.288426
1.100000 -0.504254 0.254809 0.634740 -0.552668 0.927381 -1.370164
1.133333 -0.521304 0.286856 0.591019 -0.509939 0.971705 -1.451368
1.166667 -0.535285 0.323789 0.537451 -0.467291 1.010274 -1.530404
1.200000 -0.548946 0.360700 0.473871 -0.425690 1.042740 -1.601601
1.233333 -0.562273 0.397555 0.403798 -0.385476 1.069212 -1.654429
1.266667 -0.575252 0.434322 0.327492 -0.346346 1.089986 -1.683248
1.300000 -0.587868 0.470967 0.275519 -0.307653 1.105414 -1.685222
1.333333 -0.596791 0.509481 0.209853 -0.269216 1.115239 -1.658819
1.366667 -0.605329 0.547806 0.149796 -0.230761 1.119901 -1.604762
1.400000 -0.613472 0.585905 0.084097 -0.191939 1.119839 -1.524023
1.433333 -0.619442 0.623162 0.030440 -0.152684 1.115366 -1.424992
1.466667 -0.623897 0.661179 -0.016843 -0.113432 1.105531 -1.312607
1.500000 -0.625711 0.699584 -0.039069 -0.075115 1.089558 -1.191274
1.533333 -0.627104 0.737623 -0.088352 -0.038015 1.067099 -1.066140
1.566667 -0.628074 0.775262 -0.109365 -0.002459 1.037467 -0.942774
1.600000 -0.626776 0.811647 -0.155560 0.031073 1.000053 -0.826234
1.633333 -0.623688 0.844631 -0.184138 0.062227 0.953451 -0.719249
1.666667 -0.620173 0.877114 -0.200340 0.090615 0.897789 -0.626503
1.700000 -0.616232 0.909066 -0.200203 0.116339 0.833082 -0.553150
1.733333 -0.611868 0.940456 -0.210470 0.139225 0.759183 -0.503529
1.766667 -0.607082 0.971255 -0.228666 0.159103 0.675954 -0.477780
1.800000 -0.600434 0.988391 -0.241824 0.175741 0.583884 -0.477062
1.833333 -0.593366 1.004890 -0.246708 0.189113 0.484926 -0.495312
1.866667 -0.585883 1.020739 -0.255264 0.199483 0.381381 -0.525808
1.900000 -0.577988 1.035922 -0.254051 0.207045 0.275102 -0.555794
1.933333 -0.569687 1.050425 -0.264398 0.211994 0.167945 -0.574932
1.966667 -0.561712 1.052858 -0.303827 0.214749 0.062436 -0.572433
2.000000 -0.554907 1.045505 -0.338133 0.216454 -0.039579 -0.539141
2.033333 -0.547701 1.037465 -0.388532 0.218267 -0.137278 -0.471177
2.066667 -0.540097 1.028746 -0.418886 0.221217 -0.230600 -0.366749
2.100000 -0.532098 1.019359 -0.454509 0.226111 -0.318703 -0.230702
2.133333 -0.526734 1.005302 -0.465297 0.234005 -0.400416 -0.071500
2.166667 -0.520977 0.990599 -0.454598 0.245509 -0.475913 0.097367
2.200000 -0.514831 0.975266 -0.452814 0.260592 -0.546138 0.264657
2.233333 -0.506972 0.954604 -0.416958 0.278733 -0.611016 0.415106
2.266667 -0.498724 0.933348 -0.384138 0.299404 -0.670474 0.538478
2.300000 -0.488155 0.908186 -0.351184 0.322026 -0.724562 0.624248
2.333333 -0.477204 0.882477 -0.306727 0.345180 -0.773881 0.671443
2.366667 -0.463594 0.852450 -0.268560 0.367323 -0.818014 0.683477
2.400000 -0.449614 0.821932 -0.238624 0.386936 -0.855742 0.663200
2.433333 -0.435272 0.790953 -0.212570 0.402897 -0.886924 0.620455
2.466667 -0.420577 0.759544 -0.218494 0.413996 -0.911353 0.565159
2.500000 -0.405537 0.727736 -0.207492 0.419213 -0.929272 0.510318
2.533333 -0.390162 0.695559 -0.185459 0.418352 -0.940609 0.463627
2.566667 -0.374460 0.663044 -0.171213 0.411917 -0.946007 0.430985
2.600000 -0.358440 0.630224 -0.150984 0.400636 -0.946208 0.415576
2.633333 -0.342112 0.597129 -0.155632 0.385220 -0.941580 0.420273
2.666667 -0.329464 0.565262 -0.156270 0.367023 -0.932716 0.440511
2.700000 -0.318404 0.533642 -0.148926 0.347966 -0.920196 0.472120
2.733333 -0.308345 0.502391 -0.123063 0.329945 -0.904996 0.514262
2.766667 -0.298186 0.471403 -0.110655 0.314521 -0.887773 0.566856
2.800000 -0.288828 0.441148 -0.083066 0.303236 -0.869209 0.631391
2.833333 -0.280863 0.412144 -0.052866 0.297964 -0.850066 0.705406
2.866667 -0.273777 0.385876 -0.033540 0.300040 -0.831129 0.790188
2.900000 -0.266399 0.359558 -0.010473 0.309761 -0.812999 0.884103
2.933333 -0.258728 0.333214 0.019588 0.327126 -0.795917 0.982564
2.966667 -0.250076 0.307535 0.043719 0.352068 -0.780101 1.079049
3.000000 -0.239626 0.282428 0.067918 0.384286 -0.765616 1.167933
3.033333 -0.225407 0.257382 0.101237 0.422371 -0.752420 1.243633
3.066667 -0.210893 0.232405 0.156704 0.464486 -0.739942 1.301156
3.100000 -0.196088 0.207520 0.216625 0.509237 -0.727650 1.338791
3.133333 -0.180997 0.182750 0.285806 0.555283 -0.715116 1.354374
3.166667 -0.161728 0.159468 0.357681 0.601025 -0.701965 1.348369
3.200000 -0.137666 0.136119 0.408619 0.644665 -0.687890 1.321033
3.233333 -0.113345 0.112954 0.444815 0.685114 -0.672681 1.278742
3.266667 -0.088485 0.090347 0.481753 0.721515 -0.656570 1.226756
3.300000 -0.063014 0.068061 0.513830 0.753011 -0.639760 1.170610
3.333333 -0.036368 0.046671 0.543877 0.778630 -0.622370 1.120006
3.366667 -0.008766 0.026161 0.564766 0.797949 -0.604294 1.082248
3.400000 0.019860 0.007100 0.598708 0.811155 -0.585434 1.064564
3.433333 0.048648 -0.011656 0.638387 0.818574 -0.565504 1.065951
3.466667 0.077580 -0.030091 0.665748 0.820936 -0.543990 1.089242
3.500000 0.106638 -0.048186 0.711575 0.818982 -0.520322 1.132322
3.533333 0.135804 -0.065924 0.735682 0.813752 -0.494045 1.188472
3.566667 0.162517 -0.083189 0.781873 0.806339 -0.464916 1.250022
3.600000 0.188321 -0.099696 0.807263 0.797578 -0.432641 1.311342
3.633333 0.214546 -0.115302 0.852148 0.788189 -0.397275 1.367701
3.666667 0.240030 -0.129174 0.908087 0.778556 -0.359140 1.410742
3.700000 0.265299 -0.141443 0.956605 0.769067 -0.318876 1.437800
3.733333 0.290181 -0.151828 1.017760 0.759975 -0.277020 1.446075
3.766667 0.314295 -0.159877 1.077832 0.751088 -0.234207 1.438649
3.800000 0.339746 -0.165861 1.137604 0.742188 -0.191174 1.414568
3.833333 0.365241 -0.169894 1.203907 0.733048 -0.148542 1.378518
3.866667 0.390696 -0.173452 1.241011 0.723570 -0.106796 1.336930
3.900000 0.416097 -0.176531 1.276461 0.713504 -0.066141 1.291364
3.933333 0.439313 -0.177756 1.315540 0.702764 -0.026985 1.246731
3.966667 0.462449 -0.178497 1.334449 0.691011 0.010279 1.206029
4.000000 0.484616 -0.177459 1.366472 0.678112 0.045154 1.171609
4.033333 0.506682 -0.175935 1.411150 0.663913 0.077351 1.141511
4.066667 0.528326 -0.171944 1.438817 0.648280 0.106415 1.113525
4.100000 0.549847 -0.167468 1.486752 0.631333 0.131880 1.087423
4.133333 0.571256 -0.160413 1.535252 0.612846 0.153382 1.062904
4.166667 0.592523 -0.152882 1.585440 0.593327 0.170982 1.032847
4.200000 0.613639 -0.144880 1.619459 0.573029 0.185005 0.998077
4.233333 0.633210 -0.136896 1.645487 0.552363 0.195985 0.963966
4.266667 0.652614 -0.128454 1.663525 0.531792 0.205084 0.932258
4.300000 0.667834 -0.123037 1.704869 0.511992 0.213716 0.903638
4.333333 0.682877 -0.117171 1.728867 0.493976 0.223736 0.877942
4.366667 0.697742 -0.110857 1.743786 0.478417 0.236704 0.861855
4.400000 0.712425 -0.104099 1.762680 0.466317 0.254244 0.854743
4.433333 0.726924 -0.096898 1.792865 0.458501 0.277394 0.849646
4.466667 0.741236 -0.089259 1.829154 0.455618 0.306427 0.843090
4.500000 0.755359 -0.081184 1.850917 0.457639 0.341033 0.836217
4.533333 0.769290 -0.072677 1.890035 0.464315 0.380170 0.825600
4.566667 0.783648 -0.060272 1.937133 0.475393 0.422329 0.805955
4.600000 0.798996 -0.043905 1.961637 0.490158 0.465287 0.773244
4.633333 0.814140 -0.027127 1.985125 0.507760 0.506870 0.729871
4.666667 0.830933 -0.007527 2.003779 0.527248 0.544893 0.679463
4.700000 0.847512 0.012458 2.019621 0.547966 0.577324 0.620765
4.733333 0.866981 0.034894 2.049143 0.568821 0.602296 0.559593
4.766667 0.888150 0.058577 2.067710 0.588352 0.618583 0.502173
4.800000 0.909077 0.082599 2.083995 0.605241 0.625876 0.456381
4.833333 0.929751 0.106941 2.101511 0.618280 0.624210 0.426279
4.866667 0.951285 0.129820 2.101035 0.626330 0.614070 0.416090
4.900000 0.973179 0.150931 2.114984 0.628057 0.596201 0.429779
4.933333 0.996685 0.171475 2.107197 0.622619 0.571663 0.469989
4.966667 1.020205 0.190688 2.115224 0.609884 0.541759 0.537288
5.000000 1.042872 0.208922 2.130941 0.589544 0.507332 0.628078
5.033333 1.064751 0.225704 2.141061 0.561365 0.469239 0.737061
5.066667 1.084555 0.240721 2.166540 0.525736 0.428539 0.852116
5.100000 1.101557 0.253464 2.192607 0.483617 0.386642 0.964652
5.133333 1.118196 0.266424 2.228182 0.436408 0.345064 1.059281
5.166667 1.134461 0.279595 2.275153 0.385251 0.305110 1.125026
5.200000 1.147445 0.289179 2.339470 0.332016 0.268599 1.153617
5.233333 1.157399 0.296540 2.393806 0.278735 0.237654 1.141077
5.266667 1.163853 0.300599 2.449239 0.227072 0.214555 1.090918
5.300000 1.169924 0.304868 2.512239 0.178303 0.201144 1.005592
5.333333 1.172166 0.306923 2.555657 0.133569 0.199229 0.898706
5.366667 1.174032 0.309200 2.576546 0.093885 0.210070 0.780833
5.400000 1.175529 0.311706 2.589118 0.059531 0.234182 0.664641
5.433333 1.174883 0.317072 2.598577 0.030507 0.270815 0.560845
5.466667 1.173882 0.322678 2.579995 0.006427 0.318035 0.477981
5.500000 1.173106 0.332554 2.597675 -0.013003 0.373137 0.420631
5.533333 1.171989 0.342676 2.598857 -0.028527 0.432914 0.384298
5.566667 1.170689 0.357659 2.597570 -0.040850 0.494104 0.362461
5.600000 1.169062 0.377379 2.604541 -0.050454 0.553439 0.350039
5.633333 1.167083 0.402715 2.623339 -0.057830 0.608246 0.340681
5.666667 1.164790 0.428266 2.658524 -0.063124 0.656293 0.326041
5.700000 1.162193 0.454016 2.692739 -0.066465 0.696097 0.304835
5.733333 1.159302 0.479950 2.703347 -0.067969 0.726559 0.280205
5.766667 1.156125 0.506052 2.719370 -0.067728 0.747363 0.258725
5.800000 1.152672 0.532307 2.719209 -0.065813 0.758840 0.244599
5.833333 1.149877 0.559223 2.720058 -0.062121 0.761855 0.245547
5.866667 1.148446 0.585204 2.704993 -0.056865 0.757827 0.270045
5.900000 1.146764 0.611290 2.681392 -0.050384 0.748472 0.322625
5.933333 1.144700 0.638120 2.686584 -0.042596 0.735956 0.403740
5.966667 1.143004 0.665216 2.697924 -0.032961 0.723208 0.512404
6.000000 1.142157 0.689620 2.718265 -0.019743 0.715473 0.644164
6.033333 1.142006 0.710580 2.747616 -0.001506 0.718097 0.788469
6.066667 1.141637 0.731574 2.771669 0.021723 0.733195 0.936312
6.100000 1.141051 0.752591 2.808618 0.049992 0.762581 1.075774
6.133333 1.140255 0.773622 2.857317 0.082246 0.806083 1.198032
6.166667 1.141810 0.793699 2.929323 0.116006 0.860866 1.291376
6.200000 1.143160 0.813772 2.967850 0.146237 0.918620 1.350981
6.233333 1.144307 0.833832 3.005758 0.168104 0.970248 1.377297
6.266667 1.148606 0.860893 3.059511 0.179906 1.011746 1.369629
6.300000 1.158944 0.901887 3.123197 0.179393 1.037931 1.332298
6.333333 1.184684 0.971671 -3.093606 0.164347 1.043575 1.269231
6.366667 1.210166 1.041336 -3.041090 0.133973 1.025251 1.192167
6.400000 1.213620 1.077054 -3.003083 0.090783 0.985385 1.106859
6.433333 1.216801 1.112559 -2.981284 0.037183 0.926995 1.018142
6.466667 1.213547 1.136936 -2.954783 -0.024977 0.852467 0.932937
6.500000 1.206835 1.155864 -2.939538 -0.092446 0.767007 0.858939
6.533333 1.198287 1.172221 -2.915672 -0.159750 0.679932 0.802158
6.566667 1.188324 1.187357 -2.897207 -0.221750 0.600438 0.761395
6.600000 1.177080 1.201718 -2.877482 -0.276990 0.531937 0.734152
6.633333 1.165122 1.215524 -2.853727 -0.323351 0.477716 0.717068
6.666667 1.152963 1.229045 -2.833212 -0.360120 0.438606 0.705547
6.700000 1.140345 1.241368 -2.805659 -0.387666 0.413448 0.690274
6.733333 1.127555 1.253401 -2.774015 -0.407935 0.398277 0.663590
6.766667 1.111746 1.266568 -2.756223 -0.422659 0.388653 0.625179
6.800000 1.095796 1.279437 -2.728693 -0.431941 0.382863 0.578774
6.833333 1.079725 1.292006 -2.685810 -0.436413 0.378596 0.528091
6.866667 1.063549 1.304270 -2.659359 -0.436201 0.374444 0.477766
6.900000 1.047287 1.316227 -2.648460 -0.431212 0.369285 0.436156
6.933333 1.030956 1.327874 -2.656774 -0.420723 0.361855 0.416795
6.966667 1.017541 1.341376 -2.661916 -0.405038 0.351256 0.423573
7.000000 1.004090 1.354562 -2.660465 -0.384084 0.336518 0.459183
7.033333 0.990617 1.367428 -2.649490 -0.358087 0.317490 0.522852
7.066667 0.977136 1.379969 -2.658720 -0.327354 0.293982 0.612548
7.100000 0.966022 1.390851 -2.634878 -0.292549 0.266046 0.718806
7.133333 0.954927 1.401402 -2.612271 -0.255532 0.234436 0.823127
7.166667 0.947329 1.407966 -2.578582 -0.217600 0.200382 0.913037
7.200000 0.939771 1.414200 -2.535670 -0.180631 0.165341 0.978060
7.233333 0.932260 1.420108 -2.485265 -0.146216 0.130465 1.015425
7.266667 0.930850 1.421726 -2.415507 -0.116287 0.097325 1.019030
7.300000 0.929496 1.423029 -2.354313 -0.092026 0.067163 0.991266
7.333333 0.931689 1.422676 -2.302335 -0.073968 0.040978 0.936781
7.366667 0.933936 1.422025 -2.290142 -0.062266 0.018967 0.864568
7.400000 0.935281 1.420545 -2.271761 -0.056739 0.001305 0.781204
7.433333 0.934553 1.419418 -2.265916 -0.056986 -0.011835 0.689238
7.466667 0.931680 1.418447 -2.268276 -0.061336 -0.021021 0.596833
7.500000 0.927951 1.417661 -2.257653 -0.068408 -0.026697 0.508578
7.533333 0.924273 1.416616 -2.234476 -0.076459 -0.029561 0.432575
