t x y theta dxdt dydt dthetadt
0.000000 0.000000 0.000000 -0.145215 -0.016200 0.151516 0.002804
0.033333 -0.000546 0.005105 -0.140113 -0.016495 0.154726 0.001866
0.066667 -0.001101 0.010314 -0.133936 -0.016790 0.157950 -0.000226
0.100000 -0.001665 0.015628 -0.142979 -0.017085 0.161190 -0.003274
0.133333 -0.002238 0.021047 -0.152261 -0.017381 0.164451 -0.004761
0.166667 -0.002823 0.026581 -0.136214 -0.017679 0.167733 -0.007959
0.200000 -0.003417 0.032221 -0.143195 -0.017979 0.171037 -0.013401
0.233333 -0.004019 0.037967 -0.141409 -0.018280 0.174364 -0.014220
0.266667 -0.004631 0.043818 -0.140184 -0.018584 0.177714 -0.014713
0.300000 -0.005255 0.049789 -0.144487 -0.018890 0.181086 -0.012946
0.333333 -0.005890 0.055880 -0.144281 -0.019197 0.184477 -0.011277
0.366667 -0.006536 0.062093 -0.163181 -0.019507 0.187892 -0.006964
0.400000 -0.007192 0.068411 -0.133973 -0.019818 0.191327 -0.001926
0.433333 -0.007859 0.074853 -0.150567 -0.020131 0.194787 0.001611
0.466667 -0.008535 0.081400 -0.152342 -0.020447 0.198269 0.005699
0.500000 -0.009220 0.088052 -0.141630 -0.020764 0.201777 0.008134
0.533333 -0.009917 0.094829 -0.151287 -0.021085 0.205313 0.010840
0.566667 -0.010622 0.101711 -0.143325 -0.021408 0.208875 0.010113
0.600000 -0.011339 0.108720 -0.137110 -0.021733 0.212465 0.009238
0.633333 -0.012069 0.115856 -0.137472 -0.022061 0.216081 0.006820
0.666667 -0.012810 0.123120 -0.146164 -0.022391 0.219717 -0.003469
0.700000 -0.013563 0.130513 -0.144876 -0.022721 0.223359 -0.013945
0.733333 -0.014325 0.138008 -0.142399 -0.023049 0.226992 -0.000500
0.766667 -0.015098 0.145632 -0.149333 -0.023372 0.230602 0.072888
0.800000 -0.015884 0.153387 -0.139554 -0.023688 0.234172 0.239771
0.833333 -0.016682 0.161271 -0.139852 -0.023996 0.237689 0.534126
0.866667 -0.017492 0.169285 -0.151710 -0.024294 0.241142 0.991153
0.900000 -0.018309 0.177399 -0.142500 -0.024582 0.244533 1.621675
0.933333 -0.019139 0.185643 -0.147643 -0.024861 0.247865 2.391490
0.966667 -0.019976 0.193985 -0.151599 -0.025131 0.251150 3.246066
1.000000 -0.020820 0.202423 -0.218119 -0.025395 0.254406 4.124021
1.033333 -0.021671 0.210957 -0.150574 -0.025655 0.257655 4.954412
1.066667 -0.022529 0.219584 0.145682 -0.025915 0.260929 5.654528
1.100000 -0.023394 0.228305 0.553331 -0.026177 0.264249 6.145680
1.133333 -0.024270 0.237160 0.969743 -0.026442 0.267630 6.381517
1.166667 -0.025154 0.246106 1.360334 -0.026711 0.271077 6.328620
1.200000 -0.026043 0.255142 1.643636 -0.026982 0.274595 5.974816
1.233333 -0.026944 0.264317 1.926284 -0.027254 0.278174 5.333244
1.266667 -0.027857 0.273632 2.100454 -0.027525 0.281794 4.467576
1.300000 -0.028782 0.283088 2.270027 -0.027791 0.285438 3.460503
1.333333 -0.029717 0.292685 2.291571 -0.028049 0.289092 2.402503
1.366667 -0.030663 0.302422 2.293145 -0.028297 0.292738 1.383618
1.400000 -0.031618 0.312297 2.245040 -0.028533 0.296349 0.476285
1.433333 -0.032577 0.322251 2.189023 -0.028755 0.299904 -0.261746
1.466667 -0.033541 0.332281 2.114074 -0.028962 0.303392 -0.816806
1.500000 -0.034511 0.342443 2.036124 -0.029156 0.306798 -1.187325
1.533333 -0.035488 0.352734 1.942826 -0.029337 0.310108 -1.394389
1.566667 -0.036470 0.363150 1.860322 -0.029505 0.313313 -1.466227
1.600000 -0.037459 0.373689 1.814673 -0.029663 0.316416 -1.435627
1.633333 -0.038453 0.384346 1.775761 -0.029811 0.319413 -1.334165
1.666667 -0.039451 0.395066 1.721022 -0.029949 0.322288 -1.187139
1.700000 -0.040454 0.405899 1.692466 -0.030078 0.325035 -1.020884
1.733333 -0.041459 0.416789 1.672364 -0.030197 0.327652 -0.852981
1.766667 -0.042471 0.427785 1.645001 -0.030307 0.330138 -0.695490
1.800000 -0.043487 0.438882 1.638801 -0.030405 0.332483 -0.551579
1.833333 -0.044504 0.450029 1.626399 -0.030492 0.334688 -0.424796
1.866667 -0.045523 0.461223 1.618860 -0.030568 0.336761 -0.317851
1.900000 -0.046546 0.472503 1.605875 -0.030632 0.338706 -0.226697
1.933333 -0.047571 0.483863 1.599401 -0.030684 0.340518 -0.151550
1.966667 -0.048599 0.495297 1.604010 -0.030723 0.342192 -0.090633
2.000000 -0.049627 0.506767 1.603034 -0.030750 0.343732 -0.043380
2.033333 -0.050654 0.518269 1.598022 -0.030764 0.345134 -0.007761
2.066667 -0.051683 0.529825 1.614761 -0.030764 0.346393 0.017773
2.100000 -0.052711 0.541431 1.611847 -0.030751 0.347502 0.030955
2.133333 -0.053739 0.553059 1.617968 -0.030725 0.348465 0.036828
2.166667 -0.054766 0.564724 1.621377 -0.030686 0.349286 0.037069
2.200000 -0.055791 0.576421 1.620103 -0.030634 0.349964 0.033816
2.233333 -0.056815 0.588131 1.637231 -0.030571 0.350498 0.024811
2.266667 -0.057836 0.599852 1.616070 -0.030496 0.350895 0.015818
2.300000 -0.058853 0.611584 1.621388 -0.030410 0.351158 0.007856
2.333333 -0.059867 0.623323 1.612671 -0.030313 0.351288 0.001532
2.366667 -0.060877 0.635061 1.620127 -0.030205 0.351282 -0.003948
2.400000 -0.061884 0.646797 1.614202 -0.030086 0.351141 -0.007617
2.433333 -0.062887 0.658526 1.620797 -0.029955 0.350867 -0.006017
2.466667 -0.063886 0.670244 1.621190 -0.029811 0.350456 -0.004650
2.500000 -0.064881 0.681950 1.621701 -0.029653 0.349903 -0.002193
2.533333 -0.065870 0.693638 1.618286 -0.029481 0.349204 -0.000944
2.566667 -0.066855 0.705307 1.617445 -0.029293 0.348356 0.000960
2.600000 -0.067832 0.716938 1.613835 -0.029089 0.347351 0.001608
2.633333 -0.068803 0.728542 1.620319 -0.028867 0.346187 0.000362
2.666667 -0.069765 0.740098 1.622104 -0.028629 0.344864 0.000105
2.700000 -0.070718 0.751601 1.613509 -0.028375 0.343387 -0.000088
2.733333 -0.071665 0.763067 1.622679 -0.028106 0.341760 -0.001038
2.766667 -0.072601 0.774471 1.622345 -0.027823 0.339993 -0.003052
2.800000 -0.073527 0.785807 1.614482 -0.027530 0.338100 -0.006679
2.833333 -0.074441 0.797071 1.623687 -0.027227 0.336095 -0.011398
2.866667 -0.075345 0.808257 1.619446 -0.026918 0.333990 -0.017748
2.900000 -0.076236 0.819362 1.611730 -0.026602 0.331800 -0.025044
2.933333 -0.077116 0.830381 1.617549 -0.026284 0.329542 -0.030926
2.966667 -0.077987 0.841340 1.620472 -0.025965 0.327226 -0.035865
3.000000 -0.078849 0.852238 1.622778 -0.025644 0.324858 -0.039293
3.033333 -0.079699 0.863036 1.619325 -0.025322 0.322443 -0.043117
3.066667 -0.080535 0.873733 1.606489 -0.025000 0.319980 -0.046018
3.100000 -0.081362 0.884357 1.604750 -0.024675 0.317460 -0.049103
3.133333 -0.082179 0.894908 1.594084 -0.024347 0.314873 -0.057214
3.166667 -0.082987 0.905382 1.609341 -0.024015 0.312210 -0.085838
3.200000 -0.083785 0.915776 1.607937 -0.023676 0.309461 -0.159116
3.233333 -0.084573 0.926087 1.610018 -0.023329 0.306608 -0.304005
3.266667 -0.085345 0.936273 1.600973 -0.022973 0.303643 -0.551979
3.300000 -0.086107 0.946370 1.602328 -0.022608 0.300564 -0.928664
3.333333 -0.086858 0.956376 1.596382 -0.022233 0.297366 -1.446055
3.366667 -0.087598 0.966288 1.585735 -0.021848 0.294043 -2.080606
3.400000 -0.088322 0.976061 1.593876 -0.021454 0.290596 -2.783873
3.433333 -0.089030 0.985691 1.593302 -0.021052 0.287039 -3.498845
3.466667 -0.089726 0.995219 1.516803 -0.020643 0.283373 -4.158328
3.500000 -0.090410 1.004642 1.344497 -0.020227 0.279597 -4.688912
3.533333 -0.091078 1.013917 1.039683 -0.019806 0.275720 -5.020372
3.566667 -0.091730 1.023040 0.697868 -0.019380 0.271758 -5.119624
3.600000 -0.092369 1.032052 0.350223 -0.018952 0.267719 -4.980392
3.633333 -0.092996 1.040949 0.036620 -0.018520 0.263602 -4.606135
3.666667 -0.093607 1.049688 -0.230071 -0.018086 0.259416 -4.020506
3.700000 -0.094203 1.058266 -0.331742 -0.017650 0.255176 -3.283128
3.733333 -0.094785 1.066723 -0.340814 -0.017212 0.250882 -2.479784
3.766667 -0.095351 1.075016 -0.337877 -0.016772 0.246532 -1.685572
3.800000 -0.095901 1.083146 -0.306201 -0.016330 0.242130 -0.961297
3.833333 -0.096438 1.091148 -0.228697 -0.015887 0.237683 -0.364005
3.866667 -0.096962 1.099020 -0.146448 -0.015442 0.233194 0.062378
3.900000 -0.097470 1.106726 -0.085753 -0.014995 0.228661 0.316929
3.933333 -0.097964 1.114299 -0.089085 -0.014546 0.224089 0.431627
3.966667 -0.098442 1.121706 -0.093298 -0.014096 0.219480 0.440896
4.000000 -0.098904 1.128944 -0.088859 -0.013645 0.214836 0.377466
4.033333 -0.099352 1.136044 -0.091440 -0.013192 0.210159 0.278486
4.066667 -0.099784 1.142975 -0.095037 -0.012739 0.205452 0.181972
4.100000 -0.100200 1.149736 -0.097216 -0.012286 0.200721 0.107306
4.133333 -0.100602 1.156353 -0.089380 -0.011832 0.195971 0.052745
4.166667 -0.100988 1.162799 -0.081141 -0.011379 0.191208 0.017324
4.200000 -0.101360 1.169098 -0.091931 -0.010927 0.186437 0.000050
4.233333 -0.101717 1.175248 -0.093930 -0.010475 0.181660 -0.004746
4.266667 -0.102059 1.181226 -0.089643 -0.010025 0.176876 -0.004387
4.300000 -0.102384 1.187031 -0.093499 -0.009576 0.172087 -0.005743
4.333333 -0.102696 1.192684 -0.088303 -0.009127 0.167291 -0.006463
4.366667 -0.102992 1.198182 -0.093005 -0.008679 0.162485 -0.005642
4.400000 -0.103274 1.203525 -0.097628 -0.008232 0.157666 -0.004351
4.433333 -0.103542 1.208712 -0.091683 -0.007785 0.152832 -0.003538
4.466667 -0.103793 1.213724 -0.095031 -0.007338 0.147978 -0.003324
