t x y theta dxdt dydt dthetadt
0.000000 0.000000 0.000000 1.207981 -0.009854 0.152464 0.192591
0.033333 -0.000331 0.005147 1.207828 -0.009087 0.157172 0.178790
0.066667 -0.000629 0.010465 1.210913 -0.008303 0.161823 0.160336
0.100000 -0.000895 0.015953 1.230922 -0.007503 0.166419 0.138272
0.133333 -0.001140 0.021579 1.228903 -0.006687 0.170955 0.113180
0.166667 -0.001353 0.027367 1.238781 -0.005857 0.175426 0.086870
0.200000 -0.001534 0.033313 1.231271 -0.005016 0.179825 0.060901
0.233333 -0.001682 0.039413 1.230768 -0.004167 0.184138 0.035276
0.266667 -0.001797 0.045664 1.233381 -0.003315 0.188354 0.008541
0.300000 -0.001891 0.052042 1.231909 -0.002463 0.192466 -0.015822
0.333333 -0.001965 0.058544 1.233548 -0.001613 0.196465 -0.040272
0.366667 -0.002005 0.065184 1.232137 -0.000769 0.200345 -0.063270
0.400000 -0.002024 0.071943 1.232178 0.000068 0.204100 -0.082785
0.433333 -0.002008 0.078832 1.223911 0.000899 0.207731 -0.090266
0.466667 -0.001959 0.085847 1.227699 0.001724 0.211235 -0.073198
0.500000 -0.001877 0.092981 1.217542 0.002543 0.214609 -0.012883
0.533333 -0.001773 0.100224 1.203765 0.003353 0.217854 0.111306
0.566667 -0.001649 0.107572 1.200822 0.004155 0.220970 0.321036
0.600000 -0.001494 0.115022 1.203889 0.004946 0.223959 0.637090
0.633333 -0.001319 0.122572 1.200852 0.005725 0.226824 1.067392
0.666667 -0.001115 0.130211 1.181708 0.006490 0.229568 1.606532
0.700000 -0.000884 0.137934 1.167692 0.007244 0.232197 2.232373
0.733333 -0.000624 0.145734 1.193396 0.007987 0.234716 2.921359
0.766667 -0.000337 0.153607 1.284103 0.008721 0.237132 3.633770
0.800000 -0.000029 0.161567 1.442052 0.009445 0.239449 4.313946
0.833333 0.000298 0.169609 1.681400 0.010162 0.241670 4.903662
0.866667 0.000645 0.177732 1.867766 0.010870 0.243796 5.360353
0.900000 0.001020 0.185913 2.119680 0.011570 0.245825 5.646057
0.933333 0.001414 0.194169 2.429705 0.012260 0.247756 5.727763
0.966667 0.001836 0.202479 2.722174 0.012943 0.249587 5.594246
1.000000 0.002286 0.210845 2.945946 0.013618 0.251317 5.264392
1.033333 0.002755 0.219276 -3.116292 0.014285 0.252945 4.779063
1.066667 0.003242 0.227771 -2.952222 0.014942 0.254470 4.173008
1.100000 0.003755 0.236298 -2.815812 0.015589 0.255893 3.491648
1.133333 0.004285 0.244883 -2.737541 0.016224 0.257212 2.790638
1.166667 0.004840 0.253495 -2.704855 0.016847 0.258425 2.117171
1.200000 0.005418 0.262131 -2.697587 0.017459 0.259531 1.500794
1.233333 0.006014 0.270818 -2.680818 0.018059 0.260531 0.955077
1.266667 0.006628 0.279550 -2.690321 0.018647 0.261430 0.494778
1.300000 0.007258 0.288327 -2.695998 0.019223 0.262229 0.125890
1.333333 0.007909 0.297114 -2.711916 0.019787 0.262933 -0.161083
1.366667 0.008581 0.305909 -2.709453 0.020338 0.263547 -0.381848
1.400000 0.009274 0.314707 -2.729507 0.020876 0.264074 -0.550116
1.433333 0.009982 0.323538 -2.753298 0.021401 0.264512 -0.672977
1.466667 0.010708 0.332366 -2.784598 0.021913 0.264859 -0.763553
1.500000 0.011450 0.341221 -2.827577 0.022410 0.265121 -0.830228
1.533333 0.012210 0.350065 -2.865459 0.022893 0.265300 -0.878779
1.566667 0.012984 0.358933 -2.916136 0.023362 0.265400 -0.906958
1.600000 0.013772 0.367820 -2.937721 0.023816 0.265424 -0.914881
1.633333 0.014577 0.376688 -2.956726 0.024256 0.265382 -0.907072
1.666667 0.015395 0.385571 -2.986213 0.024682 0.265279 -0.883212
1.700000 0.016228 0.394430 -3.025403 0.025094 0.265120 -0.850083
1.733333 0.017075 0.403262 -3.060621 0.025493 0.264909 -0.805855
1.766667 0.017935 0.412066 -3.085881 0.025879 0.264654 -0.752426
1.800000 0.018807 0.420875 -3.114690 0.026251 0.264365 -0.685225
1.833333 0.019691 0.429687 -3.124732 0.026608 0.264042 -0.599458
1.866667 0.020586 0.438501 3.133661 0.026951 0.263689 -0.492099
1.900000 0.021493 0.447299 3.102353 0.027278 0.263305 -0.352585
1.933333 0.022411 0.456078 3.094170 0.027589 0.262885 -0.185414
1.966667 0.023340 0.464837 3.085399 0.027882 0.262416 0.006340
2.000000 0.024279 0.473589 3.076799 0.028155 0.261888 0.210718
2.033333 0.025227 0.482331 3.035437 0.028409 0.261296 0.421962
2.066667 0.026183 0.491048 3.061904 0.028642 0.260634 0.627951
2.100000 0.027148 0.499752 3.094283 0.028854 0.259899 0.811433
2.133333 0.028119 0.508428 -3.120908 0.029044 0.259088 0.963144
2.166667 0.029094 0.517057 -3.051466 0.029215 0.258207 1.072963
2.200000 0.030076 0.525665 -3.000685 0.029367 0.257260 1.139135
2.233333 0.031065 0.534252 -2.942501 0.029500 0.256246 1.149284
2.266667 0.032054 0.542787 -2.894391 0.029614 0.255161 1.108102
2.300000 0.033040 0.551267 -2.844132 0.029710 0.254008 1.022947
2.333333 0.034033 0.559720 -2.816043 0.029789 0.252787 0.906051
2.366667 0.035032 0.568144 -2.777771 0.029850 0.251496 0.768710
2.400000 0.036036 0.576536 -2.766487 0.029895 0.250131 0.621046
2.433333 0.037036 0.584866 -2.759971 0.029923 0.248697 0.480952
2.466667 0.038040 0.593161 -2.752256 0.029938 0.247198 0.353827
2.500000 0.039041 0.601390 -2.743838 0.029941 0.245639 0.242936
2.533333 0.040045 0.609580 -2.737538 0.029933 0.244024 0.146320
2.566667 0.041045 0.617701 -2.748104 0.029914 0.242359 0.067811
2.600000 0.042041 0.625749 -2.749609 0.029889 0.240655 0.004515
2.633333 0.043032 0.633725 -2.752276 0.029859 0.238921 -0.048609
2.666667 0.044025 0.641656 -2.754255 0.029824 0.237161 -0.092155
2.700000 0.045021 0.649541 -2.761502 0.029785 0.235378 -0.123137
2.733333 0.046012 0.657352 -2.754414 0.029743 0.233578 -0.141027
2.766667 0.047004 0.665115 -2.750326 0.029697 0.231763 -0.152384
2.800000 0.047998 0.672827 -2.761849 0.029645 0.229926 -0.156550
2.833333 0.048986 0.680464 -2.794256 0.029585 0.228060 -0.151573
2.866667 0.049975 0.688049 -2.811309 0.029514 0.226158 -0.138170
2.900000 0.050958 0.695556 -2.805898 0.029434 0.224222 -0.121784
2.933333 0.051941 0.703009 -2.806067 0.029341 0.222249 -0.102869
2.966667 0.052924 0.710405 -2.805309 0.029237 0.220236 -0.079430
3.000000 0.053900 0.717723 -2.803296 0.029122 0.218191 -0.054999
3.033333 0.054870 0.724963 -2.803425 0.029000 0.216121 -0.035390
3.066667 0.055838 0.732143 -2.806635 0.028873 0.214033 -0.024671
3.100000 0.056800 0.739245 -2.803793 0.028740 0.211928 -0.022975
3.133333 0.057753 0.746269 -2.800539 0.028604 0.209810 -0.032260
3.166667 0.058699 0.753215 -2.800256 0.028468 0.207687 -0.055475
3.200000 0.059644 0.760098 -2.798686 0.028332 0.205559 -0.092324
3.233333 0.060586 0.766916 -2.803542 0.028197 0.203425 -0.138433
3.266667 0.061527 0.773669 -2.806370 0.028062 0.201287 -0.190624
3.300000 0.062459 0.780344 -2.800180 0.027930 0.199142 -0.246977
3.333333 0.063388 0.786952 -2.812309 0.027801 0.196989 -0.306225
3.366667 0.064315 0.793493 -2.820247 0.027674 0.194818 -0.364708
3.400000 0.065235 0.799955 -2.839031 0.027550 0.192622 -0.415717
3.433333 0.066149 0.806336 -2.865434 0.027428 0.190395 -0.459159
3.466667 0.067059 0.812649 -2.880704 0.027310 0.188134 -0.493037
3.500000 0.067966 0.818891 -2.903684 0.027195 0.185837 -0.513514
3.533333 0.068869 0.825062 -2.941630 0.027081 0.183503 -0.516796
3.566667 0.069768 0.831162 -2.942305 0.026969 0.181136 -0.503358
3.600000 0.070664 0.837176 -2.956771 0.026856 0.178737 -0.478023
3.633333 0.071558 0.843103 -2.975755 0.026739 0.176310 -0.441094
3.666667 0.072450 0.848942 -3.007089 0.026614 0.173856 -0.393998
3.700000 0.073338 0.854691 -3.023047 0.026480 0.171377 -0.341181
3.733333 0.074223 0.860350 -3.026210 0.026333 0.168877 -0.288363
3.766667 0.075103 0.865934 -3.035342 0.026171 0.166364 -0.236048
3.800000 0.075978 0.871444 -3.034333 0.025995 0.163843 -0.184334
3.833333 0.076848 0.876880 -3.032391 0.025803 0.161320 -0.136713
3.866667 0.077710 0.882223 -3.044686 0.025598 0.158802 -0.094689
3.900000 0.078563 0.887474 -3.043824 0.025382 0.156294 -0.060287
3.933333 0.079406 0.892636 -3.045429 0.025156 0.153799 -0.030905
3.966667 0.080240 0.897709 -3.037677 0.024925 0.151319 -0.005681
4.000000 0.081064 0.902696 -3.041952 0.024690 0.148859 0.014271
4.033333 0.081882 0.907608 -3.036229 0.024453 0.146422 0.031157
