t x y theta dxdt dydt dthetadt
0.000000 0.000000 0.000000 -0.237516 0.006080 0.038648 -0.019850
0.033333 0.000116 0.001180 -0.237554 0.006932 0.044104 -0.027778
0.066667 0.000353 0.002757 -0.232541 0.007903 0.049949 -0.037597
0.100000 0.000681 0.004719 -0.236826 0.008968 0.056119 -0.049012
0.133333 0.001029 0.006755 -0.233537 0.010129 0.062596 -0.064031
0.166667 0.001394 0.008863 -0.234672 0.011417 0.069567 -0.086372
0.200000 0.001777 0.011043 -0.238188 0.012867 0.077221 -0.118556
0.233333 0.002175 0.013293 -0.251024 0.014513 0.085775 -0.160309
0.266667 0.002708 0.016559 -0.257884 0.016438 0.095543 -0.213997
0.300000 0.003254 0.019892 -0.251119 0.018744 0.106889 -0.284909
0.333333 0.003813 0.023290 -0.252974 0.021575 0.120065 -0.373151
0.366667 0.004382 0.026751 -0.254920 0.025147 0.135099 -0.476635
0.400000 0.004960 0.030273 -0.270124 0.029676 0.152023 -0.592722
0.433333 0.005545 0.033853 -0.289849 0.035541 0.170891 -0.719359
0.466667 0.006637 0.039425 -0.324003 0.043155 0.191473 -0.843134
0.500000 0.008134 0.047126 -0.356611 0.052887 0.213335 -0.941259
0.533333 0.009633 0.054872 -0.383034 0.064930 0.235923 -0.994717
0.566667 0.011132 0.062655 -0.403120 0.079227 0.258597 -0.990002
0.600000 0.013138 0.071932 -0.467243 0.095673 0.280597 -0.912440
0.633333 0.015138 0.081230 -0.547398 0.113703 0.300832 -0.747579
0.666667 0.018434 0.092230 -0.618544 0.132261 0.318182 -0.494709
0.700000 0.023398 0.104772 -0.664410 0.150220 0.331746 -0.167421
0.733333 0.028341 0.117303 -0.695595 0.166559 0.340771 0.218185
0.766667 0.035231 0.130347 -0.703275 0.180236 0.344590 0.646726
0.800000 0.043870 0.143214 -0.670802 0.189877 0.342489 1.088420
0.833333 0.052462 0.156032 -0.588343 0.194539 0.334288 1.500539
0.866667 0.060996 0.168789 -0.487692 0.193844 0.320254 1.841224
0.900000 0.069461 0.181472 -0.402099 0.187668 0.300742 2.078686
0.933333 0.077846 0.194070 -0.299174 0.175890 0.276116 2.184924
0.966667 0.084552 0.203683 -0.174558 0.158858 0.247074 2.136248
1.000000 0.088815 0.209808 -0.046674 0.138056 0.215000 1.921850
1.033333 0.092971 0.215822 0.061416 0.114836 0.181045 1.558537
1.066667 0.097012 0.221718 0.160467 0.090771 0.146402 1.074180
1.100000 0.100932 0.227493 0.223483 0.067527 0.112184 0.497228
1.133333 0.101464 0.229429 0.248645 0.047038 0.079810 -0.140497
1.166667 0.101865 0.231239 0.215867 0.030993 0.050291 -0.793083
1.200000 0.100246 0.230153 0.145629 0.020293 0.024282 -1.402704
1.233333 0.098494 0.228942 0.042615 0.015923 0.002558 -1.928732
1.266667 0.096606 0.227608 -0.057074 0.018294 -0.014354 -2.335419
1.300000 0.094582 0.226156 -0.181041 0.027348 -0.026018 -2.587625
1.333333 0.094039 0.223732 -0.364503 0.042287 -0.032528 -2.653810
1.366667 0.093358 0.221195 -0.489996 0.062074 -0.033989 -2.534447
1.400000 0.094992 0.218632 -0.597282 0.085075 -0.031053 -2.251294
1.433333 0.099265 0.216471 -0.724059 0.109240 -0.024675 -1.833073
1.466667 0.103385 0.214209 -0.852489 0.132599 -0.015831 -1.319041
1.500000 0.109547 0.213319 -0.902179 0.153230 -0.005582 -0.759329
1.533333 0.117239 0.213891 -0.893906 0.169653 0.005009 -0.213478
1.566667 0.125826 0.215902 -0.861309 0.180483 0.014873 0.276835
1.600000 0.134218 0.217814 -0.773790 0.185290 0.023364 0.677693
1.633333 0.142400 0.219627 -0.667079 0.184200 0.030049 0.970586
1.666667 0.149750 0.221598 -0.576609 0.177648 0.034530 1.154306
1.700000 0.156866 0.223467 -0.493033 0.166401 0.036537 1.242172
1.733333 0.162318 0.224951 -0.393042 0.151554 0.035993 1.261545
1.766667 0.167513 0.226331 -0.359679 0.134386 0.033080 1.248820
1.800000 0.170953 0.227291 -0.378449 0.115981 0.027978 1.244857
1.833333 0.174118 0.228146 -0.378541 0.097154 0.020623 1.271929
1.866667 0.176235 0.228946 -0.383315 0.078558 0.010964 1.339652
1.900000 0.178060 0.229643 -0.415806 0.060740 -0.000931 1.450043
1.933333 0.179587 0.230234 -0.399227 0.043722 -0.014825 1.592633
1.966667 0.180809 0.230721 -0.329969 0.027294 -0.030519 1.734781
2.000000 0.181720 0.231103 -0.221898 0.010844 -0.047660 1.839280
2.033333 0.181851 0.229958 -0.109967 -0.006288 -0.065168 1.894275
2.066667 0.181404 0.226585 0.018333 -0.025010 -0.081657 1.885885
2.100000 0.180627 0.223113 0.149184 -0.046268 -0.095861 1.801180
2.133333 0.179515 0.219547 0.271594 -0.070657 -0.106642 1.645175
2.166667 0.177621 0.213432 0.303699 -0.098642 -0.112788 1.447877
2.200000 0.175382 0.207234 0.339893 -0.130447 -0.113461 1.234904
2.233333 0.172795 0.200961 0.338707 -0.166266 -0.108705 1.014943
2.266667 0.168367 0.194453 0.299313 -0.205759 -0.099197 0.810588
2.300000 0.161877 0.188951 0.236944 -0.248440 -0.085710 0.648875
2.333333 0.153217 0.185830 0.251851 -0.293791 -0.069234 0.534392
2.366667 0.142260 0.185037 0.323351 -0.340958 -0.051387 0.447071
2.400000 0.128644 0.185882 0.349406 -0.388668 -0.033744 0.378703
2.433333 0.114691 0.186678 0.359376 -0.435394 -0.017488 0.323744
2.466667 0.100408 0.187425 0.401691 -0.480032 -0.003507 0.263858
2.500000 0.083483 0.188733 0.433153 -0.521590 0.007329 0.177278
2.533333 0.063985 0.190116 0.449246 -0.559195 0.014549 0.064019
2.566667 0.041938 0.190972 0.439249 -0.592206 0.018258 -0.055347
2.600000 0.019611 0.191775 0.425515 -0.620478 0.018735 -0.173001
2.633333 -0.002979 0.192526 0.414526 -0.644057 0.016222 -0.279703
2.666667 -0.025815 0.193224 0.380265 -0.662874 0.010978 -0.358913
2.700000 -0.048881 0.193868 0.341295 -0.676951 0.003415 -0.397639
2.733333 -0.072159 0.194457 0.321793 -0.686430 -0.006287 -0.395192
2.766667 -0.095631 0.194991 0.288049 -0.691723 -0.018023 -0.362925
2.800000 -0.119282 0.195471 0.263897 -0.693135 -0.031593 -0.307905
2.833333 -0.143337 0.194575 0.257792 -0.690955 -0.046683 -0.239620
2.866667 -0.167534 0.193624 0.255844 -0.685377 -0.062937 -0.171220
2.900000 -0.191077 0.191210 0.272394 -0.676717 -0.079868 -0.112824
2.933333 -0.213726 0.187260 0.281481 -0.665413 -0.096779 -0.069592
2.966667 -0.236466 0.183264 0.302742 -0.651628 -0.112873 -0.043187
3.000000 -0.259281 0.179227 0.308394 -0.635612 -0.127460 -0.030770
3.033333 -0.280785 0.174138 0.298791 -0.617555 -0.139868 -0.025530
3.066667 -0.300997 0.168423 0.300664 -0.597963 -0.149470 -0.020115
3.100000 -0.320285 0.162220 0.294221 -0.577175 -0.155919 -0.006253
3.133333 -0.338581 0.155857 0.276486 -0.555340 -0.159159 0.021475
3.166667 -0.356884 0.149485 0.264719 -0.532896 -0.159365 0.067125
3.200000 -0.373993 0.143629 0.251284 -0.510193 -0.156712 0.130579
3.233333 -0.391088 0.137777 0.242694 -0.487762 -0.151661 0.205763
3.266667 -0.408161 0.131938 0.250655 -0.465809 -0.144731 0.285550
3.300000 -0.422982 0.127267 0.280023 -0.444634 -0.136498 0.358956
3.333333 -0.437763 0.122621 0.309739 -0.424627 -0.127423 0.411585
3.366667 -0.449915 0.119350 0.338311 -0.406209 -0.117986 0.430132
3.400000 -0.462016 0.116113 0.365523 -0.389809 -0.108700 0.406069
3.433333 -0.474060 0.112917 0.378676 -0.375963 -0.099901 0.338920
3.466667 -0.486043 0.109765 0.402370 -0.365490 -0.091933 0.233358
3.500000 -0.497962 0.106662 0.428160 -0.358917 -0.084906 0.102034
3.533333 -0.508544 0.104338 0.455037 -0.356597 -0.079009 -0.037421
3.566667 -0.519055 0.102071 0.455578 -0.358448 -0.074209 -0.164993
3.600000 -0.529490 0.099866 0.440167 -0.364496 -0.070545 -0.266997
3.633333 -0.539848 0.097726 0.402050 -0.374437 -0.068119 -0.334394
3.666667 -0.552273 0.095852 0.343019 -0.387433 -0.066940 -0.360668
3.700000 -0.564613 0.094052 0.278931 -0.402892 -0.067232 -0.345828
3.733333 -0.576861 0.092329 0.260357 -0.420255 -0.069199 -0.294955
3.766667 -0.591508 0.090432 0.247895 -0.439041 -0.073260 -0.219454
3.800000 -0.608168 0.087969 0.255565 -0.458350 -0.079592 -0.130897
3.833333 -0.624713 0.085596 0.278631 -0.477310 -0.088176 -0.042407
3.866667 -0.641135 0.083319 0.298124 -0.495582 -0.099014 0.029037
3.900000 -0.657423 0.081142 0.315981 -0.512694 -0.111860 0.070802
3.933333 -0.674998 0.077958 0.332908 -0.528026 -0.126199 0.078100
3.966667 -0.693504 0.073605 0.342879 -0.541136 -0.141302 0.055236
4.000000 -0.711842 0.069372 0.353374 -0.552059 -0.156643 0.009316
4.033333 -0.730804 0.063811 0.351202 -0.560854 -0.171680 -0.047368
4.066667 -0.750389 0.056957 0.345667 -0.567333 -0.185770 -0.100833
4.100000 -0.770615 0.048743 0.323609 -0.571311 -0.198265 -0.139466
4.133333 -0.790618 0.040690 0.302883 -0.572908 -0.208823 -0.155610
4.166667 -0.810383 0.032809 0.290267 -0.572305 -0.217210 -0.151932
4.200000 -0.829894 0.025115 0.261100 -0.569423 -0.223224 -0.129266
4.233333 -0.849137 0.017617 0.253897 -0.564229 -0.226990 -0.095801
4.266667 -0.868098 0.010330 0.246830 -0.556825 -0.228872 -0.056207
4.300000 -0.886696 0.001980 0.271970 -0.547340 -0.229438 -0.022514
4.333333 -0.904982 -0.006135 0.278586 -0.535661 -0.229212 -0.003184
4.366667 -0.922943 -0.013999 0.304489 -0.521457 -0.228763 -0.000913
4.400000 -0.940563 -0.021600 0.299888 -0.504446 -0.228511 -0.018012
4.433333 -0.957830 -0.028924 0.305154 -0.484363 -0.228617 -0.051408
4.466667 -0.974729 -0.035958 0.315280 -0.460793 -0.229102 -0.100651
4.500000 -0.991247 -0.042688 0.310590 -0.433494 -0.229962 -0.151633
4.533333 -1.006389 -0.050153 0.292076 -0.402553 -0.231007 -0.197531
4.566667 -1.019992 -0.058235 0.278419 -0.368411 -0.231885 -0.232201
4.600000 -1.033179 -0.065971 0.265836 -0.331669 -0.232130 -0.252896
4.633333 -1.044423 -0.074033 0.226342 -0.293184 -0.231266 -0.257125
4.666667 -1.053784 -0.082310 0.217096 -0.254103 -0.228803 -0.243808
4.700000 -1.061182 -0.090681 0.211335 -0.215593 -0.224014 -0.220234
4.733333 -1.066731 -0.099004 0.204195 -0.178651 -0.216366 -0.189787
4.766667 -1.070530 -0.107109 0.205342 -0.144068 -0.205515 -0.155303
4.800000 -1.072863 -0.114556 0.208913 -0.112500 -0.191382 -0.117944
4.833333 -1.074748 -0.121547 0.216915 -0.084136 -0.173973 -0.081381
4.866667 -1.076185 -0.128068 0.217716 -0.058702 -0.153347 -0.047448
4.900000 -1.077177 -0.134102 0.206517 -0.035510 -0.129924 -0.015441
4.933333 -1.077834 -0.137925 0.211173 -0.013711 -0.104241 0.012034
4.966667 -1.078048 -0.141234 0.199788 0.007805 -0.076763 0.034890
5.000000 -1.077821 -0.144016 0.195912 0.030148 -0.047909 0.048783
5.033333 -1.077304 -0.144466 0.192696 0.054108 -0.018298 0.052468
5.066667 -1.076349 -0.144367 0.199443 0.080145 0.011539 0.046233
5.100000 -1.074958 -0.143709 0.203124 0.108315 0.041217 0.029259
5.133333 -1.072190 -0.141683 0.229790 0.138459 0.070598 0.002751
5.166667 -1.067745 -0.138456 0.254068 0.169843 0.099678 -0.033774
5.200000 -1.061282 -0.134272 0.250150 0.201594 0.128470 -0.072091
5.233333 -1.052834 -0.129245 0.239809 0.232681 0.157583 -0.105346
5.266667 -1.043980 -0.123626 0.221643 0.262088 0.187452 -0.128435
5.300000 -1.033124 -0.117017 0.211828 0.288705 0.218768 -0.136654
5.333333 -1.021884 -0.109808 0.184764 0.311595 0.252207 -0.120557
5.366667 -1.010272 -0.101995 0.171073 0.330315 0.288341 -0.078128
5.400000 -0.997584 -0.092363 0.166449 0.344643 0.327925 -0.017313
5.433333 -0.984551 -0.082124 0.159474 0.354879 0.371289 0.052829
5.466667 -0.971185 -0.071277 0.141074 0.361430 0.419059 0.123458
5.500000 -0.958582 -0.057035 0.160173 0.365251 0.471166 0.182444
5.533333 -0.945674 -0.042188 0.185456 0.367301 0.527670 0.215473
5.566667 -0.933740 -0.023553 0.220167 0.368604 0.588300 0.215142
5.600000 -0.921524 -0.004324 0.245206 0.370144 0.652497 0.182132
5.633333 -0.910120 0.018646 0.269682 0.372805 0.719442 0.118065
5.666667 -0.898458 0.042189 0.288644 0.377368 0.787909 0.024133
5.700000 -0.886914 0.068967 0.287240 0.384353 0.857370 -0.086322
5.733333 -0.874995 0.099011 0.268832 0.394094 0.926662 -0.205483
5.766667 -0.862520 0.132135 0.253740 0.406584 0.994975 -0.321602
5.800000 -0.849239 0.168204 0.227036 0.421713 1.061424 -0.426181
5.833333 -0.835755 0.204746 0.179819 0.439096 1.125668 -0.510513
5.866667 -0.821070 0.244170 0.170442 0.458309 1.187369 -0.567137
5.900000 -0.805164 0.286459 0.146079 0.478644 1.245743 -0.597595
5.933333 -0.789094 0.329132 0.122526 0.499559 1.300840 -0.599192
5.966667 -0.771709 0.374462 0.105165 0.520492 1.352588 -0.575535
6.000000 -0.754193 0.420106 0.078624 0.540981 1.401323 -0.530073
6.033333 -0.735210 0.468787 0.070406 0.560506 1.446812 -0.472732
6.066667 -0.716130 0.517703 0.030447 0.578717 1.489232 -0.405172
6.100000 -0.695744 0.569458 0.025908 0.595459 1.529062 -0.332404
6.133333 -0.675299 0.621364 0.017767 0.610441 1.566199 -0.257945
6.166667 -0.653919 0.675659 -0.000514 0.623454 1.600547 -0.183822
6.200000 -0.632520 0.730015 -0.003069 0.634165 1.631862 -0.111656
6.233333 -0.611123 0.784383 0.006758 0.642441 1.660416 -0.032945
6.266667 -0.589010 0.840851 0.007108 0.648009 1.686103 0.050139
6.300000 -0.566511 0.898899 0.026624 0.650722 1.708710 0.140420
6.333333 -0.544078 0.956813 0.044436 0.650501 1.728204 0.237812
6.366667 -0.521512 1.015849 0.016799 0.647304 1.744536 0.344974
6.400000 -0.499055 1.074647 0.016070 0.641119 1.757406 0.460641
6.433333 -0.477005 1.134402 0.026605 0.631906 1.765929 0.579828
6.466667 -0.455108 1.193811 0.045609 0.619746 1.769579 0.699477
6.500000 -0.433937 1.253728 0.066204 0.604720 1.767920 0.815861
6.533333 -0.413854 1.313875 0.114337 0.586954 1.760116 0.923411
6.566667 -0.394770 1.374466 0.158420 0.566798 1.745140 1.009849
6.600000 -0.375920 1.434492 0.204349 0.544748 1.721871 1.068799
6.633333 -0.357322 1.493899 0.253694 0.521379 1.689898 1.090981
6.666667 -0.338997 1.552631 0.300862 0.497207 1.648639 1.069260
6.700000 -0.322463 1.609599 0.346027 0.472679 1.597141 0.997151
6.733333 -0.307679 1.664122 0.387136 0.448169 1.534942 0.871552
6.766667 -0.294348 1.715338 0.425763 0.423898 1.462546 0.696483
6.800000 -0.281351 1.765673 0.460010 0.399875 1.380762 0.474078
6.833333 -0.268703 1.815079 0.480472 0.375918 1.289689 0.211781
6.866667 -0.256750 1.859320 0.493341 0.351724 1.189399 -0.082518
6.900000 -0.245342 1.897836 0.496812 0.326758 1.080719 -0.399211
6.933333 -0.234565 1.930074 0.499208 0.300520 0.965181 -0.732176
6.966667 -0.224186 1.961232 0.459153 0.272169 0.843138 -1.076158
7.000000 -0.214216 1.991284 0.405571 0.240883 0.715134 -1.424143
7.033333 -0.205441 2.014434 0.342849 0.205932 0.582796 -1.769769
7.066667 -0.198343 2.030781 0.246824 0.166929 0.448300 -2.100446
7.100000 -0.191683 2.045961 0.179693 0.123868 0.313365 -2.408313
7.133333 -0.187024 2.054707 0.110622 0.076851 0.178943 -2.675332
7.166667 -0.184303 2.057345 0.013532 0.026614 0.047206 -2.884768
7.200000 -0.183789 2.054156 -0.095667 -0.025724 -0.079346 -3.022889
7.233333 -0.185797 2.045482 -0.192546 -0.078702 -0.198883 -3.079959
7.266667 -0.188263 2.035644 -0.355676 -0.131186 -0.310563 -3.053944
7.300000 -0.193641 2.021041 -0.503588 -0.181992 -0.413217 -2.942337
7.333333 -0.202128 2.002249 -0.636089 -0.229959 -0.505874 -2.750362
7.366667 -0.213760 1.979620 -0.768192 -0.274098 -0.588506 -2.491076
7.400000 -0.225827 1.955909 -0.856517 -0.313784 -0.661873 -2.182226
7.433333 -0.238318 1.931143 -0.922124 -0.348745 -0.726982 -1.840505
7.466667 -0.251219 1.905348 -0.968654 -0.378511 -0.784340 -1.488599
7.500000 -0.264521 1.878553 -0.974880 -0.402924 -0.835001 -1.150105
7.533333 -0.279150 1.849277 -0.973823 -0.422070 -0.879969 -0.848046
7.566667 -0.294522 1.817769 -0.975082 -0.436446 -0.920115 -0.597585
7.600000 -0.310254 1.785352 -0.976320 -0.446353 -0.955948 -0.405886
7.633333 -0.326333 1.752062 -0.990756 -0.451985 -0.987636 -0.274319
7.666667 -0.342743 1.717930 -0.975346 -0.453750 -1.015423 -0.199049
7.700000 -0.358814 1.682532 -0.974545 -0.451908 -1.039212 -0.166351
7.733333 -0.375189 1.646362 -0.976405 -0.446452 -1.058790 -0.163175
7.766667 -0.390760 1.609635 -0.981697 -0.437004 -1.073858 -0.177088
7.800000 -0.405361 1.572635 -0.984393 -0.423564 -1.084374 -0.197981
7.833333 -0.419046 1.535787 -1.008329 -0.406445 -1.090595 -0.221048
7.866667 -0.432985 1.498311 -1.010292 -0.385863 -1.092747 -0.238799
7.900000 -0.447166 1.460240 -1.018544 -0.362222 -1.091357 -0.252137
7.933333 -0.459987 1.422905 -1.043093 -0.336402 -1.087164 -0.258314
7.966667 -0.471199 1.386497 -1.048945 -0.309714 -1.081161 -0.257417
8.000000 -0.482626 1.349597 -1.061738 -0.283128 -1.074160 -0.247960
8.033333 -0.491896 1.313964 -1.065146 -0.257464 -1.066862 -0.229984
8.066667 -0.498863 1.279281 -1.064345 -0.233748 -1.060082 -0.205864
8.100000 -0.503105 1.245781 -1.067342 -0.213105 -1.054584 -0.177994
8.133333 -0.507548 1.211914 -1.081801 -0.195921 -1.050658 -0.154642
8.166667 -0.512194 1.177706 -1.091224 -0.181972 -1.048097 -0.139353
8.200000 -0.517044 1.143186 -1.103549 -0.171104 -1.046597 -0.136311
8.233333 -0.522098 1.108385 -1.113348 -0.162867 -1.045631 -0.144655
8.266667 -0.527359 1.073329 -1.096558 -0.156387 -1.044443 -0.159997
8.300000 -0.532825 1.038049 -1.091893 -0.150567 -1.041887 -0.175936
8.333333 -0.538499 1.002572 -1.087068 -0.145298 -1.037097 -0.183198
8.366667 -0.544381 0.966929 -1.070509 -0.141339 -1.029458 -0.175587
8.400000 -0.550471 0.931147 -1.090737 -0.139497 -1.018629 -0.150914
8.433333 -0.556771 0.895255 -1.121358 -0.140777 -1.004411 -0.112700
8.466667 -0.560129 0.860986 -1.155003 -0.146651 -0.986870 -0.068772
8.500000 -0.561915 0.828275 -1.188228 -0.158451 -0.966587 -0.028163
8.533333 -0.563586 0.797134 -1.203772 -0.176595 -0.944373 -0.004119
8.566667 -0.565482 0.765985 -1.177798 -0.200522 -0.921176 -0.007859
8.600000 -0.567607 0.734850 -1.140076 -0.229636 -0.897815 -0.048088
8.633333 -0.573131 0.705256 -1.112268 -0.263465 -0.874945 -0.127206
8.666667 -0.582922 0.677118 -1.075890 -0.301016 -0.852799 -0.240728
8.700000 -0.597897 0.650691 -1.043093 -0.340845 -0.831353 -0.383107
8.733333 -0.613098 0.624360 -1.061115 -0.382041 -0.810012 -0.534513
8.766667 -0.628516 0.598142 -1.082402 -0.424105 -0.788043 -0.675834
8.800000 -0.644142 0.572054 -1.147074 -0.466705 -0.764606 -0.782334
8.833333 -0.659969 0.546110 -1.214794 -0.509251 -0.739182 -0.836581
8.866667 -0.675986 0.520329 -1.306995 -0.551535 -0.711612 -0.825060
8.900000 -0.692184 0.494725 -1.359365 -0.594326 -0.681602 -0.738069
8.933333 -0.708556 0.469314 -1.418481 -0.637906 -0.649366 -0.581965
8.966667 -0.729823 0.447536 -1.436580 -0.682166 -0.615405 -0.368623
9.000000 -0.755366 0.429034 -1.429359 -0.726244 -0.580666 -0.120149
9.033333 -0.781037 0.410760 -1.422121 -0.769293 -0.545902 0.143226
9.066667 -0.809881 0.394953 -1.387081 -0.809745 -0.511972 0.397791
9.100000 -0.838809 0.379387 -1.351917 -0.845623 -0.479872 0.625797
9.133333 -0.869861 0.365384 -1.315663 -0.875039 -0.450522 0.812228
9.166667 -0.900949 0.351628 -1.275328 -0.896649 -0.424195 0.952132
9.200000 -0.933725 0.338840 -1.232657 -0.909719 -0.400609 1.047707
9.233333 -0.966486 0.326305 -1.185210 -0.913573 -0.379521 1.104238
9.266667 -0.999202 0.314022 -1.137826 -0.908583 -0.360369 1.126423
9.300000 -1.031848 0.301992 -1.107201 -0.895127 -0.342588 1.116201
9.333333 -1.063681 0.290556 -1.066536 -0.874000 -0.325420 1.082422
9.366667 -1.093951 0.279829 -1.040073 -0.846235 -0.308675 1.028995
9.400000 -1.121755 0.270044 -0.990653 -0.813416 -0.292430 0.953806
9.433333 -1.149388 0.260510 -0.943290 -0.777332 -0.276905 0.853712
9.466667 -1.176828 0.251223 -0.927297 -0.739230 -0.262568 0.732305
9.500000 -1.201026 0.243009 -0.905362 -0.700420 -0.250064 0.587611
9.533333 -1.222160 0.235663 -0.870387 -0.661954 -0.240215 0.406783
9.566667 -1.240747 0.228948 -0.829094 -0.624441 -0.233528 0.184243
9.600000 -1.259074 0.222464 -0.831466 -0.587725 -0.230395 -0.070935
9.633333 -1.277129 0.216206 -0.852976 -0.551581 -0.230944 -0.345949
9.666667 -1.294901 0.210169 -0.853152 -0.515842 -0.234969 -0.634951
9.700000 -1.312431 0.203060 -0.865306 -0.480215 -0.241792 -0.917542
9.733333 -1.329656 0.196161 -0.890057 -0.444249 -0.250416 -1.159578
9.766667 -1.345827 0.188088 -0.911979 -0.407431 -0.259679 -1.344263
9.800000 -1.360480 0.178767 -0.966760 -0.369546 -0.268361 -1.471054
9.833333 -1.372497 0.168316 -1.084983 -0.330412 -0.275203 -1.541877
9.866667 -1.381773 0.157185 -1.265599 -0.290163 -0.279159 -1.543649
9.900000 -1.389062 0.146100 -1.350055 -0.249138 -0.279568 -1.484800
9.933333 -1.396008 0.135217 -1.384209 -0.208004 -0.276087 -1.382308
9.966667 -1.402611 0.124536 -1.384511 -0.167632 -0.268850 -1.242602
10.000000 -1.407193 0.115105 -1.406280 -0.128834 -0.258321 -1.066282
10.033333 -1.411433 0.105875 -1.401842 -0.092221 -0.245270 -0.863704
10.066667 -1.413584 0.097998 -1.407211 -0.058201 -0.230702 -0.664074
10.100000 -1.413771 0.091474 -1.440444 -0.027118 -0.215678 -0.471558
10.133333 -1.413629 0.085143 -1.478117 0.000835 -0.201161 -0.289461
10.166667 -1.412046 0.079466 -1.507753 0.025448 -0.187941 -0.121536
10.200000 -1.409317 0.074144 -1.503786 0.046536 -0.176535 0.023218
10.233333 -1.406282 0.069002 -1.516053 0.063818 -0.167308 0.148213
10.266667 -1.402951 0.064033 -1.499581 0.077289 -0.160239 0.260436
10.300000 -1.399332 0.059234 -1.473915 0.087239 -0.155025 0.350376
10.333333 -1.395435 0.054599 -1.436885 0.093929 -0.151365 0.412660
10.366667 -1.391271 0.050123 -1.400744 0.097775 -0.148880 0.444733
10.400000 -1.387500 0.045174 -1.365834 0.099393 -0.147185 0.449653
10.433333 -1.384445 0.039943 -1.321282 0.099439 -0.145865 0.423546
10.466667 -1.381150 0.034855 -1.316732 0.098330 -0.144660 0.373584
10.500000 -1.377624 0.029908 -1.328159 0.096268 -0.143446 0.312857
10.533333 -1.374956 0.024988 -1.331689 0.093577 -0.142094 0.250554
10.566667 -1.372073 0.020199 -1.328201 0.090551 -0.140511 0.190556
10.600000 -1.368984 0.015537 -1.331894 0.087291 -0.138718 0.139207
10.633333 -1.365696 0.010998 -1.337003 0.083824 -0.136796 0.106500
10.666667 -1.362666 0.006566 -1.330598 0.080274 -0.134826 0.088661
10.700000 -1.359833 0.002208 -1.314696 0.076766 -0.132893 0.078647
10.733333 -1.357269 -0.002114 -1.316870 0.073305 -0.131090 0.073165
10.766667 -1.355054 -0.006403 -1.318993 0.069865 -0.129509 0.072089
