t x y theta dxdt dydt dthetadt
0.000000 0.000000 0.000000 -0.523579 0.012150 0.045784 -0.007223
0.033333 0.000395 0.001502 -0.523206 0.014120 0.050724 -0.008018
0.066667 0.000841 0.003188 -0.519123 0.016298 0.056140 -0.006704
0.100000 0.001381 0.005001 -0.527820 0.018681 0.062032 0.002000
0.133333 0.001994 0.007047 -0.530370 0.021275 0.068398 0.035001
0.166667 0.002706 0.009226 -0.522491 0.024096 0.075241 0.113084
0.200000 0.003518 0.011692 -0.531849 0.027152 0.082567 0.256278
0.233333 0.004429 0.014459 -0.519373 0.030452 0.090319 0.481229
0.266667 0.005443 0.017553 -0.524466 0.034034 0.098478 0.802094
0.300000 0.006572 0.021022 -0.520028 0.037940 0.107018 1.214720
0.333333 0.007816 0.024636 -0.526646 0.042188 0.115877 1.693301
0.366667 0.009223 0.028696 -0.522697 0.046773 0.124914 2.201193
0.400000 0.010749 0.032904 -0.521675 0.051744 0.134006 2.704946
0.433333 0.012398 0.037262 -0.434240 0.057152 0.143084 3.168222
0.466667 0.014279 0.042190 -0.234361 0.063034 0.151976 3.551620
0.500000 0.016445 0.047697 0.013619 0.069413 0.160514 3.823874
0.533333 0.018741 0.053356 0.246298 0.076388 0.168483 3.956857
0.566667 0.021168 0.059168 0.468018 0.084143 0.175668 3.927579
0.600000 0.024135 0.065486 0.633320 0.092785 0.181717 3.705503
0.633333 0.027238 0.071958 0.761485 0.102420 0.186267 3.274783
0.666667 0.030477 0.078584 0.854962 0.113089 0.189109 2.641299
0.700000 0.033855 0.085364 0.906150 0.124913 0.189982 1.822941
0.733333 0.038005 0.092264 0.988025 0.137836 0.188771 0.856760
0.766667 0.042296 0.099318 1.054297 0.151720 0.185419 -0.205958
0.800000 0.047441 0.106109 1.125241 0.166365 0.180159 -1.304198
0.833333 0.052728 0.113055 1.149327 0.181626 0.173148 -2.378414
0.866667 0.058930 0.119284 1.042247 0.197397 0.164482 -3.379180
0.900000 0.066052 0.124618 0.842480 0.213374 0.154528 -4.258865
0.933333 0.074068 0.128915 0.560994 0.229405 0.143640 -4.976030
0.966667 0.082218 0.133375 0.247442 0.245319 0.132266 -5.499005
1.000000 0.090501 0.138002 -0.016792 0.261125 0.120654 -5.806990
1.033333 0.099635 0.141502 -0.322424 0.276678 0.109324 -5.888872
1.066667 0.108894 0.145178 -0.575566 0.291860 0.098812 -5.755546
1.100000 0.118977 0.147849 -0.784073 0.306689 0.089469 -5.432501
1.133333 0.129177 0.150708 -0.955371 0.321164 0.081513 -4.959503
1.166667 0.140178 0.152825 -1.079012 0.335185 0.075243 -4.388467
1.200000 0.151941 0.154344 -1.179468 0.348427 0.071136 -3.764332
1.233333 0.163805 0.156072 -1.297392 0.360644 0.069429 -3.128886
1.266667 0.176297 0.157610 -1.411910 0.371517 0.070348 -2.503575
1.300000 0.189296 0.159162 -1.473466 0.380745 0.074025 -1.903104
1.333333 0.202744 0.160896 -1.525820 0.387872 0.080740 -1.329014
1.366667 0.216510 0.163024 -1.551832 0.392518 0.090538 -0.772235
1.400000 0.230452 0.165699 -1.564739 0.394533 0.103151 -0.225027
1.433333 0.244453 0.168635 -1.558606 0.393710 0.118329 0.319721
1.466667 0.258505 0.171842 -1.538164 0.389944 0.135772 0.867077
1.500000 0.272202 0.176089 -1.505990 0.383176 0.155183 1.424811
1.533333 0.285353 0.181490 -1.479728 0.373679 0.176006 2.003257
1.566667 0.297800 0.188150 -1.392139 0.361844 0.197664 2.608932
1.600000 0.310270 0.195107 -1.290157 0.347844 0.219809 3.249252
1.633333 0.322759 0.202364 -1.180743 0.331956 0.242103 3.922011
1.666667 0.333960 0.210941 -1.035069 0.314403 0.264220 4.613350
1.700000 0.343708 0.220753 -0.892627 0.295430 0.285897 5.304185
1.733333 0.353464 0.230876 -0.771070 0.275049 0.307110 5.959993
1.766667 0.361515 0.242038 -0.548216 0.253430 0.327910 6.542171
1.800000 0.369572 0.253514 -0.274186 0.231003 0.348235 7.006139
1.833333 0.377635 0.265305 -0.021478 0.208305 0.367982 7.321642
1.866667 0.385705 0.277411 0.333110 0.185844 0.387163 7.462219
1.900000 0.392103 0.290352 0.679996 0.164014 0.405905 7.410246
1.933333 0.396911 0.304157 1.013183 0.143363 0.424268 7.155144
1.966667 0.400230 0.318894 1.324053 0.124179 0.442390 6.705886
2.000000 0.402139 0.334651 1.594086 0.106736 0.460395 6.089349
2.033333 0.404077 0.350717 1.777640 0.091176 0.478491 5.328756
2.066667 0.406050 0.367089 1.943520 0.077729 0.496742 4.467488
2.100000 0.408069 0.383765 2.053300 0.066547 0.515100 3.552958
2.133333 0.410140 0.400741 2.120301 0.057570 0.533511 2.639322
2.166667 0.412273 0.418013 2.196139 0.050664 0.551871 1.769173
2.200000 0.413832 0.436380 2.228343 0.045504 0.570128 0.973179
2.233333 0.414981 0.455784 2.225398 0.041813 0.588091 0.279154
2.266667 0.415872 0.476114 2.191992 0.039288 0.605523 -0.299025
2.300000 0.416649 0.497255 2.125077 0.037742 0.622160 -0.757816
2.333333 0.417536 0.518663 2.072368 0.037095 0.637727 -1.104342
2.366667 0.418468 0.540679 1.979398 0.037365 0.651876 -1.342168
2.400000 0.419482 0.563190 1.896740 0.038578 0.664286 -1.480612
2.433333 0.420637 0.585946 1.834699 0.040681 0.674818 -1.533642
2.466667 0.421939 0.609067 1.774050 0.043553 0.683436 -1.516065
2.500000 0.423405 0.632416 1.718520 0.047038 0.690199 -1.448552
2.533333 0.425010 0.655923 1.680276 0.050979 0.695182 -1.345698
2.566667 0.426750 0.679483 1.634927 0.055218 0.698535 -1.232626
2.600000 0.428603 0.702970 1.593348 0.059673 0.700486 -1.126513
2.633333 0.430665 0.726649 1.575129 0.064288 0.701123 -1.033956
2.666667 0.432947 0.750510 1.548236 0.069066 0.700598 -0.960214
2.700000 0.435318 0.774118 1.527538 0.074040 0.699054 -0.900421
2.733333 0.437764 0.797396 1.514899 0.079251 0.696665 -0.849445
2.766667 0.440464 0.820831 1.476979 0.084798 0.693626 -0.792281
2.800000 0.443201 0.843725 1.470822 0.090826 0.690055 -0.721489
2.833333 0.446214 0.866759 1.436450 0.097556 0.686176 -0.631758
2.866667 0.449514 0.889928 1.402361 0.105192 0.682142 -0.523553
2.900000 0.452890 0.912407 1.331434 0.113930 0.678104 -0.399910
2.933333 0.456577 0.935005 1.294236 0.124019 0.674105 -0.275186
2.966667 0.460471 0.956958 1.287479 0.135707 0.670223 -0.175312
3.000000 0.464699 0.979018 1.314656 0.149114 0.666494 -0.118466
3.033333 0.469271 1.001177 1.345951 0.164226 0.662938 -0.130549
3.066667 0.474199 1.023430 1.377404 0.181114 0.659565 -0.228581
3.100000 0.479934 1.045431 1.396111 0.199867 0.656310 -0.426627
3.133333 0.486631 1.067218 1.417965 0.220380 0.653235 -0.714533
3.166667 0.494429 1.088788 1.446146 0.242348 0.650329 -1.064892
3.200000 0.502623 1.110428 1.460118 0.265608 0.647639 -1.451107
3.233333 0.511220 1.132133 1.435584 0.290137 0.645223 -1.835864
3.266667 0.521152 1.153539 1.310121 0.315746 0.643235 -2.181042
3.300000 0.532464 1.174645 1.131041 0.342179 0.641922 -2.449650
3.333333 0.544201 1.195800 0.991718 0.369349 0.641456 -2.624472
3.366667 0.556368 1.216998 0.825846 0.397466 0.642065 -2.698265
3.400000 0.569975 1.238117 0.695108 0.426495 0.643931 -2.670189
3.433333 0.585006 1.259247 0.585842 0.456246 0.647264 -2.549687
3.466667 0.600480 1.280405 0.508896 0.486600 0.652108 -2.360844
3.500000 0.616397 1.301587 0.464707 0.517477 0.658368 -2.138208
3.533333 0.633709 1.323099 0.436833 0.548738 0.666051 -1.906674
3.566667 0.652419 1.345037 0.403170 0.579994 0.675111 -1.693500
3.600000 0.672567 1.367532 0.362716 0.611019 0.685459 -1.517687
3.633333 0.694151 1.390670 0.325193 0.641580 0.696798 -1.388484
3.666667 0.716178 1.413798 0.283131 0.671451 0.708903 -1.302610
3.700000 0.739671 1.437798 0.231760 0.700350 0.721661 -1.242694
3.733333 0.763598 1.461773 0.193900 0.728036 0.734892 -1.196104
3.766667 0.788969 1.486831 0.150229 0.754309 0.748253 -1.144681
3.800000 0.814764 1.511846 0.116468 0.779052 0.761502 -1.074438
3.833333 0.840975 1.536807 0.068807 0.802314 0.774600 -0.978474
3.866667 0.868420 1.562985 0.035495 0.824081 0.787400 -0.855273
3.900000 0.896993 1.590357 -0.023885 0.844393 0.799593 -0.706671
3.933333 0.925961 1.617639 -0.064741 0.863243 0.810759 -0.538871
3.966667 0.955314 1.644819 -0.072939 0.880750 0.820785 -0.370903
4.000000 0.985043 1.671883 -0.074268 0.896926 0.829547 -0.223029
4.033333 1.015478 1.700047 -0.065691 0.911675 0.836767 -0.118895
4.066667 1.046493 1.729219 -0.060103 0.925007 0.842310 -0.078350
4.100000 1.077856 1.758230 -0.051788 0.936984 0.846298 -0.118115
4.133333 1.109556 1.787065 -0.011400 0.947671 0.848960 -0.242190
4.166667 1.141581 1.815707 0.016796 0.957099 0.850355 -0.433540
4.200000 1.173921 1.844141 0.039982 0.965335 0.850478 -0.670572
4.233333 1.206566 1.872351 0.081914 0.972494 0.849533 -0.916810
4.266667 1.239504 1.900320 0.058986 0.978676 0.847757 -1.130776
4.300000 1.272390 1.928613 -0.047915 0.983982 0.845191 -1.278027
4.333333 1.305264 1.957048 -0.143676 0.988561 0.841820 -1.335735
4.366667 1.338399 1.985192 -0.296465 0.992555 0.837649 -1.287039
4.400000 1.371640 2.013329 -0.456797 0.996129 0.832644 -1.124868
4.433333 1.404922 2.041300 -0.506464 0.999464 0.826655 -0.860735
4.466667 1.438266 2.069081 -0.521655 1.002760 0.819417 -0.522093
4.500000 1.471741 2.096679 -0.538442 1.006197 0.810731 -0.144184
4.533333 1.505272 2.123996 -0.519141 1.009944 0.800417 0.241347
4.566667 1.538874 2.150931 -0.438107 1.014174 0.788311 0.587079
4.600000 1.572580 2.177394 -0.351618 1.019046 0.774289 0.853618
4.633333 1.606424 2.203290 -0.262488 1.024676 0.758272 1.016838
4.666667 1.640435 2.228741 -0.213401 1.031092 0.740290 1.070256
4.700000 1.674601 2.253731 -0.155114 1.038304 0.720319 1.020288
4.733333 1.709101 2.277870 -0.143923 1.046221 0.698467 0.883396
4.766667 1.743735 2.301516 -0.092200 1.054733 0.674844 0.690986
4.800000 1.778810 2.324121 -0.052063 1.063656 0.649569 0.476390
4.833333 1.814430 2.345594 -0.041704 1.072818 0.622635 0.267687
4.866667 1.850629 2.365833 -0.056868 1.082070 0.593897 0.081905
4.900000 1.886918 2.385522 -0.077763 1.091223 0.563403 -0.071078
4.933333 1.923847 2.403646 -0.117061 1.100124 0.531153 -0.193758
4.966667 1.960840 2.421195 -0.153759 1.108635 0.497031 -0.289052
5.000000 1.997886 2.438160 -0.181245 1.116660 0.460924 -0.366347
5.033333 2.035486 2.453020 -0.187693 1.124063 0.422940 -0.439199
5.066667 2.073112 2.467275 -0.192742 1.130733 0.383346 -0.517680
5.100000 2.110751 2.480918 -0.179079 1.136583 0.342217 -0.605914
5.133333 2.148831 2.492251 -0.162055 1.141567 0.299631 -0.705489
5.166667 2.187300 2.501272 -0.167789 1.145595 0.256052 -0.819947
5.200000 2.226076 2.508001 -0.187105 1.148548 0.212206 -0.945435
5.233333 2.264808 2.514096 -0.246059 1.150396 0.168680 -1.069113
5.266667 2.303483 2.519558 -0.313349 1.151100 0.125980 -1.179504
5.300000 2.342159 2.522939 -0.359232 1.150560 0.084893 -1.267331
5.333333 2.380819 2.524352 -0.419781 1.148590 0.046148 -1.321158
5.366667 2.419349 2.523934 -0.495295 1.145079 0.010167 -1.329273
5.400000 2.457763 2.522888 -0.552902 1.139850 -0.022974 -1.283685
5.433333 2.495804 2.520350 -0.600139 1.132702 -0.053107 -1.182371
5.466667 2.533703 2.517194 -0.641905 1.123436 -0.080065 -1.025927
5.500000 2.571446 2.513428 -0.670445 1.111886 -0.104001 -0.815294
5.533333 2.609019 2.509058 -0.686550 1.098084 -0.125208 -0.553154
5.566667 2.646410 2.504089 -0.713456 1.081873 -0.144031 -0.251682
5.600000 2.683604 2.498530 -0.743989 1.063186 -0.160760 0.068415
5.633333 2.719454 2.492590 -0.762281 1.042010 -0.175848 0.382174
5.666667 2.753759 2.486418 -0.775203 1.018304 -0.189786 0.664509
5.700000 2.787834 2.479677 -0.746580 0.992092 -0.203005 0.886653
5.733333 2.820099 2.472879 -0.668830 0.963284 -0.215842 1.009899
5.766667 2.852118 2.465525 -0.558612 0.931973 -0.228575 1.004530
5.800000 2.883882 2.457623 -0.481469 0.898421 -0.241442 0.858889
5.833333 2.913574 2.449572 -0.405214 0.862876 -0.254611 0.569865
5.866667 2.942999 2.440987 -0.299457 0.825566 -0.268196 0.147986
5.900000 2.970334 2.432027 -0.241391 0.787000 -0.282275 -0.381197
5.933333 2.995611 2.422587 -0.252900 0.747841 -0.296827 -0.962266
5.966667 3.020614 2.412635 -0.287883 0.708816 -0.311827 -1.537025
6.000000 3.043636 2.402096 -0.400783 0.670647 -0.327240 -2.052565
6.033333 3.064729 2.390958 -0.535361 0.633982 -0.342997 -2.456587
6.066667 3.083961 2.379240 -0.725997 0.599731 -0.359013 -2.705723
6.100000 3.101444 2.366917 -0.906585 0.568488 -0.375177 -2.774752
6.133333 3.118672 2.354125 -1.066613 0.540553 -0.391425 -2.670200
6.166667 3.135654 2.340872 -1.218550 0.516160 -0.407647 -2.405547
6.200000 3.151404 2.326920 -1.305305 0.495345 -0.423716 -2.014518
6.233333 3.166926 2.312525 -1.371829 0.478023 -0.439500 -1.536815
6.266667 3.182230 2.297699 -1.376964 0.463756 -0.454900 -1.016770
6.300000 3.196955 2.282099 -1.380167 0.452028 -0.469813 -0.487187
6.333333 3.211481 2.266087 -1.351536 0.442448 -0.484130 0.024504
6.366667 3.225769 2.249396 -1.298222 0.434588 -0.497760 0.485108
6.400000 3.239878 2.232316 -1.253472 0.427984 -0.510660 0.883771
6.433333 3.253821 2.214857 -1.217408 0.422308 -0.522850 1.208683
6.466667 3.267740 2.196972 -1.174588 0.417372 -0.534368 1.448717
6.500000 3.281514 2.178731 -1.133941 0.413066 -0.545317 1.584804
6.533333 3.295246 2.160223 -1.105160 0.409281 -0.555812 1.611706
6.566667 3.308839 2.141534 -1.044120 0.405913 -0.566007 1.541824
6.600000 3.322319 2.122524 -0.917966 0.402946 -0.576025 1.377542
6.633333 3.335588 2.103320 -0.756917 0.400359 -0.585942 1.128898
6.666667 3.348765 2.083818 -0.658120 0.398125 -0.595785 0.819215
6.700000 3.361803 2.063894 -0.649774 0.396241 -0.605533 0.486344
6.733333 3.374772 2.043697 -0.645711 0.394719 -0.615152 0.161616
6.766667 3.387760 2.022947 -0.684155 0.393563 -0.624546 -0.127327
6.800000 3.400876 2.001622 -0.747639 0.392936 -0.633601 -0.344461
6.833333 3.413955 1.980061 -0.823985 0.393170 -0.642208 -0.457184
6.866667 3.427009 1.958277 -0.920582 0.394791 -0.650276 -0.448134
6.900000 3.440047 1.936283 -0.993235 0.398510 -0.657726 -0.323161
6.933333 3.453079 1.914093 -1.035390 0.405028 -0.664484 -0.091357
6.966667 3.466118 1.891718 -1.030467 0.415055 -0.670539 0.224195
7.000000 3.479172 1.869174 -0.995680 0.429172 -0.675897 0.590901
7.033333 3.492252 1.846471 -0.931378 0.447597 -0.680570 0.970907
7.066667 3.505368 1.823624 -0.872251 0.470341 -0.684562 1.328057
7.100000 3.518529 1.800646 -0.801408 0.497198 -0.687872 1.640461
7.133333 3.533841 1.777450 -0.728545 0.527782 -0.690494 1.889757
7.166667 3.551412 1.754139 -0.651403 0.561515 -0.692393 2.070008
7.200000 3.571336 1.730804 -0.561372 0.597397 -0.693568 2.179473
7.233333 3.593678 1.707531 -0.475334 0.634537 -0.694028 2.224140
7.266667 3.616087 1.684191 -0.391062 0.671979 -0.693813 2.212437
7.300000 3.638564 1.660799 -0.310888 0.708615 -0.692986 2.153550
7.333333 3.663419 1.637635 -0.226232 0.743495 -0.691647 2.055985
7.366667 3.688335 1.614443 -0.153055 0.776088 -0.689894 1.926456
7.400000 3.715445 1.591496 -0.090538 0.806262 -0.687812 1.774595
7.433333 3.744696 1.568740 -0.020961 0.833864 -0.685488 1.606020
7.466667 3.773989 1.545994 0.029358 0.858726 -0.682984 1.428426
7.500000 3.803315 1.523268 0.076476 0.880860 -0.680342 1.242911
7.533333 3.832664 1.500575 0.108991 0.900486 -0.677522 1.051676
7.566667 3.863473 1.477988 0.131147 0.917410 -0.674464 0.855708
7.600000 3.895541 1.455507 0.136722 0.931503 -0.671074 0.652577
7.633333 3.927599 1.433093 0.165904 0.942909 -0.667232 0.443692
7.666667 3.959633 1.410757 0.181098 0.951851 -0.662777 0.232663
7.700000 3.992254 1.388592 0.199565 0.958508 -0.657485 0.027398
7.733333 4.024826 1.366527 0.212757 0.962877 -0.651215 -0.166262
7.766667 4.057332 1.344574 0.213103 0.965271 -0.643810 -0.344335
7.800000 4.089951 1.322930 0.194990 0.966017 -0.635146 -0.500968
7.833333 4.122476 1.301417 0.154558 0.965273 -0.625114 -0.630729
7.866667 4.154846 1.280400 0.097101 0.963218 -0.613756 -0.728232
7.900000 4.186987 1.260014 0.051717 0.960091 -0.601222 -0.791299
7.933333 4.218990 1.239789 -0.013007 0.956130 -0.587634 -0.813525
7.966667 4.250843 1.219735 -0.041498 0.951385 -0.573179 -0.792756
8.000000 4.282531 1.200658 -0.041153 0.945833 -0.558082 -0.731420
8.033333 4.314124 1.182634 -0.051893 0.939373 -0.542600 -0.637021
8.066667 4.345524 1.164804 -0.079083 0.931803 -0.526830 -0.527466
8.100000 4.376726 1.148087 -0.111350 0.922840 -0.510892 -0.413490
8.133333 4.407706 1.131575 -0.150473 0.912088 -0.494885 -0.310010
8.166667 4.438449 1.115274 -0.171846 0.899145 -0.478925 -0.222740
8.200000 4.468940 1.099188 -0.125934 0.883469 -0.463000 -0.156424
8.233333 4.498707 1.084063 -0.116044 0.864718 -0.447102 -0.107837
8.266667 4.528194 1.069162 -0.094712 0.842739 -0.431321 -0.062685
8.300000 4.556709 1.055146 -0.095042 0.817610 -0.415687 -0.004624
8.333333 4.584919 1.041361 -0.095530 0.789491 -0.400283 0.084509
8.366667 4.611909 1.028325 -0.100551 0.758805 -0.385210 0.223340
8.400000 4.637514 1.015947 -0.121035 0.726329 -0.370694 0.443074
8.433333 4.661570 1.004152 -0.142353 0.692781 -0.356890 0.773334
8.466667 4.683942 0.992869 -0.147997 0.658906 -0.343943 1.234067
8.500000 4.704507 0.982021 -0.148999 0.625260 -0.331980 1.828888
8.533333 4.723147 0.971526 -0.140677 0.592711 -0.321096 2.545762
8.566667 4.741424 0.961269 -0.099713 0.561853 -0.311284 3.350338
8.600000 4.759335 0.951248 0.003213 0.532904 -0.302485 4.179380
8.633333 4.776879 0.941464 0.165606 0.505856 -0.294666 4.937161
8.666667 4.792307 0.931826 0.364000 0.480621 -0.287742 5.524624
8.700000 4.807364 0.922423 0.595066 0.457107 -0.281589 5.849812
8.733333 4.822049 0.913254 0.874685 0.434817 -0.276072 5.842301
8.766667 4.836362 0.904318 1.265286 0.413325 -0.271098 5.454219
8.800000 4.850303 0.895613 1.655474 0.392356 -0.266574 4.673882
8.833333 4.862758 0.886795 2.012366 0.371956 -0.262358 3.536041
8.866667 4.874843 0.878207 2.240535 0.351925 -0.258361 2.109142
8.900000 4.886559 0.869847 2.321091 0.332040 -0.254553 0.486011
8.933333 4.897119 0.861376 2.303002 0.312227 -0.250898 -1.231311
8.966667 4.906558 0.852825 2.109412 0.292448 -0.247346 -2.916401
9.000000 4.915637 0.844498 1.829201 0.272722 -0.243837 -4.453920
9.033333 4.924360 0.836396 1.509858 0.252818 -0.240393 -5.734689
9.066667 4.932731 0.828517 1.185184 0.232805 -0.236996 -6.681779
9.100000 4.940755 0.820860 0.844425 0.212902 -0.233591 -7.254779
9.133333 4.947618 0.813152 0.552262 0.193406 -0.230128 -7.442920
9.166667 4.954144 0.805665 0.202303 0.174547 -0.226584 -7.277428
9.200000 4.959585 0.798182 -0.101225 0.156641 -0.222910 -6.808338
9.233333 4.964039 0.790748 -0.365479 0.140222 -0.218996 -6.108530
9.266667 4.967658 0.783375 -0.587513 0.125820 -0.214715 -5.255521
9.300000 4.970611 0.776101 -0.766310 0.113851 -0.209955 -4.314969
9.333333 4.973117 0.768937 -0.906175 0.104574 -0.204624 -3.341699
9.366667 4.975332 0.761987 -0.973070 0.098322 -0.198595 -2.389357
9.400000 4.977562 0.755244 -0.959381 0.095154 -0.191802 -1.504061
9.433333 4.980041 0.748770 -0.954442 0.094852 -0.184237 -0.716556
9.466667 4.982899 0.742597 -0.920947 0.096948 -0.175948 -0.040719
9.500000 4.985498 0.736636 -0.884691 0.100956 -0.167003 0.516096
9.533333 4.988671 0.731082 -0.825601 0.106296 -0.157503 0.948270
9.566667 4.992437 0.725949 -0.752635 0.112228 -0.147604 1.263795
9.600000 4.996786 0.721253 -0.696487 0.118049 -0.137481 1.481805
9.633333 5.000901 0.716762 -0.626948 0.123215 -0.127294 1.616263
9.666667 5.005440 0.712689 -0.569465 0.127325 -0.117205 1.676954
9.700000 5.010283 0.709032 -0.522470 0.129966 -0.107382 1.670016
9.733333 5.015263 0.705762 -0.477310 0.130918 -0.097962 1.607808
9.766667 5.020260 0.702858 -0.419310 0.130116 -0.089048 1.505919
9.800000 5.025101 0.700299 -0.334352 0.127670 -0.080707 1.371524
9.833333 5.029732 0.697925 -0.235369 0.123692 -0.072995 1.211206
9.866667 5.034017 0.695801 -0.174647 0.118391 -0.065930 1.033704
9.900000 5.038097 0.693856 -0.164242 0.112064 -0.059493 0.851881
9.933333 5.041769 0.692087 -0.178146 0.105025 -0.053643 0.674496
9.966667 5.045071 0.690491 -0.172160 0.097584 -0.048330 0.504950
10.000000 5.048052 0.689047 -0.172502 0.089994 -0.043481 0.351907
10.033333 5.050842 0.687765 -0.174736 0.082496 -0.039023 0.226393
10.066667 5.053347 0.686606 -0.175354 0.075253 -0.034897 0.134178
10.100000 5.055598 0.685550 -0.169298 0.068395 -0.031065 0.071469
10.133333 5.057625 0.684575 -0.169808 0.061981 -0.027486 0.032382
10.166667 5.059477 0.683744 -0.172001 0.056019 -0.024135 0.013425
10.200000 5.061159 0.683054 -0.173530 0.050490 -0.021013 0.007020
10.233333 5.062675 0.682500 -0.169944 0.045382 -0.018133 0.005602
10.266667 5.064040 0.681999 -0.171930 0.040668 -0.015494 0.003475
10.300000 5.065264 0.681536 -0.166456 0.036305 -0.013090 0.001438
