t x y theta dxdt dydt dthetadt
0.000000 0.000000 0.000000 -1.864813 -0.134870 0.069276 -0.011695
0.033333 -0.004552 0.002337 -1.859541 -0.139174 0.071406 -0.010168
0.066667 -0.009249 0.004746 -1.868421 -0.143539 0.073568 -0.008130
0.100000 -0.014093 0.007227 -1.867750 -0.147965 0.075760 -0.005727
0.133333 -0.019086 0.009782 -1.875236 -0.152448 0.077981 -0.003253
0.166667 -0.024231 0.012413 -1.873696 -0.156985 0.080230 -0.000657
0.200000 -0.029527 0.015118 -1.860821 -0.161576 0.082505 0.000885
0.233333 -0.034979 0.017901 -1.866820 -0.166217 0.084807 0.004340
0.266667 -0.040589 0.020763 -1.866536 -0.170908 0.087134 0.006251
0.300000 -0.046355 0.023701 -1.870013 -0.175646 0.089485 0.008796
0.333333 -0.052278 0.026718 -1.864325 -0.180429 0.091859 0.010405
0.366667 -0.058359 0.029813 -1.875524 -0.185257 0.094256 0.012401
0.400000 -0.064608 0.032991 -1.855016 -0.190127 0.096675 0.013083
0.433333 -0.071018 0.036249 -1.870702 -0.195035 0.099113 0.011740
0.466667 -0.077590 0.039588 -1.866763 -0.199982 0.101572 0.010943
0.500000 -0.084327 0.043008 -1.869221 -0.204969 0.104051 0.009579
0.533333 -0.091239 0.046517 -1.861185 -0.209996 0.106551 0.008535
0.566667 -0.098318 0.050108 -1.858005 -0.215064 0.109073 0.005573
0.600000 -0.105565 0.053782 -1.860839 -0.220176 0.111617 0.005106
0.633333 -0.112981 0.057540 -1.867142 -0.225336 0.114187 0.003997
0.666667 -0.120566 0.061383 -1.861879 -0.230547 0.116783 0.002146
0.700000 -0.128323 0.065312 -1.863121 -0.235808 0.119406 -0.000368
0.733333 -0.136252 0.069326 -1.872017 -0.241123 0.122057 -0.001275
0.766667 -0.144355 0.073426 -1.861383 -0.246491 0.124736 -0.000393
0.800000 -0.152652 0.077624 -1.862220 -0.251914 0.127443 -0.001671
0.833333 -0.161124 0.081909 -1.867339 -0.257385 0.130176 -0.001760
0.866667 -0.169795 0.086294 -1.860915 -0.262899 0.132932 -0.000946
0.900000 -0.178643 0.090767 -1.860703 -0.268454 0.135710 0.000629
0.933333 -0.187669 0.095329 -1.864533 -0.274048 0.138508 -0.013365
0.966667 -0.196901 0.099995 -1.865013 -0.279677 0.141325 -0.057792
1.000000 -0.206312 0.104750 -1.867405 -0.285344 0.144162 -0.148421
1.033333 -0.215904 0.109595 -1.870173 -0.291052 0.147021 -0.306567
1.066667 -0.225707 0.114546 -1.854641 -0.296809 0.149906 -0.550335
1.100000 -0.235693 0.119589 -1.857727 -0.302621 0.152819 -0.889572
1.133333 -0.245860 0.124723 -1.878509 -0.308494 0.155762 -1.304197
1.166667 -0.256211 0.129948 -1.858141 -0.314435 0.158738 -1.772090
1.200000 -0.266745 0.135265 -1.865670 -0.320453 0.161751 -2.262014
1.233333 -0.277501 0.140694 -1.867562 -0.326558 0.164805 -2.740573
1.266667 -0.288480 0.146236 -2.016878 -0.332754 0.167902 -3.161056
1.300000 -0.299684 0.151891 -2.220189 -0.339033 0.171038 -3.489633
1.333333 -0.311074 0.157639 -2.450717 -0.345390 0.174213 -3.709703
1.366667 -0.322649 0.163480 -2.664111 -0.351816 0.177424 -3.801586
1.400000 -0.334453 0.169434 -2.886099 -0.358289 0.180662 -3.759362
1.433333 -0.346488 0.175501 -3.010007 -0.364787 0.183917 -3.583146
1.466667 -0.358756 0.181680 -3.105246 -0.371292 0.187181 -3.303294
1.500000 -0.371256 0.187972 3.071826 -0.377790 0.190449 -2.950713
1.533333 -0.383987 0.194385 3.002813 -0.384262 0.193712 -2.560428
1.566667 -0.396950 0.200920 2.954919 -0.390684 0.196957 -2.170124
1.600000 -0.410097 0.207548 2.905064 -0.397043 0.200176 -1.811106
1.633333 -0.423428 0.214268 2.868171 -0.403329 0.203362 -1.504247
1.666667 -0.436989 0.221107 2.833411 -0.409532 0.206511 -1.251070
1.700000 -0.450777 0.228063 2.806064 -0.415651 0.209615 -1.049283
1.733333 -0.464747 0.235110 2.760281 -0.421691 0.212677 -0.886065
1.766667 -0.478942 0.242271 2.753614 -0.427662 0.215700 -0.753188
1.800000 -0.493318 0.249523 2.730546 -0.433570 0.218686 -0.640517
1.833333 -0.507874 0.256866 2.707202 -0.439419 0.221637 -0.541470
1.866667 -0.522609 0.264300 2.683883 -0.445216 0.224556 -0.451793
1.900000 -0.537562 0.271842 2.682346 -0.450961 0.227446 -0.369515
1.933333 -0.552692 0.279474 2.670720 -0.456655 0.230308 -0.297882
1.966667 -0.567998 0.287195 2.663835 -0.462304 0.233145 -0.233918
2.000000 -0.583516 0.295020 2.655691 -0.467912 0.235961 -0.177026
2.033333 -0.599241 0.302947 2.654949 -0.473481 0.238755 -0.128763
2.066667 -0.615139 0.310963 2.658655 -0.479007 0.241528 -0.093342
2.100000 -0.631210 0.319065 2.657390 -0.484488 0.244280 -0.066945
2.133333 -0.647450 0.327255 2.656186 -0.489924 0.247009 -0.047936
2.166667 -0.663860 0.335530 2.654608 -0.495306 0.249713 -0.035491
2.200000 -0.680465 0.343902 2.663393 -0.500633 0.252391 -0.031015
2.233333 -0.697265 0.352369 2.655954 -0.505905 0.255044 -0.030681
2.266667 -0.714230 0.360921 2.658662 -0.511128 0.257673 -0.031223
2.300000 -0.731383 0.369565 2.651940 -0.516300 0.260280 -0.032968
2.333333 -0.748699 0.378293 2.656443 -0.521419 0.262862 -0.034805
2.366667 -0.766174 0.387103 2.650558 -0.526486 0.265420 -0.036825
2.400000 -0.783808 0.395994 2.641283 -0.531500 0.267955 -0.034629
2.433333 -0.801618 0.404972 2.647427 -0.536458 0.270464 -0.032215
2.466667 -0.819584 0.414031 2.645048 -0.541356 0.272946 -0.025730
2.500000 -0.837721 0.423175 2.648275 -0.546195 0.275401 -0.016136
2.533333 -0.856026 0.432404 2.643622 -0.550974 0.277830 -0.003668
2.566667 -0.874498 0.441716 2.650065 -0.555686 0.280229 0.009041
2.600000 -0.893118 0.451105 2.633893 -0.560325 0.282596 0.020892
2.633333 -0.911882 0.460569 2.643970 -0.564885 0.284929 0.032620
2.666667 -0.930804 0.470113 2.645125 -0.569362 0.287227 0.040304
2.700000 -0.949881 0.479736 2.647596 -0.573749 0.289486 0.041214
2.733333 -0.969110 0.489435 2.651574 -0.578044 0.291706 0.037298
2.766667 -0.988475 0.499206 2.642657 -0.582249 0.293887 0.032427
2.800000 -1.007975 0.509047 2.661733 -0.586366 0.296031 0.021307
2.833333 -1.027607 0.518959 2.679607 -0.590395 0.298136 0.006819
2.866667 -1.047370 0.528939 2.666614 -0.594339 0.300205 -0.011000
2.900000 -1.067260 0.538987 2.653366 -0.598201 0.302238 -0.026798
2.933333 -1.087276 0.549101 2.663944 -0.601986 0.304236 -0.043690
2.966667 -1.107424 0.559284 2.638843 -0.605694 0.306200 -0.060676
3.000000 -1.127693 0.569531 2.654748 -0.609328 0.308129 -0.073545
3.033333 -1.148081 0.579841 2.636927 -0.612889 0.310024 -0.080288
3.066667 -1.168584 0.590214 2.650971 -0.616377 0.311886 -0.083155
3.100000 -1.189207 0.600650 2.640762 -0.619792 0.313712 -0.083653
3.133333 -1.209940 0.611145 2.636562 -0.623131 0.315503 -0.079417
3.166667 -1.230782 0.621700 2.633701 -0.626392 0.317258 -0.075129
3.200000 -1.251735 0.632313 2.629198 -0.629574 0.318975 -0.069569
3.233333 -1.272791 0.642983 2.624955 -0.632675 0.320656 -0.066518
3.266667 -1.293951 0.653708 2.626608 -0.635693 0.322299 -0.062269
3.300000 -1.315211 0.664487 2.630630 -0.638629 0.323904 -0.059811
3.333333 -1.336567 0.675319 2.623757 -0.641480 0.325471 -0.058901
3.366667 -1.358017 0.686202 2.623757 -0.644246 0.327000 -0.057039
3.400000 -1.379557 0.697137 2.613030 -0.646925 0.328490 -0.054738
3.433333 -1.401185 0.708119 2.623030 -0.649517 0.329942 -0.054516
3.466667 -1.422898 0.719151 2.619306 -0.652023 0.331356 -0.055089
3.500000 -1.444693 0.730227 2.619798 -0.654442 0.332732 -0.054288
3.533333 -1.466568 0.741350 2.607646 -0.656775 0.334071 -0.052400
3.566667 -1.488519 0.752518 2.614421 -0.659022 0.335374 -0.050327
3.600000 -1.510543 0.763727 2.602506 -0.661182 0.336639 -0.047796
3.633333 -1.532637 0.774976 2.602092 -0.663257 0.337868 -0.038910
3.666667 -1.554797 0.786265 2.608000 -0.665245 0.339060 -0.028631
3.700000 -1.577024 0.797594 2.615586 -0.667145 0.340214 -0.017474
3.733333 -1.599312 0.808962 2.606194 -0.668956 0.341330 -0.007317
3.766667 -1.621661 0.820367 2.590183 -0.670678 0.342407 0.004272
3.800000 -1.644068 0.831809 2.599499 -0.672308 0.343443 0.014158
3.833333 -1.666528 0.843286 2.596948 -0.673846 0.344438 0.019803
3.866667 -1.689036 0.854793 2.606428 -0.675290 0.345390 0.024419
3.900000 -1.711590 0.866330 2.614197 -0.676639 0.346299 0.027696
3.933333 -1.734188 0.877899 2.615885 -0.677895 0.347165 0.031097
3.966667 -1.756830 0.889497 2.623199 -0.679058 0.347989 0.028903
4.000000 -1.779507 0.901121 2.609188 -0.680129 0.348772 0.024881
4.033333 -1.802215 0.912768 2.608974 -0.681111 0.349514 0.017252
4.066667 -1.824952 0.924438 2.607507 -0.682006 0.350219 0.009340
4.100000 -1.847720 0.936133 2.615100 -0.682816 0.350887 0.001993
4.133333 -1.870511 0.947847 2.612642 -0.683542 0.351520 -0.006247
4.166667 -1.893322 0.959579 2.621131 -0.684185 0.352118 -0.010875
4.200000 -1.916155 0.971333 2.616259 -0.684746 0.352681 -0.014002
4.233333 -1.939007 0.983106 2.607754 -0.685223 0.353210 -0.012588
4.266667 -1.961876 0.994897 2.621218 -0.685615 0.353703 -0.013686
4.300000 -1.984759 1.006706 2.606109 -0.685920 0.354161 -0.015840
4.333333 -2.007646 1.018525 2.600167 -0.686135 0.354580 -0.017527
4.366667 -2.030540 1.030360 2.592951 -0.686259 0.354961 -0.017298
4.400000 -2.053439 1.042208 2.622590 -0.686289 0.355303 -0.017616
4.433333 -2.076340 1.054067 2.615599 -0.686225 0.355604 -0.020405
4.466667 -2.099240 1.065938 2.611274 -0.686067 0.355866 -0.022240
4.500000 -2.122128 1.077813 2.605383 -0.685815 0.356087 -0.027977
4.533333 -2.145000 1.089693 2.603088 -0.685469 0.356269 -0.037358
4.566667 -2.167862 1.101579 2.606012 -0.685032 0.356412 -0.059212
4.600000 -2.190711 1.113471 2.611405 -0.684502 0.356516 -0.091164
4.633333 -2.213536 1.125364 2.600881 -0.683879 0.356580 -0.134586
4.666667 -2.236343 1.137260 2.597710 -0.683164 0.356606 -0.190240
4.700000 -2.259120 1.149155 2.601535 -0.682354 0.356593 -0.254811
4.733333 -2.281873 1.161050 2.598705 -0.681447 0.356538 -0.329694
4.766667 -2.304598 1.172944 2.598479 -0.680444 0.356443 -0.402652
4.800000 -2.327285 1.184833 2.588028 -0.679343 0.356306 -0.468050
4.833333 -2.349939 1.196719 2.547593 -0.678147 0.356128 -0.518218
4.866667 -2.372547 1.208597 2.555810 -0.676858 0.355910 -0.549417
4.900000 -2.395110 1.220467 2.489254 -0.675480 0.355651 -0.550623
4.933333 -2.417622 1.232327 2.455634 -0.674017 0.355354 -0.514376
4.966667 -2.440082 1.244175 2.430744 -0.672475 0.355019 -0.439981
5.000000 -2.462485 1.256010 2.414233 -0.670856 0.354648 -0.330195
5.033333 -2.484830 1.267832 2.384188 -0.669163 0.354241 -0.190007
5.066667 -2.507115 1.279638 2.382867 -0.667398 0.353799 -0.018587
5.100000 -2.529343 1.291430 2.379474 -0.665560 0.353321 0.169262
5.133333 -2.551514 1.303207 2.391093 -0.663648 0.352807 0.364258
5.166667 -2.573623 1.314968 2.407200 -0.661661 0.352258 0.557033
5.200000 -2.595669 1.326711 2.439727 -0.659597 0.351672 0.741809
5.233333 -2.617648 1.338436 2.472264 -0.657455 0.351050 0.913071
5.266667 -2.639549 1.350136 2.520675 -0.655235 0.350391 1.060154
5.300000 -2.661368 1.361812 2.567277 -0.652936 0.349697 1.177858
5.333333 -2.683113 1.373464 2.600820 -0.650557 0.348968 1.260107
5.366667 -2.704772 1.385091 2.638367 -0.648098 0.348205 1.300780
5.400000 -2.726344 1.396690 2.708949 -0.645559 0.347408 1.293155
5.433333 -2.747833 1.408263 2.759995 -0.642940 0.346578 1.232953
5.466667 -2.769237 1.419808 2.822778 -0.640241 0.345717 1.118911
5.500000 -2.790553 1.431325 2.872626 -0.637459 0.344823 0.956307
5.533333 -2.811779 1.442812 2.913840 -0.634596 0.343898 0.750103
5.566667 -2.832912 1.454269 2.958844 -0.631650 0.342940 0.509462
5.600000 -2.853941 1.465692 2.998782 -0.628620 0.341949 0.249117
5.633333 -2.874864 1.477081 2.992751 -0.625506 0.340923 -0.015694
5.666667 -2.895678 1.488435 2.973700 -0.622307 0.339861 -0.268663
5.700000 -2.916383 1.499754 2.933764 -0.619026 0.338762 -0.494616
5.733333 -2.936974 1.511036 2.891018 -0.615665 0.337626 -0.679441
5.766667 -2.957457 1.522280 2.848046 -0.612228 0.336452 -0.812970
5.800000 -2.977822 1.533484 2.806842 -0.608717 0.335240 -0.892710
5.833333 -2.998075 1.544648 2.760297 -0.605138 0.333988 -0.918389
5.866667 -3.018204 1.555770 2.704716 -0.601488 0.332697 -0.893806
5.900000 -3.038208 1.566848 2.670974 -0.597772 0.331365 -0.830714
5.933333 -3.058085 1.577880 2.652357 -0.593987 0.329992 -0.741460
5.966667 -3.077831 1.588864 2.628684 -0.590135 0.328578 -0.638025
6.000000 -3.097453 1.599803 2.605817 -0.586214 0.327122 -0.527009
6.033333 -3.116940 1.610691 2.607833 -0.582226 0.325625 -0.420340
6.066667 -3.136298 1.621530 2.593418 -0.578174 0.324090 -0.325543
6.100000 -3.155525 1.632321 2.592460 -0.574061 0.322519 -0.247132
6.133333 -3.174608 1.643054 2.577405 -0.569885 0.320911 -0.181322
6.166667 -3.193547 1.653731 2.592831 -0.565651 0.319270 -0.130380
6.200000 -3.212338 1.664348 2.588042 -0.561360 0.317598 -0.096752
6.233333 -3.230988 1.674912 2.593542 -0.557012 0.315896 -0.076586
6.266667 -3.249497 1.685421 2.580228 -0.552606 0.314164 -0.067280
6.300000 -3.267851 1.695867 2.575549 -0.548145 0.312403 -0.061880
6.333333 -3.286058 1.706255 2.584345 -0.543628 0.310614 -0.065337
6.366667 -3.304117 1.716586 2.584798 -0.539055 0.308796 -0.071142
6.400000 -3.322026 1.726858 2.585485 -0.534424 0.306949 -0.077367
6.433333 -3.339782 1.737070 2.566903 -0.529734 0.305070 -0.079771
6.466667 -3.357372 1.747213 2.579534 -0.524986 0.303161 -0.080161
6.500000 -3.374807 1.757294 2.563732 -0.520177 0.301220 -0.079450
6.533333 -3.392083 1.767312 2.566755 -0.515307 0.299247 -0.074370
6.566667 -3.409187 1.777258 2.553400 -0.510378 0.297242 -0.066282
6.600000 -3.426130 1.787139 2.550720 -0.505389 0.295207 -0.056363
6.633333 -3.442909 1.796954 2.554999 -0.500343 0.293140 -0.048568
6.666667 -3.459511 1.806694 2.554438 -0.495239 0.291043 -0.038763
6.700000 -3.475946 1.816367 2.551570 -0.490076 0.288915 -0.030088
6.733333 -3.492212 1.825971 2.559337 -0.484856 0.286756 -0.023225
6.766667 -3.508295 1.835498 2.555507 -0.479577 0.284566 -0.019547
6.800000 -3.524206 1.844954 2.552611 -0.474242 0.282344 -0.017847
6.833333 -3.539943 1.854339 2.561405 -0.468850 0.280092 -0.017142
6.866667 -3.555494 1.863645 2.557251 -0.463405 0.277811 -0.020014
6.900000 -3.570867 1.872877 2.552127 -0.457908 0.275502 -0.025415
6.933333 -3.586051 1.882029 2.541698 -0.452365 0.273169 -0.030003
6.966667 -3.601045 1.891099 2.546849 -0.446777 0.270813 -0.035007
7.000000 -3.615847 1.900087 2.554223 -0.441148 0.268435 -0.040943
7.033333 -3.630465 1.908998 2.553912 -0.435480 0.266038 -0.047511
7.066667 -3.644889 1.917826 2.548487 -0.429775 0.263621 -0.052934
7.100000 -3.659127 1.926577 2.547964 -0.424035 0.261187 -0.056813
7.133333 -3.673176 1.935249 2.536987 -0.418259 0.258734 -0.063365
7.166667 -3.687028 1.943835 2.544557 -0.412447 0.256263 -0.069650
7.200000 -3.700689 1.952341 2.540815 -0.406599 0.253772 -0.073863
7.233333 -3.714158 1.960767 2.528796 -0.400715 0.251260 -0.074968
7.266667 -3.727425 1.969105 2.539258 -0.394793 0.248728 -0.077396
7.300000 -3.740498 1.977361 2.528045 -0.388833 0.246174 -0.077954
7.333333 -3.753368 1.985529 2.520797 -0.382836 0.243600 -0.074857
7.366667 -3.766034 1.993608 2.520799 -0.376805 0.241005 -0.070244
7.400000 -3.778501 2.001603 2.529570 -0.370740 0.238392 -0.066118
7.433333 -3.790763 2.009509 2.517481 -0.364644 0.235761 -0.063828
7.466667 -3.802820 2.017325 2.510887 -0.358519 0.233115 -0.057394
7.500000 -3.814674 2.025054 2.517693 -0.352368 0.230454 -0.052638
7.533333 -3.826326 2.032697 2.514452 -0.346192 0.227781 -0.050228
7.566667 -3.837769 2.040249 2.516708 -0.339993 0.225094 -0.049049
7.600000 -3.849003 2.047709 2.501984 -0.333771 0.222396 -0.046334
7.633333 -3.860027 2.055078 2.512856 -0.327527 0.219686 -0.043363
7.666667 -3.870844 2.062357 2.514905 -0.321262 0.216966 -0.044383
7.700000 -3.881453 2.069547 2.504052 -0.314975 0.214233 -0.043620
7.733333 -3.891853 2.076645 2.504431 -0.308667 0.211490 -0.041428
7.766667 -3.902041 2.083651 2.504390 -0.302338 0.208736 -0.037540
7.800000 -3.912018 2.090566 2.504971 -0.295987 0.205970 -0.036884
7.833333 -3.921784 2.097388 2.497679 -0.289615 0.203193 -0.036501
7.866667 -3.931337 2.104118 2.500604 -0.283221 0.200404 -0.034520
7.900000 -3.940676 2.110754 2.495309 -0.276805 0.197603 -0.035240
7.933333 -3.949802 2.117297 2.496512 -0.270367 0.194791 -0.038630
7.966667 -3.958711 2.123746 2.501823 -0.263908 0.191968 -0.045937
8.000000 -3.967405 2.130101 2.492452 -0.257428 0.189133 -0.051662
8.033333 -3.975882 2.136360 2.500618 -0.250929 0.186288 -0.060321
8.066667 -3.984142 2.142524 2.499775 -0.244411 0.183433 -0.071831
8.100000 -3.992184 2.148594 2.498683 -0.237875 0.180568 -0.085002
8.133333 -4.000008 2.154566 2.480393 -0.231323 0.177694 -0.097505
8.166667 -4.007613 2.160442 2.485419 -0.224755 0.174811 -0.109063
8.200000 -4.014998 2.166223 2.480798 -0.218172 0.171919 -0.122693
8.233333 -4.022164 2.171907 2.476028 -0.211575 0.169018 -0.133945
8.266667 -4.029110 2.177496 2.469018 -0.204966 0.166109 -0.142199
8.300000 -4.035834 2.182987 2.464808 -0.198343 0.163193 -0.146053
8.333333 -4.042338 2.188380 2.467741 -0.191710 0.160268 -0.148834
8.366667 -4.048620 2.193675 2.451931 -0.185065 0.157336 -0.147051
8.400000 -4.054680 2.198872 2.448404 -0.178410 0.154395 -0.140884
8.433333 -4.060518 2.203970 2.443622 -0.171744 0.151446 -0.130937
8.466667 -4.066133 2.208970 2.438079 -0.165069 0.148487 -0.118623
8.500000 -4.071526 2.213872 2.428432 -0.158383 0.145519 -0.104889
8.533333 -4.076697 2.218676 2.431084 -0.151688 0.142541 -0.087232
8.566667 -4.081644 2.223383 2.419452 -0.144983 0.139552 -0.069810
8.600000 -4.086367 2.227986 2.422065 -0.138269 0.136554 -0.052232
8.633333 -4.090866 2.232491 2.426762 -0.131546 0.133547 -0.036862
8.666667 -4.095142 2.236897 2.423484 -0.124815 0.130530 -0.023643
8.700000 -4.099192 2.241200 2.429749 -0.118075 0.127505 -0.013733
8.733333 -4.103016 2.245398 2.426286 -0.111328 0.124473 -0.008765
8.766667 -4.106616 2.249497 2.424524 -0.104574 0.121433 -0.007528
8.800000 -4.109991 2.253496 2.423939 -0.097813 0.118386 -0.010865
8.833333 -4.113139 2.257390 2.424446 -0.091046 0.115329 -0.016284
8.866667 -4.116063 2.261184 2.431961 -0.084273 0.112262 -0.024098
8.900000 -4.118760 2.264878 2.429250 -0.077495 0.109185 -0.032991
8.933333 -4.121232 2.268470 2.429424 -0.070712 0.106094 -0.042253
8.966667 -4.123477 2.271962 2.418630 -0.063923 0.102990 -0.052325
9.000000 -4.125496 2.275348 2.416354 -0.057131 0.099872 -0.059672
9.033333 -4.127288 2.278632 2.420126 -0.050335 0.096739 -0.066204
9.066667 -4.128853 2.281808 2.412982 -0.043535 0.093591 -0.070121
9.100000 -4.130191 2.284878 2.421527 -0.036733 0.090427 -0.072519
9.133333 -4.131303 2.287840 2.405899 -0.029930 0.087250 -0.072556
9.166667 -4.132188 2.290693 2.402290 -0.023127 0.084059 -0.070090
9.200000 -4.132845 2.293444 2.403096 -0.016326 0.080856 -0.068368
9.233333 -4.133274 2.296092 2.401049 -0.009526 0.077641 -0.067111
9.266667 -4.133476 2.298630 2.397504 -0.002732 0.074415 -0.066494
9.300000 -4.133453 2.301060 2.393111 0.004058 0.071179 -0.063810
9.333333 -4.133204 2.303380 2.405624 0.010842 0.067932 -0.063731
9.366667 -4.132729 2.305591 2.393729 0.017622 0.064675 -0.066001
9.400000 -4.132025 2.307696 2.393762 0.024398 0.061409 -0.070427
9.433333 -4.131096 2.309692 2.392971 0.031173 0.058136 -0.076448
9.466667 -4.129943 2.311577 2.383696 0.037948 0.054856 -0.087110
9.500000 -4.128565 2.313352 2.384290 0.044726 0.051572 -0.108369
9.533333 -4.126964 2.315016 2.390753 0.051508 0.048285 -0.136007
9.566667 -4.125139 2.316569 2.364818 0.058297 0.044995 -0.170389
9.600000 -4.123091 2.318011 2.380249 0.065096 0.041705 -0.214887
9.633333 -4.120812 2.319346 2.389016 0.071907 0.038414 -0.269550
9.666667 -4.118301 2.320573 2.361870 0.078735 0.035123 -0.335942
9.700000 -4.115558 2.321691 2.355063 0.085578 0.031832 -0.424290
9.733333 -4.112594 2.322698 2.353931 0.092434 0.028539 -0.564444
9.766667 -4.109410 2.323593 2.327763 0.099301 0.025245 -0.776999
9.800000 -4.105993 2.324379 2.312715 0.106173 0.021948 -1.097994
9.833333 -4.102344 2.325057 2.277499 0.113042 0.018645 -1.557608
9.866667 -4.098461 2.325625 2.248893 0.119902 0.015335 -2.172996
9.900000 -4.094345 2.326083 2.224558 0.126743 0.012018 -2.934532
9.933333 -4.089997 2.326431 2.191549 0.133562 0.008692 -3.789436
9.966667 -4.085415 2.326668 2.172842 0.140350 0.005355 -4.698443
10.000000 -4.080601 2.326796 2.096421 0.147103 0.002008 -5.568116
10.033333 -4.075573 2.326810 1.882099 0.153816 -0.001351 -6.314600
10.066667 -4.070333 2.326711 1.492289 0.160487 -0.004721 -6.858165
10.100000 -4.064860 2.326500 1.217110 0.167118 -0.008103 -7.150724
10.133333 -4.059176 2.326176 0.673850 0.173707 -0.011495 -7.163468
10.166667 -4.053262 2.325738 0.246936 0.180258 -0.014898 -6.877247
10.200000 -4.047138 2.325186 -0.080303 0.186774 -0.018309 -6.327315
10.233333 -4.040807 2.324522 -0.368374 0.193258 -0.021727 -5.565892
10.266667 -4.034246 2.323741 -0.510273 0.199707 -0.025151 -4.674128
10.300000 -4.027480 2.322847 -0.557448 0.206121 -0.028579 -3.714256
10.333333 -4.020484 2.321836 -0.520603 0.212498 -0.032012 -2.785056
10.366667 -4.013286 2.320713 -0.484585 0.218835 -0.035449 -1.961986
10.400000 -4.005886 2.319476 -0.465612 0.225132 -0.038892 -1.293418
10.433333 -3.998260 2.318122 -0.483732 0.231387 -0.042340 -0.801412
10.466667 -3.990435 2.316654 -0.510369 0.237601 -0.045796 -0.473639
10.500000 -3.982389 2.315069 -0.515406 0.243772 -0.049263 -0.293254
10.533333 -3.974147 2.313371 -0.510959 0.249903 -0.052741 -0.209886
10.566667 -3.965711 2.311560 -0.533284 0.255991 -0.056232 -0.180784
10.600000 -3.957081 2.309637 -0.532790 0.262032 -0.059735 -0.173850
10.633333 -3.948242 2.307594 -0.548902 0.268026 -0.063249 -0.167811
10.666667 -3.939198 2.305430 -0.555281 0.273968 -0.066772 -0.155483
10.700000 -3.929950 2.303146 -0.552550 0.279853 -0.070299 -0.135534
10.733333 -3.920501 2.300741 -0.563913 0.285676 -0.073826 -0.110857
10.766667 -3.910868 2.298224 -0.565609 0.291431 -0.077349 -0.087664
10.800000 -3.901039 2.295585 -0.568305 0.297115 -0.080864 -0.066547
10.833333 -3.891019 2.292823 -0.566130 0.302723 -0.084372 -0.047652
10.866667 -3.880810 2.289939 -0.560293 0.308255 -0.087871 -0.028957
10.900000 -3.870423 2.286943 -0.558063 0.313708 -0.091361 -0.008790
10.933333 -3.859859 2.283838 -0.564767 0.319086 -0.094847 0.012690
10.966667 -3.849120 2.280623 -0.558471 0.324390 -0.098330 0.035335
11.000000 -3.838208 2.277298 -0.573174 0.329624 -0.101810 0.058044
11.033333 -3.827121 2.273848 -0.571093 0.334790 -0.105287 0.078377
11.066667 -3.815864 2.270290 -0.571166 0.339891 -0.108761 0.098760
11.100000 -3.804435 2.266608 -0.565015 0.344927 -0.112233 0.116664
11.133333 -3.792838 2.262804 -0.558858 0.349899 -0.115697 0.130193
11.166667 -3.781076 2.258878 -0.530068 0.354805 -0.119149 0.139533
11.200000 -3.769152 2.254845 -0.540533 0.359646 -0.122585 0.144046
11.233333 -3.757068 2.250693 -0.526770 0.364421 -0.126002 0.143964
11.266667 -3.744825 2.246423 -0.514180 0.369126 -0.129394 0.136038
11.300000 -3.732427 2.242047 -0.518517 0.373763 -0.132755 0.122479
11.333333 -3.719874 2.237566 -0.521541 0.378331 -0.136085 0.103900
11.366667 -3.707172 2.232971 -0.517903 0.382831 -0.139386 0.083036
11.400000 -3.694321 2.228262 -0.513161 0.387262 -0.142654 0.059921
11.433333 -3.681325 2.223439 -0.513635 0.391627 -0.145890 0.037768
11.466667 -3.668184 2.218515 -0.502919 0.395924 -0.149095 0.018930
11.500000 -3.654898 2.213489 -0.501039 0.400156 -0.152271 0.002385
11.533333 -3.641475 2.208354 -0.504630 0.404321 -0.155416 -0.012029
11.566667 -3.627916 2.203109 -0.511592 0.408421 -0.158528 -0.023372
11.600000 -3.614219 2.197766 -0.512061 0.412456 -0.161610 -0.031891
11.633333 -3.600387 2.192323 -0.514636 0.416424 -0.164662 -0.038328
11.666667 -3.586427 2.186776 -0.520499 0.420326 -0.167684 -0.044030
11.700000 -3.572336 2.181130 -0.527224 0.424163 -0.170674 -0.047603
11.733333 -3.558115 2.175389 -0.519987 0.427932 -0.173634 -0.047430
11.766667 -3.543773 2.169545 -0.524943 0.431634 -0.176565 -0.047339
11.800000 -3.529313 2.163600 -0.516889 0.435268 -0.179466 -0.047855
11.833333 -3.514730 2.157561 -0.517146 0.438836 -0.182336 -0.050035
11.866667 -3.500025 2.151429 -0.532923 0.442340 -0.185174 -0.051043
11.900000 -3.485202 2.145204 -0.522394 0.445779 -0.187980 -0.054376
11.933333 -3.470271 2.138885 -0.527746 0.449156 -0.190755 -0.060874
11.966667 -3.455234 2.132471 -0.527434 0.452472 -0.193497 -0.067894
12.000000 -3.440084 2.125968 -0.541743 0.455726 -0.196205 -0.071533
12.033333 -3.424824 2.119376 -0.537761 0.458916 -0.198882 -0.070508
12.066667 -3.409465 2.112694 -0.532676 0.462042 -0.201526 -0.069718
12.100000 -3.394001 2.105925 -0.538195 0.465103 -0.204138 -0.064932
12.133333 -3.378431 2.099070 -0.548727 0.468094 -0.206717 -0.055626
12.166667 -3.362759 2.092130 -0.551398 0.471015 -0.209264 -0.044419
12.200000 -3.346988 2.085106 -0.547377 0.473865 -0.211780 -0.034967
12.233333 -3.331127 2.077997 -0.555261 0.476645 -0.214263 -0.028046
12.266667 -3.315170 2.070806 -0.562818 0.479353 -0.216715 -0.018972
12.300000 -3.299130 2.063534 -0.549389 0.481991 -0.219134 -0.011300
12.333333 -3.283009 2.056182 -0.549171 0.484561 -0.221522 -0.006083
12.366667 -3.266799 2.048751 -0.537501 0.487065 -0.223878 -0.002367
12.400000 -3.250511 2.041242 -0.543153 0.489504 -0.226200 0.001239
12.433333 -3.234149 2.033657 -0.545449 0.491879 -0.228489 0.004025
12.466667 -3.217703 2.025995 -0.551931 0.494192 -0.230743 0.003406
12.500000 -3.201175 2.018258 -0.559258 0.496444 -0.232963 0.003856
12.533333 -3.184568 2.010446 -0.551445 0.498630 -0.235148 0.005117
12.566667 -3.167895 2.002564 -0.550854 0.500753 -0.237297 0.008869
12.600000 -3.151157 1.994611 -0.543501 0.502813 -0.239412 0.012930
12.633333 -3.134346 1.986587 -0.547842 0.504811 -0.241494 0.018369
12.666667 -3.117464 1.978493 -0.549963 0.506752 -0.243542 0.025412
12.700000 -3.100524 1.970333 -0.549283 0.508637 -0.245560 0.029152
12.733333 -3.083527 1.962107 -0.545176 0.510473 -0.247549 0.030744
12.766667 -3.066476 1.953818 -0.546741 0.512262 -0.249509 0.027889
12.800000 -3.049372 1.945465 -0.543686 0.514005 -0.251440 0.023084
12.833333 -3.032207 1.937048 -0.536071 0.515702 -0.253343 0.015051
12.866667 -3.014981 1.928566 -0.540095 0.517351 -0.255217 0.002379
12.900000 -2.997698 1.920021 -0.536670 0.518949 -0.257061 -0.011545
12.933333 -2.980359 1.911414 -0.539768 0.520493 -0.258874 -0.025253
12.966667 -2.962966 1.902746 -0.538306 0.521980 -0.260654 -0.038363
13.000000 -2.945521 1.894018 -0.533533 0.523408 -0.262401 -0.051654
13.033333 -2.928026 1.885232 -0.544092 0.524774 -0.264114 -0.062050
13.066667 -2.910492 1.876390 -0.547473 0.526079 -0.265794 -0.066760
13.100000 -2.892921 1.867495 -0.559934 0.527324 -0.267439 -0.066316
13.133333 -2.875315 1.858547 -0.557613 0.528511 -0.269051 -0.063804
13.166667 -2.857676 1.849548 -0.554431 0.529643 -0.270630 -0.056699
13.200000 -2.839997 1.840495 -0.571159 0.530725 -0.272178 -0.043381
13.233333 -2.822278 1.831390 -0.564488 0.531759 -0.273696 -0.028043
13.266667 -2.804522 1.822233 -0.553126 0.532746 -0.275183 -0.013768
13.300000 -2.786740 1.813030 -0.571693 0.533686 -0.276639 0.000308
13.333333 -2.768925 1.803779 -0.567290 0.534579 -0.278065 0.014702
13.366667 -2.751078 1.794478 -0.555616 0.535424 -0.279461 0.027180
13.400000 -2.733201 1.785131 -0.557795 0.536218 -0.280824 0.033879
13.433333 -2.715296 1.775738 -0.558921 0.536958 -0.282155 0.037774
13.466667 -2.697373 1.766303 -0.557215 0.537644 -0.283454 0.042131
13.500000 -2.679434 1.756828 -0.552890 0.538276 -0.284719 0.042192
13.533333 -2.661471 1.747311 -0.550187 0.538851 -0.285951 0.040068
13.566667 -2.643488 1.737751 -0.544944 0.539372 -0.287149 0.035206
13.600000 -2.625485 1.728151 -0.555463 0.539838 -0.288315 0.031380
13.633333 -2.607471 1.718514 -0.544234 0.540251 -0.289448 0.026341
13.666667 -2.589442 1.708838 -0.549322 0.540614 -0.290549 0.019160
13.700000 -2.571405 1.699128 -0.542134 0.540928 -0.291619 0.012889
13.733333 -2.553355 1.689381 -0.551447 0.541194 -0.292658 0.006523
13.766667 -2.535301 1.679602 -0.541955 0.541414 -0.293668 0.001512
13.800000 -2.517244 1.669791 -0.546029 0.541589 -0.294647 -0.004649
13.833333 -2.499180 1.659948 -0.550537 0.541719 -0.295596 -0.009622
13.866667 -2.481114 1.650074 -0.540859 0.541803 -0.296516 -0.014988
13.900000 -2.463045 1.640169 -0.552385 0.541843 -0.297406 -0.018596
13.933333 -2.444972 1.630234 -0.551304 0.541838 -0.298265 -0.022359
13.966667 -2.426898 1.620269 -0.544400 0.541789 -0.299094 -0.026473
14.000000 -2.408825 1.610277 -0.550314 0.541693 -0.299893 -0.029856
14.033333 -2.390758 1.600259 -0.553971 0.541552 -0.300660 -0.033931
14.066667 -2.372699 1.590218 -0.551898 0.541366 -0.301396 -0.037040
14.100000 -2.354645 1.580151 -0.554058 0.541136 -0.302102 -0.041062
14.133333 -2.336603 1.570063 -0.557864 0.540861 -0.302776 -0.044650
14.166667 -2.318572 1.559954 -0.553576 0.540544 -0.303420 -0.047994
14.200000 -2.300551 1.549823 -0.558741 0.540186 -0.304034 -0.049812
14.233333 -2.282544 1.539673 -0.557314 0.539787 -0.304618 -0.051426
14.266667 -2.264550 1.529503 -0.563399 0.539347 -0.305173 -0.052480
14.300000 -2.246570 1.519314 -0.565371 0.538868 -0.305697 -0.053994
14.333333 -2.228605 1.509108 -0.569377 0.538349 -0.306192 -0.053733
14.366667 -2.210658 1.498886 -0.568200 0.537790 -0.306656 -0.051838
14.400000 -2.192731 1.488648 -0.575058 0.537189 -0.307089 -0.050599
14.433333 -2.174825 1.478398 -0.563054 0.536546 -0.307492 -0.048866
14.466667 -2.156942 1.468136 -0.576381 0.535862 -0.307864 -0.047637
14.500000 -2.139083 1.457860 -0.580494 0.535136 -0.308205 -0.044610
14.533333 -2.121248 1.447575 -0.566715 0.534369 -0.308516 -0.045131
14.566667 -2.103440 1.437279 -0.580292 0.533562 -0.308797 -0.046216
14.600000 -2.085659 1.426974 -0.585112 0.532714 -0.309048 -0.047480
14.633333 -2.067907 1.416662 -0.583955 0.531828 -0.309270 -0.047530
14.666667 -2.050185 1.406343 -0.573003 0.530902 -0.309464 -0.045777
14.700000 -2.032496 1.396018 -0.581470 0.529937 -0.309628 -0.044924
14.733333 -2.014839 1.385689 -0.579818 0.528934 -0.309763 -0.040071
14.766667 -1.997216 1.375355 -0.588842 0.527892 -0.309869 -0.034986
14.800000 -1.979629 1.365018 -0.602712 0.526812 -0.309946 -0.028230
14.833333 -1.962078 1.354678 -0.587076 0.525693 -0.309993 -0.020955
14.866667 -1.944565 1.344337 -0.598029 0.524538 -0.310011 -0.013255
14.900000 -1.927091 1.333996 -0.586681 0.523345 -0.309999 -0.005189
14.933333 -1.909658 1.323656 -0.588810 0.522115 -0.309959 0.003242
14.966667 -1.892266 1.313318 -0.597973 0.520849 -0.309889 0.011125
15.000000 -1.874918 1.302984 -0.582329 0.519548 -0.309790 0.014487
15.033333 -1.857614 1.292653 -0.586839 0.518212 -0.309663 0.016185
15.066667 -1.840355 1.282327 -0.590834 0.516841 -0.309508 0.016626
15.100000 -1.823143 1.272007 -0.585556 0.515436 -0.309325 0.016492
15.133333 -1.805977 1.261693 -0.585295 0.513996 -0.309114 0.013182
15.166667 -1.788861 1.251386 -0.583100 0.512523 -0.308876 0.008988
15.200000 -1.771794 1.241088 -0.585249 0.511016 -0.308612 0.009431
15.233333 -1.754778 1.230799 -0.586448 0.509475 -0.308321 0.010612
15.266667 -1.737813 1.220521 -0.575145 0.507901 -0.308003 0.009317
15.300000 -1.720901 1.210254 -0.591590 0.506292 -0.307659 0.008105
15.333333 -1.704044 1.199999 -0.598048 0.504650 -0.307290 0.008945
15.366667 -1.687243 1.189757 -0.584833 0.502974 -0.306894 0.009877
15.400000 -1.670497 1.179528 -0.571046 0.501263 -0.306473 0.005896
15.433333 -1.653809 1.169314 -0.586608 0.499519 -0.306027 -0.000173
15.466667 -1.637181 1.159114 -0.585055 0.497741 -0.305557 -0.004852
15.500000 -1.620612 1.148931 -0.584244 0.495930 -0.305061 -0.010041
15.533333 -1.604103 1.138765 -0.578448 0.494085 -0.304541 -0.018468
15.566667 -1.587657 1.128617 -0.577556 0.492207 -0.303997 -0.026632
15.600000 -1.571274 1.118488 -0.578076 0.490295 -0.303429 -0.029738
15.633333 -1.554955 1.108378 -0.592916 0.488352 -0.302837 -0.030930
15.666667 -1.538702 1.098288 -0.586612 0.486375 -0.302221 -0.030676
15.700000 -1.522515 1.088219 -0.592404 0.484366 -0.301581 -0.029526
15.733333 -1.506397 1.078172 -0.600685 0.482324 -0.300918 -0.024241
15.766667 -1.490346 1.068148 -0.595888 0.480251 -0.300232 -0.019052
15.800000 -1.474365 1.058146 -0.594017 0.478145 -0.299523 -0.016920
15.833333 -1.458454 1.048168 -0.591965 0.476008 -0.298790 -0.019202
15.866667 -1.442616 1.038215 -0.594673 0.473839 -0.298035 -0.026026
15.900000 -1.426851 1.028289 -0.588397 0.471638 -0.297257 -0.036736
15.933333 -1.411160 1.018388 -0.583455 0.469407 -0.296455 -0.053703
15.966667 -1.395543 1.008514 -0.597404 0.467145 -0.295630 -0.073014
16.000000 -1.380002 0.998669 -0.584240 0.464853 -0.294781 -0.092236
16.033333 -1.364538 0.988852 -0.595780 0.462532 -0.293908 -0.103695
16.066667 -1.349153 0.979065 -0.594948 0.460183 -0.293010 -0.108177
16.100000 -1.333847 0.969307 -0.611159 0.457807 -0.292087 -0.103997
16.133333 -1.318620 0.959579 -0.611816 0.455405 -0.291139 -0.090702
16.166667 -1.303475 0.949884 -0.644628 0.452978 -0.290165 -0.068649
16.200000 -1.288412 0.940222 -0.635466 0.450527 -0.289164 -0.041365
16.233333 -1.273430 0.930594 -0.634069 0.448051 -0.288139 -0.016822
16.266667 -1.258532 0.921000 -0.630835 0.445552 -0.287087 0.004460
16.300000 -1.243717 0.911443 -0.645231 0.443030 -0.286010 0.022592
16.333333 -1.228986 0.901923 -0.613408 0.440485 -0.284909 0.035043
16.366667 -1.214340 0.892438 -0.603443 0.437915 -0.283783 0.039583
16.400000 -1.199780 0.882993 -0.595188 0.435321 -0.282633 0.036859
16.433333 -1.185307 0.873586 -0.595188 0.432703 -0.281458 0.030782
16.466667 -1.170920 0.864218 -0.602921 0.430060 -0.280260 0.023340
16.500000 -1.156624 0.854891 -0.619929 0.427393 -0.279038 0.009972
16.533333 -1.142416 0.845604 -0.613217 0.424701 -0.277791 -0.003409
16.566667 -1.128300 0.836360 -0.629638 0.421985 -0.276521 -0.014152
16.600000 -1.114274 0.827158 -0.629638 0.419245 -0.275228 -0.018976
16.633333 -1.100338 0.817999 -0.605419 0.416482 -0.273911 -0.021576
16.666667 -1.086496 0.808885 -0.616425 0.413695 -0.272571 -0.022418
16.700000 -1.072750 0.799819 -0.601133 0.410885 -0.271209 -0.020071
16.733333 -1.059095 0.790796 -0.608699 0.408053 -0.269824 -0.016086
16.766667 -1.045538 0.781822 -0.618890 0.405197 -0.268416 -0.015467
16.800000 -1.032073 0.772893 -0.616678 0.402319 -0.266987 -0.020652
16.833333 -1.018702 0.764011 -0.627382 0.399420 -0.265536 -0.022390
16.866667 -1.005430 0.755178 -0.628305 0.396500 -0.264064 -0.026338
16.900000 -0.992259 0.746396 -0.618066 0.393560 -0.262571 -0.030414
16.933333 -0.979187 0.737665 -0.607876 0.390603 -0.261058 -0.038834
16.966667 -0.966211 0.728983 -0.630567 0.387628 -0.259524 -0.043913
17.000000 -0.953337 0.720353 -0.624033 0.384636 -0.257971 -0.047790
17.033333 -0.940565 0.711778 -0.617591 0.381630 -0.256400 -0.061897
17.066667 -0.927890 0.703252 -0.616200 0.378610 -0.254810 -0.075077
17.100000 -0.915318 0.694781 -0.638446 0.375578 -0.253204 -0.087216
17.133333 -0.902848 0.686366 -0.629299 0.372533 -0.251580 -0.092358
17.166667 -0.890476 0.678002 -0.612598 0.369477 -0.249939 -0.101876
17.200000 -0.878208 0.669695 -0.656298 0.366409 -0.248283 -0.106035
17.233333 -0.866045 0.661444 -0.645060 0.363330 -0.246611 -0.098256
17.266667 -0.853981 0.653247 -0.659918 0.360240 -0.244923 -0.085721
17.300000 -0.842022 0.645107 -0.641156 0.357141 -0.243222 -0.074121
17.333333 -0.830169 0.637027 -0.656618 0.354034 -0.241507 -0.066274
17.366667 -0.818416 0.629000 -0.685626 0.350923 -0.239782 -0.050783
17.400000 -0.806768 0.621032 -0.653460 0.347808 -0.238048 -0.040452
17.433333 -0.795226 0.613125 -0.663484 0.344692 -0.236305 -0.036103
17.466667 -0.783791 0.605278 -0.641920 0.341576 -0.234557 -0.039783
17.500000 -0.772462 0.597491 -0.666729 0.338464 -0.232806 -0.040548
17.533333 -0.761234 0.589761 -0.644541 0.335357 -0.231053 -0.042191
17.566667 -0.750106 0.582086 -0.652657 0.332257 -0.229300 -0.048825
17.600000 -0.739085 0.574473 -0.649377 0.329163 -0.227546 -0.055257
17.633333 -0.728165 0.566916 -0.675458 0.326077 -0.225793 -0.059216
17.666667 -0.717351 0.559421 -0.674854 0.322996 -0.224039 -0.056352
17.700000 -0.706638 0.551984 -0.691566 0.319919 -0.222283 -0.054153
17.733333 -0.696027 0.544603 -0.659277 0.316845 -0.220523 -0.049356
17.766667 -0.685516 0.537280 -0.682434 0.313770 -0.218757 -0.042871
17.800000 -0.675107 0.530015 -0.679922 0.310694 -0.216983 -0.032688
17.833333 -0.664799 0.522808 -0.675307 0.307617 -0.215203 -0.024929
17.866667 -0.654592 0.515659 -0.678947 0.304538 -0.213413 -0.020493
17.900000 -0.644491 0.508573 -0.670287 0.301458 -0.211616 -0.019747
17.933333 -0.634492 0.501545 -0.670347 0.298376 -0.209810 -0.019968
17.966667 -0.624598 0.494581 -0.676080 0.295294 -0.207996 -0.021526
18.000000 -0.614810 0.487679 -0.679534 0.292213 -0.206174 -0.026322
18.033333 -0.605123 0.480837 -0.682389 0.289133 -0.204345 -0.028810
18.066667 -0.595540 0.474057 -0.678689 0.286056 -0.202508 -0.029861
18.100000 -0.586058 0.467336 -0.691491 0.282983 -0.200665 -0.026081
18.133333 -0.576676 0.460675 -0.671663 0.279914 -0.198817 -0.023090
18.166667 -0.567395 0.454074 -0.686699 0.276851 -0.196964 -0.016482
18.200000 -0.558217 0.447536 -0.690167 0.273794 -0.195108 -0.007136
18.233333 -0.549142 0.441063 -0.687649 0.270744 -0.193250 0.001175
18.266667 -0.540171 0.434653 -0.686356 0.267701 -0.191392 0.009808
18.300000 -0.531301 0.428307 -0.692614 0.264667 -0.189534 0.017098
18.333333 -0.522532 0.422020 -0.680904 0.261642 -0.187677 0.027191
18.366667 -0.513864 0.415797 -0.676853 0.258627 -0.185824 0.032936
18.400000 -0.505298 0.409638 -0.679214 0.255623 -0.183976 0.034304
18.433333 -0.496831 0.403538 -0.677403 0.252632 -0.182133 0.034155
18.466667 -0.488463 0.397499 -0.693748 0.249652 -0.180294 0.032496
18.500000 -0.480192 0.391520 -0.667312 0.246685 -0.178461 0.025114
18.533333 -0.472020 0.385601 -0.668296 0.243729 -0.176632 0.013057
18.566667 -0.463947 0.379744 -0.677615 0.240784 -0.174806 0.000715
18.600000 -0.455972 0.373948 -0.672314 0.237850 -0.172983 -0.010386
18.633333 -0.448096 0.368213 -0.663204 0.234927 -0.171162 -0.022563
18.666667 -0.440316 0.362539 -0.675413 0.232014 -0.169343 -0.037573
18.700000 -0.432633 0.356924 -0.673736 0.229111 -0.167526 -0.048777
18.733333 -0.425047 0.351371 -0.686619 0.226219 -0.165711 -0.056616
18.766667 -0.417557 0.345878 -0.681082 0.223339 -0.163898 -0.063697
18.800000 -0.410162 0.340445 -0.683246 0.220470 -0.162087 -0.069729
18.833333 -0.402863 0.335073 -0.691267 0.217614 -0.160280 -0.073182
18.866667 -0.395661 0.329762 -0.691330 0.214770 -0.158476 -0.073366
18.900000 -0.388553 0.324510 -0.694180 0.211940 -0.156675 -0.072105
18.933333 -0.381538 0.319318 -0.694116 0.209123 -0.154879 -0.072075
18.966667 -0.374617 0.314186 -0.693496 0.206320 -0.153086 -0.070759
19.000000 -0.367790 0.309115 -0.702450 0.203532 -0.151299 -0.068517
19.033333 -0.361055 0.304102 -0.705385 0.200759 -0.149516 -0.066070
19.066667 -0.354413 0.299150 -0.697794 0.198002 -0.147739 -0.064263
19.100000 -0.347863 0.294256 -0.708228 0.195260 -0.145967 -0.062950
19.133333 -0.341403 0.289421 -0.706865 0.192535 -0.144200 -0.061128
19.166667 -0.335035 0.284645 -0.717229 0.189826 -0.142440 -0.058907
19.200000 -0.328756 0.279928 -0.716665 0.187134 -0.140685 -0.057469
19.233333 -0.322567 0.275268 -0.716192 0.184458 -0.138936 -0.055758
19.266667 -0.316467 0.270668 -0.708198 0.181799 -0.137193 -0.053492
19.300000 -0.310455 0.266125 -0.715794 0.179157 -0.135457 -0.051497
19.333333 -0.304531 0.261640 -0.716773 0.176532 -0.133728 -0.050440
19.366667 -0.298694 0.257213 -0.724558 0.173924 -0.132007 -0.049606
19.400000 -0.292944 0.252844 -0.729115 0.171333 -0.130294 -0.047824
19.433333 -0.287279 0.248532 -0.726517 0.168759 -0.128589 -0.046770
19.466667 -0.281701 0.244276 -0.717760 0.166203 -0.126893 -0.044889
19.500000 -0.276207 0.240077 -0.729880 0.163664 -0.125205 -0.042220
19.533333 -0.270798 0.235933 -0.731090 0.161142 -0.123526 -0.037191
19.566667 -0.265472 0.231845 -0.725309 0.158639 -0.121856 -0.033782
19.600000 -0.260230 0.227813 -0.738835 0.156154 -0.120195 -0.030515
19.633333 -0.255071 0.223836 -0.733616 0.153687 -0.118543 -0.027102
19.666667 -0.249993 0.219914 -0.735727 0.151239 -0.116899 -0.022991
19.700000 -0.244997 0.216047 -0.730246 0.148810 -0.115264 -0.019998
19.733333 -0.240082 0.212234 -0.732271 0.146401 -0.113638 -0.019208
19.766667 -0.235247 0.208475 -0.734315 0.144011 -0.112021 -0.015801
19.800000 -0.230490 0.204770 -0.737781 0.141640 -0.110413 -0.014557
19.833333 -0.225812 0.201119 -0.737784 0.139290 -0.108815 -0.014081
19.866667 -0.221213 0.197520 -0.729784 0.136959 -0.107227 -0.016487
19.900000 -0.216691 0.193975 -0.743465 0.134649 -0.105649 -0.018600
19.933333 -0.212246 0.190482 -0.732431 0.132359 -0.104081 -0.021317
19.966667 -0.207877 0.187041 -0.738353 0.130089 -0.102524 -0.027182
20.000000 -0.203584 0.183652 -0.736751 0.127840 -0.100977 -0.032527
20.033333 -0.199364 0.180314 -0.741633 0.125610 -0.099441 -0.037647
20.066667 -0.195218 0.177027 -0.737154 0.123402 -0.097915 -0.042495
20.100000 -0.191146 0.173791 -0.733542 0.121213 -0.096399 -0.047964
20.133333 -0.187147 0.170606 -0.747764 0.119046 -0.094895 -0.051640
20.166667 -0.183219 0.167470 -0.748670 0.116900 -0.093401 -0.053496
