t x y theta dxdt dydt dthetadt
0.000000 0.000000 0.000000 -0.253983 0.003609 -0.003395 0.020156
0.033333 0.000469 -0.000356 -0.248022 0.005985 -0.005780 0.028243
0.066667 0.000445 -0.000299 -0.251335 0.009793 -0.009276 0.049989
0.100000 0.000104 -0.000200 -0.254869 0.015641 -0.014277 0.096572
0.133333 0.000348 -0.000299 -0.248615 0.024078 -0.021088 0.179335
0.166667 0.000617 -0.000439 -0.250045 0.035931 -0.029903 0.314430
0.200000 0.000684 -0.000847 -0.251038 0.052636 -0.040930 0.509855
0.233333 0.001382 -0.001473 -0.249426 0.075553 -0.054399 0.767367
0.266667 0.002554 -0.002569 -0.252605 0.105856 -0.070435 1.089652
0.300000 0.005162 -0.005260 -0.260777 0.144182 -0.088505 1.471712
0.333333 0.008444 -0.008184 -0.214616 0.191414 -0.108012 1.901930
0.366667 0.012416 -0.011347 -0.143791 0.247579 -0.128221 2.358398
0.400000 0.017090 -0.014751 -0.076475 0.311844 -0.148298 2.818658
0.433333 0.026764 -0.020958 0.043773 0.383059 -0.167205 3.260919
0.466667 0.037163 -0.027411 0.182211 0.460229 -0.184206 3.655114
0.500000 0.053415 -0.035449 0.345664 0.541793 -0.199115 3.969992
0.533333 0.076165 -0.043911 0.537966 0.625319 -0.212390 4.183282
0.566667 0.099641 -0.052611 0.689029 0.708850 -0.224616 4.284179
0.600000 0.123838 -0.061547 0.869891 0.790480 -0.236539 4.264570
0.633333 0.152902 -0.069537 1.052076 0.868676 -0.249428 4.127737
0.666667 0.185868 -0.076798 1.221147 0.941446 -0.264185 3.885753
0.700000 0.219518 -0.084289 1.378895 1.007941 -0.281720 3.562229
0.733333 0.256803 -0.091122 1.507662 1.068176 -0.302318 3.183221
0.766667 0.294736 -0.098183 1.600463 1.122281 -0.326421 2.769351
0.800000 0.334547 -0.108052 1.675558 1.170534 -0.354269 2.348377
0.833333 0.374964 -0.118147 1.720914 1.213493 -0.385712 1.942369
0.866667 0.417750 -0.134415 1.759620 1.252487 -0.420344 1.572464
0.900000 0.461097 -0.150896 1.789971 1.288419 -0.457641 1.253348
0.933333 0.504979 -0.167579 1.803092 1.322187 -0.496704 0.993514
0.966667 0.549370 -0.184454 1.820306 1.354672 -0.536316 0.796232
1.000000 0.594244 -0.201513 1.823539 1.386963 -0.575509 0.659708
1.033333 0.639575 -0.218744 1.838063 1.420026 -0.613284 0.577169
1.066667 0.687436 -0.240275 1.849394 1.454129 -0.648991 0.538207
1.100000 0.736976 -0.263874 1.861320 1.489435 -0.681822 0.530408
1.133333 0.786897 -0.288690 1.872575 1.525671 -0.711338 0.541033
1.166667 0.836402 -0.313890 1.880282 1.562630 -0.737212 0.565466
1.200000 0.889526 -0.341462 1.904281 1.599723 -0.758808 0.595372
1.233333 0.942924 -0.369104 1.942530 1.636214 -0.775619 0.625121
1.266667 0.998694 -0.396567 1.976290 1.671776 -0.787507 0.650772
1.300000 1.057001 -0.424141 1.991700 1.706166 -0.794586 0.671462
1.333333 1.115467 -0.451719 2.013457 1.739320 -0.797137 0.689028
1.366667 1.175249 -0.478300 2.036404 1.770579 -0.795608 0.699206
1.400000 1.235106 -0.504842 2.059244 1.800123 -0.790875 0.702061
1.433333 1.294993 -0.531325 2.081231 1.828277 -0.783903 0.700460
1.466667 1.354869 -0.557727 2.098319 1.855334 -0.775364 0.697103
1.500000 1.418095 -0.583873 2.127908 1.881657 -0.765931 0.691399
1.533333 1.481219 -0.609896 2.152782 1.907805 -0.756156 0.680390
1.566667 1.545624 -0.635065 2.177957 1.934944 -0.746442 0.664021
1.600000 1.611107 -0.659567 2.202156 1.963278 -0.736956 0.642879
1.633333 1.677138 -0.683125 2.219432 1.992534 -0.727737 0.616584
1.666667 1.742870 -0.706480 2.254250 2.022362 -0.718801 0.579328
1.700000 1.808252 -0.729614 2.271616 2.052287 -0.709982 0.533654
1.733333 1.876702 -0.753047 2.278447 2.081206 -0.701125 0.480790
1.766667 1.948034 -0.776837 2.300271 2.107367 -0.691869 0.416180
1.800000 2.018854 -0.800346 2.319129 2.129176 -0.681645 0.334261
1.833333 2.091550 -0.823660 2.335288 2.145197 -0.669851 0.224228
1.866667 2.165952 -0.846280 2.344977 2.153271 -0.655733 0.086162
1.900000 2.241831 -0.868454 2.336434 2.150798 -0.638439 -0.089249
1.933333 2.316950 -0.890267 2.334779 2.135331 -0.616994 -0.308346
1.966667 2.391570 -0.911390 2.360253 2.104743 -0.590656 -0.564008
2.000000 2.465301 -0.932116 2.338477 2.057035 -0.558817 -0.847715
2.033333 2.536202 -0.951617 2.357618 1.990749 -0.520998 -1.149592
2.066667 2.606680 -0.970582 2.335778 1.905273 -0.476652 -1.462295
2.100000 2.674348 -0.987526 2.241051 1.801365 -0.425815 -1.772460
2.133333 2.736726 -1.001921 2.157465 1.680479 -0.368710 -2.066721
2.166667 2.797914 -1.015843 2.060519 1.544863 -0.305767 -2.339441
2.200000 2.851460 -1.027039 1.956227 1.397642 -0.237907 -2.586292
2.233333 2.897712 -1.034556 1.852915 1.241674 -0.166254 -2.795348
2.266667 2.936243 -1.039153 1.733014 1.080664 -0.093010 -2.956867
2.300000 2.966548 -1.040654 1.644564 0.917655 -0.020314 -3.069604
2.333333 2.989754 -1.038554 1.545979 0.755939 0.049298 -3.129999
2.366667 3.011563 -1.035970 1.449225 0.597935 0.113318 -3.134525
2.400000 3.024982 -1.028132 1.344140 0.445533 0.169267 -3.084181
2.433333 3.036985 -1.019829 1.218458 0.300301 0.215297 -2.985584
2.466667 3.041599 -1.006948 1.087461 0.163058 0.250518 -2.846193
2.500000 3.044796 -0.993629 0.946855 0.034155 0.274836 -2.665853
2.533333 3.043236 -0.979327 0.843319 -0.086892 0.288811 -2.454240
2.566667 3.037102 -0.965568 0.764439 -0.199767 0.293431 -2.222016
2.600000 3.026835 -0.954396 0.708935 -0.304537 0.290805 -1.977485
2.633333 3.011950 -0.945741 0.668274 -0.400768 0.282947 -1.730870
2.666667 2.995720 -0.936723 0.635836 -0.488641 0.272142 -1.497651
2.700000 2.974899 -0.929390 0.608023 -0.567684 0.260381 -1.295159
2.733333 2.951304 -0.923125 0.569248 -0.637213 0.249620 -1.127823
2.766667 2.926443 -0.916522 0.528945 -0.697358 0.241481 -0.997836
2.800000 2.900346 -0.909590 0.520465 -0.748215 0.236601 -0.907003
2.833333 2.873045 -0.902334 0.508258 -0.790483 0.235147 -0.854462
2.866667 2.844568 -0.894762 0.468308 -0.824517 0.236939 -0.827297
2.900000 2.814949 -0.886881 0.443040 -0.851398 0.241468 -0.814652
2.933333 2.784978 -0.879041 0.419747 -0.872560 0.247907 -0.813323
2.966667 2.753929 -0.870907 0.402720 -0.889071 0.255542 -0.821070
3.000000 2.722932 -0.862128 0.365176 -0.902140 0.263887 -0.828302
3.033333 2.691953 -0.853170 0.338392 -0.912695 0.272662 -0.828330
3.066667 2.662161 -0.843843 0.307508 -0.921506 0.281438 -0.823271
3.100000 2.631412 -0.834250 0.279152 -0.928887 0.289902 -0.813345
3.133333 2.601770 -0.824797 0.247137 -0.934990 0.297929 -0.793410
3.166667 2.570613 -0.814841 0.207162 -0.940126 0.305306 -0.760891
3.200000 2.539048 -0.803987 0.189461 -0.944297 0.311842 -0.722231
3.233333 2.506637 -0.792899 0.168140 -0.947385 0.317354 -0.679932
3.266667 2.473999 -0.782116 0.135488 -0.949568 0.321889 -0.633892
3.300000 2.441832 -0.770691 0.115618 -0.951257 0.325494 -0.584394
3.333333 2.408931 -0.759379 0.113900 -0.952518 0.328150 -0.537509
3.366667 2.375295 -0.747868 0.088189 -0.953271 0.329908 -0.493949
3.400000 2.344827 -0.736871 0.081512 -0.953619 0.330898 -0.454249
3.433333 2.314892 -0.726254 0.057403 -0.953853 0.331309 -0.417466
3.466667 2.284294 -0.715460 0.060454 -0.954049 0.331233 -0.386684
3.500000 2.253055 -0.704495 0.033772 -0.954116 0.330915 -0.360336
3.533333 2.221199 -0.693368 0.033915 -0.954175 0.330595 -0.337489
3.566667 2.188746 -0.682085 0.012505 -0.954587 0.330513 -0.319553
3.600000 2.155721 -0.670655 0.007235 -0.955403 0.330798 -0.304509
3.633333 2.123029 -0.659852 -0.011479 -0.956546 0.331552 -0.293850
3.666667 2.090088 -0.649016 -0.006565 -0.957765 0.332747 -0.284650
3.700000 2.058379 -0.638169 -0.011389 -0.958986 0.334264 -0.280284
3.733333 2.027988 -0.627584 -0.024629 -0.960262 0.336036 -0.278333
3.766667 1.997129 -0.616884 -0.038664 -0.961443 0.337971 -0.278671
3.800000 1.965537 -0.605355 -0.042060 -0.962524 0.339942 -0.281174
3.833333 1.933514 -0.593724 -0.051894 -0.963455 0.341744 -0.285289
3.866667 1.901077 -0.581996 -0.062339 -0.964558 0.343330 -0.290352
3.900000 1.868246 -0.570180 -0.072188 -0.965863 0.344638 -0.292997
3.933333 1.835040 -0.558282 -0.084223 -0.967097 0.345539 -0.293915
3.966667 1.801477 -0.546310 -0.100588 -0.968019 0.345885 -0.291453
4.000000 1.769938 -0.534982 -0.100841 -0.968528 0.345672 -0.286029
4.033333 1.738079 -0.523592 -0.113645 -0.968792 0.344978 -0.276841
4.066667 1.705916 -0.512146 -0.125657 -0.968807 0.343829 -0.264921
4.100000 1.674197 -0.500823 -0.135930 -0.968773 0.342278 -0.250167
4.133333 1.642208 -0.489455 -0.144815 -0.969252 0.340410 -0.233670
4.166667 1.609963 -0.478049 -0.153386 -0.971198 0.338455 -0.217487
4.200000 1.577478 -0.466611 -0.159759 -0.975505 0.336581 -0.200184
4.233333 1.544771 -0.455146 -0.162006 -0.982938 0.334907 -0.182760
4.266667 1.511856 -0.443661 -0.169314 -0.994451 0.333618 -0.165134
4.300000 1.479868 -0.432754 -0.169858 -1.011278 0.332953 -0.150327
4.333333 1.448911 -0.422258 -0.179350 -1.034321 0.333179 -0.137674
4.366667 1.415462 -0.411558 -0.182342 -1.063659 0.334375 -0.124923
4.400000 1.381866 -0.400859 -0.193456 -1.099136 0.336552 -0.112832
4.433333 1.348141 -0.390166 -0.179287 -1.140262 0.339762 -0.105086
4.466667 1.311743 -0.379456 -0.193059 -1.186284 0.343946 -0.099615
4.500000 1.272085 -0.368038 -0.198433 -1.235591 0.348928 -0.095317
4.533333 1.230419 -0.356094 -0.200576 -1.286419 0.354423 -0.091361
4.566667 1.185568 -0.344342 -0.196465 -1.337339 0.360262 -0.092198
4.600000 1.138399 -0.331858 -0.205057 -1.386793 0.366256 -0.097532
4.633333 1.087464 -0.318993 -0.200591 -1.433170 0.372167 -0.101073
4.666667 1.036578 -0.306187 -0.216587 -1.474816 0.377813 -0.106394
4.700000 0.985776 -0.293446 -0.201994 -1.510678 0.383009 -0.113644
4.733333 0.935094 -0.280779 -0.204503 -1.540133 0.387702 -0.124211
4.766667 0.884567 -0.268194 -0.231642 -1.562680 0.391700 -0.129494
4.800000 0.830131 -0.255461 -0.224055 -1.578061 0.394931 -0.132132
4.833333 0.773912 -0.241580 -0.230613 -1.586485 0.397292 -0.132135
4.866667 0.717963 -0.227808 -0.230905 -1.588267 0.398645 -0.127255
4.900000 0.662973 -0.213994 -0.248241 -1.583402 0.398892 -0.115326
4.933333 0.609506 -0.200356 -0.240307 -1.571531 0.397836 -0.095801
4.966667 0.556432 -0.186854 -0.249318 -1.552311 0.395458 -0.077112
5.000000 0.503600 -0.173187 -0.264194 -1.525788 0.391685 -0.056075
5.033333 0.451240 -0.159675 -0.258779 -1.491554 0.386502 -0.037879
5.066667 0.399389 -0.146328 -0.267715 -1.448665 0.379791 -0.023812
5.100000 0.351964 -0.133942 -0.252144 -1.396970 0.371506 -0.017582
5.133333 0.305122 -0.121737 -0.251766 -1.336725 0.361718 -0.017136
5.166667 0.258895 -0.109721 -0.244093 -1.267874 0.350207 -0.019115
5.200000 0.213317 -0.097903 -0.236513 -1.190064 0.336784 -0.024598
5.233333 0.171849 -0.086172 -0.245058 -1.104023 0.321386 -0.025504
5.266667 0.134621 -0.075378 -0.245246 -1.011472 0.304020 -0.022651
5.300000 0.101997 -0.064566 -0.248578 -0.913586 0.284540 -0.012943
5.333333 0.070126 -0.053976 -0.256188 -0.811345 0.262747 0.000759
5.366667 0.044758 -0.045014 -0.271103 -0.707216 0.238942 0.017131
5.400000 0.026942 -0.037864 -0.280877 -0.604213 0.213534 0.035655
5.433333 0.009913 -0.030947 -0.283044 -0.504303 0.186833 0.046863
5.466667 -0.006327 -0.024266 -0.267824 -0.409170 0.159406 0.052286
5.500000 -0.014110 -0.020082 -0.251226 -0.321022 0.132186 0.050235
5.533333 -0.021108 -0.016134 -0.234828 -0.242169 0.106168 0.040559
5.566667 -0.027327 -0.012422 -0.201310 -0.173325 0.081953 0.021497
5.600000 -0.027516 -0.011975 -0.220848 -0.114611 0.060129 -0.005507
5.633333 -0.026947 -0.011759 -0.231305 -0.066519 0.041321 -0.033843
5.666667 -0.025635 -0.011770 -0.235425 -0.029384 0.025959 -0.061014
5.700000 -0.024152 -0.012165 -0.254083 -0.002243 0.013977 -0.083573
5.733333 -0.021956 -0.012780 -0.259676 0.016104 0.005188 -0.099371
5.766667 -0.019063 -0.013610 -0.271024 0.026539 -0.000510 -0.101614
5.800000 -0.015487 -0.014652 -0.275289 0.030487 -0.003586 -0.092788
5.833333 -0.013760 -0.014967 -0.275465 0.029782 -0.004695 -0.076704
5.866667 -0.012729 -0.014787 -0.268731 0.026259 -0.004515 -0.057301
