t x y theta dxdt dydt dthetadt
0.000000 0.000000 0.000000 -0.242053 -0.106966 0.007662 0.003548
0.033333 -0.003740 -0.000052 -0.229891 -0.102269 0.004382 0.005750
0.066667 -0.007445 0.000170 -0.232907 -0.096117 0.001527 0.007147
0.100000 -0.011221 -0.000000 -0.231771 -0.088622 -0.000887 0.009622
0.133333 -0.014454 -0.000300 -0.236181 -0.080091 -0.002623 0.011532
0.166667 -0.017650 -0.000295 -0.239602 -0.070855 -0.003734 0.014631
0.200000 -0.020809 0.000023 -0.237549 -0.061193 -0.004423 0.015542
0.233333 -0.022218 -0.000264 -0.243088 -0.051473 -0.004780 0.018257
0.266667 -0.022743 -0.001192 -0.229696 -0.042149 -0.004770 0.019914
0.300000 -0.023233 -0.001772 -0.231592 -0.033564 -0.004303 0.020730
0.333333 -0.023691 -0.001994 -0.222819 -0.025906 -0.003441 0.019590
0.366667 -0.024120 -0.001846 -0.235736 -0.019380 -0.002008 0.016497
0.400000 -0.024521 -0.001318 -0.225601 -0.014208 0.000245 0.012829
0.433333 -0.024716 -0.001563 -0.226508 -0.010339 0.003505 0.006496
0.466667 -0.024888 -0.001406 -0.223664 -0.007580 0.007796 0.003025
0.500000 -0.024975 -0.001984 -0.232926 -0.005759 0.013457 0.005227
0.533333 -0.025042 -0.002135 -0.230966 -0.004819 0.021263 0.018967
0.566667 -0.025091 -0.001846 -0.230472 -0.004666 0.031927 0.050739
0.600000 -0.025125 -0.001105 -0.228946 -0.005385 0.046618 0.107544
0.633333 -0.025146 0.000099 -0.230738 -0.007174 0.066383 0.197106
0.666667 -0.025155 0.001778 -0.228236 -0.010493 0.092748 0.322368
0.700000 -0.025350 0.003735 -0.243080 -0.015843 0.126837 0.486093
0.733333 -0.025536 0.006190 -0.238580 -0.023705 0.169191 0.685482
0.766667 -0.025717 0.009152 -0.227409 -0.034662 0.220513 0.910252
0.800000 -0.025892 0.012633 -0.195120 -0.048933 0.280574 1.146869
0.833333 -0.026569 0.019756 -0.168414 -0.066620 0.349062 1.375984
0.866667 -0.028114 0.032260 -0.115856 -0.087331 0.424709 1.577985
0.900000 -0.029661 0.045298 -0.035456 -0.110441 0.505962 1.730101
0.933333 -0.033389 0.064387 0.038918 -0.134874 0.590866 1.816290
0.966667 -0.037118 0.084005 0.147918 -0.159288 0.677187 1.826363
1.000000 -0.043133 0.108965 0.256511 -0.182208 0.762755 1.757665
1.033333 -0.051008 0.138027 0.346638 -0.202261 0.845446 1.615869
1.066667 -0.060346 0.170404 0.425038 -0.218294 0.923593 1.411243
1.100000 -0.070776 0.205462 0.474527 -0.229140 0.995631 1.164320
1.133333 -0.081180 0.240978 0.495751 -0.234274 1.060847 0.894188
1.166667 -0.090491 0.277981 0.499779 -0.233507 1.118449 0.624196
1.200000 -0.099359 0.318501 0.499728 -0.227324 1.168180 0.374691
1.233333 -0.108177 0.359409 0.480850 -0.216390 1.210261 0.160207
1.266667 -0.115798 0.402248 0.459909 -0.201742 1.245120 -0.009432
1.300000 -0.122450 0.446474 0.443394 -0.184772 1.273533 -0.130113
1.333333 -0.127508 0.491126 0.425130 -0.166792 1.295988 -0.201975
1.366667 -0.132492 0.536051 0.427196 -0.148864 1.313242 -0.233414
1.400000 -0.136600 0.581163 0.417488 -0.131750 1.326289 -0.234157
1.433333 -0.139915 0.626102 0.409865 -0.116130 1.335777 -0.214063
1.466667 -0.142644 0.670601 0.395612 -0.102385 1.342453 -0.178629
1.500000 -0.145284 0.715254 0.390465 -0.090651 1.347055 -0.138360
1.533333 -0.147833 0.760031 0.391948 -0.080793 1.350402 -0.099373
1.566667 -0.150208 0.805418 0.394021 -0.072770 1.353185 -0.063716
1.600000 -0.152486 0.850869 0.367361 -0.066399 1.355623 -0.030823
1.633333 -0.154356 0.896284 0.385265 -0.061400 1.357918 -0.001542
1.666667 -0.155911 0.941015 0.389684 -0.057447 1.359932 0.021639
1.700000 -0.157363 0.985719 0.398177 -0.054256 1.361407 0.041104
1.733333 -0.158941 1.031589 0.401656 -0.051630 1.361676 0.058033
1.766667 -0.160413 1.077370 0.405698 -0.049359 1.360062 0.073701
1.800000 -0.162280 1.123346 0.402130 -0.047258 1.355796 0.083448
1.833333 -0.164084 1.169342 0.396908 -0.045142 1.347851 0.089526
1.866667 -0.165686 1.215135 0.405803 -0.042852 1.335386 0.091466
1.900000 -0.167169 1.260713 0.405337 -0.040232 1.317582 0.089679
1.933333 -0.168533 1.306044 0.410303 -0.037200 1.293920 0.083952
1.966667 -0.169773 1.351096 0.420426 -0.033645 1.263643 0.072222
2.000000 -0.171052 1.394522 0.422067 -0.029537 1.226121 0.057354
2.033333 -0.172201 1.437608 0.424596 -0.024890 1.181301 0.038851
2.066667 -0.173017 1.477434 0.434385 -0.019776 1.128962 0.019781
2.100000 -0.173725 1.515702 0.442216 -0.014328 1.068661 0.000603
2.133333 -0.174082 1.551448 0.432785 -0.008644 1.000571 -0.016240
2.166667 -0.174236 1.583542 0.427378 -0.002889 0.925830 -0.027650
2.200000 -0.174241 1.615175 0.414396 0.002757 0.845860 -0.030988
2.233333 -0.174096 1.646329 0.407002 0.008106 0.761820 -0.025119
2.266667 -0.173882 1.672323 0.414624 0.013044 0.675595 -0.011261
2.300000 -0.173158 1.693099 0.410113 0.017549 0.589927 0.012481
2.333333 -0.171974 1.708614 0.402773 0.021572 0.507329 0.042215
2.366667 -0.170622 1.723609 0.406761 0.025108 0.429540 0.076131
2.400000 -0.169390 1.733784 0.412384 0.028184 0.358662 0.109548
2.433333 -0.168722 1.739499 0.417830 0.030914 0.297096 0.138834
2.466667 -0.167873 1.744699 0.436720 0.033314 0.246202 0.161367
2.500000 -0.166838 1.749390 0.435423 0.035398 0.206315 0.173235
2.533333 -0.165602 1.752518 0.442026 0.037262 0.176995 0.174853
2.566667 -0.164350 1.755293 0.451354 0.038937 0.157784 0.165317
2.600000 -0.162991 1.758762 0.457880 0.040408 0.147132 0.147570
2.633333 -0.161434 1.761754 0.478300 0.041521 0.142833 0.123311
2.666667 -0.159986 1.765688 0.478213 0.042271 0.142927 0.097222
2.700000 -0.158277 1.771002 0.483355 0.042619 0.145684 0.069603
2.733333 -0.156720 1.777313 0.480948 0.042510 0.149588 0.043292
2.766667 -0.154949 1.783171 0.474797 0.041996 0.153208 0.020463
2.800000 -0.153682 1.789298 0.464195 0.041266 0.155784 0.002095
2.833333 -0.152192 1.794978 0.468205 0.040567 0.156885 -0.010051
2.866667 -0.150474 1.800214 0.465973 0.040037 0.156378 -0.018005
2.900000 -0.149318 1.805548 0.462647 0.039818 0.154459 -0.018977
2.933333 -0.148745 1.811182 0.468846 0.040018 0.151637 -0.015895
2.966667 -0.147927 1.816381 0.469731 0.040628 0.148517 -0.009043
3.000000 -0.146858 1.821147 0.467958 0.041548 0.145431 -0.001600
3.033333 -0.145531 1.825484 0.462366 0.042611 0.142759 0.006193
