t x y theta dxdt dydt dthetadt
0.000000 0.000000 0.000000 -0.451812 -0.002380 0.011370 0.011925
0.033333 -0.000080 0.000319 -0.448061 -0.003194 0.014872 0.010623
0.066667 -0.000204 0.000917 -0.442992 -0.004264 0.019354 0.008913
0.100000 -0.000425 0.001335 -0.440173 -0.005780 0.025432 0.013924
0.133333 -0.000690 0.002044 -0.440625 -0.008030 0.034010 0.029889
0.166667 -0.000760 0.002457 -0.437111 -0.011429 0.046241 0.064502
0.200000 -0.000876 0.003174 -0.435696 -0.016362 0.063215 0.120827
0.233333 -0.001040 0.004202 -0.448378 -0.023125 0.085734 0.211864
0.266667 -0.001253 0.005546 -0.449260 -0.031904 0.114305 0.338912
0.300000 -0.001694 0.007701 -0.447142 -0.042772 0.149199 0.498913
0.333333 -0.002410 0.010853 -0.438132 -0.055589 0.190324 0.685975
0.366667 -0.003579 0.015289 -0.450191 -0.069890 0.236800 0.890045
0.400000 -0.005429 0.021816 -0.420316 -0.085104 0.287893 1.099408
0.433333 -0.008212 0.031158 -0.377628 -0.100561 0.343081 1.291794
0.466667 -0.012225 0.044294 -0.315790 -0.115466 0.401991 1.456104
0.500000 -0.017841 0.061630 -0.232102 -0.128915 0.463639 1.578425
0.533333 -0.023498 0.079278 -0.150854 -0.140133 0.526884 1.650304
0.566667 -0.029190 0.097227 -0.048540 -0.148566 0.591112 1.663991
0.600000 -0.034912 0.115467 0.014489 -0.153886 0.655793 1.621629
0.633333 -0.041162 0.137641 0.082473 -0.156000 0.719928 1.532391
0.666667 -0.047462 0.163412 0.137679 -0.155164 0.782226 1.403369
0.700000 -0.053776 0.189423 0.171403 -0.151930 0.842481 1.250760
0.733333 -0.059229 0.218570 0.199214 -0.146913 0.900466 1.089499
0.766667 -0.063909 0.251382 0.220451 -0.140789 0.955794 0.937786
0.800000 -0.067710 0.287897 0.252121 -0.134278 1.007472 0.804329
0.833333 -0.071508 0.324548 0.260706 -0.128044 1.055202 0.695351
0.866667 -0.075301 0.361301 0.270642 -0.122627 1.099330 0.614978
0.900000 -0.079085 0.398123 0.291319 -0.118435 1.139569 0.560678
0.933333 -0.082524 0.438313 0.296129 -0.115761 1.175841 0.529470
0.966667 -0.085950 0.478503 0.316283 -0.114703 1.208194 0.511221
1.000000 -0.089358 0.518656 0.332337 -0.115105 1.237252 0.502218
1.033333 -0.092879 0.560799 0.344367 -0.116759 1.263166 0.497236
1.066667 -0.096378 0.602829 0.362578 -0.119372 1.285658 0.491504
1.100000 -0.100219 0.647147 0.393133 -0.122568 1.304266 0.479981
1.133333 -0.104486 0.693031 0.414960 -0.125954 1.318526 0.458174
1.166667 -0.108721 0.738678 0.423983 -0.129215 1.327742 0.431037
1.200000 -0.113399 0.784964 0.435317 -0.132106 1.331001 0.398422
1.233333 -0.118330 0.831287 0.457311 -0.134381 1.327708 0.362775
1.266667 -0.123240 0.877211 0.478470 -0.135785 1.316841 0.325597
1.300000 -0.128061 0.922102 0.477289 -0.136179 1.298066 0.290492
1.333333 -0.132828 0.966535 0.487317 -0.135513 1.271428 0.256132
1.366667 -0.137536 1.010466 0.485380 -0.133741 1.236717 0.218057
1.400000 -0.142181 1.053851 0.488263 -0.130892 1.193889 0.175656
1.433333 -0.146610 1.095498 0.482657 -0.127050 1.142891 0.126372
1.466667 -0.151048 1.134383 0.492868 -0.122397 1.084146 0.070876
1.500000 -0.155128 1.169591 0.509362 -0.117088 1.017938 0.008004
1.533333 -0.159126 1.204097 0.516692 -0.111249 0.944232 -0.057942
1.566667 -0.163040 1.237867 0.539682 -0.105093 0.863692 -0.129563
1.600000 -0.166298 1.264707 0.546791 -0.098876 0.777055 -0.209742
1.633333 -0.169464 1.290752 0.515225 -0.092815 0.684503 -0.298226
1.666667 -0.172533 1.315975 0.469733 -0.087074 0.586547 -0.394832
1.700000 -0.174945 1.331830 0.450545 -0.081808 0.483750 -0.497887
1.733333 -0.177255 1.346823 0.444123 -0.077141 0.376466 -0.608155
1.766667 -0.179460 1.360940 0.423796 -0.073115 0.265303 -0.717211
1.800000 -0.181623 1.365405 0.429278 -0.069527 0.151152 -0.822399
1.833333 -0.183675 1.368975 0.407202 -0.066033 0.035492 -0.920760
1.866667 -0.185614 1.371648 0.366720 -0.062308 -0.080202 -1.012049
1.900000 -0.187648 1.367687 0.316541 -0.057955 -0.194715 -1.090845
1.933333 -0.189979 1.358338 0.274439 -0.052610 -0.306039 -1.147894
1.966667 -0.192335 1.344083 0.215471 -0.045915 -0.412314 -1.178634
2.000000 -0.194455 1.325684 0.176765 -0.037571 -0.512660 -1.174401
2.033333 -0.196345 1.303838 0.130900 -0.027557 -0.605958 -1.132895
2.066667 -0.197717 1.278654 0.075218 -0.015877 -0.691165 -1.053014
2.100000 -0.198956 1.252668 0.026878 -0.002609 -0.767706 -0.942403
2.133333 -0.199162 1.223835 -0.024861 0.012053 -0.835801 -0.811249
2.166667 -0.197699 1.192092 -0.051517 0.027764 -0.896168 -0.671519
2.200000 -0.196102 1.159634 -0.070769 0.043928 -0.949091 -0.533882
2.233333 -0.194372 1.126495 -0.070680 0.060095 -0.995474 -0.406818
2.266667 -0.192512 1.092708 -0.052432 0.075881 -1.036646 -0.297578
2.300000 -0.190522 1.058306 -0.039504 0.090916 -1.073464 -0.208886
2.333333 -0.186063 1.020073 -0.039499 0.104848 -1.106526 -0.144003
2.366667 -0.181479 0.981298 -0.039508 0.117654 -1.136415 -0.103224
2.400000 -0.176776 0.942018 -0.046281 0.129411 -1.163497 -0.084963
2.433333 -0.171959 0.902272 -0.059171 0.140368 -1.187844 -0.086806
2.466667 -0.167030 0.862099 -0.063174 0.150745 -1.209320 -0.104018
2.500000 -0.161996 0.821537 -0.061634 0.161039 -1.227403 -0.132417
2.533333 -0.156335 0.779313 -0.074283 0.171974 -1.241764 -0.167975
2.566667 -0.150577 0.736780 -0.079642 0.184019 -1.251981 -0.207128
2.600000 -0.144730 0.693980 -0.071839 0.197959 -1.257271 -0.251861
2.633333 -0.138797 0.650954 -0.070948 0.214457 -1.256498 -0.300068
2.666667 -0.132511 0.607309 -0.074966 0.234149 -1.248500 -0.351447
2.700000 -0.125400 0.564038 -0.094015 0.257050 -1.232939 -0.405881
2.733333 -0.118223 0.520664 -0.107265 0.283095 -1.208848 -0.462505
2.766667 -0.108824 0.478210 -0.147932 0.312098 -1.175309 -0.518910
2.800000 -0.099375 0.435735 -0.164915 0.343327 -1.132370 -0.568106
2.833333 -0.086538 0.397935 -0.172724 0.375203 -1.081030 -0.608202
2.866667 -0.073674 0.360190 -0.192800 0.405885 -1.022056 -0.638217
2.900000 -0.060796 0.322532 -0.221684 0.433571 -0.955508 -0.658009
2.933333 -0.044655 0.290731 -0.257259 0.455756 -0.882892 -0.664640
2.966667 -0.025629 0.265289 -0.281189 0.469710 -0.805960 -0.657637
3.000000 -0.006642 0.240018 -0.297114 0.472985 -0.725993 -0.637468
3.033333 0.012288 0.214940 -0.321399 0.464193 -0.643783 -0.602265
3.066667 0.031274 0.197534 -0.335122 0.442539 -0.561344 -0.551738
3.100000 0.050160 0.180352 -0.374868 0.407760 -0.481343 -0.482242
3.133333 0.068927 0.163407 -0.388279 0.360839 -0.405392 -0.399322
3.166667 0.084427 0.151468 -0.395242 0.304035 -0.334771 -0.309006
3.200000 0.096086 0.143581 -0.414381 0.239925 -0.271067 -0.218132
3.233333 0.103175 0.138823 -0.442686 0.171605 -0.216285 -0.132686
3.266667 0.105663 0.136414 -0.436519 0.102405 -0.171253 -0.055381
3.300000 0.103787 0.135609 -0.429418 0.035947 -0.136402 0.005948
3.333333 0.101737 0.135042 -0.400417 -0.024668 -0.112102 0.049907
3.366667 0.096243 0.134584 -0.375795 -0.077185 -0.098307 0.080494
3.400000 0.090585 0.134350 -0.372261 -0.119867 -0.094462 0.100204
3.433333 0.082912 0.132780 -0.361843 -0.152023 -0.099024 0.107339
3.466667 0.074363 0.129294 -0.357856 -0.173870 -0.110075 0.102934
3.500000 0.065680 0.126017 -0.376012 -0.186491 -0.125593 0.089407
3.533333 0.056873 0.122944 -0.390928 -0.191037 -0.143728 0.072286
3.566667 0.049595 0.117519 -0.394096 -0.189095 -0.162831 0.049986
3.600000 0.043959 0.109655 -0.386910 -0.182304 -0.181090 0.022190
3.633333 0.038227 0.101994 -0.374075 -0.172194 -0.197113 -0.007238
3.666667 0.032408 0.094535 -0.368758 -0.160073 -0.210302 -0.039761
3.700000 0.026509 0.087281 -0.349565 -0.146902 -0.220180 -0.075664
3.733333 0.021806 0.078665 -0.352576 -0.133690 -0.226015 -0.115845
3.766667 0.018103 0.069642 -0.361167 -0.120929 -0.227368 -0.156441
3.800000 0.015346 0.061092 -0.359972 -0.108801 -0.224395 -0.194877
3.833333 0.012532 0.052757 -0.387823 -0.097447 -0.217557 -0.227802
3.866667 0.009665 0.044639 -0.401157 -0.086828 -0.207097 -0.250459
3.900000 0.006750 0.036740 -0.423018 -0.076906 -0.193267 -0.256860
3.933333 0.003791 0.029062 -0.436948 -0.067552 -0.176827 -0.248823
3.966667 0.002020 0.023860 -0.440890 -0.058809 -0.158776 -0.229337
4.000000 0.000211 0.018881 -0.459743 -0.050698 -0.139849 -0.197915
4.033333 -0.001632 0.014124 -0.469093 -0.043138 -0.120597 -0.159040
4.066667 -0.002780 0.011071 -0.456016 -0.036171 -0.101728 -0.118388
4.100000 -0.003277 0.009174 -0.450234 -0.029897 -0.084035 -0.082964
4.133333 -0.003803 0.007492 -0.453804 -0.024451 -0.068083 -0.052214
4.166667 -0.004355 0.006022 -0.455999 -0.019790 -0.053950 -0.027252
4.200000 -0.004540 0.004978 -0.457794 -0.015984 -0.041754 -0.010754
4.233333 -0.004749 0.004137 -0.455196 -0.013115 -0.031632 -0.003330
4.266667 -0.004981 0.003493 -0.460342 -0.011112 -0.023476 0.000248
4.300000 -0.005234 0.003042 -0.452723 -0.009779 -0.017027 0.002737
4.333333 -0.005508 0.002779 -0.454126 -0.008943 -0.011968 0.002957
4.366667 -0.005800 0.002700 -0.449196 -0.008538 -0.008127 0.002100
