t x y theta dxdt dydt dthetadt
0.000000 0.000000 0.000000 2.985702 -0.036415 0.146776 -0.457456
0.033333 -0.001213 0.004920 2.989910 -0.036287 0.148661 -0.606736
0.066667 -0.002426 0.009907 2.967037 -0.036134 0.150546 -0.768465
0.100000 -0.003637 0.014960 2.946881 -0.035954 0.152428 -0.936149
0.133333 -0.004839 0.020073 2.911847 -0.035746 0.154306 -1.104571
0.166667 -0.006039 0.025254 2.851927 -0.035511 0.156180 -1.271187
0.200000 -0.007227 0.030496 2.799848 -0.035248 0.158050 -1.428139
0.233333 -0.008405 0.035797 2.729618 -0.034958 0.159917 -1.566757
0.266667 -0.009571 0.041160 2.667750 -0.034645 0.161783 -1.678354
0.300000 -0.010724 0.046582 2.617340 -0.034310 0.163650 -1.751709
0.333333 -0.011864 0.052065 2.554493 -0.033954 0.165520 -1.775420
0.366667 -0.012991 0.057608 2.498755 -0.033581 0.167394 -1.738608
0.400000 -0.014103 0.063212 2.435058 -0.033193 0.169275 -1.636265
0.433333 -0.015205 0.068883 2.362304 -0.032791 0.171163 -1.472804
0.466667 -0.016297 0.074623 2.279119 -0.032377 0.173059 -1.254737
0.500000 -0.017373 0.080422 2.183737 -0.031951 0.174964 -0.990589
0.533333 -0.018436 0.086289 2.124195 -0.031513 0.176878 -0.694595
0.566667 -0.019481 0.092214 2.102380 -0.031063 0.178800 -0.383449
0.600000 -0.020513 0.098206 2.122998 -0.030601 0.180730 -0.076334
0.633333 -0.021526 0.104258 2.160720 -0.030123 0.182665 0.207178
0.666667 -0.022523 0.110375 2.204718 -0.029630 0.184603 0.446628
0.700000 -0.023505 0.116558 2.254690 -0.029119 0.186541 0.620955
0.733333 -0.024471 0.122807 2.301348 -0.028588 0.188474 0.714077
0.766667 -0.025420 0.129123 2.332390 -0.028032 0.190395 0.717992
0.800000 -0.026352 0.135505 2.376869 -0.027451 0.192302 0.630208
0.833333 -0.027265 0.141954 2.408051 -0.026842 0.194189 0.461970
0.866667 -0.028159 0.148469 2.439519 -0.026202 0.196054 0.226995
0.900000 -0.029034 0.155050 2.464269 -0.025531 0.197896 -0.058366
0.933333 -0.029883 0.161688 2.482845 -0.024830 0.199714 -0.373375
0.966667 -0.030706 0.168382 2.444909 -0.024099 0.201513 -0.701061
1.000000 -0.031503 0.175132 2.416220 -0.023341 0.203292 -1.018563
1.033333 -0.032272 0.181937 2.378457 -0.022555 0.205057 -1.307248
1.066667 -0.033013 0.188797 2.307312 -0.021746 0.206812 -1.548005
1.100000 -0.033725 0.195712 2.229752 -0.020913 0.208558 -1.723826
1.133333 -0.034413 0.202694 2.129891 -0.020058 0.210297 -1.822263
1.166667 -0.035071 0.209730 2.040879 -0.019182 0.212029 -1.834251
1.200000 -0.035701 0.216831 1.963949 -0.018284 0.213754 -1.762369
1.233333 -0.036304 0.223997 1.882848 -0.017364 0.215473 -1.621237
1.266667 -0.036874 0.231215 1.823674 -0.016422 0.217180 -1.431350
1.300000 -0.037412 0.238485 1.725618 -0.015456 0.218874 -1.208081
1.333333 -0.037915 0.245805 1.684630 -0.014465 0.220554 -0.977058
1.366667 -0.038386 0.253188 1.705725 -0.013451 0.222220 -0.765200
1.400000 -0.038824 0.260634 1.719815 -0.012413 0.223872 -0.594359
1.433333 -0.039225 0.268129 1.722370 -0.011351 0.225509 -0.475039
1.466667 -0.039590 0.275672 1.734192 -0.010267 0.227135 -0.409277
1.500000 -0.039917 0.283262 1.742317 -0.009161 0.228752 -0.409441
1.533333 -0.040209 0.290916 1.754194 -0.008032 0.230362 -0.469614
1.566667 -0.040464 0.298633 1.735551 -0.006881 0.231966 -0.571493
1.600000 -0.040679 0.306396 1.709305 -0.005707 0.233564 -0.694104
1.633333 -0.040855 0.314202 1.692859 -0.004510 0.235160 -0.823075
1.666667 -0.040991 0.322072 1.645462 -0.003290 0.236751 -0.945597
1.700000 -0.041085 0.329985 1.597908 -0.002045 0.238332 -1.042494
1.733333 -0.041139 0.337959 1.539682 -0.000777 0.239900 -1.102235
1.766667 -0.041149 0.345975 1.482262 0.000515 0.241454 -1.126197
1.800000 -0.041116 0.354051 1.450267 0.001832 0.242992 -1.122057
1.833333 -0.041038 0.362187 1.393054 0.003173 0.244510 -1.088628
1.866667 -0.040915 0.370382 1.351451 0.004538 0.246006 -1.032568
1.900000 -0.040746 0.378614 1.318021 0.005929 0.247480 -0.957850
1.933333 -0.040530 0.386904 1.309992 0.007344 0.248932 -0.876482
1.966667 -0.040267 0.395229 1.283638 0.008784 0.250356 -0.789918
2.000000 -0.039957 0.403587 1.269348 0.010248 0.251747 -0.697948
2.033333 -0.039598 0.412000 1.239650 0.011736 0.253106 -0.607697
2.066667 -0.039187 0.420465 1.219240 0.013247 0.254427 -0.520643
2.100000 -0.038725 0.428981 1.184369 0.014781 0.255705 -0.440858
2.133333 -0.038210 0.437547 1.168992 0.016337 0.256939 -0.361274
2.166667 -0.037646 0.446141 1.166180 0.017915 0.258125 -0.288097
2.200000 -0.037026 0.454781 1.154738 0.019515 0.259260 -0.222233
2.233333 -0.036352 0.463464 1.174655 0.021138 0.260342 -0.166304
2.266667 -0.035625 0.472172 1.151644 0.022784 0.261368 -0.118181
2.300000 -0.034841 0.480920 1.167737 0.024453 0.262338 -0.081185
2.333333 -0.034005 0.489689 1.170997 0.026146 0.263254 -0.061034
2.366667 -0.033115 0.498479 1.174479 0.027860 0.264114 -0.053146
2.400000 -0.032165 0.507302 1.163576 0.029596 0.264919 -0.056416
2.433333 -0.031155 0.516156 1.168655 0.031351 0.265669 -0.064922
2.466667 -0.030083 0.525040 1.170333 0.033125 0.266362 -0.080205
2.500000 -0.028950 0.533950 1.155387 0.034915 0.266996 -0.092783
2.533333 -0.027761 0.542874 1.151562 0.036719 0.267565 -0.092041
2.566667 -0.026508 0.551820 1.151952 0.038536 0.268067 -0.071578
2.600000 -0.025192 0.560784 1.143362 0.040365 0.268496 -0.025799
2.633333 -0.023818 0.569757 1.146155 0.042206 0.268849 0.048287
2.666667 -0.022380 0.578744 1.129894 0.044060 0.269122 0.156819
2.700000 -0.020884 0.587736 1.121621 0.045929 0.269315 0.296967
2.733333 -0.019330 0.596733 1.121684 0.047814 0.269424 0.459033
2.766667 -0.017710 0.605733 1.125600 0.049717 0.269450 0.635253
2.800000 -0.016024 0.614734 1.128097 0.051641 0.269395 0.816971
2.833333 -0.014279 0.623734 1.160397 0.053586 0.269261 0.996805
2.866667 -0.012467 0.632728 1.227857 0.055552 0.269051 1.161344
2.900000 -0.010588 0.641712 1.293694 0.057539 0.268769 1.299668
2.933333 -0.008641 0.650682 1.366525 0.059543 0.268423 1.406797
2.966667 -0.006626 0.659636 1.422443 0.061560 0.268019 1.476801
3.000000 -0.004542 0.668573 1.467052 0.063587 0.267565 1.507267
3.033333 -0.002390 0.677490 1.532625 0.065618 0.267071 1.495790
3.066667 -0.000169 0.686389 1.578379 0.067647 0.266542 1.451742
3.100000 0.002122 0.695267 1.631792 0.069669 0.265987 1.383568
3.133333 0.004483 0.704125 1.682295 0.071682 0.265410 1.299018
3.166667 0.006913 0.712963 1.733417 0.073683 0.264815 1.205401
3.200000 0.009413 0.721780 1.760866 0.075669 0.264202 1.107454
3.233333 0.011973 0.730580 1.796120 0.077638 0.263571 1.011594
3.266667 0.014592 0.739361 1.829270 0.079593 0.262919 0.916602
3.300000 0.017282 0.748121 1.847601 0.081533 0.262244 0.823493
3.333333 0.020031 0.756859 1.877819 0.083458 0.261542 0.732864
3.366667 0.022849 0.765573 1.899060 0.085371 0.260809 0.645620
3.400000 0.025727 0.774263 1.916394 0.087274 0.260040 0.561220
3.433333 0.028673 0.782927 1.936126 0.089168 0.259233 0.479254
3.466667 0.031679 0.791565 1.954576 0.091054 0.258385 0.400139
3.500000 0.034744 0.800174 1.968744 0.092932 0.257492 0.324231
3.533333 0.037876 0.808753 1.976239 0.094802 0.256554 0.248904
3.566667 0.041067 0.817300 1.981012 0.096663 0.255568 0.175211
3.600000 0.044324 0.825813 1.982707 0.098514 0.254532 0.106505
3.633333 0.047639 0.834293 1.976431 0.100356 0.253441 0.044245
3.666667 0.051019 0.842734 1.989408 0.102186 0.252295 -0.011388
3.700000 0.054457 0.851138 1.985165 0.104005 0.251090 -0.060846
3.733333 0.057959 0.859500 1.970499 0.105812 0.249823 -0.099207
3.766667 0.061519 0.867822 1.968696 0.107605 0.248493 -0.128107
3.800000 0.065141 0.876095 1.957642 0.109385 0.247100 -0.148927
3.833333 0.068819 0.884327 1.960550 0.111149 0.245652 -0.165271
3.866667 0.072554 0.892516 1.934110 0.112898 0.244150 -0.172827
3.900000 0.076350 0.900646 1.937506 0.114630 0.242599 -0.174578
3.933333 0.080204 0.908713 1.935390 0.116346 0.241005 -0.172733
3.966667 0.084117 0.916714 1.934028 0.118045 0.239372 -0.167397
4.000000 0.088085 0.924667 1.921618 0.119729 0.237701 -0.158158
4.033333 0.092107 0.932572 1.914059 0.121399 0.235993 -0.143171
4.066667 0.096186 0.940405 1.907814 0.123055 0.234250 -0.130564
4.100000 0.100318 0.948186 1.909104 0.124697 0.232476 -0.115102
4.133333 0.104504 0.955917 1.905865 0.126325 0.230671 -0.101567
4.166667 0.108743 0.963596 1.896893 0.127941 0.228838 -0.091569
4.200000 0.113033 0.971221 1.900910 0.129543 0.226980 -0.090995
4.233333 0.117380 0.978768 1.873154 0.131131 0.225098 -0.100595
4.266667 0.121781 0.986238 1.895295 0.132708 0.223193 -0.118955
4.300000 0.126239 0.993629 1.900254 0.134272 0.221266 -0.152713
4.333333 0.130746 1.000964 1.912211 0.135825 0.219318 -0.198284
4.366667 0.135303 1.008241 1.898116 0.137369 0.217348 -0.253144
4.400000 0.139909 1.015460 1.880652 0.138906 0.215356 -0.310242
4.433333 0.144564 1.022619 1.885769 0.140439 0.213339 -0.370108
4.466667 0.149272 1.029701 1.865236 0.141967 0.211295 -0.426064
4.500000 0.154028 1.036723 1.846487 0.143493 0.209220 -0.470086
4.533333 0.158831 1.043683 1.820801 0.145018 0.207109 -0.499142
4.566667 0.163688 1.050563 1.782820 0.146540 0.204963 -0.512735
4.600000 0.168601 1.057364 1.769056 0.148058 0.202781 -0.513576
4.633333 0.173558 1.064101 1.733166 0.149570 0.200567 -0.496261
4.666667 0.178571 1.070756 1.729283 0.151076 0.198321 -0.467063
4.700000 0.183640 1.077327 1.719611 0.152572 0.196047 -0.429797
4.733333 0.188764 1.083813 1.702982 0.154056 0.193751 -0.387069
4.766667 0.193929 1.090233 1.687827 0.155525 0.191437 -0.340434
4.800000 0.199136 1.096587 1.686854 0.156975 0.189108 -0.289669
4.833333 0.204396 1.102856 1.678839 0.158402 0.186769 -0.241610
4.866667 0.209696 1.109057 1.675177 0.159804 0.184423 -0.193559
4.900000 0.215049 1.115171 1.661759 0.161176 0.182072 -0.145479
4.933333 0.220454 1.121199 1.646862 0.162517 0.179716 -0.098009
4.966667 0.225911 1.127140 1.645480 0.163823 0.177359 -0.051166
5.000000 0.231403 1.133011 1.641365 0.165093 0.175001 -0.002029
5.033333 0.236945 1.138793 1.648210 0.166325 0.172645 0.051077
5.066667 0.242521 1.144506 1.660203 0.167512 0.170298 0.107638
5.100000 0.248129 1.150149 1.671092 0.168654 0.167961 0.165843
5.133333 0.253770 1.155721 1.669701 0.169749 0.165637 0.226749
5.166667 0.259455 1.161202 1.668939 0.170799 0.163324 0.289949
5.200000 0.265185 1.166592 1.677630 0.171802 0.161025 0.351309
5.233333 0.270943 1.171911 1.686944 0.172763 0.158735 0.411996
5.266667 0.276729 1.177159 1.699613 0.173682 0.156453 0.471139
5.300000 0.282541 1.182336 1.725555 0.174560 0.154179 0.527719
5.333333 0.288380 1.187441 1.756772 0.175398 0.151914 0.576344
5.366667 0.294243 1.192476 1.763724 0.176195 0.149656 0.615543
5.400000 0.300142 1.197419 1.794490 0.176956 0.147403 0.643839
5.433333 0.306063 1.202291 1.812588 0.177678 0.145154 0.659706
5.466667 0.312005 1.207091 1.850396 0.178365 0.142906 0.658552
5.500000 0.317968 1.211821 1.873355 0.179017 0.140657 0.642585
5.533333 0.323950 1.216479 1.903519 0.179635 0.138403 0.615914
5.566667 0.329960 1.221047 1.919780 0.180221 0.136141 0.577421
5.600000 0.335986 1.225545 1.947216 0.180772 0.133873 0.528800
5.633333 0.342029 1.229972 1.952612 0.181290 0.131596 0.471345
5.666667 0.348086 1.234328 1.969943 0.181772 0.129312 0.412722
5.700000 0.354157 1.238613 1.979364 0.182219 0.127023 0.352722
5.733333 0.360246 1.242813 2.000033 0.182628 0.124734 0.290996
5.766667 0.366350 1.246931 2.013597 0.183000 0.122447 0.232778
5.800000 0.372467 1.250966 2.007064 0.183333 0.120170 0.181170
5.833333 0.378594 1.254931 2.008208 0.183626 0.117907 0.134115
5.866667 0.384730 1.258817 2.020727 0.183878 0.115663 0.087992
5.900000 0.390874 1.262624 2.004786 0.184089 0.113445 0.041876
5.933333 0.397023 1.266355 2.010869 0.184260 0.111254 -0.003784
5.966667 0.403176 1.270017 2.015784 0.184389 0.109093 -0.054452
6.000000 0.409333 1.273611 2.021657 0.184479 0.106961 -0.115476
6.033333 0.415492 1.277136 2.005492 0.184530 0.104857 -0.185825
6.066667 0.421652 1.280594 2.000575 0.184542 0.102779 -0.266402
6.100000 0.427812 1.283984 2.010060 0.184518 0.100724 -0.357588
6.133333 0.433969 1.287303 2.008147 0.184458 0.098689 -0.461378
6.166667 0.440124 1.290556 1.988178 0.184362 0.096673 -0.574490
6.200000 0.446276 1.293742 1.978672 0.184230 0.094674 -0.700416
6.233333 0.452422 1.296860 1.922279 0.184062 0.092691 -0.841588
6.266667 0.458563 1.299913 1.900203 0.183857 0.090727 -0.998803
6.300000 0.464697 1.302900 1.863621 0.183614 0.088780 -1.172463
6.333333 0.470822 1.305821 1.835886 0.183333 0.086853 -1.364948
6.366667 0.476937 1.308679 1.790372 0.183014 0.084947 -1.581119
6.400000 0.483041 1.311475 1.742008 0.182655 0.083061 -1.814378
6.433333 0.489133 1.314207 1.691609 0.182258 0.081196 -2.065958
6.466667 0.495212 1.316876 1.635022 0.181821 0.079350 -2.336819
6.500000 0.501273 1.319487 1.575530 0.181345 0.077523 -2.627146
6.533333 0.507320 1.322036 1.452285 0.180830 0.075714 -2.925654
6.566667 0.513346 1.324527 1.329111 0.180274 0.073922 -3.215452
6.600000 0.519355 1.326957 1.232612 0.179677 0.072147 -3.480570
6.633333 0.525340 1.329331 1.111876 0.179037 0.070387 -3.696785
6.666667 0.531306 1.331646 0.974417 0.178356 0.068642 -3.832847
6.700000 0.537251 1.333902 0.832997 0.177629 0.066912 -3.857853
6.733333 0.543174 1.336099 0.669948 0.176858 0.065197 -3.754059
6.766667 0.549067 1.338240 0.500544 0.176037 0.063497 -3.514560
6.800000 0.554936 1.340324 0.327029 0.175164 0.061815 -3.137068
6.833333 0.560770 1.342353 0.156908 0.174237 0.060150 -2.624832
6.866667 0.566568 1.344326 0.004294 0.173255 0.058503 -2.002646
6.900000 0.572339 1.346245 -0.068468 0.172216 0.056876 -1.304968
6.933333 0.578082 1.348108 -0.088961 0.171125 0.055268 -0.568904
6.966667 0.583781 1.349919 -0.090251 0.169985 0.053680 0.171261
7.000000 0.589450 1.351676 -0.012146 0.168803 0.052112 0.871751
7.033333 0.595070 1.353382 0.080181 0.167581 0.050564 1.487952
7.066667 0.600638 1.355038 0.181025 0.166328 0.049035 1.993530
7.100000 0.606151 1.356644 0.291223 0.165052 0.047525 2.374697
7.133333 0.611630 1.358200 0.411860 0.163761 0.046034 2.629365
7.166667 0.617075 1.359705 0.560644 0.162458 0.044561 2.754678
7.200000 0.622461 1.361162 0.658559 0.161150 0.043106 2.772105
7.233333 0.627811 1.362570 0.750438 0.159838 0.041671 2.706347
7.266667 0.633124 1.363930 0.841798 0.158519 0.040255 2.577638
7.300000 0.638378 1.365246 0.937907 0.157187 0.038862 2.405815
7.333333 0.643594 1.366514 1.002991 0.155833 0.037493 2.207352
7.366667 0.648771 1.367736 1.078314 0.154454 0.036149 2.007419
7.400000 0.653907 1.368912 1.148638 0.153042 0.034833 1.811603
7.433333 0.659003 1.370042 1.188928 0.151594 0.033543 1.628718
7.466667 0.664057 1.371128 1.244305 0.150109 0.032281 1.465167
7.500000 0.669053 1.372175 1.274021 0.148590 0.031045 1.324818
7.533333 0.673989 1.373183 1.309377 0.147038 0.029835 1.208625
7.566667 0.678866 1.374153 1.344742 0.145457 0.028650 1.107593
