t x y theta dxdt dydt dthetadt
0.000000 0.000000 0.000000 -2.342406 -0.132260 -0.076150 0.808454
0.033333 -0.004464 -0.002549 -2.317940 -0.136437 -0.077354 0.897495
0.066667 -0.009080 -0.005150 -2.263227 -0.140621 -0.078553 0.965388
0.100000 -0.013851 -0.007802 -2.217928 -0.144809 -0.079742 1.007611
0.133333 -0.018750 -0.010485 -2.169246 -0.148996 -0.080919 0.997140
0.166667 -0.023776 -0.013199 -2.183569 -0.153180 -0.082085 0.924239
0.200000 -0.028959 -0.015960 -2.186505 -0.157359 -0.083240 0.783386
0.233333 -0.034268 -0.018753 -2.181114 -0.161525 -0.084382 0.545333
0.266667 -0.039737 -0.021592 -2.056923 -0.165676 -0.085512 0.199482
0.300000 -0.045330 -0.024462 -2.019979 -0.169810 -0.086632 -0.257610
0.333333 -0.051048 -0.027363 -1.962241 -0.173930 -0.087747 -0.808716
0.366667 -0.056923 -0.030309 -1.944932 -0.178033 -0.088857 -1.433697
0.400000 -0.062954 -0.033300 -1.987265 -0.182122 -0.089964 -2.114417
0.433333 -0.069107 -0.036321 -2.027073 -0.186191 -0.091069 -2.797612
0.466667 -0.075381 -0.039373 -2.137793 -0.190236 -0.092172 -3.433044
0.500000 -0.081775 -0.042454 -2.364692 -0.194248 -0.093270 -3.974325
0.533333 -0.088288 -0.045566 -2.524641 -0.198221 -0.094361 -4.383688
0.566667 -0.094967 -0.048730 -2.873066 -0.202147 -0.095447 -4.622277
0.600000 -0.101815 -0.051948 -3.080843 -0.206019 -0.096525 -4.673552
0.633333 -0.108779 -0.055195 3.024093 -0.209831 -0.097597 -4.539723
0.666667 -0.115864 -0.058473 2.836814 -0.213579 -0.098663 -4.230973
0.700000 -0.123063 -0.061779 2.686053 -0.217256 -0.099723 -3.782251
0.733333 -0.130383 -0.065121 2.570622 -0.220857 -0.100775 -3.215942
0.766667 -0.137816 -0.068492 2.469495 -0.224378 -0.101821 -2.585057
0.800000 -0.145367 -0.071900 2.394739 -0.227824 -0.102863 -1.919590
0.833333 -0.153033 -0.075348 2.379234 -0.231195 -0.103901 -1.252728
0.866667 -0.160808 -0.078823 2.341840 -0.234496 -0.104935 -0.620103
0.900000 -0.168694 -0.082339 2.336133 -0.237729 -0.105967 -0.034080
0.933333 -0.176687 -0.085897 2.337647 -0.240900 -0.106993 0.481088
0.966667 -0.184784 -0.089480 2.364059 -0.244010 -0.108011 0.915670
1.000000 -0.192984 -0.093104 2.458486 -0.247056 -0.109013 1.266036
1.033333 -0.201286 -0.096754 2.526310 -0.250039 -0.109994 1.535007
1.066667 -0.209686 -0.100440 2.632373 -0.252959 -0.110949 1.740069
1.100000 -0.218180 -0.104163 2.748649 -0.255820 -0.111874 1.880733
1.133333 -0.226768 -0.107920 2.805631 -0.258630 -0.112771 1.966052
1.166667 -0.235445 -0.111707 2.862512 -0.261397 -0.113640 2.014811
1.200000 -0.244217 -0.115518 2.925000 -0.264132 -0.114484 2.035771
1.233333 -0.253073 -0.119358 2.996685 -0.266850 -0.115309 2.037824
1.266667 -0.262021 -0.123219 3.027586 -0.269562 -0.116119 2.010606
1.300000 -0.271046 -0.127104 3.029322 -0.272278 -0.116917 1.972284
1.333333 -0.280161 -0.131011 3.134384 -0.275003 -0.117705 1.921758
1.366667 -0.289348 -0.134938 -3.107030 -0.277741 -0.118485 1.854660
1.400000 -0.298621 -0.138885 -2.873085 -0.280492 -0.119256 1.751382
1.433333 -0.308010 -0.142873 -2.826450 -0.283249 -0.120016 1.608855
1.466667 -0.317513 -0.146901 -2.823564 -0.286005 -0.120760 1.432383
1.500000 -0.327098 -0.150946 -2.808035 -0.288752 -0.121483 1.214645
1.533333 -0.336793 -0.155025 -2.750858 -0.291477 -0.122179 0.972989
1.566667 -0.346567 -0.159121 -2.696977 -0.294167 -0.122841 0.721732
1.600000 -0.356419 -0.163233 -2.634556 -0.296809 -0.123464 0.501050
1.633333 -0.366373 -0.167369 -2.631484 -0.299398 -0.124046 0.317234
1.666667 -0.376425 -0.171527 -2.677214 -0.301926 -0.124585 0.178638
1.700000 -0.386550 -0.175699 -2.745882 -0.304384 -0.125083 0.094410
1.733333 -0.396746 -0.179883 -2.768498 -0.306773 -0.125542 0.061321
1.766667 -0.407011 -0.184080 -2.768220 -0.309092 -0.125965 0.069591
1.800000 -0.417367 -0.188292 -2.766554 -0.311340 -0.126357 0.102460
1.833333 -0.427809 -0.192517 -2.766554 -0.313512 -0.126718 0.156496
1.866667 -0.438316 -0.196753 -2.748693 -0.315610 -0.127055 0.219750
1.900000 -0.448885 -0.200997 -2.702521 -0.317635 -0.127369 0.273265
1.933333 -0.459531 -0.205255 -2.665819 -0.319587 -0.127663 0.306904
1.966667 -0.470237 -0.209521 -2.662146 -0.321463 -0.127940 0.323861
2.000000 -0.480999 -0.213793 -2.641597 -0.323264 -0.128202 0.320559
2.033333 -0.491817 -0.218071 -2.632883 -0.324995 -0.128450 0.296984
2.066667 -0.502688 -0.222355 -2.622094 -0.326654 -0.128684 0.264570
2.100000 -0.513619 -0.226651 -2.644138 -0.328240 -0.128905 0.244688
2.133333 -0.524600 -0.230950 -2.638490 -0.329755 -0.129112 0.245433
2.166667 -0.535633 -0.235261 -2.632096 -0.331201 -0.129306 0.265985
2.200000 -0.546716 -0.239584 -2.623867 -0.332577 -0.129483 0.307628
2.233333 -0.557842 -0.243909 -2.634859 -0.333880 -0.129643 0.368077
2.266667 -0.569011 -0.248234 -2.613702 -0.335108 -0.129783 0.434954
2.300000 -0.580219 -0.252572 -2.608606 -0.336264 -0.129900 0.490086
2.333333 -0.591464 -0.256908 -2.597327 -0.337345 -0.129988 0.520985
2.366667 -0.602747 -0.261242 -2.576570 -0.338351 -0.130048 0.517464
2.400000 -0.614058 -0.265586 -2.514136 -0.339283 -0.130077 0.469182
2.433333 -0.625394 -0.269936 -2.471427 -0.340141 -0.130072 0.372012
2.466667 -0.636761 -0.274282 -2.433126 -0.340926 -0.130031 0.226741
2.500000 -0.648158 -0.278623 -2.411414 -0.341638 -0.129954 0.039626
2.533333 -0.659573 -0.282963 -2.410307 -0.342276 -0.129841 -0.176808
2.566667 -0.671003 -0.287299 -2.431013 -0.342844 -0.129689 -0.407558
2.600000 -0.682458 -0.291628 -2.445484 -0.343344 -0.129497 -0.632923
2.633333 -0.693934 -0.295947 -2.471787 -0.343779 -0.129265 -0.841995
2.666667 -0.705419 -0.300260 -2.529501 -0.344150 -0.128994 -1.016334
2.700000 -0.716912 -0.304564 -2.601803 -0.344463 -0.128682 -1.145983
2.733333 -0.728408 -0.308858 -2.668413 -0.344720 -0.128326 -1.228828
2.766667 -0.739905 -0.313140 -2.706693 -0.344920 -0.127924 -1.266137
2.800000 -0.751416 -0.317408 -2.781873 -0.345066 -0.127473 -1.259159
2.833333 -0.762924 -0.321659 -2.812611 -0.345159 -0.126969 -1.206998
2.866667 -0.774442 -0.325895 -2.831836 -0.345200 -0.126410 -1.120295
2.900000 -0.785968 -0.330115 -2.873959 -0.345191 -0.125794 -1.005556
2.933333 -0.797487 -0.334313 -2.902980 -0.345131 -0.125123 -0.869016
2.966667 -0.809010 -0.338494 -2.950643 -0.345022 -0.124398 -0.713305
3.000000 -0.820524 -0.342645 -2.978424 -0.344864 -0.123621 -0.551387
3.033333 -0.832026 -0.346764 -3.004740 -0.344654 -0.122792 -0.392272
3.066667 -0.843517 -0.350848 -3.017632 -0.344392 -0.121914 -0.241639
3.100000 -0.854993 -0.354893 -3.020939 -0.344079 -0.120992 -0.108643
3.133333 -0.866466 -0.358917 -3.011129 -0.343714 -0.120030 0.000376
3.166667 -0.877933 -0.362918 -2.992868 -0.343299 -0.119030 0.075261
3.200000 -0.889380 -0.366873 -2.966434 -0.342833 -0.117999 0.114948
3.233333 -0.900818 -0.370805 -2.942209 -0.342323 -0.116945 0.119232
3.266667 -0.912232 -0.374687 -2.918271 -0.341769 -0.115876 0.094284
3.300000 -0.923633 -0.378545 -2.906138 -0.341172 -0.114795 0.056210
3.333333 -0.935005 -0.382353 -2.904955 -0.340537 -0.113709 0.016708
3.366667 -0.946342 -0.386109 -2.920042 -0.339869 -0.112627 -0.011240
3.400000 -0.957664 -0.389839 -2.939672 -0.339169 -0.111550 -0.012364
3.433333 -0.968968 -0.393541 -2.966165 -0.338433 -0.110476 0.027108
3.466667 -0.980232 -0.397191 -2.980200 -0.337658 -0.109404 0.116121
3.500000 -0.991475 -0.400814 -2.999230 -0.336842 -0.108329 0.252630
3.533333 -1.002697 -0.404406 -3.012600 -0.335976 -0.107244 0.438439
3.566667 -1.013895 -0.407969 -3.017407 -0.335052 -0.106138 0.665326
3.600000 -1.025069 -0.411502 -2.978536 -0.334066 -0.105004 0.909394
3.633333 -1.036218 -0.415003 -2.885845 -0.333018 -0.103836 1.140898
3.666667 -1.047339 -0.418474 -2.844940 -0.331908 -0.102630 1.330164
3.700000 -1.058408 -0.421892 -2.838631 -0.330739 -0.101382 1.453233
3.733333 -1.069423 -0.425258 -2.783575 -0.329517 -0.100095 1.485579
3.766667 -1.080384 -0.428572 -2.714115 -0.328251 -0.098771 1.425008
3.800000 -1.091291 -0.431832 -2.584206 -0.326952 -0.097418 1.281062
3.833333 -1.102165 -0.435059 -2.443461 -0.325632 -0.096048 1.070399
3.866667 -1.113004 -0.438253 -2.331893 -0.324300 -0.094667 0.810503
3.900000 -1.123792 -0.441389 -2.355300 -0.322965 -0.093284 0.529308
3.933333 -1.134531 -0.444469 -2.413991 -0.321631 -0.091907 0.259753
3.966667 -1.145224 -0.447493 -2.457326 -0.320300 -0.090544 0.017117
4.000000 -1.155878 -0.450482 -2.499526 -0.318970 -0.089195 -0.180769
4.033333 -1.166493 -0.453436 -2.541761 -0.317636 -0.087864 -0.317640
4.066667 -1.177062 -0.456340 -2.570844 -0.316298 -0.086551 -0.385452
4.100000 -1.187587 -0.459198 -2.586318 -0.314951 -0.085259 -0.402914
4.133333 -1.198067 -0.462010 -2.611717 -0.313593 -0.083986 -0.398466
4.166667 -1.208500 -0.464781 -2.639070 -0.312222 -0.082730 -0.387774
4.200000 -1.218887 -0.467511 -2.627861 -0.310836 -0.081490 -0.390321
4.233333 -1.229227 -0.470205 -2.572920 -0.309435 -0.080266 -0.426505
4.266667 -1.239521 -0.472864 -2.529553 -0.308015 -0.079055 -0.507044
4.300000 -1.249769 -0.475480 -2.540814 -0.306575 -0.077856 -0.623393
4.333333 -1.259971 -0.478051 -2.582087 -0.305115 -0.076670 -0.755526
4.366667 -1.270122 -0.480587 -2.629320 -0.303632 -0.075497 -0.891740
4.400000 -1.280225 -0.483079 -2.679492 -0.302125 -0.074336 -1.015498
4.433333 -1.290277 -0.485535 -2.714223 -0.300594 -0.073188 -1.110844
4.466667 -1.300278 -0.487948 -2.792663 -0.299036 -0.072053 -1.160730
4.500000 -1.310226 -0.490326 -2.858897 -0.297450 -0.070931 -1.159046
4.533333 -1.320121 -0.492668 -2.924355 -0.295837 -0.069822 -1.110262
4.566667 -1.329961 -0.494975 -2.956068 -0.294195 -0.068725 -1.019984
4.600000 -1.339746 -0.497246 -2.983136 -0.292525 -0.067638 -0.899489
4.633333 -1.349475 -0.499482 -3.008729 -0.290826 -0.066561 -0.758080
4.666667 -1.359148 -0.501682 -3.017822 -0.289100 -0.065491 -0.613922
4.700000 -1.368763 -0.503847 -3.034465 -0.287346 -0.064427 -0.477901
4.733333 -1.378318 -0.505977 -3.040445 -0.285565 -0.063367 -0.357447
4.766667 -1.387813 -0.508071 -3.052010 -0.283756 -0.062312 -0.254059
4.800000 -1.397246 -0.510129 -3.045656 -0.281921 -0.061260 -0.169707
4.833333 -1.406620 -0.512152 -3.047987 -0.280060 -0.060213 -0.106048
4.866667 -1.415929 -0.514141 -3.049680 -0.278174 -0.059171 -0.059223
4.900000 -1.425175 -0.516094 -3.048604 -0.276264 -0.058133 -0.026685
4.933333 -1.434358 -0.518013 -3.045947 -0.274332 -0.057102 -0.003481
4.966667 -1.443476 -0.519898 -3.050180 -0.272379 -0.056077 0.010238
5.000000 -1.452527 -0.521749 -3.037240 -0.270405 -0.055059 0.017093
5.033333 -1.461511 -0.523565 -3.042387 -0.268412 -0.054047 0.018618
5.066667 -1.470426 -0.525348 -3.042148 -0.266399 -0.053043 0.015572
5.100000 -1.479277 -0.527098 -3.036732 -0.264367 -0.052045 0.009764
5.133333 -1.488058 -0.528815 -3.038761 -0.262316 -0.051054 0.001131
5.166667 -1.496773 -0.530499 -3.041413 -0.260247 -0.050069 -0.009234
5.200000 -1.505417 -0.532150 -3.037533 -0.258160 -0.049092 -0.019812
5.233333 -1.513995 -0.533769 -3.046811 -0.256056 -0.048122 -0.029691
5.266667 -1.522501 -0.535355 -3.036016 -0.253937 -0.047160 -0.038709
5.300000 -1.530934 -0.536909 -3.040925 -0.251803 -0.046205 -0.045844
5.333333 -1.539294 -0.538432 -3.042993 -0.249656 -0.045257 -0.051944
5.366667 -1.547580 -0.539923 -3.051764 -0.247498 -0.044318 -0.055118
5.400000 -1.555793 -0.541382 -3.053277 -0.245332 -0.043387 -0.055977
5.433333 -1.563935 -0.542811 -3.058364 -0.243159 -0.042464 -0.055304
5.466667 -1.572008 -0.544209 -3.051099 -0.240980 -0.041551 -0.052507
5.500000 -1.580005 -0.545576 -3.058963 -0.238795 -0.040646 -0.047115
5.533333 -1.587926 -0.546915 -3.058502 -0.236606 -0.039752 -0.039465
5.566667 -1.595776 -0.548223 -3.063748 -0.234410 -0.038868 -0.031780
5.600000 -1.603555 -0.549501 -3.060086 -0.232205 -0.037996 -0.025004
5.633333 -1.611262 -0.550750 -3.063380 -0.229991 -0.037136 -0.018887
5.666667 -1.618896 -0.551971 -3.065190 -0.227765 -0.036289 -0.012428
5.700000 -1.626454 -0.553163 -3.061003 -0.225525 -0.035457 -0.008898
5.733333 -1.633940 -0.554327 -3.061689 -0.223272 -0.034640 -0.006279
5.766667 -1.641347 -0.555465 -3.064469 -0.221005 -0.033838 -0.003595
5.800000 -1.648682 -0.556574 -3.062630 -0.218725 -0.033052 0.000462
5.833333 -1.655938 -0.557658 -3.051087 -0.216433 -0.032280 0.004044
5.866667 -1.663117 -0.558718 -3.063473 -0.214132 -0.031522 0.007229
5.900000 -1.670217 -0.559753 -3.064253 -0.211826 -0.030776 0.011278
5.933333 -1.677239 -0.560764 -3.066854 -0.209518 -0.030039 0.015413
5.966667 -1.684183 -0.561752 -3.066560 -0.207210 -0.029311 0.018163
6.000000 -1.691049 -0.562717 -3.060066 -0.204908 -0.028589 0.017951
6.033333 -1.697837 -0.563659 -3.057956 -0.202613 -0.027870 0.017907
6.066667 -1.704551 -0.564575 -3.060356 -0.200326 -0.027156 0.015202
6.100000 -1.711185 -0.565470 -3.055461 -0.198049 -0.026444 0.009869
6.133333 -1.717746 -0.566340 -3.051280 -0.195780 -0.025736 0.002060
6.166667 -1.724232 -0.567185 -3.057033 -0.193520 -0.025032 -0.005623
6.200000 -1.730644 -0.568006 -3.046471 -0.191266 -0.024334 -0.012942
6.233333 -1.736982 -0.568804 -3.055655 -0.189015 -0.023645 -0.020506
6.266667 -1.743245 -0.569577 -3.058192 -0.186767 -0.022966 -0.026550
6.300000 -1.749434 -0.570328 -3.064660 -0.184520 -0.022299 -0.029262
6.333333 -1.755549 -0.571055 -3.066144 -0.182274 -0.021643 -0.028769
6.366667 -1.761590 -0.571761 -3.064665 -0.180028 -0.021001 -0.027186
6.400000 -1.767553 -0.572447 -3.063389 -0.177782 -0.020370 -0.022534
6.433333 -1.773442 -0.573112 -3.072862 -0.175538 -0.019752 -0.016313
6.466667 -1.779254 -0.573759 -3.064993 -0.173297 -0.019145 -0.009588
6.500000 -1.784992 -0.574385 -3.060736 -0.171058 -0.018549 -0.003454
6.533333 -1.790653 -0.574994 -3.065613 -0.168824 -0.017964 0.002430
6.566667 -1.796241 -0.575583 -3.066056 -0.166594 -0.017390 0.008327
6.600000 -1.801755 -0.576151 -3.063017 -0.164370 -0.016827 0.012484
6.633333 -1.807196 -0.576699 -3.068088 -0.162152 -0.016274 0.015997
6.666667 -1.812565 -0.577228 -3.063757 -0.159939 -0.015734 0.020175
6.700000 -1.817860 -0.577737 -3.060892 -0.157733 -0.015205 0.023303
6.733333 -1.823080 -0.578232 -3.058777 -0.155533 -0.014687 0.024625
6.766667 -1.828225 -0.578712 -3.068120 -0.153339 -0.014182 0.025709
6.800000 -1.833298 -0.579173 -3.065556 -0.151151 -0.013688 0.026980
6.833333 -1.838297 -0.579621 -3.057288 -0.148970 -0.013204 0.026649
