t x y theta dxdt dydt dthetadt
0.000000 0.000000 0.000000 0.461390 -0.002010 0.000942 -0.031221
0.033333 0.000234 -0.000236 0.461571 -0.004304 0.004303 -0.039023
0.066667 0.000531 -0.000583 0.471447 -0.007382 0.009387 -0.049124
0.100000 0.000075 -0.000088 0.469775 -0.011396 0.016643 -0.070578
0.133333 -0.000313 0.000289 0.469822 -0.016723 0.026543 -0.105619
0.166667 -0.000631 0.000544 0.479808 -0.023616 0.039279 -0.150192
0.200000 -0.000877 0.000673 0.480721 -0.032116 0.054466 -0.204969
0.233333 -0.001049 0.000671 0.455448 -0.042075 0.071670 -0.267221
0.266667 -0.001595 0.001622 0.473586 -0.053257 0.090421 -0.340678
0.300000 -0.003515 0.004441 0.440380 -0.065322 0.110214 -0.415643
0.333333 -0.006513 0.010660 0.416734 -0.077292 0.129965 -0.493731
0.366667 -0.009404 0.016727 0.405740 -0.088220 0.148680 -0.573371
0.400000 -0.012181 0.022630 0.405740 -0.097180 0.165409 -0.657335
0.433333 -0.014834 0.028357 0.345376 -0.103443 0.179195 -0.741897
0.466667 -0.021045 0.036324 0.338829 -0.106347 0.189088 -0.821876
0.500000 -0.027115 0.044100 0.298852 -0.105155 0.193750 -0.897332
0.533333 -0.033033 0.051672 0.290831 -0.099568 0.192576 -0.959106
0.566667 -0.037797 0.059067 0.248150 -0.089480 0.185127 -0.997769
0.600000 -0.040643 0.066046 0.230284 -0.074494 0.170878 -1.005446
0.633333 -0.042593 0.073428 0.182278 -0.054193 0.149260 -0.981412
0.666667 -0.044817 0.080904 0.108451 -0.028562 0.119980 -0.920554
0.700000 -0.046195 0.087126 0.054386 0.001792 0.083801 -0.823392
0.733333 -0.046363 0.090144 0.018741 0.036444 0.041139 -0.692896
0.766667 -0.046335 0.092858 -0.020567 0.075185 -0.007655 -0.541560
0.800000 -0.046108 0.095258 -0.027074 0.116944 -0.061316 -0.378505
0.833333 -0.041224 0.090843 -0.038686 0.160398 -0.117919 -0.215791
0.866667 -0.036154 0.086094 -0.030539 0.204127 -0.175714 -0.071506
0.900000 -0.030898 0.081007 0.003715 0.246980 -0.233586 0.041970
0.933333 -0.018062 0.068483 0.018007 0.286745 -0.289550 0.116162
0.966667 -0.005071 0.055610 0.038229 0.321027 -0.341491 0.147405
1.000000 0.008066 0.042393 0.061827 0.347815 -0.387739 0.135242
1.033333 0.021339 0.028839 0.073064 0.365794 -0.427761 0.087572
1.066667 0.037276 0.010956 0.084288 0.374154 -0.460655 0.015364
1.100000 0.053318 -0.007252 0.091998 0.372465 -0.485564 -0.069442
1.133333 0.069453 -0.025777 0.076008 0.362064 -0.503109 -0.158703
1.166667 0.085671 -0.044607 0.035061 0.344703 -0.514011 -0.241060
1.200000 0.097961 -0.064155 0.020969 0.322666 -0.519229 -0.302171
1.233333 0.107772 -0.083243 0.008897 0.298503 -0.519255 -0.331687
1.266667 0.115284 -0.101415 -0.000922 0.275412 -0.515369 -0.322272
1.300000 0.121536 -0.118280 -0.007607 0.256484 -0.508929 -0.269225
1.333333 0.126683 -0.133795 -0.040609 0.244148 -0.500610 -0.171941
1.366667 0.131899 -0.149533 -0.061465 0.240485 -0.491163 -0.037274
1.400000 0.137186 -0.165487 -0.060526 0.246895 -0.481130 0.117268
1.433333 0.142542 -0.181651 -0.067501 0.263495 -0.470933 0.274227
1.466667 0.147967 -0.198016 -0.080863 0.289062 -0.460506 0.418989
1.500000 0.155710 -0.212558 -0.086320 0.321957 -0.449693 0.536756
1.533333 0.163525 -0.227294 -0.032028 0.359947 -0.438155 0.617554
1.566667 0.176484 -0.242231 0.045221 0.399933 -0.425485 0.657343
1.600000 0.193852 -0.257108 0.125123 0.438117 -0.411448 0.658853
1.633333 0.211261 -0.272182 0.191799 0.470995 -0.395815 0.624069
1.666667 0.229479 -0.285833 0.195409 0.495358 -0.378724 0.556455
1.700000 0.249441 -0.298003 0.190215 0.508345 -0.360244 0.463098
1.733333 0.270567 -0.308545 0.174423 0.507546 -0.341399 0.351890
1.766667 0.291691 -0.319281 0.168668 0.492239 -0.323427 0.228941
1.800000 0.312797 -0.330207 0.169674 0.463483 -0.307584 0.101644
1.833333 0.333869 -0.341325 0.148061 0.423040 -0.295230 -0.017992
1.866667 0.351756 -0.350435 0.153241 0.373716 -0.287676 -0.127743
1.900000 0.365470 -0.357628 0.177860 0.319035 -0.286572 -0.226275
1.933333 0.373427 -0.363685 0.188672 0.263278 -0.292349 -0.312889
1.966667 0.377181 -0.369294 0.192288 0.210467 -0.305613 -0.383198
2.000000 0.378383 -0.377042 0.176475 0.164173 -0.327008 -0.434821
2.033333 0.379526 -0.384950 0.150649 0.127608 -0.357123 -0.471662
2.066667 0.378804 -0.398431 0.094734 0.102946 -0.395455 -0.484731
2.100000 0.378021 -0.412067 0.041387 0.090992 -0.440856 -0.470782
2.133333 0.377186 -0.425855 0.009627 0.091234 -0.492539 -0.428330
2.166667 0.376306 -0.439790 0.004819 0.102141 -0.549017 -0.362736
2.200000 0.378171 -0.458263 -0.016557 0.121054 -0.608233 -0.282139
2.233333 0.383185 -0.480145 -0.001019 0.145010 -0.667816 -0.194082
2.266667 0.388762 -0.502895 -0.012966 0.171116 -0.726741 -0.111889
2.300000 0.396217 -0.529319 0.000757 0.196918 -0.783901 -0.045143
2.333333 0.405771 -0.559319 0.017049 0.220316 -0.837855 0.000070
2.366667 0.415243 -0.589417 0.041078 0.239722 -0.887507 0.020195
2.400000 0.425567 -0.621478 0.059324 0.254406 -0.932529 0.014916
2.433333 0.435848 -0.654977 0.047415 0.264243 -0.973097 -0.011553
2.466667 0.445988 -0.689778 0.028064 0.269106 -1.008645 -0.054839
2.500000 0.456014 -0.724587 0.026756 0.269205 -1.039314 -0.110869
2.533333 0.464632 -0.760038 0.004668 0.265219 -1.065881 -0.172830
2.566667 0.472707 -0.795006 0.012605 0.257864 -1.089164 -0.235912
2.600000 0.481673 -0.833276 0.015637 0.247870 -1.109350 -0.294508
2.633333 0.490501 -0.871444 0.006342 0.235675 -1.126552 -0.347829
2.666667 0.499187 -0.909480 -0.002842 0.222025 -1.141110 -0.395971
2.700000 0.507727 -0.947357 -0.024565 0.207505 -1.153072 -0.434483
2.733333 0.514441 -0.987189 -0.043653 0.192415 -1.162033 -0.469039
2.766667 0.520999 -1.026797 -0.070051 0.176988 -1.167519 -0.495695
2.800000 0.525371 -1.067238 -0.081112 0.161577 -1.169554 -0.517840
2.833333 0.529584 -1.107387 -0.121041 0.146454 -1.167876 -0.532605
2.866667 0.533640 -1.147212 -0.124719 0.131847 -1.162268 -0.540627
2.900000 0.537540 -1.186680 -0.154080 0.117987 -1.152483 -0.545150
2.933333 0.541285 -1.225760 -0.157693 0.104990 -1.138774 -0.544066
2.966667 0.544876 -1.264420 -0.178935 0.092959 -1.121302 -0.544275
3.000000 0.547583 -1.302289 -0.187636 0.081594 -1.100238 -0.544547
3.033333 0.550139 -1.339674 -0.210186 0.070750 -1.076106 -0.547889
3.066667 0.552206 -1.375364 -0.235068 0.060206 -1.049263 -0.551670
3.100000 0.554132 -1.410509 -0.242983 0.049763 -1.019967 -0.556419
3.133333 0.555918 -1.445080 -0.270646 0.039328 -0.988198 -0.560783
3.166667 0.556640 -1.476963 -0.285585 0.028981 -0.954383 -0.560518
3.200000 0.557236 -1.508214 -0.304205 0.018991 -0.918306 -0.553813
3.233333 0.557759 -1.538377 -0.335536 0.009545 -0.879613 -0.540444
3.266667 0.558164 -1.567857 -0.343858 0.000991 -0.837747 -0.521508
3.300000 0.557898 -1.595013 -0.373627 -0.006324 -0.792606 -0.493052
3.333333 0.557061 -1.622393 -0.394126 -0.012026 -0.743524 -0.455757
3.366667 0.556121 -1.649018 -0.390836 -0.015937 -0.689355 -0.412124
3.400000 0.554615 -1.672041 -0.414521 -0.017952 -0.629980 -0.362136
3.433333 0.553352 -1.692143 -0.431886 -0.018153 -0.564987 -0.305175
3.466667 0.552016 -1.711429 -0.446948 -0.016916 -0.494799 -0.239470
3.500000 0.550610 -1.729883 -0.446480 -0.014780 -0.419034 -0.170458
3.533333 0.549926 -1.743424 -0.450386 -0.012414 -0.338790 -0.097909
3.566667 0.549192 -1.756107 -0.452304 -0.010483 -0.255053 -0.021919
3.600000 0.550098 -1.762134 -0.456482 -0.009889 -0.168237 0.052614
3.633333 0.550976 -1.767290 -0.455740 -0.011149 -0.079078 0.122457
3.666667 0.551751 -1.765693 -0.454495 -0.014689 0.011860 0.183218
3.700000 0.552518 -1.763223 -0.441881 -0.020698 0.103156 0.235595
3.733333 0.553278 -1.759882 -0.424121 -0.029199 0.194636 0.277231
3.766667 0.551998 -1.750853 -0.401105 -0.039905 0.285141 0.307360
3.800000 0.550729 -1.740960 -0.387826 -0.052043 0.373746 0.330845
3.833333 0.548335 -1.725872 -0.382100 -0.064931 0.459069 0.353255
3.866667 0.545972 -1.709940 -0.352384 -0.077791 0.540339 0.381027
3.900000 0.542793 -1.689685 -0.352213 -0.089872 0.616858 0.419979
3.933333 0.538692 -1.665645 -0.346979 -0.100408 0.687345 0.470298
3.966667 0.534581 -1.638875 -0.333694 -0.108672 0.751482 0.533352
4.000000 0.529881 -1.609123 -0.332608 -0.113782 0.808806 0.601241
4.033333 0.525272 -1.578626 -0.331611 -0.115058 0.859743 0.664789
4.066667 0.520762 -1.547410 -0.296643 -0.111525 0.904477 0.710148
4.100000 0.516358 -1.515503 -0.287974 -0.102127 0.943733 0.726658
4.133333 0.512068 -1.482931 -0.238929 -0.085966 0.978576 0.707581
4.166667 0.507897 -1.449724 -0.181710 -0.062766 1.009693 0.647746
4.200000 0.503851 -1.415908 -0.103369 -0.033010 1.037600 0.545263
4.233333 0.499934 -1.381511 -0.061913 0.002912 1.062454 0.403167
4.266667 0.496151 -1.346562 -0.053602 0.043697 1.083989 0.234089
4.300000 0.496964 -1.310806 -0.054721 0.087287 1.101724 0.044832
4.333333 0.501803 -1.271316 -0.086282 0.131369 1.114975 -0.147519
4.366667 0.506799 -1.231385 -0.104976 0.174070 1.123439 -0.329749
4.400000 0.516105 -1.190340 -0.138763 0.213548 1.126850 -0.479312
4.433333 0.528268 -1.149498 -0.163830 0.247214 1.125151 -0.586884
4.466667 0.540649 -1.110190 -0.206703 0.272879 1.119272 -0.652340
4.500000 0.552779 -1.073646 -0.225989 0.289057 1.110523 -0.673799
4.533333 0.565034 -1.036842 -0.271382 0.294621 1.100686 -0.659210
4.566667 0.577407 -0.999809 -0.284405 0.288423 1.091291 -0.617741
4.600000 0.587310 -0.966284 -0.310636 0.269839 1.084662 -0.566326
4.633333 0.597313 -0.932579 -0.338876 0.239456 1.082966 -0.509501
4.666667 0.607411 -0.898722 -0.352336 0.198416 1.087452 -0.447604
4.700000 0.617601 -0.864739 -0.351062 0.148054 1.098601 -0.381024
4.733333 0.627878 -0.830657 -0.329105 0.090000 1.116452 -0.313808
4.766667 0.631940 -0.794666 -0.331556 0.026413 1.140886 -0.241613
4.800000 0.631616 -0.756853 -0.373252 -0.040144 1.170217 -0.159532
4.833333 0.627720 -0.717636 -0.390490 -0.106940 1.202346 -0.070101
4.866667 0.620293 -0.677455 -0.403132 -0.171182 1.235162 0.021636
4.900000 0.612995 -0.637282 -0.409748 -0.230409 1.266977 0.108709
4.933333 0.601043 -0.592795 -0.403949 -0.282175 1.295749 0.189410
4.966667 0.585580 -0.545419 -0.386912 -0.324746 1.319333 0.254558
5.000000 0.570317 -0.498141 -0.367536 -0.357332 1.336547 0.294319
5.033333 0.555274 -0.450999 -0.339715 -0.379727 1.346278 0.304085
5.066667 0.540471 -0.404033 -0.318932 -0.392166 1.347492 0.283569
5.100000 0.525929 -0.357281 -0.276394 -0.393693 1.338139 0.238252
5.133333 0.511667 -0.310782 -0.250909 -0.383960 1.317029 0.176572
5.166667 0.497705 -0.264573 -0.230637 -0.362809 1.283648 0.104261
5.200000 0.485793 -0.221384 -0.239311 -0.329863 1.237572 0.030191
5.233333 0.473582 -0.177838 -0.278519 -0.285094 1.179037 -0.036954
5.266667 0.460499 -0.135439 -0.328312 -0.228861 1.109116 -0.088579
5.300000 0.448306 -0.095446 -0.337889 -0.163824 1.030923 -0.122547
5.333333 0.436505 -0.055922 -0.334174 -0.092349 0.947162 -0.141138
5.366667 0.429276 -0.021826 -0.331924 -0.016795 0.860546 -0.140746
5.400000 0.428037 0.005317 -0.339467 0.061215 0.773172 -0.121749
5.433333 0.440377 0.021069 -0.322895 0.139753 0.687369 -0.087800
5.466667 0.453095 0.036214 -0.306172 0.217151 0.604807 -0.048415
5.500000 0.466189 0.050744 -0.315314 0.292932 0.525927 -0.005698
5.533333 0.479656 0.064650 -0.316045 0.366940 0.451012 0.039551
5.566667 0.493490 0.077925 -0.339680 0.439945 0.379468 0.085924
5.600000 0.507691 0.090562 -0.346968 0.511625 0.310993 0.133816
5.633333 0.522254 0.102553 -0.350242 0.582548 0.244116 0.184485
5.666667 0.537175 0.113892 -0.335810 0.653384 0.177425 0.242232
5.700000 0.552450 0.124574 -0.322505 0.724755 0.109671 0.305442
5.733333 0.579062 0.126078 -0.303037 0.795720 0.040624 0.370946
5.766667 0.612515 0.122266 -0.273575 0.863985 -0.029044 0.433851
5.800000 0.646245 0.117763 -0.257722 0.927805 -0.098276 0.490213
5.833333 0.680228 0.112580 -0.253540 0.984550 -0.165515 0.537795
5.866667 0.718284 0.104857 -0.233668 1.031279 -0.229048 0.576989
5.900000 0.759331 0.095864 -0.222669 1.064833 -0.287108 0.607608
5.933333 0.799969 0.082873 -0.179157 1.083920 -0.339364 0.628917
5.966667 0.837551 0.068356 -0.157106 1.088597 -0.386371 0.641780
6.000000 0.875232 0.053221 -0.135332 1.078767 -0.429063 0.643961
6.033333 0.912988 0.037486 -0.121029 1.055661 -0.468162 0.636532
6.066667 0.950791 0.021169 -0.109130 1.021058 -0.504750 0.617971
6.100000 0.988616 0.004289 -0.080167 0.977099 -0.539976 0.590904
6.133333 1.026437 -0.013135 -0.037036 0.925355 -0.574423 0.560876
6.166667 1.053776 -0.033107 -0.021949 0.867695 -0.608005 0.532191
6.200000 1.081062 -0.053558 0.018177 0.806235 -0.640446 0.508165
6.233333 1.108276 -0.074464 0.015611 0.742033 -0.671219 0.490679
6.266667 1.131181 -0.097508 0.014566 0.676035 -0.699140 0.479323
6.300000 1.151001 -0.122543 0.011332 0.609440 -0.722920 0.473448
6.333333 1.169254 -0.149111 0.010054 0.543800 -0.741316 0.473891
6.366667 1.185471 -0.176580 0.033698 0.479105 -0.753442 0.477607
6.400000 1.200337 -0.204849 0.060493 0.414963 -0.758352 0.486748
6.433333 1.213691 -0.232940 0.092852 0.351875 -0.755726 0.493899
6.466667 1.223704 -0.259641 0.120959 0.290493 -0.746281 0.498417
6.500000 1.233583 -0.286547 0.137651 0.231266 -0.730754 0.499432
6.533333 1.243331 -0.313631 0.144161 0.174696 -0.709672 0.496376
6.566667 1.246773 -0.336899 0.171959 0.123011 -0.683415 0.495847
6.600000 1.245952 -0.356900 0.175519 0.079303 -0.652984 0.504140
6.633333 1.245036 -0.376984 0.184872 0.046097 -0.619231 0.537616
6.666667 1.244039 -0.397133 0.208136 0.025374 -0.582320 0.604534
6.700000 1.242970 -0.417326 0.223724 0.018536 -0.542715 0.707618
6.733333 1.237493 -0.436061 0.232193 0.026995 -0.501195 0.843181
6.766667 1.230847 -0.453326 0.226926 0.050047 -0.458778 1.004627
6.800000 1.224182 -0.470567 0.241654 0.086012 -0.415751 1.182104
6.833333 1.222429 -0.485212 0.269683 0.133074 -0.372435 1.356044
6.866667 1.227513 -0.496513 0.333465 0.189103 -0.329557 1.509536
6.900000 1.240597 -0.502854 0.422748 0.251740 -0.288003 1.628705
6.933333 1.253716 -0.509168 0.498792 0.317279 -0.248725 1.704112
6.966667 1.266865 -0.515450 0.598857 0.383002 -0.212336 1.721943
7.000000 1.280037 -0.521693 0.689885 0.446647 -0.179814 1.670798
7.033333 1.293227 -0.527891 0.748240 0.506250 -0.151985 1.553702
7.066667 1.314656 -0.530823 0.802474 0.560316 -0.129400 1.379124
7.100000 1.336093 -0.533721 0.849065 0.608612 -0.111922 1.160831
7.133333 1.357525 -0.536583 0.908871 0.651505 -0.099168 0.910116
7.166667 1.382093 -0.538285 0.921132 0.689200 -0.090967 0.650387
7.200000 1.406632 -0.539955 0.930907 0.721463 -0.086864 0.403402
7.233333 1.431555 -0.541223 0.927860 0.747882 -0.086355 0.182587
7.266667 1.458686 -0.543108 0.924905 0.768578 -0.088537 -0.003875
7.300000 1.485743 -0.544966 0.901445 0.782871 -0.092715 -0.152487
7.333333 1.514024 -0.547850 0.873329 0.790203 -0.098078 -0.256515
7.366667 1.542224 -0.551885 0.845741 0.790300 -0.103452 -0.322476
7.400000 1.570450 -0.556080 0.825820 0.783443 -0.107942 -0.358218
7.433333 1.598518 -0.561180 0.810200 0.769996 -0.110616 -0.372763
7.466667 1.625461 -0.566388 0.801757 0.750227 -0.111013 -0.373978
7.500000 1.652220 -0.571558 0.795989 0.724486 -0.108777 -0.369660
7.533333 1.676089 -0.575432 0.783507 0.693652 -0.103928 -0.370304
7.566667 1.699746 -0.579257 0.785458 0.658746 -0.096946 -0.380955
7.600000 1.722494 -0.582479 0.786392 0.620602 -0.088284 -0.401814
7.633333 1.742791 -0.585468 0.772795 0.580069 -0.078608 -0.430971
7.666667 1.761384 -0.587734 0.768003 0.537566 -0.068527 -0.467778
7.700000 1.776789 -0.589044 0.749665 0.494115 -0.058768 -0.508830
7.733333 1.791934 -0.590283 0.710200 0.450107 -0.049737 -0.547260
7.766667 1.806815 -0.591452 0.682274 0.405894 -0.041665 -0.575073
7.800000 1.821426 -0.592552 0.661332 0.361801 -0.034681 -0.589589
7.833333 1.832220 -0.593507 0.643954 0.318347 -0.028799 -0.589123
7.866667 1.841760 -0.594031 0.620438 0.276261 -0.024018 -0.569347
7.900000 1.849889 -0.594707 0.598353 0.235674 -0.020072 -0.530321
7.933333 1.857147 -0.595263 0.580053 0.197144 -0.016830 -0.477931
7.966667 1.862521 -0.595803 0.559785 0.161219 -0.014112 -0.419072
8.000000 1.865864 -0.595831 0.533846 0.128601 -0.011817 -0.355367
8.033333 1.868377 -0.596297 0.523314 0.099496 -0.009807 -0.290077
8.066667 1.869226 -0.596347 0.520854 0.074120 -0.007938 -0.228179
8.100000 1.870081 -0.596695 0.531543 0.052733 -0.006197 -0.173903
8.133333 1.870686 -0.596961 0.523844 0.035358 -0.004585 -0.126976
8.166667 1.871047 -0.597148 0.525630 0.021766 -0.003147 -0.086694
8.200000 1.871170 -0.597257 0.524279 0.011480 -0.001845 -0.056579
8.233333 1.871063 -0.597288 0.528676 0.004219 -0.000732 -0.035674
8.266667 1.870730 -0.597244 0.524796 -0.000622 0.000173 -0.022871
8.300000 1.870179 -0.597126 0.523064 -0.003634 0.000822 -0.015499
8.333333 1.869416 -0.596936 0.523352 -0.005287 0.001272 -0.010942
