t x y theta dxdt dydt dthetadt
0.000000 0.000000 0.000000 -2.621934 0.102115 -0.072883 0.000810
0.033333 0.003445 -0.002455 -2.615040 0.107222 -0.072786 0.000860
0.066667 0.007074 -0.004897 -2.625471 0.112462 -0.072613 0.000753
0.100000 0.010889 -0.007325 -2.621835 0.117832 -0.072362 0.001682
0.133333 0.014894 -0.009736 -2.627264 0.123326 -0.072039 0.000937
0.166667 0.019077 -0.012141 -2.620062 0.128940 -0.071640 -0.001059
0.200000 0.023443 -0.014540 -2.619684 0.134671 -0.071164 -0.002326
0.233333 0.027996 -0.016931 -2.624439 0.140517 -0.070612 -0.000521
0.266667 0.032751 -0.019294 -2.617983 0.146473 -0.069986 0.001250
0.300000 0.037702 -0.021645 -2.623054 0.152540 -0.069283 0.002242
0.333333 0.042861 -0.023963 -2.627617 0.158720 -0.068499 0.004348
0.366667 0.048231 -0.026246 -2.627668 0.165013 -0.067636 0.006279
0.400000 0.053814 -0.028490 -2.627796 0.171418 -0.066697 0.007191
0.433333 0.059612 -0.030714 -2.617302 0.177938 -0.065686 0.006407
0.466667 0.065630 -0.032915 -2.625451 0.184571 -0.064605 0.006410
0.500000 0.071869 -0.035070 -2.616436 0.191318 -0.063458 0.005609
0.533333 0.078333 -0.037177 -2.614244 0.198179 -0.062254 0.002644
0.566667 0.085024 -0.039233 -2.621768 0.205155 -0.060994 0.001063
0.600000 0.091953 -0.041258 -2.619248 0.212249 -0.059680 -0.001029
0.633333 0.099115 -0.043226 -2.624292 0.219461 -0.058311 -0.002721
0.666667 0.106524 -0.045159 -2.618094 0.226794 -0.056891 -0.005599
0.700000 0.114186 -0.047054 -2.630286 0.234248 -0.055418 -0.005295
0.733333 0.122087 -0.048886 -2.623472 0.241818 -0.053888 -0.002108
0.766667 0.130251 -0.050674 -2.619671 0.249496 -0.052293 -0.000859
0.800000 0.138657 -0.052394 -2.616222 0.257278 -0.050631 0.000792
0.833333 0.147336 -0.054067 -2.633088 0.265153 -0.048893 0.003517
0.866667 0.156291 -0.055690 -2.622981 0.273117 -0.047074 0.006027
0.900000 0.165527 -0.057262 -2.614026 0.281162 -0.045169 0.005163
0.933333 0.175014 -0.058754 -2.622172 0.289294 -0.043178 0.002632
0.966667 0.184792 -0.060190 -2.626898 0.297517 -0.041105 0.002598
1.000000 0.194824 -0.061541 -2.612602 0.305834 -0.038950 0.003624
1.033333 0.205156 -0.062831 -2.624172 0.314258 -0.036719 0.005631
1.066667 0.215744 -0.064033 -2.615865 0.322796 -0.034415 0.014165
1.100000 0.226591 -0.065142 -2.624829 0.331459 -0.032044 0.040536
1.133333 0.237752 -0.066183 -2.621559 0.340249 -0.029605 0.094141
1.166667 0.249172 -0.067127 -2.623056 0.349174 -0.027101 0.183643
1.200000 0.260917 -0.067997 -2.623807 0.358228 -0.024529 0.323624
1.233333 0.272991 -0.068791 -2.625618 0.367398 -0.021884 0.519717
1.266667 0.285398 -0.069505 -2.618247 0.376671 -0.019158 0.773673
1.300000 0.298068 -0.070113 -2.614984 0.386030 -0.016340 1.072901
1.333333 0.311079 -0.070637 -2.607628 0.395458 -0.013422 1.401999
1.366667 0.324439 -0.071072 -2.589731 0.404930 -0.010389 1.745660
1.400000 0.338062 -0.071394 -2.544694 0.414449 -0.007234 2.080391
1.433333 0.352044 -0.071615 -2.440075 0.424013 -0.003946 2.388256
1.466667 0.366393 -0.071727 -2.294517 0.433639 -0.000517 2.650750
1.500000 0.381003 -0.071719 -2.163290 0.443336 0.003063 2.859645
1.533333 0.395875 -0.071590 -2.002789 0.453114 0.006799 3.004872
1.566667 0.411126 -0.071333 -1.893417 0.462984 0.010691 3.083186
1.600000 0.426637 -0.070951 -1.780727 0.472941 0.014744 3.096731
1.633333 0.442533 -0.070431 -1.690618 0.482978 0.018960 3.056349
1.666667 0.458816 -0.069764 -1.599023 0.493079 0.023340 2.976490
1.700000 0.475353 -0.068966 -1.507356 0.503213 0.027879 2.869806
1.733333 0.492277 -0.068006 -1.414801 0.513354 0.032576 2.757489
1.766667 0.509586 -0.066874 -1.332505 0.523478 0.037435 2.648303
1.800000 0.527278 -0.065564 -1.235096 0.533546 0.042452 2.550117
1.833333 0.545351 -0.064066 -1.142489 0.543522 0.047621 2.461768
1.866667 0.563669 -0.062428 -1.076657 0.553382 0.052939 2.382882
1.900000 0.582227 -0.060647 -0.991374 0.563118 0.058416 2.310088
1.933333 0.601156 -0.058658 -0.919197 0.572718 0.064046 2.234117
1.966667 0.620450 -0.056452 -0.854802 0.582176 0.069832 2.153395
2.000000 0.640104 -0.054023 -0.791427 0.591500 0.075775 2.067764
2.033333 0.659986 -0.051447 -0.712012 0.600710 0.081883 1.977326
2.066667 0.680213 -0.048636 -0.638744 0.609804 0.088155 1.878208
2.100000 0.700661 -0.045677 -0.573221 0.618765 0.094571 1.771045
2.133333 0.721439 -0.042473 -0.509928 0.627592 0.101127 1.661232
2.166667 0.742538 -0.039020 -0.460371 0.636279 0.107815 1.551248
2.200000 0.763953 -0.035315 -0.407348 0.644812 0.114614 1.443106
2.233333 0.785673 -0.031355 -0.348377 0.653159 0.121490 1.342916
2.266667 0.807593 -0.027246 -0.331327 0.661305 0.128421 1.258355
2.300000 0.829803 -0.022876 -0.295298 0.669238 0.135387 1.192017
2.333333 0.852298 -0.018245 -0.261532 0.676936 0.142356 1.143576
2.366667 0.875069 -0.013351 -0.241282 0.684376 0.149300 1.114372
2.400000 0.898108 -0.008194 -0.211886 0.691545 0.156197 1.102374
2.433333 0.921319 -0.002889 -0.179104 0.698441 0.163036 1.103146
2.466667 0.944779 0.002678 -0.142040 0.705045 0.169788 1.109343
2.500000 0.968480 0.008507 -0.102706 0.711353 0.176438 1.116726
2.533333 0.992335 0.014480 -0.050614 0.717363 0.182978 1.120890
2.566667 1.016411 0.020711 0.006381 0.723073 0.189396 1.114136
2.600000 1.040694 0.027196 0.040633 0.728484 0.195690 1.093711
2.633333 1.065113 0.033821 0.068615 0.733596 0.201860 1.058931
2.666667 1.089723 0.040694 0.101137 0.738415 0.207907 1.011051
2.700000 1.114512 0.047814 0.145396 0.742941 0.213825 0.952287
2.733333 1.139417 0.055067 0.178157 0.747174 0.219607 0.885330
2.766667 1.164431 0.062450 0.212917 0.751116 0.225249 0.816348
2.800000 1.189591 0.070066 0.240123 0.754766 0.230741 0.747793
2.833333 1.214884 0.077907 0.245231 0.758120 0.236067 0.682035
2.866667 1.240266 0.085871 0.268211 0.761179 0.241238 0.623993
2.900000 1.265758 0.094050 0.291052 0.763946 0.246263 0.579808
2.933333 1.291349 0.102438 0.299939 0.766420 0.251143 0.553409
2.966667 1.317007 0.110942 0.325641 0.768599 0.255880 0.545319
3.000000 1.342723 0.119557 0.336300 0.770482 0.260482 0.556284
3.033333 1.368506 0.128364 0.346745 0.772076 0.264956 0.582578
3.066667 1.394332 0.137277 0.354827 0.773383 0.269288 0.617999
3.100000 1.420196 0.146292 0.371272 0.774409 0.273468 0.650664
3.133333 1.446091 0.155478 0.373830 0.775165 0.277494 0.673138
3.166667 1.472002 0.164829 0.400820 0.775663 0.281360 0.680665
3.200000 1.497918 0.174338 0.448960 0.775914 0.285043 0.669059
3.233333 1.523829 0.183997 0.512098 0.775924 0.288526 0.636195
3.266667 1.549741 0.193740 0.547903 0.775690 0.291797 0.582710
3.300000 1.575645 0.203564 0.577373 0.775208 0.294844 0.516398
3.333333 1.601519 0.213519 0.573061 0.774473 0.297652 0.443300
3.366667 1.627371 0.223548 0.584860 0.773471 0.300219 0.368449
3.400000 1.653194 0.233645 0.590682 0.772185 0.302557 0.301478
3.433333 1.678980 0.243808 0.578940 0.770606 0.304680 0.251319
3.466667 1.704722 0.254032 0.570785 0.768738 0.306603 0.224847
3.500000 1.730412 0.264313 0.566584 0.766586 0.308340 0.221020
3.533333 1.756044 0.274647 0.559174 0.764149 0.309910 0.237505
3.566667 1.781543 0.285039 0.577632 0.761442 0.311321 0.271720
3.600000 1.806895 0.295476 0.591422 0.758485 0.312578 0.314356
3.633333 1.832166 0.305954 0.617736 0.755292 0.313681 0.357415
3.666667 1.857349 0.316469 0.637586 0.751864 0.314622 0.390567
3.700000 1.882347 0.326996 0.643606 0.748206 0.315397 0.412069
3.733333 1.907243 0.337551 0.668908 0.744328 0.315995 0.417847
3.766667 1.932030 0.348131 0.673648 0.740227 0.316410 0.409783
3.800000 1.956702 0.358732 0.706206 0.735881 0.316627 0.389442
3.833333 1.981251 0.369349 0.711385 0.731265 0.316628 0.363175
3.866667 2.005670 0.379980 0.735018 0.726375 0.316414 0.335323
3.900000 2.029836 0.390551 0.742107 0.721192 0.315974 0.307080
3.933333 2.053858 0.401128 0.738724 0.715689 0.315290 0.283655
3.966667 2.077731 0.411705 0.746688 0.709841 0.314344 0.262445
4.000000 2.101324 0.422195 0.746025 0.703665 0.313141 0.245772
4.033333 2.124755 0.432679 0.753044 0.697178 0.311687 0.223159
4.066667 2.148017 0.443151 0.767378 0.690374 0.309972 0.186747
4.100000 2.170977 0.453509 0.777759 0.683271 0.308003 0.124670
4.133333 2.193627 0.463742 0.775252 0.675914 0.305816 0.022399
4.166667 2.216090 0.473954 0.803464 0.668355 0.303453 -0.131250
4.200000 2.238360 0.484141 0.797463 0.660610 0.300931 -0.340012
4.233333 2.260306 0.494181 0.811494 0.652707 0.298279 -0.593177
4.266667 2.281923 0.504068 0.817630 0.644706 0.295556 -0.866125
4.300000 2.303206 0.513794 0.817020 0.636647 0.292805 -1.125710
4.333333 2.324274 0.523483 0.791258 0.628530 0.290033 -1.331577
4.366667 2.345124 0.533130 0.736972 0.620358 0.287252 -1.437577
4.400000 2.365630 0.542606 0.618241 0.612154 0.284489 -1.409316
4.433333 2.385908 0.552036 0.499117 0.603918 0.281753 -1.225167
4.466667 2.405952 0.561416 0.352259 0.595616 0.279016 -0.881984
4.500000 2.425651 0.570637 0.223473 0.587216 0.276253 -0.391504
4.533333 2.445108 0.579804 0.157539 0.578707 0.273456 0.216773
4.566667 2.464317 0.588913 0.154425 0.570076 0.270614 0.894333
4.600000 2.483276 0.597964 0.219524 0.561280 0.267686 1.581847
4.633333 2.501894 0.606876 0.350699 0.552299 0.264652 2.224990
4.666667 2.520173 0.615652 0.510985 0.543138 0.261514 2.775692
4.700000 2.538112 0.624293 0.705063 0.533811 0.258280 3.195218
4.733333 2.555784 0.632866 0.904292 0.524329 0.254954 3.465437
4.766667 2.573186 0.641370 1.071713 0.514705 0.251539 3.588156
4.800000 2.590237 0.649738 1.213589 0.504977 0.248054 3.579595
4.833333 2.606935 0.657968 1.337029 0.495171 0.244512 3.462721
4.866667 2.623275 0.666058 1.433558 0.485304 0.240915 3.267316
4.900000 2.639255 0.674005 1.502003 0.475380 0.237252 3.034259
4.933333 2.654874 0.681803 1.550982 0.465408 0.233515 2.799804
4.966667 2.670204 0.689523 1.620518 0.455396 0.229699 2.594281
5.000000 2.685243 0.697162 1.722442 0.445341 0.225786 2.448709
5.033333 2.699988 0.704721 1.824397 0.435225 0.221743 2.390979
5.066667 2.714367 0.712106 1.944918 0.425027 0.217527 2.431237
5.100000 2.728378 0.719310 2.028778 0.414739 0.213120 2.559867
5.133333 2.742018 0.726323 2.015093 0.404344 0.208509 2.763968
5.166667 2.755355 0.733251 2.004316 0.393824 0.203695 3.021114
5.200000 2.768388 0.740094 2.052756 0.383171 0.198696 3.304103
5.233333 2.781036 0.746730 2.175314 0.372404 0.193573 3.569194
5.266667 2.793298 0.753152 2.339427 0.361546 0.188408 3.782335
5.300000 2.805177 0.759355 2.534258 0.350604 0.183274 3.918720
5.333333 2.816674 0.765332 2.713390 0.339593 0.178239 3.959332
5.366667 2.827795 0.771081 2.943271 0.328543 0.173377 3.905944
5.400000 2.838544 0.776597 -3.135479 0.317478 0.168764 3.765901
5.433333 2.848981 0.782029 -2.966645 0.306403 0.164440 3.559018
5.466667 2.858997 0.787339 -2.826192 0.295333 0.160430 3.299896
5.500000 2.868599 0.792531 -2.771897 0.284302 0.156744 2.994641
5.533333 2.877887 0.797641 -2.739931 0.273335 0.153381 2.627721
5.566667 2.886862 0.802669 -2.752185 0.262433 0.150313 2.170542
5.600000 2.895433 0.807599 -2.780781 0.251604 0.147480 1.604168
5.633333 2.903604 0.812441 -2.767786 0.240870 0.144832 0.917323
5.666667 2.911381 0.817202 -2.623703 0.230240 0.142317 0.112183
5.700000 2.918846 0.821886 -2.367727 0.219703 0.139886 -0.795334
5.733333 2.925928 0.826497 -2.185283 0.209262 0.137494 -1.754685
5.766667 2.932700 0.831033 -2.176219 0.198939 0.135100 -2.694478
5.800000 2.939161 0.835497 -2.329911 0.188739 0.132688 -3.547350
5.833333 2.945313 0.839888 -2.650960 0.178656 0.130251 -4.232978
5.866667 2.951092 0.844229 -3.029629 0.168685 0.127776 -4.667347
5.900000 2.956495 0.848530 2.885287 0.158837 0.125258 -4.775949
5.933333 2.961582 0.852689 2.601963 0.149111 0.122705 -4.525413
5.966667 2.966351 0.856715 2.294911 0.139501 0.120132 -3.929188
6.000000 2.970818 0.860676 2.069533 0.130012 0.117541 -3.035434
6.033333 2.974965 0.864523 1.947668 0.120653 0.114935 -1.934044
6.066667 2.978792 0.868261 1.950404 0.111433 0.112338 -0.744567
6.100000 2.982322 0.871938 2.078043 0.102343 0.109785 0.410050
6.133333 2.985556 0.875558 2.245246 0.093381 0.107292 1.428845
6.166667 2.988496 0.879121 2.407769 0.084536 0.104880 2.239034
6.200000 2.991140 0.882577 2.592464 0.075797 0.102588 2.801734
6.233333 2.993497 0.885924 2.737983 0.067148 0.100452 3.114332
6.266667 2.995566 0.889221 2.906327 0.058581 0.098489 3.203163
6.300000 2.997364 0.892411 3.031034 0.050094 0.096718 3.112656
6.333333 2.998900 0.895497 3.124269 0.041681 0.095169 2.893564
6.366667 3.000155 0.898539 -3.072314 0.033344 0.093864 2.595851
6.400000 3.001107 0.901593 -3.007972 0.025083 0.092795 2.265630
6.433333 3.001782 0.904606 -2.950273 0.016901 0.091951 1.931894
6.466667 3.002183 0.907582 -2.911585 0.008799 0.091322 1.619360
6.500000 3.002312 0.910579 -2.877506 0.000781 0.090881 1.339960
6.533333 3.002177 0.913601 -2.843098 -0.007149 0.090591 1.098121
6.566667 3.001777 0.916591 -2.795567 -0.014981 0.090426 0.895290
6.600000 3.001127 0.919610 -2.751355 -0.022710 0.090379 0.726648
6.633333 3.000232 0.922659 -2.747150 -0.030332 0.090442 0.593383
6.666667 2.999079 0.925682 -2.753605 -0.037843 0.090607 0.488472
6.700000 2.997671 0.928682 -2.756058 -0.045237 0.090878 0.405882
6.733333 2.996011 0.931658 -2.757563 -0.052515 0.091258 0.339136
6.766667 2.994102 0.934615 -2.756374 -0.059675 0.091747 0.282718
6.800000 2.991957 0.937615 -2.730983 -0.066713 0.092340 0.235010
6.833333 2.989582 0.940663 -2.724757 -0.073621 0.093034 0.191394
6.866667 2.986982 0.943762 -2.708090 -0.080396 0.093823 0.146335
6.900000 2.984162 0.946916 -2.692880 -0.087029 0.094698 0.098393
6.933333 2.981132 0.950129 -2.687891 -0.093514 0.095649 0.046975
6.966667 2.977870 0.953331 -2.684463 -0.099852 0.096654 -0.003644
7.000000 2.974416 0.956597 -2.677655 -0.106050 0.097695 -0.051046
7.033333 2.970737 0.959856 -2.687704 -0.112112 0.098758 -0.094729
7.066667 2.966835 0.963109 -2.702732 -0.118045 0.099839 -0.128154
7.100000 2.962767 0.966433 -2.743326 -0.123859 0.100935 -0.148581
7.133333 2.958535 0.969828 -2.749940 -0.129566 0.102049 -0.153028
7.166667 2.954091 0.973220 -2.744175 -0.135174 0.103189 -0.145185
7.200000 2.949485 0.976686 -2.754114 -0.140690 0.104365 -0.127962
7.233333 2.944719 0.980225 -2.743514 -0.146123 0.105583 -0.103292
7.266667 2.939750 0.983766 -2.754948 -0.151486 0.106834 -0.074544
7.300000 2.934581 0.987307 -2.751459 -0.156785 0.108119 -0.047869
7.333333 2.929256 0.990929 -2.740434 -0.162023 0.109437 -0.027703
7.366667 2.923736 0.994554 -2.744598 -0.167201 0.110788 -0.013210
7.400000 2.918063 0.998264 -2.747644 -0.172322 0.112162 -0.005198
7.433333 2.912238 1.002061 -2.756969 -0.177388 0.113542 -0.000401
7.466667 2.906228 1.005863 -2.747113 -0.182396 0.114925 -0.000441
7.500000 2.900036 1.009670 -2.743745 -0.187349 0.116293 -0.001737
7.533333 2.893695 1.013568 -2.748155 -0.192249 0.117629 -0.001711
7.566667 2.887205 1.017561 -2.748523 -0.197101 0.118909 -0.001178
7.600000 2.880544 1.021560 -2.749809 -0.201905 0.120120 0.000853
7.633333 2.873735 1.025656 -2.752980 -0.206659 0.121261 0.001171
7.666667 2.866761 1.029758 -2.745847 -0.211363 0.122321 0.002372
7.700000 2.859624 1.033867 -2.744802 -0.216016 0.123307 0.004151
7.733333 2.852328 1.037983 -2.750721 -0.220615 0.124233 0.005425
7.766667 2.844876 1.042105 -2.748680 -0.225153 0.125127 0.006369
7.800000 2.837281 1.046332 -2.749956 -0.229628 0.126004 0.004089
7.833333 2.829536 1.050565 -2.748231 -0.234037 0.126896 -0.011955
7.866667 2.821645 1.054805 -2.745935 -0.238379 0.127834 -0.061573
7.900000 2.813611 1.059051 -2.743278 -0.242651 0.128834 -0.164213
7.933333 2.805437 1.063303 -2.743960 -0.246850 0.129903 -0.334933
7.966667 2.797126 1.067561 -2.751929 -0.250975 0.131043 -0.591100
8.000000 2.788676 1.071931 -2.746086 -0.255020 0.132267 -0.940832
8.033333 2.780085 1.076415 -2.745323 -0.258980 0.133552 -1.368097
8.066667 2.771367 1.080904 -2.746915 -0.262843 0.134867 -1.839102
8.100000 2.762527 1.085397 -2.741944 -0.266599 0.136190 -2.319055
8.133333 2.753566 1.089893 -2.773880 -0.270243 0.137495 -2.778375
8.166667 2.744467 1.094509 -2.919578 -0.273768 0.138745 -3.171520
8.200000 2.735226 1.099245 3.136728 -0.277168 0.139897 -3.456939
8.233333 2.725876 1.103984 2.907081 -0.280445 0.140934 -3.611552
8.266667 2.716441 1.108740 2.727666 -0.283604 0.141842 -3.631438
8.300000 2.706917 1.113515 2.514115 -0.286652 0.142604 -3.509993
8.333333 2.697300 1.118313 2.360619 -0.289597 0.143205 -3.247206
8.366667 2.687587 1.123132 2.263716 -0.292450 0.143649 -2.873677
8.400000 2.677775 1.127971 2.210595 -0.295222 0.143948 -2.430971
8.433333 2.667875 1.132806 2.168734 -0.297926 0.144108 -1.961140
8.466667 2.657889 1.137636 2.129965 -0.300566 0.144135 -1.490876
8.500000 2.647822 1.142460 2.116695 -0.303144 0.144040 -1.056760
8.533333 2.637677 1.147276 2.100407 -0.305658 0.143833 -0.682323
8.566667 2.627436 1.152085 2.099806 -0.308106 0.143522 -0.372205
8.600000 2.617098 1.156882 2.093567 -0.310480 0.143109 -0.119406
8.633333 2.606669 1.161661 2.097893 -0.312768 0.142601 0.089580
8.666667 2.596175 1.166429 2.109593 -0.314960 0.142008 0.258376
8.700000 2.585621 1.171183 2.115949 -0.317043 0.141345 0.399767
8.733333 2.575010 1.175923 2.144546 -0.319006 0.140621 0.518751
8.766667 2.564321 1.180620 2.153841 -0.320841 0.139845 0.623604
8.800000 2.553560 1.185267 2.192627 -0.322541 0.139021 0.714255
8.833333 2.542731 1.189860 2.222993 -0.324104 0.138150 0.788430
8.866667 2.531859 1.194435 2.261546 -0.325529 0.137222 0.849351
8.900000 2.520949 1.198990 2.279358 -0.326819 0.136226 0.899545
8.933333 2.510003 1.203526 2.309967 -0.327973 0.135159 0.944023
8.966667 2.499026 1.208040 2.349611 -0.328994 0.134016 0.977800
9.000000 2.488022 1.212532 2.386743 -0.329885 0.132786 1.005701
9.033333 2.476992 1.217002 2.415913 -0.330648 0.131469 1.032444
9.066667 2.465932 1.221391 2.448965 -0.331287 0.130075 1.057125
9.100000 2.454854 1.225755 2.491131 -0.331802 0.128612 1.075325
9.133333 2.443757 1.230035 2.521055 -0.332193 0.127081 1.084124
9.166667 2.432647 1.234228 2.543617 -0.332457 0.125485 1.087488
9.200000 2.421530 1.238332 2.594122 -0.332587 0.123844 1.082399
9.233333 2.410410 1.242409 2.644278 -0.332577 0.122166 1.064610
9.266667 2.399291 1.246458 2.689064 -0.332420 0.120450 1.035309
9.300000 2.388176 1.250477 2.716234 -0.332114 0.118700 0.999004
9.333333 2.377079 1.254403 2.756677 -0.331656 0.116926 0.955952
9.366667 2.365993 1.258300 2.791559 -0.331048 0.115131 0.906236
9.400000 2.354922 1.262166 2.812214 -0.330285 0.113297 0.852834
9.433333 2.343887 1.265937 2.843250 -0.329367 0.111418 0.799410
9.466667 2.332896 1.269615 2.862004 -0.328289 0.109494 0.748735
9.500000 2.321952 1.273199 2.874352 -0.327047 0.107524 0.698955
9.533333 2.311037 1.276751 2.904132 -0.325640 0.105505 0.653013
9.566667 2.300182 1.280210 2.922548 -0.324074 0.103451 0.610362
9.600000 2.289362 1.283637 2.944834 -0.322356 0.101384 0.569816
9.633333 2.278581 1.287031 2.971505 -0.320493 0.099318 0.531796
9.666667 2.267878 1.290334 2.978520 -0.318491 0.097264 0.494322
9.700000 2.257260 1.293547 3.006423 -0.316358 0.095230 0.459083
9.733333 2.246732 1.296670 3.018079 -0.314096 0.093224 0.423996
9.766667 2.236300 1.299705 3.023881 -0.311706 0.091244 0.392564
9.800000 2.225968 1.302653 3.043287 -0.309194 0.089296 0.364317
9.833333 2.215692 1.305569 3.043502 -0.306578 0.087394 0.340173
9.866667 2.205477 1.308453 3.052941 -0.303876 0.085553 0.320070
9.900000 2.195323 1.311306 3.061024 -0.301101 0.083781 0.304264
9.933333 2.185291 1.314078 3.071812 -0.298273 0.082097 0.295753
9.966667 2.175385 1.316770 3.084806 -0.295414 0.080516 0.287453
10.000000 2.165612 1.319384 3.091879 -0.292534 0.079054 0.279701
10.033333 2.155911 1.321969 3.116273 -0.289641 0.077719 0.262635
10.066667 2.146350 1.324479 3.095672 -0.286743 0.076527 0.230260
10.100000 2.136867 1.326961 3.129831 -0.283854 0.075497 0.170008
10.133333 2.127464 1.329414 3.129603 -0.280979 0.074627 0.075689
10.166667 2.118144 1.331840 3.138704 -0.278110 0.073913 -0.050091
10.200000 2.108908 1.334240 -3.136317 -0.275233 0.073327 -0.204700
10.233333 2.099758 1.336614 -3.120044 -0.272329 0.072845 -0.374518
10.266667 2.090715 1.339036 -3.117448 -0.269365 0.072423 -0.547401
10.300000 2.081763 1.341433 -3.122440 -0.266307 0.072019 -0.700040
10.333333 2.072922 1.343883 -3.139074 -0.263127 0.071594 -0.822295
10.366667 2.064176 1.346310 3.081609 -0.259809 0.071116 -0.905069
10.400000 2.055528 1.348713 2.986461 -0.256345 0.070566 -0.943613
10.433333 2.046980 1.351094 2.889689 -0.252735 0.069927 -0.932643
10.466667 2.038533 1.353453 2.831050 -0.248988 0.069201 -0.873847
10.500000 2.030249 1.355766 2.807105 -0.245119 0.068394 -0.776860
10.533333 2.022127 1.358034 2.819075 -0.241143 0.067525 -0.650708
10.566667 2.014166 1.360258 2.816094 -0.237079 0.066615 -0.507448
10.600000 2.006365 1.362441 2.816612 -0.232949 0.065685 -0.362304
10.633333 1.998674 1.364605 2.821276 -0.228777 0.064759 -0.236139
10.666667 1.991095 1.366751 2.817687 -0.224582 0.063851 -0.136751
10.700000 1.983672 1.368861 2.816244 -0.220377 0.062973 -0.068715
10.733333 1.976405 1.370933 2.809403 -0.216177 0.062131 -0.026217
10.766667 1.969291 1.372972 2.824431 -0.211992 0.061329 -0.007324
10.800000 1.962295 1.374995 2.815915 -0.207821 0.060571 -0.002965
10.833333 1.955417 1.377005 2.826608 -0.203669 0.059859 -0.002588
10.866667 1.948691 1.378985 2.814748 -0.199538 0.059197 -0.003164
10.900000 1.942113 1.380936 2.822271 -0.195435 0.058590 -0.002754
10.933333 1.935684 1.382859 2.812895 -0.191361 0.058040 -0.003928
10.966667 1.929401 1.384757 2.810060 -0.187316 0.057548 -0.002709
11.000000 1.923242 1.386646 2.815205 -0.183300 0.057114 -0.000184
11.033333 1.917209 1.388527 2.818515 -0.179314 0.056736 0.001213
11.066667 1.911302 1.390400 2.820706 -0.175351 0.056411 0.002322
11.100000 1.905522 1.392267 2.818879 -0.171405 0.056133 0.003810
11.133333 1.899870 1.394128 2.811141 -0.167469 0.055898 0.005182
11.166667 1.894347 1.395985 2.821649 -0.163536 0.055700 0.002480
11.200000 1.888954 1.397838 2.813492 -0.159600 0.055534 -0.001455
11.233333 1.883692 1.399689 2.819130 -0.155655 0.055394 -0.004491
11.266667 1.878566 1.401528 2.820819 -0.151699 0.055279 -0.007593
11.300000 1.873575 1.403357 2.821504 -0.147732 0.055189 -0.011308
11.333333 1.868716 1.405186 2.825039 -0.143758 0.055122 -0.014789
11.366667 1.863991 1.407017 2.806288 -0.139779 0.055082 -0.013687
11.400000 1.859399 1.408842 2.817206 -0.135797 0.055070 -0.013326
