t x y theta dxdt dydt dthetadt
0.000000 0.000000 0.000000 0.403223 0.113632 0.061668 0.023077
0.033333 0.003782 0.001977 0.396524 0.115917 0.065210 0.021936
0.066667 0.007674 0.004133 0.406276 0.118566 0.069629 0.016468
0.100000 0.011637 0.006390 0.406153 0.121722 0.075202 0.002722
0.133333 0.015674 0.008749 0.402262 0.125624 0.082348 -0.020522
0.166667 0.019788 0.011210 0.398808 0.130578 0.091535 -0.053357
0.200000 0.023981 0.013774 0.397456 0.136901 0.103218 -0.099825
0.233333 0.028314 0.016857 0.406040 0.144822 0.117651 -0.163341
0.266667 0.032733 0.020044 0.401083 0.154482 0.134911 -0.242359
0.300000 0.037452 0.023989 0.389939 0.165877 0.154838 -0.336630
0.333333 0.042260 0.028037 0.401685 0.178821 0.176992 -0.447818
0.366667 0.047644 0.033235 0.384395 0.192889 0.200580 -0.577853
0.400000 0.053714 0.039715 0.361076 0.207751 0.224936 -0.724477
0.433333 0.060680 0.047612 0.341968 0.223207 0.249657 -0.880746
0.466667 0.068805 0.057256 0.304307 0.239015 0.274295 -1.042122
0.500000 0.078316 0.068897 0.270310 0.254927 0.298459 -1.202282
0.533333 0.087910 0.080611 0.231294 0.270871 0.322102 -1.348783
0.566667 0.097585 0.092390 0.170204 0.286962 0.345507 -1.467725
0.600000 0.107337 0.104223 0.120019 0.303154 0.368919 -1.550806
0.633333 0.117161 0.116101 0.057689 0.319232 0.392327 -1.590437
0.666667 0.127055 0.128014 -0.011385 0.335174 0.416227 -1.581893
0.700000 0.137012 0.139950 -0.097143 0.351154 0.441380 -1.519373
0.733333 0.148841 0.154564 -0.168791 0.367006 0.468136 -1.405455
0.766667 0.162498 0.171804 -0.233299 0.382342 0.496735 -1.248779
0.800000 0.176198 0.189028 -0.273915 0.396751 0.527309 -1.055832
0.833333 0.189933 0.206221 -0.315412 0.409859 0.560292 -0.838723
0.866667 0.204743 0.225791 -0.332982 0.421090 0.595317 -0.612057
0.900000 0.219570 0.245293 -0.333672 0.429678 0.631982 -0.395126
0.933333 0.234868 0.267155 -0.343209 0.435244 0.669888 -0.202528
0.966667 0.250161 0.288909 -0.335615 0.437598 0.708674 -0.044309
1.000000 0.265596 0.313289 -0.308676 0.436475 0.747510 0.074177
1.033333 0.281003 0.337513 -0.288612 0.431699 0.785174 0.155031
1.066667 0.296168 0.364191 -0.267497 0.423015 0.820606 0.211116
1.100000 0.310916 0.393005 -0.246414 0.410058 0.851985 0.263003
1.133333 0.325009 0.423745 -0.235251 0.392096 0.877339 0.330101
1.166667 0.338500 0.456558 -0.236821 0.368611 0.894495 0.431581
1.200000 0.351909 0.489065 -0.234645 0.339480 0.902093 0.580429
1.233333 0.364216 0.522780 -0.247711 0.304355 0.898305 0.779457
1.266667 0.376425 0.556116 -0.268351 0.263349 0.882059 1.020805
1.300000 0.386476 0.588972 -0.270509 0.217245 0.853443 1.287352
1.333333 0.393948 0.620387 -0.244927 0.167458 0.812896 1.558737
1.366667 0.401306 0.651315 -0.189692 0.115152 0.761255 1.809858
1.400000 0.405075 0.678687 -0.070775 0.061675 0.698574 2.015551
1.433333 0.404929 0.701775 0.066600 0.009068 0.626580 2.157546
1.466667 0.400734 0.719741 0.195710 -0.040571 0.546913 2.220376
1.500000 0.396439 0.737105 0.319087 -0.085777 0.460707 2.197171
1.533333 0.392054 0.753848 0.422616 -0.125595 0.369700 2.088764
1.566667 0.384319 0.763420 0.473688 -0.158761 0.275982 1.909366
1.600000 0.376517 0.772337 0.534596 -0.184418 0.181963 1.680555
1.633333 0.368663 0.780588 0.571945 -0.202540 0.088755 1.427139
1.666667 0.359661 0.780241 0.600199 -0.213299 -0.003128 1.175075
1.700000 0.350636 0.779215 0.613849 -0.216702 -0.093168 0.948160
1.733333 0.342956 0.768685 0.634861 -0.212418 -0.181047 0.765093
1.766667 0.335281 0.757483 0.646103 -0.200336 -0.267820 0.629648
1.800000 0.327623 0.745619 0.654899 -0.180451 -0.353953 0.541706
1.833333 0.319994 0.733102 0.658567 -0.152150 -0.439758 0.497710
1.866667 0.312406 0.719942 0.659484 -0.115107 -0.525654 0.492262
1.900000 0.304872 0.706151 0.672966 -0.068657 -0.612170 0.517824
1.933333 0.302239 0.683925 0.695641 -0.013017 -0.699947 0.565698
1.966667 0.299679 0.661101 0.714300 0.051545 -0.788489 0.633788
2.000000 0.301711 0.631675 0.731856 0.124160 -0.876994 0.719068
2.033333 0.303824 0.601700 0.752138 0.203664 -0.964192 0.815512
2.066667 0.310193 0.566964 0.789638 0.288343 -1.047960 0.919588
2.100000 0.320626 0.528306 0.812598 0.375444 -1.125677 1.028176
2.133333 0.334834 0.486483 0.841385 0.462942 -1.195420 1.138756
2.166667 0.352660 0.442364 0.891122 0.548147 -1.255446 1.245104
2.200000 0.374513 0.395835 0.926180 0.629041 -1.304643 1.340043
2.233333 0.400586 0.347680 0.982197 0.702753 -1.341798 1.417140
2.266667 0.426649 0.299255 1.036072 0.767448 -1.366591 1.467882
2.300000 0.456878 0.250843 1.090599 0.821605 -1.378894 1.480952
2.333333 0.487037 0.202256 1.150056 0.863929 -1.378390 1.447335
2.366667 0.520817 0.155403 1.208875 0.893349 -1.364688 1.361658
2.400000 0.554459 0.108469 1.282954 0.908787 -1.337558 1.215998
2.433333 0.587926 0.061499 1.346920 0.910144 -1.297182 1.004143
2.466667 0.621183 0.014539 1.391368 0.896991 -1.243401 0.719687
2.500000 0.654192 -0.032366 1.426433 0.869635 -1.176181 0.360493
2.533333 0.686220 -0.073910 1.439197 0.828151 -1.095718 -0.076069
2.566667 0.715724 -0.109684 1.449007 0.773978 -1.003309 -0.593638
2.600000 0.744871 -0.145289 1.439745 0.709031 -0.900787 -1.188684
2.633333 0.769309 -0.174404 1.397946 0.635735 -0.790751 -1.849075
2.666667 0.793328 -0.203294 1.349352 0.556522 -0.675810 -2.546990
2.700000 0.811830 -0.225409 1.278479 0.474276 -0.559837 -3.249439
2.733333 0.824763 -0.240480 1.170986 0.392118 -0.446236 -3.917385
2.766667 0.832248 -0.247970 1.029468 0.312412 -0.337615 -4.502625
2.800000 0.839231 -0.255187 0.834190 0.237040 -0.236039 -4.952351
2.833333 0.841327 -0.254798 0.609936 0.167361 -0.143429 -5.223015
2.866667 0.842905 -0.254143 0.359402 0.104678 -0.061862 -5.291915
2.900000 0.843958 -0.253233 0.080806 0.049040 0.008067 -5.143366
2.933333 0.844483 -0.252075 -0.226920 -0.000175 0.065887 -4.770950
2.966667 0.842617 -0.245819 -0.487906 -0.043944 0.111344 -4.188032
3.000000 0.840213 -0.239338 -0.618974 -0.083138 0.144248 -3.432417
3.033333 0.837271 -0.232649 -0.716260 -0.118994 0.165470 -2.549214
3.066667 0.832891 -0.223853 -0.773868 -0.152575 0.176070 -1.585581
3.100000 0.827130 -0.214021 -0.784069 -0.184283 0.176811 -0.598648
3.133333 0.820157 -0.204358 -0.761012 -0.213970 0.168522 0.349267
3.166667 0.811943 -0.195732 -0.695556 -0.241300 0.152379 1.205152
3.200000 0.802575 -0.189030 -0.598919 -0.265941 0.129714 1.935322
3.233333 0.792243 -0.184943 -0.482780 -0.287320 0.101895 2.511339
3.266667 0.781133 -0.183884 -0.350421 -0.304977 0.070763 2.912835
3.300000 0.769500 -0.182738 -0.220755 -0.318792 0.038432 3.133549
3.333333 0.757350 -0.181514 -0.070356 -0.328985 0.006877 3.173276
3.366667 0.745250 -0.183305 0.089662 -0.335940 -0.022143 3.036319
3.400000 0.732642 -0.185033 0.242981 -0.340148 -0.047211 2.729726
3.433333 0.720745 -0.188507 0.363107 -0.342231 -0.067477 2.269645
3.466667 0.709574 -0.192976 0.468618 -0.343013 -0.082676 1.680101
3.500000 0.699122 -0.197755 0.547920 -0.343339 -0.092847 0.991197
3.533333 0.688176 -0.202484 0.584938 -0.343898 -0.098093 0.248127
3.566667 0.676738 -0.207165 0.584721 -0.345229 -0.099108 -0.497356
3.600000 0.665621 -0.211112 0.547345 -0.347971 -0.096368 -1.194422
3.633333 0.654556 -0.214392 0.467796 -0.352672 -0.090385 -1.795452
3.666667 0.643001 -0.217632 0.340557 -0.359593 -0.081787 -2.259192
3.700000 0.631577 -0.220006 0.189260 -0.368927 -0.071275 -2.557899
3.733333 0.619664 -0.222349 0.026441 -0.380864 -0.059557 -2.683935
3.766667 0.607262 -0.224667 -0.149672 -0.395584 -0.047011 -2.644429
3.800000 0.594417 -0.225457 -0.306238 -0.413088 -0.034405 -2.455953
3.833333 0.581083 -0.226233 -0.414489 -0.433175 -0.022437 -2.148354
3.866667 0.567263 -0.227002 -0.472855 -0.455869 -0.011820 -1.760132
3.900000 0.552956 -0.227771 -0.488511 -0.480931 -0.003108 -1.330401
3.933333 0.537135 -0.227219 -0.488591 -0.508032 0.003040 -0.894567
3.966667 0.519584 -0.225585 -0.472823 -0.536738 0.005874 -0.484722
4.000000 0.501554 -0.223976 -0.459451 -0.566502 0.004992 -0.128546
4.033333 0.481491 -0.222355 -0.443714 -0.596749 -0.000234 0.160969
4.066667 0.460958 -0.220776 -0.427993 -0.626553 -0.010218 0.379135
4.100000 0.439962 -0.219250 -0.409241 -0.655173 -0.025433 0.526306
4.133333 0.417020 -0.219643 -0.373928 -0.681868 -0.046161 0.609956
4.166667 0.393629 -0.220104 -0.353470 -0.706110 -0.072496 0.642368
4.200000 0.368235 -0.223433 -0.330539 -0.727380 -0.104031 0.634324
4.233333 0.342410 -0.226841 -0.293945 -0.745524 -0.139906 0.593274
4.266667 0.316167 -0.230333 -0.266431 -0.760695 -0.179027 0.528911
4.300000 0.289514 -0.233912 -0.230592 -0.773051 -0.220295 0.451769
4.333333 0.262538 -0.240828 -0.202918 -0.783017 -0.262360 0.366984
4.366667 0.235773 -0.251037 -0.180990 -0.790962 -0.303647 0.273710
4.400000 0.209655 -0.264385 -0.199544 -0.797578 -0.342988 0.179595
4.433333 0.183171 -0.277811 -0.239082 -0.803381 -0.379301 0.091174
4.466667 0.156879 -0.293604 -0.237416 -0.808849 -0.411379 0.008191
4.500000 0.130238 -0.309457 -0.224309 -0.814459 -0.438017 -0.070127
4.533333 0.103257 -0.325361 -0.235248 -0.820501 -0.458629 -0.141869
4.566667 0.075944 -0.342407 -0.225592 -0.827180 -0.473085 -0.201174
4.600000 0.048257 -0.360063 -0.231594 -0.834438 -0.481547 -0.252139
4.633333 0.020257 -0.377736 -0.238201 -0.842211 -0.484201 -0.298496
4.666667 -0.008091 -0.395203 -0.243756 -0.850325 -0.481882 -0.333956
4.700000 -0.036682 -0.412079 -0.266776 -0.858600 -0.475429 -0.353022
4.733333 -0.065346 -0.428023 -0.275593 -0.866873 -0.465434 -0.353232
4.766667 -0.094288 -0.443936 -0.296763 -0.874980 -0.452508 -0.332401
4.800000 -0.123612 -0.458627 -0.330930 -0.882824 -0.437289 -0.285116
4.833333 -0.153198 -0.473268 -0.353721 -0.890313 -0.420541 -0.209528
4.866667 -0.183035 -0.487850 -0.374512 -0.897384 -0.402680 -0.112326
4.900000 -0.213218 -0.501253 -0.377077 -0.903946 -0.384193 -0.001172
4.933333 -0.243715 -0.513487 -0.378909 -0.909844 -0.365543 0.115375
4.966667 -0.274377 -0.524718 -0.366624 -0.914990 -0.347161 0.227096
5.000000 -0.305255 -0.535861 -0.334852 -0.919293 -0.329194 0.320121
5.033333 -0.336229 -0.546258 -0.321264 -0.922623 -0.311778 0.386438
5.066667 -0.367269 -0.556120 -0.287015 -0.924915 -0.295162 0.420187
5.100000 -0.398173 -0.565420 -0.261456 -0.926211 -0.279501 0.418768
5.133333 -0.429408 -0.574317 -0.232054 -0.926631 -0.264891 0.383779
5.166667 -0.460728 -0.582772 -0.213261 -0.926260 -0.251248 0.319847
5.200000 -0.491870 -0.590777 -0.203815 -0.925207 -0.238581 0.238719
5.233333 -0.522771 -0.598281 -0.189212 -0.923700 -0.226872 0.149156
5.266667 -0.553295 -0.605235 -0.197774 -0.921948 -0.216043 0.062973
5.300000 -0.583960 -0.612070 -0.202441 -0.920064 -0.205997 -0.010821
5.333333 -0.614759 -0.618783 -0.214138 -0.918142 -0.196684 -0.064352
5.366667 -0.644979 -0.624905 -0.232416 -0.916304 -0.188136 -0.092379
5.400000 -0.675319 -0.630903 -0.245354 -0.914634 -0.180344 -0.095279
5.433333 -0.705774 -0.636777 -0.253232 -0.913098 -0.173252 -0.074334
5.466667 -0.736138 -0.642314 -0.261213 -0.911614 -0.166775 -0.035688
5.500000 -0.766523 -0.647599 -0.267526 -0.910114 -0.160867 0.014637
5.533333 -0.796890 -0.652645 -0.267606 -0.908568 -0.155485 0.069556
5.566667 -0.827292 -0.657569 -0.253195 -0.906898 -0.150524 0.120452
5.600000 -0.857621 -0.662425 -0.244589 -0.905063 -0.145896 0.160810
5.633333 -0.888032 -0.667155 -0.225188 -0.903028 -0.141526 0.185552
5.666667 -0.918177 -0.671824 -0.210446 -0.900779 -0.137328 0.194273
5.700000 -0.947993 -0.676386 -0.199069 -0.898358 -0.133212 0.185260
5.733333 -0.977872 -0.680785 -0.192132 -0.895767 -0.129067 0.159075
5.766667 -1.007680 -0.685114 -0.183901 -0.893030 -0.124816 0.121389
5.800000 -1.037360 -0.689291 -0.184091 -0.890163 -0.120388 0.079624
5.833333 -1.066874 -0.693234 -0.181093 -0.887254 -0.115749 0.039363
5.866667 -1.096439 -0.697053 -0.175943 -0.884440 -0.110931 0.002794
5.900000 -1.126051 -0.700747 -0.180521 -0.881802 -0.105970 -0.023912
5.933333 -1.155707 -0.704317 -0.200798 -0.879431 -0.100929 -0.036784
5.966667 -1.184933 -0.707646 -0.209936 -0.877441 -0.095902 -0.035790
6.000000 -1.213731 -0.710656 -0.201644 -0.875976 -0.090990 -0.026158
6.033333 -1.242565 -0.713545 -0.216266 -0.875126 -0.086265 -0.008379
6.066667 -1.271496 -0.716218 -0.218556 -0.874900 -0.081781 0.016769
6.100000 -1.300442 -0.718707 -0.209907 -0.875296 -0.077592 0.044576
6.133333 -1.329417 -0.721077 -0.198693 -0.876279 -0.073741 0.069541
6.166667 -1.358258 -0.723349 -0.201862 -0.877739 -0.070231 0.087952
6.200000 -1.387480 -0.725580 -0.191152 -0.879429 -0.067031 0.101149
6.233333 -1.416948 -0.727721 -0.182999 -0.881103 -0.064119 0.106598
6.266667 -1.446607 -0.729823 -0.179303 -0.882560 -0.061437 0.102264
6.300000 -1.476284 -0.731813 -0.168225 -0.883634 -0.058916 0.089107
6.333333 -1.506045 -0.733723 -0.170981 -0.884184 -0.056488 0.069330
6.366667 -1.535820 -0.735523 -0.175291 -0.884127 -0.054105 0.046699
6.400000 -1.565508 -0.737323 -0.169350 -0.883552 -0.051728 0.022805
6.433333 -1.595118 -0.739051 -0.165757 -0.882568 -0.049321 -0.000590
6.466667 -1.624653 -0.740698 -0.163388 -0.881298 -0.046874 -0.020094
6.500000 -1.653908 -0.742187 -0.171078 -0.879843 -0.044387 -0.034788
6.533333 -1.682822 -0.743649 -0.177803 -0.878350 -0.041874 -0.041290
6.566667 -1.711878 -0.745018 -0.173249 -0.876954 -0.039348 -0.043022
6.600000 -1.740979 -0.746266 -0.183080 -0.875711 -0.036841 -0.040366
6.633333 -1.770153 -0.747466 -0.183322 -0.874648 -0.034391 -0.034110
6.666667 -1.799324 -0.748566 -0.201305 -0.873761 -0.032038 -0.023279
6.700000 -1.828492 -0.749570 -0.189683 -0.873048 -0.029816 -0.008306
6.733333 -1.857655 -0.750477 -0.188461 -0.872411 -0.027744 0.005615
6.766667 -1.886812 -0.751290 -0.181261 -0.871730 -0.025839 0.019670
6.800000 -1.915961 -0.752009 -0.173439 -0.870901 -0.024102 0.032547
6.833333 -1.944753 -0.752676 -0.187709 -0.869873 -0.022531 0.045765
6.866667 -1.973682 -0.753400 -0.175462 -0.868604 -0.021103 0.052034
6.900000 -2.002733 -0.754110 -0.175557 -0.867067 -0.019790 0.052221
6.933333 -2.031772 -0.754731 -0.182009 -0.865341 -0.018569 0.050352
6.966667 -2.060765 -0.755339 -0.180882 -0.863548 -0.017403 0.046972
7.000000 -2.089676 -0.755916 -0.162723 -0.861813 -0.016256 0.041383
7.033333 -2.118415 -0.756452 -0.158147 -0.860193 -0.015080 0.030877
7.066667 -2.147001 -0.756948 -0.166076 -0.858774 -0.013847 0.022656
7.100000 -2.175320 -0.757421 -0.169880 -0.857676 -0.012535 0.015855
7.133333 -2.203623 -0.757811 -0.166319 -0.856924 -0.011122 0.008481
7.166667 -2.231905 -0.758171 -0.163231 -0.856517 -0.009594 0.000006
7.200000 -2.260187 -0.758498 -0.171639 -0.856439 -0.007945 -0.005915
7.233333 -2.288512 -0.758771 -0.168846 -0.856702 -0.006185 -0.009104
7.266667 -2.317329 -0.759017 -0.164244 -0.857240 -0.004317 -0.012437
7.300000 -2.346127 -0.759183 -0.173936 -0.857899 -0.002347 -0.014671
7.333333 -2.374905 -0.759270 -0.176069 -0.858565 -0.000276 -0.017050
7.366667 -2.403492 -0.759226 -0.170641 -0.859135 0.001892 -0.018098
7.400000 -2.432058 -0.759104 -0.169581 -0.859547 0.004154 -0.019896
7.433333 -2.460814 -0.758931 -0.170957 -0.859728 0.006512 -0.020534
7.466667 -2.489547 -0.758682 -0.160062 -0.859715 0.008978 -0.020407
7.500000 -2.518256 -0.758357 -0.173915 -0.859597 0.011566 -0.021304
7.533333 -2.546940 -0.757957 -0.174814 -0.859480 0.014271 -0.021300
7.566667 -2.575599 -0.757483 -0.185530 -0.859438 0.017098 -0.020059
7.600000 -2.604228 -0.756941 -0.176802 -0.859486 0.020041 -0.019480
7.633333 -2.632804 -0.756324 -0.169606 -0.859666 0.023094 -0.020504
7.666667 -2.661264 -0.755498 -0.183066 -0.859964 0.026218 -0.021018
7.700000 -2.689695 -0.754601 -0.182990 -0.860340 0.029371 -0.021910
7.733333 -2.718430 -0.753543 -0.171575 -0.860722 0.032512 -0.024183
7.766667 -2.747134 -0.752416 -0.177909 -0.861051 0.035597 -0.028969
7.800000 -2.775963 -0.751088 -0.172496 -0.861313 0.038575 -0.033767
7.833333 -2.804867 -0.749653 -0.176474 -0.861462 0.041396 -0.036486
7.866667 -2.833735 -0.748151 -0.184238 -0.861447 0.044047 -0.039092
7.900000 -2.862566 -0.746584 -0.184704 -0.861257 0.046513 -0.039359
7.933333 -2.891283 -0.744959 -0.185563 -0.860946 0.048796 -0.035819
7.966667 -2.919960 -0.743271 -0.186075 -0.860564 0.050898 -0.029107
8.000000 -2.948595 -0.741522 -0.189238 -0.860166 0.052844 -0.020250
8.033333 -2.977187 -0.739713 -0.196985 -0.859848 0.054667 -0.011691
8.066667 -3.005733 -0.737845 -0.199989 -0.859730 0.056377 -0.003113
8.100000 -3.034231 -0.735919 -0.194072 -0.859868 0.057994 0.005218
8.133333 -3.062891 -0.733962 -0.188156 -0.860257 0.059533 0.011953
8.166667 -3.091500 -0.731949 -0.177524 -0.860894 0.061012 0.016130
8.200000 -3.120016 -0.729835 -0.182784 -0.861746 0.062434 0.018256
8.233333 -3.148849 -0.727725 -0.182065 -0.862682 0.063803 0.018655
8.266667 -3.177626 -0.725563 -0.187299 -0.863573 0.065141 0.017951
8.300000 -3.206343 -0.723350 -0.181143 -0.864348 0.066465 0.014713
8.333333 -3.235204 -0.721124 -0.186068 -0.864986 0.067790 0.011416
8.366667 -3.264262 -0.718837 -0.186182 -0.865459 0.069127 0.010468
8.400000 -3.293354 -0.716546 -0.190684 -0.865740 0.070490 0.011424
8.433333 -3.322376 -0.714208 -0.177772 -0.865923 0.071887 0.013328
8.466667 -3.351295 -0.711795 -0.182362 -0.866061 0.073302 0.015732
8.500000 -3.380137 -0.709337 -0.182188 -0.866158 0.074714 0.020233
8.533333 -3.408899 -0.706835 -0.185395 -0.866183 0.076103 0.023551
8.566667 -3.437355 -0.704322 -0.180146 -0.866145 0.077451 0.023701
8.600000 -3.466057 -0.701656 -0.183365 -0.866040 0.078739 0.021667
8.633333 -3.494959 -0.698948 -0.181596 -0.865816 0.079969 0.018801
8.666667 -3.524033 -0.696184 -0.173454 -0.865446 0.081163 0.013699
8.700000 -3.553158 -0.693377 -0.172262 -0.864911 0.082351 0.006573
8.733333 -3.582208 -0.690641 -0.176224 -0.864213 0.083581 -0.001427
8.766667 -3.611152 -0.687869 -0.173359 -0.863314 0.084900 -0.008677
8.800000 -3.639986 -0.685061 -0.177798 -0.862231 0.086369 -0.016686
8.833333 -3.668726 -0.682273 -0.174234 -0.860987 0.088018 -0.025243
8.866667 -3.697300 -0.679405 -0.180154 -0.859604 0.089865 -0.031512
8.900000 -3.725751 -0.676504 -0.185650 -0.858166 0.091931 -0.037527
8.933333 -3.754075 -0.673572 -0.178046 -0.856741 0.094199 -0.043926
8.966667 -3.782574 -0.670362 -0.184676 -0.855397 0.096615 -0.050317
9.000000 -3.811231 -0.667058 -0.195089 -0.854162 0.099099 -0.055190
9.033333 -3.839745 -0.663727 -0.180186 -0.853046 0.101570 -0.059413
9.066667 -3.868225 -0.660210 -0.188842 -0.852064 0.103936 -0.063189
9.100000 -3.896641 -0.656634 -0.189293 -0.851191 0.106077 -0.065153
9.133333 -3.924960 -0.652995 -0.190723 -0.850450 0.107887 -0.062910
9.166667 -3.953236 -0.649271 -0.191383 -0.849860 0.109319 -0.057622
9.200000 -3.981344 -0.645526 -0.200537 -0.849457 0.110357 -0.050539
9.233333 -4.009687 -0.641632 -0.206410 -0.849295 0.110986 -0.039737
9.266667 -4.037850 -0.637719 -0.213130 -0.849420 0.111230 -0.026151
9.300000 -4.066132 -0.633922 -0.210931 -0.849797 0.111152 -0.011115
9.333333 -4.094462 -0.630202 -0.208054 -0.850291 0.110839 0.002943
9.366667 -4.122593 -0.626466 -0.203606 -0.850820 0.110365 0.015678
9.400000 -4.150709 -0.622832 -0.202609 -0.851280 0.109799 0.025825
9.433333 -4.179236 -0.619239 -0.201144 -0.851488 0.109239 0.031835
9.466667 -4.208075 -0.615703 -0.197779 -0.851225 0.108762 0.032247
9.500000 -4.236688 -0.612156 -0.191427 -0.850367 0.108419 0.029190
9.533333 -4.265066 -0.608597 -0.192003 -0.848895 0.108255 0.023561
9.566667 -4.293767 -0.605033 -0.191464 -0.846680 0.108317 0.015885
9.600000 -4.322217 -0.601459 -0.186875 -0.843610 0.108647 0.008707
9.633333 -4.350408 -0.597875 -0.196480 -0.839664 0.109291 0.001083
9.666667 -4.378331 -0.594283 -0.198806 -0.834907 0.110278 -0.005568
9.700000 -4.406351 -0.590611 -0.193319 -0.829291 0.111666 -0.013300
9.733333 -4.434087 -0.586931 -0.203642 -0.822622 0.113497 -0.021824
9.766667 -4.461531 -0.583245 -0.197465 -0.814813 0.115781 -0.033365
9.800000 -4.488674 -0.579551 -0.198683 -0.805710 0.118512 -0.050620
9.833333 -4.515507 -0.575852 -0.192303 -0.795169 0.121646 -0.074241
9.866667 -4.542323 -0.571903 -0.197310 -0.782977 0.125123 -0.104105
9.900000 -4.568906 -0.567725 -0.195421 -0.768978 0.128816 -0.139642
9.933333 -4.594999 -0.563363 -0.191487 -0.753212 0.132564 -0.181218
9.966667 -4.620393 -0.558736 -0.209425 -0.735715 0.136201 -0.223551
10.000000 -4.645438 -0.554106 -0.215193 -0.716666 0.139567 -0.262906
10.033333 -4.669418 -0.549242 -0.222498 -0.696202 0.142462 -0.292723
10.066667 -4.692080 -0.544148 -0.233005 -0.674517 0.144665 -0.312044
10.100000 -4.714372 -0.539054 -0.251859 -0.651894 0.146009 -0.316267
10.133333 -4.735338 -0.533891 -0.275461 -0.628514 0.146335 -0.302067
10.166667 -4.755926 -0.528731 -0.298247 -0.604424 0.145485 -0.271246
10.200000 -4.776132 -0.523576 -0.304106 -0.579501 0.143271 -0.224367
10.233333 -4.794526 -0.518705 -0.320987 -0.553689 0.139613 -0.168459
10.266667 -4.812532 -0.513840 -0.317364 -0.526892 0.134540 -0.106337
10.300000 -4.830149 -0.508983 -0.323331 -0.499043 0.128120 -0.044586
10.333333 -4.847375 -0.504135 -0.328409 -0.470031 0.120457 0.010183
10.366667 -4.863287 -0.499794 -0.306991 -0.439954 0.111712 0.052720
10.400000 -4.877945 -0.495983 -0.304255 -0.409175 0.102168 0.079748
10.433333 -4.891282 -0.492683 -0.292622 -0.378058 0.092075 0.092419
10.466667 -4.903321 -0.489844 -0.276795 -0.347048 0.081658 0.092870
10.500000 -4.914089 -0.487533 -0.272210 -0.316642 0.071093 0.086042
10.533333 -4.923343 -0.485663 -0.261055 -0.287537 0.060640 0.075688
10.566667 -4.931173 -0.484249 -0.275688 -0.260374 0.050559 0.071098
10.600000 -4.938631 -0.482831 -0.278502 -0.235557 0.040986 0.075977
10.633333 -4.945726 -0.481405 -0.283733 -0.213352 0.032045 0.094086
10.666667 -4.951844 -0.480499 -0.288991 -0.193924 0.023829 0.126938
10.700000 -4.957093 -0.480120 -0.287794 -0.177226 0.016488 0.169680
10.733333 -4.962002 -0.479719 -0.291049 -0.163042 0.010060 0.221214
10.766667 -4.966638 -0.479815 -0.289813 -0.151007 0.004544 0.271899
10.800000 -4.970953 -0.479878 -0.274462 -0.140899 -0.000022 0.316822
10.833333 -4.975581 -0.480512 -0.239591 -0.132523 -0.003552 0.348146
10.866667 -4.979906 -0.481101 -0.223203 -0.125656 -0.006012 0.360376
10.900000 -4.983934 -0.481639 -0.194154 -0.120113 -0.007467 0.352884
10.933333 -4.987675 -0.482120 -0.181525 -0.115652 -0.007955 0.326654
10.966667 -4.991138 -0.482536 -0.164647 -0.112132 -0.007565 0.285232
