t x y theta dxdt dydt dthetadt
0.000000 0.000000 0.000000 1.627389 0.061270 0.137429 2.684155
0.033333 0.002047 0.004595 1.638454 0.061353 0.138240 3.397838
0.066667 0.004096 0.009217 1.774065 0.061421 0.139046 4.046844
0.100000 0.006148 0.013865 1.996784 0.061471 0.139847 4.562167
0.133333 0.008202 0.018539 2.344427 0.061503 0.140640 4.860560
0.166667 0.010257 0.023241 2.652154 0.061514 0.141421 4.879554
0.200000 0.012313 0.027969 2.884703 0.061503 0.142190 4.555230
0.233333 0.014368 0.032726 3.106005 0.061467 0.142942 3.867666
0.266667 0.016423 0.037513 -2.953662 0.061407 0.143679 2.853329
0.300000 0.018476 0.042324 -2.784581 0.061321 0.144400 1.555419
0.333333 0.020526 0.047155 -2.589641 0.061211 0.145106 0.081119
0.366667 0.022573 0.052010 -2.566447 0.061078 0.145802 -1.469274
0.400000 0.024613 0.056885 -2.779820 0.060921 0.146491 -2.951634
0.433333 0.026644 0.061777 -2.944957 0.060743 0.147177 -4.260314
0.466667 0.028665 0.066688 2.997844 0.060545 0.147865 -5.306367
0.500000 0.030682 0.071621 2.704430 0.060327 0.148559 -6.007708
0.533333 0.032694 0.076577 2.274490 0.060092 0.149264 -6.319367
0.566667 0.034697 0.081561 1.960608 0.059841 0.149978 -6.212128
0.600000 0.036690 0.086572 1.665178 0.059577 0.150702 -5.712381
0.633333 0.038677 0.091604 1.354198 0.059301 0.151433 -4.834458
0.666667 0.040654 0.096663 1.224329 0.059014 0.152167 -3.651259
0.700000 0.042619 0.101748 1.066479 0.058720 0.152896 -2.232702
0.733333 0.044572 0.106860 1.033175 0.058420 0.153616 -0.679086
0.766667 0.046514 0.111998 1.053310 0.058116 0.154323 0.903273
0.800000 0.048444 0.117161 1.091391 0.057808 0.155015 2.412498
0.833333 0.050362 0.122350 1.210702 0.057499 0.155688 3.725249
0.866667 0.052271 0.127558 1.358834 0.057187 0.156342 4.771266
0.900000 0.054173 0.132784 1.634582 0.056870 0.156977 5.462307
0.933333 0.056066 0.138027 2.045103 0.056547 0.157597 5.749271
0.966667 0.057947 0.143295 2.467880 0.056214 0.158205 5.610941
1.000000 0.059819 0.148579 2.739074 0.055869 0.158804 5.062950
1.033333 0.061682 0.153880 3.047728 0.055508 0.159399 4.156150
1.066667 0.063532 0.159207 -2.991396 0.055130 0.159994 2.962098
1.100000 0.065372 0.164550 -2.886752 0.054736 0.160590 1.592339
1.133333 0.067196 0.169909 -2.839369 0.054327 0.161186 0.161430
1.166667 0.069004 0.175286 -2.917874 0.053904 0.161780 -1.208125
1.200000 0.070795 0.180681 3.093958 0.053472 0.162366 -2.412286
1.233333 0.072569 0.186102 2.831097 0.053034 0.162940 -3.360472
1.266667 0.074327 0.191552 2.629065 0.052593 0.163495 -4.008055
1.300000 0.076068 0.197028 2.376619 0.052153 0.164026 -4.345299
1.333333 0.077797 0.202515 2.148078 0.051715 0.164527 -4.383668
1.366667 0.079515 0.208013 1.937540 0.051280 0.164997 -4.168528
1.400000 0.081214 0.213537 1.800280 0.050846 0.165434 -3.770021
1.433333 0.082900 0.219070 1.699727 0.050413 0.165837 -3.263903
1.466667 0.084574 0.224613 1.619326 0.049976 0.166211 -2.707600
1.500000 0.086234 0.230164 1.575917 0.049532 0.166560 -2.155220
1.533333 0.087882 0.235723 1.544267 0.049080 0.166887 -1.651039
1.566667 0.089516 0.241289 1.527815 0.048618 0.167196 -1.224224
1.600000 0.091136 0.246861 1.518155 0.048145 0.167488 -0.877514
1.633333 0.092736 0.252452 1.510753 0.047660 0.167765 -0.606608
1.666667 0.094322 0.258048 1.501641 0.047165 0.168029 -0.407230
1.700000 0.095886 0.263660 1.492124 0.046660 0.168278 -0.266858
1.733333 0.097429 0.269285 1.492294 0.046146 0.168509 -0.172706
1.766667 0.098958 0.274914 1.494690 0.045623 0.168722 -0.111548
1.800000 0.100472 0.280545 1.491227 0.045091 0.168916 -0.071821
1.833333 0.101966 0.286187 1.493821 0.044553 0.169089 -0.047383
1.866667 0.103444 0.291830 1.497498 0.044008 0.169239 -0.033790
1.900000 0.104908 0.297474 1.497973 0.043458 0.169365 -0.026799
1.933333 0.106351 0.303123 1.490625 0.042903 0.169468 -0.023111
1.966667 0.107774 0.308778 1.494310 0.042344 0.169546 -0.021268
2.000000 0.109177 0.314437 1.498010 0.041784 0.169597 -0.023224
2.033333 0.110559 0.320098 1.485733 0.041225 0.169620 -0.025175
2.066667 0.111922 0.325761 1.490551 0.040668 0.169612 -0.026388
2.100000 0.113266 0.331424 1.484503 0.040116 0.169573 -0.026976
2.133333 0.114590 0.337086 1.486973 0.039571 0.169499 -0.028971
2.166667 0.115894 0.342745 1.482497 0.039034 0.169389 -0.029585
2.200000 0.117183 0.348398 1.488207 0.038505 0.169243 -0.026845
2.233333 0.118456 0.354045 1.488054 0.037985 0.169061 -0.025820
2.266667 0.119714 0.359684 1.494282 0.037470 0.168843 -0.026419
2.300000 0.120955 0.365314 1.481637 0.036959 0.168592 -0.027263
2.333333 0.122178 0.370936 1.471430 0.036450 0.168307 -0.027112
2.366667 0.123385 0.376548 1.479606 0.035942 0.167990 -0.029541
2.400000 0.124576 0.382149 1.484440 0.035433 0.167643 -0.034608
2.433333 0.125751 0.387739 1.478568 0.034923 0.167267 -0.038648
2.466667 0.126908 0.393316 1.479144 0.034411 0.166863 -0.041581
2.500000 0.128047 0.398878 1.483899 0.033900 0.166431 -0.045613
2.533333 0.129167 0.404424 1.479556 0.033388 0.165973 -0.051019
2.566667 0.130270 0.409954 1.466550 0.032878 0.165489 -0.054068
2.600000 0.131356 0.415466 1.471849 0.032370 0.164980 -0.055441
2.633333 0.132425 0.420962 1.476762 0.031865 0.164446 -0.056253
2.666667 0.133477 0.426438 1.464046 0.031364 0.163887 -0.054403
2.700000 0.134514 0.431897 1.464120 0.030866 0.163304 -0.050031
2.733333 0.135534 0.437338 1.462064 0.030372 0.162697 -0.042660
2.766667 0.136538 0.442757 1.454014 0.029882 0.162066 -0.035867
2.800000 0.137526 0.448156 1.453678 0.029395 0.161411 -0.027749
2.833333 0.138497 0.453531 1.466887 0.028912 0.160731 -0.019209
2.866667 0.139451 0.458880 1.456135 0.028432 0.160028 -0.014249
2.900000 0.140390 0.464209 1.462462 0.027955 0.159300 -0.011944
2.933333 0.141313 0.469510 1.455859 0.027481 0.158548 -0.011267
2.966667 0.142221 0.474789 1.455889 0.027010 0.157772 -0.011690
3.000000 0.143112 0.480040 1.467486 0.026543 0.156973 -0.015830
3.033333 0.143989 0.485266 1.465241 0.026079 0.156150 -0.020999
3.066667 0.144849 0.490462 1.458598 0.025618 0.155303 -0.024904
3.100000 0.145695 0.495627 1.454384 0.025160 0.154433 -0.027452
3.133333 0.146525 0.500767 1.459972 0.024706 0.153539 -0.030929
3.166667 0.147341 0.505874 1.454748 0.024255 0.152624 -0.033251
3.200000 0.148141 0.510955 1.445530 0.023807 0.151687 -0.032463
3.233333 0.148927 0.516002 1.449863 0.023362 0.150731 -0.030247
3.266667 0.149697 0.521014 1.452803 0.022921 0.149758 -0.028298
3.300000 0.150453 0.525992 1.447519 0.022484 0.148770 -0.026732
3.333333 0.151194 0.530934 1.451452 0.022051 0.147770 -0.023978
