t x y theta dxdt dydt dthetadt
0.000000 0.000000 0.000000 2.418095 -0.138345 0.063082 0.007204
0.033333 -0.004659 0.002113 2.428170 -0.141684 0.063588 0.008508
0.066667 -0.009433 0.004247 2.417897 -0.145052 0.064083 0.008665
0.100000 -0.014315 0.006392 2.419458 -0.148447 0.064561 0.009827
0.133333 -0.019316 0.008558 2.424736 -0.151866 0.065020 0.009191
0.166667 -0.024426 0.010733 2.429535 -0.155308 0.065460 0.008096
0.200000 -0.029658 0.012929 2.430048 -0.158775 0.065883 0.005931
0.233333 -0.035012 0.015145 2.424067 -0.162268 0.066287 0.002689
0.266667 -0.040477 0.017368 2.424032 -0.165785 0.066673 0.000241
0.300000 -0.046054 0.019599 2.421953 -0.169328 0.067042 -0.003608
0.333333 -0.051743 0.021836 2.422165 -0.172897 0.067396 -0.005909
0.366667 -0.057560 0.024092 2.436586 -0.176491 0.067734 -0.007280
0.400000 -0.063491 0.026353 2.414260 -0.180106 0.068053 -0.006508
0.433333 -0.069551 0.028632 2.429915 -0.183738 0.068350 -0.005054
0.466667 -0.075726 0.030915 2.419125 -0.187387 0.068627 -0.003878
0.500000 -0.082034 0.033215 2.420837 -0.191053 0.068883 -0.002330
0.533333 -0.088475 0.035532 2.425201 -0.194731 0.069114 -0.000970
0.566667 -0.095032 0.037850 2.421013 -0.198421 0.069321 0.001296
0.600000 -0.101705 0.040170 2.420332 -0.202121 0.069503 0.002977
0.633333 -0.108493 0.042489 2.422983 -0.205836 0.069662 0.008386
0.666667 -0.115421 0.044824 2.425179 -0.209564 0.069798 0.020376
0.700000 -0.122464 0.047157 2.432690 -0.213305 0.069910 0.043000
0.733333 -0.129625 0.049488 2.426214 -0.217061 0.070000 0.077283
0.766667 -0.136902 0.051817 2.423563 -0.220834 0.070070 0.127183
0.800000 -0.144323 0.054158 2.412037 -0.224627 0.070122 0.196441
0.833333 -0.151887 0.056511 2.416904 -0.228433 0.070152 0.284812
0.866667 -0.159568 0.058859 2.434571 -0.232246 0.070157 0.388978
0.900000 -0.167367 0.061201 2.432797 -0.236062 0.070135 0.506571
0.933333 -0.175283 0.063536 2.442078 -0.239875 0.070081 0.642919
0.966667 -0.183345 0.065879 2.458059 -0.243676 0.069992 0.804013
1.000000 -0.191553 0.068229 2.493677 -0.247456 0.069863 0.997874
1.033333 -0.199877 0.070569 2.551399 -0.251214 0.069696 1.236011
1.066667 -0.208319 0.072899 2.581852 -0.254952 0.069491 1.534594
1.100000 -0.216877 0.075217 2.638436 -0.258671 0.069251 1.894321
1.133333 -0.225578 0.077534 2.675864 -0.262373 0.068980 2.305444
1.166667 -0.234395 0.079838 2.722775 -0.266067 0.068683 2.745254
1.200000 -0.243327 0.082127 2.768181 -0.269764 0.068369 3.193391
1.233333 -0.252375 0.084401 2.835278 -0.273468 0.068039 3.630427
1.266667 -0.261538 0.086659 2.969041 -0.277186 0.067699 4.035360
1.300000 -0.270815 0.088899 -3.110197 -0.280917 0.067348 4.402147
1.333333 -0.280232 0.091137 -2.890413 -0.284662 0.066986 4.721870
1.366667 -0.289786 0.093370 -2.623805 -0.288413 0.066608 4.995145
1.400000 -0.299453 0.095584 -2.377263 -0.292156 0.066206 5.217164
1.433333 -0.309255 0.097789 -2.224768 -0.295883 0.065773 5.380273
1.466667 -0.319192 0.099986 -2.092279 -0.299580 0.065302 5.474616
1.500000 -0.329262 0.102174 -2.001182 -0.303236 0.064784 5.497644
1.533333 -0.339465 0.104350 -1.880713 -0.306840 0.064214 5.454912
1.566667 -0.349778 0.106500 -1.671029 -0.310390 0.063591 5.346541
1.600000 -0.360201 0.108624 -1.384853 -0.313890 0.062915 5.169630
1.633333 -0.370732 0.110721 -1.130471 -0.317342 0.062190 4.916305
1.666667 -0.381370 0.112788 -0.952054 -0.320755 0.061420 4.588243
1.700000 -0.392115 0.114826 -0.777644 -0.324140 0.060614 4.178673
1.733333 -0.402966 0.116833 -0.622864 -0.327514 0.059782 3.688405
1.766667 -0.413947 0.118818 -0.485908 -0.330882 0.058928 3.133926
1.800000 -0.425032 0.120771 -0.382950 -0.334251 0.058056 2.546830
1.833333 -0.436219 0.122690 -0.317502 -0.337621 0.057170 1.964006
1.866667 -0.447509 0.124573 -0.308153 -0.340994 0.056271 1.411291
1.900000 -0.458927 0.126434 -0.325592 -0.344365 0.055357 0.917184
1.933333 -0.470473 0.128272 -0.332838 -0.347723 0.054425 0.499796
1.966667 -0.482146 0.130087 -0.346595 -0.351062 0.053473 0.165584
2.000000 -0.493917 0.131862 -0.359535 -0.354377 0.052498 -0.091617
2.033333 -0.505784 0.133597 -0.368095 -0.357661 0.051498 -0.283590
2.066667 -0.517774 0.135306 -0.384491 -0.360905 0.050470 -0.421631
2.100000 -0.529858 0.136972 -0.411720 -0.364108 0.049413 -0.523563
2.133333 -0.542061 0.138609 -0.424723 -0.367269 0.048330 -0.605030
2.166667 -0.554379 0.140217 -0.437354 -0.370385 0.047218 -0.680113
2.200000 -0.566788 0.141778 -0.471127 -0.373454 0.046078 -0.759064
2.233333 -0.579285 0.143293 -0.486878 -0.376473 0.044908 -0.847092
2.266667 -0.591890 0.144772 -0.508028 -0.379439 0.043705 -0.940958
2.300000 -0.604598 0.146215 -0.545548 -0.382343 0.042464 -1.032807
2.333333 -0.617407 0.147619 -0.570956 -0.385179 0.041181 -1.114285
2.366667 -0.630314 0.148983 -0.608950 -0.387941 0.039850 -1.175486
2.400000 -0.643315 0.150304 -0.655767 -0.390622 0.038466 -1.250327
2.433333 -0.656405 0.151581 -0.710528 -0.393216 0.037025 -1.335701
2.466667 -0.669582 0.152809 -0.767900 -0.395718 0.035522 -1.443665
2.500000 -0.682841 0.153988 -0.832849 -0.398126 0.033954 -1.586216
2.533333 -0.696174 0.155109 -0.898598 -0.400438 0.032320 -1.772710
2.566667 -0.709579 0.156172 -0.957667 -0.402654 0.030617 -2.016887
2.600000 -0.723055 0.157177 -0.957667 -0.404776 0.028849 -2.251506
2.633333 -0.736600 0.158122 -0.957667 -0.406809 0.027016 -2.484803
2.666667 -0.750212 0.159004 -0.957667 -0.408757 0.025122 -2.708042
2.700000 -0.763890 0.159824 -0.957667 -0.410624 0.023167 -2.915222
2.733333 -0.777632 0.160581 -1.462961 -0.412415 0.021151 -3.062506
2.766667 -0.791421 0.161262 -1.537646 -0.414129 0.019067 -3.134702
2.800000 -0.805272 0.161878 -1.666995 -0.415766 0.016910 -3.146581
2.833333 -0.819164 0.162412 -1.773308 -0.417330 0.014679 -3.072847
2.866667 -0.833113 0.162878 -1.856177 -0.418819 0.012367 -2.900737
2.900000 -0.847117 0.163275 -1.951789 -0.420235 0.009974 -2.617824
2.933333 -0.861173 0.163604 -2.029884 -0.421581 0.007504 -2.300154
2.966667 -0.875264 0.163834 -2.125256 -0.422864 0.004968 -1.959741
3.000000 -0.889405 0.163993 -2.185528 -0.424089 0.002379 -1.624406
3.033333 -0.903576 0.164047 -2.233744 -0.425259 -0.000253 -1.327661
3.066667 -0.917777 0.163990 -2.272668 -0.426381 -0.002912 -1.094147
3.100000 -0.932005 0.163821 -2.276114 -0.427459 -0.005583 -0.946930
3.133333 -0.946275 0.163578 -2.280431 -0.428499 -0.008258 -0.855978
3.166667 -0.960585 0.163260 -2.254016 -0.429500 -0.010935 -0.826000
3.200000 -0.974918 0.162825 -2.232291 -0.430465 -0.013612 -0.848735
3.233333 -0.989288 0.162315 -2.233841 -0.431394 -0.016293 -0.906657
3.266667 -1.003693 0.161729 -2.274643 -0.432284 -0.018989 -0.981768
3.300000 -1.018130 0.161066 -2.335159 -0.433132 -0.021716 -1.052830
3.333333 -1.032598 0.160327 -2.401111 -0.433933 -0.024489 -1.104842
3.366667 -1.047095 0.159511 -2.490643 -0.434686 -0.027315 -1.115805
3.400000 -1.061611 0.158576 -2.555811 -0.435387 -0.030213 -1.070716
3.433333 -1.076144 0.157521 -2.599711 -0.436036 -0.033187 -0.965953
3.466667 -1.090700 0.156388 -2.635416 -0.436632 -0.036237 -0.810641
3.500000 -1.105273 0.155133 -2.667041 -0.437177 -0.039354 -0.618118
3.533333 -1.119866 0.153800 -2.682583 -0.437674 -0.042530 -0.401143
3.566667 -1.134473 0.152344 -2.689170 -0.438124 -0.045750 -0.181884
3.600000 -1.149094 0.150764 -2.671086 -0.438531 -0.048999 0.018678
3.633333 -1.163726 0.149060 -2.651709 -0.438894 -0.052257 0.189482
3.666667 -1.178372 0.147278 -2.637732 -0.439215 -0.055512 0.331547
3.700000 -1.193027 0.145373 -2.614196 -0.439494 -0.058756 0.444707
3.733333 -1.207691 0.143344 -2.568187 -0.439730 -0.061980 0.526784
3.766667 -1.222362 0.141192 -2.537379 -0.439923 -0.065179 0.584634
3.800000 -1.237039 0.138963 -2.538580 -0.440071 -0.068351 0.627006
3.833333 -1.251721 0.136615 -2.530016 -0.440173 -0.071500 0.660118
3.866667 -1.266404 0.134190 -2.507408 -0.440228 -0.074625 0.684618
3.900000 -1.281090 0.131650 -2.495835 -0.440232 -0.077725 0.705068
3.933333 -1.295778 0.128994 -2.469915 -0.440184 -0.080794 0.726608
3.966667 -1.310461 0.126265 -2.428820 -0.440081 -0.083834 0.740888
4.000000 -1.325141 0.123424 -2.392480 -0.439920 -0.086833 0.736492
4.033333 -1.339817 0.120474 -2.370456 -0.439701 -0.089784 0.701290
4.066667 -1.354486 0.117414 -2.354220 -0.439420 -0.092671 0.627720
4.100000 -1.369144 0.114248 -2.317862 -0.439078 -0.095481 0.505385
4.133333 -1.383790 0.110975 -2.309616 -0.438674 -0.098207 0.334956
4.166667 -1.398420 0.107634 -2.257679 -0.438208 -0.100831 0.126986
4.200000 -1.413032 0.104190 -2.217090 -0.437680 -0.103345 -0.103964
4.233333 -1.427625 0.100679 -2.193965 -0.437090 -0.105743 -0.347479
4.266667 -1.442196 0.097104 -2.204095 -0.436442 -0.108029 -0.591148
4.300000 -1.456747 0.093430 -2.270232 -0.435737 -0.110211 -0.815753
4.333333 -1.471272 0.089693 -2.359825 -0.434979 -0.112299 -1.013408
4.366667 -1.485771 0.085895 -2.418360 -0.434170 -0.114309 -1.176406
4.400000 -1.500242 0.082037 -2.479242 -0.433315 -0.116259 -1.299381
4.433333 -1.514682 0.078121 -2.543037 -0.432418 -0.118166 -1.373184
4.466667 -1.529089 0.074148 -2.569078 -0.431482 -0.120042 -1.401363
4.500000 -1.543463 0.070119 -2.610512 -0.430506 -0.121894 -1.394369
4.533333 -1.557800 0.066036 -2.656503 -0.429493 -0.123730 -1.364212
4.566667 -1.572100 0.061900 -2.712894 -0.428441 -0.125552 -1.318531
4.600000 -1.586371 0.057686 -2.746309 -0.427346 -0.127353 -1.265621
4.633333 -1.600611 0.053396 -2.793687 -0.426206 -0.129127 -1.214680
4.666667 -1.614808 0.049057 -2.821158 -0.425015 -0.130865 -1.163736
4.700000 -1.628970 0.044648 -2.866736 -0.423771 -0.132557 -1.109990
4.733333 -1.643095 0.040172 -2.910437 -0.422466 -0.134192 -1.045864
4.766667 -1.657172 0.035653 -2.942943 -0.421098 -0.135762 -0.971304
4.800000 -1.671206 0.031072 -2.980988 -0.419663 -0.137258 -0.884734
4.833333 -1.685188 0.026452 -3.010169 -0.418161 -0.138680 -0.786315
4.866667 -1.699116 0.021792 -3.041747 -0.416589 -0.140025 -0.679604
4.900000 -1.712987 0.017095 -3.070530 -0.414949 -0.141294 -0.565324
4.933333 -1.726806 0.012351 -3.082539 -0.413240 -0.142487 -0.447283
4.966667 -1.740565 0.007572 -3.098202 -0.411464 -0.143607 -0.327914
5.000000 -1.754265 0.002753 -3.102718 -0.409622 -0.144656 -0.210912
5.033333 -1.767903 -0.002105 -3.108979 -0.407713 -0.145633 -0.096334
5.066667 -1.781477 -0.006998 -3.095027 -0.405738 -0.146540 0.014275
5.100000 -1.794984 -0.011917 -3.084637 -0.403700 -0.147374 0.115072
5.133333 -1.808423 -0.016862 -3.078122 -0.401598 -0.148135 0.201093
5.166667 -1.821792 -0.021830 -3.077122 -0.399435 -0.148824 0.272023
5.200000 -1.835085 -0.026818 -3.093442 -0.397213 -0.149441 0.329236
5.233333 -1.848300 -0.031825 -3.064524 -0.394933 -0.149988 0.369044
5.266667 -1.861436 -0.036847 -3.021351 -0.392599 -0.150467 0.391369
5.300000 -1.874490 -0.041880 -3.008026 -0.390210 -0.150879 0.399085
5.333333 -1.887465 -0.046928 -2.989154 -0.387771 -0.151229 0.396959
5.366667 -1.900361 -0.051988 -2.967458 -0.385282 -0.151517 0.384417
5.400000 -1.913175 -0.057059 -2.964485 -0.382745 -0.151746 0.361759
5.433333 -1.925906 -0.062139 -2.948124 -0.380159 -0.151915 0.333492
5.466667 -1.938543 -0.067215 -2.948469 -0.377524 -0.152024 0.306496
5.500000 -1.951094 -0.072296 -2.936164 -0.374838 -0.152072 0.282738
5.533333 -1.963557 -0.077381 -2.933788 -0.372098 -0.152054 0.265959
5.566667 -1.975930 -0.082468 -2.923385 -0.369297 -0.151963 0.258884
5.600000 -1.988199 -0.087539 -2.918366 -0.366427 -0.151789 0.260742
5.633333 -2.000377 -0.092609 -2.916316 -0.363481 -0.151526 0.273755
5.666667 -2.012460 -0.097675 -2.909140 -0.360450 -0.151160 0.291170
5.700000 -2.024449 -0.102737 -2.900712 -0.357325 -0.150680 0.311637
5.733333 -2.036341 -0.107792 -2.880141 -0.354099 -0.150076 0.327507
5.766667 -2.048115 -0.112815 -2.874658 -0.350770 -0.149346 0.338388
5.800000 -2.059790 -0.117827 -2.857801 -0.347337 -0.148488 0.340775
5.833333 -2.071342 -0.122801 -2.850401 -0.343802 -0.147500 0.327086
5.866667 -2.082768 -0.127733 -2.819662 -0.340172 -0.146389 0.296330
5.900000 -2.094065 -0.132619 -2.814403 -0.336454 -0.145164 0.250101
5.933333 -2.105232 -0.137457 -2.802137 -0.332662 -0.143837 0.195144
5.966667 -2.116265 -0.142243 -2.776666 -0.328804 -0.142418 0.131678
6.000000 -2.127164 -0.146974 -2.777961 -0.324894 -0.140920 0.068526
6.033333 -2.137927 -0.151648 -2.784277 -0.320946 -0.139360 0.014947
6.066667 -2.148553 -0.156263 -2.787069 -0.316974 -0.137753 -0.019668
6.100000 -2.159069 -0.160854 -2.783302 -0.312990 -0.136111 -0.035083
6.133333 -2.169446 -0.165382 -2.811602 -0.309001 -0.134444 -0.031050
6.166667 -2.179682 -0.169844 -2.837498 -0.305014 -0.132758 -0.005303
6.200000 -2.189778 -0.174239 -2.852773 -0.301038 -0.131060 0.039495
6.233333 -2.199733 -0.178567 -2.852963 -0.297074 -0.129354 0.097281
6.266667 -2.209548 -0.182827 -2.834865 -0.293126 -0.127645 0.159045
6.300000 -2.219251 -0.187059 -2.805039 -0.289202 -0.125943 0.221299
6.333333 -2.228816 -0.191222 -2.798026 -0.285306 -0.124260 0.278168
6.366667 -2.238267 -0.195354 -2.783245 -0.281445 -0.122610 0.323218
6.400000 -2.247583 -0.199419 -2.756895 -0.277622 -0.121000 0.350524
6.433333 -2.256766 -0.203417 -2.746465 -0.273840 -0.119441 0.361150
6.466667 -2.265816 -0.207347 -2.736755 -0.270097 -0.117934 0.358694
6.500000 -2.274735 -0.211212 -2.725029 -0.266394 -0.116483 0.349144
6.533333 -2.283539 -0.215042 -2.710495 -0.262729 -0.115080 0.336710
6.566667 -2.292226 -0.218837 -2.707934 -0.259100 -0.113722 0.326975
6.600000 -2.300797 -0.222597 -2.693679 -0.255504 -0.112401 0.326335
6.633333 -2.309250 -0.226321 -2.686923 -0.251939 -0.111107 0.334317
6.666667 -2.317587 -0.230009 -2.680231 -0.248400 -0.109829 0.349236
6.700000 -2.325807 -0.233659 -2.671744 -0.244881 -0.108553 0.365327
6.733333 -2.333909 -0.237273 -2.665221 -0.241378 -0.107271 0.381622
6.766667 -2.341893 -0.240849 -2.657586 -0.237884 -0.105973 0.396789
6.800000 -2.349763 -0.244368 -2.641543 -0.234399 -0.104654 0.407235
6.833333 -2.357518 -0.247832 -2.610761 -0.230921 -0.103312 0.414156
6.866667 -2.365160 -0.251242 -2.584367 -0.227451 -0.101950 0.417520
6.900000 -2.372684 -0.254613 -2.565011 -0.223987 -0.100573 0.418129
6.933333 -2.380089 -0.257944 -2.543477 -0.220534 -0.099187 0.412013
6.966667 -2.387377 -0.261235 -2.550712 -0.217090 -0.097795 0.397003
7.000000 -2.394552 -0.264475 -2.547770 -0.213656 -0.096401 0.372378
7.033333 -2.401615 -0.267663 -2.547248 -0.210231 -0.095011 0.336020
7.066667 -2.408559 -0.270811 -2.528313 -0.206815 -0.093622 0.285262
7.100000 -2.415393 -0.273908 -2.496775 -0.203408 -0.092236 0.217324
7.133333 -2.422118 -0.276955 -2.489462 -0.200008 -0.090853 0.134060
7.166667 -2.428733 -0.279954 -2.469524 -0.196614 -0.089473 0.031370
7.200000 -2.435230 -0.282911 -2.457331 -0.193224 -0.088097 -0.090169
7.233333 -2.441609 -0.285826 -2.463361 -0.189836 -0.086726 -0.227225
7.266667 -2.447878 -0.288695 -2.476486 -0.186449 -0.085359 -0.373237
7.300000 -2.454039 -0.291516 -2.478731 -0.183062 -0.083997 -0.518230
7.333333 -2.460090 -0.294289 -2.509196 -0.179674 -0.082639 -0.653819
7.366667 -2.466023 -0.297021 -2.541782 -0.176284 -0.081286 -0.766279
7.400000 -2.471839 -0.299712 -2.579510 -0.172892 -0.079935 -0.847526
7.433333 -2.477545 -0.302355 -2.624120 -0.169497 -0.078588 -0.894282
7.466667 -2.483138 -0.304952 -2.676301 -0.166100 -0.077244 -0.903329
7.500000 -2.488621 -0.307502 -2.719490 -0.162702 -0.075905 -0.877195
7.533333 -2.493991 -0.310005 -2.758448 -0.159302 -0.074569 -0.820601
7.566667 -2.499245 -0.312467 -2.779871 -0.155904 -0.073237 -0.743414
7.600000 -2.504386 -0.314882 -2.813388 -0.152508 -0.071909 -0.652556
7.633333 -2.509412 -0.317257 -2.822850 -0.149116 -0.070586 -0.554952
7.666667 -2.514321 -0.319590 -2.837009 -0.145731 -0.069268 -0.460002
7.700000 -2.519120 -0.321877 -2.836143 -0.142353 -0.067956 -0.372609
7.733333 -2.523803 -0.324123 -2.845758 -0.138987 -0.066650 -0.294905
7.766667 -2.528377 -0.326321 -2.848730 -0.135632 -0.065350 -0.224092
7.800000 -2.532842 -0.328471 -2.846396 -0.132293 -0.064056 -0.161462
