t x y theta dxdt dydt dthetadt
0.000000 0.000000 0.000000 0.531597 0.002878 -0.007801 -0.272692
0.033333 -0.000030 -0.000169 0.537388 0.006167 -0.009831 -0.376529
0.066667 0.000207 -0.000314 0.531152 0.010442 -0.012352 -0.486860
0.100000 0.000716 -0.000432 0.531469 0.016603 -0.015525 -0.590838
0.133333 0.001504 -0.000522 0.511792 0.025524 -0.019524 -0.682627
0.166667 0.002101 -0.001183 0.464992 0.038953 -0.024591 -0.752918
0.200000 0.002598 -0.002245 0.415892 0.058666 -0.030928 -0.795513
0.233333 0.003391 -0.003271 0.355385 0.086442 -0.038788 -0.806169
0.266667 0.004485 -0.004259 0.315477 0.123371 -0.048288 -0.785643
0.300000 0.006226 -0.005714 0.279460 0.169457 -0.059240 -0.738281
0.333333 0.008279 -0.007124 0.251197 0.224733 -0.071452 -0.668372
0.366667 0.010649 -0.008486 0.238899 0.287920 -0.084736 -0.585162
0.400000 0.017228 -0.010798 0.226433 0.357702 -0.099115 -0.499120
0.433333 0.030411 -0.014634 0.239932 0.432528 -0.114674 -0.423868
0.466667 0.043908 -0.018412 0.232610 0.511165 -0.131580 -0.365819
0.500000 0.069222 -0.024436 0.220086 0.591996 -0.150020 -0.330077
0.533333 0.094823 -0.030391 0.211579 0.673401 -0.170180 -0.316537
0.566667 0.120691 -0.036268 0.207067 0.753837 -0.191967 -0.321442
0.600000 0.146808 -0.042060 0.200099 0.831721 -0.214966 -0.339740
0.633333 0.173153 -0.047757 0.198026 0.906205 -0.238628 -0.360933
0.666667 0.199706 -0.053352 0.177606 0.976445 -0.262400 -0.381016
0.700000 0.233887 -0.061945 0.161219 1.043129 -0.285757 -0.395945
0.733333 0.272548 -0.073112 0.132193 1.106591 -0.307948 -0.402636
0.766667 0.314859 -0.086473 0.112303 1.166859 -0.328090 -0.400712
0.800000 0.357256 -0.099686 0.100141 1.224201 -0.345299 -0.390737
0.833333 0.399705 -0.112733 0.081063 1.278113 -0.358777 -0.376098
0.866667 0.442167 -0.125598 0.077161 1.328153 -0.367578 -0.358132
0.900000 0.488418 -0.139453 0.075270 1.373323 -0.371107 -0.338643
0.933333 0.534605 -0.153092 0.055218 1.413351 -0.369224 -0.323265
0.966667 0.583947 -0.166386 0.056344 1.448423 -0.362161 -0.312978
1.000000 0.633140 -0.179432 0.041362 1.478327 -0.350448 -0.306634
1.033333 0.685264 -0.191507 0.026465 1.502870 -0.334666 -0.302367
1.066667 0.737148 -0.203302 0.035794 1.521749 -0.315700 -0.299204
1.100000 0.788743 -0.214800 0.029779 1.533779 -0.294194 -0.293840
1.133333 0.842412 -0.224246 0.001228 1.536262 -0.270629 -0.281403
1.166667 0.895697 -0.233367 -0.018705 1.527117 -0.245527 -0.260599
1.200000 0.949215 -0.240369 -0.022938 1.503118 -0.219333 -0.233218
1.233333 1.002251 -0.247021 -0.036928 1.461572 -0.192375 -0.202508
1.266667 1.054755 -0.253313 -0.052498 1.399859 -0.164833 -0.170048
1.300000 1.104516 -0.257701 -0.038006 1.316403 -0.136817 -0.145933
1.333333 1.153649 -0.261709 -0.058894 1.211968 -0.108328 -0.140398
1.366667 1.202110 -0.265326 -0.056315 1.086887 -0.079247 -0.166446
1.400000 1.249852 -0.268546 -0.041411 0.943617 -0.048606 -0.227632
1.433333 1.282841 -0.269908 -0.033441 0.785543 -0.015616 -0.328997
1.466667 1.303540 -0.269780 -0.032933 0.616347 0.021349 -0.470705
1.500000 1.323427 -0.269225 -0.024472 0.440545 0.063614 -0.639002
1.533333 1.326819 -0.267263 -0.045624 0.262805 0.112356 -0.815992
1.566667 1.329383 -0.264860 -0.062772 0.087796 0.168748 -0.974680
1.600000 1.331119 -0.262011 -0.085798 -0.079939 0.232445 -1.096261
1.633333 1.317965 -0.254670 -0.152393 -0.237024 0.302999 -1.154260
1.666667 1.304001 -0.246879 -0.242460 -0.380667 0.378270 -1.131024
1.700000 1.289244 -0.238637 -0.352499 -0.509082 0.456318 -1.017203
1.733333 1.266296 -0.221326 -0.408177 -0.622493 0.534647 -0.817120
1.766667 1.242602 -0.203578 -0.484502 -0.721469 0.611189 -0.540916
1.800000 1.210116 -0.174225 -0.506449 -0.806622 0.683934 -0.205396
1.833333 1.176947 -0.144468 -0.509096 -0.879794 0.751616 0.159797
1.866667 1.143130 -0.114330 -0.482905 -0.942551 0.813819 0.523079
1.900000 1.108701 -0.083836 -0.429744 -0.996314 0.870252 0.847959
1.933333 1.073694 -0.053013 -0.351361 -1.042221 0.922053 1.109266
1.966667 1.038146 -0.021884 -0.265698 -1.080502 0.969572 1.276792
2.000000 1.002093 0.009523 -0.181355 -1.112138 1.014515 1.333707
2.033333 0.965571 0.041184 -0.120349 -1.136449 1.058049 1.273604
2.066667 0.928617 0.073071 -0.064035 -1.152764 1.101343 1.098996
2.100000 0.887326 0.110346 -0.008798 -1.160403 1.144895 0.823246
2.133333 0.844684 0.150977 0.040978 -1.157843 1.188105 0.462901
2.166667 0.801334 0.194027 0.071425 -1.143794 1.230425 0.047291
2.200000 0.757720 0.237173 0.089892 -1.117264 1.270597 -0.399506
2.233333 0.715764 0.281799 0.058359 -1.077800 1.306926 -0.848353
2.266667 0.676293 0.327271 0.011335 -1.025184 1.337655 -1.270765
2.300000 0.639783 0.373550 -0.072702 -0.959971 1.361946 -1.635132
2.333333 0.608405 0.420022 -0.148259 -0.884163 1.379412 -1.915915
2.366667 0.582056 0.468483 -0.250226 -0.801122 1.389931 -2.094309
2.400000 0.555657 0.516785 -0.353606 -0.713825 1.393216 -2.154558
2.433333 0.529231 0.564886 -0.478438 -0.625618 1.389447 -2.095112
2.466667 0.509963 0.613059 -0.592916 -0.540106 1.378583 -1.919782
2.500000 0.497741 0.660288 -0.681470 -0.460674 1.359900 -1.646327
2.533333 0.485543 0.707178 -0.765586 -0.389516 1.332023 -1.291066
2.566667 0.479559 0.751801 -0.806518 -0.327972 1.294112 -0.876559
2.600000 0.473610 0.795998 -0.823384 -0.277302 1.245000 -0.423896
2.633333 0.467697 0.839726 -0.803536 -0.238252 1.183796 0.049346
2.666667 0.463509 0.882018 -0.775745 -0.210510 1.110365 0.530229
2.700000 0.460024 0.922200 -0.720330 -0.192501 1.024811 1.013983
2.733333 0.456055 0.959493 -0.679939 -0.182329 0.927989 1.494170
2.766667 0.451272 0.992941 -0.641959 -0.177358 0.820416 1.971192
2.800000 0.445211 1.021657 -0.582187 -0.174847 0.704203 2.445872
2.833333 0.438695 1.044272 -0.495986 -0.172083 0.581652 2.914293
2.866667 0.431190 1.058765 -0.405001 -0.166335 0.454850 3.361612
2.900000 0.423723 1.072552 -0.282876 -0.155844 0.326224 3.762230
2.933333 0.416105 1.077004 -0.162698 -0.139795 0.199100 4.092869
2.966667 0.408527 1.080737 -0.018751 -0.118144 0.076245 4.323238
3.000000 0.400995 1.083752 0.172110 -0.091267 -0.041033 4.422500
3.033333 0.397221 1.078515 0.415937 -0.060207 -0.151679 4.370831
3.066667 0.398204 1.065463 0.625901 -0.027762 -0.254465 4.165572
3.100000 0.399224 1.051712 0.837466 0.002924 -0.348011 3.818642
3.133333 0.400276 1.037280 1.037404 0.028869 -0.432612 3.345791
3.166667 0.401354 1.022183 1.162001 0.047127 -0.507824 2.778173
3.200000 0.406718 1.002629 1.226746 0.054887 -0.572438 2.160239
3.233333 0.414081 0.979308 1.243779 0.050229 -0.625753 1.540274
3.266667 0.421440 0.955383 1.248634 0.033027 -0.668142 0.956419
3.300000 0.427510 0.928752 1.213225 0.003964 -0.700356 0.445481
3.333333 0.431327 0.900906 1.177315 -0.035567 -0.722708 0.036226
3.366667 0.431923 0.872926 1.135963 -0.083505 -0.735990 -0.255816
3.400000 0.428379 0.845758 1.098451 -0.136836 -0.741743 -0.435778
3.433333 0.421644 0.819808 1.054463 -0.192081 -0.741671 -0.517863
3.466667 0.411899 0.795392 1.043179 -0.245822 -0.736915 -0.520454
3.500000 0.399127 0.772126 1.009313 -0.294652 -0.728834 -0.467321
3.533333 0.386332 0.748481 1.013788 -0.335786 -0.718740 -0.382520
3.566667 0.371818 0.725815 1.001470 -0.367085 -0.707864 -0.286378
3.600000 0.355737 0.703210 0.995301 -0.387488 -0.697059 -0.190682
3.633333 0.339665 0.680297 0.995569 -0.397086 -0.686672 -0.107255
3.666667 0.323615 0.657097 0.997725 -0.396862 -0.676680 -0.038797
3.700000 0.307598 0.633634 1.005174 -0.388590 -0.666641 0.009973
3.733333 0.292564 0.610641 1.012283 -0.373942 -0.656115 0.041798
3.766667 0.279449 0.588322 1.024343 -0.354772 -0.644548 0.058197
3.800000 0.268355 0.566961 1.017892 -0.332942 -0.631464 0.061710
3.833333 0.259959 0.547018 1.025690 -0.310060 -0.616378 0.055769
3.866667 0.251641 0.526912 1.028849 -0.287440 -0.599089 0.042757
3.900000 0.243404 0.506661 1.028685 -0.266029 -0.579887 0.027695
3.933333 0.235254 0.486282 1.030555 -0.246620 -0.558804 0.011650
3.966667 0.227194 0.465794 1.030425 -0.229537 -0.535714 -0.003133
4.000000 0.220086 0.447673 1.020849 -0.214699 -0.510451 -0.015455
4.033333 0.213693 0.432443 1.019329 -0.201672 -0.483164 -0.022445
4.066667 0.207402 0.417150 1.018654 -0.189996 -0.454142 -0.026135
4.100000 0.201212 0.401804 1.024448 -0.179158 -0.423431 -0.027586
4.133333 0.195127 0.386417 1.019938 -0.168720 -0.391427 -0.027663
4.166667 0.189833 0.373527 1.012079 -0.158424 -0.358992 -0.026394
4.200000 0.184985 0.362934 1.015526 -0.148094 -0.327049 -0.025672
4.233333 0.180246 0.352328 1.016018 -0.137750 -0.296067 -0.026958
4.266667 0.175602 0.343456 1.016437 -0.127398 -0.266555 -0.027456
4.300000 0.171220 0.335987 1.018563 -0.117042 -0.239105 -0.026927
4.333333 0.167173 0.329593 1.019223 -0.106715 -0.214240 -0.024583
4.366667 0.164187 0.324254 1.021225 -0.096582 -0.192135 -0.022337
4.400000 0.161408 0.319428 1.008503 -0.086844 -0.172762 -0.017311
4.433333 0.158739 0.314602 1.011812 -0.077723 -0.156363 -0.011308
4.466667 0.156179 0.309777 1.001824 -0.069513 -0.142851 -0.006524
4.500000 0.154431 0.305600 1.004398 -0.062571 -0.132014 -0.002931
4.533333 0.152787 0.301421 1.003668 -0.057151 -0.123470 -0.001167
4.566667 0.151529 0.297895 1.009328 -0.053209 -0.116880 0.000299
4.600000 0.150371 0.294364 1.018909 -0.050642 -0.111947 -0.002196
4.633333 0.149486 0.291169 1.018296 -0.049366 -0.108348 -0.005049
4.666667 0.148565 0.288111 1.018876 -0.049123 -0.105900 -0.008833
