t x y theta dxdt dydt dthetadt
0.000000 0.000000 0.000000 0.013756 0.077484 -0.130501 -0.002587
0.033333 0.002588 -0.004388 0.028985 0.077460 -0.132920 -0.002212
0.066667 0.005170 -0.008853 0.031323 0.077420 -0.135358 -0.004114
0.100000 0.007747 -0.013396 0.024823 0.077375 -0.137823 -0.005008
0.133333 0.010316 -0.018017 0.026317 0.077329 -0.140319 -0.006295
0.166667 0.012878 -0.022715 0.027388 0.077286 -0.142847 -0.009749
0.200000 0.015451 -0.027510 0.028998 0.077245 -0.145408 -0.010699
0.233333 0.018015 -0.032383 0.017719 0.077204 -0.148000 -0.006382
0.266667 0.020589 -0.037354 0.023772 0.077162 -0.150623 0.007186
0.300000 0.023173 -0.042423 0.025926 0.077116 -0.153278 0.031243
0.333333 0.025766 -0.047592 0.012539 0.077059 -0.155961 0.068412
0.366667 0.028345 -0.052838 0.024356 0.076984 -0.158668 0.119379
0.400000 0.030910 -0.058162 0.025015 0.076883 -0.161395 0.177112
0.433333 0.033460 -0.063564 0.016820 0.076751 -0.164142 0.234821
0.466667 0.036016 -0.069067 0.015437 0.076579 -0.166905 0.284271
0.500000 0.038576 -0.074673 0.017521 0.076359 -0.169674 0.318965
0.533333 0.041139 -0.080383 0.051651 0.076087 -0.172444 0.330487
0.566667 0.043682 -0.086169 0.073811 0.075760 -0.175209 0.317066
0.600000 0.046221 -0.092061 0.118286 0.075371 -0.177957 0.286957
0.633333 0.048753 -0.098058 0.144257 0.074914 -0.180674 0.251107
0.666667 0.051262 -0.104131 0.150659 0.074380 -0.183350 0.235520
0.700000 0.053752 -0.110310 0.165352 0.073765 -0.185981 0.270900
0.733333 0.056218 -0.116563 0.152729 0.073064 -0.188566 0.404708
0.766667 0.058656 -0.122921 0.133342 0.072271 -0.191105 0.665381
0.800000 0.061067 -0.129353 0.111657 0.071383 -0.193601 1.070950
0.833333 0.063450 -0.135857 0.085125 0.070401 -0.196066 1.637515
0.866667 0.065804 -0.142432 0.060704 0.069331 -0.198503 2.355749
0.900000 0.068127 -0.149078 0.066341 0.068175 -0.200919 3.214151
0.933333 0.070419 -0.155794 0.150820 0.066942 -0.203314 4.146988
0.966667 0.072650 -0.162607 0.252306 0.065641 -0.205691 5.108711
1.000000 0.074817 -0.169517 0.491751 0.064282 -0.208049 6.045555
1.033333 0.076949 -0.176494 0.793835 0.062876 -0.210384 6.889713
1.066667 0.079010 -0.183569 1.213840 0.061436 -0.212689 7.563191
1.100000 0.081034 -0.190709 1.499795 0.059974 -0.214955 7.988549
1.133333 0.083020 -0.197914 1.787760 0.058498 -0.217177 8.155339
1.166667 0.084927 -0.205217 2.116644 0.057016 -0.219349 8.048159
1.200000 0.086794 -0.212584 2.466713 0.055538 -0.221462 7.674628
1.233333 0.088622 -0.220013 2.937708 0.054069 -0.223514 7.054836
1.266667 0.090410 -0.227503 -3.125981 0.052607 -0.225507 6.271701
1.300000 0.092156 -0.235053 -2.943854 0.051153 -0.227441 5.396485
1.333333 0.093822 -0.242688 -2.770329 0.049709 -0.229315 4.473972
1.366667 0.095445 -0.250381 -2.646582 0.048271 -0.231134 3.555385
1.400000 0.097024 -0.258130 -2.646582 0.046838 -0.232899 2.693575
1.433333 0.098559 -0.265936 -2.646582 0.045406 -0.234612 1.952180
1.466667 0.100049 -0.273795 -2.646582 0.043975 -0.236275 1.332782
1.500000 0.101493 -0.281708 -2.646582 0.042545 -0.237886 0.841906
1.533333 0.102891 -0.289674 -2.646582 0.041110 -0.239451 0.484475
1.566667 0.104241 -0.297690 -2.646582 0.039668 -0.240972 0.253708
1.600000 0.105544 -0.305756 -2.646582 0.038215 -0.242449 0.120432
1.633333 0.106798 -0.313871 -2.646582 0.036749 -0.243886 0.045397
1.666667 0.108002 -0.322032 -2.646582 0.035268 -0.245282 0.010312
1.700000 0.109157 -0.330240 -2.646582 0.033767 -0.246641 0.000000
1.733333 0.110262 -0.338493 -2.646582 0.032248 -0.247962 0.000000
1.766667 0.111315 -0.346789 -2.646582 0.030711 -0.249244 0.000000
1.800000 0.112317 -0.355127 -2.646582 0.029157 -0.250487 0.023894
1.833333 0.113267 -0.363506 -2.646582 0.027583 -0.251692 0.070868
1.866667 0.114164 -0.371925 -2.646582 0.025988 -0.252858 0.139648
1.900000 0.115008 -0.380382 -2.646582 0.024369 -0.253986 0.229957
1.933333 0.115798 -0.388875 -2.646582 0.022723 -0.255077 0.343676
1.966667 0.116533 -0.397405 -2.646582 0.021044 -0.256132 0.483392
2.000000 0.117214 -0.405968 -2.646582 0.019329 -0.257152 0.604003
2.033333 0.117839 -0.414564 -2.646582 0.017577 -0.258138 0.710347
2.066667 0.118408 -0.423192 -2.646582 0.015791 -0.259089 0.805947
2.100000 0.118922 -0.431849 -2.646582 0.013967 -0.260006 0.893239
2.133333 0.119378 -0.440536 -2.359859 0.012109 -0.260889 0.946695
2.166667 0.119748 -0.449257 -2.369616 0.010220 -0.261737 0.963189
2.200000 0.120061 -0.458003 -2.384901 0.008301 -0.262551 0.963095
2.233333 0.120315 -0.466774 -2.388249 0.006348 -0.263333 0.939825
2.266667 0.120483 -0.475579 -2.365654 0.004357 -0.264087 0.888327
2.300000 0.120592 -0.484405 -2.334616 0.002328 -0.264812 0.802253
2.333333 0.120642 -0.493251 -2.302398 0.000258 -0.265511 0.723833
2.366667 0.120634 -0.502115 -2.263865 -0.001859 -0.266188 0.648518
2.400000 0.120566 -0.510996 -2.252134 -0.004028 -0.266842 0.573112
2.433333 0.120409 -0.519906 -2.229611 -0.006245 -0.267473 0.496857
2.466667 0.120194 -0.528829 -2.204051 -0.008507 -0.268079 0.421881
2.500000 0.119889 -0.537778 -2.189219 -0.010817 -0.268660 0.351533
2.533333 0.119496 -0.546751 -2.182301 -0.013170 -0.269212 0.269509
2.566667 0.119013 -0.555747 -2.177904 -0.015556 -0.269733 0.182033
2.600000 0.118442 -0.564763 -2.177181 -0.017965 -0.270216 0.095077
2.633333 0.117812 -0.573785 -2.173918 -0.020391 -0.270658 0.012281
2.666667 0.117093 -0.582825 -2.179855 -0.022822 -0.271055 -0.063746
2.700000 0.116286 -0.591880 -2.177783 -0.025247 -0.271401 -0.130111
2.733333 0.115392 -0.600948 -2.192209 -0.027652 -0.271690 -0.187235
2.766667 0.114439 -0.610017 -2.201829 -0.030033 -0.271922 -0.235031
2.800000 0.113400 -0.619094 -2.206200 -0.032385 -0.272093 -0.276375
2.833333 0.112275 -0.628180 -2.229252 -0.034701 -0.272202 -0.307595
2.866667 0.111066 -0.637271 -2.233142 -0.036978 -0.272249 -0.329892
2.900000 0.109773 -0.646367 -2.251568 -0.039220 -0.272233 -0.344266
2.933333 0.108396 -0.655464 -2.253681 -0.041429 -0.272159 -0.352827
2.966667 0.106963 -0.664551 -2.278774 -0.043606 -0.272025 -0.353935
3.000000 0.105474 -0.673626 -2.291399 -0.045754 -0.271835 -0.343862
3.033333 0.103929 -0.682687 -2.302611 -0.047879 -0.271591 -0.327445
3.066667 0.102305 -0.691743 -2.305534 -0.049984 -0.271296 -0.304820
3.100000 0.100603 -0.700791 -2.323313 -0.052072 -0.270950 -0.274186
3.133333 0.098823 -0.709830 -2.341695 -0.054142 -0.270555 -0.232296
3.166667 0.096990 -0.718849 -2.345253 -0.056192 -0.270109 -0.183715
3.200000 0.095081 -0.727854 -2.347018 -0.058214 -0.269611 -0.129755
3.233333 0.093099 -0.736845 -2.366111 -0.060197 -0.269055 -0.067461
3.266667 0.091045 -0.745819 -2.359724 -0.062133 -0.268437 0.001993
3.300000 0.088918 -0.754776 -2.358658 -0.064010 -0.267753 0.073612
3.333333 0.086722 -0.763712 -2.351706 -0.065822 -0.266999 0.141355
3.366667 0.084477 -0.772618 -2.353630 -0.067563 -0.266171 0.207575
3.400000 0.082185 -0.781490 -2.347244 -0.069232 -0.265268 0.268565
3.433333 0.079827 -0.790337 -2.331466 -0.070832 -0.264288 0.317265
3.466667 0.077423 -0.799148 -2.305386 -0.072365 -0.263231 0.351349
3.500000 0.074975 -0.807921 -2.303239 -0.073834 -0.262093 0.372555
3.533333 0.072484 -0.816654 -2.267597 -0.075247 -0.260874 0.383018
3.566667 0.069950 -0.825344 -2.252134 -0.076608 -0.259571 0.384852
3.600000 0.067361 -0.833993 -2.243343 -0.077918 -0.258177 0.385118
3.633333 0.064732 -0.842596 -2.234450 -0.079179 -0.256688 0.401668
3.666667 0.062064 -0.851152 -2.219556 -0.080392 -0.255098 0.453016
3.700000 0.059350 -0.859650 -2.207992 -0.081556 -0.253406 0.555065
3.733333 0.056599 -0.868097 -2.190857 -0.082666 -0.251607 0.728528
3.766667 0.053811 -0.876493 -2.199974 -0.083720 -0.249698 0.993886
3.800000 0.050989 -0.884813 -2.206303 -0.084718 -0.247681 1.361912
3.833333 0.048134 -0.893052 -2.201205 -0.085656 -0.245561 1.822207
3.866667 0.045246 -0.901235 -2.168522 -0.086533 -0.243340 2.364098
3.900000 0.042334 -0.909328 -2.106428 -0.087349 -0.241019 2.959943
3.933333 0.039399 -0.917325 -2.028799 -0.088104 -0.238603 3.571154
3.966667 0.036434 -0.925262 -1.890040 -0.088800 -0.236101 4.138667
4.000000 0.033453 -0.933097 -1.720192 -0.089437 -0.233516 4.614847
4.033333 0.030444 -0.940869 -1.519718 -0.090018 -0.230855 4.971322
4.066667 0.027422 -0.948536 -1.267888 -0.090549 -0.228129 5.167446
4.100000 0.024388 -0.956097 -0.951462 -0.091035 -0.225358 5.183544
4.133333 0.021330 -0.963591 -0.701587 -0.091484 -0.222554 5.019880
4.166667 0.018262 -0.970978 -0.536642 -0.091903 -0.219740 4.704504
4.200000 0.015187 -0.978258 -0.289741 -0.092301 -0.216933 4.258293
4.233333 0.012103 -0.985429 -0.184456 -0.092683 -0.214153 3.709737
4.266667 0.009012 -0.992493 -0.097541 -0.093054 -0.211410 3.104014
4.300000 0.005915 -0.999447 -0.063098 -0.093415 -0.208710 2.497321
4.333333 0.002800 -1.006329 -0.021304 -0.093766 -0.206053 1.921321
4.366667 -0.000331 -1.013136 0.028532 -0.094101 -0.203430 1.395119
4.400000 -0.003478 -1.019869 0.066109 -0.094414 -0.200826 0.947051
4.433333 -0.006639 -1.026526 0.043894 -0.094700 -0.198228 0.584807
4.466667 -0.009813 -1.033107 0.080809 -0.094948 -0.195616 0.304704
4.500000 -0.013000 -1.039611 0.048196 -0.095153 -0.192970 0.087573
4.533333 -0.016198 -1.046037 0.033292 -0.095305 -0.190272 -0.072089
4.566667 -0.019391 -1.052352 0.019341 -0.095405 -0.187519 -0.178047
4.600000 -0.022594 -1.058587 0.005675 -0.095449 -0.184704 -0.240392
4.633333 -0.025788 -1.064710 -0.006006 -0.095435 -0.181824 -0.265600
4.666667 -0.028974 -1.070720 -0.019448 -0.095366 -0.178886 -0.254157
4.700000 -0.032150 -1.076617 -0.031162 -0.095247 -0.175902 -0.207517
4.733333 -0.035331 -1.082433 -0.049113 -0.095085 -0.172888 -0.132756
4.766667 -0.038516 -1.088169 -0.066859 -0.094882 -0.169849 -0.038458
4.800000 -0.041688 -1.093791 -0.061076 -0.094643 -0.166799 0.065456
4.833333 -0.044845 -1.099299 -0.077300 -0.094377 -0.163752 0.172401
4.866667 -0.047986 -1.104693 -0.055771 -0.094089 -0.160718 0.274121
4.900000 -0.051127 -1.110005 -0.040435 -0.093784 -0.157704 0.361438
4.933333 -0.054250 -1.115203 -0.024446 -0.093465 -0.154715 0.426592
4.966667 -0.057354 -1.120289 0.014326 -0.093142 -0.151767 0.467871
5.000000 -0.060456 -1.125291 0.033394 -0.092821 -0.148867 0.489218
5.033333 -0.063538 -1.130184 0.083114 -0.092506 -0.146022 0.491428
5.066667 -0.066616 -1.134994 0.108350 -0.092198 -0.143232 0.476680
5.100000 -0.069673 -1.139697 0.107731 -0.091902 -0.140501 0.452378
5.133333 -0.072725 -1.144317 0.109302 -0.091614 -0.137827 0.430339
5.166667 -0.075771 -1.148855 0.110483 -0.091329 -0.135199 0.415992
5.200000 -0.078811 -1.153310 0.129095 -0.091041 -0.132610 0.405407
5.233333 -0.081845 -1.157684 0.140780 -0.090745 -0.130051 0.400947
5.266667 -0.084870 -1.161975 0.113587 -0.090434 -0.127513 0.406945
5.300000 -0.087887 -1.166185 0.136785 -0.090101 -0.124989 0.418153
5.333333 -0.090895 -1.170313 0.165075 -0.089742 -0.122473 0.425277
5.366667 -0.093894 -1.174360 0.208707 -0.089353 -0.119963 0.418489
