t x y theta dxdt dydt dthetadt
0.000000 0.000000 0.000000 -2.366810 0.032811 -0.070259 -0.031794
0.033333 0.002148 -0.003492 -2.374821 0.033441 -0.063396 -0.025309
0.066667 0.003929 -0.006192 -2.379747 0.032813 -0.054057 -0.012344
0.100000 0.005038 -0.007751 -2.366077 0.030938 -0.042353 0.012397
0.133333 0.005940 -0.008199 -2.381303 0.027873 -0.028318 0.060887
0.166667 0.006903 -0.008736 -2.375011 0.023814 -0.011836 0.145912
0.200000 0.007427 -0.008736 -2.370314 0.019033 0.007287 0.279618
0.233333 0.008044 -0.008805 -2.378661 0.013739 0.029653 0.477484
0.266667 0.008386 -0.008115 -2.370486 0.008111 0.055651 0.756960
0.300000 0.008272 -0.006671 -2.364637 0.002318 0.085414 1.124067
0.333333 0.008300 -0.005268 -2.371595 -0.003436 0.118838 1.566166
0.366667 0.008488 -0.003899 -2.358798 -0.008980 0.155433 2.076516
0.400000 0.008563 -0.000501 -2.328200 -0.014294 0.194499 2.647461
0.433333 0.008101 0.005807 -2.230956 -0.019185 0.234228 3.248738
0.466667 0.006987 0.015180 -2.064651 -0.023502 0.272508 3.830716
0.500000 0.005597 0.027397 -1.915530 -0.027168 0.306920 4.353295
0.533333 0.004454 0.039593 -1.769066 -0.030166 0.334839 4.793292
0.566667 0.002572 0.055189 -1.562043 -0.032433 0.353598 5.118448
0.600000 0.000974 0.070753 -1.277447 -0.033832 0.360709 5.291087
0.633333 -0.000321 0.086275 -1.039294 -0.034369 0.354593 5.306674
0.666667 -0.001291 0.101750 -0.842651 -0.034134 0.334396 5.189840
0.700000 -0.001918 0.117169 -0.625754 -0.033268 0.300101 4.960201
0.733333 -0.002928 0.131079 -0.393781 -0.031832 0.252330 4.624680
0.766667 -0.004107 0.142165 -0.249748 -0.030012 0.192519 4.207669
0.800000 -0.005578 0.149833 -0.161715 -0.027885 0.122840 3.749206
0.833333 -0.006849 0.153317 -0.112744 -0.025124 0.046032 3.279114
0.866667 -0.007747 0.152327 -0.018831 -0.020792 -0.034595 2.805847
0.900000 -0.008175 0.151286 0.066482 -0.013823 -0.115760 2.347318
0.933333 -0.008616 0.145793 0.159945 -0.002647 -0.193628 1.929156
0.966667 -0.008918 0.136275 0.221865 0.014325 -0.264778 1.563979
1.000000 -0.009732 0.123216 0.281146 0.038605 -0.326426 1.250189
1.033333 -0.010656 0.106890 0.300811 0.071050 -0.376582 0.980221
1.066667 -0.010911 0.087810 0.307151 0.111578 -0.414347 0.757347
1.100000 -0.010566 0.068811 0.296386 0.160623 -0.438773 0.579032
1.133333 -0.009600 0.049923 0.281219 0.217373 -0.450429 0.441884
1.166667 -0.004212 0.031414 0.288821 0.281162 -0.450058 0.337536
1.200000 0.006778 0.014777 0.287728 0.350789 -0.438872 0.260596
1.233333 0.018434 -0.001654 0.293675 0.425269 -0.418277 0.202353
1.266667 0.038114 -0.013913 0.295995 0.503435 -0.389977 0.152571
1.300000 0.058467 -0.025909 0.321422 0.582953 -0.356360 0.097027
1.333333 0.079496 -0.037617 0.346256 0.662142 -0.319124 0.022072
1.366667 0.101199 -0.049013 0.368660 0.739008 -0.280192 -0.076062
1.400000 0.123576 -0.060072 0.361596 0.812522 -0.240555 -0.196265
1.433333 0.153604 -0.066716 0.358909 0.881104 -0.200946 -0.329534
1.466667 0.184294 -0.072977 0.346398 0.944300 -0.160917 -0.466267
1.500000 0.221484 -0.075292 0.335402 1.001763 -0.119641 -0.591087
1.533333 0.259309 -0.077189 0.303913 1.053151 -0.076292 -0.686530
1.566667 0.297751 -0.078651 0.252163 1.098304 -0.029770 -0.738254
1.600000 0.336794 -0.079666 0.199857 1.136556 0.020174 -0.741101
1.633333 0.376418 -0.080217 0.150126 1.168365 0.074105 -0.693291
1.666667 0.416606 -0.080291 0.107640 1.193714 0.131911 -0.598115
1.700000 0.457339 -0.079874 0.084110 1.213488 0.193569 -0.464542
1.733333 0.499172 -0.074721 0.064042 1.228534 0.258699 -0.310675
1.766667 0.541214 -0.065143 0.051233 1.239714 0.326751 -0.158037
1.800000 0.582529 -0.051559 0.058103 1.248044 0.397232 -0.021519
1.833333 0.624416 -0.033414 0.073250 1.254127 0.468707 0.082382
1.866667 0.666746 -0.014758 0.114036 1.258609 0.539557 0.138125
1.900000 0.709499 0.004402 0.161102 1.261938 0.607869 0.135027
1.933333 0.752655 0.024062 0.175088 1.264801 0.672390 0.072927
1.966667 0.794999 0.047775 0.184161 1.268068 0.731827 -0.044541
2.000000 0.836871 0.074800 0.195588 1.272555 0.785102 -0.211745
2.033333 0.878366 0.104413 0.191878 1.279057 0.831939 -0.417798
2.066667 0.920186 0.134477 0.166420 1.288460 0.872235 -0.645473
2.100000 0.962178 0.166883 0.138904 1.301269 0.905880 -0.876864
2.133333 1.004459 0.199704 0.112699 1.317665 0.932516 -1.102243
2.166667 1.047010 0.232919 0.057572 1.337426 0.952278 -1.309257
2.200000 1.089813 0.266509 0.000344 1.360126 0.965764 -1.491392
2.233333 1.134803 0.300638 -0.067307 1.385044 0.973580 -1.642279
2.266667 1.181647 0.334535 -0.138303 1.410993 0.976524 -1.761734
2.300000 1.230024 0.367770 -0.213842 1.436815 0.975814 -1.852760
2.333333 1.279519 0.399660 -0.267303 1.461228 0.972627 -1.914744
2.366667 1.329154 0.431828 -0.339681 1.482900 0.967809 -1.952131
2.400000 1.380854 0.463423 -0.408388 1.500485 0.961904 -1.965663
2.433333 1.432640 0.495264 -0.470273 1.513027 0.955311 -1.961570
2.466667 1.484482 0.527332 -0.544315 1.519782 0.948161 -1.943853
2.500000 1.536464 0.558396 -0.605720 1.519957 0.940200 -1.916926
2.533333 1.588446 0.589656 -0.681484 1.513280 0.931174 -1.882921
2.566667 1.640400 0.621096 -0.739772 1.499992 0.921042 -1.845167
2.600000 1.692296 0.652699 -0.797051 1.480665 0.909621 -1.809060
2.633333 1.744106 0.684451 -0.862630 1.455715 0.896719 -1.774851
2.666667 1.793677 0.714710 -0.919444 1.426068 0.882536 -1.745874
2.700000 1.840135 0.743213 -0.973100 1.393125 0.867554 -1.721683
2.733333 1.886431 0.771819 -1.022881 1.357842 0.852162 -1.707289
2.766667 1.932540 0.800516 -1.072158 1.320929 0.836594 -1.702899
2.800000 1.975658 0.828014 -1.123510 1.283165 0.821259 -1.705951
2.833333 2.015211 0.853656 -1.183591 1.245612 0.806726 -1.716286
2.866667 2.054521 0.879355 -1.243826 1.208670 0.793136 -1.728829
2.900000 2.093572 0.905103 -1.298329 1.172394 0.780445 -1.739533
2.933333 2.132348 0.930890 -1.363971 1.137330 0.768935 -1.735978
2.966667 2.170834 0.956709 -1.416717 1.104024 0.758889 -1.709979
3.000000 2.209013 0.982550 -1.481865 1.072669 0.750529 -1.655745
3.033333 2.243995 1.007463 -1.537473 1.043266 0.743980 -1.570054
3.066667 2.276339 1.031245 -1.613004 1.016441 0.739825 -1.449774
3.100000 2.308341 1.055025 -1.675901 0.992909 0.738656 -1.297011
3.133333 2.339991 1.078796 -1.732157 0.973002 0.740797 -1.121352
3.166667 2.371282 1.102552 -1.777276 0.957044 0.746572 -0.929160
3.200000 2.401354 1.125664 -1.815970 0.945460 0.756185 -0.727664
3.233333 2.430530 1.149130 -1.827133 0.938259 0.769509 -0.523162
3.266667 2.460642 1.174226 -1.810768 0.934741 0.785884 -0.328841
3.300000 2.490360 1.199279 -1.796317 0.934237 0.804753 -0.153208
3.333333 2.521042 1.226149 -1.793425 0.936016 0.825322 -0.000266
3.366667 2.552829 1.254745 -1.793271 0.939215 0.846645 0.128658
3.400000 2.585597 1.284742 -1.779798 0.942746 0.867595 0.236346
3.433333 2.617928 1.314656 -1.779329 0.945716 0.887216 0.330399
3.466667 2.650157 1.345775 -1.760896 0.947540 0.904750 0.425537
3.500000 2.681925 1.376783 -1.734335 0.947304 0.919036 0.534983
3.533333 2.713568 1.408130 -1.718785 0.944321 0.929293 0.672094
3.566667 2.744725 1.439336 -1.708974 0.938002 0.934746 0.844020
3.600000 2.776514 1.471525 -1.694398 0.928043 0.934934 1.051930
3.633333 2.808754 1.504441 -1.698616 0.914140 0.929178 1.293589
3.666667 2.840466 1.537169 -1.676391 0.896033 0.916977 1.559049
3.700000 2.871636 1.569693 -1.616007 0.873896 0.898429 1.838152
3.733333 2.901986 1.601589 -1.528713 0.847761 0.873277 2.109719
3.766667 2.930737 1.631842 -1.450816 0.817942 0.841835 2.354104
3.800000 2.958906 1.661843 -1.348353 0.784756 0.804093 2.555932
3.833333 2.984399 1.688484 -1.263803 0.749053 0.760761 2.701254
3.866667 3.009290 1.714848 -1.123999 0.711742 0.712205 2.780432
3.900000 3.031656 1.737356 -0.979606 0.673721 0.658833 2.787354
3.933333 3.053404 1.759570 -0.857607 0.636038 0.601589 2.728637
3.966667 3.072841 1.777273 -0.754762 0.599548 0.541240 2.614936
4.000000 3.091650 1.794673 -0.682063 0.565157 0.479412 2.461468
4.033333 3.109827 1.811770 -0.608929 0.533190 0.417351 2.282082
4.066667 3.126031 1.824759 -0.546601 0.503912 0.357108 2.095835
4.100000 3.141597 1.837448 -0.495531 0.477109 0.300170 1.919161
4.133333 3.155878 1.845486 -0.436537 0.452319 0.248077 1.762045
4.166667 3.169557 1.849889 -0.382686 0.428568 0.201944 1.627136
4.200000 3.183621 1.851088 -0.341616 0.404665 0.162308 1.507531
4.233333 3.197045 1.852028 -0.303049 0.379600 0.129677 1.397150
4.266667 3.209824 1.852726 -0.275842 0.351888 0.103621 1.288637
4.300000 3.221958 1.853199 -0.233356 0.320158 0.083958 1.173725
4.333333 3.233879 1.856173 -0.172438 0.282940 0.069676 1.042853
4.366667 3.245151 1.858953 -0.101571 0.239543 0.059785 0.890754
4.400000 3.255772 1.861552 -0.058474 0.189491 0.053028 0.719852
4.433333 3.263884 1.864361 -0.034631 0.132469 0.048113 0.533141
4.466667 3.268836 1.866779 -0.020424 0.069165 0.044181 0.331424
4.500000 3.269386 1.867655 -0.028678 0.001124 0.040883 0.122800
4.533333 3.269298 1.868405 -0.050522 -0.069429 0.038474 -0.073973
4.566667 3.268580 1.869045 -0.058765 -0.140581 0.037374 -0.239601
4.600000 3.263214 1.868983 -0.059559 -0.210172 0.038293 -0.361999
4.633333 3.252927 1.869056 -0.064903 -0.275719 0.042442 -0.433061
4.666667 3.237519 1.870182 -0.113485 -0.335118 0.050846 -0.444680
4.700000 3.221547 1.871256 -0.169696 -0.386782 0.063893 -0.399083
4.733333 3.205032 1.872293 -0.211544 -0.429542 0.081838 -0.310059
4.766667 3.188000 1.873307 -0.243132 -0.461725 0.105289 -0.192668
4.800000 3.170474 1.874314 -0.256069 -0.481722 0.135046 -0.062165
4.833333 3.152201 1.880051 -0.235543 -0.489024 0.170601 0.065926
4.866667 3.133480 1.885803 -0.206516 -0.483682 0.211650 0.170789
4.900000 3.114338 1.891580 -0.175289 -0.466337 0.257642 0.235164
4.933333 3.094798 1.897390 -0.138029 -0.437644 0.308025 0.250693
4.966667 3.078161 1.908693 -0.110158 -0.399575 0.361060 0.211045
5.000000 3.061170 1.920041 -0.087744 -0.354459 0.414745 0.119761
5.033333 3.049043 1.935918 -0.065281 -0.304477 0.467923 -0.011995
5.066667 3.036597 1.951842 -0.061363 -0.251137 0.519555 -0.165205
5.100000 3.030040 1.972160 -0.067657 -0.196035 0.568610 -0.317220
5.133333 3.030618 1.996048 -0.102584 -0.141272 0.613854 -0.450077
5.166667 3.030896 2.019966 -0.146495 -0.087799 0.655366 -0.544532
5.200000 3.030873 2.043900 -0.198140 -0.037045 0.692942 -0.588752
5.233333 3.030549 2.067841 -0.245437 0.010447 0.726676 -0.575843
5.266667 3.029922 2.091775 -0.267820 0.053533 0.756257 -0.505682
5.300000 3.028992 2.115690 -0.304810 0.092053 0.781888 -0.384266
5.333333 3.034445 2.142891 -0.321944 0.126293 0.803777 -0.219528
5.366667 3.039583 2.170048 -0.327596 0.156098 0.821610 -0.025928
5.400000 3.048020 2.199610 -0.327790 0.181480 0.834903 0.182309
5.433333 3.056120 2.229096 -0.298041 0.202045 0.842927 0.387398
5.466667 3.065233 2.259543 -0.282444 0.217588 0.845071 0.578446
5.500000 3.075034 2.290319 -0.250452 0.227414 0.840757 0.744515
5.533333 3.084655 2.320635 -0.217215 0.231429 0.829516 0.877838
5.566667 3.093784 2.350088 -0.173554 0.229640 0.810979 0.977989
5.600000 3.102500 2.379367 -0.122022 0.222792 0.785760 1.045537
5.633333 3.110156 2.405905 -0.080373 0.211678 0.754635 1.087053
5.666667 3.117201 2.430600 -0.032018 0.197345 0.718236 1.104109
5.700000 3.123790 2.455071 0.005500 0.180967 0.677063 1.102100
5.733333 3.129253 2.475767 0.043891 0.163370 0.632240 1.084997
5.766667 3.134231 2.496214 0.070270 0.145363 0.584776 1.053007
5.800000 3.138711 2.516404 0.107094 0.127398 0.535183 1.005761
5.833333 3.142677 2.536327 0.129042 0.109824 0.483551 0.945192
5.866667 3.145817 2.549420 0.149556 0.092951 0.431053 0.873252
5.900000 3.148418 2.562235 0.198523 0.077116 0.378824 0.790734
5.933333 3.150466 2.574767 0.249183 0.062448 0.327510 0.700415
5.966667 3.151947 2.587017 0.271982 0.049079 0.277810 0.606010
6.000000 3.152958 2.593442 0.307747 0.037133 0.230887 0.512185
6.033333 3.153377 2.599587 0.311260 0.026785 0.188111 0.417401
6.066667 3.154182 2.601823 0.306384 0.017995 0.149802 0.325218
6.100000 3.154370 2.603792 0.302675 0.010495 0.116270 0.241189
6.133333 3.153925 2.605503 0.294768 0.003933 0.087797 0.169329
6.166667 3.152833 2.606965 0.305551 -0.002067 0.064674 0.109785
6.200000 3.152268 2.607843 0.303106 -0.007965 0.046295 0.060808
6.233333 3.152409 2.608502 0.303608 -0.014486 0.032075 0.018996
6.266667 3.153154 2.609060 0.313797 -0.022573 0.021415 -0.024983
6.300000 3.153189 2.609409 0.315671 -0.033282 0.013831 -0.078491
6.333333 3.152499 2.609558 0.318849 -0.047865 0.009005 -0.147862
6.366667 3.151066 2.609517 0.300422 -0.067837 0.006735 -0.231710
6.400000 3.150038 2.609420 0.304922 -0.094901 0.007303 -0.327183
6.433333 3.148233 2.609153 0.304939 -0.130224 0.010930 -0.423509
6.466667 3.145635 2.608727 0.307525 -0.174317 0.017947 -0.507984
6.500000 3.141913 2.608381 0.308325 -0.227621 0.028530 -0.574891
6.533333 3.137365 2.607895 0.264427 -0.289953 0.042533 -0.614924
6.566667 3.130157 2.607635 0.191409 -0.360357 0.059474 -0.625330
6.600000 3.119625 2.608555 0.131322 -0.436989 0.078628 -0.600636
6.633333 3.105453 2.610775 0.100775 -0.518034 0.099178 -0.544061
6.666667 3.086739 2.614796 0.089381 -0.601827 0.120285 -0.461582
6.700000 3.063327 2.620635 0.088561 -0.685817 0.140906 -0.355791
6.733333 3.035570 2.627463 0.076955 -0.767385 0.160064 -0.240279
6.766667 3.006948 2.634188 0.081156 -0.844537 0.177008 -0.127038
6.800000 2.977467 2.640809 0.086240 -0.916042 0.191300 -0.031175
6.833333 2.942053 2.648549 0.087091 -0.980711 0.202626 0.040816
6.866667 2.905803 2.656184 0.115223 -1.037721 0.210904 0.085247
6.900000 2.868731 2.663715 0.120439 -1.087290 0.216461 0.101274
6.933333 2.830852 2.671140 0.135262 -1.130480 0.219793 0.093850
6.966667 2.792183 2.678460 0.147969 -1.168295 0.221364 0.068960
7.000000 2.750960 2.686164 0.140150 -1.201467 0.221457 0.036185
7.033333 2.708980 2.693761 0.140723 -1.231358 0.220435 -0.002800
7.066667 2.667266 2.701259 0.124663 -1.259355 0.218561 -0.040222
7.100000 2.624832 2.708647 0.123838 -1.286662 0.215924 -0.074295
7.133333 2.582150 2.716124 0.113548 -1.313977 0.212537 -0.102658
7.166667 2.538831 2.723280 0.118795 -1.342095 0.208422 -0.123960
7.200000 2.494326 2.730270 0.107321 -1.372027 0.203711 -0.140611
7.233333 2.449177 2.737146 0.105150 -1.404341 0.198500 -0.150139
7.266667 2.402356 2.743741 0.098476 -1.439009 0.192830 -0.157881
7.300000 2.353879 2.750167 0.094718 -1.475792 0.186753 -0.165467
7.333333 2.304826 2.756475 0.096187 -1.514589 0.180287 -0.173592
7.366667 2.255159 2.762148 0.082432 -1.554829 0.173480 -0.181431
7.400000 2.202835 2.767846 0.076840 -1.595834 0.166266 -0.189607
7.433333 2.148339 2.773237 0.081290 -1.636788 0.158553 -0.200498
7.466667 2.093369 2.778509 0.060779 -1.677448 0.150274 -0.211349
7.500000 2.034699 2.783521 0.054345 -1.717353 0.141363 -0.220722
7.533333 1.975618 2.788414 0.047912 -1.755909 0.131790 -0.229093
7.566667 1.916160 2.793188 0.042330 -1.792881 0.121414 -0.237872
7.600000 1.856733 2.797323 0.032156 -1.828188 0.110250 -0.246117
7.633333 1.795070 2.801027 0.026798 -1.861904 0.098320 -0.250072
7.666667 1.731589 2.803984 0.020956 -1.893711 0.085764 -0.251558
7.700000 1.667871 2.806826 0.010228 -1.923785 0.072753 -0.252649
7.733333 1.602384 2.808944 -0.002067 -1.952129 0.059562 -0.250334
7.766667 1.536741 2.810950 -0.018636 -1.978596 0.046574 -0.245134
7.800000 1.470084 2.812282 -0.023561 -2.002715 0.034108 -0.236191
7.833333 1.402627 2.813070 -0.021218 -2.024068 0.022377 -0.226567
7.866667 1.334119 2.813109 -0.037756 -2.042416 0.011417 -0.215129
7.900000 1.264715 2.812670 -0.042519 -2.057044 0.001170 -0.199856
7.933333 1.194529 2.811912 -0.059838 -2.067221 -0.008709 -0.182678
7.966667 1.123970 2.811218 -0.058758 -2.072259 -0.018606 -0.160556
8.000000 1.053558 2.810443 -0.051772 -2.071459 -0.029201 -0.133024
8.033333 0.983341 2.809591 -0.068241 -2.063709 -0.041241 -0.095414
8.066667 0.913364 2.808668 -0.057297 -2.048090 -0.055376 -0.048736
8.100000 0.843672 2.807679 -0.081516 -2.023752 -0.072261 0.011792
8.133333 0.774312 2.806629 -0.083722 -1.990447 -0.092240 0.084264
8.166667 0.705205 2.804542 -0.084233 -1.948005 -0.115549 0.163614
8.200000 0.637398 2.801522 -0.077100 -1.896528 -0.141837 0.243577
8.233333 0.572381 2.797197 -0.077877 -1.836974 -0.170175 0.315483
8.266667 0.511388 2.791092 -0.061760 -1.770445 -0.199505 0.373640
8.300000 0.450944 2.784968 -0.040349 -1.698740 -0.228540 0.405982
8.333333 0.394279 2.776170 -0.015183 -1.623566 -0.255897 0.411433
8.366667 0.343002 2.765016 0.012217 -1.547011 -0.280177 0.393038
8.400000 0.292374 2.753885 0.045559 -1.471293 -0.300385 0.355590
8.433333 0.248165 2.740976 0.092444 -1.398747 -0.315675 0.301419
8.466667 0.204653 2.728128 0.110999 -1.331118 -0.325502 0.239434
8.500000 0.161861 2.715358 0.097984 -1.269923 -0.329089 0.177234
8.533333 0.123044 2.702883 0.063605 -1.216586 -0.325793 0.120375
8.566667 0.086048 2.691977 0.049367 -1.171966 -0.315035 0.067978
8.600000 0.049821 2.681203 0.018315 -1.136713 -0.296154 0.023186
8.633333 0.014379 2.670578 0.033146 -1.110230 -0.268936 -0.012158
8.666667 -0.020264 2.660115 0.053482 -1.092202 -0.233029 -0.043612
8.700000 -0.054095 2.649833 0.072091 -1.081793 -0.188503 -0.077124
8.733333 -0.087100 2.639745 0.061753 -1.077529 -0.135854 -0.119614
8.766667 -0.122223 2.634116 0.065784 -1.077587 -0.076258 -0.168440
8.800000 -0.156492 2.628706 0.074526 -1.080138 -0.010893 -0.224962
8.833333 -0.192969 2.628150 0.068446 -1.083447 0.058584 -0.283444
8.866667 -0.230691 2.631873 0.070302 -1.085501 0.130289 -0.332823
8.900000 -0.269399 2.640339 0.040439 -1.084082 0.201562 -0.358763
8.933333 -0.307178 2.649032 0.001256 -1.077420 0.270063 -0.352244
8.966667 -0.345300 2.662125 -0.034025 -1.064383 0.334074 -0.309286
9.000000 -0.382449 2.675428 -0.052872 -1.043844 0.391880 -0.228448
9.033333 -0.418619 2.693241 -0.085180 -1.015614 0.442319 -0.110673
9.066667 -0.453771 2.711238 -0.101246 -0.979883 0.484525 0.034194
9.100000 -0.487882 2.729403 -0.087981 -0.937771 0.518881 0.192245
9.133333 -0.520930 2.747720 -0.068148 -0.890427 0.545749 0.353035
9.166667 -0.551033 2.767463 -0.062740 -0.839202 0.565743 0.504554
9.200000 -0.578861 2.788648 0.003295 -0.785692 0.579457 0.634024
9.233333 -0.601933 2.809174 0.036701 -0.731389 0.587993 0.731310
9.266667 -0.623873 2.829781 0.058067 -0.677841 0.592499 0.791816
9.300000 -0.644668 2.850453 0.104644 -0.625993 0.593544 0.815267
9.333333 -0.664307 2.871168 0.133401 -0.576500 0.591524 0.802031
9.366667 -0.682778 2.891909 0.162865 -0.529123 0.586384 0.752476
9.400000 -0.697909 2.910688 0.196193 -0.482811 0.577889 0.673343
9.433333 -0.711854 2.929457 0.220034 -0.435907 0.565319 0.563936
9.466667 -0.724873 2.947865 0.241329 -0.386615 0.547950 0.422164
9.500000 -0.737532 2.966353 0.257113 -0.333347 0.525334 0.247639
9.533333 -0.750715 2.985748 0.253937 -0.274407 0.497083 0.043475
9.566667 -0.762681 3.005064 0.277756 -0.208992 0.463310 -0.190031
9.600000 -0.773026 3.023540 0.278597 -0.137230 0.424663 -0.446307
9.633333 -0.780496 3.040198 0.279742 -0.059346 0.381998 -0.713327
9.666667 -0.783749 3.053917 0.255317 0.024165 0.336294 -0.973988
9.700000 -0.781794 3.063937 0.228055 0.112470 0.288710 -1.213785
9.733333 -0.772550 3.068881 0.156285 0.203216 0.241358 -1.419235
9.766667 -0.762079 3.073680 0.090810 0.294564 0.196268 -1.572679
9.800000 -0.750390 3.078331 -0.003440 0.385207 0.155313 -1.665048
9.833333 -0.737496 3.082834 -0.093733 0.473416 0.120071 -1.693100
9.866667 -0.717593 3.083477 -0.167384 0.557660 0.092212 -1.657769
9.900000 -0.696517 3.083973 -0.263811 0.637143 0.072790 -1.560499
9.933333 -0.674287 3.084324 -0.325114 0.712715 0.061640 -1.415247
9.966667 -0.646744 3.084546 -0.348681 0.784375 0.058302 -1.230884
10.000000 -0.618094 3.084628 -0.378450 0.851827 0.062057 -1.024739
10.033333 -0.588364 3.084576 -0.398353 0.914992 0.072322 -0.810168
10.066667 -0.557580 3.084390 -0.396126 0.974045 0.087731 -0.603389
10.100000 -0.523509 3.086616 -0.433428 1.028445 0.107027 -0.418503
10.133333 -0.486728 3.091313 -0.438060 1.076730 0.129169 -0.257388
10.166667 -0.448984 3.095878 -0.449547 1.118333 0.153064 -0.128159
10.200000 -0.408345 3.103019 -0.429560 1.152644 0.177359 -0.031304
10.233333 -0.366812 3.110020 -0.422504 1.178468 0.200640 0.036751
10.266667 -0.324419 3.116875 -0.432838 1.194591 0.221904 0.082195
10.300000 -0.282706 3.125251 -0.386251 1.200709 0.240378 0.103752
10.333333 -0.239998 3.134925 -0.382595 1.197363 0.255547 0.103306
10.366667 -0.196535 3.144431 -0.380449 1.184562 0.266942 0.078158
10.400000 -0.154095 3.154495 -0.380214 1.162341 0.274502 0.027562
10.433333 -0.113355 3.164708 -0.387134 1.131800 0.278148 -0.052516
10.466667 -0.075354 3.175073 -0.386337 1.094017 0.277667 -0.162311
10.500000 -0.039646 3.185370 -0.383080 1.049681 0.272937 -0.291200
10.533333 -0.003331 3.195446 -0.391734 0.999155 0.263736 -0.435614
10.566667 0.026495 3.204514 -0.376463 0.944422 0.249895 -0.582298
10.600000 0.056889 3.213339 -0.410177 0.888133 0.231183 -0.714418
10.633333 0.087838 3.221911 -0.421622 0.832606 0.207610 -0.822453
10.666667 0.119324 3.230222 -0.435443 0.779927 0.179587 -0.902184
10.700000 0.144630 3.237436 -0.506391 0.732472 0.147324 -0.953417
10.733333 0.164807 3.243029 -0.605770 0.693017 0.111128 -0.975344
10.766667 0.181590 3.246867 -0.666757 0.662611 0.071567 -0.974388
10.800000 0.196865 3.248381 -0.713526 0.641771 0.029356 -0.966782
10.833333 0.212660 3.249597 -0.729237 0.630876 -0.014935 -0.965667
10.866667 0.229653 3.248627 -0.735466 0.630409 -0.060905 -0.978696
10.900000 0.249000 3.245361 -0.722040 0.639675 -0.107898 -1.016610
10.933333 0.271014 3.239525 -0.724357 0.656885 -0.155001 -1.086625
10.966667 0.293558 3.233398 -0.737890 0.680336 -0.201648 -1.188781
11.000000 0.316633 3.226986 -0.772828 0.708178 -0.247334 -1.312640
11.033333 0.341385 3.218342 -0.821351 0.738539 -0.291214 -1.434374
11.066667 0.367447 3.206894 -0.888730 0.769526 -0.332042 -1.531683
11.100000 0.394033 3.195186 -0.957366 0.800109 -0.368818 -1.583809
11.133333 0.421002 3.180428 -1.036524 0.829930 -0.400842 -1.571878
11.166667 0.448487 3.165435 -1.160052 0.858957 -0.427295 -1.479051
11.200000 0.477200 3.148705 -1.252776 0.887402 -0.447034 -1.299086
11.233333 0.506986 3.130674 -1.304415 0.915463 -0.459513 -1.043935
11.266667 0.538656 3.112753 -1.331763 0.943368 -0.464851 -0.731255
11.300000 0.570821 3.094663 -1.359216 0.971238 -0.463101 -0.375783
11.333333 0.603475 3.076421 -1.365094 0.999109 -0.454576 0.000902
11.366667 0.637551 3.060195 -1.341206 1.026938 -0.439775 0.370279
11.400000 0.672744 3.046917 -1.292862 1.054460 -0.420255 0.705342
11.433333 0.708398 3.033531 -1.264957 1.081777 -0.397285 0.994776
11.466667 0.744502 3.020049 -1.199701 1.108981 -0.372159 1.228297
11.500000 0.781048 3.006483 -1.141331 1.136158 -0.346174 1.398332
11.533333 0.819758 2.996105 -1.068661 1.163484 -0.320592 1.504551
11.566667 0.858885 2.985664 -1.011068 1.191287 -0.296315 1.553173
11.600000 0.899822 2.978405 -0.932378 1.220118 -0.273559 1.557970
11.633333 0.941148 2.971096 -0.878526 1.249984 -0.252697 1.523468
11.666667 0.982849 2.963740 -0.829471 1.280895 -0.233858 1.459349
11.700000 1.024912 2.956341 -0.770134 1.312857 -0.217169 1.373271
11.733333 1.067321 2.948905 -0.744152 1.345933 -0.202341 1.276841
11.766667 1.113586 2.943068 -0.705938 1.379999 -0.189409 1.177250
11.800000 1.160162 2.937201 -0.667762 1.414814 -0.178210 1.079255
11.833333 1.207032 2.931306 -0.634194 1.450375 -0.168481 0.988881
11.866667 1.256779 2.926285 -0.600032 1.486544 -0.160028 0.909215
11.900000 1.306777 2.921241 -0.578807 1.523278 -0.152674 0.844733
11.933333 1.358750 2.916744 -0.544968 1.560160 -0.146509 0.790498
11.966667 1.412053 2.912438 -0.525431 1.596894 -0.141359 0.744895
12.000000 1.465535 2.908114 -0.520375 1.633311 -0.137186 0.706576
12.033333 1.519169 2.903771 -0.500068 1.669078 -0.133940 0.674619
12.066667 1.575364 2.899594 -0.466735 1.703914 -0.131436 0.647043
12.100000 1.633872 2.895344 -0.450417 1.737172 -0.129451 0.621218
12.133333 1.692447 2.891076 -0.422500 1.768664 -0.127594 0.598682
12.166667 1.752588 2.886826 -0.395576 1.798268 -0.125517 0.580424
12.200000 1.813804 2.882565 -0.385284 1.825620 -0.122988 0.564575
12.233333 1.876081 2.878087 -0.363597 1.850366 -0.119729 0.548706
12.266667 1.939580 2.873672 -0.335802 1.872245 -0.115520 0.532713
12.300000 2.002976 2.869245 -0.343068 1.891455 -0.110171 0.516827
12.333333 2.067363 2.865800 -0.329849 1.907711 -0.103755 0.500148
12.366667 2.131570 2.862342 -0.299585 1.920628 -0.096549 0.482024
12.400000 2.195560 2.858869 -0.293769 1.929897 -0.088944 0.462880
12.433333 2.259296 2.855382 -0.269043 1.935255 -0.081556 0.441532
12.466667 2.324864 2.852714 -0.242120 1.936445 -0.075057 0.416794
12.500000 2.391494 2.850792 -0.235030 1.932912 -0.070177 0.385617
12.533333 2.458143 2.849495 -0.220593 1.924443 -0.067462 0.347626
12.566667 2.524070 2.848472 -0.201480 1.910440 -0.067520 0.301300
12.600000 2.588530 2.847330 -0.206111 1.890607 -0.070716 0.246549
12.633333 2.652494 2.846159 -0.194256 1.864924 -0.077089 0.185299
12.666667 2.715922 2.844954 -0.187757 1.833538 -0.086550 0.120944
12.700000 2.778389 2.842949 -0.178197 1.796205 -0.099076 0.054771
12.733333 2.838642 2.839825 -0.167155 1.752793 -0.114527 -0.013631
12.766667 2.895933 2.834978 -0.171739 1.704215 -0.132176 -0.081607
12.800000 2.952545 2.830088 -0.196391 1.651086 -0.151401 -0.150669
12.833333 3.008445 2.825158 -0.196039 1.592814 -0.171871 -0.218087
12.866667 3.063601 2.820188 -0.198558 1.528635 -0.193324 -0.286750
12.900000 3.112400 2.812441 -0.219272 1.459396 -0.214938 -0.354974
12.933333 3.160399 2.804656 -0.218675 1.385652 -0.236127 -0.424055
12.966667 3.207573 2.796838 -0.239757 1.307136 -0.256835 -0.496863
13.000000 3.253900 2.788988 -0.263254 1.223014 -0.276982 -0.575873
13.033333 3.291415 2.777987 -0.270831 1.134705 -0.295846 -0.669188
13.066667 3.328045 2.766963 -0.291932 1.043295 -0.312610 -0.775578
13.100000 3.363777 2.755925 -0.323602 0.948312 -0.327111 -0.893530
13.133333 3.398598 2.744879 -0.361161 0.849241 -0.339029 -1.010997
13.166667 3.420249 2.731980 -0.364614 0.746664 -0.347733 -1.119991
13.200000 3.440979 2.719087 -0.410227 0.642438 -0.352686 -1.206136
13.233333 3.460791 2.706208 -0.438257 0.536987 -0.354174 -1.251743
13.266667 3.479686 2.693352 -0.500558 0.431412 -0.352682 -1.241974
13.300000 3.497670 2.680528 -0.570405 0.327553 -0.348559 -1.167421
13.333333 3.506857 2.667976 -0.654654 0.228266 -0.342317 -1.027317
13.366667 3.509701 2.656349 -0.734150 0.135062 -0.334888 -0.815027
13.400000 3.507607 2.645930 -0.796660 0.049206 -0.327181 -0.533217
13.433333 3.504663 2.635570 -0.807689 -0.027836 -0.319769 -0.192025
13.466667 3.498725 2.626134 -0.794333 -0.094317 -0.313150 0.189145
13.500000 3.490516 2.616978 -0.772359 -0.148500 -0.307533 0.590094
13.533333 3.481053 2.607288 -0.754084 -0.190114 -0.302967 0.990497
13.566667 3.470854 2.597678 -0.709855 -0.218551 -0.299005 1.362275
13.600000 3.459951 2.588154 -0.633828 -0.233622 -0.294890 1.680884
13.633333 3.451643 2.577633 -0.542198 -0.235421 -0.289776 1.932267
13.666667 3.442691 2.567210 -0.452485 -0.225319 -0.282776 2.107458
13.700000 3.433127 2.556893 -0.352778 -0.205426 -0.273187 2.203294
13.733333 3.422977 2.546689 -0.258727 -0.177291 -0.260425 2.217722
13.766667 3.412274 2.536604 -0.174974 -0.142775 -0.244276 2.161211
13.800000 3.406416 2.527264 -0.076419 -0.104546 -0.224981 2.048587
13.833333 3.405161 2.519510 0.005486 -0.065234 -0.203093 1.889211
13.866667 3.403422 2.511895 0.076879 -0.026845 -0.179222 1.697042
13.900000 3.405555 2.506523 0.117137 0.008629 -0.154327 1.487521
13.933333 3.411022 2.503299 0.147870 0.038921 -0.129482 1.277668
13.966667 3.416047 2.500221 0.188113 0.062206 -0.105711 1.074085
14.000000 3.420640 2.497288 0.202305 0.078000 -0.083825 0.884314
14.033333 3.425921 2.495939 0.222453 0.086457 -0.064408 0.715540
14.066667 3.430788 2.494732 0.224127 0.087790 -0.047978 0.572712
14.100000 3.434823 2.494401 0.246373 0.083084 -0.034598 0.453837
14.133333 3.437731 2.494553 0.275685 0.074188 -0.024030 0.353845
14.166667 3.439368 2.494762 0.272369 0.063024 -0.015991 0.275278
14.200000 3.440558 2.494714 0.275023 0.051045 -0.010198 0.212348
14.233333 3.441506 2.494382 0.281540 0.039379 -0.006217 0.163012
14.266667 3.442103 2.494171 0.278627 0.029086 -0.003641 0.122206
14.300000 3.442361 2.494078 0.279053 0.020721 -0.002101 0.088144
14.333333 3.442292 2.494099 0.290564 0.014312 -0.001311 0.063939
14.366667 3.441908 2.494231 0.277872 0.009722 -0.000974 0.045445
14.400000 3.441608 2.494439 0.276972 0.006711 -0.000827 0.033368
