t x y theta dxdt dydt dthetadt
0.000000 0.000000 0.000000 -1.554173 0.003505 0.002466 0.022737
0.033333 0.000124 0.000179 -1.549762 0.007539 0.002587 0.029956
0.066667 -0.000424 -0.000012 -1.548898 0.013792 0.003251 0.047114
0.100000 -0.000282 -0.000102 -1.547759 0.022703 0.004522 0.083174
0.133333 0.000572 -0.000087 -1.559945 0.034523 0.006426 0.141009
0.166667 0.000671 -0.000027 -1.551862 0.050030 0.009066 0.224262
0.200000 0.001531 0.000148 -1.552380 0.069787 0.012529 0.331191
0.233333 0.003176 0.000442 -1.552268 0.094128 0.016821 0.460129
0.266667 0.005196 0.000790 -1.557816 0.123389 0.021857 0.605590
0.300000 0.008050 0.001265 -1.554774 0.158133 0.027573 0.760756
0.333333 0.011763 0.001871 -1.520935 0.199124 0.033835 0.914706
0.366667 0.018987 0.003323 -1.470317 0.246016 0.040392 1.061402
0.400000 0.027114 0.004911 -1.404925 0.298563 0.047004 1.192031
0.433333 0.036167 0.006638 -1.346878 0.356367 0.053348 1.295525
0.466667 0.046164 0.008507 -1.286609 0.418675 0.059161 1.364158
0.500000 0.060912 0.010787 -1.250120 0.484324 0.064095 1.392655
0.533333 0.076640 0.013211 -1.205599 0.551817 0.067942 1.384060
0.566667 0.096076 0.016217 -1.140662 0.620449 0.070573 1.340462
0.600000 0.118827 0.019175 -1.086196 0.689326 0.071875 1.269746
0.633333 0.144459 0.022241 -1.030017 0.757577 0.071901 1.184352
0.666667 0.173094 0.024624 -0.993876 0.824397 0.070766 1.094395
0.700000 0.202753 0.027150 -0.959175 0.889330 0.068766 1.006099
0.733333 0.233439 0.029821 -0.937394 0.952088 0.066131 0.924541
0.766667 0.266176 0.031824 -0.928739 1.012203 0.063251 0.856587
0.800000 0.299943 0.033977 -0.905684 1.069596 0.060486 0.805538
0.833333 0.337373 0.035454 -0.883106 1.124272 0.058245 0.770156
0.866667 0.375829 0.037086 -0.869927 1.176618 0.056834 0.748999
0.900000 0.417052 0.038455 -0.840145 1.226845 0.056583 0.741159
0.933333 0.459292 0.039987 -0.823348 1.275170 0.057820 0.745639
0.966667 0.504070 0.041530 -0.781465 1.321851 0.060661 0.753393
1.000000 0.549849 0.043242 -0.758413 1.366925 0.065280 0.760791
1.033333 0.596623 0.045128 -0.729971 1.410442 0.071677 0.765989
1.066667 0.644382 0.047193 -0.712246 1.452189 0.079846 0.769393
1.100000 0.692653 0.049541 -0.675597 1.492305 0.089606 0.771818
1.133333 0.741891 0.052077 -0.644667 1.530928 0.100774 0.770304
1.166667 0.793979 0.055132 -0.616132 1.568171 0.113189 0.768423
1.200000 0.847588 0.058809 -0.609235 1.604160 0.126559 0.765983
1.233333 0.902915 0.063664 -0.588940 1.639103 0.140669 0.763334
1.266667 0.959163 0.068715 -0.560895 1.673258 0.155339 0.759852
1.300000 1.016316 0.073964 -0.536405 1.706430 0.170381 0.756211
1.333333 1.074005 0.079976 -0.503496 1.738452 0.185562 0.753935
1.366667 1.131528 0.086528 -0.470979 1.769334 0.200740 0.753115
1.400000 1.189912 0.093282 -0.447850 1.799155 0.215887 0.751092
1.433333 1.250928 0.101071 -0.414141 1.827956 0.230894 0.745803
1.466667 1.312776 0.109060 -0.392170 1.855836 0.245677 0.734673
1.500000 1.375437 0.117250 -0.383561 1.883130 0.260265 0.716195
1.533333 1.438893 0.125640 -0.367130 1.910112 0.274782 0.691711
1.566667 1.503574 0.135662 -0.340428 1.936889 0.289160 0.662054
1.600000 1.569016 0.145879 -0.302797 1.963496 0.303344 0.629469
1.633333 1.635199 0.156290 -0.266597 1.989906 0.317413 0.595074
1.666667 1.702104 0.166891 -0.244580 2.015882 0.331407 0.563208
1.700000 1.768525 0.178277 -0.233425 2.041184 0.345210 0.532595
1.733333 1.835629 0.189849 -0.232995 2.065772 0.358701 0.503900
1.766667 1.905110 0.201984 -0.215304 2.089522 0.371986 0.476843
1.800000 1.975896 0.214607 -0.210471 2.112300 0.385051 0.453966
1.833333 2.047887 0.228036 -0.193561 2.134098 0.397721 0.438597
1.866667 2.120478 0.241629 -0.173879 2.155168 0.409822 0.425715
1.900000 2.193643 0.255381 -0.159971 2.175577 0.421359 0.419478
1.933333 2.267099 0.269855 -0.150314 2.195037 0.432171 0.415494
1.966667 2.340548 0.284737 -0.139159 2.213404 0.441911 0.414987
2.000000 2.413269 0.299919 -0.108934 2.230728 0.450321 0.412959
2.033333 2.486472 0.315237 -0.108202 2.246962 0.457300 0.406468
2.066667 2.562117 0.331159 -0.082380 2.262112 0.462694 0.400398
2.100000 2.638197 0.347201 -0.072286 2.276357 0.466241 0.390006
2.133333 2.714687 0.363354 -0.070211 2.290090 0.467904 0.378252
2.166667 2.792639 0.379280 -0.047420 2.303680 0.467897 0.361165
2.200000 2.870950 0.395301 -0.054445 2.317236 0.466439 0.345408
2.233333 2.949159 0.411757 -0.019780 2.330877 0.463691 0.327970
2.266667 3.027101 0.427778 -0.015309 2.344577 0.459934 0.309423
2.300000 3.103545 0.442593 0.008152 2.358422 0.455587 0.290254
2.333333 3.180241 0.457478 0.000848 2.372508 0.450978 0.271000
2.366667 3.257552 0.472105 0.003094 2.386958 0.446310 0.256701
2.400000 3.338894 0.486449 0.025878 2.401677 0.441798 0.240954
2.433333 3.420408 0.500840 0.031028 2.416506 0.437727 0.228654
2.466667 3.502064 0.515274 0.032826 2.431119 0.434349 0.214557
2.500000 3.583834 0.529745 0.040184 2.444892 0.431702 0.200524
2.533333 3.665688 0.544247 0.040832 2.457033 0.429873 0.183972
2.566667 3.747595 0.558776 0.036485 2.466766 0.428861 0.160223
2.600000 3.830893 0.572584 0.068476 2.473837 0.428675 0.129986
2.633333 3.914182 0.586406 0.067127 2.478079 0.429218 0.092953
2.666667 3.997893 0.600257 0.070883 2.479450 0.430374 0.053789
2.700000 4.081309 0.614462 0.090458 2.478075 0.432104 0.013150
2.733333 4.164622 0.628666 0.089278 2.474347 0.434303 -0.026092
2.766667 4.247529 0.643294 0.073626 2.468630 0.436885 -0.060606
2.800000 4.330272 0.657910 0.070574 2.461199 0.439668 -0.082607
2.833333 4.412819 0.672509 0.055583 2.452538 0.442560 -0.089716
2.866667 4.494038 0.687691 0.047637 2.443491 0.445462 -0.084654
2.900000 4.575001 0.702846 0.037245 2.434863 0.448333 -0.065172
2.933333 4.655679 0.717967 0.022146 2.427288 0.451113 -0.030526
2.966667 4.736040 0.733048 0.014507 2.421519 0.453852 0.018551
3.000000 4.816057 0.748083 0.037030 2.418191 0.456661 0.072472
3.033333 4.895698 0.763066 0.044574 2.417501 0.459554 0.124504
3.066667 4.975427 0.778403 0.049609 2.418977 0.462523 0.174395
3.100000 5.054722 0.793674 0.044530 2.422058 0.465560 0.217666
3.133333 5.133554 0.808873 0.064663 2.426496 0.468780 0.249530
3.166667 5.214645 0.824639 0.086451 2.431495 0.472126 0.264717
3.200000 5.297521 0.840830 0.088239 2.436067 0.475501 0.269351
3.233333 5.379839 0.856920 0.103112 2.439440 0.478846 0.266779
3.266667 5.461564 0.872900 0.117968 2.441170 0.482153 0.257247
3.300000 5.544684 0.889246 0.128733 2.440851 0.485311 0.242132
3.333333 5.627139 0.905464 0.129658 2.437283 0.487892 0.224570
3.366667 5.709146 0.921697 0.136265 2.429876 0.489604 0.211484
3.400000 5.790216 0.937761 0.138985 2.418444 0.490246 0.200157
3.433333 5.869279 0.954039 0.142692 2.402868 0.489579 0.188770
3.466667 5.950798 0.971195 0.159101 2.382850 0.487276 0.176506
3.500000 6.031476 0.988176 0.143880 2.358187 0.482895 0.162657
3.533333 6.111276 1.004973 0.152759 2.329263 0.476189 0.145307
3.566667 6.190521 1.021700 0.169163 2.296245 0.466873 0.120492
3.600000 6.267940 1.038014 0.172594 2.258885 0.454497 0.086125
3.633333 6.344372 1.054117 0.192183 2.216488 0.438549 0.041490
3.666667 6.416759 1.068246 0.193366 2.168784 0.418747 -0.011331
3.700000 6.488091 1.082150 0.190606 2.115625 0.395235 -0.073978
3.733333 6.558338 1.095821 0.196497 2.056830 0.368414 -0.144797
3.766667 6.627471 1.109255 0.182391 1.992003 0.338811 -0.220208
3.800000 6.695459 1.122442 0.168450 1.920852 0.307403 -0.292671
3.833333 6.760560 1.132611 0.153594 1.843891 0.275639 -0.351269
3.866667 6.822126 1.140311 0.143726 1.761347 0.245124 -0.390078
3.900000 6.882463 1.147760 0.130840 1.672948 0.217411 -0.398366
3.933333 6.938331 1.153256 0.108463 1.578428 0.194099 -0.366531
3.966667 6.989628 1.156910 0.082322 1.478297 0.176687 -0.284251
4.000000 7.036018 1.159382 0.059213 1.373428 0.166259 -0.150455
4.033333 7.081110 1.161624 0.028659 1.263827 0.163339 0.031548
4.066667 7.122787 1.164020 0.016669 1.149875 0.167718 0.259316
4.100000 7.160014 1.167525 -0.003705 1.032738 0.178574 0.524474
4.133333 7.192242 1.173216 0.018051 0.913914 0.194067 0.812008
4.166667 7.223164 1.178703 0.060557 0.794087 0.212196 1.097376
4.200000 7.248979 1.186334 0.103533 0.674035 0.230310 1.363903
4.233333 7.269158 1.195892 0.163492 0.555669 0.245728 1.591360
4.266667 7.282926 1.207134 0.239321 0.441039 0.255489 1.761726
4.300000 7.295442 1.218182 0.353789 0.331715 0.257313 1.857024
4.333333 7.302341 1.229496 0.440735 0.229341 0.249527 1.869322
4.366667 7.304269 1.241107 0.530935 0.136138 0.230557 1.800556
4.400000 7.305026 1.252519 0.619610 0.053704 0.200174 1.652017
4.433333 7.302173 1.262041 0.672223 -0.017211 0.158696 1.436747
4.466667 7.296731 1.268421 0.728119 -0.076809 0.108115 1.164307
4.500000 7.290213 1.274598 0.763589 -0.124900 0.050058 0.857214
4.533333 7.282155 1.275608 0.790879 -0.162041 -0.012645 0.532815
4.566667 7.273091 1.276422 0.792247 -0.189147 -0.076964 0.209486
4.600000 7.265385 1.270222 0.800291 -0.207063 -0.139903 -0.098523
4.633333 7.256739 1.263843 0.772190 -0.216684 -0.198929 -0.384526
4.666667 7.250116 1.250705 0.734001 -0.218517 -0.251791 -0.636303
4.700000 7.242616 1.237417 0.692775 -0.213773 -0.296000 -0.851845
4.733333 7.234273 1.224001 0.655500 -0.203652 -0.330584 -1.029389
4.766667 7.225123 1.210476 0.626674 -0.189518 -0.354333 -1.172233
4.800000 7.215199 1.196865 0.561090 -0.172351 -0.367184 -1.273492
4.833333 7.208737 1.181693 0.508622 -0.153327 -0.368422 -1.328277
4.866667 7.204622 1.167056 0.459678 -0.133797 -0.358707 -1.334710
4.900000 7.203139 1.153765 0.425740 -0.115008 -0.338675 -1.292360
4.933333 7.201002 1.140458 0.368556 -0.097842 -0.308228 -1.199574
4.966667 7.198234 1.127154 0.316409 -0.082917 -0.267949 -1.057303
5.000000 7.198051 1.118459 0.249695 -0.071306 -0.218241 -0.878943
5.033333 7.197288 1.109796 0.199253 -0.063288 -0.160558 -0.680130
5.066667 7.195965 1.101181 0.155810 -0.058435 -0.095837 -0.475159
5.100000 7.195027 1.098875 0.148210 -0.055749 -0.025799 -0.279434
5.133333 7.193577 1.096636 0.160763 -0.054375 0.047270 -0.111832
5.166667 7.191061 1.099227 0.200285 -0.053613 0.120686 0.012951
5.200000 7.188105 1.105562 0.238330 -0.052237 0.192226 0.086715
5.233333 7.185053 1.115235 0.279057 -0.049380 0.259528 0.109505
5.266667 7.182447 1.128340 0.305598 -0.044802 0.319596 0.083073
5.300000 7.181114 1.144603 0.319816 -0.038800 0.370258 0.018760
5.333333 7.179405 1.160911 0.313846 -0.031511 0.409207 -0.066782
5.366667 7.177334 1.177251 0.283791 -0.023010 0.434895 -0.153214
5.400000 7.177014 1.194886 0.271320 -0.013808 0.445765 -0.224498
5.433333 7.178182 1.213247 0.237406 -0.004634 0.441450 -0.269668
5.466667 7.179030 1.231590 0.197077 0.003995 0.423081 -0.283756
5.500000 7.179569 1.249902 0.171714 0.011878 0.392093 -0.269084
5.533333 7.179809 1.268166 0.154754 0.018628 0.351005 -0.230111
5.566667 7.180584 1.281767 0.144763 0.023777 0.303225 -0.179364
5.600000 7.181727 1.290428 0.167320 0.027147 0.252776 -0.126605
5.633333 7.182589 1.299008 0.190306 0.028953 0.203477 -0.080211
5.666667 7.184317 1.302382 0.194681 0.029370 0.158996 -0.046425
5.700000 7.186006 1.302024 0.212580 0.028578 0.122569 -0.030558
5.733333 7.187483 1.299814 0.221771 0.026853 0.096709 -0.037428
5.766667 7.188867 1.296648 0.197665 0.024671 0.082356 -0.063592
5.800000 7.189992 1.293412 0.177994 0.022446 0.079371 -0.104029
5.833333 7.190417 1.292911 0.168608 0.020354 0.086876 -0.154291
