t x y theta dxdt dydt dthetadt
0.000000 0.000000 0.000000 -0.000789 0.012452 0.002114 0.018410
0.033333 0.000535 0.000071 0.014648 0.017026 0.002935 0.014664
0.066667 0.001018 0.000083 0.012422 0.023161 0.003895 0.007421
0.100000 0.001284 0.000142 0.004893 0.031098 0.004943 0.000718
0.133333 0.001803 0.000262 0.005926 0.041369 0.005974 -0.008320
0.166667 0.002580 0.000446 0.014980 0.054311 0.006880 -0.022767
0.200000 0.003981 0.000599 0.006922 0.070226 0.007544 -0.039285
0.233333 0.005955 0.000963 0.005636 0.089744 0.007791 -0.055816
0.266667 0.008201 0.001398 0.011045 0.113275 0.007529 -0.073973
0.300000 0.011661 0.001912 0.002053 0.141310 0.006724 -0.094582
0.333333 0.015401 0.002501 0.002590 0.173813 0.005559 -0.116304
0.366667 0.019422 0.003169 -0.005799 0.211036 0.004314 -0.134392
0.400000 0.026526 0.003300 -0.005880 0.253059 0.003316 -0.153573
0.433333 0.033913 0.003512 -0.022017 0.299443 0.003001 -0.170369
0.466667 0.045290 0.003038 -0.017490 0.349173 0.003836 -0.181992
0.500000 0.056941 0.002649 -0.037076 0.401301 0.006253 -0.185483
0.533333 0.068862 0.002348 -0.022724 0.454998 0.010438 -0.182913
0.566667 0.084443 0.001615 -0.045793 0.508971 0.016468 -0.175178
0.600000 0.103391 0.000924 -0.053840 0.562206 0.024389 -0.157698
0.633333 0.124690 0.000984 -0.072395 0.613777 0.034134 -0.133872
0.666667 0.147352 0.002211 -0.066093 0.663651 0.045433 -0.105981
0.700000 0.172830 0.004686 -0.071512 0.711221 0.057828 -0.080206
0.733333 0.198495 0.007254 -0.081669 0.755974 0.070950 -0.053292
0.766667 0.224327 0.009918 -0.075816 0.797782 0.084320 -0.030730
0.800000 0.250306 0.012679 -0.066875 0.836630 0.097338 -0.016790
0.833333 0.279158 0.016400 -0.061471 0.872632 0.109442 -0.014760
0.866667 0.308111 0.020217 -0.063952 0.905881 0.120178 -0.023059
0.900000 0.340193 0.024584 -0.063180 0.936881 0.129318 -0.037226
0.933333 0.373611 0.029767 -0.058835 0.966230 0.136425 -0.058952
0.966667 0.407049 0.035038 -0.052406 0.994289 0.141231 -0.083475
1.000000 0.441834 0.040612 -0.051199 1.021106 0.143446 -0.108379
1.033333 0.476579 0.046269 -0.071251 1.047008 0.142870 -0.127295
1.066667 0.511254 0.052008 -0.081768 1.071697 0.139435 -0.141447
1.100000 0.547064 0.057311 -0.097095 1.095064 0.132995 -0.150847
1.133333 0.583268 0.062186 -0.104557 1.116776 0.123866 -0.154369
1.166667 0.619304 0.067139 -0.110611 1.136525 0.112320 -0.151747
1.200000 0.659018 0.070956 -0.108723 1.153630 0.099073 -0.140565
1.233333 0.698492 0.074845 -0.108680 1.167189 0.084773 -0.124834
1.266667 0.740059 0.077013 -0.108508 1.176425 0.070119 -0.103415
1.300000 0.781307 0.079255 -0.111156 1.179902 0.055951 -0.075225
1.333333 0.822625 0.079683 -0.126122 1.175491 0.043029 -0.038139
1.366667 0.863542 0.080193 -0.117675 1.161237 0.032132 0.008356
1.400000 0.904018 0.080787 -0.129038 1.136257 0.023591 0.062940
1.433333 0.944048 0.080181 -0.131325 1.099680 0.017846 0.125297
1.466667 0.983557 0.079671 -0.133273 1.051039 0.015034 0.194174
1.500000 1.021516 0.079165 -0.133097 0.991094 0.015135 0.263452
1.533333 1.055924 0.079183 -0.118173 0.921637 0.017689 0.324004
1.566667 1.089701 0.079319 -0.097801 0.844392 0.022225 0.369913
1.600000 1.122816 0.079581 -0.090010 0.760515 0.028399 0.396815
1.633333 1.147869 0.080562 -0.052869 0.671419 0.035620 0.402109
1.666667 1.162094 0.082363 -0.027131 0.578807 0.043434 0.383765
1.700000 1.175587 0.084325 0.009006 0.483607 0.051420 0.343494
1.733333 1.188336 0.086452 0.024063 0.386989 0.059536 0.287724
1.766667 1.200328 0.088750 0.030128 0.290121 0.067743 0.222201
1.800000 1.211552 0.091221 0.029229 0.193956 0.076069 0.149944
1.833333 1.221997 0.093870 0.022520 0.098964 0.084716 0.078388
1.866667 1.220446 0.096498 0.003824 0.005383 0.093986 0.012645
1.900000 1.218107 0.099325 0.002320 -0.086467 0.104186 -0.040922
1.933333 1.214983 0.102356 -0.002431 -0.176437 0.115439 -0.080431
1.966667 1.206574 0.105778 -0.000144 -0.264004 0.127850 -0.107266
2.000000 1.193137 0.110018 -0.004282 -0.348092 0.141411 -0.119355
2.033333 1.178942 0.114482 -0.001175 -0.427446 0.156102 -0.121309
2.066667 1.160884 0.119980 -0.016913 -0.501600 0.171635 -0.114714
2.100000 1.142100 0.125712 -0.013359 -0.570096 0.187721 -0.105630
2.133333 1.119996 0.132532 -0.029516 -0.632696 0.204119 -0.094846
2.166667 1.097209 0.139591 -0.025069 -0.689845 0.220583 -0.084085
2.200000 1.071471 0.147729 -0.043222 -0.742123 0.236764 -0.072941
2.233333 1.045099 0.156107 -0.027553 -0.790006 0.252278 -0.064293
2.266667 1.018117 0.164725 -0.037683 -0.833550 0.266990 -0.060333
2.300000 0.990551 0.173582 -0.035147 -0.872829 0.280819 -0.057814
2.333333 0.959609 0.183683 -0.032404 -0.907770 0.293637 -0.059773
2.366667 0.927470 0.194255 -0.027464 -0.938068 0.305485 -0.061858
2.400000 0.894285 0.204888 -0.031259 -0.963743 0.316761 -0.068859
2.433333 0.860636 0.215756 -0.033053 -0.984864 0.328042 -0.071620
2.466667 0.824453 0.227496 -0.038641 -1.001170 0.339871 -0.067768
2.500000 0.788814 0.239017 -0.051869 -1.012461 0.352729 -0.058681
2.533333 0.754419 0.250358 -0.036134 -1.019122 0.367442 -0.043408
2.566667 0.719691 0.261920 -0.062485 -1.021446 0.384744 -0.022133
2.600000 0.685952 0.273692 -0.075584 -1.019822 0.405195 0.009295
2.633333 0.651813 0.286294 -0.061952 -1.014527 0.429140 0.040166
2.666667 0.617438 0.299106 -0.069143 -1.006404 0.456815 0.068895
2.700000 0.582432 0.313668 -0.047576 -0.996116 0.488301 0.090746
2.733333 0.549178 0.329625 -0.047938 -0.983615 0.523107 0.104911
2.766667 0.515935 0.347652 -0.025765 -0.968751 0.560454 0.096784
2.800000 0.484505 0.367114 -0.020736 -0.951314 0.599247 0.059900
2.833333 0.452996 0.386742 -0.022958 -0.931369 0.638347 0.002513
2.866667 0.421165 0.408497 -0.026264 -0.908526 0.676635 -0.077440
2.900000 0.390065 0.432385 -0.003877 -0.882610 0.713122 -0.173270
2.933333 0.360161 0.458333 0.005801 -0.854039 0.747034 -0.279503
2.966667 0.331872 0.486193 -0.019119 -0.823721 0.777734 -0.372338
3.000000 0.303645 0.514135 -0.021143 -0.792257 0.805051 -0.441067
3.033333 0.275506 0.542137 -0.045484 -0.760105 0.828914 -0.481791
3.066667 0.251397 0.570312 -0.083690 -0.728301 0.849308 -0.485828
3.100000 0.230080 0.599668 -0.155945 -0.697942 0.866328 -0.444581
3.133333 0.208911 0.629014 -0.186377 -0.669681 0.880158 -0.360511
3.166667 0.187905 0.658327 -0.190618 -0.643696 0.891228 -0.249339
3.200000 0.168308 0.689195 -0.218945 -0.620171 0.899186 -0.118762
3.233333 0.148906 0.719984 -0.219145 -0.599095 0.903369 0.013642
3.266667 0.129714 0.750668 -0.200399 -0.579429 0.902720 0.134310
3.300000 0.110745 0.781226 -0.177305 -0.559472 0.895835 0.221173
3.333333 0.092006 0.812685 -0.144545 -0.537518 0.880960 0.268440
3.366667 0.073519 0.843968 -0.087579 -0.511994 0.856197 0.275806
3.400000 0.055296 0.875051 -0.076800 -0.481635 0.820758 0.246120
3.433333 0.037351 0.905909 -0.045159 -0.445396 0.774255 0.193563
3.466667 0.020622 0.934718 -0.049169 -0.403132 0.717232 0.130936
3.500000 0.004193 0.963256 -0.051567 -0.355434 0.650827 0.072857
3.533333 -0.008896 0.987041 -0.067264 -0.303683 0.577416 0.027914
3.566667 -0.019358 1.006764 -0.113748 -0.249456 0.499696 0.005936
3.600000 -0.026556 1.021470 -0.134770 -0.194425 0.420257 0.006168
3.633333 -0.030069 1.031267 -0.146123 -0.140694 0.342223 0.026992
3.666667 -0.030150 1.035880 -0.139083 -0.090433 0.268555 0.059943
3.700000 -0.029943 1.040147 -0.130101 -0.045640 0.201994 0.101865
3.733333 -0.029456 1.044072 -0.094660 -0.007453 0.144065 0.144044
3.766667 -0.026621 1.044873 -0.066722 0.023158 0.095926 0.177141
3.800000 -0.023525 1.045342 -0.045641 0.045722 0.057943 0.198003
3.833333 -0.019487 1.044511 -0.045411 0.060431 0.029594 0.203340
3.866667 -0.016291 1.043655 -0.035908 0.068403 0.009465 0.196494
3.900000 -0.012861 1.042491 -0.062280 0.070822 -0.003950 0.180085
3.933333 -0.009207 1.041030 -0.055632 0.068692 -0.011887 0.159942
3.966667 -0.005338 1.039280 -0.047549 0.063266 -0.015768 0.141392
4.000000 -0.003823 1.038723 -0.052134 0.055766 -0.016749 0.127848
4.033333 -0.002107 1.037899 -0.041320 0.047302 -0.015843 0.120008
4.066667 -0.001361 1.037693 -0.034329 0.038468 -0.013626 0.118403
