t x y theta dxdt dydt dthetadt
0.000000 0.000000 0.000000 -0.418422 0.003935 0.004355 -0.006792
0.033333 -0.000065 -0.000070 -0.424383 0.006775 0.005984 -0.012246
0.066667 -0.000354 -0.000374 -0.421481 0.010723 0.008173 -0.023002
0.100000 -0.000218 -0.000297 -0.428159 0.016070 0.011235 -0.041274
0.133333 -0.000272 -0.000257 -0.412915 0.023136 0.015684 -0.068492
0.166667 0.000125 0.000188 -0.418572 0.032240 0.022034 -0.102323
0.200000 0.000742 0.000539 -0.430654 0.043721 0.030892 -0.137731
0.233333 0.001838 0.001319 -0.416713 0.057819 0.042764 -0.174738
0.266667 0.003430 0.002132 -0.421759 0.074838 0.058139 -0.208873
0.300000 0.005527 0.003398 -0.423517 0.094999 0.077264 -0.240828
0.333333 0.008476 0.005037 -0.437274 0.118453 0.100033 -0.270411
0.366667 0.011956 0.007153 -0.459779 0.145346 0.126337 -0.300335
0.400000 0.015978 0.009760 -0.505396 0.175790 0.155807 -0.334770
0.433333 0.021308 0.014488 -0.512524 0.210111 0.188077 -0.371976
0.466667 0.028373 0.021763 -0.516324 0.248200 0.222400 -0.415645
0.500000 0.036012 0.029557 -0.507404 0.290008 0.258165 -0.467910
0.533333 0.045997 0.039760 -0.492872 0.335103 0.294676 -0.531340
0.566667 0.056571 0.050495 -0.515299 0.383046 0.331237 -0.608274
0.600000 0.070051 0.062908 -0.540407 0.432921 0.367065 -0.701876
0.633333 0.084132 0.075860 -0.562292 0.483464 0.401464 -0.810936
0.666667 0.101451 0.090032 -0.614390 0.533582 0.434146 -0.929031
0.700000 0.119374 0.104748 -0.638301 0.582258 0.465083 -1.047613
0.733333 0.140624 0.121146 -0.665100 0.628734 0.494533 -1.154600
0.766667 0.165268 0.139216 -0.707547 0.672021 0.522659 -1.239659
0.800000 0.190506 0.157831 -0.747276 0.711736 0.550109 -1.293812
0.833333 0.216331 0.176986 -0.803732 0.747649 0.577660 -1.312017
0.866667 0.242735 0.196681 -0.877686 0.779854 0.606158 -1.295119
0.900000 0.269711 0.216913 -0.945552 0.808315 0.636013 -1.241788
0.933333 0.297252 0.237678 -0.997612 0.833310 0.667668 -1.155326
0.966667 0.325349 0.258973 -1.039244 0.855584 0.701751 -1.042260
1.000000 0.353993 0.280795 -1.066067 0.875815 0.738454 -0.908940
1.033333 0.384094 0.306211 -1.098032 0.894643 0.777368 -0.765432
1.066667 0.414723 0.332142 -1.118467 0.912597 0.817796 -0.619555
1.100000 0.445871 0.358580 -1.126398 0.930241 0.859139 -0.483236
1.133333 0.477394 0.387869 -1.131116 0.947922 0.900506 -0.365443
1.166667 0.509181 0.419694 -1.131228 0.965775 0.940741 -0.270401
1.200000 0.541182 0.453499 -1.128856 0.983803 0.978607 -0.200074
1.233333 0.573918 0.488701 -1.131482 1.002122 1.013475 -0.152510
1.266667 0.607117 0.524346 -1.121967 1.020708 1.044747 -0.129962
1.300000 0.640768 0.560417 -1.127446 1.039634 1.071933 -0.126477
1.333333 0.676043 0.597538 -1.133487 1.058935 1.094923 -0.139412
1.366667 0.711745 0.635049 -1.153824 1.078608 1.113952 -0.163198
1.400000 0.748593 0.673185 -1.140689 1.098563 1.129662 -0.195381
1.433333 0.785840 0.711673 -1.153230 1.118680 1.142600 -0.232666
1.466667 0.823471 0.750495 -1.148782 1.138885 1.153455 -0.268310
1.500000 0.861472 0.789630 -1.161783 1.158943 1.162890 -0.301269
1.533333 0.900498 0.828523 -1.176433 1.178556 1.171470 -0.326964
1.566667 0.939863 0.867691 -1.188737 1.197444 1.179587 -0.346447
1.600000 0.979606 0.906466 -1.215430 1.215501 1.187605 -0.353275
1.633333 1.020581 0.945790 -1.223928 1.232550 1.195875 -0.347991
1.666667 1.062838 0.985766 -1.241512 1.248397 1.204700 -0.327936
1.700000 1.105363 1.025939 -1.256945 1.262999 1.214378 -0.293671
1.733333 1.148573 1.066665 -1.269184 1.276555 1.225021 -0.249888
1.766667 1.192013 1.107548 -1.273172 1.289328 1.236695 -0.198317
1.800000 1.235636 1.148699 -1.293793 1.301474 1.249149 -0.147666
1.833333 1.279369 1.190247 -1.295692 1.313337 1.261871 -0.102357
1.866667 1.322667 1.232081 -1.287651 1.325417 1.274216 -0.069031
1.900000 1.366115 1.273986 -1.289889 1.338083 1.285521 -0.050758
1.933333 1.410273 1.317209 -1.272974 1.351462 1.295180 -0.048535
1.966667 1.454893 1.361581 -1.261214 1.365523 1.302572 -0.061540
2.000000 1.500256 1.406706 -1.260817 1.380217 1.307200 -0.087242
2.033333 1.546399 1.452050 -1.257763 1.395305 1.308894 -0.122072
2.066667 1.593561 1.497114 -1.269369 1.410242 1.307719 -0.161217
2.100000 1.641509 1.541636 -1.278911 1.424479 1.303803 -0.200863
2.133333 1.689455 1.586058 -1.291420 1.437635 1.297463 -0.235192
2.166667 1.738437 1.629177 -1.314434 1.449365 1.289263 -0.261276
2.200000 1.787925 1.671229 -1.325044 1.459467 1.280100 -0.279368
2.233333 1.837334 1.713111 -1.338241 1.467746 1.270716 -0.287335
2.266667 1.886638 1.754797 -1.354743 1.474297 1.261835 -0.287719
2.300000 1.935811 1.796267 -1.354265 1.479488 1.254320 -0.282723
2.333333 1.984828 1.837497 -1.350892 1.483585 1.248870 -0.275939
2.366667 2.034943 1.878916 -1.367506 1.486852 1.245875 -0.270638
2.400000 2.084848 1.920049 -1.376628 1.489376 1.245206 -0.264359
2.433333 2.134515 1.960875 -1.380798 1.491292 1.246748 -0.259093
2.466667 2.184230 2.001689 -1.390978 1.492438 1.250031 -0.253366
2.500000 2.233652 2.042149 -1.395855 1.492303 1.254178 -0.244392
2.533333 2.283731 2.083902 -1.411658 1.490292 1.258142 -0.229809
2.566667 2.333462 2.125256 -1.417485 1.485979 1.260900 -0.207639
2.600000 2.383229 2.167559 -1.440876 1.478989 1.261404 -0.180020
2.633333 2.434277 2.212000 -1.445136 1.468726 1.258203 -0.148577
2.666667 2.484893 2.255965 -1.446769 1.454792 1.250012 -0.114704
2.700000 2.534489 2.299632 -1.455097 1.436842 1.235489 -0.081203
2.733333 2.582971 2.342512 -1.448055 1.414800 1.213711 -0.053902
2.766667 2.630934 2.384833 -1.441688 1.388317 1.183648 -0.037589
2.800000 2.676887 2.425166 -1.450456 1.357297 1.144941 -0.034915
2.833333 2.722194 2.464748 -1.436748 1.321828 1.097793 -0.047009
2.866667 2.766584 2.503012 -1.436537 1.281814 1.042529 -0.072532
2.900000 2.809720 2.539244 -1.420209 1.237014 0.979883 -0.112914
2.933333 2.851534 2.572765 -1.431735 1.187037 0.910524 -0.159824
2.966667 2.891714 2.603304 -1.441771 1.131990 0.835851 -0.206428
3.000000 2.929576 2.630284 -1.450437 1.071383 0.756721 -0.245274
3.033333 2.964904 2.653111 -1.450477 1.005192 0.674399 -0.270569
3.066667 2.999514 2.675197 -1.476335 0.933612 0.590139 -0.282072
3.100000 3.030598 2.692674 -1.491399 0.857419 0.505440 -0.277136
3.133333 3.060937 2.709398 -1.524413 0.777097 0.421358 -0.259748
3.166667 3.087264 2.722092 -1.546350 0.693017 0.338524 -0.232169
3.200000 3.108756 2.730793 -1.545539 0.606389 0.257939 -0.201446
3.233333 3.124577 2.735010 -1.548384 0.518189 0.180131 -0.169512
3.266667 3.139637 2.738482 -1.541755 0.429599 0.105881 -0.137338
3.300000 3.153940 2.741217 -1.534794 0.341506 0.035467 -0.104174
3.333333 3.162648 2.740063 -1.514400 0.255718 -0.030157 -0.069633
3.366667 3.170613 2.738194 -1.510427 0.173579 -0.090398 -0.034705
3.400000 3.174506 2.733186 -1.525172 0.096353 -0.144464 0.007248
3.433333 3.174526 2.725452 -1.555109 0.025383 -0.191269 0.059210
3.466667 3.171072 2.715565 -1.566741 -0.037964 -0.229942 0.124027
3.500000 3.166940 2.705033 -1.560395 -0.092360 -0.259469 0.201762
3.533333 3.160282 2.693117 -1.561772 -0.137369 -0.279432 0.289211
3.566667 3.152059 2.681154 -1.544157 -0.172216 -0.289199 0.380874
3.600000 3.142771 2.669376 -1.527540 -0.196708 -0.288388 0.464913
3.633333 3.132901 2.657037 -1.522167 -0.211518 -0.277730 0.527516
3.666667 3.122476 2.644159 -1.472507 -0.217832 -0.258155 0.556091
3.700000 3.111522 2.630762 -1.440857 -0.216845 -0.230597 0.545236
3.733333 3.103441 2.622152 -1.409367 -0.209915 -0.195774 0.496475
3.766667 3.098862 2.619787 -1.366599 -0.198897 -0.154879 0.416577
3.800000 3.093822 2.616950 -1.335216 -0.185834 -0.109911 0.315785
3.833333 3.088343 2.613652 -1.316418 -0.172179 -0.062143 0.208289
3.866667 3.082445 2.609901 -1.319089 -0.159165 -0.012697 0.111857
3.900000 3.076146 2.605707 -1.340402 -0.148015 0.037255 0.038755
3.933333 3.073387 2.611927 -1.371184 -0.139591 0.085469 -0.003860
3.966667 3.070264 2.617711 -1.406616 -0.134010 0.130773 -0.009432
4.000000 3.066791 2.623057 -1.431993 -0.130850 0.172261 0.025166
4.033333 3.062986 2.627963 -1.438701 -0.129473 0.208877 0.094118
4.066667 3.059243 2.638805 -1.420757 -0.129250 0.238977 0.185898
4.100000 3.055199 2.649195 -1.402316 -0.129313 0.260932 0.282381
4.133333 3.050652 2.661964 -1.389023 -0.128240 0.274917 0.370356
4.166667 3.045837 2.674261 -1.354281 -0.124811 0.280655 0.433997
4.200000 3.040636 2.686442 -1.336812 -0.118000 0.278406 0.463133
4.233333 3.035299 2.697574 -1.300119 -0.107165 0.268914 0.456025
4.266667 3.030118 2.707577 -1.270789 -0.091644 0.254081 0.416546
4.300000 3.024734 2.717063 -1.237289 -0.071324 0.236037 0.358088
4.333333 3.020792 2.724745 -1.213936 -0.046949 0.216489 0.289038
4.366667 3.019205 2.730040 -1.217720 -0.019879 0.197064 0.220763
4.400000 3.017458 2.734793 -1.222790 0.008469 0.179128 0.160799
4.433333 3.018610 2.737995 -1.267465 0.036543 0.163633 0.118263
4.466667 3.021942 2.740972 -1.278933 0.062512 0.150469 0.097658
4.500000 3.026721 2.744593 -1.271935 0.084656 0.138617 0.099045
4.533333 3.032381 2.748949 -1.260934 0.101661 0.126523 0.119064
4.566667 3.038544 2.754217 -1.255229 0.112922 0.111842 0.151140
4.600000 3.044581 2.758905 -1.245577 0.117938 0.092305 0.187121
4.633333 3.049999 2.764280 -1.235615 0.116785 0.065064 0.215714
4.666667 3.055296 2.769056 -1.221264 0.110138 0.028188 0.225780
4.700000 3.058845 2.772827 -1.213053 0.099224 -0.019285 0.210631
4.733333 3.062279 2.775981 -1.189364 0.085313 -0.078338 0.172069
4.766667 3.065602 2.778510 -1.189524 0.069617 -0.148855 0.112036
4.800000 3.067384 2.775606 -1.163300 0.053467 -0.230307 0.035368
4.833333 3.067947 2.765959 -1.139538 0.038005 -0.320386 -0.055511
4.866667 3.068418 2.755679 -1.162100 0.024056 -0.417200 -0.150217
4.900000 3.068021 2.738398 -1.183559 0.012012 -0.518201 -0.241742
4.933333 3.067547 2.720502 -1.207746 0.002262 -0.620471 -0.324561
4.966667 3.066697 2.696228 -1.213269 -0.004914 -0.720774 -0.394240
5.000000 3.065785 2.671370 -1.237536 -0.009477 -0.816678 -0.444505
5.033333 3.064834 2.641184 -1.252515 -0.011476 -0.907015 -0.466629
5.066667 3.063891 2.606166 -1.265313 -0.010880 -0.990260 -0.463154
5.100000 3.063488 2.566518 -1.308519 -0.007701 -1.065975 -0.435337
5.133333 3.063053 2.526393 -1.320673 -0.002046 -1.133579 -0.388181
5.166667 3.062594 2.485824 -1.343331 0.005911 -1.193260 -0.322012
5.200000 3.062118 2.444846 -1.356188 0.016113 -1.244814 -0.241911
5.233333 3.061631 2.403494 -1.356716 0.028417 -1.288221 -0.153745
5.266667 3.062269 2.358922 -1.354004 0.042420 -1.323964 -0.057367
5.300000 3.063885 2.311664 -1.365251 0.057798 -1.352491 0.043589
5.333333 3.065505 2.264145 -1.357139 0.074131 -1.374552 0.148832
5.366667 3.068196 2.215755 -1.344763 0.090820 -1.390868 0.254661
5.400000 3.071946 2.167303 -1.330032 0.107190 -1.401664 0.359160
5.433333 3.075708 2.118715 -1.323259 0.122656 -1.406832 0.464428
5.466667 3.080608 2.070373 -1.305169 0.136801 -1.405892 0.569093
5.500000 3.086706 2.023762 -1.300144 0.149228 -1.398575 0.677173
5.533333 3.092817 1.977135 -1.270844 0.159634 -1.384588 0.788523
5.566667 3.098939 1.930534 -1.240629 0.168006 -1.363181 0.905529
5.600000 3.105070 1.883996 -1.190821 0.174474 -1.334217 1.028144
5.633333 3.111210 1.837560 -1.166632 0.179194 -1.297212 1.150451
5.666667 3.117355 1.791264 -1.128431 0.182472 -1.252088 1.266366
5.700000 3.123505 1.745148 -1.099378 0.184730 -1.198277 1.366152
5.733333 3.129803 1.705333 -1.055707 0.186381 -1.135729 1.445942
5.766667 3.136102 1.665767 -0.989599 0.187804 -1.064890 1.500038
5.800000 3.142311 1.632676 -0.921313 0.189441 -0.986765 1.524167
5.833333 3.148516 1.599888 -0.847196 0.191798 -0.902900 1.513870
5.866667 3.154712 1.567427 -0.789692 0.195196 -0.815037 1.471150
5.900000 3.161036 1.540435 -0.725172 0.199848 -0.725493 1.395807
5.933333 3.167243 1.518438 -0.660208 0.205891 -0.635939 1.288348
5.966667 3.173711 1.501117 -0.619092 0.213124 -0.548589 1.149813
6.000000 3.180650 1.488235 -0.600617 0.221055 -0.465057 0.988384
6.033333 3.187566 1.475742 -0.585634 0.228719 -0.387041 0.820856
6.066667 3.194456 1.463639 -0.562071 0.235192 -0.315899 0.656759
6.100000 3.202250 1.455665 -0.512401 0.239346 -0.252500 0.509103
6.133333 3.211366 1.450966 -0.494005 0.240020 -0.197773 0.387749
6.166667 3.221758 1.448824 -0.498898 0.236417 -0.151803 0.303107
6.200000 3.232102 1.447056 -0.506985 0.227913 -0.114306 0.255524
6.233333 3.242392 1.445652 -0.542114 0.214524 -0.084670 0.236135
6.266667 3.251350 1.444888 -0.539480 0.196378 -0.062297 0.237814
6.300000 3.258189 1.444561 -0.553073 0.174193 -0.046301 0.257716
6.333333 3.264958 1.444567 -0.551333 0.148995 -0.035616 0.288480
6.366667 3.268348 1.443852 -0.509767 0.122105 -0.029119 0.317630
6.400000 3.271663 1.443449 -0.483299 0.094865 -0.025944 0.339274
6.433333 3.273054 1.442577 -0.462741 0.068594 -0.025190 0.350517
6.466667 3.273177 1.441508 -0.430555 0.044498 -0.025864 0.352116
6.500000 3.273232 1.440720 -0.403511 0.023334 -0.027272 0.338527
6.533333 3.272857 1.439758 -0.391025 0.005748 -0.028912 0.309831
6.566667 3.272099 1.438608 -0.400352 -0.008227 -0.030503 0.274180
6.600000 3.271284 1.437709 -0.411817 -0.018587 -0.031814 0.236427
6.633333 3.269964 1.436654 -0.418137 -0.025736 -0.032742 0.201625
6.666667 3.268329 1.435470 -0.414814 -0.030150 -0.033259 0.172651
6.700000 3.266513 1.433950 -0.404387 -0.032265 -0.033310 0.153592
