t x y theta dxdt dydt dthetadt
0.000000 0.000000 0.000000 2.449941 -0.105008 -0.111541 0.086938
0.033333 -0.003538 -0.003754 2.452020 -0.107412 -0.113771 0.087593
0.066667 -0.007151 -0.007580 2.453475 -0.109852 -0.116025 0.086743
0.100000 -0.010849 -0.011482 2.453399 -0.112325 -0.118299 0.083004
0.133333 -0.014626 -0.015459 2.461896 -0.114830 -0.120593 0.078554
0.166667 -0.018489 -0.019513 2.464042 -0.117365 -0.122905 0.074329
0.200000 -0.022438 -0.023645 2.464464 -0.119929 -0.125234 0.070288
0.233333 -0.026470 -0.027855 2.477943 -0.122523 -0.127582 0.064530
0.266667 -0.030591 -0.032143 2.468717 -0.125148 -0.129949 0.057794
0.300000 -0.034799 -0.036509 2.471187 -0.127806 -0.132338 0.052624
0.333333 -0.039096 -0.040954 2.473743 -0.130498 -0.134751 0.049469
0.366667 -0.043482 -0.045477 2.483165 -0.133224 -0.137188 0.045425
0.400000 -0.047961 -0.050085 2.483376 -0.135986 -0.139650 0.040684
0.433333 -0.052533 -0.054778 2.468168 -0.138782 -0.142135 0.039305
0.466667 -0.057196 -0.059550 2.468215 -0.141611 -0.144641 0.040403
0.500000 -0.061956 -0.064409 2.485022 -0.144469 -0.147165 0.040746
0.533333 -0.066808 -0.069347 2.483590 -0.147355 -0.149704 0.039531
0.566667 -0.071761 -0.074375 2.482370 -0.150268 -0.152255 0.039719
0.600000 -0.076816 -0.079495 2.483669 -0.153203 -0.154814 0.041397
0.633333 -0.081975 -0.084707 2.483511 -0.156160 -0.157379 0.041270
0.666667 -0.087228 -0.089998 2.492183 -0.159140 -0.159951 0.037876
0.700000 -0.092575 -0.095368 2.492280 -0.162142 -0.162529 0.036265
0.733333 -0.098030 -0.100834 2.489463 -0.165165 -0.165113 0.036130
0.766667 -0.103581 -0.106378 2.486234 -0.168214 -0.167708 0.036105
0.800000 -0.109226 -0.112001 2.497930 -0.171292 -0.170316 0.036105
0.833333 -0.114985 -0.117723 2.485840 -0.174396 -0.172938 0.038084
0.866667 -0.120839 -0.123524 2.495453 -0.177527 -0.175570 0.042931
0.900000 -0.126789 -0.129402 2.496469 -0.180686 -0.178218 0.048639
0.933333 -0.132858 -0.135383 2.494594 -0.183872 -0.180878 0.054740
0.966667 -0.139048 -0.141468 2.493554 -0.187074 -0.183541 0.060927
1.000000 -0.145333 -0.147630 2.497454 -0.190286 -0.186198 0.067767
1.033333 -0.151714 -0.153868 2.502985 -0.193501 -0.188843 0.072905
1.066667 -0.158221 -0.160213 2.512468 -0.196713 -0.191471 0.077487
1.100000 -0.164854 -0.166668 2.506635 -0.199907 -0.194063 0.079281
1.133333 -0.171584 -0.173196 2.513988 -0.203076 -0.196614 0.077311
1.166667 -0.178408 -0.179799 2.511606 -0.206221 -0.199125 0.073847
1.200000 -0.185328 -0.186474 2.510694 -0.209341 -0.201595 0.067493
1.233333 -0.192381 -0.193263 2.527406 -0.212433 -0.204020 0.059735
1.266667 -0.199529 -0.200123 2.533455 -0.215502 -0.206407 0.049238
1.300000 -0.206771 -0.207054 2.521277 -0.218567 -0.208775 0.039212
1.333333 -0.214108 -0.214055 2.526486 -0.221636 -0.211134 0.030624
1.366667 -0.221537 -0.221126 2.524055 -0.224717 -0.213489 0.022393
1.400000 -0.229060 -0.228265 2.531002 -0.227814 -0.215849 0.014457
1.433333 -0.236676 -0.235471 2.524359 -0.230943 -0.218225 0.008700
1.466667 -0.244436 -0.242798 2.523523 -0.234097 -0.220615 0.007101
1.500000 -0.252287 -0.250190 2.528729 -0.237267 -0.223008 0.006378
1.533333 -0.260229 -0.257647 2.518028 -0.240447 -0.225396 0.008935
1.566667 -0.268262 -0.265167 2.526915 -0.243629 -0.227775 0.011552
1.600000 -0.276444 -0.272810 2.522421 -0.246810 -0.230138 0.018094
1.633333 -0.284776 -0.280576 2.531447 -0.249976 -0.232472 0.025240
1.666667 -0.293196 -0.288403 2.523938 -0.253127 -0.234779 0.031757
1.700000 -0.301704 -0.296288 2.534871 -0.256266 -0.237058 0.038027
1.733333 -0.310298 -0.304230 2.520175 -0.259398 -0.239318 0.042385
1.766667 -0.318977 -0.312229 2.528456 -0.262532 -0.241566 0.049593
1.800000 -0.327741 -0.320282 2.532827 -0.265679 -0.243815 0.056225
1.833333 -0.336662 -0.328463 2.541849 -0.268854 -0.246080 0.065378
1.866667 -0.345666 -0.336695 2.542756 -0.272077 -0.248382 0.079083
1.900000 -0.354751 -0.344977 2.532143 -0.275362 -0.250741 0.101387
1.933333 -0.363997 -0.353388 2.540536 -0.278714 -0.253162 0.132894
1.966667 -0.373321 -0.361845 2.547379 -0.282139 -0.255660 0.172677
2.000000 -0.382722 -0.370348 2.546025 -0.285635 -0.258235 0.223668
2.033333 -0.392286 -0.378981 2.547984 -0.289196 -0.260888 0.285331
2.066667 -0.402012 -0.387743 2.549233 -0.292797 -0.263596 0.354572
2.100000 -0.411810 -0.396546 2.562301 -0.296409 -0.266334 0.427735
2.133333 -0.421767 -0.405478 2.572974 -0.300006 -0.269076 0.503819
2.166667 -0.431793 -0.414445 2.599857 -0.303550 -0.271785 0.580760
2.200000 -0.441973 -0.423541 2.632264 -0.307008 -0.274426 0.653530
2.233333 -0.452302 -0.432765 2.648421 -0.310348 -0.276972 0.721153
2.266667 -0.462775 -0.442116 2.684371 -0.313559 -0.279419 0.781062
2.300000 -0.473389 -0.451593 2.709150 -0.316624 -0.281754 0.833860
2.333333 -0.484061 -0.461092 2.742697 -0.319543 -0.283990 0.878551
2.366667 -0.494789 -0.470610 2.776130 -0.322316 -0.286138 0.915433
2.400000 -0.505570 -0.480145 2.797098 -0.324959 -0.288237 0.949773
2.433333 -0.516471 -0.489798 2.828819 -0.327487 -0.290307 0.980613
2.466667 -0.527420 -0.499461 2.866628 -0.329919 -0.292368 1.015043
2.500000 -0.538476 -0.509236 2.899844 -0.332282 -0.294439 1.054153
2.533333 -0.549575 -0.519015 2.935398 -0.334590 -0.296518 1.098260
2.566667 -0.560766 -0.528899 2.984957 -0.336852 -0.298583 1.150860
2.600000 -0.572045 -0.538884 2.998010 -0.339061 -0.300580 1.210480
2.633333 -0.583404 -0.548966 3.040587 -0.341203 -0.302460 1.282809
2.666667 -0.594835 -0.559140 3.088880 -0.343253 -0.304158 1.368512
2.700000 -0.606331 -0.569400 3.120634 -0.345179 -0.305615 1.471889
2.733333 -0.617884 -0.579741 -3.107004 -0.346953 -0.306770 1.600605
2.766667 -0.629521 -0.590103 -3.051440 -0.348556 -0.307589 1.761816
2.800000 -0.641236 -0.600478 -2.994061 -0.349973 -0.308056 1.959507
2.833333 -0.653019 -0.610860 -2.930834 -0.351195 -0.308167 2.190055
2.866667 -0.664815 -0.621210 -2.889105 -0.352217 -0.307935 2.456881
2.900000 -0.676620 -0.631524 -2.807289 -0.353043 -0.307381 2.758049
2.933333 -0.688430 -0.641798 -2.745899 -0.353677 -0.306542 3.092029
2.966667 -0.700243 -0.652028 -2.620777 -0.354125 -0.305451 3.444242
3.000000 -0.712084 -0.662227 -2.502474 -0.354395 -0.304134 3.811391
3.033333 -0.723919 -0.672374 -2.376871 -0.354503 -0.302616 4.192370
3.066667 -0.735768 -0.682474 -2.231765 -0.354457 -0.300911 4.571878
3.100000 -0.747621 -0.692519 -2.024128 -0.354262 -0.299021 4.936207
3.133333 -0.759470 -0.702496 -1.856814 -0.353923 -0.296945 5.265475
3.166667 -0.771301 -0.712406 -1.695848 -0.353438 -0.294681 5.553343
3.200000 -0.783108 -0.722243 -1.492605 -0.352808 -0.292228 5.777180
3.233333 -0.794892 -0.731987 -1.276325 -0.352030 -0.289576 5.914794
3.266667 -0.806646 -0.741652 -1.060355 -0.351102 -0.286721 5.950255
3.300000 -0.818365 -0.751207 -0.838301 -0.350026 -0.283659 5.870263
3.333333 -0.830043 -0.760643 -0.588027 -0.348805 -0.280381 5.663938
3.366667 -0.841680 -0.769988 -0.362763 -0.347441 -0.276870 5.314999
3.400000 -0.853266 -0.779198 -0.148240 -0.345935 -0.273107 4.824412
3.433333 -0.864797 -0.788266 0.069966 -0.344288 -0.269086 4.196276
3.466667 -0.876277 -0.797232 0.218303 -0.342502 -0.264799 3.443263
3.500000 -0.887703 -0.806091 0.344998 -0.340579 -0.260243 2.580032
3.533333 -0.899060 -0.814783 0.430662 -0.338522 -0.255429 1.629866
3.566667 -0.910343 -0.823297 0.482232 -0.336335 -0.250379 0.620006
3.600000 -0.921548 -0.831624 0.484363 -0.334025 -0.245125 -0.429911
3.633333 -0.932670 -0.839753 0.433478 -0.331595 -0.239682 -1.500832
3.666667 -0.943705 -0.847674 0.360678 -0.329046 -0.234072 -2.582100
3.700000 -0.954647 -0.855373 0.225079 -0.326382 -0.228321 -3.660504
3.733333 -0.965493 -0.862841 0.084069 -0.323603 -0.222448 -4.199786
3.766667 -0.976258 -0.870178 -0.077611 -0.320710 -0.216467 -4.194395
3.800000 -0.986916 -0.877261 -0.274311 -0.317700 -0.210380 -3.632651
3.833333 -0.997486 -0.884209 -0.528149 -0.314569 -0.204200 -2.490239
3.866667 -1.007967 -0.891019 -0.790267 -0.311309 -0.197932 -0.736730
3.900000 -1.018320 -0.897542 -1.099263 -0.307906 -0.191567 1.665840
3.933333 -1.028578 -0.903923 -1.454974 -0.304343 -0.185083 3.700946
3.966667 -1.038693 -0.909997 -1.872275 -0.300606 -0.178486 4.897463
4.000000 -1.048660 -0.915756 -2.293427 -0.296684 -0.171781 5.299608
4.033333 -1.058522 -0.921369 -2.758637 -0.292572 -0.164979 4.929503
4.066667 -1.068276 -0.926834 -3.120211 -0.288270 -0.158095 3.792595
4.100000 -1.077868 -0.931970 2.707638 -0.283793 -0.151164 1.879669
4.133333 -1.087346 -0.936956 2.290926 -0.279150 -0.144222 -0.301642
4.166667 -1.096622 -0.941664 1.975953 -0.274360 -0.137292 -1.753997
4.200000 -1.105695 -0.946095 1.727299 -0.269444 -0.130390 -2.531772
4.233333 -1.114565 -0.950249 1.595176 -0.264428 -0.123546 -2.693157
4.266667 -1.123312 -0.954250 1.514209 -0.259343 -0.116793 -2.283329
4.300000 -1.131856 -0.957979 1.499828 -0.254207 -0.110145 -1.359610
4.333333 -1.140273 -0.961554 1.527107 -0.249044 -0.103625 0.021289
4.366667 -1.148486 -0.964867 1.571501 -0.243863 -0.097242 1.304911
4.400000 -1.156496 -0.967922 1.650583 -0.238666 -0.091005 2.466617
4.433333 -1.164373 -0.970823 1.768019 -0.233450 -0.084904 3.492963
4.466667 -1.172044 -0.973480 1.929766 -0.228208 -0.078924 4.368684
4.500000 -1.179578 -0.975985 2.116001 -0.222932 -0.073047 5.087778
4.533333 -1.186975 -0.978338 2.331727 -0.217616 -0.067248 5.651584
4.566667 -1.194156 -0.980471 2.581660 -0.212259 -0.061514 6.043413
4.600000 -1.201197 -0.982453 2.826408 -0.206849 -0.055820 6.246906
4.633333 -1.208016 -0.984233 3.092856 -0.201379 -0.050146 6.251928
4.666667 -1.214608 -0.985819 -2.961426 -0.195842 -0.044473 6.051647
4.700000 -1.221007 -0.987163 -2.687835 -0.190248 -0.038807 5.646323
4.733333 -1.227262 -0.988360 -2.424085 -0.184609 -0.033160 5.039776
4.766667 -1.233372 -0.989412 -2.213480 -0.178932 -0.027540 4.255950
4.800000 -1.239278 -0.990245 -2.024114 -0.173241 -0.021977 3.322183
4.833333 -1.244978 -0.990869 -1.921041 -0.167555 -0.016505 2.266003
4.866667 -1.250469 -0.991292 -1.864454 -0.161888 -0.011154 1.118092
4.900000 -1.255752 -0.991520 -1.857592 -0.156237 -0.005942 -0.083817
4.933333 -1.260824 -0.991563 -1.904206 -0.150602 -0.000886 -1.292839
4.966667 -1.265685 -0.991428 -1.955088 -0.144990 0.003986 -2.485698
5.000000 -1.270398 -0.991159 -2.078648 -0.139405 0.008658 -3.636342
5.033333 -1.274962 -0.990758 -2.249094 -0.133851 0.013122 -4.723414
5.066667 -1.279377 -0.990227 -2.459406 -0.128325 0.017373 -5.204014
5.100000 -1.283585 -0.989546 -2.676814 -0.122832 0.021411 -5.060400
5.133333 -1.287587 -0.988718 -2.926784 -0.117371 0.025240 -4.285495
5.166667 -1.291387 -0.987750 3.061984 -0.111938 0.028877 -3.363784
5.200000 -1.295039 -0.986661 2.754220 -0.106532 0.032337 -2.257051
5.233333 -1.298461 -0.985495 2.408954 -0.101158 0.035634 -0.924066
5.266667 -1.301738 -0.984212 2.135971 -0.095833 0.038780 -0.380478
5.300000 -1.304798 -0.982859 1.751458 -0.090575 0.041794 -0.596401
5.333333 -1.307712 -0.981395 1.353199 -0.085403 0.044699 -1.550137
5.366667 -1.310482 -0.979821 0.961402 -0.080325 0.047511 -2.203144
5.400000 -1.313061 -0.978176 0.606458 -0.075354 0.050247 -2.576418
5.433333 -1.315454 -0.976458 0.341730 -0.070491 0.052922 -2.709762
5.466667 -1.317670 -0.974666 0.198006 -0.065741 0.055550 -2.128076
5.500000 -1.319746 -0.972774 0.133722 -0.061096 0.058136 -0.895909
5.533333 -1.321682 -0.970785 0.174468 -0.056553 0.060680 0.912080
5.566667 -1.323479 -0.968701 0.278765 -0.052114 0.063185 2.183480
5.600000 -1.325121 -0.966542 0.459442 -0.047782 0.065653 2.851429
