t x y theta dxdt dydt dthetadt
0.000000 0.000000 0.000000 -2.555770 -0.151765 -0.004320 0.049943
0.033333 -0.005108 -0.000151 -2.559218 -0.154887 -0.004725 0.040393
0.066667 -0.010311 -0.000316 -2.572238 -0.158028 -0.005130 0.027091
0.100000 -0.015633 -0.000494 -2.555894 -0.161186 -0.005535 0.011434
0.133333 -0.021050 -0.000685 -2.575164 -0.164360 -0.005938 -0.005432
0.166667 -0.026590 -0.000889 -2.579927 -0.167556 -0.006340 -0.021023
0.200000 -0.032224 -0.001108 -2.552408 -0.170775 -0.006741 -0.032093
0.233333 -0.037983 -0.001339 -2.564143 -0.174017 -0.007141 -0.040234
0.266667 -0.043836 -0.001584 -2.575615 -0.177280 -0.007539 -0.042165
0.300000 -0.049784 -0.001842 -2.580496 -0.180568 -0.007935 -0.041304
0.333333 -0.055825 -0.002115 -2.593283 -0.183880 -0.008329 -0.036192
0.366667 -0.061995 -0.002400 -2.580804 -0.187215 -0.008721 -0.029797
0.400000 -0.068296 -0.002697 -2.587589 -0.190573 -0.009111 -0.020347
0.433333 -0.074690 -0.003008 -2.568458 -0.193964 -0.009499 -0.012417
0.466667 -0.081217 -0.003332 -2.587924 -0.197396 -0.009884 -0.007542
0.500000 -0.087878 -0.003668 -2.582477 -0.200870 -0.010268 -0.001099
0.533333 -0.094630 -0.004017 -2.582298 -0.204388 -0.010650 0.001467
0.566667 -0.101473 -0.004379 -2.576759 -0.207956 -0.011030 0.002144
0.600000 -0.108452 -0.004753 -2.564065 -0.211571 -0.011409 -0.003805
0.633333 -0.115520 -0.005139 -2.597371 -0.215221 -0.011786 -0.005809
0.666667 -0.122727 -0.005538 -2.572481 -0.218888 -0.012160 -0.006526
0.700000 -0.130073 -0.005950 -2.579361 -0.222560 -0.012529 -0.007966
0.733333 -0.137558 -0.006375 -2.573194 -0.226218 -0.012893 -0.009499
0.766667 -0.145185 -0.006813 -2.590341 -0.229837 -0.013251 -0.007309
0.800000 -0.152952 -0.007263 -2.586140 -0.233402 -0.013600 0.001815
0.833333 -0.160802 -0.007724 -2.584841 -0.236902 -0.013942 0.009950
0.866667 -0.168794 -0.008198 -2.574454 -0.240332 -0.014275 0.021523
0.900000 -0.176929 -0.008684 -2.593997 -0.243686 -0.014600 0.040776
0.933333 -0.185142 -0.009179 -2.584895 -0.246961 -0.014914 0.072373
0.966667 -0.193432 -0.009683 -2.581184 -0.250154 -0.015218 0.114526
1.000000 -0.201798 -0.010195 -2.565019 -0.253259 -0.015510 0.163380
1.033333 -0.210237 -0.010715 -2.575890 -0.256266 -0.015789 0.223266
1.066667 -0.218821 -0.011247 -2.579426 -0.259167 -0.016052 0.290470
1.100000 -0.227548 -0.011792 -2.581579 -0.261953 -0.016299 0.356562
1.133333 -0.236420 -0.012348 -2.558984 -0.264618 -0.016528 0.414843
1.166667 -0.245357 -0.012910 -2.542466 -0.267154 -0.016740 0.458162
1.200000 -0.254360 -0.013478 -2.520038 -0.269557 -0.016934 0.485278
1.233333 -0.263424 -0.014051 -2.492543 -0.271824 -0.017109 0.487278
1.266667 -0.272549 -0.014628 -2.457077 -0.273955 -0.017267 0.463162
1.300000 -0.281732 -0.015209 -2.419749 -0.275962 -0.017407 0.414080
1.333333 -0.290971 -0.015793 -2.409464 -0.277860 -0.017532 0.345490
1.366667 -0.300264 -0.016380 -2.374938 -0.279670 -0.017644 0.260993
1.400000 -0.309608 -0.016970 -2.390248 -0.281411 -0.017744 0.168405
1.433333 -0.319002 -0.017561 -2.395487 -0.283107 -0.017839 0.077072
1.466667 -0.328506 -0.018165 -2.390843 -0.284774 -0.017931 -0.007711
1.500000 -0.338054 -0.018770 -2.407895 -0.286424 -0.018027 -0.078291
1.533333 -0.347644 -0.019374 -2.430533 -0.288063 -0.018131 -0.133670
1.566667 -0.357275 -0.019977 -2.434400 -0.289692 -0.018248 -0.168701
1.600000 -0.366944 -0.020578 -2.446526 -0.291315 -0.018385 -0.186897
1.633333 -0.376648 -0.021177 -2.448619 -0.292930 -0.018546 -0.191644
1.666667 -0.386433 -0.021789 -2.435083 -0.294536 -0.018733 -0.183219
1.700000 -0.396294 -0.022415 -2.458126 -0.296122 -0.018945 -0.166052
1.733333 -0.406183 -0.023036 -2.463875 -0.297675 -0.019178 -0.146239
1.766667 -0.416139 -0.023670 -2.465109 -0.299182 -0.019429 -0.126204
1.800000 -0.426155 -0.024317 -2.480299 -0.300620 -0.019690 -0.107432
1.833333 -0.436228 -0.024978 -2.481302 -0.301967 -0.019952 -0.089495
1.866667 -0.446352 -0.025653 -2.467503 -0.303201 -0.020210 -0.075446
1.900000 -0.456522 -0.026341 -2.491171 -0.304311 -0.020463 -0.066275
1.933333 -0.466732 -0.027044 -2.481258 -0.305282 -0.020706 -0.058965
1.966667 -0.476977 -0.027760 -2.484625 -0.306107 -0.020936 -0.051480
2.000000 -0.487227 -0.028463 -2.466477 -0.306780 -0.021153 -0.046451
2.033333 -0.497481 -0.029153 -2.471174 -0.307307 -0.021357 -0.041491
2.066667 -0.507754 -0.029857 -2.480438 -0.307688 -0.021543 -0.033805
2.100000 -0.518042 -0.030574 -2.492800 -0.307924 -0.021709 -0.022995
2.133333 -0.528340 -0.031305 -2.491284 -0.308021 -0.021853 -0.009060
2.166667 -0.538642 -0.032049 -2.493723 -0.307982 -0.021973 0.002585
2.200000 -0.548944 -0.032806 -2.487495 -0.307809 -0.022057 0.015098
2.233333 -0.559231 -0.033542 -2.502389 -0.307502 -0.022100 0.024689
2.266667 -0.569506 -0.034289 -2.499751 -0.307059 -0.022094 0.027581
2.300000 -0.579765 -0.035048 -2.481125 -0.306482 -0.022030 0.022073
2.333333 -0.590004 -0.035817 -2.483194 -0.305772 -0.021893 0.010615
2.366667 -0.600214 -0.036559 -2.460835 -0.304927 -0.021681 -0.004026
2.400000 -0.610394 -0.037272 -2.456324 -0.303948 -0.021396 -0.020102
2.433333 -0.620537 -0.037993 -2.464684 -0.302837 -0.021035 -0.036060
2.466667 -0.630637 -0.038722 -2.474214 -0.301591 -0.020600 -0.047495
2.500000 -0.640698 -0.039416 -2.486519 -0.300206 -0.020100 -0.048555
2.533333 -0.650704 -0.040113 -2.499522 -0.298677 -0.019546 -0.042363
2.566667 -0.660664 -0.040773 -2.504343 -0.297001 -0.018939 -0.028041
2.600000 -0.670576 -0.041393 -2.511927 -0.295179 -0.018276 -0.007485
2.633333 -0.680437 -0.041972 -2.514485 -0.293211 -0.017559 0.016981
2.666667 -0.690220 -0.042543 -2.501948 -0.291100 -0.016791 0.040584
2.700000 -0.699920 -0.043103 -2.488133 -0.288852 -0.015963 0.055540
2.733333 -0.709532 -0.043649 -2.480879 -0.286477 -0.015066 0.061079
2.766667 -0.719080 -0.044145 -2.477511 -0.283980 -0.014094 0.056721
2.800000 -0.728529 -0.044621 -2.468415 -0.281357 -0.013045 0.041987
2.833333 -0.737871 -0.045071 -2.456850 -0.278608 -0.011910 0.019889
2.866667 -0.747103 -0.045494 -2.467073 -0.275734 -0.010679 -0.006369
2.900000 -0.756261 -0.045859 -2.468579 -0.272740 -0.009350 -0.031021
2.933333 -0.765342 -0.046166 -2.474210 -0.269617 -0.007924 -0.050610
2.966667 -0.774345 -0.046412 -2.491270 -0.266367 -0.006399 -0.065469
3.000000 -0.783215 -0.046613 -2.488519 -0.262994 -0.004775 -0.075920
3.033333 -0.791947 -0.046768 -2.499193 -0.259512 -0.003055 -0.082260
3.066667 -0.800593 -0.046855 -2.510242 -0.255927 -0.001244 -0.085038
3.100000 -0.809090 -0.046886 -2.497438 -0.252246 0.000655 -0.087382
3.133333 -0.817433 -0.046857 -2.492941 -0.248489 0.002645 -0.093088
3.166667 -0.825617 -0.046764 -2.485966 -0.244679 0.004728 -0.103930
3.200000 -0.833706 -0.046595 -2.495930 -0.240838 0.006903 -0.119775
3.233333 -0.841699 -0.046349 -2.501108 -0.236978 0.009168 -0.141614
3.266667 -0.849520 -0.046026 -2.504620 -0.233121 0.011526 -0.170704
3.300000 -0.857242 -0.045622 -2.510121 -0.229272 0.013976 -0.205561
3.333333 -0.864785 -0.045133 -2.522403 -0.225439 0.016514 -0.240928
3.366667 -0.872224 -0.044558 -2.531308 -0.221613 0.019135 -0.274430
3.400000 -0.879558 -0.043894 -2.538632 -0.217778 0.021837 -0.302736
3.433333 -0.886785 -0.043139 -2.546244 -0.213919 0.024621 -0.324019
3.466667 -0.893826 -0.042285 -2.564736 -0.210013 0.027486 -0.334535
3.500000 -0.900757 -0.041336 -2.565372 -0.206050 0.030430 -0.332230
3.533333 -0.907576 -0.040289 -2.599200 -0.202002 0.033455 -0.317564
3.566667 -0.914284 -0.039144 -2.608159 -0.197855 0.036562 -0.289787
3.600000 -0.920878 -0.037898 -2.619555 -0.193608 0.039749 -0.251805
3.633333 -0.927288 -0.036538 -2.644406 -0.189270 0.043013 -0.203828
3.666667 -0.933582 -0.035073 -2.641698 -0.184844 0.046353 -0.151813
3.700000 -0.939695 -0.033489 -2.648894 -0.180340 0.049764 -0.097806
3.733333 -0.945628 -0.031786 -2.648937 -0.175792 0.053241 -0.047573
3.766667 -0.951382 -0.029961 -2.643949 -0.171232 0.056777 -0.003983
3.800000 -0.957016 -0.028023 -2.637012 -0.166688 0.060367 0.031566
3.833333 -0.962472 -0.025959 -2.631292 -0.162180 0.064005 0.055835
3.866667 -0.967750 -0.023767 -2.617647 -0.157739 0.067687 0.072490
3.900000 -0.972907 -0.021457 -2.606610 -0.153382 0.071408 0.080474
3.933333 -0.977943 -0.019026 -2.614426 -0.149110 0.075168 0.083678
3.966667 -0.982803 -0.016461 -2.612822 -0.144914 0.078968 0.083073
4.000000 -0.987541 -0.013772 -2.622871 -0.140781 0.082811 0.084498
4.033333 -0.992155 -0.010958 -2.622535 -0.136695 0.086701 0.089518
4.066667 -0.996648 -0.008016 -2.611820 -0.132630 0.090644 0.098271
4.100000 -1.001017 -0.004945 -2.602989 -0.128566 0.094643 0.110726
4.133333 -1.005263 -0.001743 -2.612941 -0.124484 0.098704 0.124487
4.166667 -1.009337 0.001605 -2.605786 -0.120369 0.102832 0.140338
4.200000 -1.013288 0.005086 -2.599072 -0.116214 0.107028 0.150509
4.233333 -1.017117 0.008704 -2.592035 -0.112019 0.111290 0.154421
4.266667 -1.020822 0.012458 -2.579099 -0.107791 0.115616 0.150195
4.300000 -1.024360 0.016367 -2.578163 -0.103538 0.120003 0.139619
4.333333 -1.027731 0.020431 -2.555508 -0.099281 0.124443 0.121659
4.366667 -1.030936 0.024654 -2.559955 -0.095038 0.128928 0.095952
4.400000 -1.034020 0.029019 -2.548694 -0.090827 0.133451 0.066619
4.433333 -1.036982 0.033528 -2.555786 -0.086658 0.138007 0.037434
4.466667 -1.039783 0.038201 -2.563723 -0.082549 0.142589 0.010720
4.500000 -1.042422 0.043040 -2.552349 -0.078510 0.147191 -0.014634
4.533333 -1.044941 0.048026 -2.556577 -0.074540 0.151815 -0.033286
4.566667 -1.047341 0.053161 -2.567492 -0.070636 0.156460 -0.045149
4.600000 -1.049623 0.058446 -2.569071 -0.066792 0.161129 -0.050031
4.633333 -1.051788 0.063882 -2.574536 -0.062999 0.165828 -0.050435
4.666667 -1.053835 0.069469 -2.581010 -0.059243 0.170565 -0.047794
4.700000 -1.055728 0.075235 -2.580704 -0.055506 0.175348 -0.040263
4.733333 -1.057507 0.081154 -2.574569 -0.051785 0.180181 -0.031548
4.766667 -1.059171 0.087227 -2.567513 -0.048073 0.185065 -0.022310
4.800000 -1.060721 0.093456 -2.577138 -0.044372 0.189998 -0.013629
4.833333 -1.062160 0.099841 -2.575984 -0.040688 0.194971 -0.006871
4.866667 -1.063451 0.106413 -2.576375 -0.037033 0.199974 -0.001488
4.900000 -1.064632 0.113143 -2.580956 -0.033410 0.205005 0.000454
4.933333 -1.065667 0.120064 -2.579546 -0.029824 0.210061 0.000418
4.966667 -1.066558 0.127178 -2.568793 -0.026279 0.215140 -0.002168
5.000000 -1.067342 0.134451 -2.581328 -0.022776 0.220243 -0.005540
5.033333 -1.068022 0.141884 -2.572929 -0.019313 0.225374 -0.008196
5.066667 -1.068599 0.149476 -2.574450 -0.015888 0.230534 -0.010381
5.100000 -1.069074 0.157228 -2.567405 -0.012504 0.235719 -0.011847
5.133333 -1.069449 0.165140 -2.578919 -0.009161 0.240932 -0.010750
5.166667 -1.069724 0.173213 -2.575828 -0.005852 0.246177 -0.004488
5.200000 -1.069865 0.181490 -2.580107 -0.002572 0.251459 0.005388
5.233333 -1.069871 0.189975 -2.583055 0.000684 0.256785 0.017647
5.266667 -1.069784 0.198620 -2.583259 0.003923 0.262164 0.031130
5.300000 -1.069566 0.207474 -2.585701 0.007143 0.267594 0.046149
5.333333 -1.069257 0.216489 -2.583850 0.010341 0.273070 0.058549
5.366667 -1.068859 0.225664 -2.569769 0.013510 0.278586 0.064938
5.400000 -1.068374 0.234999 -2.575940 0.016643 0.284131 0.065102
5.433333 -1.067763 0.244549 -2.570756 0.019727 0.289688 0.059693
5.466667 -1.067069 0.254258 -2.555702 0.022752 0.295239 0.050559
5.500000 -1.066253 0.264185 -2.547776 0.025711 0.300773 0.037264
5.533333 -1.065316 0.274331 -2.539993 0.028598 0.306277 0.019642
5.566667 -1.064260 0.284697 -2.548305 0.031399 0.311731 0.002287
5.600000 -1.063129 0.295219 -2.567820 0.034107 0.317121 -0.013648
5.633333 -1.061924 0.305897 -2.571858 0.036726 0.322457 -0.027306
5.666667 -1.060648 0.316728 -2.565146 0.039263 0.327751 -0.038384
5.700000 -1.059259 0.327784 -2.568888 0.041727 0.333019 -0.045055
5.733333 -1.057803 0.338993 -2.567895 0.044135 0.338292 -0.043531
5.766667 -1.056283 0.350352 -2.571284 0.046509 0.343606 -0.036662
5.800000 -1.054701 0.361861 -2.568028 0.048868 0.348989 -0.028325
5.833333 -1.053058 0.373517 -2.566689 0.051222 0.354460 -0.017872
5.866667 -1.051358 0.385321 -2.577718 0.053574 0.360020 -0.003316
5.900000 -1.049555 0.397355 -2.571378 0.055926 0.365672 0.014106
5.933333 -1.047650 0.409619 -2.574817 0.058268 0.371398 0.033539
5.966667 -1.045647 0.422114 -2.580345 0.060588 0.377175 0.057368
6.000000 -1.043545 0.434841 -2.574267 0.062867 0.382970 0.092008
6.033333 -1.041398 0.447707 -2.567677 0.065083 0.388743 0.134461
6.066667 -1.039157 0.460804 -2.563700 0.067216 0.394460 0.178170
6.100000 -1.036875 0.474036 -2.554182 0.069251 0.400096 0.220471
6.133333 -1.034503 0.487500 -2.572445 0.071172 0.405622 0.260919
6.166667 -1.032043 0.501196 -2.557743 0.072969 0.411023 0.291517
6.200000 -1.029550 0.515019 -2.534395 0.074640 0.416292 0.305983
6.233333 -1.027027 0.528966 -2.515649 0.076184 0.421429 0.303978
6.266667 -1.024428 0.543141 -2.504578 0.077602 0.426433 0.288206
6.300000 -1.021805 0.557433 -2.470304 0.078890 0.431301 0.259947
6.333333 -1.019115 0.571948 -2.446390 0.080051 0.436044 0.213834
6.366667 -1.016405 0.586575 -2.447532 0.081086 0.440660 0.157658
6.400000 -1.013640 0.601415 -2.452859 0.081994 0.445153 0.095863
6.433333 -1.010861 0.616362 -2.460825 0.082771 0.449527 0.033342
6.466667 -1.008072 0.631411 -2.458416 0.083421 0.453794 -0.027203
6.500000 -1.005243 0.646660 -2.472951 0.083941 0.457940 -0.081354
6.533333 -1.002410 0.662005 -2.467813 0.084329 0.461961 -0.121336
6.566667 -0.999575 0.677442 -2.481954 0.084583 0.465857 -0.148511
6.600000 -0.996722 0.693060 -2.491433 0.084705 0.469625 -0.162650
6.633333 -0.993859 0.708854 -2.489150 0.084692 0.473246 -0.166975
6.666667 -0.991002 0.724729 -2.502830 0.084537 0.476703 -0.162516
6.700000 -0.988155 0.740680 -2.508738 0.084237 0.480001 -0.152071
6.733333 -0.985321 0.756784 -2.515004 0.083782 0.483135 -0.137143
6.766667 -0.982507 0.773033 -2.522291 0.083162 0.486084 -0.118041
6.800000 -0.979711 0.789347 -2.519248 0.082360 0.488843 -0.098548
6.833333 -0.976935 0.805722 -2.527281 0.081369 0.491420 -0.077600
6.866667 -0.974183 0.822154 -2.524696 0.080182 0.493816 -0.058551
6.900000 -0.971485 0.838693 -2.535466 0.078792 0.496022 -0.041844
6.933333 -0.968815 0.855281 -2.525875 0.077202 0.498034 -0.031260
6.966667 -0.966218 0.871954 -2.528010 0.075428 0.499863 -0.028082
7.000000 -0.963701 0.888705 -2.532222 0.073499 0.501506 -0.030256
7.033333 -0.961219 0.905490 -2.526730 0.071431 0.502952 -0.039743
7.066667 -0.958835 0.922331 -2.518526 0.069253 0.504193 -0.051983
7.100000 -0.956558 0.939215 -2.518026 0.066998 0.505229 -0.066769
7.133333 -0.954397 0.956131 -2.521294 0.064688 0.506050 -0.076720
7.166667 -0.952279 0.973064 -2.526071 0.062319 0.506643 -0.076771
7.200000 -0.950293 0.990006 -2.545446 0.059882 0.507001 -0.060744
7.233333 -0.948355 1.006957 -2.545227 0.057389 0.507125 -0.023828
7.266667 -0.946465 1.023911 -2.549506 0.054817 0.507013 0.033503
7.300000 -0.944627 1.040865 -2.554837 0.052139 0.506660 0.113336
7.333333 -0.942840 1.057813 -2.566100 0.049321 0.506065 0.211363
7.366667 -0.941224 1.074715 -2.573199 0.046356 0.505231 0.323013
7.400000 -0.939664 1.091603 -2.563686 0.043209 0.504146 0.438893
7.433333 -0.938160 1.108473 -2.550088 0.039821 0.502787 0.554437
7.466667 -0.936851 1.125262 -2.507024 0.036177 0.501147 0.662691
7.500000 -0.935745 1.141961 -2.465193 0.032279 0.499223 0.757663
7.533333 -0.934698 1.158627 -2.418220 0.028137 0.497013 0.830422
7.566667 -0.933711 1.175258 -2.388702 0.023743 0.494509 0.877019
7.600000 -0.932945 1.191766 -2.374094 0.019138 0.491729 0.901304
7.633333 -0.932239 1.208230 -2.339175 0.014396 0.488709 0.903328
7.666667 -0.931764 1.224551 -2.295603 0.009550 0.485466 0.894105
7.700000 -0.931523 1.240719 -2.261143 0.004624 0.482016 0.878784
7.733333 -0.931520 1.256725 -2.224597 -0.000338 0.478383 0.872369
7.766667 -0.931758 1.272558 -2.194598 -0.005255 0.474619 0.881357
7.800000 -0.932056 1.288328 -2.198519 -0.010084 0.470753 0.905582
7.833333 -0.932414 1.304031 -2.161200 -0.014798 0.466804 0.947106
7.866667 -0.933018 1.319538 -2.158046 -0.019340 0.462813 1.001402
7.900000 -0.933868 1.334843 -2.139410 -0.023655 0.458821 1.065953
7.933333 -0.934774 1.350072 -2.090888 -0.027714 0.454851 1.127892
7.966667 -0.935736 1.365221 -2.051848 -0.031548 0.450888 1.180413
8.000000 -0.936940 1.380153 -1.988967 -0.035171 0.446927 1.210982
8.033333 -0.938195 1.394999 -1.942004 -0.038607 0.442950 1.210262
8.066667 -0.939685 1.409622 -1.867876 -0.041902 0.438928 1.164487
8.100000 -0.941222 1.424154 -1.823227 -0.045116 0.434820 1.066066
8.133333 -0.942806 1.438591 -1.788348 -0.048283 0.430600 0.919881
8.166667 -0.944434 1.452932 -1.734458 -0.051410 0.426267 0.728304
8.200000 -0.946103 1.467174 -1.700010 -0.054507 0.421814 0.508186
8.233333 -0.947812 1.481315 -1.682055 -0.057565 0.417254 0.272192
8.266667 -0.949716 1.495229 -1.668978 -0.060572 0.412597 0.042507
8.300000 -0.951806 1.508918 -1.671405 -0.063501 0.407869 -0.162073
8.333333 -0.954073 1.522383 -1.715257 -0.066323 0.403093 -0.332457
8.366667 -0.956511 1.535626 -1.751323 -0.068989 0.398310 -0.455829
8.400000 -0.958976 1.548757 -1.799091 -0.071449 0.393560 -0.526904
8.433333 -0.961463 1.561774 -1.859411 -0.073664 0.388876 -0.541347
8.466667 -0.963970 1.574676 -1.874424 -0.075604 0.384279 -0.503680
8.500000 -0.966615 1.587363 -1.889646 -0.077242 0.379795 -0.423329
8.533333 -0.969274 1.599931 -1.905246 -0.078574 0.375424 -0.308052
8.566667 -0.971943 1.612380 -1.917951 -0.079638 0.371135 -0.172139
8.600000 -0.974618 1.624707 -1.913745 -0.080472 0.366894 -0.029340
8.633333 -0.977395 1.636828 -1.899850 -0.081106 0.362675 0.103895
8.666667 -0.980172 1.648826 -1.898974 -0.081557 0.358459 0.217742
8.700000 -0.982944 1.660698 -1.878004 -0.081858 0.354213 0.308069
8.733333 -0.985708 1.672444 -1.855692 -0.082024 0.349923 0.367752
8.766667 -0.988460 1.684062 -1.842311 -0.082050 0.345592 0.397847
8.800000 -0.991197 1.695552 -1.807419 -0.081927 0.341228 0.396101
8.833333 -0.993914 1.706912 -1.798140 -0.081659 0.336827 0.370030
8.866667 -0.996654 1.718088 -1.767505 -0.081249 0.332388 0.320844
8.900000 -0.999403 1.729084 -1.768491 -0.080684 0.327926 0.252896
8.933333 -1.002148 1.739903 -1.739077 -0.079944 0.323457 0.172804
8.966667 -1.004858 1.750589 -1.744521 -0.079009 0.318992 0.085142
9.000000 -1.007530 1.761142 -1.752847 -0.077864 0.314539 0.000752
9.033333 -1.010158 1.771531 -1.748797 -0.076481 0.310119 -0.080228
9.066667 -1.012740 1.781784 -1.764222 -0.074838 0.305741 -0.148839
9.100000 -1.015272 1.791903 -1.771766 -0.072920 0.301408 -0.205541
9.133333 -1.017722 1.801867 -1.783565 -0.070732 0.297115 -0.246165
9.166667 -1.020115 1.811695 -1.796491 -0.068277 0.292859 -0.272079
9.200000 -1.022447 1.821387 -1.819634 -0.065561 0.288636 -0.289504
9.233333 -1.024659 1.830934 -1.826719 -0.062596 0.284437 -0.297809
9.266667 -1.026739 1.840339 -1.839617 -0.059384 0.280258 -0.303430
9.300000 -1.028676 1.849605 -1.843718 -0.055944 0.276100 -0.304606
9.333333 -1.030538 1.858733 -1.840546 -0.052274 0.271963 -0.303144
9.366667 -1.032235 1.867725 -1.859911 -0.048379 0.267847 -0.292888
9.400000 -1.033849 1.876579 -1.866180 -0.044255 0.263752 -0.265618
9.433333 -1.035278 1.885299 -1.874518 -0.039901 0.259679 -0.215932
9.466667 -1.036618 1.893882 -1.883186 -0.035317 0.255626 -0.136943
9.500000 -1.037754 1.902333 -1.888900 -0.030483 0.251593 -0.029453
9.533333 -1.038794 1.910646 -1.917028 -0.025394 0.247579 0.106821
9.566667 -1.039615 1.918828 -1.941160 -0.020042 0.243579 0.262832
9.600000 -1.040212 1.926880 -1.959181 -0.014445 0.239590 0.427356
9.633333 -1.040704 1.934794 -1.937662 -0.008615 0.235608 0.590699
9.666667 -1.040965 1.942578 -1.907589 -0.002586 0.231628 0.740811
9.700000 -1.040995 1.950233 -1.840017 0.003603 0.227643 0.869035
9.733333 -1.040791 1.957759 -1.769081 0.009894 0.223647 0.964759
9.766667 -1.040357 1.965154 -1.723307 0.016230 0.219635 1.021382
9.800000 -1.039693 1.972417 -1.668718 0.022561 0.215604 1.038036
9.833333 -1.038802 1.979546 -1.632016 0.028831 0.211549 1.012779
9.866667 -1.037687 1.986538 -1.606092 0.034986 0.207468 0.950239
9.900000 -1.036351 1.993394 -1.572117 0.040977 0.203365 0.858366
9.933333 -1.034799 2.000110 -1.565438 0.046774 0.199240 0.750128
9.966667 -1.033124 2.006689 -1.534965 0.052358 0.195099 0.636587
10.000000 -1.031239 2.013125 -1.517856 0.057717 0.190947 0.526337
10.033333 -1.029148 2.019418 -1.494959 0.062855 0.186789 0.429114
10.066667 -1.026933 2.025574 -1.470179 0.067789 0.182630 0.348996
10.100000 -1.024519 2.031584 -1.474324 0.072548 0.178473 0.291852
10.133333 -1.021979 2.037458 -1.457962 0.077159 0.174324 0.253917
10.166667 -1.019312 2.043197 -1.480759 0.081645 0.170184 0.239380
10.200000 -1.016519 2.048800 -1.488493 0.086035 0.166055 0.248840
10.233333 -1.013599 2.054269 -1.490887 0.090357 0.161937 0.282108
10.266667 -1.010501 2.059593 -1.474941 0.094629 0.157831 0.338740
10.300000 -1.007276 2.064784 -1.469688 0.098864 0.153739 0.410560
10.333333 -1.003922 2.069841 -1.450581 0.103072 0.149661 0.494074
10.366667 -1.000407 2.074757 -1.438834 0.107260 0.145599 0.577664
10.400000 -0.996763 2.079540 -1.419439 0.111426 0.141555 0.650865
10.433333 -0.992967 2.084185 -1.381238 0.115560 0.137532 0.702146
10.466667 -0.989022 2.088693 -1.345358 0.119662 0.133533 0.726026
10.500000 -0.984950 2.093070 -1.318423 0.123725 0.129560 0.721449
10.533333 -0.980750 2.097317 -1.276732 0.127746 0.125617 0.690126
10.566667 -0.976413 2.101430 -1.244193 0.131727 0.121705 0.635641
10.600000 -0.971948 2.105415 -1.210688 0.135673 0.117827 0.565097
10.633333 -0.967352 2.109270 -1.182498 0.139593 0.113985 0.487732
10.666667 -0.962630 2.112998 -1.175545 0.143497 0.110181 0.408924
10.700000 -0.957780 2.116600 -1.178520 0.147397 0.106416 0.332425
10.733333 -0.952805 2.120075 -1.187854 0.151299 0.102691 0.262065
10.766667 -0.947704 2.123426 -1.207030 0.155209 0.099005 0.204551
10.800000 -0.942480 2.126651 -1.196392 0.159131 0.095359 0.160287
10.833333 -0.937122 2.129758 -1.178617 0.163067 0.091751 0.128643
10.866667 -0.931629 2.132747 -1.160218 0.167018 0.088182 0.107152
10.900000 -0.925999 2.135619 -1.163837 0.170987 0.084650 0.094090
10.933333 -0.920229 2.138377 -1.152004 0.174977 0.081158 0.084529
10.966667 -0.914318 2.141021 -1.162622 0.178994 0.077706 0.072716
11.000000 -0.908287 2.143546 -1.159182 0.183040 0.074295 0.058051
11.033333 -0.902112 2.145961 -1.158388 0.187117 0.070927 0.041162
11.066667 -0.895820 2.148258 -1.156193 0.191221 0.067600 0.024088
11.100000 -0.889411 2.150437 -1.152474 0.195347 0.064314 0.006979
11.133333 -0.882854 2.152510 -1.151620 0.199484 0.061065 -0.008793
11.166667 -0.876149 2.154479 -1.161625 0.203617 0.057849 -0.026525
11.200000 -0.869293 2.156346 -1.154623 0.207736 0.054664 -0.051728
11.233333 -0.862287 2.158111 -1.162226 0.211830 0.051507 -0.089388
11.266667 -0.855129 2.159776 -1.163187 0.215892 0.048377 -0.145035
11.300000 -0.847819 2.161344 -1.160886 0.219912 0.045271 -0.221896
11.333333 -0.840403 2.162798 -1.162549 0.223889 0.042189 -0.320107
11.366667 -0.832834 2.164158 -1.170970 0.227816 0.039131 -0.434619
11.400000 -0.825162 2.165406 -1.163587 0.231686 0.036096 -0.555941
11.433333 -0.817389 2.166545 -1.169803 0.235491 0.033083 -0.676578
11.466667 -0.809517 2.167575 -1.189608 0.239226 0.030093 -0.786508
11.500000 -0.801493 2.168513 -1.236229 0.242891 0.027129 -0.873392
11.533333 -0.793319 2.169361 -1.295772 0.246477 0.024192 -0.928298
11.566667 -0.784998 2.170121 -1.353883 0.249985 0.021289 -0.946322
11.600000 -0.776535 2.170793 -1.399399 0.253406 0.018420 -0.925364
11.633333 -0.767984 2.171360 -1.451730 0.256732 0.015591 -0.864228
11.666667 -0.759347 2.171823 -1.483534 0.259952 0.012801 -0.768532
11.700000 -0.750626 2.172181 -1.517536 0.263057 0.010053 -0.648327
11.733333 -0.741782 2.172459 -1.524239 0.266039 0.007349 -0.518645
11.766667 -0.732860 2.172634 -1.532300 0.268896 0.004689 -0.389465
11.800000 -0.723827 2.172733 -1.526168 0.271629 0.002074 -0.274134
11.833333 -0.714690 2.172755 -1.524026 0.274237 -0.000505 -0.185606
11.866667 -0.705481 2.172677 -1.516030 0.276722 -0.003052 -0.128369
11.900000 -0.696183 2.172525 -1.529817 0.279079 -0.005579 -0.106565
11.933333 -0.686802 2.172300 -1.511777 0.281306 -0.008099 -0.117787
11.966667 -0.677346 2.172003 -1.502928 0.283395 -0.010629 -0.162855
12.000000 -0.667830 2.171606 -1.505717 0.285335 -0.013175 -0.239682
12.033333 -0.658254 2.171138 -1.508177 0.287119 -0.015742 -0.344852
12.066667 -0.648625 2.170596 -1.530057 0.288732 -0.018331 -0.480289
12.100000 -0.638945 2.169957 -1.543619 0.290167 -0.020940 -0.645442
12.133333 -0.629217 2.169222 -1.556458 0.291413 -0.023561 -0.838073
12.166667 -0.619443 2.168391 -1.585567 0.292466 -0.026183 -1.053204
12.200000 -0.609627 2.167465 -1.599328 0.293323 -0.028800 -1.284085
12.233333 -0.599770 2.166444 -1.648496 0.293984 -0.031408 -1.518723
12.266667 -0.589877 2.165329 -1.699469 0.294452 -0.033996 -1.739487
12.300000 -0.579994 2.164138 -1.755783 0.294732 -0.036561 -1.930686
12.333333 -0.570126 2.162872 -1.835026 0.294826 -0.039100 -2.074041
12.366667 -0.560283 2.161530 -1.920165 0.294740 -0.041614 -2.156788
12.400000 -0.550472 2.160112 -2.037691 0.294479 -0.044103 -2.163937
12.433333 -0.540638 2.158603 -2.146911 0.294050 -0.046569 -2.091449
12.466667 -0.530785 2.157001 -2.255779 0.293467 -0.049018 -1.942500
12.500000 -0.520986 2.155325 -2.349945 0.292740 -0.051450 -1.717712
12.533333 -0.511172 2.153558 -2.416654 0.291880 -0.053867 -1.431560
12.566667 -0.501423 2.151716 -2.456030 0.290899 -0.056268 -1.097296
12.600000 -0.491739 2.149800 -2.464938 0.289815 -0.058654 -0.740721
12.633333 -0.482049 2.147793 -2.488919 0.288648 -0.061024 -0.379631
12.666667 -0.472426 2.145713 -2.471847 0.287415 -0.063378 -0.034160
12.700000 -0.462867 2.143559 -2.468769 0.286140 -0.065718 0.275400
12.733333 -0.453372 2.141332 -2.435853 0.284854 -0.068050 0.536658
12.766667 -0.443936 2.139031 -2.394355 0.283582 -0.070377 0.743365
12.800000 -0.434506 2.136643 -2.361544 0.282339 -0.072704 0.898261
12.833333 -0.425131 2.134182 -2.302858 0.281142 -0.075036 0.996376
12.866667 -0.415806 2.131648 -2.254609 0.280001 -0.077376 1.047307
12.900000 -0.406494 2.129027 -2.211506 0.278915 -0.079726 1.056140
12.933333 -0.397226 2.126334 -2.176217 0.277873 -0.082086 1.032092
12.966667 -0.388000 2.123568 -2.122075 0.276865 -0.084455 0.979619
13.000000 -0.378794 2.120717 -2.105347 0.275880 -0.086832 0.907727
13.033333 -0.369608 2.117780 -2.072394 0.274900 -0.089217 0.832794
13.066667 -0.360459 2.114771 -2.054552 0.273907 -0.091604 0.760006
13.100000 -0.351334 2.111677 -2.011325 0.272886 -0.093996 0.695683
13.133333 -0.342237 2.108498 -2.007673 0.271825 -0.096389 0.646866
13.166667 -0.333179 2.105245 -2.003107 0.270713 -0.098784 0.620663
13.200000 -0.324152 2.101909 -1.982048 0.269538 -0.101178 0.612995
13.233333 -0.315168 2.098497 -1.971009 0.268295 -0.103574 0.618327
13.266667 -0.306231 2.095008 -1.970243 0.266985 -0.105972 0.633801
13.300000 -0.297332 2.091436 -1.941637 0.265606 -0.108371 0.658615
13.333333 -0.288484 2.087785 -1.919354 0.264162 -0.110775 0.685560
13.366667 -0.279690 2.084055 -1.876223 0.262659 -0.113184 0.706259
13.400000 -0.270952 2.080245 -1.850197 0.261104 -0.115598 0.722635
13.433333 -0.262271 2.076354 -1.825115 0.259504 -0.118018 0.736027
13.466667 -0.253637 2.072381 -1.790965 0.257865 -0.120442 0.746616
13.500000 -0.245064 2.068326 -1.753884 0.256192 -0.122870 0.754763
13.533333 -0.236550 2.064189 -1.741515 0.254493 -0.125301 0.762711
13.566667 -0.228090 2.059971 -1.722413 0.252775 -0.127733 0.774085
13.600000 -0.219690 2.055672 -1.712394 0.251044 -0.130164 0.787263
13.633333 -0.211347 2.051293 -1.697638 0.249308 -0.132595 0.798399
13.666667 -0.203064 2.046832 -1.666344 0.247574 -0.135025 0.803447
13.700000 -0.194839 2.042289 -1.633162 0.245850 -0.137453 0.798139
13.733333 -0.186678 2.037667 -1.607001 0.244138 -0.139877 0.778603
13.766667 -0.178575 2.032962 -1.559893 0.242438 -0.142297 0.742663
13.800000 -0.170539 2.028180 -1.513275 0.240743 -0.144709 0.688748
13.833333 -0.162555 2.023317 -1.481387 0.239048 -0.147111 0.618917
13.866667 -0.154622 2.018371 -1.454604 0.237347 -0.149503 0.538636
13.900000 -0.146736 2.013344 -1.444395 0.235633 -0.151881 0.456338
13.933333 -0.138896 2.008235 -1.444876 0.233892 -0.154244 0.378675
13.966667 -0.131097 2.003046 -1.440313 0.232122 -0.156591 0.311034
14.000000 -0.123377 1.997782 -1.441853 0.230325 -0.158924 0.257703
14.033333 -0.115695 1.992439 -1.456453 0.228504 -0.161244 0.222828
14.066667 -0.108095 1.987022 -1.456913 0.226658 -0.163553 0.205893
14.100000 -0.100581 1.981532 -1.443767 0.224800 -0.165857 0.199157
14.133333 -0.093155 1.975971 -1.437143 0.222950 -0.168161 0.196768
14.166667 -0.085761 1.970329 -1.422942 0.221116 -0.170468 0.193825
14.200000 -0.078400 1.964605 -1.408714 0.219293 -0.172780 0.188664
14.233333 -0.071133 1.958812 -1.387681 0.217485 -0.175099 0.174656
14.266667 -0.063962 1.952949 -1.375992 0.215683 -0.177423 0.149273
14.300000 -0.056824 1.947003 -1.365814 0.213868 -0.179750 0.117413
14.333333 -0.049722 1.940974 -1.385381 0.212014 -0.182076 0.085635
14.366667 -0.042657 1.934862 -1.375426 0.210107 -0.184403 0.056351
14.400000 -0.035633 1.928666 -1.374336 0.208134 -0.186729 0.030871
14.433333 -0.028652 1.922386 -1.384668 0.206066 -0.189047 0.015438
14.466667 -0.021782 1.916042 -1.397284 0.203887 -0.191356 0.015012
14.500000 -0.015025 1.909635 -1.396732 0.201585 -0.193652 0.027207
14.533333 -0.008325 1.903144 -1.398518 0.199149 -0.195931 0.047844
14.566667 -0.001689 1.896568 -1.390227 0.196564 -0.198183 0.076095
14.600000 0.004826 1.889932 -1.393235 0.193827 -0.200407 0.111240
14.633333 0.011268 1.883210 -1.382049 0.190947 -0.202603 0.149814
14.666667 0.017630 1.876404 -1.373563 0.187923 -0.204768 0.183438
14.700000 0.023909 1.869513 -1.367582 0.184752 -0.206899 0.215704
14.733333 0.030056 1.862566 -1.364758 0.181442 -0.209004 0.242390
14.766667 0.036071 1.855565 -1.350234 0.178001 -0.211093 0.261988
14.800000 0.041986 1.848478 -1.334255 0.174433 -0.213178 0.273735
14.833333 0.047763 1.841339 -1.336863 0.170740 -0.215267 0.275928
14.866667 0.053398 1.834150 -1.313428 0.166935 -0.217377 0.271504
14.900000 0.058921 1.826873 -1.309376 0.163031 -0.219523 0.258412
14.933333 0.064297 1.819549 -1.301554 0.159036 -0.221709 0.243731
14.966667 0.069553 1.812134 -1.269488 0.154947 -0.223931 0.230006
15.000000 0.074657 1.804674 -1.289655 0.150766 -0.226183 0.219415
15.033333 0.079631 1.797119 -1.247910 0.146492 -0.228464 0.210810
15.066667 0.084469 1.789466 -1.273357 0.142115 -0.230752 0.215887
15.100000 0.089166 1.781713 -1.281426 0.137628 -0.233032 0.230355
15.133333 0.093717 1.773860 -1.254686 0.133022 -0.235274 0.249846
15.166667 0.098105 1.765971 -1.260835 0.128298 -0.237465 0.280814
15.200000 0.102336 1.757983 -1.288027 0.123450 -0.239571 0.319849
15.233333 0.106398 1.749963 -1.233921 0.118479 -0.241568 0.371289
15.266667 0.110292 1.741845 -1.222918 0.113390 -0.243436 0.422714
15.300000 0.114012 1.733699 -1.201244 0.108186 -0.245164 0.473766
15.333333 0.117553 1.725458 -1.184591 0.102873 -0.246759 0.527952
15.366667 0.120908 1.717123 -1.184591 0.097456 -0.248215 0.570937
15.400000 0.124082 1.708766 -1.142270 0.091937 -0.249551 0.598602
15.433333 0.127073 1.700389 -1.137500 0.086320 -0.250773 0.610415
15.466667 0.129878 1.691996 -1.128536 0.080606 -0.251896 0.603766
15.500000 0.132494 1.683589 -1.055434 0.074794 -0.252933 0.578242
15.533333 0.134921 1.675169 -1.060665 0.068880 -0.253896 0.533012
15.566667 0.137135 1.666664 -1.034446 0.062857 -0.254808 0.471707
15.600000 0.139155 1.658152 -0.986331 0.056722 -0.255675 0.398487
15.633333 0.140979 1.649635 -0.993314 0.050467 -0.256512 0.313385
15.666667 0.142576 1.641044 -0.973326 0.044079 -0.257326 0.221764
15.700000 0.143973 1.632453 -0.976446 0.037551 -0.258117 0.132094
15.733333 0.145132 1.623798 -0.976446 0.030873 -0.258871 0.040648
15.766667 0.146088 1.615148 -0.992089 0.024046 -0.259576 -0.043590
15.800000 0.146839 1.606506 -1.008007 0.017065 -0.260221 -0.113658
15.833333 0.147339 1.597816 -1.009990 0.009935 -0.260788 -0.169754
15.866667 0.147581 1.589085 -1.000746 0.002669 -0.261258 -0.208828
15.900000 0.147562 1.580320 -1.016479 -0.004714 -0.261608 -0.231673
15.933333 0.147333 1.571573 -1.025008 -0.012200 -0.261826 -0.234090
15.966667 0.146831 1.562808 -1.044555 -0.019779 -0.261893 -0.222283
16.000000 0.146052 1.554032 -1.047091 -0.027445 -0.261786 -0.201642
16.033333 0.144992 1.545251 -1.070071 -0.035189 -0.261487 -0.168381
16.066667 0.143645 1.536476 -1.089187 -0.043016 -0.260981 -0.125980
16.100000 0.142083 1.527734 -1.077799 -0.050938 -0.260259 -0.081207
16.133333 0.140305 1.519028 -1.081143 -0.058956 -0.259312 -0.032725
16.166667 0.138231 1.510350 -1.090230 -0.067068 -0.258134 0.017365
16.200000 0.135941 1.501714 -1.064535 -0.075267 -0.256730 0.066472
16.233333 0.133351 1.493126 -1.054430 -0.083541 -0.255111 0.104561
16.266667 0.130461 1.484595 -1.065272 -0.091869 -0.253291 0.131446
16.300000 0.127270 1.476132 -1.063246 -0.100222 -0.251278 0.149436
16.333333 0.123777 1.467745 -1.048685 -0.108575 -0.249077 0.153400
16.366667 0.119984 1.459445 -1.027858 -0.116907 -0.246697 0.142415
16.400000 0.115892 1.451239 -1.033331 -0.125190 -0.244143 0.116967
16.433333 0.111500 1.443136 -1.031604 -0.133411 -0.241410 0.082785
16.466667 0.106895 1.435097 -1.004428 -0.141560 -0.238502 0.037833
16.500000 0.101992 1.427179 -1.022610 -0.149626 -0.235429 -0.010392
16.533333 0.096878 1.419331 -1.006373 -0.157596 -0.232213 -0.057863
16.566667 0.091553 1.411554 -1.021986 -0.165460 -0.228878 -0.089677
16.600000 0.085935 1.403921 -1.024212 -0.173221 -0.225442 -0.091814
16.633333 0.080024 1.396437 -1.039658 -0.180874 -0.221930 -0.055454
16.666667 0.073820 1.389108 -1.023287 -0.188408 -0.218369 0.026209
16.700000 0.067326 1.381938 -1.053334 -0.195819 -0.214780 0.148443
16.733333 0.060630 1.374852 -1.088949 -0.203109 -0.211175 0.314905
16.766667 0.053646 1.367932 -1.113758 -0.210279 -0.207562 0.507882
16.800000 0.046464 1.361100 -1.107386 -0.217331 -0.203950 0.705448
16.833333 0.039086 1.354356 -1.060915 -0.224266 -0.200345 0.885910
16.866667 0.031515 1.347704 -1.023246 -0.231097 -0.196736 1.038500
16.900000 0.023752 1.341145 -0.952677 -0.237854 -0.193102 1.149563
16.933333 0.015714 1.334748 -0.837474 -0.244544 -0.189438 1.198690
16.966667 0.007405 1.328509 -0.774450 -0.251173 -0.185734 1.185212
17.000000 -0.001087 1.322369 -0.726639 -0.257737 -0.181988 1.116079
17.033333 -0.009760 1.316328 -0.666665 -0.264235 -0.178195 1.003043
17.066667 -0.018690 1.310440 -0.617362 -0.270651 -0.174361 0.849896
17.100000 -0.027869 1.304704 -0.631480 -0.276951 -0.170508 0.672299
17.133333 -0.037292 1.299119 -0.623229 -0.283115 -0.166644 0.489916
17.166667 -0.046883 1.293638 -0.653594 -0.289126 -0.162771 0.317835
17.200000 -0.056639 1.288264 -0.661453 -0.294979 -0.158890 0.161227
17.233333 -0.066617 1.283037 -0.639357 -0.300651 -0.155009 0.026410
17.266667 -0.076753 1.277918 -0.620658 -0.306136 -0.151130 -0.079462
17.300000 -0.087098 1.272948 -0.630468 -0.311432 -0.147252 -0.159821
17.333333 -0.097594 1.268087 -0.612925 -0.316544 -0.143372 -0.218307
17.366667 -0.108284 1.263378 -0.644054 -0.321468 -0.139500 -0.262072
17.400000 -0.119117 1.258780 -0.671773 -0.326196 -0.135646 -0.290173
17.433333 -0.130123 1.254338 -0.684893 -0.330735 -0.131809 -0.300037
17.466667 -0.141264 1.250009 -0.718633 -0.335081 -0.127987 -0.290098
17.500000 -0.152561 1.245840 -0.724272 -0.339234 -0.124171 -0.256154
17.533333 -0.163985 1.241785 -0.732508 -0.343188 -0.120350 -0.191735
17.566667 -0.175532 1.237845 -0.739963 -0.346943 -0.116500 -0.095605
17.600000 -0.187197 1.234021 -0.743935 -0.350501 -0.112593 0.030741
17.633333 -0.198978 1.230312 -0.744452 -0.353865 -0.108604 0.176480
17.666667 -0.210869 1.226720 -0.758073 -0.357041 -0.104517 0.332753
17.700000 -0.222866 1.223245 -0.752746 -0.360034 -0.100321 0.485206
17.733333 -0.234964 1.219886 -0.739627 -0.362856 -0.096016 0.616229
17.766667 -0.247150 1.216702 -0.689865 -0.365514 -0.091615 0.714156
17.800000 -0.259415 1.213694 -0.673158 -0.368018 -0.087134 0.766140
17.833333 -0.271754 1.210864 -0.610757 -0.370378 -0.082607 0.764798
17.866667 -0.284163 1.208212 -0.561691 -0.372604 -0.078060 0.704004
17.900000 -0.296636 1.205741 -0.506151 -0.374703 -0.073525 0.588953
17.933333 -0.309184 1.203387 -0.445988 -0.376682 -0.069026 0.421851
17.966667 -0.321788 1.201220 -0.421079 -0.378546 -0.064588 0.203570
18.000000 -0.334459 1.199168 -0.417442 -0.380301 -0.060226 -0.061989
18.033333 -0.347192 1.197233 -0.457569 -0.381945 -0.055937 -0.367306
18.066667 -0.359983 1.195412 -0.510001 -0.383480 -0.051717 -0.703558
18.100000 -0.372815 1.193785 -0.510698 -0.384903 -0.047556 -1.072723
18.133333 -0.385696 1.192272 -0.560728 -0.386212 -0.043446 -1.462121
18.166667 -0.398622 1.190872 -0.598956 -0.387403 -0.039369 -1.860105
18.200000 -0.411580 1.189660 -0.639327 -0.388477 -0.035313 -2.254390
18.233333 -0.424573 1.188560 -0.680386 -0.389433 -0.031264 -2.638293
18.266667 -0.437597 1.187570 -0.782180 -0.390275 -0.027211 -3.006274
18.300000 -0.450644 1.186757 -0.910691 -0.391003 -0.023135 -3.334290
18.333333 -0.463714 1.186054 -1.057874 -0.391620 -0.019010 -3.617326
18.366667 -0.476801 1.185458 -1.234437 -0.392127 -0.014814 -3.845474
18.400000 -0.489906 1.185035 -1.377114 -0.392524 -0.010533 -4.014189
18.433333 -0.503019 1.184718 -1.549313 -0.392807 -0.006156 -4.113380
18.466667 -0.516136 1.184505 -1.705524 -0.392971 -0.001674 -4.142032
18.500000 -0.529261 1.184467 -1.860382 -0.393010 0.002907 -4.116048
18.533333 -0.542391 1.184605 -1.988238 -0.392915 0.007570 -4.041836
18.566667 -0.555521 1.184919 -2.121338 -0.392677 0.012280 -3.932083
18.600000 -0.568644 1.185411 -2.247705 -0.392284 0.017012 -3.793094
18.633333 -0.581754 1.186081 -2.334097 -0.391727 0.021722 -3.643433
18.666667 -0.594846 1.186928 -2.471531 -0.390995 0.026356 -3.485794
18.700000 -0.607913 1.187953 -2.609013 -0.390079 0.030865 -3.318986
18.733333 -0.620947 1.189069 -2.721309 -0.388971 0.035204 -3.142617
18.766667 -0.633939 1.190361 -2.820054 -0.387664 0.039343 -2.953352
18.800000 -0.646881 1.191826 -2.923008 -0.386156 0.043249 -2.753348
18.833333 -0.659777 1.193376 -3.012933 -0.384439 0.046906 -2.530468
18.866667 -0.672606 1.195093 -3.092020 -0.382509 0.050312 -2.288353
18.900000 -0.685381 1.196890 3.100600 -0.380359 0.053469 -2.024506
18.933333 -0.698062 1.198785 3.046849 -0.377982 0.056377 -1.736928
18.966667 -0.710680 1.200755 2.976612 -0.375373 0.059042 -1.421966
19.000000 -0.723189 1.202813 2.937959 -0.372533 0.061480 -1.075023
19.033333 -0.735624 1.204940 2.902489 -0.369471 0.063703 -0.697506
19.066667 -0.747936 1.207141 2.882716 -0.366202 0.065733 -0.285822
19.100000 -0.760166 1.209407 2.869957 -0.362750 0.067590 0.150887
19.133333 -0.772258 1.211732 2.855984 -0.359143 0.069303 0.605181
19.166667 -0.784204 1.214107 2.870548 -0.355413 0.070891 1.064501
19.200000 -0.795999 1.216522 2.892072 -0.351581 0.072371 1.514174
19.233333 -0.807636 1.218971 2.970568 -0.347671 0.073757 1.934265
19.266667 -0.819112 1.221443 3.077089 -0.343705 0.075056 2.305556
19.300000 -0.830484 1.223964 -3.103061 -0.339700 0.076274 2.617912
19.333333 -0.841748 1.226532 -2.981228 -0.335660 0.077404 2.853509
19.366667 -0.852900 1.229144 -2.840731 -0.331586 0.078436 2.999847
19.400000 -0.863891 1.231804 -2.714956 -0.327480 0.079355 3.051040
19.433333 -0.874763 1.234504 -2.601302 -0.323336 0.080141 3.012144
19.466667 -0.885513 1.237240 -2.476551 -0.319139 0.080767 2.893209
19.500000 -0.896101 1.239991 -2.352119 -0.314882 0.081200 2.702486
19.533333 -0.906527 1.242747 -2.274694 -0.310565 0.081410 2.463602
19.566667 -0.916822 1.245531 -2.187954 -0.306195 0.081367 2.196099
19.600000 -0.926957 1.248298 -2.121591 -0.301775 0.081062 1.916698
19.633333 -0.936953 1.251091 -2.056390 -0.297314 0.080484 1.631750
19.666667 -0.946793 1.253841 -2.031270 -0.292823 0.079648 1.348343
19.700000 -0.956478 1.256538 -1.994312 -0.288308 0.078588 1.069069
19.733333 -0.966010 1.259169 -1.987863 -0.283765 0.077345 0.783946
19.766667 -0.975391 1.261817 -1.973002 -0.279191 0.075977 0.484157
19.800000 -0.984625 1.264375 -1.953535 -0.274579 0.074534 0.157600
19.833333 -0.993710 1.266831 -1.932149 -0.269921 0.073064 -0.204149
19.866667 -1.002649 1.269178 -1.903360 -0.265210 0.071607 -0.617131
19.900000 -1.011441 1.271407 -1.899070 -0.260435 0.070184 -1.092810
19.933333 -1.020068 1.273646 -1.926595 -0.255590 0.068798 -1.638654
19.966667 -1.028527 1.275894 -1.991025 -0.250664 0.067446 -2.253057
20.000000 -1.036816 1.278148 -2.051249 -0.245654 0.066094 -2.928210
20.033333 -1.044933 1.280408 -2.151443 -0.240552 0.064711 -3.647517
20.066667 -1.052890 1.282535 -2.265352 -0.235355 0.063263 -4.388361
20.100000 -1.060669 1.284666 -2.417640 -0.230061 0.061721 -5.115766
20.133333 -1.068268 1.286801 -2.611841 -0.224672 0.060083 -5.795695
20.166667 -1.075692 1.288807 -2.852029 -0.219188 0.058344 -6.400240
20.200000 -1.082932 1.290816 -3.081139 -0.213605 0.056526 -6.904271
20.233333 -1.089988 1.292702 2.897530 -0.207920 0.054660 -7.284739
20.266667 -1.096845 1.294408 2.588300 -0.202128 0.052767 -7.521106
20.300000 -1.103511 1.296115 2.291287 -0.196224 0.050868 -7.610180
20.333333 -1.109967 1.297650 1.991340 -0.190202 0.048986 -7.547060
20.366667 -1.116227 1.299187 1.696757 -0.184064 0.047144 -7.330714
20.400000 -1.122288 1.300724 1.423813 -0.177811 0.045367 -6.961286
20.433333 -1.128150 1.302262 1.210773 -0.171445 0.043656 -6.456605
20.466667 -1.133809 1.303802 0.981962 -0.164973 0.042020 -5.835486
20.500000 -1.139230 1.305195 0.778658 -0.158397 0.040467 -5.114662
20.533333 -1.144405 1.306446 0.585331 -0.151720 0.038990 -4.316592
20.566667 -1.149373 1.307700 0.430193 -0.144939 0.037580 -3.464539
20.600000 -1.154079 1.308824 0.307253 -0.138071 0.036248 -2.581271
20.633333 -1.158575 1.309952 0.235838 -0.131117 0.035007 -1.679087
20.666667 -1.162859 1.311085 0.207203 -0.124077 0.033871 -0.770867
20.700000 -1.166931 1.312225 0.231345 -0.116963 0.032853 0.123321
20.733333 -1.170705 1.313251 0.267949 -0.109775 0.031953 0.987839
20.766667 -1.174264 1.314286 0.334134 -0.102516 0.031176 1.805121
20.800000 -1.177607 1.315330 0.411135 -0.095161 0.030482 2.551578
20.833333 -1.180627 1.316273 0.518997 -0.087705 0.029854 3.203874
20.866667 -1.183430 1.317228 0.633396 -0.080130 0.029264 3.735685
20.900000 -1.186013 1.318197 0.799657 -0.072417 0.028689 4.133475
20.933333 -1.188378 1.319182 0.986816 -0.064554 0.028113 4.381490
20.966667 -1.190394 1.320083 1.176893 -0.056533 0.027521 4.472871
21.000000 -1.192190 1.321004 1.419031 -0.048363 0.026920 4.406985
21.033333 -1.193765 1.321944 1.599084 -0.040038 0.026298 4.194024
21.066667 -1.194986 1.322812 1.792178 -0.031573 0.025661 3.848799
21.100000 -1.195986 1.323704 1.971645 -0.022987 0.025014 3.390105
21.133333 -1.196633 1.324530 2.076217 -0.014302 0.024375 2.848507
21.166667 -1.196930 1.325293 2.147821 -0.005545 0.023757 2.250114
21.200000 -1.196881 1.325998 2.182055 0.003248 0.023186 1.631004
21.233333 -1.196612 1.326735 2.186546 0.012023 0.022700 1.016487
21.266667 -1.196125 1.327506 2.189909 0.020744 0.022323 0.433321
21.300000 -1.195304 1.328236 2.202847 0.029364 0.022088 -0.094228
21.333333 -1.194155 1.328933 2.182418 0.037847 0.022015 -0.560443
21.366667 -1.192682 1.329602 2.150781 0.046162 0.022127 -0.957085
21.400000 -1.190890 1.330253 2.090507 0.054283 0.022437 -1.285897
21.433333 -1.188886 1.330949 2.016048 0.062194 0.022950 -1.548398
21.466667 -1.186671 1.331696 1.963337 0.069882 0.023678 -1.746520
21.500000 -1.184159 1.332449 1.880672 0.077343 0.024621 -1.886981
21.533333 -1.181356 1.333218 1.795133 0.084576 0.025780 -1.967259
21.566667 -1.178348 1.334045 1.716241 0.091587 0.027151 -1.987991
21.600000 -1.175137 1.334932 1.614123 0.098396 0.028723 -1.949972
21.633333 -1.171726 1.335882 1.572168 0.105025 0.030492 -1.858987
21.666667 -1.168116 1.336897 1.489568 0.111490 0.032455 -1.715670
21.700000 -1.164255 1.337978 1.425412 0.117806 0.034606 -1.523316
21.733333 -1.160200 1.339130 1.367227 0.123996 0.036949 -1.287688
21.766667 -1.155953 1.340356 1.319473 0.130070 0.039491 -1.014960
21.800000 -1.151479 1.341680 1.285989 0.136027 0.042252 -0.714798
21.833333 -1.146820 1.343083 1.266841 0.141863 0.045247 -0.387776
21.866667 -1.141976 1.344569 1.244503 0.147570 0.048491 -0.044306
21.900000 -1.136928 1.346184 1.247208 0.153141 0.052007 0.304764
21.933333 -1.131702 1.347887 1.259495 0.158558 0.055815 0.655323
21.966667 -1.126288 1.349741 1.284916 0.163806 0.059916 1.006044
22.000000 -1.120693 1.351759 1.338652 0.168881 0.064297 1.358308
22.033333 -1.114930 1.353872 1.416859 0.173779 0.068929 1.710125
22.066667 -1.109004 1.356166 1.478119 0.178504 0.073775 2.060161
22.100000 -1.102925 1.358650 1.551971 0.183057 0.078788 2.410794
22.133333 -1.096702 1.361330 1.629211 0.187449 0.083912 2.755368
22.166667 -1.090343 1.364212 1.711244 0.191687 0.089106 3.082480
22.200000 -1.083858 1.367300 1.817393 0.195777 0.094346 3.378794
22.233333 -1.077253 1.370597 1.911126 0.199724 0.099609 3.633318
22.266667 -1.070535 1.374104 2.049780 0.203541 0.104868 3.834134
22.300000 -1.063672 1.377721 2.220888 0.207241 0.110101 3.965416
22.333333 -1.056667 1.381448 2.398251 0.210837 0.115297 4.014849
22.366667 -1.049523 1.385288 2.587541 0.214338 0.120451 3.973277
22.400000 -1.042281 1.389336 2.753448 0.217757 0.125557 3.838304
22.433333 -1.034944 1.393592 2.895520 0.221102 0.130620 3.606739
22.466667 -1.027512 1.398053 3.026187 0.224378 0.135656 3.283764
22.500000 -1.019985 1.402718 3.141145 0.227586 0.140683 2.886007
22.533333 -1.012364 1.407584 -3.059396 0.230729 0.145712 2.436324
22.566667 -1.004623 1.412568 -2.976574 0.233813 0.150730 1.958176
22.600000 -0.996766 1.417669 -2.900127 0.236842 0.155719 1.472758
22.633333 -0.988794 1.422887 -2.873538 0.239816 0.160677 1.003127
22.666667 -0.980711 1.428224 -2.863450 0.242727 0.165612 0.571064
22.700000 -0.972549 1.433812 -2.863876 0.245572 0.170520 0.190413
22.733333 -0.964310 1.439650 -2.897357 0.248340 0.175401 -0.130735
22.766667 -0.955970 1.445606 -2.926488 0.251022 0.180266 -0.384349
22.800000 -0.947531 1.451681 -2.962679 0.253607 0.185129 -0.563884
22.833333 -0.939025 1.457999 -3.005463 0.256094 0.189968 -0.669864
22.866667 -0.930427 1.464435 -3.036505 0.258489 0.194747 -0.711608
22.900000 -0.921741 1.470989 -3.084524 0.260794 0.199445 -0.696175
22.933333 -0.912970 1.477659 -3.129004 0.263011 0.204055 -0.636337
22.966667 -0.904145 1.484565 3.125958 0.265145 0.208565 -0.545945
23.000000 -0.895259 1.491643 3.125923 0.267198 0.212961 -0.442120
23.033333 -0.886317 1.498891 3.120639 0.269173 0.217247 -0.338495
23.066667 -0.877303 1.506253 3.124166 0.271069 0.221433 -0.243816
23.100000 -0.868220 1.513728 3.119449 0.272888 0.225524 -0.170408
23.133333 -0.859071 1.521316 3.119301 0.274631 0.229514 -0.120041
23.166667 -0.849875 1.529064 3.131840 0.276300 0.233411 -0.094305
23.200000 -0.840619 1.536921 3.135553 0.277892 0.237225 -0.088382
23.233333 -0.831308 1.544889 -3.132301 0.279404 0.240972 -0.098406
23.266667 -0.821943 1.552964 3.140812 0.280832 0.244668 -0.116603
23.300000 -0.812538 1.561187 3.126067 0.282173 0.248322 -0.132633
23.333333 -0.803094 1.569554 3.113570 0.283424 0.251943 -0.145278
23.366667 -0.793606 1.578025 3.110174 0.284584 0.255537 -0.149699
23.400000 -0.784079 1.586599 3.088379 0.285651 0.259106 -0.143861
23.433333 -0.774520 1.595309 3.067301 0.286626 0.262643 -0.124184
23.466667 -0.764927 1.604119 3.077738 0.287511 0.266139 -0.094361
23.500000 -0.755308 1.613058 3.073740 0.288306 0.269591 -0.059841
23.533333 -0.745666 1.622123 3.074285 0.289011 0.272994 -0.019875
23.566667 -0.736000 1.631282 3.084484 0.289627 0.276342 0.020862
23.600000 -0.726316 1.640559 3.082286 0.290155 0.279626 0.057965
23.633333 -0.716616 1.649952 3.095561 0.290597 0.282840 0.084074
23.666667 -0.706904 1.659455 3.084419 0.290953 0.285978 0.101072
23.700000 -0.697181 1.669067 3.092564 0.291223 0.289032 0.110209
23.733333 -0.687451 1.678784 3.101299 0.291409 0.291997 0.110203
23.766667 -0.677716 1.688583 3.111036 0.291511 0.294866 0.103768
23.800000 -0.667979 1.698479 3.118219 0.291529 0.297635 0.092020
23.833333 -0.658243 1.708468 3.121240 0.291463 0.300300 0.080351
23.866667 -0.648509 1.718546 3.122896 0.291310 0.302860 0.068092
23.900000 -0.638782 1.728708 3.116620 0.291071 0.305312 0.056147
23.933333 -0.629064 1.738951 3.125776 0.290742 0.307656 0.045783
23.966667 -0.619358 1.749271 3.117513 0.290323 0.309892 0.039304
24.000000 -0.609667 1.759663 3.114571 0.289811 0.312018 0.036882
24.033333 -0.599994 1.770125 3.123736 0.289206 0.314034 0.038324
24.066667 -0.590342 1.780652 3.117959 0.288505 0.315940 0.044057
24.100000 -0.580714 1.791239 3.115775 0.287709 0.317741 0.053094
24.133333 -0.571112 1.801884 3.128529 0.286814 0.319447 0.065736
24.166667 -0.561545 1.812583 3.122341 0.285820 0.321074 0.077792
24.200000 -0.552015 1.823334 3.135659 0.284724 0.322642 0.088095
24.233333 -0.542521 1.834129 3.135220 0.283523 0.324171 0.095339
24.266667 -0.533070 1.844972 3.129461 0.282216 0.325685 0.097034
24.300000 -0.523660 1.855851 3.141472 0.280801 0.327201 0.092692
24.333333 -0.514295 1.866763 3.140376 0.279276 0.328732 0.083204
24.366667 -0.504983 1.877714 -3.132823 0.277641 0.330284 0.068009
24.400000 -0.495726 1.888702 -3.118361 0.275898 0.331851 0.048076
24.433333 -0.486533 1.899770 -3.121724 0.274048 0.333426 0.022853
24.466667 -0.477406 1.910916 -3.120701 0.272093 0.334988 -0.005122
24.500000 -0.468348 1.922134 -3.124698 0.270038 0.336507 -0.035277
24.533333 -0.459363 1.933420 -3.127246 0.267888 0.337942 -0.067511
24.566667 -0.450449 1.944728 -3.132543 0.265650 0.339254 -0.099440
24.600000 -0.441613 1.956096 -3.139326 0.263328 0.340403 -0.128898
24.633333 -0.432859 1.967520 -3.141388 0.260929 0.341350 -0.151800
24.666667 -0.424190 1.978994 -3.140342 0.258455 0.342066 -0.169325
24.700000 -0.415602 1.990478 3.130206 0.255909 0.342531 -0.176871
24.733333 -0.407100 2.001969 3.122733 0.253291 0.342746 -0.176862
24.766667 -0.398685 2.013463 3.102196 0.250602 0.342713 -0.165945
24.800000 -0.390361 2.024959 3.111401 0.247842 0.342450 -0.145977
24.833333 -0.382128 2.036421 3.087285 0.245008 0.341978 -0.119169
24.866667 -0.373990 2.047847 3.101959 0.242099 0.341327 -0.085794
24.900000 -0.365950 2.059232 3.077861 0.239113 0.340524 -0.050011
24.933333 -0.358011 2.070573 3.069035 0.236049 0.339593 -0.009061
24.966667 -0.350175 2.081899 3.086521 0.232905 0.338550 0.029923
25.000000 -0.342446 2.093171 3.090798 0.229680 0.337413 0.068607
25.033333 -0.334828 2.104386 3.107227 0.226371 0.336194 0.104245
25.066667 -0.327320 2.115578 3.102971 0.222978 0.334900 0.138669
25.100000 -0.319925 2.126743 3.107684 0.219498 0.333540 0.169734
25.133333 -0.312647 2.137878 3.112448 0.215930 0.332124 0.192945
25.166667 -0.305486 2.148982 3.118089 0.212272 0.330661 0.212848
25.200000 -0.298450 2.160007 3.127749 0.208520 0.329160 0.225847
25.233333 -0.291541 2.170951 3.132007 0.204673 0.327626 0.232390
25.266667 -0.284762 2.181809 -3.137694 0.200728 0.326068 0.230353
25.300000 -0.278109 2.192623 -3.136489 0.196684 0.324492 0.220648
25.333333 -0.271601 2.203404 -3.119074 0.192539 0.322902 0.205277
25.366667 -0.265225 2.214136 -3.095639 0.188297 0.321300 0.181923
25.400000 -0.258997 2.224828 -3.091143 0.183960 0.319682 0.152888
25.433333 -0.252923 2.235474 -3.084535 0.179533 0.318041 0.119393
25.466667 -0.246986 2.246064 -3.092323 0.175020 0.316358 0.083010
25.500000 -0.241205 2.256601 -3.089932 0.170429 0.314618 0.046985
25.533333 -0.235584 2.267083 -3.092699 0.165764 0.312804 0.013602
25.566667 -0.230126 2.277505 -3.098810 0.161026 0.310899 -0.014470
25.600000 -0.224832 2.287862 -3.088306 0.156220 0.308894 -0.036915
25.633333 -0.219707 2.298150 -3.100722 0.151352 0.306784 -0.051014
25.666667 -0.214729 2.308366 -3.106685 0.146427 0.304568 -0.057573
25.700000 -0.209901 2.318506 -3.101290 0.141448 0.302247 -0.060268
25.733333 -0.205249 2.328566 -3.107155 0.136418 0.299822 -0.058933
25.766667 -0.200774 2.338542 -3.113627 0.131342 0.297296 -0.055336
25.800000 -0.196481 2.348429 -3.117284 0.126220 0.294668 -0.047991
25.833333 -0.192343 2.358231 -3.105069 0.121044 0.291937 -0.044289
25.866667 -0.188391 2.367936 -3.114629 0.115811 0.289103 -0.043071
25.900000 -0.184627 2.377541 -3.121542 0.110520 0.286165 -0.040668
25.933333 -0.181021 2.387053 -3.115553 0.105166 0.283119 -0.041268
25.966667 -0.177575 2.396469 -3.111121 0.099746 0.279966 -0.043977
26.000000 -0.174324 2.405774 -3.115510 0.094263 0.276707 -0.049649
26.033333 -0.171233 2.414978 -3.120956 0.088728 0.273349 -0.050047
26.066667 -0.168341 2.424063 -3.115056 0.083146 0.269894 -0.046196
26.100000 -0.165650 2.433025 -3.126287 0.077519 0.266346 -0.040235
26.133333 -0.163163 2.441859 -3.110796 0.071856 0.262710 -0.029181
26.166667 -0.160880 2.450561 -3.140482 0.066170 0.258993 -0.010289
26.200000 -0.158761 2.459152 -3.137128 0.060460 0.255193 0.014767
26.233333 -0.156852 2.467604 -3.131523 0.054721 0.251307 0.040676
26.266667 -0.155155 2.475912 3.137735 0.048951 0.247331 0.068369
26.300000 -0.153622 2.484103 -3.139024 0.043152 0.243265 0.095860
26.333333 -0.152254 2.492176 -3.110850 0.037323 0.239109 0.123168
26.366667 -0.151052 2.500129 -3.118077 0.031455 0.234859 0.142931
26.400000 -0.150067 2.507924 -3.100261 0.025560 0.230524 0.150781
26.433333 -0.149303 2.515558 -3.101255 0.019654 0.226116 0.150453
26.466667 -0.148761 2.523027 -3.101564 0.013762 0.221657 0.138811
26.500000 -0.148382 2.530369 -3.089587 0.007906 0.217163 0.117971
26.533333 -0.148228 2.537539 -3.060322 0.002105 0.212650 0.086048
26.566667 -0.148300 2.544532 -3.080118 -0.003612 0.208137 0.049852
26.600000 -0.148599 2.551346 -3.071953 -0.009227 0.203640 0.016075
26.633333 -0.149060 2.558026 -3.081400 -0.014737 0.199160 -0.015255
26.666667 -0.149682 2.564574 -3.064682 -0.020151 0.194690 -0.043628
26.700000 -0.150464 2.570987 -3.078932 -0.025480 0.190221 -0.066418
26.733333 -0.151406 2.577264 -3.094262 -0.030729 0.185752 -0.076449
26.766667 -0.152505 2.583405 -3.099448 -0.035916 0.181269 -0.078872
26.800000 -0.153762 2.589407 -3.105147 -0.041073 0.176750 -0.074215
26.833333 -0.155175 2.595271 -3.109746 -0.046212 0.172185 -0.061955
26.866667 -0.156821 2.600931 -3.110213 -0.051342 0.167567 -0.038830
26.900000 -0.158620 2.606449 -3.103999 -0.056474 0.162890 -0.009336
26.933333 -0.160573 2.611827 -3.107731 -0.061618 0.158144 0.011368
26.966667 -0.162760 2.616992 -3.099825 -0.066773 0.153331 0.017723
27.000000 -0.165096 2.622015 -3.109868 -0.071916 0.148468 0.001918
27.033333 -0.167581 2.626895 -3.109868 -0.077041 0.143557 -0.056538
27.066667 -0.170212 2.631632 -3.087112 -0.082136 0.138603 -0.172600
27.100000 -0.172988 2.636224 -3.095060 -0.087189 0.133610 -0.352815
27.133333 -0.176002 2.640590 -3.097736 -0.092183 0.128589 -0.589793
27.166667 -0.179156 2.644812 -3.057174 -0.097119 0.123531 -0.876034
27.200000 -0.182548 2.648802 -3.066620 -0.101998 0.118424 -1.201525
27.233333 -0.186077 2.652646 -3.069275 -0.106807 0.113283 -1.533428
27.266667 -0.189742 2.656346 3.134162 -0.111534 0.108118 -1.837297
27.300000 -0.193539 2.659901 3.043818 -0.116167 0.102942 -2.086292
27.333333 -0.197468 2.663311 2.958002 -0.120715 0.097743 -2.259849
27.366667 -0.201617 2.666433 2.785085 -0.125160 0.092549 -2.330530
27.400000 -0.205892 2.669411 2.637159 -0.129503 0.087365 -2.280927
27.433333 -0.210292 2.672245 2.518683 -0.133752 0.082183 -2.111718
27.466667 -0.214813 2.674935 2.414557 -0.137918 0.076996 -1.835046
27.500000 -0.219535 2.677354 2.351382 -0.142007 0.071799 -1.468660
27.533333 -0.224374 2.679629 2.307518 -0.146009 0.066606 -1.031884
27.566667 -0.229326 2.681763 2.307939 -0.149936 0.061395 -0.566410
27.600000 -0.234391 2.683756 2.309140 -0.153789 0.056164 -0.105038
27.633333 -0.239564 2.685609 2.328706 -0.157567 0.050904 0.326657
27.666667 -0.244905 2.687208 2.362754 -0.161268 0.045609 0.702928
27.700000 -0.250349 2.688669 2.409894 -0.164894 0.040268 1.013373
27.733333 -0.255946 2.689887 2.477773 -0.168446 0.034884 1.245064
27.766667 -0.261640 2.690968 2.530256 -0.171915 0.029470 1.407760
27.800000 -0.267429 2.691914 2.612980 -0.175292 0.024038 1.500302
27.833333 -0.273350 2.692630 2.667176 -0.178563 0.018621 1.527526
27.866667 -0.279395 2.693123 2.732577 -0.181715 0.013249 1.500382
27.900000 -0.285527 2.693485 2.776580 -0.184733 0.007954 1.424536
27.933333 -0.291769 2.693636 2.850178 -0.187609 0.002746 1.312168
27.966667 -0.298114 2.693583 2.901699 -0.190330 -0.002350 1.164926
28.000000 -0.304555 2.693336 2.919543 -0.192885 -0.007302 1.002130
28.033333 -0.311069 2.692964 2.966677 -0.195269 -0.012103 0.831062
28.066667 -0.317653 2.692471 2.978092 -0.197484 -0.016749 0.663535
28.100000 -0.324311 2.691807 3.014788 -0.199529 -0.021230 0.505061
28.133333 -0.331036 2.690979 3.012600 -0.201405 -0.025530 0.363754
28.166667 -0.337822 2.690035 3.017757 -0.203121 -0.029650 0.246894
28.200000 -0.344659 2.688945 2.995332 -0.204684 -0.033601 0.150169
28.233333 -0.351540 2.687717 2.989925 -0.206100 -0.037384 0.076630
28.266667 -0.358457 2.686361 2.987493 -0.207368 -0.040991 0.020912
28.300000 -0.365402 2.684884 2.983632 -0.208484 -0.044423 -0.016823
28.333333 -0.372391 2.683304 2.991106 -0.209448 -0.047682 -0.045638
28.366667 -0.379421 2.681623 2.995581 -0.210252 -0.050764 -0.069414
28.400000 -0.386488 2.679842 2.989291 -0.210893 -0.053669 -0.091738
28.433333 -0.393589 2.677966 2.993342 -0.211361 -0.056397 -0.115858
28.466667 -0.400680 2.676009 2.992916 -0.211652 -0.058953 -0.141923
28.500000 -0.407799 2.673960 2.990451 -0.211761 -0.061342 -0.169757
28.533333 -0.414893 2.671844 2.980448 -0.211684 -0.063566 -0.194155
28.566667 -0.422009 2.669643 2.975398 -0.211424 -0.065632 -0.215709
28.600000 -0.429087 2.667388 2.960983 -0.210981 -0.067541 -0.231619
28.633333 -0.436122 2.665086 2.943190 -0.210371 -0.069300 -0.241472
28.666667 -0.443168 2.662706 2.921471 -0.209602 -0.070915 -0.242474
28.700000 -0.450162 2.660290 2.919493 -0.208692 -0.072393 -0.235930
28.733333 -0.457162 2.657802 2.905385 -0.207646 -0.073736 -0.222111
28.766667 -0.464100 2.655288 2.913839 -0.206477 -0.074949 -0.199327
28.800000 -0.470974 2.652754 2.905347 -0.205192 -0.076038 -0.166855
28.833333 -0.477779 2.650203 2.909795 -0.203796 -0.077008 -0.125045
28.866667 -0.484578 2.647589 2.902085 -0.202300 -0.077866 -0.077672
28.900000 -0.491304 2.644966 2.884661 -0.200707 -0.078618 -0.024029
28.933333 -0.498020 2.642284 2.875787 -0.199033 -0.079275 0.031222
28.966667 -0.504660 2.639598 2.871383 -0.197291 -0.079850 0.086891
29.000000 -0.511224 2.636907 2.879066 -0.195487 -0.080349 0.138287
29.033333 -0.517713 2.634214 2.889166 -0.193632 -0.080782 0.183101
29.066667 -0.524126 2.631518 2.905610 -0.191742 -0.081165 0.218795
29.100000 -0.530465 2.628820 2.916015 -0.189832 -0.081513 0.241633
29.133333 -0.536779 2.626077 2.935130 -0.187916 -0.081838 0.251630
29.166667 -0.543020 2.623333 2.957742 -0.186000 -0.082147 0.245144
29.200000 -0.549185 2.620589 2.971587 -0.184095 -0.082449 0.225137
29.233333 -0.555274 2.617846 2.979916 -0.182206 -0.082748 0.193749
29.266667 -0.561287 2.615106 2.973892 -0.180327 -0.083040 0.155255
29.300000 -0.567267 2.612330 2.971478 -0.178455 -0.083321 0.112376
29.333333 -0.573170 2.609558 2.972562 -0.176588 -0.083592 0.071015
29.366667 -0.579035 2.606753 2.977876 -0.174728 -0.083855 0.036559
29.400000 -0.584862 2.603917 2.977583 -0.172875 -0.084111 0.009613
29.433333 -0.590612 2.601089 2.982583 -0.171028 -0.084360 -0.011897
29.466667 -0.596283 2.598268 2.977021 -0.169185 -0.084598 -0.026848
29.500000 -0.601877 2.595457 2.957955 -0.167346 -0.084825 -0.036859
29.533333 -0.607394 2.592656 2.966556 -0.165505 -0.085033 -0.047427
29.566667 -0.612864 2.589832 2.972802 -0.163658 -0.085217 -0.057252
29.600000 -0.618286 2.586987 2.963068 -0.161805 -0.085373 -0.068231
29.633333 -0.623659 2.584122 2.956742 -0.159943 -0.085497 -0.073832
29.666667 -0.628981 2.581238 2.976462 -0.158072 -0.085587 -0.079052
29.700000 -0.634228 2.578368 2.961050 -0.156189 -0.085638 -0.078277
29.733333 -0.639422 2.575482 2.964155 -0.154290 -0.085645 -0.068980
29.766667 -0.644541 2.572610 2.944878 -0.152372 -0.085602 -0.053394
29.800000 -0.649588 2.569753 2.962103 -0.150434 -0.085514 -0.030096
29.833333 -0.654564 2.566909 2.921204 -0.148478 -0.085383 -0.002766
29.866667 -0.659482 2.564056 2.925775 -0.146511 -0.085217 0.032580
29.900000 -0.664330 2.561217 2.947850 -0.144538 -0.085023 0.068226
29.933333 -0.669111 2.558391 2.927403 -0.142565 -0.084814 0.106049
29.966667 -0.673830 2.555560 2.952978 -0.140600 -0.084598 0.141292
30.000000 -0.678482 2.552742 2.962019 -0.138645 -0.084376 0.173736
30.033333 -0.683069 2.549936 2.974229 -0.136700 -0.084148 0.198257
30.066667 -0.687592 2.547143 2.980965 -0.134764 -0.083916 0.211943
30.100000 -0.692050 2.544349 2.987260 -0.132834 -0.083680 0.219350
30.133333 -0.696440 2.541555 2.996740 -0.130906 -0.083436 0.213163
30.166667 -0.700769 2.538772 2.999775 -0.128974 -0.083183 0.197898
30.200000 -0.705037 2.536000 3.007989 -0.127033 -0.082924 0.171914
30.233333 -0.709243 2.533238 3.014558 -0.125076 -0.082657 0.137602
