t x y theta dxdt dydt dthetadt
0.000000 0.000000 0.000000 -1.372191 0.020858 -0.103290 -1.172549
0.033333 0.000631 -0.003667 -1.407648 0.023238 -0.097508 -0.890433
0.066667 0.001411 -0.007044 -1.425282 0.025771 -0.090501 -0.619959
0.100000 0.002234 -0.010231 -1.440653 0.028442 -0.082238 -0.372516
0.133333 0.003246 -0.012971 -1.449427 0.031240 -0.072688 -0.151266
0.166667 0.004300 -0.015507 -1.425208 0.034132 -0.061904 0.048933
0.200000 0.005552 -0.017474 -1.396652 0.037085 -0.049840 0.233034
0.233333 0.006846 -0.019225 -1.375242 0.040047 -0.036478 0.409163
0.266667 0.008184 -0.020753 -1.345384 0.042981 -0.021761 0.600612
0.300000 0.009702 -0.021541 -1.332253 0.045823 -0.005782 0.835431
0.333333 0.011262 -0.022094 -1.323560 0.048531 0.011422 1.136433
0.366667 0.012957 -0.021784 -1.305688 0.051067 0.029802 1.517347
0.400000 0.014774 -0.020550 -1.296373 0.053409 0.049162 1.986267
0.433333 0.016706 -0.018320 -1.286961 0.055540 0.069137 2.549144
0.466667 0.018679 -0.015841 -1.233049 0.057442 0.089321 3.180958
0.500000 0.020692 -0.013109 -1.114438 0.059127 0.109519 3.835480
0.533333 0.022761 -0.009221 -0.998803 0.060590 0.129440 4.466530
0.566667 0.024856 -0.004149 -0.885908 0.061846 0.148820 5.029203
0.600000 0.026934 0.002135 -0.631571 0.062917 0.167534 5.479121
0.633333 0.029048 0.008674 -0.316062 0.063847 0.185713 5.767881
0.666667 0.031199 0.015466 -0.007324 0.064684 0.203430 5.870487
0.700000 0.033385 0.022509 0.292198 0.065472 0.220588 5.785058
0.733333 0.035605 0.029802 0.506758 0.066270 0.237281 5.522404
0.766667 0.037859 0.037342 0.717233 0.067126 0.253709 5.100872
0.800000 0.040082 0.045941 0.892912 0.068081 0.270026 4.558417
0.833333 0.042298 0.055575 1.036762 0.069160 0.286153 3.945694
0.866667 0.044545 0.065448 1.135611 0.070384 0.302076 3.311645
0.900000 0.046822 0.075556 1.178583 0.071766 0.317848 2.701063
0.933333 0.049178 0.086588 1.223777 0.073296 0.333302 2.143364
0.966667 0.051646 0.098490 1.269108 0.074966 0.348160 1.662477
1.000000 0.054142 0.110611 1.296927 0.076758 0.362198 1.267583
1.033333 0.056665 0.122945 1.321988 0.078653 0.375381 0.956193
1.066667 0.059350 0.136009 1.332648 0.080632 0.387640 0.720386
1.100000 0.062059 0.149272 1.341784 0.082691 0.398919 0.542663
1.133333 0.064936 0.163170 1.349414 0.084841 0.409290 0.409987
1.166667 0.067834 0.177252 1.359690 0.087083 0.418898 0.311905
1.200000 0.070753 0.191510 1.362224 0.089419 0.427829 0.237096
1.233333 0.073690 0.205937 1.368586 0.091855 0.436102 0.177866
1.266667 0.076644 0.220523 1.375722 0.094401 0.443803 0.127455
1.300000 0.079772 0.235488 1.375477 0.097037 0.450974 0.083162
1.333333 0.083065 0.250783 1.386494 0.099736 0.457644 0.045478
1.366667 0.086370 0.266212 1.384710 0.102477 0.463807 0.012394
1.400000 0.089835 0.281908 1.388639 0.105220 0.469455 -0.017493
1.433333 0.093462 0.297835 1.388997 0.107915 0.474561 -0.043933
1.466667 0.097224 0.313946 1.367976 0.110489 0.479064 -0.065991
1.500000 0.100989 0.330155 1.363007 0.112897 0.482945 -0.082714
1.533333 0.104876 0.346493 1.364147 0.115093 0.486191 -0.094709
1.566667 0.108761 0.362910 1.358035 0.117029 0.488789 -0.101425
1.600000 0.112735 0.379386 1.366925 0.118686 0.490754 -0.103373
1.633333 0.116786 0.395880 1.353321 0.120052 0.492142 -0.101533
1.666667 0.120929 0.412387 1.350977 0.121137 0.493002 -0.099642
1.700000 0.125059 0.428935 1.340174 0.121934 0.493358 -0.096715
1.733333 0.129173 0.445515 1.341282 0.122450 0.493224 -0.092463
1.766667 0.133331 0.462015 1.346540 0.122691 0.492621 -0.089345
1.800000 0.137467 0.478527 1.346965 0.122658 0.491530 -0.086353
1.833333 0.141629 0.494919 1.335506 0.122356 0.489914 -0.083227
1.866667 0.145763 0.511306 1.331290 0.121793 0.487734 -0.077884
1.900000 0.149867 0.527678 1.328984 0.120984 0.484987 -0.073429
1.933333 0.153936 0.544025 1.327516 0.119930 0.481627 -0.071634
1.966667 0.157968 0.560340 1.324411 0.118628 0.477551 -0.069386
2.000000 0.161953 0.576346 1.318354 0.117069 0.472692 -0.067162
2.033333 0.165862 0.592029 1.319767 0.115231 0.466938 -0.067642
2.066667 0.169725 0.607654 1.326990 0.113098 0.460235 -0.068565
2.100000 0.173540 0.623212 1.319355 0.110629 0.452447 -0.068299
2.133333 0.177249 0.638328 1.314003 0.107791 0.443502 -0.066116
2.166667 0.180903 0.653362 1.321749 0.104544 0.433381 -0.065741
2.200000 0.184426 0.667878 1.313658 0.100866 0.422086 -0.065388
2.233333 0.187889 0.682297 1.305014 0.096753 0.409686 -0.062353
2.266667 0.191196 0.696142 1.299868 0.092203 0.396256 -0.061988
2.300000 0.194319 0.709362 1.304529 0.087263 0.382019 -0.062810
2.333333 0.197224 0.721908 1.291559 0.082002 0.367240 -0.063916
2.366667 0.199886 0.733732 1.288707 0.076515 0.352267 -0.060987
2.400000 0.202477 0.745431 1.319043 0.070900 0.337416 -0.059484
2.433333 0.204765 0.756350 1.306076 0.065262 0.323035 -0.058811
2.466667 0.206769 0.766539 1.296013 0.059708 0.309437 -0.055011
2.500000 0.208505 0.776090 1.287465 0.054322 0.296839 -0.050019
2.533333 0.210011 0.785116 1.292778 0.049181 0.285399 -0.045741
2.566667 0.211440 0.794003 1.288828 0.044328 0.275162 -0.044827
2.600000 0.212792 0.802750 1.269557 0.039792 0.266203 -0.039411
2.633333 0.214066 0.811356 1.287707 0.035562 0.258489 -0.033368
2.666667 0.215147 0.819696 1.279817 0.031599 0.251971 -0.026783
2.700000 0.216033 0.827833 1.288443 0.027845 0.246601 -0.020696
2.733333 0.216841 0.835827 1.286968 0.024216 0.242304 -0.012424
2.766667 0.217569 0.843677 1.294796 0.020637 0.239051 -0.000715
2.800000 0.218217 0.851384 1.280869 0.017032 0.236801 0.013877
2.833333 0.218786 0.858947 1.281402 0.013327 0.235609 0.037683
2.866667 0.219275 0.866365 1.278712 0.009468 0.235484 0.072798
2.900000 0.219595 0.873916 1.282217 0.005403 0.236387 0.123389
2.933333 0.219735 0.881650 1.280313 0.001085 0.238296 0.190628
2.966667 0.219795 0.889239 1.288861 -0.003513 0.241117 0.272906
3.000000 0.219660 0.897117 1.286346 -0.008384 0.244654 0.364534
3.033333 0.219345 0.905341 1.287156 -0.013479 0.248585 0.459275
3.066667 0.218953 0.913418 1.296799 -0.018763 0.252611 0.551513
3.100000 0.218325 0.921924 1.323084 -0.024177 0.256388 0.635388
3.133333 0.217425 0.930831 1.369041 -0.029643 0.259498 0.702544
3.166667 0.216248 0.940077 1.405568 -0.035090 0.261471 0.751561
3.200000 0.214998 0.949169 1.442613 -0.040482 0.261953 0.779287
3.233333 0.213467 0.958403 1.471431 -0.045800 0.260692 0.785420
3.266667 0.211663 0.967663 1.513803 -0.050980 0.257473 0.769403
3.300000 0.209792 0.976761 1.532529 -0.055974 0.252140 0.730564
3.333333 0.207855 0.985694 1.564117 -0.060755 0.244590 0.667332
3.366667 0.205855 0.994459 1.571710 -0.065305 0.234931 0.568241
3.400000 0.203625 1.002740 1.588024 -0.069590 0.223125 0.419136
3.433333 0.201185 1.010395 1.602452 -0.073589 0.209044 0.199295
3.466667 0.198545 1.017277 1.625558 -0.077322 0.192617 -0.111682
3.500000 0.195717 1.023220 1.646950 -0.080785 0.173989 -0.529778
3.533333 0.192839 1.028989 1.654491 -0.083965 0.153352 -1.059886
3.566667 0.189912 1.034586 1.657250 -0.086834 0.130678 -1.690811
3.600000 0.186942 1.040012 1.666563 -0.089376 0.106062 -2.395867
3.633333 0.183873 1.043853 1.628182 -0.091566 0.079895 -3.129294
3.666667 0.180730 1.045965 1.550948 -0.093386 0.052582 -3.842380
3.700000 0.177552 1.047914 1.380493 -0.094812 0.024199 -4.482693
3.733333 0.174309 1.048038 1.133841 -0.095819 -0.004931 -4.999507
3.766667 0.170983 1.046341 0.840707 -0.096397 -0.034110 -5.350693
3.800000 0.167631 1.044500 0.546222 -0.096508 -0.062600 -5.505604
3.833333 0.164257 1.042524 0.273449 -0.096080 -0.090046 -5.460706
3.866667 0.160873 1.038971 0.027508 -0.095033 -0.116183 -5.219744
3.900000 0.157555 1.033924 -0.176383 -0.093351 -0.140390 -4.805863
3.933333 0.154401 1.027476 -0.343251 -0.091038 -0.162339 -4.262530
3.966667 0.151238 1.020938 -0.421569 -0.088100 -0.182096 -3.646431
4.000000 0.148068 1.014326 -0.516401 -0.084584 -0.199695 -3.010660
4.033333 0.145290 1.006578 -0.588887 -0.080648 -0.214870 -2.397951
4.066667 0.142511 0.998784 -0.624962 -0.076442 -0.227471 -1.846500
4.100000 0.139734 0.990959 -0.647804 -0.072073 -0.237670 -1.383480
4.133333 0.137458 0.982400 -0.663929 -0.067658 -0.245657 -1.016668
4.166667 0.135667 0.973280 -0.666608 -0.063345 -0.251441 -0.732927
4.200000 0.133884 0.964177 -0.675070 -0.059284 -0.255015 -0.519938
4.233333 0.132111 0.955107 -0.666630 -0.055513 -0.256597 -0.358473
4.266667 0.130348 0.946088 -0.680443 -0.052065 -0.256142 -0.218843
4.300000 0.128598 0.937136 -0.691766 -0.048972 -0.253333 -0.063542
4.333333 0.127191 0.928560 -0.690820 -0.046224 -0.247891 0.141244
4.366667 0.125799 0.920084 -0.696004 -0.043734 -0.239482 0.419275
4.400000 0.124422 0.911724 -0.697851 -0.041426 -0.227846 0.787851
4.433333 0.123062 0.903495 -0.720099 -0.039256 -0.212638 1.252103
4.466667 0.121718 0.895414 -0.733999 -0.037201 -0.193818 1.794273
4.500000 0.120392 0.887496 -0.715355 -0.035251 -0.171522 2.382077
4.533333 0.119299 0.881276 -0.662772 -0.033402 -0.145777 2.972879
4.566667 0.118224 0.875248 -0.559088 -0.031682 -0.116756 3.522510
4.600000 0.117289 0.871222 -0.385675 -0.030103 -0.084851 3.987684
4.633333 0.116444 0.869275 -0.158046 -0.028680 -0.050506 4.332203
4.666667 0.115620 0.867555 0.100045 -0.027415 -0.014017 4.533206
4.700000 0.114797 0.867938 0.355631 -0.026296 0.024128 4.578689
4.733333 0.113946 0.870408 0.587712 -0.025292 0.063337 4.474027
4.766667 0.113116 0.873125 0.750207 -0.024376 0.102921 4.235123
4.800000 0.112307 0.876091 0.863446 -0.023502 0.142476 3.893105
4.833333 0.111494 0.880958 0.971990 -0.022611 0.181606 3.482091
4.866667 0.110700 0.887631 1.025013 -0.021639 0.219836 3.044281
4.900000 0.109935 0.896047 1.098867 -0.020528 0.256874 2.616873
4.933333 0.109220 0.906102 1.159664 -0.019260 0.292472 2.227964
4.966667 0.108578 0.917677 1.227173 -0.017817 0.326423 1.891976
5.000000 0.107959 0.929497 1.277976 -0.016198 0.358383 1.609829
5.033333 0.107406 0.942606 1.330353 -0.014427 0.388046 1.380657
5.066667 0.106935 0.956881 1.370689 -0.012543 0.415200 1.190362
5.100000 0.106487 0.971379 1.403565 -0.010591 0.439738 1.026849
5.133333 0.106145 0.986808 1.431204 -0.008610 0.461651 0.880422
5.166667 0.105907 1.003046 1.444153 -0.006645 0.481052 0.748300
5.200000 0.105765 1.020021 1.461897 -0.004746 0.498021 0.629846
5.233333 0.105712 1.037632 1.485781 -0.002954 0.512665 0.522270
5.266667 0.105679 1.055415 1.499815 -0.001298 0.525135 0.426990
5.300000 0.105716 1.073622 1.510990 0.000191 0.535445 0.345868
5.333333 0.105815 1.092152 1.514254 0.001490 0.543597 0.277494
5.366667 0.105934 1.110819 1.525152 0.002583 0.549569 0.218892
5.400000 0.106071 1.129608 1.533049 0.003467 0.553440 0.168634
5.433333 0.106240 1.148489 1.524066 0.004146 0.555329 0.126766
5.466667 0.106426 1.167468 1.533559 0.004617 0.555288 0.092245
5.500000 0.106628 1.186531 1.530083 0.004888 0.553419 0.063899
5.533333 0.106841 1.205426 1.530708 0.004967 0.549820 0.041296
5.566667 0.107061 1.224071 1.533757 0.004865 0.544652 0.024970
5.600000 0.107266 1.242397 1.535205 0.004603 0.538142 0.014498
5.633333 0.107444 1.260323 1.534969 0.004200 0.530483 0.008068
5.666667 0.107634 1.278271 1.531788 0.003686 0.521955 0.005786
5.700000 0.107770 1.295691 1.530458 0.003104 0.512946 0.006114
5.733333 0.107854 1.312543 1.534517 0.002497 0.503839 0.008571
5.766667 0.107949 1.329382 1.525911 0.001889 0.494827 0.011833
5.800000 0.107976 1.345527 1.530132 0.001300 0.486053 0.015381
5.833333 0.107926 1.360901 1.531648 0.000749 0.477647 0.019773
5.866667 0.107886 1.376234 1.532332 0.000249 0.469687 0.023915
5.900000 0.107855 1.391517 1.533762 -0.000221 0.461988 0.027858
5.933333 0.107833 1.406740 1.539579 -0.000692 0.454295 0.031649
5.966667 0.107819 1.421894 1.539189 -0.001184 0.446448 0.035894
6.000000 0.107814 1.436972 1.539326 -0.001744 0.438093 0.040117
6.033333 0.107817 1.451964 1.540926 -0.002429 0.428789 0.043773
6.066667 0.107828 1.466861 1.545774 -0.003298 0.418096 0.045752
6.100000 0.107687 1.480547 1.530279 -0.004360 0.405925 0.038823
6.133333 0.107553 1.494123 1.540850 -0.005636 0.392109 0.007240
6.166667 0.107427 1.507581 1.548366 -0.007151 0.376491 -0.069423
6.200000 0.107307 1.520915 1.547830 -0.008888 0.359200 -0.215469
6.233333 0.107011 1.532840 1.550752 -0.010809 0.340534 -0.455869
6.266667 0.106722 1.544629 1.558642 -0.012892 0.320702 -0.806952
6.300000 0.106252 1.554934 1.553364 -0.015143 0.299732 -1.274628
6.333333 0.105589 1.563723 1.556126 -0.017511 0.278024 -1.845199
6.366667 0.104933 1.572363 1.563343 -0.019922 0.256111 -2.492368
6.400000 0.104285 1.580852 1.549102 -0.022313 0.234371 -3.178296
6.433333 0.103645 1.589189 1.446895 -0.024639 0.212932 -3.854449
6.466667 0.102783 1.595845 1.271882 -0.026799 0.192238 -4.475309
6.500000 0.101691 1.600870 1.031380 -0.028691 0.172722 -4.989656
6.533333 0.100610 1.605743 0.738113 -0.030265 0.154460 -5.355483
6.566667 0.099541 1.610465 0.446617 -0.031492 0.137404 -5.538763
6.600000 0.098263 1.613928 0.221616 -0.032333 0.121687 -5.515528
6.633333 0.097000 1.617244 -0.029517 -0.032734 0.107669 -5.275492
6.666667 0.095751 1.620418 -0.235622 -0.032675 0.095431 -4.821943
6.700000 0.094519 1.623453 -0.403969 -0.032160 0.084914 -4.176247
6.733333 0.093357 1.625817 -0.552249 -0.031166 0.076298 -3.368814
6.766667 0.092367 1.627664 -0.666477 -0.029683 0.069789 -2.436263
6.800000 0.091397 1.629384 -0.741990 -0.027722 0.065436 -1.417934
