t x y theta dxdt dydt dthetadt
0.000000 0.000000 0.000000 -0.183240 -0.009125 -0.005998 -0.001945
0.033333 -0.000494 -0.000267 -0.193501 -0.013016 -0.008332 0.003736
0.066667 -0.000890 -0.000427 -0.201564 -0.017825 -0.011187 0.010120
0.100000 -0.000939 -0.000580 -0.205730 -0.023645 -0.014522 0.023037
0.133333 -0.001334 -0.000841 -0.188882 -0.031006 -0.018548 0.038684
0.166667 -0.002160 -0.001044 -0.176764 -0.040391 -0.023467 0.059020
0.200000 -0.003326 -0.002062 -0.180623 -0.052279 -0.029452 0.091050
0.233333 -0.004870 -0.003193 -0.181482 -0.067152 -0.036664 0.128938
0.266667 -0.006802 -0.004438 -0.184611 -0.086042 -0.045291 0.168742
0.300000 -0.009134 -0.005800 -0.175368 -0.109863 -0.055499 0.198752
0.333333 -0.011874 -0.007280 -0.192493 -0.138989 -0.066927 0.214673
0.366667 -0.015034 -0.008879 -0.189419 -0.174197 -0.079205 0.208666
0.400000 -0.018622 -0.010598 -0.180825 -0.216274 -0.092068 0.175349
0.433333 -0.022648 -0.012438 -0.136458 -0.266005 -0.105253 0.119132
0.466667 -0.033330 -0.017676 -0.102441 -0.322849 -0.118304 0.039113
0.500000 -0.044457 -0.023043 -0.053608 -0.386506 -0.130875 -0.057294
0.533333 -0.056032 -0.028537 -0.063060 -0.456374 -0.142958 -0.165883
0.566667 -0.068055 -0.034153 -0.110705 -0.531032 -0.154538 -0.276107
0.600000 -0.087176 -0.039641 -0.125026 -0.608491 -0.165642 -0.378378
0.633333 -0.106743 -0.045257 -0.162548 -0.686759 -0.176296 -0.464731
0.666667 -0.132382 -0.051051 -0.201089 -0.764409 -0.187003 -0.520850
0.700000 -0.163289 -0.057102 -0.219224 -0.839244 -0.198264 -0.538716
0.733333 -0.194606 -0.063289 -0.264150 -0.909280 -0.210434 -0.510720
0.766667 -0.226315 -0.069607 -0.273790 -0.972821 -0.223930 -0.444494
0.800000 -0.261705 -0.076304 -0.289639 -1.028861 -0.238970 -0.343142
0.833333 -0.299714 -0.084345 -0.293889 -1.075934 -0.255724 -0.216429
0.866667 -0.339586 -0.093389 -0.312889 -1.113150 -0.274048 -0.080203
0.900000 -0.379756 -0.102559 -0.313084 -1.140608 -0.293487 0.057458
0.933333 -0.420051 -0.112840 -0.313797 -1.158557 -0.313576 0.182962
0.966667 -0.460589 -0.123234 -0.316977 -1.167506 -0.333745 0.298373
1.000000 -0.501347 -0.133736 -0.272267 -1.168294 -0.353506 0.396979
1.033333 -0.542408 -0.146893 -0.253563 -1.162702 -0.372238 0.480662
1.066667 -0.583631 -0.160142 -0.204873 -1.151753 -0.389473 0.551295
1.100000 -0.623510 -0.174106 -0.189983 -1.135756 -0.404976 0.608498
1.133333 -0.661463 -0.188522 -0.162348 -1.114724 -0.418678 0.654825
1.166667 -0.696130 -0.203719 -0.161077 -1.088479 -0.430567 0.691149
1.200000 -0.730863 -0.218956 -0.153890 -1.056404 -0.440646 0.724466
1.233333 -0.765642 -0.234221 -0.124274 -1.017465 -0.449239 0.757123
1.266667 -0.800448 -0.249503 -0.091286 -0.971828 -0.456312 0.788917
1.300000 -0.835262 -0.264788 -0.068095 -0.920318 -0.461774 0.817182
1.333333 -0.870063 -0.280067 -0.030587 -0.864326 -0.465459 0.840855
1.366667 -0.904834 -0.295326 -0.012582 -0.805397 -0.467197 0.852603
1.400000 -0.932939 -0.310621 0.027707 -0.745632 -0.466812 0.842975
1.433333 -0.955575 -0.326858 0.060815 -0.687717 -0.463536 0.804529
1.466667 -0.972823 -0.343377 0.092886 -0.633876 -0.456769 0.740251
1.500000 -0.985728 -0.360582 0.132841 -0.586331 -0.445487 0.651312
1.533333 -0.998564 -0.377675 0.166094 -0.547028 -0.428672 0.542691
1.566667 -1.011726 -0.393871 0.216965 -0.517795 -0.405384 0.419024
1.600000 -1.027404 -0.406660 0.204512 -0.499135 -0.374974 0.291976
1.633333 -1.043028 -0.419304 0.202353 -0.490253 -0.337772 0.170504
1.666667 -1.058599 -0.431792 0.202256 -0.488808 -0.294604 0.056794
1.700000 -1.074119 -0.444117 0.183278 -0.491788 -0.247222 -0.043414
1.733333 -1.089589 -0.456267 0.169473 -0.495637 -0.197610 -0.133184
1.766667 -1.107517 -0.463028 0.156508 -0.496650 -0.148057 -0.207757
1.800000 -1.126311 -0.465316 0.141907 -0.492027 -0.100653 -0.271354
1.833333 -1.144758 -0.462685 0.127008 -0.479793 -0.057464 -0.324733
1.866667 -1.163169 -0.459880 0.140374 -0.460174 -0.020217 -0.369676
1.900000 -1.181542 -0.456907 0.134198 -0.434108 0.009765 -0.408074
1.933333 -1.199876 -0.453773 0.127494 -0.404034 0.031573 -0.436331
1.966667 -1.218169 -0.450486 0.119417 -0.372782 0.045103 -0.457257
2.000000 -1.227862 -0.446932 0.097637 -0.343832 0.050694 -0.474469
2.033333 -1.237518 -0.443227 0.063192 -0.320718 0.049566 -0.491970
2.066667 -1.240684 -0.442196 0.010448 -0.306574 0.043107 -0.504402
2.100000 -1.243831 -0.441014 -0.022525 -0.303988 0.032677 -0.510641
2.133333 -1.246974 -0.439688 -0.022185 -0.314160 0.019528 -0.512909
2.166667 -1.251763 -0.439466 -0.011939 -0.338195 0.004474 -0.511667
2.200000 -1.259595 -0.439517 -0.016659 -0.375559 -0.012056 -0.501941
2.233333 -1.271939 -0.440199 -0.021587 -0.424778 -0.029877 -0.480413
2.266667 -1.289375 -0.441526 -0.043153 -0.482565 -0.048990 -0.453891
2.300000 -1.306840 -0.442741 -0.067907 -0.545459 -0.069041 -0.425078
2.333333 -1.324332 -0.443844 -0.108949 -0.610418 -0.089733 -0.387893
2.366667 -1.346432 -0.446241 -0.135248 -0.673756 -0.110637 -0.336115
2.400000 -1.371902 -0.450287 -0.138165 -0.732518 -0.130858 -0.272586
2.433333 -1.399937 -0.456143 -0.139706 -0.784605 -0.149305 -0.199573
2.466667 -1.427963 -0.461899 -0.156783 -0.829613 -0.164653 -0.118373
2.500000 -1.459145 -0.468847 -0.165446 -0.867499 -0.175623 -0.029717
2.533333 -1.491822 -0.476677 -0.163932 -0.898104 -0.180855 0.057957
2.566667 -1.525018 -0.484944 -0.137901 -0.922120 -0.179191 0.134000
2.600000 -1.558205 -0.493581 -0.123415 -0.940409 -0.170173 0.201304
2.633333 -1.589946 -0.500954 -0.118986 -0.953860 -0.154029 0.258795
2.666667 -1.621577 -0.508198 -0.107041 -0.962650 -0.131337 0.307549
2.700000 -1.653080 -0.515307 -0.079816 -0.966777 -0.103173 0.344784
2.733333 -1.684973 -0.519487 -0.085115 -0.966450 -0.071011 0.372541
2.766667 -1.717092 -0.521339 -0.060092 -0.961565 -0.036489 0.393478
2.800000 -1.749439 -0.520733 -0.070440 -0.952127 -0.001283 0.404522
2.833333 -1.783796 -0.517596 -0.060948 -0.937658 0.033130 0.405305
2.866667 -1.817948 -0.514329 -0.037313 -0.918140 0.065533 0.396165
2.900000 -1.851876 -0.510937 -0.013093 -0.893977 0.095079 0.379980
2.933333 -1.883380 -0.506575 0.025090 -0.865714 0.121450 0.353394
2.966667 -1.913128 -0.501078 0.038802 -0.833982 0.144687 0.319209
3.000000 -1.939775 -0.495251 0.041048 -0.799531 0.165314 0.277911
3.033333 -1.963306 -0.488912 0.042038 -0.763671 0.183967 0.233560
3.066667 -1.986540 -0.482472 0.052489 -0.727576 0.201103 0.189035
3.100000 -2.009467 -0.475937 0.052241 -0.692126 0.216954 0.147715
3.133333 -2.032076 -0.469318 0.054795 -0.657804 0.231562 0.115309
3.166667 -2.052628 -0.462161 0.051897 -0.624477 0.244443 0.091681
3.200000 -2.072282 -0.453716 0.053440 -0.591552 0.254859 0.075639
3.233333 -2.091932 -0.443691 0.041588 -0.557791 0.261956 0.062688
3.266667 -2.111199 -0.432986 0.048855 -0.521502 0.264721 0.046801
3.300000 -2.129394 -0.421885 0.047473 -0.481079 0.262247 0.022211
3.333333 -2.147234 -0.410761 0.057666 -0.434969 0.253526 -0.016415
3.366667 -2.160889 -0.401590 0.073293 -0.382951 0.238428 -0.069836
3.400000 -2.174182 -0.392414 0.083834 -0.324953 0.217015 -0.136941
3.433333 -2.187109 -0.383242 0.078194 -0.261792 0.189862 -0.214362
3.466667 -2.199672 -0.374087 0.071692 -0.195605 0.158206 -0.291280
3.500000 -2.204717 -0.369897 0.062247 -0.129010 0.123755 -0.359984
3.533333 -2.209396 -0.365729 0.052472 -0.064888 0.088390 -0.410334
3.566667 -2.208240 -0.364308 0.028337 -0.005405 0.053723 -0.438867
3.600000 -2.201800 -0.365459 -0.014432 0.046820 0.021475 -0.441097
3.633333 -2.195027 -0.366623 -0.059740 0.088971 -0.006787 -0.419199
3.666667 -2.186356 -0.368845 -0.100739 0.119001 -0.029773 -0.383633
3.700000 -2.177907 -0.372779 -0.092225 0.135620 -0.046806 -0.342743
3.733333 -2.169180 -0.376720 -0.098919 0.137686 -0.057306 -0.305827
3.766667 -2.160197 -0.380662 -0.103350 0.124404 -0.061180 -0.277533
3.800000 -2.156925 -0.383135 -0.080203 0.096261 -0.059023 -0.264467
3.833333 -2.153433 -0.385612 -0.079563 0.055132 -0.051855 -0.262342
3.866667 -2.149735 -0.388091 -0.060980 0.003688 -0.041053 -0.265793
3.900000 -2.145846 -0.390569 -0.051249 -0.055179 -0.028339 -0.265060
3.933333 -2.141780 -0.393045 -0.063331 -0.118568 -0.015433 -0.253625
3.966667 -2.145783 -0.393006 -0.120034 -0.182761 -0.004068 -0.224384
4.000000 -2.155716 -0.391154 -0.177233 -0.244666 0.004466 -0.168363
4.033333 -2.170627 -0.388041 -0.204747 -0.301216 0.008984 -0.088186
4.066667 -2.185381 -0.384955 -0.215105 -0.349988 0.008547 0.017722
4.100000 -2.202563 -0.382489 -0.200466 -0.388803 0.003040 0.139175
4.133333 -2.220220 -0.381634 -0.177990 -0.415439 -0.007511 0.267418
4.166667 -2.237694 -0.380821 -0.149889 -0.429270 -0.022283 0.388808
4.200000 -2.254975 -0.380050 -0.128996 -0.430580 -0.040134 0.489393
4.233333 -2.271647 -0.382430 -0.084266 -0.420832 -0.059277 0.562889
4.266667 -2.288105 -0.384852 -0.053830 -0.401428 -0.077844 0.600241
4.300000 -2.302563 -0.388895 -0.021012 -0.374328 -0.094196 0.605290
4.333333 -2.314861 -0.394532 -0.002540 -0.341773 -0.106782 0.582664
4.366667 -2.324137 -0.400270 0.004770 -0.306007 -0.114713 0.540218
4.400000 -2.333171 -0.406023 0.034115 -0.268611 -0.117388 0.483604
4.433333 -2.341963 -0.411787 0.032579 -0.230821 -0.115150 0.422964
4.466667 -2.350509 -0.417555 0.038663 -0.194063 -0.108515 0.365595
4.500000 -2.355234 -0.421411 0.063038 -0.159545 -0.098383 0.311677
4.533333 -2.359717 -0.425258 0.068523 -0.128113 -0.085896 0.262694
4.566667 -2.361714 -0.427185 0.080031 -0.100035 -0.072213 0.218107
4.600000 -2.362571 -0.428123 0.078883 -0.075690 -0.058551 0.181877
4.633333 -2.363202 -0.429041 0.090468 -0.055284 -0.045743 0.148545
4.666667 -2.363660 -0.429379 0.089155 -0.038868 -0.034568 0.117801
4.700000 -2.363907 -0.429698 0.093774 -0.026037 -0.025353 0.092201
4.733333 -2.363947 -0.429996 0.084430 -0.016541 -0.018241 0.070652
4.766667 -2.363863 -0.430097 0.103356 -0.009993 -0.013039 0.053206
4.800000 -2.364025 -0.430277 0.094119 -0.005763 -0.009421 0.039994
4.833333 -2.363999 -0.430438 0.094361 -0.003246 -0.007059 0.031605
4.866667 -2.364066 -0.430773 0.094479 -0.001857 -0.005527 0.027061
