t x y theta dxdt dydt dthetadt
0.000000 0.000000 0.000000 -0.228423 0.135641 -0.038512 -0.002923
0.033333 0.004584 -0.001302 -0.230016 0.140519 -0.040069 0.000845
0.066667 0.009328 -0.002659 -0.234722 0.145472 -0.041657 0.004342
0.100000 0.014244 -0.004067 -0.222042 0.150501 -0.043276 0.007206
0.133333 0.019334 -0.005528 -0.233834 0.155606 -0.044926 0.010596
0.166667 0.024590 -0.007047 -0.221959 0.160789 -0.046607 0.012208
0.200000 0.030028 -0.008620 -0.223160 0.166050 -0.048316 0.009635
0.233333 0.035634 -0.010253 -0.225831 0.171384 -0.050053 0.006239
0.266667 0.041411 -0.011946 -0.221825 0.176788 -0.051818 0.002083
0.300000 0.047360 -0.013699 -0.216068 0.182262 -0.053610 -0.001035
0.333333 0.053504 -0.015512 -0.217314 0.187812 -0.055429 -0.006577
0.366667 0.059849 -0.017383 -0.229465 0.193436 -0.057274 -0.010337
0.400000 0.066397 -0.019315 -0.228466 0.199136 -0.059145 -0.011500
0.433333 0.073121 -0.021311 -0.232061 0.204922 -0.061043 -0.010509
0.466667 0.080023 -0.023372 -0.221354 0.210806 -0.062966 -0.009054
0.500000 0.087139 -0.025496 -0.225505 0.216791 -0.064915 -0.007112
0.533333 0.094434 -0.027687 -0.235279 0.222878 -0.066890 -0.002605
0.566667 0.101908 -0.029945 -0.232858 0.229071 -0.068891 0.001940
0.600000 0.109608 -0.032270 -0.223813 0.235368 -0.070918 0.006311
0.633333 0.117536 -0.034662 -0.222373 0.241751 -0.072970 0.007541
0.666667 0.125697 -0.037122 -0.220990 0.248190 -0.075046 0.009031
0.700000 0.134039 -0.039653 -0.226644 0.254662 -0.077147 0.009572
0.733333 0.142620 -0.042254 -0.232652 0.261143 -0.079271 0.008920
0.766667 0.151444 -0.044926 -0.220807 0.267606 -0.081418 0.006627
0.800000 0.160515 -0.047671 -0.226016 0.274032 -0.083589 0.003948
0.833333 0.169837 -0.050489 -0.222265 0.280418 -0.085783 0.003802
0.866667 0.179340 -0.053381 -0.224317 0.286783 -0.088001 0.003519
0.900000 0.189024 -0.056346 -0.223212 0.293134 -0.090243 0.002577
0.933333 0.198890 -0.059386 -0.222168 0.299498 -0.092509 0.000797
0.966667 0.208935 -0.062502 -0.230518 0.305906 -0.094800 0.000573
1.000000 0.219161 -0.065693 -0.225201 0.312395 -0.097116 0.000072
1.033333 0.229658 -0.068964 -0.225262 0.318984 -0.099458 -0.001319
1.066667 0.240332 -0.072311 -0.221365 0.325670 -0.101823 -0.002545
1.100000 0.251285 -0.075740 -0.224025 0.332448 -0.104211 -0.002965
1.133333 0.262414 -0.079246 -0.223173 0.339288 -0.106620 -0.002674
1.166667 0.273826 -0.082836 -0.219420 0.346133 -0.109047 -0.003699
1.200000 0.285525 -0.086509 -0.229710 0.352911 -0.111488 -0.003460
1.233333 0.297397 -0.090261 -0.231608 0.359569 -0.113940 -0.003051
1.266667 0.309562 -0.094100 -0.220600 0.366052 -0.116400 -0.002414
1.300000 0.322023 -0.098025 -0.227941 0.372328 -0.118867 -0.000410
1.333333 0.334651 -0.102030 -0.224478 0.378374 -0.121338 0.001529
1.366667 0.347444 -0.106117 -0.222100 0.384213 -0.123815 0.004520
1.400000 0.360400 -0.110285 -0.225974 0.389901 -0.126301 0.006600
1.433333 0.373516 -0.114535 -0.232513 0.395506 -0.128799 0.008092
1.466667 0.386790 -0.118866 -0.222791 0.401132 -0.131316 0.009839
1.500000 0.400220 -0.123280 -0.226847 0.406866 -0.133857 0.009218
1.533333 0.413804 -0.127776 -0.215932 0.412794 -0.136426 0.004642
1.566667 0.427537 -0.132355 -0.226098 0.418978 -0.139027 -0.006601
1.600000 0.441419 -0.137017 -0.221690 0.425454 -0.141663 -0.030847
1.633333 0.455626 -0.141774 -0.220110 0.432224 -0.144334 -0.070428
1.666667 0.469975 -0.146614 -0.226067 0.439245 -0.147037 -0.129462
1.700000 0.484653 -0.151552 -0.226905 0.446461 -0.149768 -0.206136
1.733333 0.499665 -0.156587 -0.210072 0.453816 -0.152524 -0.293645
1.766667 0.515009 -0.161720 -0.231713 0.461232 -0.155301 -0.382840
1.800000 0.530686 -0.166953 -0.217300 0.468610 -0.158093 -0.462409
1.833333 0.546487 -0.172268 -0.231125 0.475868 -0.160893 -0.523501
1.866667 0.562408 -0.177667 -0.266944 0.482953 -0.163699 -0.555606
1.900000 0.578639 -0.183167 -0.308275 0.489826 -0.166509 -0.552040
1.933333 0.595171 -0.188767 -0.359714 0.496448 -0.169323 -0.508580
1.966667 0.611993 -0.194469 -0.408026 0.502786 -0.172137 -0.431572
2.000000 0.628916 -0.200253 -0.447439 0.508835 -0.174949 -0.322889
2.033333 0.645936 -0.206120 -0.454970 0.514588 -0.177760 -0.192693
2.066667 0.663211 -0.212087 -0.440523 0.520006 -0.180561 -0.057180
2.100000 0.680729 -0.218156 -0.411505 0.525050 -0.183347 0.064372
2.133333 0.698475 -0.224325 -0.393721 0.529686 -0.186112 0.150744
2.166667 0.716296 -0.230576 -0.386041 0.533912 -0.188857 0.195769
2.200000 0.734314 -0.236932 -0.367340 0.537711 -0.191581 0.187088
2.233333 0.752393 -0.243367 -0.332075 0.541065 -0.194285 0.127773
2.266667 0.770639 -0.249910 -0.290881 0.543990 -0.196973 0.027748
2.300000 0.788934 -0.256533 -0.282841 0.546511 -0.199656 -0.093406
2.333333 0.807271 -0.263234 -0.282169 0.548662 -0.202342 -0.214788
2.366667 0.825644 -0.270013 -0.318739 0.550455 -0.205037 -0.325762
2.400000 0.844047 -0.276870 -0.356116 0.551922 -0.207754 -0.407007
2.433333 0.862472 -0.283804 -0.398591 0.553095 -0.210511 -0.451065
2.466667 0.880974 -0.290857 -0.447756 0.554000 -0.213324 -0.451018
2.500000 0.899538 -0.298029 -0.452037 0.554642 -0.216204 -0.416135
2.533333 0.918105 -0.305275 -0.504856 0.555014 -0.219163 -0.352298
2.566667 0.936668 -0.312596 -0.512306 0.555113 -0.222205 -0.267570
2.600000 0.955250 -0.320039 -0.510189 0.554926 -0.225321 -0.176425
2.633333 0.973814 -0.327554 -0.486766 0.554441 -0.228489 -0.087903
2.666667 0.992366 -0.335194 -0.461795 0.553650 -0.231687 -0.014515
2.700000 1.010889 -0.342958 -0.451035 0.552563 -0.234882 0.045567
2.733333 1.029368 -0.350845 -0.439672 0.551195 -0.238036 0.084467
2.766667 1.047789 -0.358856 -0.449032 0.549555 -0.241111 0.103219
2.800000 1.066136 -0.366987 -0.441521 0.547648 -0.244086 0.104387
2.833333 1.084397 -0.375238 -0.454768 0.545484 -0.246938 0.089401
2.866667 1.102558 -0.383605 -0.462633 0.543067 -0.249650 0.060071
2.900000 1.120648 -0.392034 -0.460201 0.540387 -0.252218 0.014885
2.933333 1.138660 -0.400522 -0.462771 0.537419 -0.254656 -0.040397
2.966667 1.156588 -0.409069 -0.438906 0.534152 -0.256980 -0.107713
3.000000 1.174426 -0.417672 -0.411623 0.530585 -0.259201 -0.188536
3.033333 1.192167 -0.426329 -0.412241 0.526714 -0.261339 -0.281896
3.066667 1.209805 -0.435040 -0.429789 0.522529 -0.263419 -0.384342
3.100000 1.227235 -0.443855 -0.454292 0.518035 -0.265452 -0.492462
3.133333 1.244444 -0.452772 -0.474154 0.513256 -0.267434 -0.602549
3.166667 1.261531 -0.461736 -0.502438 0.508210 -0.269362 -0.705697
3.200000 1.278490 -0.470746 -0.540664 0.502895 -0.271235 -0.793011
3.233333 1.295189 -0.479845 -0.570148 0.497322 -0.273040 -0.861683
3.266667 1.311621 -0.489030 -0.606384 0.491503 -0.274761 -0.908021
3.300000 1.327907 -0.498256 -0.645941 0.485436 -0.276389 -0.932596
3.333333 1.344041 -0.507518 -0.686382 0.479116 -0.277923 -0.937816
3.366667 1.360018 -0.516817 -0.705898 0.472538 -0.279361 -0.928327
3.400000 1.375833 -0.526149 -0.745039 0.465709 -0.280701 -0.909891
3.433333 1.391334 -0.535541 -0.781084 0.458628 -0.281942 -0.885932
3.466667 1.406512 -0.544988 -0.794855 0.451300 -0.283089 -0.865927
3.500000 1.421513 -0.554462 -0.827986 0.443749 -0.284143 -0.850991
3.533333 1.436180 -0.563980 -0.867537 0.436009 -0.285100 -0.841750
3.566667 1.450661 -0.573521 -0.886086 0.428103 -0.285955 -0.837757
3.600000 1.464798 -0.583095 -0.890856 0.420069 -0.286703 -0.838124
3.633333 1.478588 -0.592695 -0.928408 0.411930 -0.287338 -0.834924
3.666667 1.492177 -0.602312 -0.951921 0.403699 -0.287853 -0.822062
3.700000 1.505562 -0.611942 -0.973444 0.395363 -0.288241 -0.796650
3.733333 1.518591 -0.621582 -1.016659 0.386888 -0.288496 -0.756670
3.766667 1.531407 -0.631230 -1.053046 0.378251 -0.288612 -0.696723
3.800000 1.543865 -0.640879 -1.095987 0.369417 -0.288587 -0.615581
3.833333 1.556104 -0.650532 -1.126952 0.360348 -0.288419 -0.523807
3.866667 1.568121 -0.660187 -1.146253 0.351017 -0.288104 -0.416725
3.900000 1.579779 -0.669826 -1.158610 0.341432 -0.287645 -0.300547
3.933333 1.591077 -0.679444 -1.159541 0.331608 -0.287045 -0.180396
3.966667 1.602015 -0.689034 -1.113596 0.321571 -0.286310 -0.073758
4.000000 1.612593 -0.698593 -1.153769 0.311357 -0.285448 0.018887
4.033333 1.622809 -0.708118 -1.138305 0.301024 -0.284471 0.089775
4.066667 1.632666 -0.717606 -1.133730 0.290650 -0.283395 0.121305
4.100000 1.642160 -0.727051 -1.090949 0.280280 -0.282231 0.103495
4.133333 1.651292 -0.736451 -1.107399 0.269971 -0.280994 0.037346
4.166667 1.660060 -0.745801 -1.097780 0.259776 -0.279701 -0.061345
4.200000 1.668465 -0.755099 -1.065121 0.249733 -0.278362 -0.202164
4.233333 1.676625 -0.764375 -1.080209 0.239856 -0.276986 -0.366722
4.266667 1.684422 -0.773592 -1.067295 0.230130 -0.275571 -0.537841
4.300000 1.691854 -0.782747 -1.079036 0.220554 -0.274122 -0.691906
4.333333 1.699041 -0.791873 -1.075827 0.211097 -0.272630 -0.832322
4.366667 1.705864 -0.800933 -1.155855 0.201708 -0.271082 -0.960201
4.400000 1.712442 -0.809962 -1.241914 0.192342 -0.269465 -1.062150
4.433333 1.718661 -0.818921 -1.361356 0.182969 -0.267770 -1.139639
4.466667 1.724635 -0.827844 -1.385914 0.173570 -0.265991 -1.204591
4.500000 1.730365 -0.836732 -1.381254 0.164117 -0.264118 -1.273769
4.533333 1.735743 -0.845544 -1.403368 0.154614 -0.262153 -1.345184
4.566667 1.740772 -0.854280 -1.429349 0.145080 -0.260104 -1.450626
4.600000 1.745456 -0.862937 -1.443522 0.135555 -0.257985 -1.617770
4.633333 1.749798 -0.871514 -1.493605 0.126076 -0.255810 -1.882851
4.666667 1.753801 -0.880006 -1.561314 0.116684 -0.253596 -2.254482
4.700000 1.757469 -0.888414 -1.606924 0.107435 -0.251364 -2.740387
4.733333 1.760809 -0.896738 -1.685182 0.098366 -0.249132 -3.343470
4.766667 1.763828 -0.904977 -1.748578 0.089517 -0.246917 -4.015086
4.800000 1.766613 -0.913167 -1.879735 0.080903 -0.244729 -4.698467
4.833333 1.769091 -0.921271 -1.990688 0.072530 -0.242573 -5.316396
4.866667 1.771341 -0.929324 -2.122687 0.064399 -0.240452 -5.803009
4.900000 1.773295 -0.937290 -2.456324 0.056500 -0.238367 -6.072387
4.933333 1.775025 -0.945202 -2.732244 0.048813 -0.236317 -6.065427
4.966667 1.776534 -0.953059 -3.094151 0.041299 -0.234292 -5.747609
5.000000 1.777767 -0.960832 2.831864 0.033933 -0.232290 -5.121169
5.033333 1.778693 -0.968522 2.500668 0.026691 -0.230309 -4.212852
5.066667 1.779405 -0.976153 2.238720 0.019551 -0.228348 -3.068325
5.100000 1.779907 -0.983726 2.109329 0.012490 -0.226404 -1.786878
5.133333 1.780203 -0.991238 2.128095 0.005504 -0.224478 -0.452860
5.166667 1.780295 -0.998689 2.264057 -0.001391 -0.222573 0.825901
5.200000 1.780186 -1.006079 2.450089 -0.008187 -0.220688 1.964276
5.233333 1.779807 -1.013401 2.691927 -0.014874 -0.218823 2.887951
5.266667 1.779160 -1.020659 2.867752 -0.021432 -0.216975 3.551681
5.300000 1.778251 -1.027856 3.095756 -0.027831 -0.215143 3.947620
5.333333 1.777155 -1.034989 -3.009855 -0.034044 -0.213324 4.089893
5.366667 1.775851 -1.042062 -2.856330 -0.040044 -0.211516 4.023669
5.400000 1.774347 -1.049079 -2.740758 -0.045793 -0.209716 3.794888
5.433333 1.772655 -1.056040 -2.625079 -0.051261 -0.207920 3.453131
5.466667 1.770785 -1.062947 -2.531350 -0.056424 -0.206126 3.028192
5.500000 1.768747 -1.069785 -2.443477 -0.061270 -0.204332 2.550611
5.533333 1.766556 -1.076569 -2.359447 -0.065787 -0.202537 2.035477
5.566667 1.764228 -1.083302 -2.286837 -0.069983 -0.200734 1.495578
5.600000 1.761743 -1.089962 -2.216955 -0.073870 -0.198919 0.950683
5.633333 1.759150 -1.096569 -2.168437 -0.077458 -0.197092 0.422888
5.666667 1.756409 -1.103102 -2.123167 -0.080771 -0.195249 -0.062114
5.700000 1.753593 -1.109581 -2.113724 -0.083847 -0.193383 -0.480253
5.733333 1.750718 -1.116005 -2.185606 -0.086731 -0.191486 -0.809535
5.766667 1.747705 -1.122354 -2.298136 -0.089442 -0.189558 -1.039511
5.800000 1.744664 -1.128650 -2.436272 -0.092007 -0.187595 -1.170065
5.833333 1.741608 -1.134897 -2.585986 -0.094442 -0.185596 -1.206255
5.866667 1.738424 -1.141064 -2.660443 -0.096752 -0.183558 -1.153787
5.900000 1.735117 -1.147151 -2.674460 -0.098906 -0.181488 -1.030264
5.933333 1.731823 -1.153189 -2.640252 -0.100856 -0.179389 -0.863742
5.966667 1.728412 -1.159144 -2.613777 -0.102583 -0.177260 -0.673829
6.000000 1.724888 -1.165018 -2.617957 -0.104065 -0.175101 -0.474981
6.033333 1.721253 -1.170808 -2.615393 -0.105279 -0.172910 -0.278699
6.066667 1.717510 -1.176514 -2.607996 -0.106184 -0.170683 -0.086939
6.100000 1.713823 -1.182166 -2.624317 -0.106791 -0.168410 0.112293
6.133333 1.710199 -1.187761 -2.644954 -0.107125 -0.166080 0.339537
6.166667 1.706647 -1.193291 -2.671237 -0.107198 -0.163683 0.606377
6.200000 1.703000 -1.198735 -2.681218 -0.107003 -0.161205 0.911172
6.233333 1.699444 -1.204098 -2.682610 -0.106578 -0.158634 1.237796
6.266667 1.695987 -1.209372 -2.668067 -0.105997 -0.155964 1.552820
6.300000 1.692442 -1.214557 -2.597815 -0.105289 -0.153192 1.806597
6.333333 1.688811 -1.219651 -2.504797 -0.104475 -0.150320 1.952050
6.366667 1.685292 -1.224635 -2.371350 -0.103578 -0.147361 1.948594
6.400000 1.681884 -1.229505 -2.209026 -0.102659 -0.144331 1.770173
6.433333 1.678397 -1.234283 -2.049282 -0.101719 -0.141245 1.415079
6.466667 1.675011 -1.238944 -1.942049 -0.100745 -0.138122 0.905933
6.500000 1.671721 -1.243489 -1.837978 -0.099743 -0.134978 0.286594
6.533333 1.668521 -1.247920 -1.790758 -0.098755 -0.131827 -0.391997
6.566667 1.665245 -1.252257 -1.847327 -0.097810 -0.128681 -1.073268
6.600000 1.662044 -1.256484 -1.988553 -0.096919 -0.125544 -1.696240
6.633333 1.658770 -1.260616 -2.174554 -0.096123 -0.122423 -2.212016
6.666667 1.655555 -1.264644 -2.371072 -0.095462 -0.119318 -2.590388
6.700000 1.652394 -1.268568 -2.507683 -0.094974 -0.116229 -2.821321
6.733333 1.649280 -1.272389 -2.640863 -0.094666 -0.113149 -2.906592
