t x y theta dxdt dydt dthetadt
0.000000 0.000000 0.000000 -0.319183 0.001061 -0.027752 0.021943
0.033333 -0.000164 -0.000895 -0.313771 0.004862 -0.032201 0.042795
0.066667 0.000066 -0.001972 -0.307286 0.009021 -0.037020 0.057032
0.100000 0.000233 -0.003323 -0.303582 0.013553 -0.042063 0.064801
0.133333 0.000816 -0.004866 -0.291748 0.018508 -0.047241 0.064158
0.166667 0.001828 -0.006604 -0.288633 0.023923 -0.052553 0.055902
0.200000 0.002786 -0.008560 -0.281453 0.029940 -0.058082 0.041388
0.233333 0.003712 -0.010652 -0.282522 0.036742 -0.063961 0.024244
0.266667 0.004667 -0.012838 -0.279138 0.044605 -0.070446 0.008411
0.300000 0.005759 -0.015071 -0.280414 0.053734 -0.077806 -0.004766
0.333333 0.007338 -0.017519 -0.285348 0.064434 -0.086371 -0.011634
0.366667 0.009126 -0.020080 -0.294637 0.077136 -0.096518 -0.010126
0.400000 0.011424 -0.022865 -0.304859 0.092125 -0.108500 0.003577
0.433333 0.014111 -0.025957 -0.309963 0.109813 -0.122668 0.029558
0.466667 0.017351 -0.029550 -0.305720 0.130407 -0.139137 0.067005
0.500000 0.021299 -0.033812 -0.298447 0.154282 -0.158086 0.113547
0.533333 0.026196 -0.039066 -0.290807 0.181576 -0.179423 0.163171
0.566667 0.031659 -0.044557 -0.285548 0.212351 -0.202951 0.208165
0.600000 0.038472 -0.051436 -0.284641 0.246677 -0.228434 0.238552
0.633333 0.045867 -0.058552 -0.282850 0.284493 -0.255515 0.248018
0.666667 0.055079 -0.067282 -0.269824 0.325963 -0.283969 0.233657
0.700000 0.066412 -0.077717 -0.246514 0.370742 -0.313268 0.195188
0.733333 0.078344 -0.088381 -0.211063 0.418870 -0.343208 0.135513
0.766667 0.093106 -0.100810 -0.187810 0.469903 -0.373337 0.062057
0.800000 0.108470 -0.113460 -0.181568 0.523720 -0.403463 -0.016663
0.833333 0.127017 -0.127908 -0.187798 0.579906 -0.433202 -0.093685
0.866667 0.146161 -0.142562 -0.208797 0.637965 -0.462225 -0.161839
0.900000 0.168542 -0.158905 -0.235053 0.697810 -0.490445 -0.214426
0.933333 0.191509 -0.175435 -0.262985 0.759082 -0.517580 -0.244430
0.966667 0.217789 -0.193524 -0.286560 0.821972 -0.543633 -0.251036
1.000000 0.247353 -0.212974 -0.301948 0.886176 -0.568287 -0.232815
1.033333 0.277467 -0.232574 -0.312074 0.951685 -0.591499 -0.191435
1.066667 0.310703 -0.253300 -0.317025 1.018042 -0.613042 -0.129761
1.100000 0.344456 -0.274145 -0.300337 1.084938 -0.632765 -0.053423
1.133333 0.381035 -0.295888 -0.295205 1.151691 -0.650475 0.029765
1.166667 0.420282 -0.318365 -0.296999 1.217331 -0.665989 0.116698
1.200000 0.462080 -0.341443 -0.290776 1.280983 -0.679334 0.200544
1.233333 0.506366 -0.364894 -0.290026 1.341735 -0.690441 0.280862
1.266667 0.553383 -0.388750 -0.285928 1.399237 -0.699430 0.353190
1.300000 0.603015 -0.412862 -0.281323 1.452553 -0.706297 0.418512
1.333333 0.655228 -0.437049 -0.252947 1.501264 -0.711206 0.475760
1.366667 0.707722 -0.461213 -0.248871 1.545279 -0.714333 0.523018
1.400000 0.760456 -0.485336 -0.205336 1.584827 -0.715851 0.559661
1.433333 0.815504 -0.509429 -0.168745 1.620032 -0.715952 0.580867
1.466667 0.870709 -0.533441 -0.152923 1.650973 -0.714772 0.587421
1.500000 0.926027 -0.557352 -0.129067 1.678328 -0.712459 0.575656
1.533333 0.981417 -0.581142 -0.116195 1.702745 -0.709052 0.549991
1.566667 1.038803 -0.604861 -0.096734 1.724530 -0.704530 0.510934
1.600000 1.097966 -0.628513 -0.076457 1.743663 -0.698821 0.466375
1.633333 1.157063 -0.651986 -0.047241 1.760366 -0.691887 0.423173
1.666667 1.217436 -0.675336 -0.042329 1.774440 -0.683602 0.384955
1.700000 1.277645 -0.698467 -0.038113 1.785262 -0.673768 0.357926
1.733333 1.337640 -0.721362 -0.032566 1.791927 -0.662161 0.341386
1.766667 1.398017 -0.743711 -0.030594 1.793633 -0.648469 0.341235
1.800000 1.458942 -0.765555 -0.021513 1.789812 -0.632418 0.354665
1.833333 1.520050 -0.786732 -0.012317 1.779733 -0.613739 0.381823
1.866667 1.580911 -0.807030 -0.004035 1.762922 -0.592266 0.423702
1.900000 1.641306 -0.826999 -0.003856 1.738959 -0.567890 0.478292
1.933333 1.701181 -0.846624 0.028473 1.707500 -0.540569 0.545423
1.966667 1.760488 -0.865886 0.052059 1.668500 -0.510454 0.617939
2.000000 1.817773 -0.883581 0.070825 1.622031 -0.477757 0.694333
2.033333 1.872621 -0.899520 0.095578 1.568078 -0.442615 0.773291
2.066667 1.924529 -0.913574 0.106994 1.506806 -0.405262 0.852323
2.100000 1.973598 -0.925719 0.141085 1.438642 -0.366127 0.932036
2.133333 2.021867 -0.937436 0.178546 1.364469 -0.325796 1.014547
2.166667 2.069296 -0.948716 0.212862 1.284594 -0.284700 1.106825
2.200000 2.112559 -0.957874 0.267522 1.199302 -0.243233 1.213539
2.233333 2.151409 -0.964901 0.299297 1.109504 -0.201981 1.337046
2.266667 2.185517 -0.969805 0.345934 1.016211 -0.161555 1.475106
2.300000 2.218653 -0.974249 0.367158 0.920508 -0.122368 1.620960
2.333333 2.250789 -0.978231 0.412545 0.822971 -0.084690 1.764059
2.366667 2.277869 -0.980261 0.477407 0.725061 -0.049008 1.890471
2.400000 2.299656 -0.980486 0.537844 0.628161 -0.015740 1.979367
2.433333 2.316129 -0.979086 0.621861 0.533139 0.014918 2.007015
2.466667 2.331534 -0.977226 0.707491 0.440524 0.043071 1.959295
2.500000 2.341634 -0.974261 0.788588 0.351017 0.068744 1.830008
2.533333 2.350654 -0.970844 0.924136 0.265647 0.091979 1.615327
2.566667 2.358591 -0.966980 1.039288 0.184699 0.113106 1.317375
2.600000 2.362181 -0.962687 1.110712 0.108270 0.132546 0.953427
2.633333 2.364687 -0.957957 1.119089 0.036228 0.150727 0.553223
2.666667 2.363788 -0.952737 1.119906 -0.031168 0.167864 0.143370
2.700000 2.359902 -0.946945 1.113520 -0.094188 0.184249 -0.256179
2.733333 2.354952 -0.940732 1.059171 -0.153195 0.200133 -0.615948
2.766667 2.347779 -0.933824 0.985022 -0.208159 0.215583 -0.912168
2.800000 2.338631 -0.926141 0.901787 -0.259126 0.230519 -1.133469
2.833333 2.328452 -0.918060 0.832876 -0.305802 0.244751 -1.282227
2.866667 2.316633 -0.909330 0.785175 -0.348311 0.258130 -1.365378
2.900000 2.303381 -0.900095 0.736545 -0.386761 0.270508 -1.388155
2.933333 2.288905 -0.890460 0.704798 -0.421196 0.281732 -1.374255
2.966667 2.273458 -0.880460 0.670343 -0.451927 0.291751 -1.344445
3.000000 2.257064 -0.870206 0.627930 -0.479173 0.300587 -1.310995
3.033333 2.240020 -0.859875 0.573818 -0.503354 0.308353 -1.277955
3.066667 2.222057 -0.849207 0.551248 -0.524804 0.315192 -1.245222
3.100000 2.203844 -0.838572 0.506012 -0.543801 0.321265 -1.209601
3.133333 2.184750 -0.827616 0.467665 -0.560868 0.326794 -1.156845
3.166667 2.165841 -0.816763 0.442731 -0.576664 0.332006 -1.075880
3.200000 2.146085 -0.805606 0.394217 -0.591770 0.337081 -0.964249
3.233333 2.125502 -0.794156 0.337332 -0.606674 0.342104 -0.825929
3.266667 2.105324 -0.782773 0.268043 -0.621955 0.347153 -0.662351
3.300000 2.085247 -0.771306 0.205989 -0.638161 0.352234 -0.480591
3.333333 2.064394 -0.759571 0.209268 -0.655744 0.357307 -0.294671
3.366667 2.042800 -0.747617 0.237369 -0.674811 0.362268 -0.116115
3.400000 2.020465 -0.735413 0.257615 -0.695472 0.366999 0.043177
3.433333 1.997407 -0.722966 0.281946 -0.717785 0.371422 0.176443
3.466667 1.973643 -0.710287 0.307697 -0.741511 0.375429 0.272686
3.500000 1.948605 -0.697507 0.331544 -0.766194 0.378953 0.323952
3.533333 1.922900 -0.684512 0.359011 -0.791319 0.381964 0.333117
3.566667 1.896110 -0.671565 0.374829 -0.816451 0.384455 0.304471
3.600000 1.868155 -0.658603 0.374853 -0.841094 0.386484 0.248802
3.633333 1.839158 -0.645634 0.375246 -0.864730 0.388132 0.174584
3.666667 1.809230 -0.632706 0.375999 -0.886963 0.389514 0.092173
3.700000 1.778740 -0.619606 0.390995 -0.907565 0.390714 0.011026
3.733333 1.747626 -0.606612 0.374681 -0.926335 0.391822 -0.063409
3.766667 1.716027 -0.593744 0.381091 -0.943180 0.392940 -0.130458
3.800000 1.683936 -0.580726 0.370669 -0.958084 0.394123 -0.189565
3.833333 1.651377 -0.567568 0.354396 -0.971126 0.395412 -0.241126
3.866667 1.618372 -0.554276 0.347228 -0.982445 0.396809 -0.285595
3.900000 1.585151 -0.541020 0.339535 -0.992225 0.398359 -0.321571
3.933333 1.551532 -0.527646 0.319928 -1.000664 0.400060 -0.350488
3.966667 1.517859 -0.514353 0.313436 -1.007900 0.401901 -0.368973
4.000000 1.483836 -0.500957 0.296824 -1.014043 0.403880 -0.377872
4.033333 1.449936 -0.487574 0.282613 -1.019235 0.405989 -0.376967
4.066667 1.415733 -0.474103 0.264929 -1.023591 0.408240 -0.367535
4.100000 1.381250 -0.460552 0.245497 -1.027144 0.410632 -0.350994
4.133333 1.346830 -0.446830 0.239070 -1.029942 0.413199 -0.330049
4.166667 1.312504 -0.432962 0.222181 -1.032074 0.415935 -0.308151
4.200000 1.277967 -0.419038 0.211000 -1.033671 0.418820 -0.287630
4.233333 1.243243 -0.405064 0.201847 -1.034755 0.421841 -0.269909
4.266667 1.208354 -0.391049 0.196910 -1.035347 0.425010 -0.253509
4.300000 1.173716 -0.376835 0.202733 -1.035529 0.428285 -0.240832
4.333333 1.139354 -0.362465 0.203568 -1.035371 0.431607 -0.231536
4.366667 1.104894 -0.348077 0.197656 -1.034860 0.434972 -0.225631
4.400000 1.070359 -0.333679 0.173961 -1.033950 0.438390 -0.220289
4.433333 1.035870 -0.318988 0.163812 -1.032648 0.441811 -0.213370
4.466667 1.001432 -0.304032 0.155647 -1.030980 0.445121 -0.206036
4.500000 0.966983 -0.289091 0.147792 -1.028900 0.448257 -0.196438
4.533333 0.932544 -0.274173 0.139559 -1.026337 0.451158 -0.181211
4.566667 0.898169 -0.259029 0.130554 -1.023266 0.453695 -0.160069
4.600000 0.863930 -0.243676 0.135353 -1.019645 0.455712 -0.136679
4.633333 0.829764 -0.228373 0.132367 -1.015410 0.457124 -0.114111
4.666667 0.795826 -0.212919 0.119177 -1.010491 0.457894 -0.093617
4.700000 0.762233 -0.197325 0.118881 -1.004868 0.457957 -0.075186
4.733333 0.728775 -0.181809 0.117580 -0.998513 0.457233 -0.063306
4.766667 0.695471 -0.166379 0.125122 -0.991369 0.455698 -0.060096
4.800000 0.662343 -0.151045 0.128460 -0.983367 0.453357 -0.063649
4.833333 0.629408 -0.135816 0.115926 -0.974446 0.450192 -0.073214
4.866667 0.596687 -0.120701 0.121739 -0.964528 0.446197 -0.089427
4.900000 0.564459 -0.105769 0.118386 -0.953522 0.441409 -0.113784
4.933333 0.532793 -0.091041 0.121001 -0.941424 0.435906 -0.144624
4.966667 0.501397 -0.076452 0.116410 -0.928308 0.429779 -0.179963
5.000000 0.470289 -0.062013 0.101485 -0.914334 0.423140 -0.218850
5.033333 0.439486 -0.047732 0.100750 -0.899513 0.416019 -0.261197
5.066667 0.409373 -0.033846 0.087725 -0.883743 0.408377 -0.302891
5.100000 0.380168 -0.020346 0.075513 -0.866763 0.400062 -0.340918
5.133333 0.351955 -0.007315 0.074992 -0.848286 0.390922 -0.374648
5.166667 0.324112 0.005527 0.050544 -0.827977 0.380782 -0.400540
5.200000 0.296654 0.018172 0.033774 -0.805245 0.369345 -0.418581
5.233333 0.269594 0.030614 0.016261 -0.779596 0.356366 -0.423312
5.266667 0.242947 0.042847 0.001321 -0.750788 0.341717 -0.416715
5.300000 0.216726 0.054862 -0.024637 -0.718875 0.325438 -0.400320
5.333333 0.190945 0.066655 -0.033671 -0.683670 0.307443 -0.374159
5.366667 0.167416 0.077267 -0.055576 -0.645012 0.287664 -0.342341
5.400000 0.146244 0.086722 -0.062682 -0.603309 0.266317 -0.308147
5.433333 0.127701 0.094771 -0.066589 -0.559366 0.243835 -0.279901
5.466667 0.109635 0.102578 -0.082962 -0.513836 0.220591 -0.258831
5.500000 0.092051 0.110140 -0.087879 -0.467235 0.196896 -0.247521
5.533333 0.077423 0.116203 -0.088857 -0.420662 0.173376 -0.245786
5.566667 0.065773 0.120765 -0.071296 -0.375388 0.150735 -0.254457
5.600000 0.054610 0.125079 -0.075587 -0.332179 0.129435 -0.270479
5.633333 0.043933 0.129148 -0.089147 -0.291340 0.109669 -0.288816
5.666667 0.035643 0.131963 -0.112699 -0.253416 0.091739 -0.306081
5.700000 0.029415 0.133758 -0.123500 -0.219094 0.075984 -0.318613
5.733333 0.023660 0.135314 -0.144266 -0.188476 0.062403 -0.323489
5.766667 0.019003 0.136448 -0.156755 -0.161312 0.050813 -0.317890
5.800000 0.015133 0.137338 -0.172493 -0.137495 0.041073 -0.300101
5.833333 0.011786 0.138173 -0.191901 -0.117050 0.033105 -0.271534
5.866667 0.008802 0.139036 -0.203869 -0.099578 0.026587 -0.236470
5.900000 0.006251 0.139679 -0.193598 -0.084409 0.021080 -0.197586
5.933333 0.003883 0.140324 -0.204322 -0.071118 0.016283 -0.159638
5.966667 0.001928 0.140756 -0.209709 -0.059374 0.011968 -0.124100
6.000000 -0.000010 0.141294 -0.201991 -0.048782 0.007897 -0.097007
6.033333 -0.001554 0.141626 -0.210247 -0.038978 0.003887 -0.078175
6.066667 -0.002712 0.141757 -0.203381 -0.029845 -0.000064 -0.067183
6.100000 -0.003494 0.141690 -0.207727 -0.021439 -0.003869 -0.061498
6.133333 -0.003911 0.141428 -0.202105 -0.013793 -0.007443 -0.060160
6.166667 -0.003972 0.140976 -0.213530 -0.006992 -0.010688 -0.062404
6.200000 -0.003688 0.140337 -0.214948 -0.001252 -0.013430 -0.062334
6.233333 -0.003068 0.139516 -0.217231 0.003298 -0.015570 -0.060707
