t x y theta dxdt dydt dthetadt
0.000000 0.000000 0.000000 -0.682928 0.083565 -0.077577 0.007888
0.033333 0.002696 -0.002633 -0.680174 0.086187 -0.081585 0.007471
0.066667 0.005445 -0.005291 -0.675411 0.089398 -0.086192 0.005598
0.100000 0.008270 -0.008135 -0.682681 0.093437 -0.091696 0.004176
0.133333 0.011215 -0.011035 -0.677558 0.098658 -0.098553 0.008699
0.166667 0.014497 -0.014113 -0.677579 0.105310 -0.107146 0.023414
0.200000 0.017859 -0.017383 -0.680024 0.113640 -0.117847 0.051133
0.233333 0.021302 -0.020848 -0.675361 0.123789 -0.130886 0.094357
0.266667 0.024827 -0.024510 -0.684521 0.135749 -0.146284 0.158890
0.300000 0.028943 -0.028796 -0.684670 0.149452 -0.163988 0.242207
0.333333 0.033142 -0.033283 -0.680757 0.164755 -0.183838 0.339642
0.366667 0.038180 -0.038817 -0.679433 0.181536 -0.205633 0.444833
0.400000 0.044152 -0.045642 -0.678913 0.199599 -0.229079 0.552875
0.433333 0.051308 -0.053978 -0.659756 0.218728 -0.253858 0.658983
0.466667 0.060032 -0.064121 -0.618371 0.238655 -0.279621 0.753679
0.500000 0.068826 -0.074462 -0.569292 0.259061 -0.305962 0.834262
0.533333 0.077687 -0.084996 -0.529766 0.279409 -0.332255 0.897155
0.566667 0.086608 -0.095719 -0.485422 0.299291 -0.358084 0.941065
0.600000 0.095586 -0.106627 -0.446023 0.318443 -0.383214 0.966150
0.633333 0.106632 -0.119923 -0.421911 0.336526 -0.407417 0.971474
0.666667 0.119742 -0.135587 -0.387618 0.353122 -0.430477 0.962504
0.700000 0.132885 -0.151416 -0.361918 0.367506 -0.451931 0.940576
0.733333 0.146051 -0.167402 -0.346368 0.378905 -0.471346 0.908363
0.766667 0.159232 -0.183535 -0.303822 0.386191 -0.487877 0.866295
0.800000 0.172417 -0.199806 -0.274817 0.387917 -0.500366 0.814324
0.833333 0.186908 -0.217814 -0.236056 0.382955 -0.507839 0.752676
0.866667 0.201382 -0.235940 -0.214956 0.370560 -0.509450 0.681074
0.900000 0.216103 -0.254998 -0.186467 0.350409 -0.504428 0.604112
0.933333 0.230784 -0.274150 -0.157101 0.322626 -0.492319 0.525361
0.966667 0.244353 -0.293042 -0.137113 0.287958 -0.473184 0.453826
1.000000 0.255894 -0.311124 -0.110536 0.247923 -0.447465 0.395401
1.033333 0.264824 -0.327719 -0.113688 0.204219 -0.415800 0.357317
1.066667 0.271028 -0.342511 -0.133322 0.158958 -0.379215 0.344730
1.100000 0.274154 -0.354899 -0.141686 0.114771 -0.339507 0.359248
1.133333 0.274193 -0.364583 -0.148345 0.074558 -0.298628 0.404495
1.166667 0.274165 -0.374304 -0.138529 0.041028 -0.258399 0.474303
1.200000 0.272121 -0.380976 -0.123781 0.016266 -0.220829 0.564904
1.233333 0.268815 -0.384661 -0.087574 0.001915 -0.187784 0.666796
1.266667 0.265466 -0.388389 -0.067283 -0.001236 -0.160786 0.768129
1.300000 0.262080 -0.392168 -0.025203 0.006601 -0.140702 0.855692
1.333333 0.259846 -0.394159 0.010800 0.024166 -0.128091 0.917352
1.366667 0.257592 -0.396214 0.040671 0.049809 -0.123414 0.950369
1.400000 0.257670 -0.398021 0.077911 0.081613 -0.126558 0.952793
1.433333 0.260519 -0.400426 0.133128 0.117336 -0.137067 0.927992
1.466667 0.266280 -0.403915 0.186982 0.154601 -0.154173 0.881617
1.500000 0.274880 -0.408991 0.217894 0.190903 -0.176908 0.823236
1.533333 0.283466 -0.414171 0.241934 0.224326 -0.203971 0.759331
1.566667 0.292035 -0.419461 0.259109 0.252994 -0.233902 0.693576
1.600000 0.302406 -0.426941 0.257297 0.275257 -0.265255 0.630810
1.633333 0.313952 -0.436536 0.260302 0.289946 -0.296551 0.575781
1.666667 0.326072 -0.448238 0.280790 0.296492 -0.326487 0.531219
1.700000 0.338234 -0.461680 0.297897 0.295242 -0.354005 0.499312
1.733333 0.350341 -0.475236 0.320879 0.286504 -0.378370 0.479631
1.766667 0.361218 -0.489902 0.345444 0.270968 -0.398878 0.471026
1.800000 0.372022 -0.504673 0.366012 0.249804 -0.415234 0.467913
1.833333 0.380699 -0.519752 0.370031 0.224593 -0.427568 0.466401
1.866667 0.389289 -0.534928 0.380284 0.196778 -0.436265 0.465739
1.900000 0.395544 -0.550132 0.394954 0.167574 -0.441846 0.461848
1.933333 0.399532 -0.565223 0.413380 0.138378 -0.444855 0.455629
1.966667 0.401258 -0.580015 0.431092 0.110605 -0.446030 0.447909
2.000000 0.402893 -0.594883 0.439867 0.085358 -0.445834 0.442037
2.033333 0.404441 -0.609823 0.468536 0.063149 -0.444466 0.434272
2.066667 0.405905 -0.624831 0.474300 0.044491 -0.441860 0.423031
2.100000 0.406027 -0.639488 0.492830 0.029670 -0.437903 0.407671
2.133333 0.406072 -0.654204 0.501103 0.018679 -0.432346 0.388145
2.166667 0.406042 -0.668976 0.518501 0.011124 -0.424902 0.362244
2.200000 0.405943 -0.683800 0.529616 0.006654 -0.415377 0.328412
2.233333 0.405469 -0.698275 0.545355 0.005042 -0.403795 0.291602
2.266667 0.404933 -0.712795 0.553927 0.005948 -0.390389 0.251888
2.300000 0.404443 -0.726505 0.572005 0.008971 -0.375371 0.210920
2.333333 0.404173 -0.739205 0.576144 0.013885 -0.359296 0.168993
2.366667 0.404283 -0.750736 0.571975 0.020614 -0.342785 0.130796
2.400000 0.405012 -0.761062 0.572170 0.028857 -0.326642 0.102324
2.433333 0.405701 -0.771429 0.573554 0.038296 -0.311505 0.086352
2.466667 0.407279 -0.780554 0.578802 0.048771 -0.298145 0.086689
2.500000 0.408823 -0.789725 0.576425 0.060244 -0.287227 0.104998
2.533333 0.411481 -0.797933 0.571924 0.072443 -0.279272 0.137482
2.566667 0.414108 -0.806193 0.568011 0.085191 -0.274705 0.176488
2.600000 0.416705 -0.814510 0.565502 0.098492 -0.273762 0.208729
2.633333 0.419275 -0.822887 0.567996 0.112319 -0.276803 0.223600
2.666667 0.423872 -0.831662 0.579482 0.126213 -0.283753 0.211350
2.700000 0.428441 -0.840507 0.591687 0.139707 -0.294605 0.166337
2.733333 0.432979 -0.849423 0.637199 0.152467 -0.309160 0.089621
2.766667 0.437485 -0.858414 0.665421 0.164072 -0.327206 -0.012962
2.800000 0.444151 -0.869091 0.699796 0.173914 -0.348288 -0.131032
2.833333 0.450780 -0.879850 0.703349 0.181496 -0.371760 -0.250535
2.866667 0.458393 -0.892041 0.671000 0.186837 -0.397078 -0.357336
2.900000 0.466234 -0.905650 0.627777 0.189993 -0.423655 -0.439890
2.933333 0.473728 -0.920593 0.572068 0.191108 -0.450814 -0.486733
2.966667 0.480521 -0.936735 0.520634 0.190418 -0.477667 -0.493866
3.000000 0.486651 -0.953934 0.484435 0.188578 -0.503654 -0.458375
3.033333 0.492718 -0.971201 0.456390 0.186202 -0.528324 -0.388953
3.066667 0.498295 -0.989617 0.451588 0.183785 -0.551248 -0.297725
3.100000 0.503723 -1.009447 0.454829 0.181761 -0.571967 -0.197635
3.133333 0.509078 -1.029325 0.462063 0.180479 -0.590327 -0.105220
3.166667 0.514357 -1.049242 0.499554 0.180175 -0.606473 -0.033110
3.200000 0.520191 -1.070204 0.512332 0.180692 -0.620427 0.009262
3.233333 0.526617 -1.092021 0.521239 0.181796 -0.632115 0.019734
3.266667 0.532956 -1.113849 0.530284 0.183034 -0.641447 0.001879
3.300000 0.539206 -1.135676 0.516219 0.183855 -0.648325 -0.038473
3.333333 0.545682 -1.157929 0.513883 0.183706 -0.652514 -0.093074
3.366667 0.552199 -1.180337 0.503330 0.182079 -0.653673 -0.149931
3.400000 0.558615 -1.202712 0.490977 0.178576 -0.651366 -0.201985
3.433333 0.564926 -1.225044 0.483400 0.172882 -0.645097 -0.244705
3.466667 0.571128 -1.247320 0.471998 0.164925 -0.634421 -0.275949
3.500000 0.577216 -1.269530 0.457656 0.154878 -0.619000 -0.297069
3.533333 0.583188 -1.291663 0.452112 0.142966 -0.598575 -0.310557
3.566667 0.589040 -1.313708 0.436111 0.129444 -0.572923 -0.319026
3.600000 0.593404 -1.333601 0.427807 0.114833 -0.542395 -0.324994
3.633333 0.596225 -1.351053 0.409926 0.099874 -0.508033 -0.326834
3.666667 0.598922 -1.368391 0.404566 0.085235 -0.471118 -0.322692
3.700000 0.601495 -1.385609 0.396855 0.071536 -0.433286 -0.309402
3.733333 0.603064 -1.400054 0.398737 0.059440 -0.396362 -0.285917
3.766667 0.603993 -1.411736 0.378207 0.049641 -0.362371 -0.258087
3.800000 0.604557 -1.420840 0.365374 0.042403 -0.333079 -0.229849
3.833333 0.604963 -1.427753 0.337983 0.037574 -0.309577 -0.207112
3.866667 0.605255 -1.434546 0.315125 0.034976 -0.292743 -0.196620
3.900000 0.605436 -1.441225 0.325295 0.034208 -0.282952 -0.204603
3.933333 0.606240 -1.448332 0.333549 0.034537 -0.280118 -0.229718
3.966667 0.607761 -1.456734 0.334212 0.034920 -0.283576 -0.267127
4.000000 0.609177 -1.465035 0.365588 0.034502 -0.292082 -0.311784
4.033333 0.611239 -1.475686 0.373567 0.032543 -0.304148 -0.358215
4.066667 0.613198 -1.486242 0.356417 0.028308 -0.318282 -0.399266
4.100000 0.615056 -1.496704 0.315193 0.021317 -0.333036 -0.422748
4.133333 0.616510 -1.509346 0.273989 0.011305 -0.346820 -0.423166
4.166667 0.617865 -1.521892 0.225751 -0.001507 -0.358539 -0.393354
4.200000 0.619122 -1.534343 0.196830 -0.016899 -0.367490 -0.330082
4.233333 0.619137 -1.547658 0.176712 -0.034421 -0.373475 -0.234591
4.266667 0.617598 -1.561320 0.180298 -0.053504 -0.376263 -0.116819
4.300000 0.614151 -1.574657 0.171470 -0.073515 -0.375723 0.007383
4.333333 0.610625 -1.587887 0.190103 -0.093552 -0.372465 0.121102
4.366667 0.607026 -1.601008 0.203539 -0.112929 -0.366968 0.206907
4.400000 0.603362 -1.614019 0.223353 -0.130963 -0.359714 0.256822
4.433333 0.599641 -1.626916 0.252150 -0.147367 -0.351067 0.270038
4.466667 0.592832 -1.637505 0.286574 -0.161935 -0.341571 0.256352
4.500000 0.585986 -1.647978 0.326046 -0.174849 -0.331650 0.224651
4.533333 0.579115 -1.658334 0.338767 -0.186625 -0.321254 0.188972
4.566667 0.572230 -1.668575 0.335506 -0.197892 -0.310226 0.160667
4.600000 0.565343 -1.678701 0.299844 -0.209400 -0.298299 0.144451
4.633333 0.558467 -1.688712 0.271131 -0.221652 -0.285170 0.138365
4.666667 0.551612 -1.698608 0.242718 -0.235481 -0.270199 0.139659
4.700000 0.544792 -1.708390 0.231903 -0.251396 -0.252933 0.146682
4.733333 0.538019 -1.718059 0.252038 -0.269753 -0.233085 0.154292
4.766667 0.529594 -1.726715 0.299381 -0.290542 -0.210660 0.157732
4.800000 0.520205 -1.734298 0.335890 -0.313425 -0.185996 0.151057
4.833333 0.509867 -1.740776 0.372250 -0.337831 -0.159718 0.132182
4.866667 0.498423 -1.745922 0.383658 -0.362676 -0.132850 0.097672
4.900000 0.485761 -1.749670 0.380440 -0.386758 -0.106610 0.049125
4.933333 0.471765 -1.751997 0.360336 -0.408594 -0.082526 -0.004743
4.966667 0.456357 -1.752974 0.328361 -0.426969 -0.061971 -0.050064
5.000000 0.439679 -1.752712 0.310369 -0.440645 -0.046375 -0.072265
5.033333 0.423217 -1.752384 0.293394 -0.448741 -0.036759 -0.055377
5.066667 0.406331 -1.751521 0.296248 -0.450504 -0.034169 0.011899
5.100000 0.389711 -1.750614 0.310851 -0.445597 -0.039098 0.131274
5.133333 0.373262 -1.749978 0.306799 -0.434278 -0.051295 0.293548
5.166667 0.357419 -1.750128 0.293094 -0.416996 -0.070508 0.479921
5.200000 0.341916 -1.750266 0.282018 -0.394741 -0.095814 0.670209
5.233333 0.327892 -1.752394 0.288766 -0.368720 -0.126382 0.836759
5.266667 0.316033 -1.757202 0.340029 -0.340599 -0.160585 0.950726
5.300000 0.304586 -1.762022 0.408926 -0.311838 -0.197066 0.991176
5.333333 0.295763 -1.770293 0.469130 -0.284162 -0.234561 0.944406
5.366667 0.287390 -1.778582 0.546918 -0.259034 -0.271631 0.806344
5.400000 0.281248 -1.790425 0.629980 -0.237756 -0.306925 0.580090
5.433333 0.275591 -1.802282 0.691187 -0.221160 -0.339130 0.280195
5.466667 0.270433 -1.814151 0.736775 -0.209573 -0.367719 -0.067636
5.500000 0.265306 -1.828508 0.731936 -0.203278 -0.391960 -0.433488
5.533333 0.260710 -1.842867 0.675616 -0.201509 -0.411675 -0.788708
5.566667 0.253865 -1.858584 0.590099 -0.203014 -0.426649 -1.105017
5.600000 0.247586 -1.874288 0.478153 -0.205744 -0.437208 -1.354614
5.633333 0.241892 -1.889970 0.379061 -0.207602 -0.443765 -1.517206
5.666667 0.232813 -1.905601 0.302758 -0.206308 -0.446517 -1.579896
5.700000 0.224360 -1.921192 0.248528 -0.199666 -0.446081 -1.544684
5.733333 0.216553 -1.936735 0.200110 -0.186002 -0.442789 -1.416322
5.766667 0.207183 -1.951408 0.156641 -0.164557 -0.437412 -1.209118
5.800000 0.198506 -1.966016 0.104052 -0.134940 -0.430465 -0.944641
5.833333 0.190544 -1.980553 0.075625 -0.096952 -0.422396 -0.646805
5.866667 0.183321 -1.995010 0.040472 -0.050434 -0.413607 -0.339492
5.900000 0.180631 -2.008530 0.021419 0.005043 -0.404344 -0.039639
5.933333 0.184704 -2.021317 0.025352 0.069398 -0.394907 0.231840
5.966667 0.189567 -2.034007 0.052704 0.143117 -0.385313 0.462630
6.000000 0.195229 -2.046594 0.097998 0.225999 -0.375735 0.639032
6.033333 0.201702 -2.059072 0.140600 0.318192 -0.366440 0.754442
6.066667 0.208993 -2.071436 0.213992 0.418891 -0.357783 0.801447
6.100000 0.217112 -2.083678 0.263777 0.526809 -0.350020 0.778016
6.133333 0.235511 -2.094923 0.315600 0.640862 -0.343371 0.692653
6.166667 0.254743 -2.106040 0.357762 0.759569 -0.338152 0.552301
6.200000 0.282450 -2.116493 0.377396 0.880797 -0.334521 0.372311
6.233333 0.317580 -2.126558 0.372363 1.001160 -0.332495 0.167137
6.266667 0.353508 -2.136484 0.347766 1.117907 -0.332046 -0.040695
6.300000 0.395036 -2.146718 0.347381 1.228126 -0.333154 -0.237170
6.333333 0.442076 -2.157574 0.321243 1.329568 -0.335609 -0.411429
6.366667 0.494150 -2.169401 0.299337 1.419534 -0.338873 -0.555796
6.400000 0.546904 -2.181072 0.271731 1.497004 -0.342384 -0.664652
6.433333 0.600302 -2.192581 0.228373 1.562405 -0.345574 -0.736007
6.466667 0.654303 -2.203920 0.203346 1.616057 -0.347766 -0.778886
6.500000 0.711590 -2.216349 0.180125 1.658730 -0.348128 -0.793167
6.533333 0.769399 -2.228597 0.136678 1.691202 -0.345968 -0.782496
6.566667 0.827886 -2.240993 0.105487 1.715295 -0.340978 -0.746639
6.600000 0.886812 -2.253192 0.094434 1.732107 -0.332750 -0.691821
6.633333 0.946134 -2.265186 0.061910 1.742211 -0.320933 -0.624835
6.666667 1.005539 -2.276560 0.040908 1.746327 -0.305294 -0.547992
6.700000 1.064647 -2.287023 0.008084 1.745565 -0.286096 -0.468054
6.733333 1.124022 -2.297260 -0.006804 1.740547 -0.263652 -0.391306
6.766667 1.183624 -2.307265 -0.014114 1.731270 -0.238081 -0.326408
6.800000 1.242018 -2.315731 -0.019349 1.717700 -0.209791 -0.274081
6.833333 1.298843 -2.322422 -0.012229 1.699948 -0.179319 -0.238903
6.866667 1.355128 -2.327314 -0.012324 1.677703 -0.147308 -0.221222
6.900000 1.411479 -2.331961 0.002854 1.650186 -0.114050 -0.225082
6.933333 1.466733 -2.334621 0.005623 1.616412 -0.079965 -0.250165
6.966667 1.521978 -2.337035 -0.010182 1.575878 -0.045654 -0.293463
7.000000 1.575796 -2.337626 -0.032850 1.527902 -0.011639 -0.356860
7.033333 1.629534 -2.337977 -0.054025 1.471522 0.021813 -0.428049
7.066667 1.680932 -2.336765 -0.062752 1.406337 0.054469 -0.502149
7.100000 1.729216 -2.334054 -0.070323 1.331817 0.085910 -0.565278
7.133333 1.773223 -2.329767 -0.069292 1.248660 0.115780 -0.605958
7.166667 1.817032 -2.325261 -0.119706 1.157151 0.143758 -0.612224
7.200000 1.854004 -2.319154 -0.147121 1.059036 0.169423 -0.576547
7.233333 1.890739 -2.312846 -0.187491 0.956207 0.192228 -0.506972
7.266667 1.919729 -2.304980 -0.211950 0.851797 0.211527 -0.407954
7.300000 1.948461 -2.296935 -0.238552 0.749315 0.226931 -0.293644
7.333333 1.968971 -2.287825 -0.285119 0.652316 0.237979 -0.179310
7.366667 1.989220 -2.278558 -0.290373 0.565360 0.244135 -0.091976
7.400000 2.002768 -2.268929 -0.293539 0.491823 0.245232 -0.043354
7.433333 2.010829 -2.259447 -0.257234 0.435503 0.241134 -0.038876
7.466667 2.018658 -2.249844 -0.179119 0.397775 0.232165 -0.088473
7.500000 2.024187 -2.240971 -0.107256 0.379977 0.218598 -0.195522
7.533333 2.029868 -2.233268 -0.098403 0.381758 0.201123 -0.358394
7.566667 2.035372 -2.225481 -0.145940 0.401692 0.180719 -0.555775
7.600000 2.045543 -2.219557 -0.185402 0.437444 0.158347 -0.778983
7.633333 2.055569 -2.213568 -0.238537 0.486057 0.134899 -1.010970
7.666667 2.072641 -2.209886 -0.286901 0.545179 0.111172 -1.226494
7.700000 2.097559 -2.208794 -0.361106 0.611553 0.088033 -1.401101
7.733333 2.122351 -2.207660 -0.408381 0.682155 0.066107 -1.521853
7.766667 2.147015 -2.206485 -0.467515 0.753733 0.045938 -1.593406
7.800000 2.171551 -2.205273 -0.544130 0.824269 0.027690 -1.611069
7.833333 2.195955 -2.204027 -0.609731 0.891639 0.011600 -1.583845
7.866667 2.226704 -2.204217 -0.662028 0.953596 -0.002387 -1.527613
7.900000 2.262751 -2.205383 -0.713962 1.008184 -0.014656 -1.458631
7.933333 2.298642 -2.206521 -0.773726 1.053966 -0.025610 -1.388877
7.966667 2.337656 -2.207926 -0.805997 1.089656 -0.035650 -1.320857
8.000000 2.378710 -2.209504 -0.845924 1.112810 -0.044967 -1.267739
8.033333 2.421015 -2.211231 -0.875055 1.121149 -0.053765 -1.239595
8.066667 2.463092 -2.212928 -0.887599 1.113892 -0.062210 -1.248080
8.100000 2.505131 -2.214977 -0.942434 1.091668 -0.070254 -1.302203
8.133333 2.545680 -2.217410 -0.959250 1.055222 -0.077817 -1.409544
8.166667 2.585939 -2.219809 -0.995731 1.005227 -0.084839 -1.586478
8.200000 2.621001 -2.222793 -1.066963 0.944043 -0.091149 -1.844948
8.233333 2.649469 -2.226585 -1.086394 0.874278 -0.096519 -2.188273
8.266667 2.677609 -2.230331 -1.159261 0.797604 -0.100651 -2.604146
8.300000 2.705413 -2.234027 -1.208633 0.714337 -0.103384 -3.091183
8.333333 2.723433 -2.238150 -1.266653 0.625381 -0.104589 -3.637810
8.366667 2.741116 -2.242212 -1.379292 0.532865 -0.103717 -4.211701
8.400000 2.758470 -2.246211 -1.577991 0.438296 -0.100440 -4.767904
8.433333 2.775500 -2.250140 -1.721010 0.343410 -0.094295 -5.268186
8.466667 2.792212 -2.253997 -1.889719 0.249944 -0.084819 -5.682469
8.500000 2.800758 -2.257017 -2.161192 0.161121 -0.071417 -5.963555
8.533333 2.802035 -2.259407 -2.471736 0.079267 -0.053591 -6.069484
8.566667 2.796720 -2.261482 -2.727129 0.006509 -0.031973 -5.986707
8.600000 2.791164 -2.263466 -3.005680 -0.055210 -0.007101 -5.723281
8.633333 2.780306 -2.266368 3.035860 -0.104199 0.019863 -5.288614
8.666667 2.769274 -2.269172 2.826053 -0.138877 0.047562 -4.702931
8.700000 2.760273 -2.265606 2.648431 -0.159589 0.074157 -4.010701
8.733333 2.751172 -2.261943 2.528645 -0.167074 0.097942 -3.273124
8.766667 2.746101 -2.254522 2.455980 -0.164109 0.117610 -2.537070
8.800000 2.740995 -2.247016 2.423014 -0.153487 0.131859 -1.847529
8.833333 2.735886 -2.239431 2.421554 -0.138549 0.139896 -1.246302
8.866667 2.730804 -2.231776 2.462845 -0.122465 0.141321 -0.762660
8.900000 2.729368 -2.225553 2.475050 -0.107645 0.136889 -0.403609
8.933333 2.728017 -2.219273 2.496989 -0.095798 0.127385 -0.154396
8.966667 2.726996 -2.215124 2.519079 -0.086707 0.114462 0.003525
9.000000 2.725027 -2.213256 2.543765 -0.079793 0.100073 0.097516
9.033333 2.723221 -2.211342 2.564814 -0.074029 0.086073 0.149912
9.066667 2.721606 -2.209383 2.566076 -0.068128 0.074166 0.174461
9.100000 2.717627 -2.208672 2.531157 -0.059883 0.065305 0.172074
9.133333 2.713896 -2.207916 2.480370 -0.047332 0.060302 0.137381
9.166667 2.710441 -2.207115 2.434412 -0.028659 0.059139 0.062716
9.200000 2.707292 -2.206268 2.457715 -0.002409 0.061151 -0.062520
9.233333 2.704964 -2.204888 2.513152 0.033195 0.065585 -0.237127
9.266667 2.704447 -2.202654 2.602405 0.079099 0.071529 -0.458859
9.300000 2.704319 -2.200375 2.654942 0.135198 0.078051 -0.716881
9.333333 2.707858 -2.196850 2.671815 0.201585 0.084230 -0.999954
9.366667 2.711836 -2.193284 2.608180 0.277571 0.089429 -1.287273
9.400000 2.720481 -2.189162 2.503949 0.362086 0.093473 -1.546155
9.433333 2.733994 -2.185066 2.367733 0.453018 0.096359 -1.751874
9.466667 2.747996 -2.180941 2.266107 0.549215 0.098398 -1.871540
9.500000 2.767021 -2.177377 2.151289 0.648966 0.100019 -1.881269
9.533333 2.790971 -2.174460 2.049613 0.750002 0.101809 -1.763455
9.566667 2.819894 -2.172031 1.994575 0.850309 0.104486 -1.528138
9.600000 2.849318 -2.169582 1.917785 0.948234 0.108600 -1.201117
9.633333 2.883782 -2.166913 1.854506 1.042814 0.114590 -0.810481
9.666667 2.923090 -2.163621 1.837259 1.131856 0.122509 -0.394410
9.700000 2.962867 -2.160315 1.855133 1.214230 0.132363 0.014856
9.733333 3.007343 -2.155815 1.900929 1.289092 0.143892 0.382139
9.766667 3.052249 -2.151307 1.925172 1.355849 0.156474 0.698853
9.800000 3.102047 -2.145186 1.991626 1.413549 0.169406 0.957224
9.833333 3.152225 -2.139067 2.033080 1.461265 0.181993 1.152041
9.866667 3.202757 -2.132955 2.125289 1.498774 0.193751 1.282501
9.900000 3.256625 -2.125191 2.181635 1.524938 0.204023 1.347477
9.933333 3.310787 -2.117448 2.220293 1.538876 0.212404 1.357644
9.966667 3.365213 -2.109730 2.251345 1.539097 0.218679 1.311261
10.000000 3.419869 -2.102046 2.278137 1.524868 0.222907 1.216814
10.033333 3.473791 -2.093937 2.337484 1.495919 0.225150 1.083885
10.066667 3.525540 -2.085926 2.383046 1.452648 0.225478 0.929179
10.100000 3.577428 -2.077968 2.445518 1.396795 0.224296 0.766927
10.133333 3.629427 -2.070070 2.499535 1.330308 0.221953 0.596980
10.166667 3.677030 -2.062591 2.506677 1.256526 0.218814 0.421871
10.200000 3.719783 -2.055503 2.509237 1.178795 0.215139 0.234021
10.233333 3.757124 -2.048583 2.478743 1.100415 0.211214 0.026415
10.266667 3.788689 -2.041870 2.451144 1.024374 0.207303 -0.213922
10.300000 3.814220 -2.035151 2.426377 0.953454 0.203511 -0.495455
10.333333 3.839771 -2.028524 2.414666 0.890564 0.199829 -0.806157
10.366667 3.865340 -2.021995 2.426077 0.837614 0.196138 -1.137998
10.400000 3.890929 -2.015569 2.448724 0.795760 0.192256 -1.473685
10.433333 3.916536 -2.009253 2.466831 0.765611 0.187898 -1.798294
10.466667 3.939418 -2.002732 2.386788 0.747583 0.182592 -2.091650
10.500000 3.962321 -1.996332 2.274452 0.741073 0.175882 -2.337954
10.533333 3.984819 -1.990002 2.121488 0.744957 0.167441 -2.535343
10.566667 4.007644 -1.984161 1.945255 0.758248 0.156877 -2.672608
10.600000 4.030500 -1.978457 1.805791 0.780324 0.143833 -2.751834
10.633333 4.053390 -1.972893 1.677539 0.810551 0.127853 -2.777016
10.666667 4.078204 -1.968105 1.608287 0.847649 0.108586 -2.776798
10.700000 4.106208 -1.964166 1.532942 0.890749 0.085411 -2.777919
10.733333 4.134245 -1.960381 1.490536 0.939064 0.057667 -2.800465
10.766667 4.166478 -1.958061 1.444198 0.991106 0.025179 -2.872282
10.800000 4.203117 -1.957641 1.405437 1.045078 -0.012369 -3.001401
10.833333 4.239765 -1.957379 1.320093 1.099103 -0.054807 -3.184479
10.866667 4.276409 -1.957275 1.208459 1.151738 -0.101794 -3.385914
10.900000 4.316982 -1.960238 1.112688 1.201304 -0.152315 -3.568183
10.933333 4.357519 -1.963355 0.973637 1.246027 -0.205379 -3.698886
10.966667 4.400566 -1.970141 0.814290 1.284809 -0.260117 -3.739801
11.000000 4.446235 -1.980793 0.595746 1.316769 -0.314971 -3.663753
11.033333 4.493962 -1.995419 0.356978 1.340845 -0.368185 -3.456567
11.066667 4.541563 -2.010156 0.213765 1.355789 -0.417659 -3.127413
11.100000 4.589011 -2.024986 0.080943 1.361091 -0.461840 -2.691440
11.133333 4.637008 -2.043339 0.011695 1.356461 -0.498852 -2.168524
11.166667 4.684798 -2.061747 -0.031274 1.341924 -0.527327 -1.586449
11.200000 4.732099 -2.082323 -0.055567 1.318031 -0.546678 -0.979698
11.233333 4.778218 -2.104109 -0.054883 1.286228 -0.557203 -0.381778
11.266667 4.822444 -2.126155 -0.048073 1.248289 -0.559362 0.190806
11.300000 4.865007 -2.147999 -0.002214 1.205341 -0.552988 0.723419
11.333333 4.905134 -2.168678 0.043976 1.158683 -0.538612 1.206335
11.366667 4.942241 -2.187236 0.091153 1.109297 -0.516190 1.627831
11.400000 4.975328 -2.202672 0.161867 1.057913 -0.485496 1.979064
11.433333 5.008034 -2.217975 0.203592 1.004705 -0.446021 2.255953
11.466667 5.040348 -2.233125 0.288368 0.950127 -0.397795 2.440553
11.500000 5.072257 -2.248104 0.408878 0.895238 -0.341628 2.518361
11.533333 5.103749 -2.262895 0.530738 0.840687 -0.277868 2.481500
11.566667 5.134813 -2.277479 0.658876 0.787299 -0.207332 2.332373
11.600000 5.160642 -2.285740 0.808117 0.735941 -0.131470 2.081144
11.633333 5.181727 -2.287704 0.931011 0.688057 -0.052155 1.738464
11.666667 5.202365 -2.289428 1.022661 0.644830 0.028630 1.329277
11.700000 5.219980 -2.285540 1.050915 0.607255 0.108412 0.887216
11.733333 5.235746 -2.276657 1.043105 0.576640 0.184085 0.438273
11.766667 5.251072 -2.267540 1.004800 0.553891 0.252471 0.004885
11.800000 5.266532 -2.254764 0.945183 0.539248 0.311275 -0.394131
11.833333 5.282945 -2.239226 0.871171 0.531823 0.358877 -0.741780
11.866667 5.298928 -2.223493 0.835396 0.530546 0.394085 -1.029455
11.900000 5.316780 -2.206433 0.791072 0.533689 0.416946 -1.261148
11.933333 5.334203 -2.189211 0.759058 0.539221 0.428605 -1.437843
11.966667 5.352877 -2.172034 0.722252 0.545196 0.430664 -1.557762
12.000000 5.372431 -2.155486 0.682022 0.549980 0.424853 -1.619914
12.033333 5.392448 -2.140117 0.647779 0.552529 0.413256 -1.623551
12.066667 5.412392 -2.126400 0.591165 0.551806 0.398031 -1.567826
12.100000 5.431672 -2.114592 0.496081 0.547383 0.381100 -1.447905
12.133333 5.450500 -2.102713 0.378286 0.538939 0.363726 -1.263205
12.166667 5.468815 -2.092733 0.268861 0.526420 0.347143 -1.018418
12.200000 5.486670 -2.082702 0.216990 0.510099 0.332183 -0.722862
12.233333 5.504060 -2.072628 0.194291 0.490553 0.318923 -0.392014
12.266667 5.520981 -2.062522 0.210486 0.468575 0.307172 -0.045921
12.300000 5.537428 -2.052391 0.253944 0.445127 0.296313 0.286931
12.333333 5.552518 -2.042346 0.290486 0.421341 0.285967 0.582572
12.366667 5.566224 -2.032237 0.354098 0.398274 0.275438 0.815206
12.400000 5.578532 -2.022287 0.407332 0.377041 0.264107 0.969129
12.433333 5.589377 -2.012890 0.476016 0.358585 0.251810 1.037690
12.466667 5.599146 -2.004893 0.510422 0.343792 0.238633 1.028014
12.500000 5.608432 -1.996922 0.562017 0.333117 0.224910 0.953543
12.533333 5.617238 -1.988984 0.610038 0.326858 0.210801 0.822285
12.566667 5.627036 -1.982962 0.632736 0.325039 0.196793 0.652724
12.600000 5.636354 -1.976985 0.644170 0.327206 0.183333 0.460903
12.633333 5.647906 -1.972085 0.651704 0.332333 0.170732 0.262785
12.666667 5.658973 -1.967238 0.656800 0.339214 0.159022 0.063538
12.700000 5.669552 -1.962448 0.652641 0.346610 0.148194 -0.127247
12.733333 5.681569 -1.957623 0.640427 0.353005 0.138300 -0.290875
12.766667 5.694891 -1.953025 0.622237 0.357055 0.129085 -0.419283
12.800000 5.707709 -1.948493 0.622781 0.357565 0.120303 -0.510878
12.833333 5.721091 -1.944557 0.600056 0.353863 0.111607 -0.566736
12.866667 5.734490 -1.941232 0.529092 0.345405 0.102906 -0.582095
12.900000 5.747361 -1.937980 0.477028 0.331896 0.094145 -0.556524
12.933333 5.759694 -1.934803 0.450200 0.313638 0.085311 -0.499199
12.966667 5.771481 -1.931704 0.430118 0.291174 0.076529 -0.416415
13.000000 5.781767 -1.929294 0.434305 0.265318 0.068002 -0.311851
13.033333 5.790567 -1.927436 0.432488 0.237059 0.059981 -0.189604
13.066667 5.797612 -1.926026 0.438109 0.207579 0.052612 -0.065811
13.100000 5.804082 -1.924694 0.434928 0.177988 0.046002 0.045937
13.133333 5.808856 -1.923590 0.443491 0.149169 0.040212 0.138020
13.166667 5.812188 -1.922639 0.439512 0.121918 0.035304 0.207351
13.200000 5.814449 -1.921800 0.457737 0.096915 0.031231 0.250765
13.233333 5.816122 -1.921036 0.489835 0.074522 0.027900 0.265792
13.266667 5.817536 -1.920241 0.507564 0.054886 0.025196 0.261037
13.300000 5.819069 -1.919392 0.516720 0.038090 0.022988 0.245068
13.333333 5.820008 -1.918616 0.531047 0.024138 0.021140 0.227182
13.366667 5.820351 -1.917912 0.545189 0.012738 0.019509 0.213325
13.400000 5.820096 -1.917278 0.536440 0.003394 0.017993 0.213811
13.433333 5.819239 -1.916714 0.536152 -0.004315 0.016525 0.237091
13.466667 5.817779 -1.916219 0.524555 -0.010851 0.015087 0.289704
13.500000 5.816982 -1.915763 0.527014 -0.016634 0.013725 0.370909
13.533333 5.816758 -1.915340 0.519502 -0.022257 0.012470 0.475169
13.566667 5.815919 -1.914982 0.535126 -0.028141 0.011416 0.590559
13.600000 5.815621 -1.914671 0.538211 -0.034691 0.010711 0.702901
13.633333 5.814699 -1.914423 0.571787 -0.042341 0.010544 0.796485
13.666667 5.814152 -1.914111 0.612810 -0.051536 0.011086 0.853961
13.700000 5.812969 -1.913861 0.681928 -0.062632 0.012412 0.863623
13.733333 5.811143 -1.913671 0.735348 -0.075612 0.014614 0.819044
13.766667 5.808668 -1.913539 0.787567 -0.090264 0.017656 0.725178
13.800000 5.805537 -1.913465 0.839515 -0.106122 0.021406 0.583596
13.833333 5.802125 -1.912908 0.879021 -0.122701 0.025601 0.405270
13.866667 5.798045 -1.912406 0.878625 -0.139343 0.029999 0.204567
13.900000 5.793237 -1.911342 0.854670 -0.155463 0.034348 0.001430
13.933333 5.787406 -1.909730 0.837682 -0.170725 0.038342 -0.185972
13.966667 5.780566 -1.907669 0.804231 -0.185140 0.041728 -0.344288
14.000000 5.773036 -1.905664 0.778779 -0.198570 0.044230 -0.458400
14.033333 5.764812 -1.903714 0.757120 -0.210642 0.045644 -0.521058
14.066667 5.756973 -1.901804 0.720925 -0.221027 0.045700 -0.527310
14.100000 5.750628 -1.900222 0.698486 -0.229544 0.044200 -0.482682
14.133333 5.743570 -1.898699 0.666957 -0.236038 0.040993 -0.396004
14.166667 5.735793 -1.897235 0.651558 -0.240374 0.035936 -0.276724
14.200000 5.727288 -1.895830 0.627075 -0.242964 0.029034 -0.130271
14.233333 5.718049 -1.894485 0.623847 -0.244960 0.020300 0.038855
14.266667 5.708068 -1.893200 0.638535 -0.247591 0.009866 0.220308
14.300000 5.697339 -1.891975 0.655542 -0.251816 -0.002125 0.410101
14.333333 5.689130 -1.891673 0.664655 -0.259064 -0.015456 0.607747
14.366667 5.682586 -1.892172 0.687192 -0.270650 -0.029778 0.811451
14.400000 5.676809 -1.893406 0.728718 -0.288065 -0.044812 1.010186
14.433333 5.670835 -1.895322 0.772227 -0.312033 -0.060150 1.194871
14.466667 5.663332 -1.897991 0.787670 -0.343475 -0.075426 1.366254
14.500000 5.653279 -1.901355 0.834495 -0.383552 -0.090304 1.520592
14.533333 5.642398 -1.904762 0.897454 -0.432225 -0.104521 1.652536
14.566667 5.627054 -1.909055 0.983532 -0.489100 -0.117947 1.755327
14.600000 5.610867 -1.913379 1.053597 -0.552867 -0.130454 1.832290
14.633333 5.593832 -1.917727 1.133934 -0.622411 -0.142088 1.882353
14.666667 5.571705 -1.922856 1.199454 -0.695897 -0.152837 1.899951
14.700000 5.548725 -1.927996 1.274456 -0.771250 -0.162698 1.882426
14.733333 5.520998 -1.933819 1.323972 -0.846794 -0.171568 1.831339
14.766667 5.492424 -1.939637 1.392927 -0.921297 -0.179326 1.754234
14.800000 5.459418 -1.946017 1.450373 -0.993684 -0.185804 1.652559
14.833333 5.422432 -1.952975 1.513002 -1.062668 -0.190736 1.538771
14.866667 5.384628 -1.959902 1.577615 -1.127653 -0.193969 1.428557
14.900000 5.343425 -1.967095 1.625278 -1.187951 -0.195321 1.340115
14.933333 5.301438 -1.974236 1.663796 -1.243327 -0.194800 1.285435
14.966667 5.258683 -1.981316 1.692844 -1.293324 -0.192467 1.277310
15.000000 5.213771 -1.988113 1.720217 -1.337969 -0.188493 1.328087
15.033333 5.168131 -1.994830 1.731606 -1.377823 -0.183155 1.440955
15.066667 5.120595 -2.001016 1.746755 -1.413155 -0.176765 1.609894
15.100000 5.071511 -2.006546 1.776931 -1.444605 -0.169733 1.823450
15.133333 5.021767 -2.011970 1.780680 -1.472498 -0.162318 2.074435
15.166667 4.971386 -2.017279 1.864763 -1.497237 -0.154735 2.340027
15.200000 4.920654 -2.021994 1.999320 -1.519036 -0.146915 2.598702
15.233333 4.869336 -2.026579 2.122343 -1.537852 -0.138740 2.827074
15.266667 4.817456 -2.031027 2.234356 -1.553819 -0.129978 3.010446
15.300000 4.765039 -2.035331 2.377747 -1.567145 -0.120482 3.134403
15.333333 4.712112 -2.039485 2.477469 -1.578382 -0.110350 3.185116
15.366667 4.658699 -2.043481 2.621307 -1.588083 -0.099681 3.162847
15.400000 4.604828 -2.047311 2.742243 -1.597024 -0.088975 3.074685
15.433333 4.550524 -2.050971 2.849328 -1.606034 -0.078667 2.927038
15.466667 4.496883 -2.053768 2.948162 -1.615940 -0.069190 2.725038
15.500000 4.442862 -2.056382 3.025839 -1.627313 -0.060487 2.482313
15.533333 4.390258 -2.055942 3.100528 -1.640456 -0.052424 2.207164
15.566667 4.337325 -2.055310 -3.096847 -1.655756 -0.044729 1.910107
15.600000 4.284085 -2.054485 -3.019550 -1.673280 -0.036855 1.597474
15.633333 4.228841 -2.055888 -2.970698 -1.692928 -0.028082 1.282004
15.666667 4.171395 -2.058661 -2.920230 -1.714239 -0.017640 0.974240
15.700000 4.113723 -2.061228 -2.900425 -1.736779 -0.005210 0.679834
15.733333 4.054817 -2.063388 -2.886484 -1.759893 0.009858 0.407167
15.766667 3.995117 -2.064568 -2.909402 -1.782817 0.027780 0.164987
15.800000 3.935150 -2.064351 -2.924173 -1.805039 0.048312 -0.044819
15.833333 3.873845 -2.062372 -2.948971 -1.826113 0.070535 -0.219474
15.866667 3.812470 -2.060165 -2.968251 -1.846020 0.093310 -0.356100
15.900000 3.750013 -2.056113 -2.997914 -1.864565 0.115468 -0.454657
15.933333 3.687775 -2.050551 -2.998755 -1.881742 0.135840 -0.516327
15.966667 3.624535 -2.043559 -3.019829 -1.897296 0.153874 -0.548435
16.000000 3.561359 -2.036345 -3.035338 -1.910565 0.169879 -0.552522
16.033333 3.497139 -2.028785 -3.058111 -1.920802 0.184932 -0.535359
16.066667 3.433054 -2.021010 -3.082291 -1.927101 0.200245 -0.503324
16.100000 3.367765 -2.014169 -3.107145 -1.928648 0.217671 -0.458621
16.133333 3.300962 -2.009094 3.134630 -1.924674 0.238792 -0.401322
16.166667 3.234408 -2.003815 3.133302 -1.914896 0.264708 -0.335420
16.200000 3.168142 -1.998332 3.130236 -1.899423 0.295796 -0.264753
16.233333 3.102203 -1.992649 3.118334 -1.878732 0.331878 -0.192498
16.266667 3.038457 -1.982994 3.121062 -1.853461 0.372455 -0.121917
16.300000 2.976615 -1.970016 3.123683 -1.824645 0.415905 -0.059744
16.333333 2.916718 -1.954125 3.114533 -1.793604 0.460252 -0.011495
16.366667 2.858953 -1.935412 3.127386 -1.761710 0.503269 0.022731
16.400000 2.801693 -1.916548 3.125061 -1.730271 0.542796 0.046533
16.433333 2.745741 -1.894336 -3.131304 -1.700452 0.576478 0.061044
16.466667 2.690353 -1.872008 -3.128343 -1.673166 0.602488 0.071986
16.500000 2.635560 -1.849586 -3.128251 -1.648884 0.619785 0.086684
16.533333 2.581391 -1.827088 -3.138011 -1.627677 0.627958 0.110412
16.566667 2.527874 -1.804535 -3.140264 -1.609091 0.627423 0.151084
16.600000 2.475038 -1.781948 3.134000 -1.592289 0.618870 0.208594
16.633333 2.422910 -1.759347 3.141424 -1.576253 0.603803 0.286655
16.666667 2.371519 -1.736751 -3.131965 -1.560002 0.583645 0.382061
16.700000 2.319424 -1.716441 -3.141122 -1.541939 0.559928 0.489205
16.733333 2.267357 -1.698177 -3.120025 -1.519705 0.534095 0.599029
16.766667 2.215842 -1.681607 -3.095946 -1.491187 0.507319 0.701443
16.800000 2.164469 -1.666448 -3.069442 -1.454791 0.480859 0.790122
16.833333 2.114133 -1.652637 -3.023549 -1.409032 0.455675 0.854819
16.866667 2.064702 -1.638922 -2.976489 -1.352494 0.432614 0.886645
16.900000 2.016203 -1.625313 -2.929205 -1.285292 0.412102 0.879195
16.933333 1.971727 -1.612671 -2.885882 -1.209582 0.394359 0.833163
16.966667 1.928234 -1.600157 -2.849009 -1.127569 0.379335 0.748716
17.000000 1.885747 -1.587778 -2.818978 -1.041330 0.366679 0.629541
17.033333 1.852033 -1.575926 -2.808592 -0.952888 0.355682 0.490988
17.066667 1.829218 -1.564605 -2.801513 -0.864538 0.345482 0.354906
17.100000 1.807445 -1.553450 -2.777419 -0.777337 0.335138 0.242553
17.133333 1.786717 -1.542470 -2.745753 -0.690950 0.323703 0.169557
17.166667 1.767034 -1.531671 -2.761197 -0.605013 0.310369 0.149721
17.200000 1.748395 -1.521063 -2.803864 -0.519108 0.294441 0.188972
17.233333 1.730801 -1.510652 -2.840162 -0.432888 0.275624 0.276238
17.266667 1.714249 -1.500446 -2.873353 -0.345471 0.253932 0.389890
17.300000 1.698739 -1.490452 -2.884007 -0.256745 0.229334 0.504250
17.333333 1.684267 -1.480678 -2.851629 -0.166857 0.201874 0.592397
17.366667 1.678946 -1.473274 -2.809181 -0.076581 0.171218 0.627857
17.400000 1.681280 -1.468305 -2.739592 0.012753 0.137219 0.587418
17.433333 1.690229 -1.466372 -2.647112 0.099248 0.099270 0.462303
17.466667 1.700152 -1.464675 -2.566932 0.180743 0.056616 0.251589
17.500000 1.711024 -1.463211 -2.511802 0.255217 0.009302 -0.034144
17.533333 1.722816 -1.461979 -2.483795 0.320670 -0.042354 -0.374094
17.566667 1.735500 -1.460976 -2.527525 0.376369 -0.097272 -0.741643
17.600000 1.749047 -1.460201 -2.605499 0.422699 -0.154735 -1.105277
17.633333 1.765408 -1.465824 -2.703949 0.460819 -0.212525 -1.433934
17.666667 1.782571 -1.471662 -2.821068 0.491601 -0.268066 -1.697107
17.700000 1.801068 -1.484411 -2.907641 0.516042 -0.318738 -1.875442
17.733333 1.820300 -1.497349 -2.977580 0.534661 -0.362008 -1.955345
17.766667 1.838652 -1.517074 -3.037372 0.547485 -0.395179 -1.937110
17.800000 1.857674 -1.536947 -3.120320 0.553751 -0.414878 -1.830244
17.833333 1.877334 -1.556942 3.100947 0.552970 -0.419783 -1.649120
17.866667 1.897736 -1.573860 3.031101 0.545123 -0.408996 -1.408258
17.900000 1.918712 -1.590854 2.978157 0.530293 -0.382752 -1.116997
17.933333 1.940232 -1.607903 2.928610 0.509510 -0.341938 -0.786861
17.966667 1.959034 -1.620840 2.905809 0.483819 -0.288904 -0.426205
18.000000 1.974755 -1.629455 2.873293 0.454695 -0.227394 -0.034574
18.033333 1.990936 -1.638075 2.872681 0.423185 -0.160302 0.381005
18.066667 2.001969 -1.641300 2.919643 0.390770 -0.091248 0.805850
18.100000 2.013421 -1.644509 2.966917 0.358687 -0.023262 1.224302
18.133333 2.022319 -1.641638 2.966280 0.327777 0.040578 1.616547
18.166667 2.031602 -1.638747 3.035447 0.298295 0.098405 1.965149
18.200000 2.039790 -1.628865 3.123694 0.270288 0.148952 2.247038
18.233333 2.048337 -1.618973 -3.035530 0.243806 0.190964 2.447466
18.266667 2.057227 -1.609081 -2.891711 0.217828 0.224406 2.559334
18.300000 2.066449 -1.599198 -2.791426 0.191736 0.249187 2.575281
18.333333 2.071673 -1.589426 -2.682280 0.164913 0.266112 2.495650
18.366667 2.077207 -1.579681 -2.580704 0.137167 0.275600 2.332307
18.400000 2.083044 -1.569972 -2.478340 0.108227 0.278879 2.099562
18.433333 2.086778 -1.559897 -2.351135 0.078025 0.277151 1.812542
18.466667 2.088719 -1.549797 -2.319683 0.047133 0.271167 1.496133
18.500000 2.088792 -1.540194 -2.320668 0.015988 0.261669 1.176296
18.533333 2.086698 -1.531462 -2.308229 -0.014993 0.249191 0.878971
18.566667 2.084894 -1.522812 -2.287974 -0.045159 0.234475 0.622630
18.600000 2.083382 -1.514251 -2.276616 -0.073584 0.217871 0.426395
18.633333 2.082165 -1.505789 -2.281706 -0.099742 0.199796 0.310366
18.666667 2.078710 -1.498834 -2.297635 -0.123238 0.180820 0.276831
18.700000 2.073091 -1.493462 -2.317055 -0.143606 0.161762 0.319190
18.733333 2.065622 -1.489699 -2.336252 -0.160455 0.143361 0.422602
18.766667 2.058477 -1.486056 -2.337123 -0.173599 0.126230 0.565671
18.800000 2.051666 -1.482538 -2.327365 -0.183012 0.110830 0.716666
18.833333 2.043828 -1.480150 -2.307493 -0.188328 0.097582 0.836103
18.866667 2.036350 -1.477892 -2.266027 -0.189456 0.086484 0.879691
18.900000 2.029244 -1.475767 -2.195929 -0.186684 0.076964 0.811676
18.933333 2.022524 -1.473776 -2.122430 -0.180486 0.068191 0.607503
18.966667 2.016204 -1.471921 -2.038780 -0.171409 0.058969 0.255358
19.000000 2.010405 -1.469952 -1.938149 -0.160131 0.047686 -0.237347
19.033333 2.004973 -1.467767 -1.889711 -0.147610 0.032712 -0.846985
19.066667 2.000130 -1.465279 -1.903851 -0.134163 0.012999 -1.519557
19.100000 1.995738 -1.462936 -1.940804 -0.119827 -0.011910 -2.194965
19.133333 1.992153 -1.461084 -2.065961 -0.104478 -0.042276 -2.807918
19.166667 1.989369 -1.460435 -2.214347 -0.087409 -0.077406 -3.303277
19.200000 1.987048 -1.461588 -2.449573 -0.067304 -0.115409 -3.630942
19.233333 1.984770 -1.465489 -2.693642 -0.042681 -0.154122 -3.759845
19.266667 1.983003 -1.469538 -2.933721 -0.012909 -0.191848 -3.688994
19.300000 1.980929 -1.478114 -3.113870 0.022961 -0.226605 -3.435356
19.333333 1.978649 -1.492248 3.026962 0.065991 -0.256016 -3.039924
19.366667 1.976918 -1.506503 2.933629 0.116396 -0.278386 -2.548265
19.400000 1.980958 -1.518418 2.897546 0.173114 -0.293149 -2.022539
19.433333 1.985568 -1.530426 2.885587 0.235005 -0.300212 -1.518605
19.466667 1.990757 -1.542516 2.911700 0.301359 -0.299241 -1.083668
19.500000 2.002206 -1.553103 2.933463 0.370267 -0.291059 -0.745889
19.533333 2.019477 -1.562117 2.948402 0.439197 -0.277446 -0.516583
19.566667 2.037329 -1.571183 2.961843 0.505760 -0.260170 -0.393693
19.600000 2.055756 -1.580292 2.966477 0.568653 -0.240525 -0.356056
19.633333 2.078244 -1.587734 2.946883 0.626322 -0.219733 -0.378826
19.666667 2.101293 -1.595203 2.928745 0.677128 -0.199122 -0.431368
19.700000 2.126367 -1.601151 2.892681 0.720621 -0.179378 -0.490273
19.733333 2.153328 -1.605901 2.853997 0.757248 -0.160688 -0.534132
19.766667 2.180813 -1.610664 2.828536 0.787679 -0.143170 -0.550755
19.800000 2.208990 -1.614491 2.799555 0.812219 -0.127088 -0.536970
19.833333 2.237663 -1.618324 2.779485 0.831761 -0.112424 -0.494453
19.866667 2.266415 -1.621413 2.755823 0.847378 -0.099243 -0.427551
19.900000 2.294991 -1.623859 2.738326 0.859973 -0.087539 -0.345840
19.933333 2.324022 -1.626305 2.741555 0.870208 -0.077175 -0.262899
19.966667 2.353495 -1.628751 2.735601 0.878654 -0.068053 -0.186527
20.000000 2.382645 -1.630564 2.730183 0.886043 -0.060035 -0.122394
20.033333 2.412211 -1.632376 2.730791 0.892817 -0.053125 -0.074290
20.066667 2.442178 -1.634186 2.747608 0.899287 -0.047147 -0.047493
20.100000 2.472329 -1.635434 2.749287 0.905506 -0.042005 -0.040016
20.133333 2.502457 -1.636277 2.758159 0.911402 -0.037746 -0.045438
20.166667 2.532947 -1.637120 2.758752 0.917030 -0.034373 -0.060271
20.200000 2.563786 -1.637964 2.763464 0.922274 -0.031824 -0.082417
20.233333 2.594961 -1.638810 2.746231 0.926981 -0.030035 -0.106955
20.266667 2.626459 -1.639660 2.736119 0.930995 -0.028999 -0.126624
20.300000 2.657394 -1.640515 2.721786 0.934342 -0.028652 -0.137829
20.333333 2.688627 -1.641376 2.725447 0.937053 -0.028838 -0.141842
20.366667 2.720144 -1.642243 2.708267 0.939062 -0.029404 -0.137925
20.400000 2.751932 -1.643120 2.705754 0.940366 -0.030250 -0.125778
20.433333 2.783414 -1.644134 2.695162 0.941077 -0.031271 -0.106607
20.466667 2.814598 -1.645310 2.698885 0.941439 -0.032356 -0.086242
20.500000 2.846018 -1.646497 2.697432 0.941478 -0.033446 -0.067631
20.533333 2.877662 -1.647697 2.707629 0.941212 -0.034521 -0.050710
20.566667 2.909120 -1.648861 2.693222 0.940740 -0.035558 -0.036378
20.600000 2.940262 -1.650018 2.703193 0.940206 -0.036536 -0.026056
20.633333 2.971607 -1.651227 2.707202 0.939612 -0.037445 -0.020904
20.666667 3.002834 -1.652486 2.698632 0.938853 -0.038294 -0.016268
20.700000 3.033959 -1.653797 2.694608 0.938005 -0.039086 -0.012425
20.733333 3.065246 -1.655127 2.697572 0.937203 -0.039835 -0.007523
20.766667 3.096683 -1.656478 2.695961 0.936460 -0.040552 -0.004175
20.800000 3.128261 -1.657851 2.689222 0.935705 -0.041247 0.001202
20.833333 3.159469 -1.659288 2.701332 0.934973 -0.041928 0.008436
20.866667 3.190286 -1.660699 2.693006 0.934293 -0.042609 0.014238
20.900000 3.221217 -1.662136 2.696143 0.933604 -0.043329 0.018670
20.933333 3.252251 -1.663598 2.694548 0.932808 -0.044145 0.020314
20.966667 3.283275 -1.665030 2.699780 0.931907 -0.045117 0.021443
21.000000 3.314386 -1.666491 2.706026 0.930938 -0.046318 0.017566
21.033333 3.345575 -1.667982 2.707476 0.929835 -0.047826 0.010737
21.066667 3.376832 -1.669504 2.707854 0.928550 -0.049712 0.002407
21.100000 3.407777 -1.671099 2.696818 0.927091 -0.052000 -0.006626
21.133333 3.438773 -1.672728 2.704454 0.925488 -0.054686 -0.016892
21.166667 3.469814 -1.674391 2.707976 0.923722 -0.057755 -0.026486
21.200000 3.500351 -1.676158 2.700279 0.921839 -0.061168 -0.031100
21.233333 3.530899 -1.678189 2.701524 0.919973 -0.064843 -0.033461
21.266667 3.561502 -1.680509 2.696295 0.918275 -0.068667 -0.033082
21.300000 3.592118 -1.682866 2.692381 0.916831 -0.072549 -0.029501
21.333333 3.622598 -1.685401 2.685067 0.915691 -0.076388 -0.020652
21.366667 3.652990 -1.688082 2.692757 0.914918 -0.080076 -0.010284
21.400000 3.683227 -1.690948 2.697006 0.914488 -0.083516 -0.001223
21.433333 3.713447 -1.693853 2.686269 0.914364 -0.086666 0.009218
21.466667 3.743957 -1.696933 2.682864 0.914476 -0.089530 0.019279
21.500000 3.774436 -1.700052 2.700383 0.914786 -0.092107 0.026136
21.533333 3.804876 -1.703210 2.702900 0.915255 -0.094429 0.027682
21.566667 3.835583 -1.706445 2.692468 0.915807 -0.096547 0.026548
21.600000 3.866237 -1.709718 2.700221 0.916396 -0.098538 0.023741
21.633333 3.896829 -1.713028 2.704316 0.916910 -0.100430 0.016951
21.666667 3.927353 -1.716375 2.703355 0.917289 -0.102257 0.007548
21.700000 3.957800 -1.719758 2.703194 0.917478 -0.104057 -0.000923
21.733333 3.988179 -1.723163 2.707537 0.917433 -0.105859 -0.008139
21.766667 4.019073 -1.726798 2.699431 0.917152 -0.107683 -0.014674
21.800000 4.049868 -1.730467 2.696995 0.916621 -0.109523 -0.021216
21.833333 4.080554 -1.734171 2.696371 0.915887 -0.111405 -0.025638
21.866667 4.111124 -1.737908 2.697326 0.914991 -0.113346 -0.028126
21.900000 4.141570 -1.741677 2.688775 0.913966 -0.115355 -0.029591
21.933333 4.172055 -1.745569 2.698587 0.912838 -0.117438 -0.028466
21.966667 4.202501 -1.749480 2.691887 0.911630 -0.119612 -0.024452
22.000000 4.232822 -1.753449 2.696356 0.910365 -0.121906 -0.016984
22.033333 4.263047 -1.757513 2.694408 0.909005 -0.124309 -0.007224
22.066667 4.293106 -1.761606 2.693156 0.907481 -0.126824 0.003006
22.100000 4.323416 -1.765859 2.689789 0.905702 -0.129472 0.013074
22.133333 4.353543 -1.770138 2.683107 0.903588 -0.132268 0.021317
22.166667 4.383839 -1.774631 2.683787 0.901029 -0.135200 0.026387
22.200000 4.414217 -1.779240 2.692410 0.897981 -0.138272 0.027431
22.233333 4.444385 -1.783870 2.687485 0.894435 -0.141511 0.024692
22.266667 4.474431 -1.788657 2.706493 0.890378 -0.144889 0.019615
22.300000 4.504248 -1.793461 2.710955 0.885850 -0.148354 0.011483
22.333333 4.533654 -1.798373 2.711656 0.880941 -0.151862 0.000580
22.366667 4.562814 -1.803299 2.709180 0.875824 -0.155412 -0.012275
22.400000 4.591856 -1.808544 2.695961 0.870610 -0.158950 -0.024142
22.433333 4.620736 -1.814085 2.694057 0.865398 -0.162393 -0.035069
22.466667 4.649342 -1.819633 2.691394 0.860323 -0.165708 -0.043530
22.500000 4.677665 -1.825184 2.693491 0.855494 -0.168876 -0.048382
22.533333 4.706316 -1.831084 2.688590 0.850836 -0.171825 -0.048688
22.566667 4.734667 -1.836982 2.684216 0.846117 -0.174431 -0.045033
22.600000 4.762706 -1.842876 2.688951 0.841114 -0.176622 -0.040166
22.633333 4.790426 -1.848761 2.684138 0.835570 -0.178351 -0.034548
22.666667 4.818297 -1.854797 2.687063 0.829083 -0.179521 -0.030227
22.700000 4.846223 -1.860919 2.686095 0.821129 -0.180009 -0.025457
22.733333 4.874066 -1.867161 2.684870 0.811365 -0.179764 -0.022302
22.766667 4.901550 -1.873382 2.684039 0.799547 -0.178803 -0.019969
22.800000 4.928788 -1.879602 2.683098 0.785373 -0.177107 -0.018989
22.833333 4.955647 -1.885793 2.678892 0.768635 -0.174674 -0.017555
22.866667 4.981860 -1.891814 2.685670 0.749390 -0.171587 -0.015344
22.900000 5.006939 -1.897561 2.675882 0.727921 -0.167986 -0.015844
22.933333 5.031610 -1.903268 2.685128 0.704400 -0.163969 -0.017400
22.966667 5.055272 -1.908703 2.676374 0.679003 -0.159573 -0.020400
23.000000 5.077604 -1.913821 2.672464 0.652026 -0.154863 -0.021849
23.033333 5.098411 -1.918640 2.689091 0.623806 -0.149909 -0.025725
23.066667 5.118782 -1.923407 2.684244 0.594411 -0.144675 -0.029981
23.100000 5.138041 -1.928326 2.680586 0.563765 -0.139050 -0.032200
23.133333 5.156121 -1.932956 2.670322 0.532005 -0.132981 -0.032396
23.166667 5.173755 -1.937529 2.678813 0.499309 -0.126455 -0.030570
23.200000 5.190938 -1.942041 2.674105 0.465836 -0.119457 -0.028280
23.233333 5.206647 -1.946226 2.663929 0.431649 -0.111956 -0.020163
23.266667 5.220873 -1.950052 2.674134 0.397130 -0.104047 -0.009501
23.300000 5.233471 -1.953444 2.660473 0.362871 -0.095955 0.002376
23.333333 5.244398 -1.956378 2.669341 0.329355 -0.087874 0.012659
23.366667 5.254874 -1.959244 2.667579 0.297048 -0.079997 0.022646
23.400000 5.263527 -1.961473 2.671157 0.266544 -0.072565 0.029513
23.433333 5.270262 -1.963245 2.678121 0.238522 -0.065830 0.028623
23.466667 5.276560 -1.964948 2.673234 0.213446 -0.059963 0.024299
23.500000 5.282427 -1.966583 2.674732 0.191555 -0.055017 0.015915
23.533333 5.287871 -1.968150 2.686214 0.172981 -0.050995 0.007370
23.566667 5.292898 -1.969649 2.690899 0.157822 -0.047875 -0.002741
23.600000 5.297308 -1.971067 2.690057 0.145911 -0.045518 -0.011734
23.633333 5.301315 -1.972419 2.682088 0.136833 -0.043731 -0.016688
23.666667 5.304925 -1.973706 2.667022 0.130188 -0.042328 -0.020745
23.700000 5.308532 -1.975074 2.671777 0.125600 -0.041173 -0.022551
23.733333 5.312242 -1.976456 2.661041 0.122675 -0.040162 -0.021145
