t x y theta dxdt dydt dthetadt
0.000000 0.000000 0.000000 1.697990 -0.016231 -0.150054 0.001501
0.033333 -0.000547 -0.005047 1.699979 -0.016766 -0.153762 0.002176
0.066667 -0.001106 -0.010184 1.701551 -0.017306 -0.157512 0.001339
0.100000 -0.001685 -0.015464 1.705696 -0.017849 -0.161288 0.001130
0.133333 -0.002288 -0.020890 1.692152 -0.018392 -0.165080 0.001095
0.166667 -0.002912 -0.026463 1.704927 -0.018934 -0.168887 0.002017
0.200000 -0.003559 -0.032186 1.704153 -0.019476 -0.172707 0.001403
0.233333 -0.004228 -0.038061 1.699315 -0.020017 -0.176541 0.001888
0.266667 -0.004908 -0.044021 1.700169 -0.020555 -0.180376 0.002660
0.300000 -0.005597 -0.050066 1.691834 -0.021088 -0.184200 0.004623
0.333333 -0.006309 -0.056269 1.697030 -0.021615 -0.188002 0.005532
0.366667 -0.007030 -0.062555 1.697083 -0.022132 -0.191770 0.006424
0.400000 -0.007776 -0.069003 1.703520 -0.022638 -0.195493 -0.002399
0.433333 -0.008545 -0.075615 1.706933 -0.023133 -0.199172 -0.039062
0.466667 -0.009323 -0.082306 1.705035 -0.023620 -0.202816 -0.119314
0.500000 -0.010126 -0.089165 1.702306 -0.024098 -0.206431 -0.263223
0.533333 -0.010954 -0.096193 1.697749 -0.024569 -0.210019 -0.484766
0.566667 -0.011790 -0.103296 1.700205 -0.025030 -0.213569 -0.798902
0.600000 -0.012632 -0.110472 1.700297 -0.025479 -0.217064 -1.196136
0.633333 -0.013480 -0.117718 1.708235 -0.025910 -0.220489 -1.654251
0.666667 -0.014335 -0.125033 1.705891 -0.026320 -0.223828 -2.146547
0.700000 -0.015216 -0.132526 1.697526 -0.026703 -0.227080 -2.642848
0.733333 -0.016124 -0.140201 1.575089 -0.027055 -0.230255 -3.113453
0.766667 -0.017057 -0.148059 1.377526 -0.027370 -0.233361 -3.529129
0.800000 -0.017995 -0.155978 1.180262 -0.027642 -0.236409 -3.870607
0.833333 -0.018937 -0.163955 0.969981 -0.027867 -0.239401 -4.129629
0.866667 -0.019882 -0.171987 0.770985 -0.028038 -0.242338 -4.309168
0.900000 -0.020831 -0.180073 0.592593 -0.028151 -0.245221 -4.407615
0.933333 -0.021782 -0.188209 0.452660 -0.028207 -0.248043 -4.430705
0.966667 -0.022736 -0.196527 0.317965 -0.028209 -0.250807 -4.378694
1.000000 -0.023692 -0.204890 0.246045 -0.028162 -0.253522 -4.268993
1.033333 -0.024640 -0.213417 0.168411 -0.028070 -0.256183 -4.103551
1.066667 -0.025574 -0.222097 0.021048 -0.027941 -0.258771 -3.871475
1.100000 -0.026509 -0.230814 -0.178994 -0.027783 -0.261259 -3.568469
1.133333 -0.027444 -0.239565 -0.296202 -0.027599 -0.263618 -3.187765
1.166667 -0.028361 -0.248453 -0.491672 -0.027392 -0.265825 -2.732060
1.200000 -0.029277 -0.257368 -0.670147 -0.027168 -0.267844 -2.187233
1.233333 -0.030173 -0.266413 -0.760210 -0.026930 -0.269658 -1.562006
1.266667 -0.031068 -0.275479 -0.824372 -0.026682 -0.271268 -0.885011
1.300000 -0.031961 -0.284563 -0.786249 -0.026425 -0.272677 -0.193270
1.333333 -0.032833 -0.293745 -0.766961 -0.026164 -0.273876 0.477803
1.366667 -0.033702 -0.302939 -0.695743 -0.025903 -0.274859 1.085537
1.400000 -0.034568 -0.312141 -0.601750 -0.025645 -0.275620 1.582198
1.433333 -0.035414 -0.321400 -0.504332 -0.025392 -0.276150 1.936949
1.466667 -0.036256 -0.330660 -0.363847 -0.025149 -0.276433 2.134097
1.500000 -0.037082 -0.339948 -0.243566 -0.024921 -0.276450 2.170772
1.533333 -0.037903 -0.349228 -0.150226 -0.024710 -0.276196 2.052017
1.566667 -0.038719 -0.358500 -0.062076 -0.024516 -0.275656 1.795944
1.600000 -0.039527 -0.367750 -0.007620 -0.024341 -0.274827 1.431695
1.633333 -0.040328 -0.376967 0.092844 -0.024180 -0.273717 0.986638
1.666667 -0.041123 -0.386163 0.126750 -0.024032 -0.272325 0.489414
1.700000 -0.041918 -0.395292 0.144611 -0.023886 -0.270658 -0.031327
1.733333 -0.042714 -0.404338 0.118231 -0.023735 -0.268723 -0.548598
1.766667 -0.043510 -0.413285 0.053167 -0.023570 -0.266538 -1.026653
1.800000 -0.044300 -0.422199 0.001228 -0.023379 -0.264115 -1.444252
1.833333 -0.045088 -0.430975 -0.085730 -0.023156 -0.261464 -1.777743
1.866667 -0.045868 -0.439711 -0.160320 -0.022893 -0.258606 -2.009620
1.900000 -0.046641 -0.448284 -0.277277 -0.022586 -0.255571 -2.125723
1.933333 -0.047405 -0.456812 -0.385704 -0.022233 -0.252373 -2.127034
1.966667 -0.048161 -0.465290 -0.459981 -0.021836 -0.249023 -2.035474
2.000000 -0.048893 -0.473569 -0.585856 -0.021395 -0.245538 -1.862246
2.033333 -0.049598 -0.481648 -0.701009 -0.020915 -0.241923 -1.629559
2.066667 -0.050292 -0.489670 -0.754037 -0.020400 -0.238192 -1.359447
2.100000 -0.050959 -0.497503 -0.746998 -0.019858 -0.234358 -1.081649
2.133333 -0.051616 -0.505275 -0.749443 -0.019295 -0.230451 -0.815694
2.166667 -0.052263 -0.512983 -0.739586 -0.018719 -0.226494 -0.571266
2.200000 -0.052883 -0.520509 -0.731242 -0.018136 -0.222513 -0.365799
2.233333 -0.053476 -0.527855 -0.737065 -0.017552 -0.218544 -0.207606
2.266667 -0.054044 -0.535023 -0.742641 -0.016976 -0.214621 -0.100260
2.300000 -0.054600 -0.542119 -0.730649 -0.016408 -0.210754 -0.034922
2.333333 -0.055132 -0.549041 -0.729111 -0.015853 -0.206963 -0.002718
2.366667 -0.055639 -0.555789 -0.742371 -0.015314 -0.203274 0.008471
2.400000 -0.056134 -0.562461 -0.734189 -0.014792 -0.199695 0.008639
2.433333 -0.056618 -0.569055 -0.728716 -0.014287 -0.196215 0.004033
2.466667 -0.057077 -0.575482 -0.733171 -0.013794 -0.192809 0.001111
2.500000 -0.057525 -0.581828 -0.739068 -0.013312 -0.189469 0.001742
2.533333 -0.057961 -0.588092 -0.734619 -0.012838 -0.186157 0.005444
2.566667 -0.058384 -0.594272 -0.733232 -0.012364 -0.182828 0.005466
2.600000 -0.058796 -0.600369 -0.742175 -0.011885 -0.179445 0.005391
2.633333 -0.059185 -0.606309 -0.738400 -0.011401 -0.175996 0.008322
2.666667 -0.059562 -0.612163 -0.737227 -0.010910 -0.172471 0.012167
2.700000 -0.059919 -0.617865 -0.722862 -0.010412 -0.168866 0.012854
2.733333 -0.060262 -0.623479 -0.729932 -0.009908 -0.165193 0.012267
2.766667 -0.060586 -0.628945 -0.736972 -0.009401 -0.161481 0.014718
2.800000 -0.060890 -0.634265 -0.731884 -0.008896 -0.157757 0.016075
2.833333 -0.061175 -0.639441 -0.730214 -0.008394 -0.154038 0.013730
2.866667 -0.061441 -0.644475 -0.730272 -0.007899 -0.150350 0.008632
2.900000 -0.061688 -0.649369 -0.738894 -0.007412 -0.146709 0.006715
