t x y theta dxdt dydt dthetadt
0.000000 0.000000 0.000000 -0.029867 -0.011787 0.026136 -0.004253
0.033333 -0.000304 0.000587 -0.039602 -0.014532 0.028551 -0.007882
0.066667 -0.000881 0.001648 -0.033697 -0.017599 0.031491 -0.008597
0.100000 -0.001457 0.002620 -0.034445 -0.021189 0.035254 -0.005789
0.133333 -0.002055 0.003558 -0.032261 -0.025520 0.040176 -0.002920
0.166667 -0.002740 0.004577 -0.034907 -0.030820 0.046525 -0.001065
0.200000 -0.003512 0.005684 -0.049871 -0.037362 0.054623 0.001787
0.233333 -0.004416 0.006927 -0.050415 -0.045478 0.064790 0.003193
0.266667 -0.005639 0.008717 -0.033563 -0.055463 0.077359 -0.002055
0.300000 -0.007190 0.011067 -0.033661 -0.067480 0.092497 -0.016970
0.333333 -0.009142 0.013791 -0.029964 -0.081641 0.110295 -0.042486
0.366667 -0.011436 0.017099 -0.030925 -0.097917 0.130718 -0.079995
0.400000 -0.014302 0.021058 -0.035386 -0.116086 0.153533 -0.131819
0.433333 -0.017944 0.025845 -0.037550 -0.135844 0.178468 -0.196851
0.466667 -0.021950 0.031249 -0.033114 -0.157057 0.205449 -0.264930
0.500000 -0.027088 0.037930 -0.033937 -0.179738 0.234613 -0.331456
0.533333 -0.033600 0.046162 -0.043223 -0.204006 0.266245 -0.390875
0.566667 -0.041724 0.056311 -0.049547 -0.229956 0.300608 -0.439807
0.600000 -0.050227 0.067112 -0.103868 -0.257954 0.338295 -0.470803
0.633333 -0.059112 0.078571 -0.136146 -0.288338 0.379868 -0.482336
0.666667 -0.068378 0.090693 -0.161953 -0.321249 0.425690 -0.477441
0.700000 -0.078028 0.103483 -0.179862 -0.356644 0.475831 -0.457035
0.733333 -0.088062 0.116946 -0.193782 -0.394324 0.530094 -0.424673
0.766667 -0.100488 0.133527 -0.202986 -0.434201 0.588486 -0.384692
0.800000 -0.115163 0.153193 -0.208596 -0.475740 0.650388 -0.348868
0.833333 -0.132064 0.175909 -0.217166 -0.518213 0.714974 -0.320401
0.866667 -0.151220 0.201879 -0.221061 -0.560661 0.780986 -0.305305
0.900000 -0.170740 0.228512 -0.222547 -0.602212 0.847312 -0.305944
0.933333 -0.192238 0.258291 -0.212087 -0.641935 0.912768 -0.325461
0.966667 -0.215529 0.291186 -0.234315 -0.678909 0.976052 -0.358428
1.000000 -0.240538 0.327170 -0.245483 -0.712547 1.036271 -0.398643
1.033333 -0.265863 0.363762 -0.257707 -0.742546 1.092693 -0.444460
1.066667 -0.291490 0.400944 -0.273988 -0.769048 1.145364 -0.489969
1.100000 -0.318292 0.441093 -0.308631 -0.792132 1.194251 -0.532055
1.133333 -0.345364 0.481791 -0.316507 -0.812171 1.239886 -0.563701
1.166667 -0.373571 0.525652 -0.336372 -0.829526 1.282621 -0.590602
1.200000 -0.402015 0.570013 -0.373070 -0.844653 1.323128 -0.612014
1.233333 -0.430677 0.614848 -0.383838 -0.857939 1.362192 -0.627519
1.266667 -0.459540 0.660129 -0.421206 -0.869606 1.400185 -0.635999
1.300000 -0.489133 0.708066 -0.433998 -0.879971 1.437457 -0.641140
1.333333 -0.518890 0.756392 -0.440054 -0.889164 1.473886 -0.645396
1.366667 -0.548792 0.805079 -0.465180 -0.897369 1.509773 -0.643553
1.400000 -0.578968 0.855720 -0.490775 -0.904612 1.544863 -0.637637
1.433333 -0.609304 0.908074 -0.512298 -0.910865 1.578600 -0.624911
1.466667 -0.640002 0.962446 -0.529261 -0.916025 1.610244 -0.609316
1.500000 -0.670769 1.017046 -0.573146 -0.919938 1.639284 -0.584996
1.533333 -0.701769 1.073127 -0.588438 -0.922374 1.665091 -0.553228
1.566667 -0.732952 1.130423 -0.608696 -0.923059 1.686725 -0.513768
1.600000 -0.764274 1.188695 -0.618478 -0.921749 1.703556 -0.463604
1.633333 -0.795585 1.247042 -0.639967 -0.918088 1.715042 -0.406977
1.666667 -0.826804 1.305749 -0.645815 -0.911671 1.720737 -0.340871
1.700000 -0.857729 1.364482 -0.665866 -0.902209 1.720140 -0.267749
1.733333 -0.888583 1.423168 -0.678070 -0.889637 1.713212 -0.181720
1.766667 -0.919054 1.481664 -0.672805 -0.873709 1.699756 -0.082542
1.800000 -0.948865 1.539682 -0.672598 -0.854241 1.679621 0.031878
1.833333 -0.977699 1.596772 -0.676726 -0.831274 1.652764 0.172779
1.866667 -1.005236 1.652389 -0.697815 -0.805117 1.619385 0.348121
1.900000 -1.032611 1.707761 -0.680988 -0.775970 1.579633 0.561280
1.933333 -1.059808 1.762850 -0.649263 -0.743823 1.533134 0.807230
1.966667 -1.084605 1.814489 -0.658549 -0.709213 1.480375 1.083960
2.000000 -1.106715 1.862168 -0.621490 -0.672777 1.421797 1.378792
2.033333 -1.128607 1.909465 -0.582855 -0.635255 1.358001 1.664078
2.066667 -1.150274 1.956352 -0.536176 -0.597440 1.289640 1.909379
2.100000 -1.169171 1.998603 -0.458912 -0.560503 1.217648 2.090744
2.133333 -1.187825 2.040391 -0.363978 -0.525817 1.143594 2.192358
2.166667 -1.204013 2.077419 -0.235612 -0.494386 1.068543 2.194754
2.200000 -1.217914 2.109729 -0.092544 -0.467220 0.993785 2.093422
2.233333 -1.231559 2.141523 0.042433 -0.445104 0.920654 1.898427
2.266667 -1.243719 2.168989 0.137381 -0.428626 0.850788 1.626689
2.300000 -1.255623 2.195917 0.210898 -0.417832 0.785256 1.299142
2.333333 -1.267199 2.219596 0.243761 -0.412821 0.725028 0.934843
2.366667 -1.279179 2.240698 0.203390 -0.413448 0.670787 0.564093
2.400000 -1.292200 2.259834 0.170231 -0.418997 0.622702 0.210606
2.433333 -1.306719 2.277565 0.137696 -0.428684 0.580824 -0.103889
2.466667 -1.320980 2.294745 0.110389 -0.441626 0.544446 -0.366045
2.500000 -1.334980 2.311375 0.098784 -0.456881 0.513136 -0.572948
2.533333 -1.351111 2.327392 0.084595 -0.472863 0.486009 -0.722314
2.566667 -1.366974 2.342863 0.049868 -0.488137 0.462204 -0.827326
2.600000 -1.382565 2.357791 0.023988 -0.501513 0.440998 -0.900783
2.633333 -1.399967 2.372084 0.010993 -0.511650 0.421587 -0.965542
2.666667 -1.419004 2.385820 -0.035173 -0.517156 0.403484 -1.034884
2.700000 -1.437750 2.399021 -0.074672 -0.516726 0.386262 -1.115695
2.733333 -1.457167 2.411608 -0.133588 -0.509555 0.369777 -1.214759
2.766667 -1.476643 2.423497 -0.165780 -0.494850 0.354081 -1.332877
2.800000 -1.495803 2.434864 -0.194735 -0.472159 0.339303 -1.469484
2.833333 -1.513868 2.445566 -0.234598 -0.441608 0.325597 -1.605902
2.866667 -1.530297 2.455686 -0.257195 -0.403639 0.313163 -1.737661
2.900000 -1.544656 2.465414 -0.308415 -0.359222 0.302081 -1.856703
2.933333 -1.556515 2.474863 -0.382123 -0.309735 0.292328 -1.956969
2.966667 -1.565541 2.484148 -0.499009 -0.257083 0.283762 -2.024740
3.000000 -1.574226 2.492943 -0.587034 -0.203038 0.276277 -2.047199
3.033333 -1.579956 2.501819 -0.679161 -0.149365 0.269665 -2.028923
3.066667 -1.582843 2.510810 -0.757253 -0.097901 0.263574 -1.961561
3.100000 -1.583029 2.519756 -0.832952 -0.050297 0.257700 -1.846707
3.133333 -1.582902 2.528231 -0.924996 -0.007766 0.251813 -1.684044
3.166667 -1.580762 2.536636 -0.948854 0.028984 0.245752 -1.493445
3.200000 -1.576917 2.545072 -0.999887 0.059156 0.239342 -1.292121
3.233333 -1.572801 2.553049 -1.031408 0.082460 0.232625 -1.089042
3.266667 -1.567843 2.560926 -1.062352 0.098987 0.225762 -0.896915
3.300000 -1.562648 2.568351 -1.085127 0.109414 0.219040 -0.724095
3.333333 -1.557749 2.575583 -1.097698 0.114568 0.212661 -0.585190
3.366667 -1.552646 2.582368 -1.108863 0.115471 0.206975 -0.471655
3.400000 -1.547357 2.588707 -1.101733 0.113468 0.202294 -0.383820
3.433333 -1.543432 2.594846 -1.104552 0.109852 0.198706 -0.327847
3.466667 -1.540766 2.600990 -1.088074 0.106010 0.196388 -0.309067
3.500000 -1.537960 2.606696 -1.118701 0.102920 0.195408 -0.321421
3.533333 -1.535788 2.612788 -1.162232 0.101419 0.195849 -0.350373
3.566667 -1.533723 2.619401 -1.155513 0.102016 0.197576 -0.392648
3.600000 -1.531559 2.625580 -1.140043 0.105030 0.200564 -0.436063
3.633333 -1.528522 2.632588 -1.137005 0.110418 0.204847 -0.461552
3.666667 -1.525415 2.639163 -1.150618 0.117656 0.210284 -0.451733
3.700000 -1.520953 2.646585 -1.166871 0.126028 0.216477 -0.410007
3.733333 -1.516454 2.653569 -1.224164 0.134696 0.223133 -0.340961
3.766667 -1.511934 2.660115 -1.305403 0.142863 0.230000 -0.243362
3.800000 -1.506406 2.667628 -1.345297 0.149619 0.236529 -0.119600
3.833333 -1.500276 2.676155 -1.324458 0.154260 0.242121 0.017671
3.866667 -1.494178 2.684232 -1.304178 0.156305 0.246170 0.155330
3.900000 -1.487976 2.693205 -1.261560 0.155611 0.248309 0.288563
3.933333 -1.481877 2.702724 -1.236235 0.152138 0.247977 0.408231
3.966667 -1.476103 2.712313 -1.199482 0.145830 0.244543 0.501205
4.000000 -1.470793 2.721622 -1.163682 0.136909 0.237695 0.556569
4.033333 -1.466088 2.730349 -1.143624 0.125741 0.227382 0.578864
4.066667 -1.462033 2.738440 -1.127300 0.112721 0.213662 0.571391
4.100000 -1.458136 2.746027 -1.116841 0.098126 0.196705 0.544421
4.133333 -1.454872 2.753007 -1.101302 0.082289 0.177003 0.507848
4.166667 -1.452324 2.759087 -1.086454 0.065647 0.155300 0.469552
4.200000 -1.450447 2.763994 -1.068425 0.048484 0.132316 0.439214
4.233333 -1.448791 2.768365 -1.062413 0.030910 0.108603 0.414843
4.266667 -1.448005 2.771364 -1.063342 0.013069 0.084745 0.400355
4.300000 -1.448259 2.773100 -1.036653 -0.004842 0.061277 0.389243
4.333333 -1.448776 2.774282 -1.030806 -0.022671 0.038538 0.382303
4.366667 -1.449568 2.774905 -1.001969 -0.040338 0.016676 0.381677
4.400000 -1.451402 2.774612 -0.999956 -0.057725 -0.004277 0.389919
4.433333 -1.453536 2.773751 -0.975754 -0.074711 -0.024314 0.411506
4.466667 -1.456463 2.772459 -0.967623 -0.091225 -0.043563 0.447249
4.500000 -1.460085 2.770752 -0.970028 -0.107363 -0.062288 0.504545
4.533333 -1.464193 2.768561 -0.951161 -0.123212 -0.080740 0.577601
4.566667 -1.468643 2.765787 -0.945520 -0.138936 -0.099076 0.660903
4.600000 -1.473680 2.762219 -0.925806 -0.154857 -0.117365 0.736477
4.633333 -1.479079 2.758059 -0.913109 -0.171300 -0.135540 0.791815
4.666667 -1.484849 2.753306 -0.886277 -0.188710 -0.153399 0.810656
4.700000 -1.490999 2.747955 -0.856186 -0.207458 -0.170597 0.776170
4.733333 -1.497540 2.742003 -0.791874 -0.227941 -0.186774 0.683879
4.766667 -1.504953 2.735030 -0.723491 -0.250350 -0.201620 0.534093
4.800000 -1.512773 2.727451 -0.650027 -0.274691 -0.214961 0.341708
4.833333 -1.521819 2.719242 -0.605382 -0.300782 -0.226795 0.117236
4.866667 -1.531286 2.710422 -0.606660 -0.328189 -0.237296 -0.116843
4.900000 -1.542229 2.701625 -0.647436 -0.356297 -0.246815 -0.334143
4.933333 -1.554583 2.692988 -0.719646 -0.384328 -0.255855 -0.510294
4.966667 -1.568311 2.684567 -0.768302 -0.411495 -0.265151 -0.626313
5.000000 -1.583408 2.676225 -0.826588 -0.436994 -0.275418 -0.670197
5.033333 -1.599712 2.667905 -0.890362 -0.460108 -0.287473 -0.631002
5.066667 -1.616458 2.658954 -0.941062 -0.480246 -0.302101 -0.513470
5.100000 -1.633819 2.649630 -0.963042 -0.497046 -0.319944 -0.332884
5.133333 -1.651622 2.639666 -0.956969 -0.510453 -0.341358 -0.109070
5.166667 -1.669866 2.629057 -0.953087 -0.520654 -0.366375 0.136066
5.200000 -1.687882 2.617266 -0.920163 -0.528055 -0.394946 0.377505
5.233333 -1.706339 2.604821 -0.879087 -0.533277 -0.426759 0.590426
5.266667 -1.724399 2.590781 -0.868721 -0.537113 -0.461281 0.757581
5.300000 -1.742079 2.574841 -0.823917 -0.540397 -0.497909 0.869747
5.333333 -1.760201 2.558243 -0.781012 -0.543811 -0.536183 0.920038
5.366667 -1.777943 2.539572 -0.733621 -0.548090 -0.575584 0.908529
5.400000 -1.795386 2.518852 -0.687717 -0.553893 -0.615480 0.840875
5.433333 -1.813274 2.497478 -0.635520 -0.561713 -0.655236 0.725703
5.466667 -1.831612 2.475455 -0.587206 -0.571833 -0.694413 0.571360
5.500000 -1.850071 2.451773 -0.568889 -0.584348 -0.732658 0.386882
5.533333 -1.869012 2.426435 -0.566435 -0.599392 -0.769546 0.186346
5.566667 -1.888617 2.399430 -0.560125 -0.616771 -0.804765 -0.020698
5.600000 -1.909018 2.371231 -0.597717 -0.636107 -0.838195 -0.219133
5.633333 -1.930250 2.342064 -0.597080 -0.657032 -0.869784 -0.400271
5.666667 -1.951939 2.312288 -0.634917 -0.679170 -0.899416 -0.549764
5.700000 -1.974953 2.281194 -0.651207 -0.702114 -0.927015 -0.660796
5.733333 -1.999148 2.249239 -0.699577 -0.725323 -0.952624 -0.731568
5.766667 -2.023795 2.216708 -0.724559 -0.748429 -0.976410 -0.760561
5.800000 -2.049524 2.183405 -0.768591 -0.771147 -0.998524 -0.754832
5.833333 -2.075701 2.149551 -0.804355 -0.793192 -1.019146 -0.719759
5.866667 -2.102852 2.115029 -0.836709 -0.814327 -1.038497 -0.664719
5.900000 -2.130443 2.079981 -0.857588 -0.834492 -1.056846 -0.598283
5.933333 -2.158898 2.044311 -0.871866 -0.853738 -1.074434 -0.527598
5.966667 -2.188085 2.008003 -0.886544 -0.872075 -1.091396 -0.457795
6.000000 -2.217695 1.971209 -0.888959 -0.889568 -1.107839 -0.398894
6.033333 -2.247724 1.933941 -0.887434 -0.906299 -1.123872 -0.349066
6.066667 -2.278261 1.896248 -0.903111 -0.922340 -1.139568 -0.313993
6.100000 -2.309200 1.858071 -0.900543 -0.937689 -1.154944 -0.289059
6.133333 -2.340865 1.819238 -0.888368 -0.952334 -1.170020 -0.274699
6.166667 -2.372781 1.780116 -0.942112 -0.966331 -1.184865 -0.266579
6.200000 -2.405531 1.740167 -0.923811 -0.979688 -1.199502 -0.256801
6.233333 -2.438710 1.699707 -0.957816 -0.992395 -1.213936 -0.244106
6.266667 -2.472258 1.658878 -0.957677 -1.004486 -1.228172 -0.223695
6.300000 -2.506166 1.617695 -0.951631 -1.015991 -1.242178 -0.199685
6.333333 -2.540364 1.576027 -0.985192 -1.026963 -1.255877 -0.166963
6.366667 -2.574905 1.534038 -0.982353 -1.037400 -1.269120 -0.134216
6.400000 -2.609590 1.491649 -1.000341 -1.047379 -1.281809 -0.099410
6.433333 -2.644649 1.448615 -0.986445 -1.057016 -1.293845 -0.068564
6.466667 -2.680026 1.404967 -0.983329 -1.066441 -1.305122 -0.043669
6.500000 -2.715768 1.360907 -0.971198 -1.075783 -1.315543 -0.022829
6.533333 -2.751839 1.316457 -0.976596 -1.085133 -1.325037 -0.011040
6.566667 -2.788199 1.271790 -0.974894 -1.094631 -1.333586 -0.004244
6.600000 -2.824844 1.226901 -0.972444 -1.104354 -1.341164 -0.005473
6.633333 -2.861759 1.181830 -0.980014 -1.114314 -1.347775 -0.012038
6.666667 -2.898934 1.136597 -0.984765 -1.124446 -1.353462 -0.020565
6.700000 -2.936372 1.091397 -0.975136 -1.134758 -1.358327 -0.031397
6.733333 -2.974049 1.046072 -0.984965 -1.145267 -1.362488 -0.042577
6.766667 -3.012339 1.000504 -0.973202 -1.155940 -1.366048 -0.053570
6.800000 -3.051325 0.954734 -0.987041 -1.166720 -1.369097 -0.064026
6.833333 -3.090518 0.908894 -0.990730 -1.177635 -1.371714 -0.071793
6.866667 -3.129906 0.863002 -0.989383 -1.188752 -1.373961 -0.078456
6.900000 -3.169936 0.817056 -0.991298 -1.199966 -1.375815 -0.082446
6.933333 -3.210138 0.771095 -0.985208 -1.211169 -1.377244 -0.085400
6.966667 -3.250500 0.725138 -1.000492 -1.222242 -1.378209 -0.085255
7.000000 -3.291009 0.679205 -1.000953 -1.233145 -1.378688 -0.082853
7.033333 -3.332434 0.633091 -1.013471 -1.243658 -1.378624 -0.078878
7.066667 -3.373979 0.587038 -1.015156 -1.253562 -1.377962 -0.073168
7.100000 -3.416314 0.540887 -1.010978 -1.262723 -1.376668 -0.065354
7.133333 -3.458742 0.494835 -1.021505 -1.271047 -1.374718 -0.049580
7.166667 -3.501928 0.448801 -1.012665 -1.278407 -1.372086 -0.027529
7.200000 -3.545177 0.402902 -1.004787 -1.284665 -1.368729 0.004248
7.233333 -3.588474 0.357158 -1.016371 -1.289869 -1.364650 0.044775
7.266667 -3.631804 0.311588 -1.020362 -1.294069 -1.359853 0.095275
7.300000 -3.675152 0.266210 -1.022456 -1.297443 -1.354353 0.154557
7.333333 -3.718502 0.221043 -1.030024 -1.300090 -1.348146 0.216664
7.366667 -3.761838 0.176104 -1.017999 -1.302254 -1.341211 0.279063
7.400000 -3.805146 0.131414 -1.008940 -1.304154 -1.333502 0.336264
7.433333 -3.848409 0.086988 -0.997553 -1.305942 -1.324903 0.383036
7.466667 -3.892091 0.042718 -0.966105 -1.307731 -1.315228 0.410954
7.500000 -3.935697 -0.001251 -0.943479 -1.309451 -1.304233 0.417035
7.533333 -3.979518 -0.044823 -0.911763 -1.311047 -1.291696 0.397335
7.566667 -4.023230 -0.088057 -0.898496 -1.312341 -1.277450 0.354327
7.600000 -4.066818 -0.130937 -0.872851 -1.313094 -1.261322 0.289751
7.633333 -4.110888 -0.173262 -0.865142 -1.313010 -1.243260 0.210384
7.666667 -4.154800 -0.215198 -0.850179 -1.311882 -1.223356 0.126023
7.700000 -4.198947 -0.256339 -0.854155 -1.309558 -1.201866 0.041571
7.733333 -4.243149 -0.296584 -0.856197 -1.305823 -1.178965 -0.034615
7.766667 -4.287187 -0.335781 -0.882426 -1.300492 -1.154848 -0.099799
7.800000 -4.330955 -0.373789 -0.903535 -1.293368 -1.129790 -0.149621
7.833333 -4.374248 -0.410468 -0.904323 -1.284273 -1.103973 -0.184009
7.866667 -4.417283 -0.446672 -0.916846 -1.272989 -1.077510 -0.205939
7.900000 -4.460043 -0.482388 -0.919688 -1.259211 -1.050294 -0.218438
7.933333 -4.502000 -0.516632 -0.919211 -1.242885 -1.022442 -0.224070
7.966667 -4.543649 -0.550366 -0.930246 -1.223808 -0.993902 -0.228511
8.000000 -4.584976 -0.583582 -0.932487 -1.201820 -0.964566 -0.237882
8.033333 -4.625964 -0.616269 -0.934246 -1.176882 -0.934359 -0.255434
8.066667 -4.665447 -0.647112 -0.947013 -1.149055 -0.903314 -0.280235
8.100000 -4.704563 -0.677409 -0.956634 -1.118504 -0.871639 -0.310675
8.133333 -4.741784 -0.705875 -0.964649 -1.085323 -0.839415 -0.347138
8.166667 -4.777346 -0.732811 -0.964465 -1.049942 -0.807028 -0.385949
8.200000 -4.812506 -0.759184 -0.994519 -1.013002 -0.774954 -0.419329
8.233333 -4.845593 -0.783984 -1.005857 -0.975173 -0.743820 -0.443701
8.266667 -4.878259 -0.808214 -1.013362 -0.936939 -0.714127 -0.456820
8.300000 -4.908586 -0.831043 -1.043174 -0.899089 -0.686414 -0.454001
8.333333 -4.936510 -0.852503 -1.067528 -0.862397 -0.661242 -0.431102
8.366667 -4.963999 -0.873391 -1.087584 -0.827478 -0.638939 -0.384971
8.400000 -4.991049 -0.893705 -1.107043 -0.794781 -0.619764 -0.321604
8.433333 -5.015961 -0.913102 -1.116546 -0.764735 -0.603717 -0.243605
8.466667 -5.040433 -0.931929 -1.134410 -0.737851 -0.590722 -0.155467
8.500000 -5.063454 -0.950591 -1.144299 -0.714261 -0.580498 -0.067167
8.533333 -5.086036 -0.968685 -1.138309 -0.693822 -0.572564 0.011088
8.566667 -5.107894 -0.987166 -1.144293 -0.676441 -0.566281 0.069903
8.600000 -5.129382 -1.006170 -1.120714 -0.662011 -0.560918 0.102162
8.633333 -5.150435 -1.024607 -1.085578 -0.650187 -0.555688 0.103553
8.666667 -5.171451 -1.043513 -1.071933 -0.640593 -0.549804 0.070956
8.700000 -5.192558 -1.062703 -1.055543 -0.632849 -0.542426 0.005251
8.733333 -5.213235 -1.081323 -1.052747 -0.626825 -0.532730 -0.085838
8.766667 -5.234341 -1.099882 -1.064495 -0.622161 -0.520023 -0.194573
8.800000 -5.255020 -1.117868 -1.067432 -0.618527 -0.503626 -0.308703
8.833333 -5.275273 -1.135283 -1.067236 -0.615658 -0.483096 -0.419122
8.866667 -5.295102 -1.152123 -1.097902 -0.613354 -0.458163 -0.517829
8.900000 -5.315584 -1.167827 -1.133650 -0.611354 -0.428754 -0.596878
8.933333 -5.335644 -1.182956 -1.187011 -0.609291 -0.395069 -0.656476
8.966667 -5.356161 -1.196565 -1.213442 -0.606928 -0.357660 -0.699001
9.000000 -5.376256 -1.209600 -1.238496 -0.603925 -0.317153 -0.724529
9.033333 -5.396553 -1.220584 -1.256303 -0.599964 -0.274219 -0.738167
9.066667 -5.417066 -1.229378 -1.272133 -0.594644 -0.229583 -0.744746
9.100000 -5.437483 -1.235757 -1.287004 -0.587786 -0.184187 -0.749866
9.133333 -5.457716 -1.239553 -1.319057 -0.579241 -0.138970 -0.752385
9.166667 -5.477523 -1.242807 -1.330493 -0.568963 -0.094517 -0.751161
9.200000 -5.496901 -1.245529 -1.357456 -0.557035 -0.051644 -0.747624
9.233333 -5.515412 -1.245178 -1.376346 -0.543681 -0.011130 -0.737329
9.266667 -5.533492 -1.244321 -1.432767 -0.529211 0.026423 -0.712697
9.300000 -5.551141 -1.242972 -1.464244 -0.513885 0.060737 -0.669652
9.333333 -5.567707 -1.238995 -1.471470 -0.498069 0.091625 -0.610535
9.366667 -5.583841 -1.234558 -1.512279 -0.482010 0.118682 -0.533048
9.400000 -5.599545 -1.229678 -1.539971 -0.465905 0.141769 -0.439795
9.433333 -5.614687 -1.223460 -1.554117 -0.449772 0.160837 -0.334465
9.466667 -5.629332 -1.216381 -1.559986 -0.433630 0.175855 -0.228319
9.500000 -5.643551 -1.208915 -1.564658 -0.417395 0.186585 -0.128684
9.533333 -5.657304 -1.201590 -1.544033 -0.400803 0.192939 -0.041105
9.566667 -5.670633 -1.193916 -1.543941 -0.383690 0.195115 0.025447
9.600000 -5.683249 -1.187052 -1.536847 -0.365888 0.193281 0.066171
9.633333 -5.695444 -1.179876 -1.534819 -0.347363 0.187773 0.080186
9.666667 -5.707220 -1.172406 -1.514706 -0.328051 0.178856 0.070326
9.700000 -5.717995 -1.166346 -1.509377 -0.308071 0.167159 0.043001
9.733333 -5.728357 -1.160026 -1.490952 -0.287678 0.153263 0.004542
9.766667 -5.737509 -1.155199 -1.488405 -0.267148 0.137753 -0.038153
9.800000 -5.746256 -1.150141 -1.490513 -0.246735 0.121174 -0.078433
9.833333 -5.753828 -1.146472 -1.516827 -0.226683 0.104105 -0.114222
9.866667 -5.760441 -1.144097 -1.534255 -0.207284 0.087323 -0.140270
9.900000 -5.766664 -1.141528 -1.556288 -0.188595 0.071277 -0.158556
9.933333 -5.772195 -1.139800 -1.562173 -0.170661 0.056498 -0.167557
9.966667 -5.777197 -1.138702 -1.556304 -0.153409 0.043294 -0.168665
10.000000 -5.781864 -1.138117 -1.558174 -0.136808 0.032079 -0.164922
10.033333 -5.786218 -1.137903 -1.552728 -0.120785 0.022992 -0.158878
10.066667 -5.790171 -1.138027 -1.561763 -0.105179 0.015901 -0.154269
10.100000 -5.793775 -1.138005 -1.566844 -0.090065 0.010752 -0.149754
10.133333 -5.796734 -1.138115 -1.561194 -0.075487 0.007299 -0.148544
10.166667 -5.798848 -1.138272 -1.571618 -0.061574 0.005320 -0.147792
10.200000 -5.800637 -1.138302 -1.573770 -0.048507 0.004430 -0.144464
10.233333 -5.801350 -1.138254 -1.597687 -0.036525 0.004308 -0.135517
10.266667 -5.801758 -1.138089 -1.602149 -0.025905 0.004676 -0.121226
10.300000 -5.801869 -1.137814 -1.606112 -0.016747 0.005302 -0.103715
10.333333 -5.801692 -1.137433 -1.616012 -0.009193 0.005971 -0.080857
10.366667 -5.801442 -1.137149 -1.613198 -0.003293 0.006522 -0.057048
10.400000 -5.800924 -1.136769 -1.614559 0.001056 0.006904 -0.035373
