t x y theta dxdt dydt dthetadt
0.000000 0.000000 0.000000 -0.044263 -0.000602 0.010545 0.003604
0.033333 0.000418 0.000398 -0.049150 -0.003446 0.013928 0.008473
0.066667 0.000610 0.000810 -0.041721 -0.007142 0.018604 0.015172
0.100000 0.000568 0.001235 -0.045989 -0.011747 0.024976 0.024855
0.133333 0.000284 0.001673 -0.054309 -0.017277 0.033460 0.040374
0.166667 -0.000252 0.002121 -0.044012 -0.023690 0.044264 0.059087
0.200000 -0.001046 0.002579 -0.041769 -0.030720 0.057520 0.078463
0.233333 -0.001919 0.003546 -0.051338 -0.037936 0.073605 0.097689
0.266667 -0.003007 0.005439 -0.044603 -0.044890 0.093235 0.116089
0.300000 -0.004532 0.008389 -0.045177 -0.051130 0.116732 0.131043
0.333333 -0.006804 0.012935 -0.033790 -0.056271 0.144054 0.141152
0.366667 -0.009377 0.017473 -0.020067 -0.059965 0.175249 0.151692
0.400000 -0.012257 0.021998 -0.008814 -0.062161 0.210665 0.165864
0.433333 -0.015276 0.028564 0.004634 -0.063030 0.250014 0.185472
0.466667 -0.018051 0.036861 0.011074 -0.062908 0.292188 0.210338
0.500000 -0.021157 0.045119 0.001849 -0.062147 0.336425 0.242238
0.533333 -0.023128 0.055416 -0.003285 -0.061142 0.382319 0.280100
0.566667 -0.024281 0.068845 -0.004582 -0.060243 0.429170 0.317384
0.600000 -0.025005 0.087130 0.007144 -0.059589 0.474787 0.347105
0.633333 -0.026102 0.105317 0.012112 -0.059209 0.517547 0.363386
0.666667 -0.027584 0.123384 0.038839 -0.058975 0.556459 0.361254
0.700000 -0.029460 0.141311 0.073832 -0.058735 0.589909 0.335331
0.733333 -0.031652 0.165394 0.101280 -0.058405 0.615097 0.285253
0.766667 -0.034262 0.189287 0.134288 -0.057990 0.629821 0.213354
0.800000 -0.037302 0.212962 0.144763 -0.057694 0.633637 0.125669
0.833333 -0.040782 0.236390 0.150203 -0.057732 0.625941 0.026040
0.866667 -0.043425 0.261027 0.148131 -0.059024 0.605374 -0.080340
0.900000 -0.044812 0.284999 0.130424 -0.062650 0.571702 -0.187240
0.933333 -0.044660 0.306272 0.098093 -0.069600 0.527170 -0.290321
0.966667 -0.044996 0.327188 0.063383 -0.081177 0.473400 -0.383037
1.000000 -0.045835 0.347723 0.033505 -0.098861 0.411105 -0.458967
1.033333 -0.047073 0.361378 0.027771 -0.124134 0.341548 -0.508572
1.066667 -0.050384 0.367009 0.041612 -0.157145 0.267618 -0.524753
1.100000 -0.054233 0.372204 0.048556 -0.197775 0.191398 -0.504750
1.133333 -0.058633 0.376954 0.027137 -0.245771 0.113192 -0.449252
1.166667 -0.063593 0.381249 -0.020242 -0.300142 0.033982 -0.360983
1.200000 -0.075722 0.379159 -0.077231 -0.358927 -0.044393 -0.243652
1.233333 -0.088425 0.376602 -0.116296 -0.420143 -0.121175 -0.104296
1.266667 -0.101705 0.373575 -0.126834 -0.482554 -0.197059 0.049525
1.300000 -0.119938 0.366007 -0.118702 -0.544749 -0.271995 0.210299
1.333333 -0.142124 0.354270 -0.091264 -0.605067 -0.344972 0.369321
1.366667 -0.164880 0.342071 -0.048501 -0.662209 -0.415320 0.511921
1.400000 -0.189571 0.326463 -0.002679 -0.715977 -0.482838 0.623044
1.433333 -0.215284 0.307868 0.035382 -0.766347 -0.546568 0.692388
1.466667 -0.242377 0.286105 0.062887 -0.813078 -0.604816 0.715007
1.500000 -0.270003 0.263930 0.094581 -0.856652 -0.656667 0.691225
1.533333 -0.299944 0.238276 0.139601 -0.898229 -0.701763 0.625974
1.566667 -0.330392 0.212250 0.165895 -0.938972 -0.739751 0.533841
1.600000 -0.362125 0.185130 0.183532 -0.979553 -0.770620 0.427366
1.633333 -0.395845 0.157105 0.185108 -1.020331 -0.794700 0.320024
1.666667 -0.430027 0.128775 0.184136 -1.061874 -0.812849 0.220310
1.700000 -0.464655 0.100163 0.166167 -1.104112 -0.825685 0.136216
1.733333 -0.501243 0.072106 0.178029 -1.146475 -0.834178 0.073504
1.766667 -0.540618 0.043929 0.174683 -1.188197 -0.839312 0.031991
1.800000 -0.580381 0.015541 0.167215 -1.228682 -0.841782 0.012602
1.833333 -0.622869 -0.012767 0.158570 -1.267282 -0.842174 0.011286
1.866667 -0.668041 -0.040796 0.157015 -1.303027 -0.840746 0.023960
1.900000 -0.713528 -0.068968 0.157834 -1.335037 -0.837562 0.043273
1.933333 -0.759302 -0.097259 0.156007 -1.362737 -0.832257 0.063846
1.966667 -0.806924 -0.124962 0.171107 -1.385758 -0.824349 0.080952
2.000000 -0.854776 -0.152739 0.173974 -1.403552 -0.813312 0.090412
2.033333 -0.902827 -0.180568 0.177773 -1.415986 -0.798722 0.090511
2.066667 -0.951047 -0.208425 0.194033 -1.423437 -0.780359 0.081099
2.100000 -0.999406 -0.236290 0.198284 -1.426504 -0.758355 0.064591
2.133333 -1.048229 -0.262920 0.196943 -1.425510 -0.732840 0.042336
2.166667 -1.097063 -0.288027 0.208149 -1.420801 -0.704127 0.016394
2.200000 -1.145278 -0.311421 0.200235 -1.412932 -0.672947 -0.009618
2.233333 -1.192188 -0.332653 0.196725 -1.402369 -0.640103 -0.034473
2.266667 -1.239089 -0.353794 0.185725 -1.389261 -0.606225 -0.054540
2.300000 -1.285218 -0.372953 0.184763 -1.373711 -0.571923 -0.069677
2.333333 -1.330566 -0.389729 0.169205 -1.356101 -0.538088 -0.077619
2.366667 -1.375824 -0.406375 0.178597 -1.336953 -0.505567 -0.077607
2.400000 -1.420965 -0.422881 0.176500 -1.316517 -0.474692 -0.070498
2.433333 -1.465962 -0.439236 0.179317 -1.294721 -0.445389 -0.056735
2.466667 -1.509260 -0.453334 0.171414 -1.271761 -0.417911 -0.038950
2.500000 -1.550283 -0.465418 0.167607 -1.247746 -0.392315 -0.017800
2.533333 -1.591090 -0.477326 0.160139 -1.222704 -0.368321 0.003837
2.566667 -1.631658 -0.489052 0.162673 -1.196439 -0.345577 0.025313
2.600000 -1.671152 -0.499664 0.164891 -1.169059 -0.324019 0.045076
2.633333 -1.710365 -0.510084 0.167103 -1.140936 -0.303803 0.063209
2.666667 -1.748110 -0.519614 0.174774 -1.112151 -0.284684 0.077978
2.700000 -1.785533 -0.528946 0.179297 -1.082772 -0.266334 0.089086
2.733333 -1.821325 -0.537448 0.186248 -1.052871 -0.248579 0.094188
2.766667 -1.855597 -0.545086 0.190231 -1.022663 -0.231371 0.093583
2.800000 -1.889495 -0.552519 0.195543 -0.992098 -0.214522 0.087956
2.833333 -1.921361 -0.559317 0.191635 -0.961156 -0.197960 0.077738
2.866667 -1.952823 -0.565907 0.202651 -0.929889 -0.181743 0.064457
2.900000 -1.983182 -0.571813 0.202679 -0.898390 -0.166155 0.050228
2.933333 -2.012675 -0.577102 0.203934 -0.866628 -0.151519 0.038357
2.966667 -2.041259 -0.581501 0.203412 -0.834505 -0.138078 0.028816
3.000000 -2.068568 -0.585277 0.203509 -0.802202 -0.126152 0.021877
3.033333 -2.095415 -0.588849 0.201072 -0.769769 -0.115886 0.016653
3.066667 -2.120993 -0.591858 0.193636 -0.737349 -0.107475 0.015328
3.100000 -2.145237 -0.594603 0.201054 -0.704929 -0.100938 0.014937
3.133333 -2.167900 -0.597128 0.203619 -0.672715 -0.096145 0.014703
3.166667 -2.188998 -0.599754 0.198245 -0.640945 -0.092876 0.014097
3.200000 -2.209597 -0.602191 0.199231 -0.609466 -0.090853 0.012433
3.233333 -2.229082 -0.605260 0.210838 -0.578223 -0.089791 0.010371
3.266667 -2.247131 -0.608772 0.204487 -0.547103 -0.089290 0.005673
3.300000 -2.264672 -0.612101 0.213013 -0.516164 -0.088947 0.000236
3.333333 -2.281704 -0.615250 0.211847 -0.485151 -0.088402 -0.004967
3.366667 -2.298225 -0.618221 0.198565 -0.453672 -0.087401 -0.009160
3.400000 -2.314235 -0.621016 0.204848 -0.421710 -0.085654 -0.012898
3.433333 -2.327173 -0.624088 0.206805 -0.389360 -0.082973 -0.014826
3.466667 -2.339600 -0.626989 0.199215 -0.356647 -0.079280 -0.015462
3.500000 -2.351520 -0.629719 0.202164 -0.323735 -0.074573 -0.015211
3.533333 -2.360955 -0.632490 0.195141 -0.291213 -0.068929 -0.013719
3.566667 -2.369890 -0.635095 0.194422 -0.259742 -0.062408 -0.013594
3.600000 -2.378332 -0.637535 0.198705 -0.229861 -0.055158 -0.012593
3.633333 -2.384803 -0.639528 0.207495 -0.201839 -0.047387 -0.013613
3.666667 -2.389768 -0.640877 0.205283 -0.176066 -0.039336 -0.016034
3.700000 -2.394263 -0.642068 0.208923 -0.152765 -0.031277 -0.020328
3.733333 -2.398019 -0.642695 0.193791 -0.131792 -0.023502 -0.026201
3.766667 -2.401323 -0.643171 0.198208 -0.113058 -0.016310 -0.032921
3.800000 -2.404405 -0.643221 0.191937 -0.096477 -0.009998 -0.039814
3.833333 -2.407459 -0.642915 0.196028 -0.081974 -0.004769 -0.044771
3.866667 -2.410063 -0.642631 0.201304 -0.069323 -0.000705 -0.047631
3.900000 -2.412047 -0.642308 0.194820 -0.058297 0.002178 -0.047468
3.933333 -2.413630 -0.641855 0.191183 -0.048739 0.003968 -0.047303
3.966667 -2.414592 -0.641597 0.182472 -0.040440 0.004819 -0.043500
4.000000 -2.415174 -0.641218 0.179693 -0.033141 0.004957 -0.039228
4.033333 -2.415673 -0.640943 0.179698 -0.026693 0.004643 -0.033297
4.066667 -2.416096 -0.640768 0.193727 -0.021046 0.004070 -0.027301
4.100000 -2.416483 -0.640726 0.178490 -0.016108 0.003418 -0.020618
4.133333 -2.417045 -0.640761 0.185869 -0.011831 0.002819 -0.012751
