t x y theta dxdt dydt dthetadt
0.000000 0.000000 0.000000 -0.274914 0.091569 0.058078 -0.015251
0.033333 0.003089 0.002001 -0.279283 0.096161 0.061329 -0.026502
0.066667 0.006268 0.003949 -0.273506 0.100970 0.064741 -0.050112
0.100000 0.009642 0.006093 -0.269928 0.105999 0.068224 -0.085476
0.133333 0.013226 0.008440 -0.266394 0.111253 0.071674 -0.129279
0.166667 0.017022 0.011001 -0.272908 0.116737 0.074985 -0.179196
0.200000 0.021052 0.013780 -0.274334 0.122464 0.078087 -0.228110
0.233333 0.025165 0.016497 -0.274700 0.128460 0.080943 -0.271556
0.266667 0.029549 0.019440 -0.294037 0.134721 0.083463 -0.297506
0.300000 0.034013 0.022315 -0.305502 0.141259 0.085598 -0.300578
0.333333 0.038554 0.025119 -0.330654 0.148046 0.087316 -0.277542
0.366667 0.043480 0.028117 -0.354790 0.155082 0.088612 -0.226122
0.400000 0.048851 0.031279 -0.388158 0.162353 0.089486 -0.146654
0.433333 0.054292 0.034359 -0.402635 0.169785 0.089919 -0.040923
0.466667 0.060232 0.037547 -0.401337 0.177278 0.089924 0.082517
0.500000 0.066236 0.040645 -0.397055 0.184742 0.089488 0.217717
0.533333 0.072301 0.043652 -0.376497 0.192114 0.088590 0.356516
0.566667 0.078891 0.046687 -0.351739 0.199268 0.087217 0.491209
0.600000 0.085996 0.049722 -0.324122 0.206091 0.085366 0.611176
0.633333 0.093149 0.052652 -0.296328 0.212515 0.083022 0.709734
0.666667 0.100345 0.055473 -0.269145 0.218524 0.080199 0.786475
0.700000 0.107962 0.058212 -0.236836 0.224032 0.076891 0.839385
0.733333 0.115611 0.060835 -0.200181 0.228954 0.073096 0.869679
0.766667 0.123289 0.063337 -0.166043 0.233288 0.068812 0.878552
0.800000 0.131273 0.065656 -0.134339 0.237054 0.063998 0.870946
0.833333 0.139515 0.067749 -0.104898 0.240226 0.058618 0.850346
0.866667 0.147768 0.069711 -0.075328 0.242762 0.052567 0.814574
0.900000 0.156027 0.071537 -0.040976 0.244685 0.045745 0.765876
0.933333 0.164285 0.073224 -0.022702 0.246021 0.038057 0.705558
0.966667 0.172646 0.074508 -0.003014 0.246745 0.029416 0.634254
1.000000 0.180996 0.075647 0.033127 0.246840 0.019752 0.550418
1.033333 0.189368 0.076276 0.052327 0.246335 0.009027 0.454384
1.066667 0.197716 0.076753 0.069264 0.245259 -0.002748 0.350076
1.100000 0.206033 0.077077 0.080469 0.243622 -0.015539 0.238014
1.133333 0.214268 0.076738 0.082785 0.241440 -0.029271 0.120903
1.166667 0.222395 0.075689 0.089205 0.238738 -0.043906 0.002165
1.200000 0.230386 0.073892 0.080163 0.235535 -0.059331 -0.108881
1.233333 0.238209 0.071324 0.090072 0.231864 -0.075371 -0.210109
1.266667 0.245971 0.068597 0.075574 0.227778 -0.091802 -0.299221
1.300000 0.253666 0.065711 0.047427 0.223340 -0.108351 -0.371756
1.333333 0.261153 0.062029 0.015572 0.218612 -0.124807 -0.426078
1.366667 0.268418 0.057566 0.000830 0.213663 -0.140917 -0.460647
1.400000 0.275456 0.052346 -0.021307 0.208571 -0.156448 -0.481316
1.433333 0.282266 0.046388 -0.039647 0.203392 -0.171241 -0.485900
1.466667 0.288984 0.040282 -0.050694 0.198163 -0.185206 -0.474957
1.500000 0.295458 0.033510 -0.075941 0.192922 -0.198261 -0.451782
1.533333 0.301693 0.026109 -0.079780 0.187715 -0.210284 -0.421717
1.566667 0.307821 0.018574 -0.089211 0.182575 -0.221205 -0.388158
1.600000 0.313837 0.010911 -0.115665 0.177506 -0.231047 -0.351358
1.633333 0.319737 0.003125 -0.124925 0.172493 -0.239884 -0.315869
1.666667 0.325414 -0.005140 -0.131105 0.167538 -0.247724 -0.283403
1.700000 0.330871 -0.013841 -0.142870 0.162626 -0.254641 -0.257154
1.733333 0.336199 -0.022647 -0.156836 0.157723 -0.260764 -0.233980
1.766667 0.341394 -0.031553 -0.153695 0.152794 -0.266193 -0.214029
1.800000 0.346376 -0.040752 -0.156277 0.147815 -0.270948 -0.197747
1.833333 0.351217 -0.050037 -0.153744 0.142788 -0.274999 -0.185038
1.866667 0.355915 -0.059402 -0.156972 0.137691 -0.278375 -0.177005
1.900000 0.360466 -0.068839 -0.169540 0.132501 -0.281118 -0.170307
1.933333 0.364867 -0.078342 -0.187891 0.127200 -0.283213 -0.166358
1.966667 0.369054 -0.087934 -0.189465 0.121786 -0.284656 -0.164425
2.000000 0.373027 -0.097574 -0.187315 0.116253 -0.285479 -0.165667
2.033333 0.376839 -0.107259 -0.200734 0.110585 -0.285693 -0.168606
2.066667 0.380488 -0.116982 -0.201430 0.104780 -0.285312 -0.172298
2.100000 0.383911 -0.126637 -0.209332 0.098849 -0.284306 -0.178507
2.133333 0.387107 -0.136186 -0.209232 0.092812 -0.282670 -0.187311
2.166667 0.390132 -0.145753 -0.211655 0.086674 -0.280374 -0.196910
2.200000 0.392919 -0.155145 -0.219912 0.080447 -0.277418 -0.204654
2.233333 0.395528 -0.164541 -0.223491 0.074153 -0.273851 -0.211141
2.266667 0.397896 -0.173709 -0.232872 0.067812 -0.269726 -0.215507
2.300000 0.400082 -0.182869 -0.244595 0.061442 -0.265126 -0.216275
2.333333 0.402027 -0.191751 -0.259102 0.055054 -0.260167 -0.211847
2.366667 0.403732 -0.200331 -0.272387 0.048674 -0.255031 -0.204074
2.400000 0.405248 -0.208886 -0.280128 0.042318 -0.249848 -0.192732
2.433333 0.406539 -0.217118 -0.289571 0.035997 -0.244750 -0.177109
2.466667 0.407609 -0.225031 -0.285748 0.029718 -0.239855 -0.157149
2.500000 0.408463 -0.232614 -0.275819 0.023490 -0.235287 -0.135858
2.533333 0.409123 -0.240151 -0.288271 0.017315 -0.231114 -0.115430
2.566667 0.409587 -0.247638 -0.293798 0.011185 -0.227332 -0.097211
2.600000 0.409854 -0.255070 -0.301882 0.005093 -0.223933 -0.082973
2.633333 0.409923 -0.262443 -0.307942 -0.000969 -0.220861 -0.074337
2.666667 0.409792 -0.269753 -0.304802 -0.007014 -0.218010 -0.073748
2.700000 0.409462 -0.276995 -0.305446 -0.013059 -0.215209 -0.078721
2.733333 0.408931 -0.284166 -0.302233 -0.019124 -0.212290 -0.088829
2.766667 0.408199 -0.291261 -0.307164 -0.025227 -0.209091 -0.102511
2.800000 0.407265 -0.298276 -0.293028 -0.031391 -0.205470 -0.121282
2.833333 0.406128 -0.305206 -0.306292 -0.037636 -0.201310 -0.142737
2.866667 0.404788 -0.312049 -0.313513 -0.043984 -0.196540 -0.164304
2.900000 0.403245 -0.318800 -0.322258 -0.050458 -0.191131 -0.184310
2.933333 0.401491 -0.325223 -0.325501 -0.057072 -0.185116 -0.202337
2.966667 0.399533 -0.331546 -0.340060 -0.063828 -0.178560 -0.218062
3.000000 0.397355 -0.337541 -0.346895 -0.070728 -0.171551 -0.227763
3.033333 0.394938 -0.343209 -0.369805 -0.077785 -0.164182 -0.231570
3.066667 0.392267 -0.348546 -0.368626 -0.085005 -0.156564 -0.230005
3.100000 0.389332 -0.353556 -0.373917 -0.092393 -0.148826 -0.224012
3.133333 0.386124 -0.358237 -0.379230 -0.099971 -0.141044 -0.213072
3.166667 0.382715 -0.362802 -0.385136 -0.107764 -0.133276 -0.196656
3.200000 0.379019 -0.367051 -0.391782 -0.115774 -0.125572 -0.175628
3.233333 0.375019 -0.370984 -0.401755 -0.123977 -0.117990 -0.152510
3.266667 0.370823 -0.374798 -0.409304 -0.132334 -0.110563 -0.127068
3.300000 0.366431 -0.378490 -0.417480 -0.140822 -0.103287 -0.100165
3.333333 0.361705 -0.381880 -0.423383 -0.149381 -0.096185 -0.072724
3.366667 0.356631 -0.384972 -0.424656 -0.157974 -0.089281 -0.048811
3.400000 0.351197 -0.387770 -0.418618 -0.166611 -0.082573 -0.030785
3.433333 0.345385 -0.390271 -0.415404 -0.175354 -0.076028 -0.018789
3.466667 0.339183 -0.392481 -0.421080 -0.184300 -0.069621 -0.015213
3.500000 0.332801 -0.394569 -0.407510 -0.193503 -0.063354 -0.021800
3.533333 0.326242 -0.396534 -0.403214 -0.203095 -0.057189 -0.039499
3.566667 0.319508 -0.398377 -0.407536 -0.213169 -0.051087 -0.063183
3.600000 0.312604 -0.400099 -0.403123 -0.223763 -0.045019 -0.092026
3.633333 0.305198 -0.401549 -0.403430 -0.234878 -0.038973 -0.124713
3.666667 0.297631 -0.402880 -0.416825 -0.246516 -0.032929 -0.158779
3.700000 0.289499 -0.403943 -0.434313 -0.258718 -0.026865 -0.190164
3.733333 0.280766 -0.404737 -0.435655 -0.271386 -0.020806 -0.215826
3.766667 0.271401 -0.405262 -0.444455 -0.284397 -0.014797 -0.236801
3.800000 0.261373 -0.405511 -0.459778 -0.297650 -0.008899 -0.249724
3.833333 0.251210 -0.405648 -0.459870 -0.311057 -0.003175 -0.252232
3.866667 0.240353 -0.405526 -0.481604 -0.324437 0.002273 -0.241621
3.900000 0.229377 -0.405295 -0.476282 -0.337601 0.007351 -0.220314
3.933333 0.218288 -0.404958 -0.487684 -0.350481 0.012000 -0.188632
3.966667 0.206479 -0.404408 -0.501871 -0.363039 0.016178 -0.149254
4.000000 0.193963 -0.403671 -0.516952 -0.375191 0.019872 -0.104916
4.033333 0.180764 -0.402783 -0.520918 -0.386756 0.023077 -0.058952
4.066667 0.167490 -0.401798 -0.530313 -0.397638 0.025836 -0.016929
4.100000 0.154150 -0.400718 -0.516039 -0.407712 0.028215 0.017621
4.133333 0.140265 -0.399598 -0.515248 -0.416746 0.030240 0.042022
4.166667 0.125905 -0.398470 -0.502711 -0.424503 0.031929 0.055459
4.200000 0.111149 -0.397375 -0.485734 -0.430781 0.033281 0.054207
4.233333 0.096095 -0.396347 -0.468789 -0.435491 0.034312 0.037318
4.266667 0.081033 -0.395238 -0.474104 -0.438491 0.034995 0.004304
4.300000 0.065974 -0.394050 -0.483948 -0.439662 0.035293 -0.039433
4.333333 0.050931 -0.392786 -0.483802 -0.439028 0.035210 -0.091729
4.366667 0.035917 -0.391448 -0.488654 -0.436654 0.034769 -0.148061
4.400000 0.020944 -0.390040 -0.485733 -0.432642 0.034005 -0.203257
4.433333 0.006023 -0.388563 -0.504130 -0.427090 0.032920 -0.248487
4.466667 -0.008488 -0.387331 -0.515216 -0.420161 0.031582 -0.275392
4.500000 -0.022532 -0.386334 -0.526842 -0.412048 0.030079 -0.279507
4.533333 -0.036056 -0.385555 -0.540242 -0.402874 0.028508 -0.255206
4.566667 -0.049481 -0.384716 -0.549059 -0.392783 0.026966 -0.199880
4.600000 -0.062331 -0.384045 -0.574314 -0.381985 0.025576 -0.106944
4.633333 -0.075059 -0.383317 -0.596297 -0.370668 0.024470 0.020306
4.666667 -0.087656 -0.382534 -0.600032 -0.358987 0.023735 0.177484
4.700000 -0.099570 -0.381829 -0.603270 -0.347051 0.023428 0.358532
4.733333 -0.110774 -0.381174 -0.614262 -0.334995 0.023575 0.552461
4.766667 -0.121816 -0.380469 -0.577345 -0.322883 0.024200 0.745253
4.800000 -0.132135 -0.379755 -0.540320 -0.310676 0.025292 0.915966
4.833333 -0.142275 -0.378994 -0.489965 -0.298336 0.026838 1.044807
4.866667 -0.151738 -0.378147 -0.431742 -0.285884 0.028817 1.114932
4.900000 -0.161008 -0.377254 -0.381857 -0.273322 0.031185 1.111445
4.933333 -0.170077 -0.376318 -0.325546 -0.260610 0.033883 1.027588
4.966667 -0.178937 -0.375339 -0.250687 -0.247747 0.036829 0.865726
5.000000 -0.187227 -0.374138 -0.190886 -0.234758 0.039921 0.636593
5.033333 -0.194952 -0.372735 -0.130738 -0.221688 0.043035 0.356529
5.066667 -0.202110 -0.371159 -0.126451 -0.208530 0.046043 0.048926
5.100000 -0.208716 -0.369427 -0.141984 -0.195353 0.048821 -0.263450
5.133333 -0.214774 -0.367571 -0.179197 -0.182270 0.051255 -0.558556
5.166667 -0.220587 -0.365684 -0.227988 -0.169397 0.053252 -0.815151
5.200000 -0.225891 -0.363729 -0.292949 -0.156828 0.054743 -1.016890
5.233333 -0.230709 -0.361742 -0.357003 -0.144641 0.055691 -1.150147
5.266667 -0.235270 -0.359731 -0.422880 -0.132893 0.056098 -1.214863
5.300000 -0.239394 -0.357749 -0.483210 -0.121599 0.056013 -1.211076
5.333333 -0.243253 -0.355747 -0.524671 -0.110721 0.055499 -1.146049
5.366667 -0.246715 -0.353821 -0.563564 -0.100219 0.054612 -1.032694
5.400000 -0.249795 -0.351989 -0.588472 -0.090053 0.053433 -0.887113
5.433333 -0.252513 -0.350267 -0.622093 -0.080174 0.052060 -0.725455
5.466667 -0.254952 -0.348534 -0.654428 -0.070549 0.050570 -0.556293
5.500000 -0.257112 -0.346792 -0.666270 -0.061135 0.049011 -0.392654
5.533333 -0.258959 -0.345194 -0.663356 -0.051918 0.047439 -0.241340
5.566667 -0.260504 -0.343749 -0.662860 -0.042857 0.045929 -0.106525
5.600000 -0.261761 -0.342300 -0.663215 -0.033919 0.044518 0.011335
5.633333 -0.262729 -0.340850 -0.646257 -0.025076 0.043204 0.111386
5.666667 -0.263405 -0.339399 -0.642916 -0.016297 0.041988 0.192305
5.700000 -0.263823 -0.338105 -0.627666 -0.007563 0.040886 0.257450
5.733333 -0.263946 -0.336815 -0.608780 0.001144 0.039881 0.311408
5.766667 -0.263771 -0.335528 -0.608069 0.009833 0.038923 0.356563
5.800000 -0.263297 -0.334246 -0.583034 0.018518 0.037990 0.391996
5.833333 -0.262523 -0.332972 -0.578526 0.027203 0.037066 0.420655
5.866667 -0.261448 -0.331705 -0.572515 0.035893 0.036125 0.440111
5.900000 -0.260069 -0.330447 -0.550768 0.044584 0.035120 0.449789
5.933333 -0.258476 -0.329314 -0.536881 0.053290 0.034035 0.445294
5.966667 -0.256578 -0.328193 -0.526071 0.062031 0.032860 0.424385
6.000000 -0.254373 -0.327085 -0.489372 0.070819 0.031578 0.389522
6.033333 -0.251861 -0.325992 -0.478410 0.079682 0.030174 0.336995
6.066667 -0.249090 -0.325024 -0.443102 0.088670 0.028649 0.257156
6.100000 -0.246011 -0.324074 -0.425421 0.097848 0.027008 0.133586
6.133333 -0.242623 -0.323141 -0.426726 0.107272 0.025232 -0.052921
6.166667 -0.238953 -0.322303 -0.433457 0.116986 0.023325 -0.323016
6.200000 -0.234991 -0.321551 -0.447254 0.127037 0.021294 -0.697672
6.233333 -0.230719 -0.320820 -0.457343 0.137453 0.019150 -1.186491
6.266667 -0.226091 -0.320187 -0.466443 0.148233 0.016896 -1.782809
6.300000 -0.221075 -0.319658 -0.469829 0.159344 0.014554 -2.470635
6.333333 -0.215747 -0.319152 -0.470550 0.170734 0.012161 -3.223846
6.366667 -0.209969 -0.318761 -0.520419 0.182339 0.009747 -4.010942
6.400000 -0.203718 -0.318490 -0.673859 0.194066 0.007342 -4.791445
6.433333 -0.196983 -0.318333 -0.912611 0.205801 0.004990 -5.530766
6.466667 -0.189756 -0.318286 -1.206770 0.217456 0.002735 -6.186661
6.500000 -0.182223 -0.318267 -1.506668 0.228960 0.000611 -6.716653
6.533333 -0.174384 -0.318274 -1.820662 0.240274 -0.001351 -7.083940
6.566667 -0.166115 -0.318385 -2.056373 0.251396 -0.003113 -7.266490
6.600000 -0.157438 -0.318590 -2.343221 0.262361 -0.004654 -7.257219
6.633333 -0.148392 -0.318866 -2.635716 0.273235 -0.005954 -7.058384
6.666667 -0.139049 -0.319171 -2.885715 0.284050 -0.006996 -6.694916
6.700000 -0.129449 -0.319482 -3.129691 0.294843 -0.007765 -6.202644
6.733333 -0.119654 -0.319759 2.922797 0.305625 -0.008250 -5.622967
6.766667 -0.109571 -0.320066 2.708709 0.316391 -0.008465 -4.977256
6.800000 -0.098781 -0.320448 2.554737 0.327094 -0.008420 -4.288240
6.833333 -0.087708 -0.320861 2.442753 0.337688 -0.008159 -3.580551
6.866667 -0.076128 -0.321215 2.364711 0.348142 -0.007722 -2.872069
6.900000 -0.064105 -0.321470 2.298320 0.358410 -0.007155 -2.174771
6.933333 -0.051811 -0.321755 2.242169 0.368448 -0.006509 -1.494646
6.966667 -0.039263 -0.321865 2.197542 0.378240 -0.005822 -0.853978
7.000000 -0.026452 -0.322006 2.206484 0.387848 -0.005121 -0.274960
7.033333 -0.013380 -0.322182 2.197501 0.397331 -0.004412 0.237442
7.066667 0.000048 -0.322214 2.191194 0.406757 -0.003700 0.684876
7.100000 0.013728 -0.322282 2.253406 0.416243 -0.002947 1.063317
7.133333 0.027654 -0.322386 2.365330 0.425898 -0.002108 1.361071
7.166667 0.041821 -0.322529 2.428847 0.435789 -0.001125 1.579223
7.200000 0.056431 -0.322607 2.513928 0.445889 0.000027 1.728969
7.233333 0.071273 -0.322726 2.585894 0.456172 0.001371 1.813679
7.266667 0.086584 -0.322772 2.670690 0.466570 0.002915 1.826778
7.300000 0.102361 -0.322723 2.741954 0.476969 0.004616 1.776828
7.333333 0.118597 -0.322551 2.785650 0.487231 0.006403 1.688229
7.366667 0.135042 -0.322426 2.820236 0.497242 0.008199 1.574187
7.400000 0.151887 -0.322115 2.900998 0.506888 0.009968 1.445954
7.433333 0.169128 -0.321610 2.956638 0.516035 0.011653 1.317140
7.466667 0.186775 -0.320928 2.985724 0.524583 0.013202 1.208368
7.500000 0.204603 -0.320302 3.017753 0.532424 0.014594 1.127202
7.533333 0.222604 -0.319735 3.040793 0.539453 0.015841 1.068089
7.566667 0.240772 -0.319230 3.064843 0.545546 0.016963 1.029824
7.600000 0.259099 -0.318789 3.081747 0.550675 0.017950 1.009415
7.633333 0.277781 -0.318238 3.104260 0.554818 0.018823 0.997172
7.666667 0.296811 -0.317585 3.134114 0.557938 0.019619 0.980479
7.700000 0.315976 -0.317005 -3.134849 0.560059 0.020341 0.952842
7.733333 0.334790 -0.316153 -3.077931 0.561288 0.020939 0.910912
7.766667 0.353724 -0.315382 -2.998351 0.561758 0.021355 0.848815
7.800000 0.372771 -0.314695 -2.944639 0.561545 0.021538 0.762991
7.833333 0.391565 -0.313880 -2.912786 0.560777 0.021437 0.653575
7.866667 0.410164 -0.313001 -2.901235 0.559615 0.021003 0.523376
7.900000 0.428625 -0.312126 -2.900851 0.558174 0.020219 0.371865
7.933333 0.447169 -0.311352 -2.905537 0.556424 0.019158 0.202123
7.966667 0.465632 -0.310650 -2.903478 0.554312 0.017909 0.025150
8.000000 0.484024 -0.310031 -2.907890 0.551810 0.016571 -0.151913
8.033333 0.502481 -0.309525 -2.923182 0.548857 0.015259 -0.320922
8.066667 0.520995 -0.309136 -2.915597 0.545375 0.014073 -0.477342
8.100000 0.539385 -0.308790 -2.933473 0.541343 0.013109 -0.612926
8.133333 0.557820 -0.308570 -2.941820 0.536863 0.012388 -0.724546
8.166667 0.576009 -0.308351 -2.973189 0.532108 0.011885 -0.811691
8.200000 0.593870 -0.308103 -3.021091 0.527254 0.011556 -0.871670
8.233333 0.611322 -0.307797 -3.085917 0.522515 0.011314 -0.901483
8.266667 0.628303 -0.307382 -3.140781 0.518168 0.011051 -0.897342
8.300000 0.644765 -0.306816 3.105182 0.514467 0.010622 -0.862512
8.333333 0.661375 -0.306285 3.083956 0.511643 0.009891 -0.798118
8.366667 0.678104 -0.305749 3.060408 0.509858 0.008746 -0.711565
8.400000 0.694840 -0.305378 3.037750 0.509233 0.007085 -0.617130
8.433333 0.711673 -0.304961 3.017951 0.509793 0.004815 -0.533408
8.466667 0.728504 -0.304720 2.996113 0.511448 0.001877 -0.473465
8.500000 0.745329 -0.304662 2.989763 0.514049 -0.001725 -0.447590
8.533333 0.762318 -0.304648 3.002594 0.517399 -0.005971 -0.465330
8.566667 0.779521 -0.304741 3.020483 0.521277 -0.010824 -0.531541
8.600000 0.796976 -0.305005 3.010020 0.525437 -0.016242 -0.637440
8.633333 0.814407 -0.305475 2.994989 0.529670 -0.022146 -0.769021
8.666667 0.832121 -0.306187 2.983475 0.533766 -0.028472 -0.919844
8.700000 0.850095 -0.307161 2.960368 0.537511 -0.035184 -1.078920
8.733333 0.868295 -0.308412 2.904684 0.540711 -0.042233 -1.231527
8.766667 0.886670 -0.309941 2.835409 0.543197 -0.049579 -1.357747
8.800000 0.905151 -0.311734 2.775830 0.544856 -0.057183 -1.447956
8.833333 0.923660 -0.313768 2.692322 0.545572 -0.065045 -1.490114
8.866667 0.942125 -0.316033 2.623515 0.545309 -0.073190 -1.467764
8.900000 0.960518 -0.318544 2.558978 0.544106 -0.081661 -1.363874
8.933333 0.978834 -0.321306 2.527126 0.542036 -0.090525 -1.171415
8.966667 0.997066 -0.324323 2.498506 0.539209 -0.099830 -0.895668
9.000000 1.015096 -0.327658 2.444402 0.535759 -0.109681 -0.543058
9.033333 1.032907 -0.331350 2.376625 0.531883 -0.120186 -0.129216
9.066667 1.050616 -0.335310 2.324648 0.527750 -0.131410 0.330385
9.100000 1.068110 -0.339713 2.329084 0.523507 -0.143345 0.803987
9.133333 1.085492 -0.344391 2.375238 0.519254 -0.156038 1.261209
9.166667 1.102669 -0.349586 2.458515 0.515069 -0.169522 1.675494
9.200000 1.119668 -0.355350 2.539732 0.510977 -0.183717 2.023807
9.233333 1.136536 -0.361740 2.667435 0.506931 -0.198435 2.281883
9.266667 1.153267 -0.368414 2.808939 0.502856 -0.213582 2.424030
9.300000 1.169858 -0.375374 2.946832 0.498643 -0.229186 2.444421
9.333333 1.186456 -0.383208 3.048471 0.494218 -0.245114 2.350755
9.366667 1.203135 -0.392003 3.140263 0.489460 -0.261282 2.155620
9.400000 1.219658 -0.401086 -3.037912 0.484260 -0.277699 1.872203
9.433333 1.236017 -0.410457 -2.985433 0.478525 -0.294542 1.530279
9.466667 1.251910 -0.420794 -2.960839 0.472214 -0.311860 1.163821
9.500000 1.267629 -0.431416 -2.936952 0.465324 -0.329615 0.799969
9.533333 1.283169 -0.442322 -2.926378 0.457839 -0.347980 0.453903
9.566667 1.298527 -0.453511 -2.937516 0.449827 -0.367088 0.141832
9.600000 1.313466 -0.465788 -2.940355 0.441423 -0.387053 -0.121033
9.633333 1.327993 -0.479153 -2.968550 0.432811 -0.407764 -0.332501
9.666667 1.342323 -0.492790 -2.990995 0.424173 -0.429229 -0.497589
9.700000 1.356261 -0.507496 -3.033433 0.415712 -0.451336 -0.618811
9.733333 1.369994 -0.522465 -3.067225 0.407672 -0.473862 -0.697573
9.766667 1.383355 -0.538466 -3.094682 0.400280 -0.496532 -0.741781
9.800000 1.396358 -0.555469 -3.108089 0.393671 -0.519047 -0.759632
9.833333 1.409025 -0.573461 -3.138742 0.387941 -0.541248 -0.756943
9.866667 1.421363 -0.592411 3.110573 0.383143 -0.562830 -0.735583
9.900000 1.433479 -0.611585 3.084876 0.379286 -0.583686 -0.703938
9.933333 1.445944 -0.631861 3.057581 0.376239 -0.603567 -0.667450
9.966667 1.458179 -0.652341 3.034676 0.373842 -0.622356 -0.627816
10.000000 1.470719 -0.673829 3.020364 0.371864 -0.639890 -0.584935
10.033333 1.483023 -0.695496 3.004757 0.370068 -0.656082 -0.541044
10.066667 1.495584 -0.718091 2.989282 0.368143 -0.670885 -0.499489
10.100000 1.507901 -0.740840 2.972089 0.365792 -0.684188 -0.460688
10.133333 1.520381 -0.764387 2.950197 0.362796 -0.696029 -0.426977
10.166667 1.532608 -0.788060 2.940241 0.358951 -0.706384 -0.404300
10.200000 1.544885 -0.812391 2.938234 0.354128 -0.715283 -0.399302
10.233333 1.556899 -0.836819 2.920085 0.348171 -0.722636 -0.413867
10.266667 1.568645 -0.861330 2.908591 0.341020 -0.728408 -0.452201
10.300000 1.580120 -0.885908 2.900375 0.332614 -0.732567 -0.513431
10.333333 1.591317 -0.910539 2.894793 0.322918 -0.735088 -0.596582
10.366667 1.602198 -0.935390 2.888422 0.311849 -0.735879 -0.693914
10.400000 1.612674 -0.960349 2.888410 0.299369 -0.734856 -0.796120
10.433333 1.622861 -0.985315 2.854444 0.285521 -0.732021 -0.896667
10.466667 1.632459 -1.010156 2.817817 0.270415 -0.727410 -0.981594
10.500000 1.641761 -1.034972 2.755650 0.254111 -0.720988 -1.041214
10.533333 1.650317 -1.059436 2.699830 0.236748 -0.712782 -1.064866
10.566667 1.658066 -1.083444 2.656867 0.218553 -0.702915 -1.046697
10.600000 1.664969 -1.106898 2.593961 0.199777 -0.691530 -0.983701
10.633333 1.671567 -1.130267 2.555129 0.180626 -0.678742 -0.875262
10.666667 1.677281 -1.152958 2.515962 0.161261 -0.664654 -0.728140
10.700000 1.682095 -1.174882 2.483369 0.141990 -0.649571 -0.550927
10.733333 1.686003 -1.195968 2.478698 0.123047 -0.633758 -0.356815
10.766667 1.689607 -1.216918 2.464232 0.104625 -0.617502 -0.156350
10.800000 1.692908 -1.237721 2.476889 0.086873 -0.601106 0.036027
10.833333 1.695329 -1.257493 2.486474 0.069987 -0.584943 0.208220
10.866667 1.697451 -1.277096 2.506169 0.054071 -0.569225 0.350814
10.900000 1.698737 -1.295573 2.533200 0.039110 -0.553983 0.456909
10.933333 1.699211 -1.312888 2.550869 0.025069 -0.539237 0.527904
10.966667 1.699395 -1.330006 2.583243 0.011908 -0.524962 0.559459
11.000000 1.699292 -1.346921 2.612925 -0.000415 -0.511025 0.559191
11.033333 1.698907 -1.363625 2.651360 -0.012041 -0.497090 0.533482
11.066667 1.698244 -1.380109 2.672983 -0.023021 -0.482971 0.490294
11.100000 1.697307 -1.396368 2.698196 -0.033410 -0.468473 0.434627
11.133333 1.696101 -1.412393 2.703370 -0.043300 -0.453300 0.367998
11.166667 1.694630 -1.428177 2.690692 -0.052785 -0.437157 0.299613
11.200000 1.692668 -1.442787 2.685841 -0.061930 -0.419952 0.228649
11.233333 1.690256 -1.456256 2.700362 -0.070730 -0.401825 0.156358
11.266667 1.687593 -1.469467 2.711905 -0.079200 -0.382914 0.082257
11.300000 1.684686 -1.482415 2.701563 -0.087334 -0.363465 0.011374
11.333333 1.681486 -1.494337 2.727094 -0.095081 -0.343843 -0.054549
11.366667 1.678053 -1.505285 2.726388 -0.102389 -0.324444 -0.114757
11.400000 1.674421 -1.515310 2.725628 -0.109250 -0.305503 -0.166689
11.433333 1.670621 -1.524449 2.714771 -0.115706 -0.287149 -0.204888
11.466667 1.666605 -1.533313 2.699625 -0.121805 -0.269507 -0.224593
11.500000 1.662378 -1.541900 2.672291 -0.127581 -0.252638 -0.225614
11.533333 1.657946 -1.550211 2.656738 -0.133082 -0.236532 -0.205242
11.566667 1.653388 -1.557821 2.630286 -0.138351 -0.221147 -0.165787
11.600000 1.648694 -1.564770 2.615811 -0.143394 -0.206443 -0.109043
11.633333 1.643813 -1.571443 2.606160 -0.148192 -0.192356 -0.042313
11.666667 1.638761 -1.577511 2.618086 -0.152706 -0.178860 0.026652
11.700000 1.633534 -1.583008 2.639844 -0.156909 -0.165972 0.088419
11.733333 1.628138 -1.588233 2.652575 -0.160770 -0.153745 0.135292
11.766667 1.622592 -1.592964 2.664369 -0.164268 -0.142212 0.161269
11.800000 1.616928 -1.597253 2.676735 -0.167384 -0.131431 0.162763
11.833333 1.611183 -1.601159 2.689121 -0.170103 -0.121502 0.139505
11.866667 1.605292 -1.604802 2.699177 -0.172450 -0.112421 0.093565
11.900000 1.599398 -1.608184 2.704597 -0.174455 -0.104128 0.031641
11.933333 1.593549 -1.611374 2.706273 -0.176136 -0.096588 -0.041858
11.966667 1.587571 -1.614310 2.695261 -0.177480 -0.089799 -0.119101
12.000000 1.581717 -1.617176 2.695227 -0.178513 -0.083728 -0.192949
12.033333 1.575745 -1.619795 2.682526 -0.179223 -0.078358 -0.256050
12.066667 1.569663 -1.622170 2.667722 -0.179557 -0.073758 -0.301665
12.100000 1.563475 -1.624303 2.648803 -0.179441 -0.070017 -0.326652
12.133333 1.557525 -1.626563 2.636899 -0.178825 -0.067187 -0.326075
12.166667 1.551480 -1.628588 2.620706 -0.177709 -0.065264 -0.300133
12.200000 1.545344 -1.630381 2.604175 -0.176049 -0.064302 -0.252309
12.233333 1.539123 -1.631945 2.581314 -0.173855 -0.064283 -0.188563
12.266667 1.533136 -1.633699 2.555226 -0.171208 -0.065073 -0.115444
12.300000 1.527366 -1.635643 2.544897 -0.168203 -0.066555 -0.038343
12.333333 1.521803 -1.637800 2.565829 -0.164942 -0.068575 0.033648
12.366667 1.516448 -1.640204 2.585566 -0.161525 -0.070969 0.093117
12.400000 1.511316 -1.642893 2.610398 -0.158124 -0.073447 0.134500
12.433333 1.506124 -1.645363 2.607105 -0.154889 -0.075760 0.157689
12.466667 1.501179 -1.648194 2.626419 -0.151919 -0.077719 0.159761
12.500000 1.496180 -1.650807 2.639926 -0.149297 -0.079151 0.142367
12.533333 1.491440 -1.653842 2.647789 -0.147080 -0.079978 0.110129
12.566667 1.486653 -1.656659 2.646886 -0.145274 -0.080202 0.069449
12.600000 1.481820 -1.659259 2.648054 -0.143813 -0.079962 0.028323
12.633333 1.477230 -1.662326 2.632560 -0.142655 -0.079340 -0.013228
12.666667 1.472600 -1.665175 2.634594 -0.141733 -0.078480 -0.049696
12.700000 1.467931 -1.667802 2.624116 -0.141003 -0.077487 -0.079984
12.733333 1.463226 -1.670208 2.609993 -0.140418 -0.076417 -0.103972
12.766667 1.458487 -1.672391 2.616870 -0.139952 -0.075286 -0.122744
12.800000 1.453716 -1.674349 2.616004 -0.139611 -0.074114 -0.140423
12.833333 1.449070 -1.676786 2.623361 -0.139364 -0.072976 -0.157198
12.866667 1.444538 -1.679707 2.617658 -0.139228 -0.071877 -0.175114
12.900000 1.439981 -1.682398 2.603473 -0.139208 -0.070769 -0.194476
12.933333 1.435399 -1.684858 2.598266 -0.139334 -0.069644 -0.214173
12.966667 1.430794 -1.687084 2.581434 -0.139640 -0.068490 -0.232848
13.000000 1.426169 -1.689072 2.581913 -0.140160 -0.067237 -0.246896
13.033333 1.421536 -1.691474 2.577502 -0.140945 -0.065839 -0.253308
13.066667 1.416886 -1.693634 2.556550 -0.142019 -0.064321 -0.248497
13.100000 1.412221 -1.695549 2.554092 -0.143405 -0.062759 -0.234065
13.133333 1.407469 -1.697741 2.529949 -0.145114 -0.061147 -0.211247
13.166667 1.402706 -1.699682 2.522196 -0.147158 -0.059476 -0.182021
13.200000 1.397813 -1.701805 2.509023 -0.149534 -0.057713 -0.148101
13.233333 1.392913 -1.703669 2.509444 -0.152241 -0.055841 -0.112254
13.266667 1.387851 -1.705630 2.517511 -0.155279 -0.053762 -0.081395
13.300000 1.382784 -1.707325 2.511544 -0.158671 -0.051386 -0.054687
13.333333 1.377528 -1.709053 2.515112 -0.162411 -0.048680 -0.036099
13.366667 1.372070 -1.710782 2.517937 -0.166504 -0.045589 -0.027292
13.400000 1.366398 -1.712482 2.526634 -0.170955 -0.042100 -0.029921
13.433333 1.360731 -1.713899 2.528101 -0.175766 -0.038137 -0.045585
13.466667 1.354831 -1.715250 2.522511 -0.180911 -0.033662 -0.068375
13.500000 1.348943 -1.716309 2.522084 -0.186343 -0.028602 -0.099857
13.533333 1.342793 -1.717265 2.517808 -0.192034 -0.022893 -0.134864
13.566667 1.336360 -1.718085 2.514600 -0.197907 -0.016500 -0.171366
13.600000 1.329640 -1.718740 2.506465 -0.203882 -0.009367 -0.207403
13.633333 1.322618 -1.719193 2.503777 -0.209815 -0.001457 -0.239122
13.666667 1.315627 -1.719332 2.483548 -0.215614 0.007249 -0.268456
13.700000 1.308322 -1.719174 2.470237 -0.221153 0.016791 -0.291687
13.733333 1.300704 -1.718657 2.473768 -0.226306 0.027197 -0.307471
13.766667 1.292768 -1.717732 2.441559 -0.231009 0.038565 -0.308771
13.800000 1.284882 -1.716476 2.444828 -0.235225 0.051005 -0.294472
13.833333 1.276670 -1.714670 2.428236 -0.238999 0.064693 -0.259301
13.866667 1.268519 -1.712526 2.419810 -0.242381 0.079921 -0.199074
13.900000 1.260435 -1.710042 2.401390 -0.245478 0.096962 -0.109316
13.933333 1.252055 -1.706749 2.397506 -0.248422 0.116177 0.011012
13.966667 1.243754 -1.703111 2.377367 -0.251343 0.137888 0.157129
14.000000 1.235539 -1.699126 2.367848 -0.254336 0.162388 0.333413
14.033333 1.227063 -1.694003 2.363535 -0.257448 0.189754 0.534705
14.066667 1.218686 -1.688530 2.398698 -0.260675 0.219862 0.754169
14.100000 1.210073 -1.681707 2.436652 -0.263937 0.252365 0.978863
14.133333 1.201242 -1.673451 2.466967 -0.267112 0.286788 1.196493
14.166667 1.192209 -1.663699 2.512417 -0.270013 0.322422 1.392838
14.200000 1.182990 -1.652414 2.566764 -0.272412 0.358436 1.547436
14.233333 1.173618 -1.639570 2.636212 -0.274095 0.394193 1.642930
14.266667 1.164126 -1.625151 2.712189 -0.274852 0.429053 1.669623
14.300000 1.154567 -1.609160 2.790246 -0.274508 0.462626 1.622527
14.333333 1.144985 -1.591600 2.883090 -0.272893 0.494548 1.499173
14.366667 1.135571 -1.573744 2.958396 -0.269868 0.524833 1.304061
14.400000 1.126333 -1.555605 3.026382 -0.265344 0.553685 1.045704
14.433333 1.117280 -1.537195 3.075753 -0.259288 0.581267 0.742681
14.466667 1.108451 -1.517355 3.086633 -0.251666 0.607922 0.409069
14.500000 1.099823 -1.497272 3.087661 -0.242460 0.634016 0.062345
14.533333 1.091542 -1.475839 3.074146 -0.231735 0.659877 -0.277046
14.566667 1.083689 -1.453104 3.032512 -0.219571 0.685547 -0.589814
14.600000 1.076059 -1.430174 2.994987 -0.206096 0.710914 -0.858157
14.633333 1.069004 -1.406056 2.948152 -0.191372 0.735816 -1.074534
14.666667 1.062596 -1.380810 2.892639 -0.175565 0.759963 -1.229252
14.700000 1.056902 -1.354493 2.834923 -0.158935 0.782840 -1.318632
14.733333 1.051975 -1.327174 2.766953 -0.141652 0.804048 -1.341437
14.766667 1.047299 -1.299763 2.737506 -0.123925 0.823341 -1.306275
14.800000 1.043460 -1.271449 2.657475 -0.105964 0.840478 -1.217282
14.833333 1.040493 -1.242309 2.607019 -0.088024 0.855237 -1.082448
14.866667 1.037788 -1.213148 2.561585 -0.070167 0.867530 -0.911793
14.900000 1.036014 -1.183323 2.529792 -0.052302 0.877422 -0.715329
14.933333 1.034506 -1.153527 2.501858 -0.034391 0.884979 -0.507491
14.966667 1.033963 -1.123236 2.498940 -0.016415 0.890186 -0.290278
15.000000 1.033686 -1.093026 2.491428 0.001835 0.893131 -0.074948
15.033333 1.033676 -1.062924 2.499793 0.020651 0.893943 0.133087
15.066667 1.034687 -1.032600 2.531186 0.040172 0.892601 0.328883
15.100000 1.035962 -1.002437 2.551148 0.060552 0.889092 0.510780
15.133333 1.037500 -0.972461 2.576602 0.082056 0.883298 0.682006
15.166667 1.040154 -0.942635 2.596949 0.104998 0.875194 0.839661
15.200000 1.043964 -0.913084 2.618160 0.129380 0.864762 0.983734
15.233333 1.048979 -0.883946 2.649892 0.154991 0.851971 1.116671
15.266667 1.054243 -0.855099 2.679371 0.181662 0.836879 1.241495
15.300000 1.059750 -0.826571 2.741443 0.209050 0.819584 1.352444
15.333333 1.066600 -0.798834 2.800220 0.236554 0.800269 1.442161
15.366667 1.074821 -0.771989 2.841318 0.263586 0.779049 1.503533
15.400000 1.084424 -0.746103 2.898684 0.289703 0.756045 1.529525
15.433333 1.095408 -0.721269 2.959690 0.314545 0.731477 1.510411
15.466667 1.107767 -0.697584 3.039341 0.337623 0.705578 1.433283
15.500000 1.120313 -0.674360 3.105468 0.358606 0.678404 1.299072
15.533333 1.133031 -0.651617 -3.129569 0.377388 0.650023 1.109931
15.566667 1.146357 -0.630060 -3.073797 0.393898 0.620629 0.870244
15.600000 1.160258 -0.609783 -3.022746 0.408149 0.590386 0.588387
15.633333 1.174289 -0.590048 -3.011258 0.420343 0.559170 0.278826
15.666667 1.188789 -0.571743 -2.989788 0.430899 0.526803 -0.038131
15.700000 1.203685 -0.554963 -3.007467 0.440117 0.493296 -0.345304
15.733333 1.218665 -0.538775 -3.046954 0.448236 0.458623 -0.627090
15.766667 1.233713 -0.523195 -3.087284 0.455509 0.422475 -0.868031
15.800000 1.248897 -0.509426 3.137805 0.462153 0.384425 -1.053004
15.833333 1.264805 -0.497784 3.072897 0.468157 0.344379 -1.177286
15.866667 1.280731 -0.486787 3.018075 0.473405 0.302215 -1.240034
15.900000 1.296658 -0.476448 2.963113 0.477851 0.257815 -1.249034
15.933333 1.312570 -0.466775 2.894048 0.481412 0.210944 -1.212297
15.966667 1.328838 -0.459468 2.852393 0.483926 0.161845 -1.141544
16.000000 1.345371 -0.454550 2.820520 0.485132 0.110934 -1.052068
16.033333 1.362079 -0.452023 2.797485 0.484919 0.058642 -0.957978
16.066667 1.378700 -0.450189 2.776628 0.483211 0.005589 -0.874351
16.100000 1.395289 -0.450711 2.759084 0.479840 -0.047617 -0.811061
16.133333 1.411732 -0.453548 2.739092 0.474625 -0.100076 -0.779878
16.166667 1.427910 -0.458655 2.725906 0.467372 -0.151254 -0.786312
16.200000 1.443704 -0.465975 2.712259 0.458061 -0.200597 -0.837840
16.233333 1.459320 -0.473976 2.684205 0.446550 -0.247911 -0.932806
16.266667 1.474325 -0.484079 2.659225 0.432716 -0.293013 -1.064939
16.300000 1.489119 -0.494848 2.633213 0.416615 -0.335826 -1.225149
16.333333 1.503037 -0.507555 2.614177 0.398405 -0.376451 -1.398370
16.366667 1.516710 -0.520906 2.578400 0.378293 -0.415014 -1.570616
16.400000 1.530122 -0.534892 2.512318 0.356371 -0.451866 -1.716690
16.433333 1.542273 -0.550545 2.435463 0.332911 -0.487038 -1.819331
16.466667 1.553070 -0.567784 2.343758 0.308203 -0.520720 -1.860848
16.500000 1.562444 -0.586522 2.272956 0.282547 -0.552978 -1.828142
16.533333 1.571504 -0.605838 2.157166 0.256169 -0.583960 -1.711141
16.566667 1.579081 -0.626528 2.071766 0.229426 -0.613613 -1.507559
16.600000 1.586321 -0.647760 1.990414 0.202694 -0.641760 -1.226474
16.633333 1.593214 -0.669516 1.927951 0.176241 -0.668374 -0.877229
16.666667 1.598651 -0.692459 1.902213 0.150236 -0.693423 -0.478149
16.700000 1.602679 -0.716531 1.903376 0.124743 -0.716978 -0.049178
16.733333 1.606335 -0.741068 1.922535 0.099868 -0.738979 0.384028
16.766667 1.608696 -0.766608 1.950863 0.075577 -0.759441 0.802082
16.800000 1.610676 -0.792570 2.003934 0.051836 -0.778377 1.186580
16.833333 1.612268 -0.818932 2.076741 0.028618 -0.795762 1.519150
16.866667 1.612731 -0.846098 2.140102 0.005906 -0.811518 1.789993
16.900000 1.612105 -0.873969 2.213644 -0.016391 -0.825523 1.995320
16.933333 1.611081 -0.902173 2.295976 -0.038390 -0.837656 2.136656
16.966667 1.609657 -0.930684 2.389107 -0.060284 -0.847822 2.214348
17.000000 1.607226 -0.959582 2.489399 -0.082218 -0.855920 2.230004
17.033333 1.604392 -0.988740 2.574904 -0.104336 -0.861852 2.192451
17.066667 1.600579 -1.018051 2.651186 -0.126777 -0.865542 2.106097
17.100000 1.595785 -1.047387 2.727829 -0.149552 -0.867028 1.970683
17.133333 1.590589 -1.076911 2.802159 -0.172606 -0.866447 1.787678
17.166667 1.584991 -1.106601 2.860518 -0.195736 -0.863999 1.562019
17.200000 1.578362 -1.135996 2.913574 -0.218864 -0.859832 1.302636
17.233333 1.570682 -1.164973 2.966719 -0.241857 -0.854144 1.011079
17.266667 1.561920 -1.193413 3.002456 -0.264476 -0.847258 0.694772
17.300000 1.552061 -1.221200 3.037436 -0.286596 -0.839343 0.365713
17.333333 1.541818 -1.249039 3.035843 -0.308145 -0.830515 0.036595
17.366667 1.531196 -1.276907 3.042805 -0.329115 -0.820832 -0.284362
17.400000 1.519387 -1.303827 3.025321 -0.349401 -0.810442 -0.589989
17.433333 1.507212 -1.330736 2.973740 -0.369076 -0.799293 -0.866015
17.466667 1.494680 -1.357613 2.915372 -0.388348 -0.787153 -1.107123
17.500000 1.481798 -1.384438 2.868359 -0.407338 -0.773913 -1.309745
17.533333 1.467657 -1.409953 2.803554 -0.426144 -0.759452 -1.474676
17.566667 1.453184 -1.435378 2.732665 -0.444906 -0.743539 -1.600641
17.600000 1.438387 -1.460694 2.680239 -0.463819 -0.725834 -1.689793
17.633333 1.422344 -1.484543 2.623173 -0.482811 -0.706383 -1.755029
17.666667 1.405998 -1.508249 2.555073 -0.501753 -0.685286 -1.801050
17.700000 1.389358 -1.531797 2.508093 -0.520535 -0.662593 -1.835433
17.733333 1.371590 -1.553806 2.442793 -0.539041 -0.638392 -1.862382
17.766667 1.352748 -1.574265 2.392949 -0.557005 -0.613014 -1.889650
17.800000 1.333649 -1.594522 2.315813 -0.574091 -0.586979 -1.918706
17.833333 1.314308 -1.614564 2.255746 -0.590175 -0.560388 -1.944334
17.866667 1.294137 -1.633018 2.181100 -0.605082 -0.533457 -1.964696
17.900000 1.273231 -1.649894 2.122994 -0.618567 -0.506446 -1.975553
17.933333 1.251689 -1.665196 2.066958 -0.630405 -0.479624 -1.972811
17.966667 1.229962 -1.680245 1.982642 -0.640543 -0.453110 -1.944810
18.000000 1.208066 -1.695034 1.908745 -0.648915 -0.426867 -1.884847
18.033333 1.186017 -1.709557 1.836793 -0.655347 -0.401094 -1.785364
18.066667 1.163685 -1.722624 1.767856 -0.659756 -0.375863 -1.640601
18.100000 1.141186 -1.734284 1.704496 -0.662203 -0.351248 -1.441702
18.133333 1.118581 -1.745664 1.650323 -0.662834 -0.327239 -1.187743
18.166667 1.096038 -1.755772 1.596609 -0.661745 -0.303925 -0.884315
18.200000 1.073422 -1.765595 1.551196 -0.659060 -0.281475 -0.543181
18.233333 1.051104 -1.774324 1.507057 -0.655034 -0.260117 -0.174807
18.266667 1.029163 -1.782038 1.502733 -0.649932 -0.240055 0.207902
18.300000 1.007196 -1.789465 1.518522 -0.643955 -0.221348 0.583129
18.333333 0.985822 -1.796063 1.574580 -0.637204 -0.204152 0.935484
18.366667 0.965132 -1.801918 1.633298 -0.629735 -0.188499 1.249482
18.400000 0.944461 -1.807491 1.697726 -0.621710 -0.174397 1.519872
18.433333 0.923822 -1.812783 1.793567 -0.613093 -0.161689 1.732209
18.466667 0.903229 -1.817798 1.857518 -0.603694 -0.150206 1.882048
18.500000 0.882695 -1.822538 1.950465 -0.593318 -0.139872 1.971929
18.533333 0.863156 -1.826875 2.000821 -0.581906 -0.130523 2.010441
18.566667 0.843702 -1.830944 2.086081 -0.569456 -0.121990 2.005034
18.600000 0.824346 -1.834749 2.164403 -0.555821 -0.114107 1.960203
18.633333 0.805099 -1.838292 2.222812 -0.540977 -0.106773 1.893522
18.666667 0.786923 -1.841614 2.278734 -0.525167 -0.099918 1.812603
18.700000 0.769822 -1.844748 2.344846 -0.508656 -0.093484 1.724686
18.733333 0.752863 -1.847634 2.407841 -0.491524 -0.087439 1.628112
18.766667 0.736993 -1.850393 2.458475 -0.473910 -0.081784 1.526473
18.800000 0.722206 -1.853051 2.501009 -0.456167 -0.076476 1.423505
18.833333 0.707587 -1.855474 2.550478 -0.438657 -0.071465 1.313649
18.866667 0.693143 -1.857666 2.585507 -0.421466 -0.066735 1.196907
18.900000 0.678883 -1.859631 2.628297 -0.404605 -0.062261 1.073037
18.933333 0.665628 -1.861562 2.661915 -0.388197 -0.058028 0.946678
18.966667 0.653356 -1.863469 2.711406 -0.372243 -0.054040 0.817992
19.000000 0.641284 -1.865163 2.733185 -0.356493 -0.050353 0.689355
19.033333 0.630127 -1.866849 2.756612 -0.340781 -0.046992 0.564398
19.066667 0.619179 -1.868331 2.769182 -0.325071 -0.043962 0.446738
19.100000 0.608444 -1.869614 2.770572 -0.309404 -0.041262 0.340021
19.133333 0.597923 -1.870701 2.769965 -0.293749 -0.038893 0.245813
19.166667 0.588140 -1.871788 2.780103 -0.278126 -0.036831 0.167995
19.200000 0.579054 -1.872877 2.768299 -0.262725 -0.034997 0.105303
19.233333 0.570636 -1.873966 2.766267 -0.247614 -0.033344 0.059080
19.266667 0.562841 -1.875061 2.770049 -0.232894 -0.031798 0.028339
19.300000 0.555632 -1.876161 2.765460 -0.218704 -0.030254 0.009775
19.333333 0.548975 -1.877268 2.774172 -0.205242 -0.028592 -0.000882
19.366667 0.542542 -1.878211 2.771427 -0.192655 -0.026725 -0.006768
19.400000 0.536604 -1.879169 2.767870 -0.181000 -0.024607 -0.007914
19.433333 0.531134 -1.880146 2.766078 -0.170336 -0.022206 -0.006921
19.466667 0.525885 -1.880969 2.774995 -0.160629 -0.019538 -0.006969
19.500000 0.520856 -1.881642 2.772795 -0.151766 -0.016671 -0.007918
19.533333 0.516046 -1.882170 2.762831 -0.143576 -0.013708 -0.007781
19.566667 0.511452 -1.882555 2.763886 -0.135933 -0.010732 -0.006175
19.600000 0.507072 -1.882802 2.770430 -0.128711 -0.007817 -0.005676
19.633333 0.502905 -1.882915 2.764621 -0.121792 -0.005034 -0.005790
19.666667 0.498948 -1.882897 2.770989 -0.115090 -0.002441 -0.003947
19.700000 0.495199 -1.882753 2.759998 -0.108555 -0.000065 -0.000269
19.733333 0.491710 -1.882645 2.772835 -0.102168 0.002094 0.002555
19.766667 0.488469 -1.882575 2.772165 -0.095912 0.004050 0.003873
19.800000 0.485427 -1.882389 2.764577 -0.089797 0.005807 0.005704
19.833333 0.482590 -1.882246 2.764797 -0.083842 0.007408 0.007376
19.866667 0.479948 -1.881995 2.764464 -0.078068 0.008897 0.007946
19.900000 0.477497 -1.881640 2.765974 -0.072484 0.010327 0.006131
19.933333 0.475233 -1.881184 2.772538 -0.067100 0.011715 0.004580
19.966667 0.473123 -1.880775 2.771825 -0.061924 0.013057 0.003424
20.000000 0.471195 -1.880272 2.773257 -0.056960 0.014358 0.001361
