t x y theta dxdt dydt dthetadt
0.000000 0.000000 0.000000 -0.280196 0.153465 -0.010260 -0.421458
0.033333 0.007731 -0.000533 -0.319899 0.158311 -0.010302 -0.435766
0.066667 0.015225 -0.001238 -0.360128 0.159713 -0.009820 -0.419912
0.100000 0.022685 -0.001541 -0.373754 0.157416 -0.008939 -0.377178
0.133333 0.029877 -0.002027 -0.406728 0.151314 -0.007848 -0.309515
0.166667 0.035732 -0.002103 -0.425937 0.142093 -0.006741 -0.216325
0.200000 0.041291 -0.002373 -0.441456 0.130440 -0.005816 -0.104417
0.233333 0.045206 -0.002360 -0.429113 0.117586 -0.005226 0.017752
0.266667 0.047850 -0.002215 -0.419628 0.104757 -0.005196 0.143566
0.300000 0.049674 -0.001979 -0.402610 0.093004 -0.005856 0.270161
0.333333 0.051158 -0.001962 -0.371813 0.083138 -0.007333 0.388898
0.366667 0.052291 -0.002169 -0.357174 0.075122 -0.009701 0.487566
0.400000 0.053572 -0.002361 -0.339644 0.068675 -0.013095 0.556996
0.433333 0.055326 -0.002679 -0.326689 0.062671 -0.017629 0.587628
0.466667 0.057661 -0.003089 -0.322688 0.055408 -0.023386 0.566609
0.500000 0.060968 -0.003655 -0.289431 0.045042 -0.030445 0.485555
0.533333 0.063869 -0.004477 -0.258788 0.029813 -0.038873 0.349541
0.566667 0.066432 -0.005619 -0.216694 0.008473 -0.048691 0.165523
0.600000 0.068565 -0.007031 -0.152362 -0.019732 -0.059800 -0.056641
0.633333 0.070255 -0.008718 -0.128279 -0.054724 -0.072039 -0.297477
0.666667 0.071490 -0.010688 -0.141294 -0.095931 -0.085219 -0.533784
0.700000 0.070393 -0.013415 -0.181156 -0.142354 -0.099120 -0.741352
0.733333 0.066405 -0.016923 -0.233549 -0.193233 -0.113543 -0.907139
0.766667 0.058531 -0.021236 -0.330157 -0.247665 -0.128295 -1.012442
0.800000 0.045631 -0.026277 -0.428437 -0.304604 -0.143209 -1.041497
0.833333 0.032251 -0.031624 -0.508266 -0.363358 -0.158167 -0.992395
0.866667 0.018395 -0.037281 -0.541313 -0.422928 -0.173128 -0.871914
0.900000 0.004066 -0.043251 -0.577202 -0.482957 -0.188250 -0.692768
0.933333 -0.010731 -0.049535 -0.580601 -0.542593 -0.203646 -0.471823
0.966667 -0.025991 -0.056135 -0.571691 -0.601747 -0.219629 -0.234515
1.000000 -0.047876 -0.063539 -0.565718 -0.660735 -0.236658 -0.004635
1.033333 -0.070207 -0.071264 -0.548283 -0.720011 -0.255306 0.201000
1.066667 -0.098358 -0.080072 -0.527755 -0.779685 -0.276013 0.375610
1.100000 -0.126925 -0.089203 -0.501372 -0.839270 -0.298955 0.511269
1.133333 -0.155887 -0.098658 -0.476034 -0.898612 -0.324418 0.613607
1.166667 -0.185227 -0.108436 -0.453750 -0.956949 -0.352490 0.690723
1.200000 -0.218088 -0.119833 -0.427852 -1.013696 -0.383069 0.748250
1.233333 -0.253926 -0.132913 -0.388638 -1.067859 -0.415806 0.791703
1.266667 -0.290070 -0.146311 -0.384902 -1.119372 -0.450360 0.825421
1.300000 -0.328762 -0.161492 -0.357256 -1.168204 -0.486379 0.855967
1.333333 -0.369611 -0.178346 -0.321818 -1.214048 -0.523256 0.881645
1.366667 -0.412380 -0.196887 -0.286766 -1.256536 -0.560205 0.901024
1.400000 -0.456737 -0.217049 -0.248720 -1.295144 -0.596412 0.913651
1.433333 -0.501242 -0.237490 -0.224525 -1.329750 -0.631206 0.919207
1.466667 -0.546876 -0.259315 -0.190289 -1.359760 -0.663818 0.910075
1.500000 -0.593262 -0.282490 -0.156326 -1.384911 -0.693632 0.882965
1.533333 -0.640962 -0.307156 -0.127526 -1.405060 -0.720086 0.835016
1.566667 -0.689777 -0.333233 -0.088997 -1.420319 -0.742846 0.761364
1.600000 -0.738548 -0.359517 -0.057131 -1.430881 -0.761800 0.659445
1.633333 -0.787235 -0.385991 -0.030178 -1.436588 -0.776695 0.525509
1.666667 -0.836399 -0.413172 -0.004441 -1.437521 -0.787540 0.364042
1.700000 -0.885399 -0.440507 0.018057 -1.433293 -0.794291 0.173786
1.733333 -0.934192 -0.467976 0.027010 -1.423779 -0.797203 -0.045585
1.766667 -0.982738 -0.495562 0.028389 -1.408350 -0.796537 -0.284910
1.800000 -1.030317 -0.522556 0.009956 -1.386322 -0.792502 -0.537752
1.833333 -1.077570 -0.549628 0.005258 -1.356862 -0.785559 -0.800432
1.866667 -1.123534 -0.575838 -0.028602 -1.318540 -0.776174 -1.067071
1.900000 -1.169096 -0.602092 -0.085195 -1.270673 -0.764953 -1.324517
1.933333 -1.214215 -0.628371 -0.145220 -1.211690 -0.752356 -1.561687
1.966667 -1.256121 -0.653110 -0.208183 -1.141281 -0.739031 -1.773817
2.000000 -1.297514 -0.677841 -0.262087 -1.059033 -0.725514 -1.959193
2.033333 -1.333606 -0.701163 -0.331342 -0.965937 -0.712349 -2.104585
2.066667 -1.369125 -0.724446 -0.441880 -0.864074 -0.699908 -2.204589
2.100000 -1.397374 -0.746714 -0.508287 -0.755087 -0.688571 -2.266492
2.133333 -1.425003 -0.768915 -0.604145 -0.641514 -0.678712 -2.288750
2.166667 -1.444664 -0.790901 -0.721727 -0.525495 -0.670373 -2.274085
2.200000 -1.455985 -0.812626 -0.791645 -0.409441 -0.663765 -2.219696
2.233333 -1.466655 -0.834242 -0.835269 -0.293983 -0.658972 -2.138424
2.266667 -1.468126 -0.856103 -0.938605 -0.179526 -0.656271 -2.042127
2.300000 -1.468955 -0.877828 -0.984852 -0.066573 -0.655687 -1.937419
2.333333 -1.469154 -0.899401 -1.081162 0.044184 -0.657363 -1.834478
2.366667 -1.468731 -0.920811 -1.127500 0.153121 -0.661759 -1.742804
2.400000 -1.467698 -0.942044 -1.165657 0.261036 -0.669113 -1.675045
2.433333 -1.458810 -0.963611 -1.201831 0.366977 -0.679495 -1.637630
2.466667 -1.442854 -0.985634 -1.246282 0.470131 -0.692654 -1.640205
2.500000 -1.426346 -1.007438 -1.295310 0.569739 -0.708459 -1.686141
2.533333 -1.404154 -1.030155 -1.339014 0.664799 -0.726343 -1.780363
2.566667 -1.376967 -1.054045 -1.377995 0.753225 -0.745334 -1.921209
2.600000 -1.344843 -1.079609 -1.442821 0.832338 -0.764498 -2.096368
2.633333 -1.312311 -1.104886 -1.520932 0.901051 -0.783104 -2.288540
2.666667 -1.277289 -1.132216 -1.593259 0.958769 -0.800473 -2.473565
2.700000 -1.241110 -1.161805 -1.633203 1.004655 -0.815620 -2.622520
2.733333 -1.204661 -1.191042 -1.728289 1.038636 -0.827812 -2.706077
2.766667 -1.167992 -1.219905 -1.855262 1.061402 -0.836496 -2.696687
2.800000 -1.131150 -1.248370 -2.010818 1.073940 -0.841073 -2.574213
2.833333 -1.094184 -1.276414 -2.194247 1.076081 -0.840718 -2.321073
2.866667 -1.057144 -1.304013 -2.300513 1.067005 -0.834761 -1.932195
2.900000 -1.019650 -1.332787 -2.375301 1.046370 -0.823012 -1.420933
2.933333 -0.982365 -1.362143 -2.432468 1.013209 -0.805222 -0.808135
2.966667 -0.945150 -1.390984 -2.489228 0.965390 -0.781017 -0.124761
3.000000 -0.909113 -1.419331 -2.532362 0.901484 -0.750344 0.586984
3.033333 -0.875416 -1.446038 -2.462148 0.821382 -0.713618 1.265255
3.066667 -0.845362 -1.470476 -2.354410 0.726324 -0.671572 1.861978
3.100000 -0.815557 -1.494306 -2.228810 0.617383 -0.624907 2.336058
3.133333 -0.791971 -1.515153 -2.070471 0.497419 -0.574887 2.645588
3.166667 -0.775442 -1.533127 -1.909423 0.371546 -0.523269 2.757106
3.200000 -0.767104 -1.548284 -1.785324 0.244137 -0.471424 2.653220
3.233333 -0.759128 -1.562774 -1.665648 0.118647 -0.420355 2.353445
3.266667 -0.761085 -1.574670 -1.504776 -0.002438 -0.370278 1.878663
3.300000 -0.773498 -1.584053 -1.392104 -0.115829 -0.321418 1.261737
3.333333 -0.786284 -1.592747 -1.321573 -0.220444 -0.272760 0.550143
3.366667 -0.799435 -1.600745 -1.325889 -0.317172 -0.222767 -0.203552
3.400000 -0.812941 -1.608042 -1.363508 -0.406675 -0.170291 -0.949822
3.433333 -0.826794 -1.614634 -1.452271 -0.489702 -0.113512 -1.651968
3.466667 -0.840982 -1.620516 -1.563572 -0.567431 -0.050573 -2.276620
3.500000 -0.855497 -1.625685 -1.717759 -0.642724 0.020681 -2.799826
3.533333 -0.879044 -1.625600 -1.888938 -0.716376 0.100622 -3.209673
3.566667 -0.902885 -1.624802 -2.028640 -0.788622 0.189429 -3.500474
3.600000 -0.933410 -1.617418 -2.138227 -0.859236 0.286977 -3.679404
3.633333 -0.964180 -1.609335 -2.254416 -0.927480 0.391593 -3.769084
3.666667 -1.000272 -1.593378 -2.371480 -0.991560 0.499649 -3.794012
3.700000 -1.036544 -1.576752 -2.544907 -1.048845 0.607357 -3.776058
3.733333 -1.072961 -1.559476 -2.692417 -1.098590 0.712288 -3.736171
3.766667 -1.112570 -1.532345 -2.785024 -1.139801 0.811245 -3.699684
3.800000 -1.154472 -1.494522 -2.891454 -1.172374 0.901177 -3.677712
3.833333 -1.196402 -1.456141 -3.001560 -1.196466 0.979718 -3.669386
3.866667 -1.238317 -1.417246 -3.135353 -1.213267 1.046465 -3.669999
3.900000 -1.280174 -1.377879 3.053396 -1.223974 1.101025 -3.687613
3.933333 -1.321928 -1.338082 2.933212 -1.229065 1.142642 -3.719839
3.966667 -1.363536 -1.297899 2.797252 -1.229509 1.172011 -3.752974
4.000000 -1.404953 -1.257373 2.666415 -1.226120 1.191034 -3.774799
4.033333 -1.446137 -1.216549 2.547566 -1.219726 1.201809 -3.774472
4.066667 -1.487041 -1.175469 2.411050 -1.210594 1.205845 -3.748504
4.100000 -1.527623 -1.134179 2.274075 -1.198782 1.204440 -3.680337
4.133333 -1.567838 -1.092721 2.122967 -1.184109 1.198653 -3.566916
4.166667 -1.607566 -1.052239 1.987608 -1.165966 1.188808 -3.417194
4.200000 -1.646696 -1.012766 1.877847 -1.143336 1.174232 -3.245350
4.233333 -1.685327 -0.973255 1.751765 -1.115000 1.153895 -3.071248
4.266667 -1.723415 -0.933748 1.644861 -1.080062 1.127036 -2.915943
4.300000 -1.760603 -0.895457 1.539308 -1.038077 1.093440 -2.801969
4.333333 -1.797162 -0.857252 1.476359 -0.989096 1.053389 -2.744463
4.366667 -1.833050 -0.819172 1.456866 -0.933434 1.007188 -2.747760
4.400000 -1.866256 -0.783373 1.424063 -0.871820 0.955430 -2.809708
4.433333 -1.896183 -0.750426 1.367924 -0.805353 0.899254 -2.918158
4.466667 -1.922409 -0.720649 1.269012 -0.735218 0.839871 -3.044482
4.500000 -1.944992 -0.694215 1.131433 -0.662221 0.778153 -3.159941
4.533333 -1.963908 -0.671101 1.031962 -0.586796 0.714820 -3.238030
4.566667 -1.979523 -0.651532 0.891472 -0.509298 0.650975 -3.257537
4.600000 -1.994234 -0.632298 0.715309 -0.429571 0.587508 -3.205231
4.633333 -2.008017 -0.613418 0.532659 -0.347339 0.525033 -3.076223
4.666667 -2.020853 -0.594910 0.379197 -0.261449 0.463531 -2.884767
4.700000 -2.030670 -0.579358 0.272810 -0.171180 0.403148 -2.652692
4.733333 -2.037044 -0.566847 0.218548 -0.075985 0.343913 -2.402938
4.766667 -2.039432 -0.557377 0.180017 0.024218 0.285618 -2.158976
4.800000 -2.040802 -0.548331 0.182396 0.128805 0.228291 -1.943569
4.833333 -2.036934 -0.541906 0.154678 0.236941 0.172038 -1.775570
4.866667 -2.027569 -0.537874 0.140027 0.346458 0.117563 -1.666915
4.900000 -2.012458 -0.536060 0.082519 0.455253 0.065363 -1.612359
4.933333 -1.991865 -0.536384 0.011920 0.560774 0.016034 -1.596958
4.966667 -1.970254 -0.537146 -0.062430 0.661162 -0.030149 -1.604574
5.000000 -1.942919 -0.540036 -0.115119 0.754541 -0.072915 -1.613429
5.033333 -1.914595 -0.543356 -0.186618 0.839036 -0.112069 -1.603150
5.066667 -1.881562 -0.548956 -0.256014 0.913464 -0.147563 -1.549752
5.100000 -1.847581 -0.554973 -0.323330 0.977264 -0.179432 -1.445122
5.133333 -1.812673 -0.561399 -0.361528 1.030740 -0.207935 -1.293756
5.166667 -1.775574 -0.569536 -0.416501 1.073249 -0.232902 -1.096941
5.200000 -1.736732 -0.579108 -0.474100 1.104872 -0.254366 -0.862091
5.233333 -1.697039 -0.589060 -0.508783 1.126021 -0.272384 -0.601924
5.266667 -1.656524 -0.599380 -0.515123 1.137117 -0.287223 -0.342890
5.300000 -1.615213 -0.610057 -0.536384 1.138203 -0.299006 -0.106696
5.333333 -1.573134 -0.621079 -0.514444 1.128896 -0.307748 0.085002
5.366667 -1.536245 -0.631560 -0.504271 1.110785 -0.314018 0.207201
5.400000 -1.498639 -0.642364 -0.472531 1.085321 -0.318492 0.238400
5.433333 -1.460337 -0.653477 -0.431718 1.054324 -0.321873 0.168521
5.466667 -1.421364 -0.664887 -0.380223 1.019956 -0.324767 0.007119
5.500000 -1.388956 -0.675342 -0.315675 0.985093 -0.327946 -0.236723
5.533333 -1.355914 -0.686073 -0.272407 0.952813 -0.332180 -0.538715
5.566667 -1.327392 -0.696486 -0.269097 0.924868 -0.337850 -0.871639
5.600000 -1.302138 -0.706819 -0.347630 0.903018 -0.345147 -1.202053
5.633333 -1.276280 -0.717394 -0.435939 0.888540 -0.354222 -1.501474
5.666667 -1.250566 -0.728567 -0.558739 0.882260 -0.365123 -1.745352
5.700000 -1.223696 -0.740590 -0.662661 0.883530 -0.377509 -1.903422
5.733333 -1.195030 -0.753706 -0.761820 0.891065 -0.390844 -1.964508
5.766667 -1.165785 -0.767015 -0.847627 0.903181 -0.404552 -1.932137
5.800000 -1.135969 -0.780504 -0.926994 0.917715 -0.418046 -1.822013
5.833333 -1.104282 -0.794943 -0.995673 0.932492 -0.430657 -1.651431
5.866667 -1.071085 -0.810205 -1.040115 0.945489 -0.441796 -1.450060
5.900000 -1.036892 -0.825983 -1.057874 0.955298 -0.451120 -1.260067
5.933333 -1.002588 -0.842072 -1.097789 0.961440 -0.458556 -1.110684
5.966667 -0.968371 -0.858361 -1.135525 0.964046 -0.464172 -1.010480
6.000000 -0.935778 -0.874286 -1.153249 0.963874 -0.468220 -0.962465
6.033333 -0.902684 -0.890278 -1.093420 0.961854 -0.471095 -0.979879
6.066667 -0.872763 -0.905855 -1.089125 0.959511 -0.473398 -1.058729
6.100000 -0.842355 -0.921468 -1.145306 0.958704 -0.475740 -1.182644
6.133333 -0.811466 -0.937100 -1.204979 0.961073 -0.478751 -1.335598
6.166667 -0.780100 -0.952735 -1.253453 0.967976 -0.482942 -1.514515
6.200000 -0.748265 -0.968357 -1.312892 0.980318 -0.488596 -1.713908
6.233333 -0.717802 -0.983988 -1.375927 0.999311 -0.495971 -1.907654
6.266667 -0.686879 -0.999574 -1.472012 1.025235 -0.504915 -2.081763
6.300000 -0.654454 -1.015928 -1.532268 1.058080 -0.515179 -2.228745
6.333333 -0.619650 -1.033416 -1.585316 1.097192 -0.526184 -2.343177
6.366667 -0.584403 -1.050807 -1.694541 1.142261 -0.537165 -2.406652
6.400000 -0.545790 -1.069594 -1.777407 1.192612 -0.547260 -2.402561
6.433333 -0.506754 -1.088245 -1.891427 1.246716 -0.555529 -2.315541
6.466667 -0.464213 -1.107996 -1.974593 1.302828 -0.561134 -2.134607
6.500000 -0.421275 -1.127569 -2.060807 1.359406 -0.562944 -1.849015
6.533333 -0.375250 -1.147583 -2.144764 1.415343 -0.559648 -1.452293
6.566667 -0.325603 -1.167899 -2.252622 1.468828 -0.550393 -0.951476
6.600000 -0.272593 -1.187738 -2.340147 1.518515 -0.534657 -0.360299
6.633333 -0.219271 -1.207313 -2.380945 1.563458 -0.511538 0.288655
6.666667 -0.165662 -1.226602 -2.359707 1.603483 -0.480330 0.963087
6.700000 -0.109193 -1.242608 -2.301025 1.638002 -0.441037 1.628876
6.733333 -0.052494 -1.258289 -2.198297 1.666523 -0.394263 2.243314
6.766667 0.004404 -1.273630 -2.048552 1.689318 -0.340458 2.761306
6.800000 0.061471 -1.288613 -1.895597 1.706979 -0.279671 3.149788
6.833333 0.119078 -1.298018 -1.756164 1.720200 -0.213069 3.387837
6.866667 0.177789 -1.301783 -1.590358 1.729415 -0.142010 3.469485
6.900000 0.236574 -1.305160 -1.409099 1.735715 -0.067525 3.393145
6.933333 0.295401 -1.308143 -1.265743 1.740212 0.009316 3.179793
6.966667 0.353915 -1.305567 -1.125171 1.743855 0.087064 2.862080
7.000000 0.412406 -1.302597 -1.027844 1.747311 0.163764 2.468243
7.033333 0.470264 -1.295117 -0.946783 1.751182 0.238037 2.030469
7.066667 0.527611 -1.283727 -0.931295 1.756116 0.308804 1.579587
7.100000 0.584841 -1.271966 -0.912376 1.762377 0.374848 1.149256
7.133333 0.642554 -1.256964 -0.880035 1.769948 0.434902 0.759435
7.166667 0.701014 -1.239341 -0.892675 1.778525 0.488344 0.430551
7.200000 0.760180 -1.219693 -0.882434 1.787630 0.534678 0.177700
7.233333 0.820135 -1.198600 -0.901129 1.796644 0.573758 0.010064
7.266667 0.880943 -1.176560 -0.930279 1.804523 0.605571 -0.073944
7.300000 0.942365 -1.154085 -0.948674 1.809802 0.630162 -0.078526
7.333333 1.004338 -1.131469 -0.984619 1.811142 0.648127 -0.007277
7.366667 1.065924 -1.108640 -1.002817 1.807048 0.659876 0.126808
7.400000 1.127088 -1.085620 -1.004612 1.795725 0.665904 0.314499
7.433333 1.188419 -1.063007 -1.004053 1.775554 0.666606 0.538992
7.466667 1.249254 -1.040250 -0.989996 1.745164 0.662225 0.784033
7.500000 1.309558 -1.017374 -0.944620 1.704051 0.653236 1.028531
7.533333 1.369294 -0.994401 -0.899139 1.651822 0.639866 1.255614
7.566667 1.428427 -0.971354 -0.854112 1.588857 0.622468 1.450208
7.600000 1.483882 -0.949643 -0.781291 1.516469 0.601531 1.598868
7.633333 1.534756 -0.929393 -0.686899 1.436321 0.577484 1.699037
7.666667 1.584935 -0.909137 -0.630022 1.350725 0.550996 1.755759
7.700000 1.629355 -0.890781 -0.529182 1.261864 0.522488 1.778364
7.733333 1.666639 -0.874815 -0.437973 1.172283 0.492288 1.771312
7.766667 1.703168 -0.858900 -0.412352 1.084106 0.460568 1.749866
7.800000 1.733017 -0.845527 -0.372137 0.999531 0.427408 1.725326
7.833333 1.762095 -0.832233 -0.335901 0.920047 0.392691 1.710454
7.866667 1.790397 -0.819031 -0.288973 0.846647 0.356094 1.706364
7.900000 1.817919 -0.805934 -0.244761 0.779773 0.317533 1.717844
7.933333 1.840776 -0.795786 -0.182519 0.719324 0.277363 1.748896
7.966667 1.862851 -0.785765 -0.132415 0.665187 0.235943 1.789321
8.000000 1.884145 -0.775879 -0.064638 0.616346 0.193509 1.832726
8.033333 1.902864 -0.769441 0.017074 0.572252 0.150697 1.865205
8.066667 1.919599 -0.766722 0.071868 0.532452 0.108440 1.883709
8.100000 1.935567 -0.764153 0.159998 0.496758 0.067555 1.876564
8.133333 1.950477 -0.765891 0.221638 0.464821 0.028553 1.841425
8.166667 1.964635 -0.767775 0.297385 0.436286 -0.008057 1.782663
8.200000 1.978050 -0.769802 0.353321 0.411020 -0.041291 1.707994
8.233333 1.990728 -0.771967 0.425874 0.388560 -0.070653 1.626708
8.266667 2.002680 -0.774266 0.461848 0.368235 -0.096166 1.547478
8.300000 2.013913 -0.776694 0.515417 0.349379 -0.117766 1.485049
8.333333 2.025714 -0.782633 0.559902 0.331461 -0.135332 1.445682
8.366667 2.036815 -0.788688 0.598039 0.313999 -0.148644 1.430289
8.400000 2.047225 -0.794850 0.623385 0.296760 -0.157762 1.432457
8.433333 2.056952 -0.801109 0.647210 0.279706 -0.162618 1.446481
8.466667 2.066403 -0.808346 0.664608 0.262881 -0.162931 1.457909
8.500000 2.075190 -0.815661 0.737232 0.246413 -0.158538 1.447912
8.533333 2.082946 -0.822454 0.817729 0.230746 -0.149745 1.398105
8.566667 2.089774 -0.828442 0.875113 0.216251 -0.137142 1.300169
8.600000 2.095885 -0.833569 0.947275 0.203110 -0.121560 1.147915
8.633333 2.101506 -0.837614 1.020805 0.191566 -0.103854 0.942547
8.666667 2.106924 -0.840659 1.078226 0.181881 -0.085037 0.693289
8.700000 2.112341 -0.842482 1.117586 0.174135 -0.066293 0.417786
8.733333 2.118116 -0.843066 1.138398 0.168024 -0.048549 0.140281
8.766667 2.123312 -0.843675 1.106990 0.163242 -0.032482 -0.122007
8.800000 2.127937 -0.844306 1.052796 0.159539 -0.018510 -0.347904
8.833333 2.133270 -0.844081 1.003703 0.156330 -0.006920 -0.526743
8.866667 2.139065 -0.843242 0.933682 0.152877 0.002236 -0.651194
8.900000 2.144318 -0.842420 0.896807 0.148356 0.009265 -0.724128
8.933333 2.149037 -0.841613 0.861075 0.142221 0.014695 -0.756113
8.966667 2.154328 -0.840774 0.853767 0.133858 0.018976 -0.755611
9.000000 2.159101 -0.839949 0.842487 0.122439 0.022571 -0.735738
9.033333 2.164179 -0.839276 0.830201 0.107226 0.026077 -0.706890
9.066667 2.168755 -0.838614 0.827962 0.087838 0.030037 -0.680716
9.100000 2.172836 -0.837964 0.813436 0.064223 0.034766 -0.660860
9.133333 2.176282 -0.837318 0.802063 0.036263 0.040474 -0.645242
9.166667 2.178494 -0.836418 0.774549 0.003833 0.047476 -0.634095
9.200000 2.178946 -0.835080 0.726678 -0.032815 0.055980 -0.627975
9.233333 2.177109 -0.833095 0.673758 -0.072984 0.065932 -0.620913
9.266667 2.174824 -0.831120 0.615644 -0.116162 0.077265 -0.605804
9.300000 2.172104 -0.829157 0.634805 -0.162091 0.090013 -0.582636
9.333333 2.165948 -0.826165 0.659679 -0.210312 0.104156 -0.557606
9.366667 2.156290 -0.821853 0.646632 -0.259801 0.119359 -0.534179
9.400000 2.146247 -0.817558 0.617599 -0.309550 0.135239 -0.512486
9.433333 2.135839 -0.813285 0.578909 -0.358670 0.151412 -0.498986
9.466667 2.125085 -0.809037 0.570790 -0.406072 0.167409 -0.498740
9.500000 2.110877 -0.803373 0.576512 -0.450204 0.182536 -0.511506
9.533333 2.093680 -0.796476 0.551477 -0.489723 0.196107 -0.529643
9.566667 2.073867 -0.788521 0.547086 -0.523322 0.207435 -0.551992
9.600000 2.053809 -0.780614 0.498483 -0.549819 0.215906 -0.575276
9.633333 2.032306 -0.772141 0.485496 -0.568220 0.220988 -0.599673
9.666667 2.010263 -0.763358 0.464922 -0.577909 0.222292 -0.620842
9.700000 1.988066 -0.754648 0.450284 -0.578906 0.219730 -0.635611
9.733333 1.965748 -0.746020 0.429193 -0.571462 0.213369 -0.645867
9.766667 1.944797 -0.738040 0.410823 -0.557070 0.203861 -0.646371
9.800000 1.926177 -0.731196 0.387772 -0.536789 0.191608 -0.640630
9.833333 1.907522 -0.724455 0.356295 -0.511164 0.176748 -0.622501
9.866667 1.888860 -0.717824 0.328767 -0.480604 0.159397 -0.592633
9.900000 1.876066 -0.714064 0.301885 -0.445751 0.139781 -0.553714
9.933333 1.863312 -0.710422 0.285661 -0.406545 0.117742 -0.508611
9.966667 1.850615 -0.706902 0.262629 -0.362005 0.092707 -0.461541
10.000000 1.837997 -0.703506 0.254789 -0.312035 0.064614 -0.413219
10.033333 1.825475 -0.700238 0.235952 -0.257651 0.033999 -0.369888
10.066667 1.813069 -0.697100 0.232692 -0.199551 0.001218 -0.336679
10.100000 1.800797 -0.694095 0.233783 -0.137462 -0.033830 -0.314310
10.133333 1.796350 -0.695288 0.225478 -0.072556 -0.070408 -0.302185
10.166667 1.799319 -0.700513 0.227304 -0.006620 -0.107426 -0.301573
10.200000 1.802452 -0.705862 0.232399 0.058993 -0.144044 -0.310672
10.233333 1.805750 -0.711329 0.202031 0.123539 -0.179746 -0.326635
10.266667 1.815009 -0.720319 0.189593 0.185203 -0.213430 -0.346299
10.300000 1.824428 -0.729410 0.177351 0.241596 -0.243561 -0.367034
10.333333 1.834002 -0.738590 0.158047 0.291652 -0.269226 -0.382384
10.366667 1.843724 -0.747849 0.140946 0.335224 -0.289996 -0.385393
10.400000 1.857110 -0.759017 0.128627 0.371878 -0.305295 -0.373656
10.433333 1.870626 -0.770241 0.118322 0.401099 -0.314483 -0.348145
10.466667 1.886238 -0.782372 0.106916 0.423475 -0.317577 -0.308514
10.500000 1.903288 -0.794744 0.095636 0.439672 -0.314987 -0.257340
10.533333 1.920427 -0.807130 0.084680 0.449988 -0.307219 -0.204866
10.566667 1.937640 -0.819515 0.058633 0.454269 -0.294683 -0.157441
10.600000 1.954912 -0.831887 0.033411 0.452954 -0.278104 -0.114055
10.633333 1.971151 -0.841819 0.033440 0.446754 -0.258547 -0.072227
10.666667 1.986044 -0.849259 0.081614 0.436279 -0.237067 -0.033680
10.700000 2.000038 -0.855061 0.110977 0.422356 -0.214689 -0.000333
10.733333 2.014031 -0.860810 0.106875 0.405951 -0.192333 0.030791
10.766667 2.026964 -0.865674 0.091830 0.388284 -0.170974 0.057268
10.800000 2.039872 -0.870472 0.068050 0.370282 -0.151431 0.071797
10.833333 2.052744 -0.875199 0.061793 0.352608 -0.134051 0.067378
10.866667 2.064057 -0.879244 0.065983 0.335785 -0.118904 0.044155
10.900000 2.073878 -0.882504 0.069767 0.320100 -0.105744 0.005465
10.933333 2.083631 -0.885680 0.089167 0.305590 -0.094198 -0.050838
10.966667 2.093310 -0.888766 0.105154 0.291994 -0.083695 -0.120205
11.000000 2.102122 -0.890821 0.120704 0.278915 -0.073673 -0.197006
11.033333 2.110843 -0.892780 0.124781 0.266045 -0.063774 -0.269691
11.066667 2.119464 -0.894641 0.119258 0.252870 -0.053661 -0.328570
11.100000 2.127978 -0.896402 0.088285 0.238905 -0.043193 -0.369746
11.133333 2.136377 -0.898059 0.057944 0.223673 -0.032317 -0.381697
11.166667 2.144654 -0.899612 0.004325 0.206789 -0.021052 -0.357887
11.200000 2.152800 -0.901058 -0.042606 0.187921 -0.009303 -0.295799
11.233333 2.159688 -0.901338 -0.054394 0.166829 0.002933 -0.201650
11.266667 2.164957 -0.900595 -0.078717 0.143528 0.015535 -0.083847
11.300000 2.170077 -0.899742 -0.069847 0.118059 0.028410 0.048652
11.333333 2.172617 -0.897985 -0.044468 0.090835 0.041479 0.181677
11.366667 2.175001 -0.896122 -0.012473 0.062273 0.054665 0.298580
11.400000 2.177227 -0.894152 0.028672 0.032963 0.067832 0.386403
11.433333 2.179294 -0.892079 0.038583 0.003206 0.081157 0.439415
11.466667 2.178404 -0.889169 0.060491 -0.026712 0.094908 0.450518
11.500000 2.177354 -0.886159 0.087007 -0.056573 0.109478 0.419641
11.533333 2.173462 -0.882003 0.096495 -0.086219 0.125106 0.350128
11.566667 2.169418 -0.877754 0.113294 -0.115522 0.142139 0.249132
11.600000 2.165224 -0.873418 0.132546 -0.144310 0.160748 0.125886
11.633333 2.160887 -0.868997 0.131263 -0.172106 0.180804 -0.013144
11.666667 2.154291 -0.862952 0.134818 -0.198601 0.202092 -0.158507
11.700000 2.147562 -0.856833 0.134419 -0.223320 0.224148 -0.300881
11.733333 2.139096 -0.849110 0.123099 -0.246056 0.246601 -0.430627
11.766667 2.129222 -0.839673 0.093480 -0.266437 0.268732 -0.536185
11.800000 2.119244 -0.830187 0.070692 -0.284159 0.289859 -0.608904
11.833333 2.108347 -0.819167 0.035168 -0.298879 0.309066 -0.643007
11.866667 2.097368 -0.808119 -0.011114 -0.310276 0.325472 -0.633661
11.900000 2.085952 -0.795791 -0.053402 -0.318132 0.338218 -0.580191
11.933333 2.074476 -0.783459 -0.084691 -0.322174 0.346443 -0.487914
11.966667 2.062916 -0.770411 -0.116040 -0.322376 0.349611 -0.367387
12.000000 2.051319 -0.757385 -0.132034 -0.318699 0.347160 -0.229348
12.033333 2.040057 -0.744378 -0.134507 -0.311289 0.338883 -0.083233
12.066667 2.029024 -0.731610 -0.119868 -0.300338 0.324790 0.058834
12.100000 2.017990 -0.718906 -0.096558 -0.285954 0.304893 0.184741
12.133333 2.007783 -0.707347 -0.064122 -0.268338 0.279358 0.287637
12.166667 1.998509 -0.697456 -0.050953 -0.247667 0.248475 0.366024
12.200000 1.990456 -0.689571 -0.033634 -0.224460 0.213031 0.419618
12.233333 1.982440 -0.681792 -0.009923 -0.199202 0.173805 0.449670
12.266667 1.976192 -0.676593 0.002670 -0.172383 0.131590 0.461606
12.300000 1.969995 -0.671514 0.009571 -0.144701 0.087508 0.463268
12.333333 1.965694 -0.669112 0.025727 -0.116955 0.042925 0.461021
12.366667 1.963148 -0.669435 0.037462 -0.089929 -0.000897 0.456304
12.400000 1.960663 -0.669883 0.053366 -0.064054 -0.043230 0.449776
12.433333 1.959667 -0.673013 0.065416 -0.039932 -0.082983 0.441727
12.466667 1.960080 -0.678760 0.077427 -0.017977 -0.119222 0.430164
12.500000 1.960556 -0.684620 0.096197 0.001520 -0.151124 0.409041
12.533333 1.961092 -0.690584 0.119184 0.018625 -0.178419 0.372768
12.566667 1.963078 -0.699018 0.137639 0.033493 -0.200942 0.316378
12.600000 1.965119 -0.707540 0.154268 0.046184 -0.218377 0.237761
12.633333 1.967209 -0.716140 0.166748 0.056868 -0.230641 0.132189
12.666667 1.969346 -0.724809 0.174554 0.065741 -0.237934 -0.004627
12.700000 1.971524 -0.733536 0.176506 0.072991 -0.240672 -0.169842
12.733333 1.973739 -0.742313 0.179516 0.078654 -0.239061 -0.359828
12.766667 1.976824 -0.751447 0.170322 0.082788 -0.233464 -0.562068
12.800000 1.980283 -0.760206 0.165225 0.085223 -0.223899 -0.768484
12.833333 1.983824 -0.767731 0.133840 0.085747 -0.210639 -0.960674
12.866667 1.987380 -0.775266 0.093506 0.084066 -0.193715 -1.118606
12.900000 1.990944 -0.782802 0.027162 0.079894 -0.173060 -1.226123
12.933333 1.994509 -0.790331 -0.012965 0.072946 -0.148612 -1.269101
12.966667 1.996806 -0.793729 -0.094473 0.062886 -0.120320 -1.243093
13.000000 1.999093 -0.797107 -0.176370 0.049843 -0.088837 -1.141524
13.033333 2.001364 -0.800462 -0.246169 0.034257 -0.054979 -0.972086
13.066667 2.003614 -0.803790 -0.317921 0.016569 -0.019564 -0.746563
13.100000 2.005838 -0.807087 -0.336731 -0.002836 0.016586 -0.483706
13.133333 2.005607 -0.805753 -0.345502 -0.023384 0.052223 -0.200944
13.166667 2.002926 -0.800118 -0.322790 -0.044187 0.085991 0.080351
13.200000 2.000209 -0.794457 -0.285050 -0.064530 0.116753 0.337848
13.233333 1.997456 -0.788776 -0.250840 -0.083902 0.143627 0.557261
13.266667 1.994667 -0.783081 -0.207699 -0.101677 0.165531 0.724484
13.300000 1.989628 -0.775098 -0.170270 -0.116924 0.181206 0.838357
13.333333 1.984555 -0.767116 -0.123859 -0.128906 0.190000 0.898010
13.366667 1.979448 -0.759145 -0.083784 -0.137413 0.192001 0.912384
13.400000 1.974311 -0.751193 -0.051082 -0.142360 0.187572 0.891987
13.433333 1.968412 -0.743298 -0.022058 -0.143604 0.177082 0.844220
13.466667 1.962331 -0.735918 0.001322 -0.140996 0.161116 0.782023
13.500000 1.956491 -0.729642 0.015079 -0.134847 0.140729 0.711224
13.533333 1.951340 -0.725003 0.045110 -0.125465 0.116967 0.636293
13.566667 1.946169 -0.720420 0.073565 -0.112940 0.090436 0.556987
13.600000 1.942394 -0.718325 0.078238 -0.097425 0.061818 0.472872
13.633333 1.938601 -0.716294 0.096895 -0.079198 0.031789 0.386457
13.666667 1.937033 -0.717280 0.113874 -0.058894 0.001351 0.295576
13.700000 1.935445 -0.718331 0.124409 -0.036927 -0.028860 0.198278
13.733333 1.933833 -0.719445 0.139474 -0.013898 -0.058292 0.097166
13.766667 1.932196 -0.720622 0.135922 0.009675 -0.086406 -0.002737
13.800000 1.933299 -0.724725 0.133204 0.033319 -0.112796 -0.098437
13.833333 1.934367 -0.728885 0.131504 0.056611 -0.136961 -0.187344
13.866667 1.938363 -0.735661 0.124177 0.079010 -0.158479 -0.265386
13.900000 1.942308 -0.742481 0.099573 0.099954 -0.176843 -0.327956
13.933333 1.946193 -0.749339 0.071484 0.119023 -0.191528 -0.371829
13.966667 1.950006 -0.756226 0.060853 0.135617 -0.201921 -0.399225
14.000000 1.956148 -0.764556 0.038102 0.149194 -0.207635 -0.412426
14.033333 1.962197 -0.772898 0.013088 0.159233 -0.208435 -0.418454
14.066667 1.968140 -0.781245 0.014118 0.165900 -0.204685 -0.422542
14.100000 1.974998 -0.789742 -0.005754 0.169280 -0.196740 -0.428572
14.133333 1.982233 -0.797814 -0.020420 0.169514 -0.185199 -0.445652
14.166667 1.989170 -0.804724 -0.017044 0.166924 -0.170920 -0.473304
14.200000 1.994913 -0.809644 -0.028875 0.162202 -0.154914 -0.505749
14.233333 2.000481 -0.814527 -0.053817 0.156054 -0.138189 -0.529980
14.266667 2.005278 -0.818137 -0.033941 0.148891 -0.121546 -0.539971
14.300000 2.009763 -0.820885 -0.050780 0.141304 -0.105883 -0.531161
14.333333 2.014032 -0.823586 -0.092055 0.133984 -0.091986 -0.493520
14.366667 2.017930 -0.825683 -0.161896 0.127504 -0.080456 -0.423364
14.400000 2.021662 -0.827329 -0.192925 0.121886 -0.071459 -0.328692
14.433333 2.025141 -0.828921 -0.224517 0.117046 -0.065085 -0.220133
14.466667 2.028354 -0.830459 -0.238513 0.112809 -0.061185 -0.098680
14.500000 2.031990 -0.832071 -0.225490 0.108652 -0.059365 0.035184
14.533333 2.036163 -0.833882 -0.193091 0.103626 -0.059031 0.172500
14.566667 2.040032 -0.835632 -0.156678 0.096593 -0.059390 0.310167
14.600000 2.043581 -0.837320 -0.124087 0.086455 -0.059641 0.458843
14.633333 2.046799 -0.838944 -0.109298 0.072304 -0.059033 0.623686
14.666667 2.050390 -0.841266 -0.076849 0.053222 -0.056857 0.806087
14.700000 2.053897 -0.844128 -0.076975 0.028770 -0.052601 1.005637
14.733333 2.056623 -0.847170 -0.097005 -0.000869 -0.046014 1.228479
14.766667 2.057847 -0.849832 -0.088616 -0.035183 -0.037238 1.465003
14.800000 2.058670 -0.852418 -0.057032 -0.073302 -0.026643 1.695339
14.833333 2.056873 -0.853972 0.025163 -0.114262 -0.014655 1.898303
14.866667 2.052335 -0.854423 0.096840 -0.156780 -0.001915 2.049853
14.900000 2.045063 -0.853500 0.225833 -0.199763 0.010852 2.121160
14.933333 2.034996 -0.851466 0.364068 -0.242250 0.022898 2.085647
14.966667 2.024494 -0.849357 0.459366 -0.283442 0.033827 1.936313
15.000000 2.013556 -0.847173 0.586965 -0.322879 0.043430 1.671314
15.033333 2.002181 -0.844919 0.688638 -0.360471 0.051657 1.306623
15.066667 1.990369 -0.842597 0.747139 -0.396578 0.058695 0.866108
15.100000 1.975840 -0.840852 0.755682 -0.431451 0.065075 0.390075
15.133333 1.960875 -0.839044 0.749103 -0.465699 0.071589 -0.081638
15.166667 1.945477 -0.837175 0.698119 -0.499700 0.078786 -0.515628
15.200000 1.929648 -0.835247 0.626034 -0.533456 0.087031 -0.873958
15.233333 1.911173 -0.832862 0.543479 -0.566447 0.096564 -1.134706
15.266667 1.892276 -0.830424 0.480582 -0.597787 0.107519 -1.287459
15.300000 1.870983 -0.826940 0.399598 -0.626710 0.119583 -1.334900
15.333333 1.847605 -0.822200 0.323103 -0.651776 0.132060 -1.278922
15.366667 1.823828 -0.817419 0.269588 -0.671717 0.144336 -1.118497
15.400000 1.799662 -0.812602 0.231813 -0.685369 0.155739 -0.864636
15.433333 1.774578 -0.806683 0.199142 -0.692096 0.165460 -0.532634
15.466667 1.749182 -0.799919 0.189838 -0.691615 0.172519 -0.139023
15.500000 1.723429 -0.793139 0.186960 -0.683894 0.176130 0.297002
15.533333 1.698486 -0.786087 0.200091 -0.669975 0.175878 0.741079
15.566667 1.675038 -0.779205 0.203406 -0.651059 0.171365 1.141629
15.600000 1.653360 -0.772556 0.216685 -0.628895 0.162470 1.454443
15.633333 1.631360 -0.765922 0.232606 -0.605361 0.149574 1.651801
15.666667 1.613213 -0.760034 0.329098 -0.582668 0.133626 1.714245
15.700000 1.594750 -0.754174 0.560390 -0.562876 0.115863 1.620763
15.733333 1.578760 -0.749734 0.765034 -0.547718 0.097666 1.372560
15.766667 1.563752 -0.747056 0.875725 -0.538836 0.080671 0.995983
15.800000 1.548559 -0.746110 0.916693 -0.537416 0.066635 0.526363
15.833333 1.532326 -0.746655 0.918471 -0.544118 0.057042 -0.003909
15.866667 1.515772 -0.747244 0.867971 -0.558591 0.052832 -0.550855
15.900000 1.498893 -0.747879 0.773855 -0.580272 0.054564 -1.048089
15.933333 1.481688 -0.748559 0.656234 -0.607968 0.062247 -1.441190
15.966667 1.462292 -0.748342 0.540366 -0.640050 0.075259 -1.698778
16.000000 1.440783 -0.746910 0.427740 -0.674630 0.092329 -1.808055
16.033333 1.417369 -0.744005 0.319297 -0.709958 0.111825 -1.765226
16.066667 1.392098 -0.739417 0.238139 -0.744621 0.132038 -1.591705
16.100000 1.365244 -0.733226 0.185344 -0.777181 0.151150 -1.330074
16.133333 1.336555 -0.725475 0.146038 -0.806437 0.167469 -1.025720
16.166667 1.307566 -0.717802 0.129593 -0.831669 0.179644 -0.717281
16.200000 1.278287 -0.710215 0.138322 -0.852546 0.186728 -0.434635
16.233333 1.248727 -0.702725 0.156692 -0.868954 0.188292 -0.206383
16.266667 1.218896 -0.695342 0.184161 -0.881050 0.184308 -0.042365
16.300000 1.188803 -0.688074 0.215300 -0.889305 0.175229 0.052419
16.333333 1.158459 -0.680931 0.226622 -0.894448 0.161784 0.082344
16.366667 1.127938 -0.674778 0.259058 -0.897150 0.144897 0.055719
16.400000 1.097546 -0.669871 0.248496 -0.898030 0.125621 -0.013458
16.433333 1.067524 -0.666299 0.249433 -0.897575 0.104871 -0.105878
16.466667 1.037288 -0.662882 0.241470 -0.896216 0.083488 -0.209094
16.500000 1.007375 -0.660812 0.218856 -0.894268 0.062141 -0.306352
16.533333 0.977907 -0.660000 0.197219 -0.891971 0.041433 -0.388216
16.566667 0.948251 -0.659355 0.172378 -0.889498 0.021695 -0.442246
16.600000 0.919025 -0.659850 0.163697 -0.887048 0.003124 -0.467142
16.633333 0.889625 -0.660517 0.129845 -0.884796 -0.014214 -0.463923
16.666667 0.860057 -0.661357 0.111254 -0.882847 -0.030362 -0.435068
16.700000 0.830330 -0.662371 0.084045 -0.881211 -0.045512 -0.386150
16.733333 0.800982 -0.664078 0.056790 -0.879818 -0.059963 -0.321254
16.766667 0.772030 -0.666476 0.062117 -0.878668 -0.073869 -0.251590
16.800000 0.742937 -0.669050 0.060645 -0.877651 -0.087448 -0.180966
16.833333 0.713807 -0.672177 0.055335 -0.876677 -0.100795 -0.115629
16.866667 0.684568 -0.675790 0.055792 -0.875691 -0.113941 -0.059103
16.900000 0.655321 -0.679893 0.067101 -0.874734 -0.126785 -0.016094
16.933333 0.626003 -0.684459 0.070985 -0.873821 -0.139183 0.009669
16.966667 0.596743 -0.689464 0.076920 -0.872849 -0.151029 0.019988
17.000000 0.567586 -0.694893 0.077689 -0.871786 -0.162124 0.016471
17.033333 0.538619 -0.700687 0.083217 -0.870639 -0.172321 0.001207
17.066667 0.509786 -0.706851 0.081046 -0.869411 -0.181529 -0.022622
17.100000 0.480867 -0.713414 0.083787 -0.868065 -0.189707 -0.050592
17.133333 0.451858 -0.720132 0.078452 -0.866640 -0.196854 -0.077941
17.166667 0.423028 -0.727125 0.073355 -0.865270 -0.202990 -0.099724
17.200000 0.394114 -0.734265 0.063754 -0.864025 -0.208181 -0.115546
17.233333 0.365122 -0.741547 0.066750 -0.862909 -0.212505 -0.121894
17.266667 0.336423 -0.748864 0.053985 -0.861922 -0.216060 -0.118232
17.300000 0.308054 -0.756162 0.040211 -0.861103 -0.218973 -0.104968
17.333333 0.279540 -0.763447 0.039970 -0.860459 -0.221347 -0.082759
17.366667 0.250958 -0.770858 0.031231 -0.859955 -0.223314 -0.058121
17.400000 0.222312 -0.778392 0.027744 -0.859613 -0.225012 -0.031113
17.433333 0.193604 -0.786044 0.034230 -0.859460 -0.226544 -0.006433
17.466667 0.164838 -0.793810 0.027645 -0.859458 -0.227949 0.013631
17.500000 0.136144 -0.801443 0.045061 -0.859510 -0.229243 0.026531
17.533333 0.107610 -0.808945 0.042037 -0.859531 -0.230420 0.030668
17.566667 0.079024 -0.816548 0.058442 -0.859446 -0.231446 0.029016
17.600000 0.050389 -0.824251 0.059542 -0.859171 -0.232256 0.019038
17.633333 0.021707 -0.832048 0.056678 -0.858671 -0.232826 0.005125
17.666667 -0.007021 -0.839936 0.062700 -0.857994 -0.233204 -0.011529
17.700000 -0.035791 -0.847912 0.040486 -0.857205 -0.233421 -0.025878
17.733333 -0.064602 -0.855971 0.050479 -0.856371 -0.233507 -0.037255
17.766667 -0.093201 -0.863882 0.041664 -0.855581 -0.233515 -0.042382
17.800000 -0.121557 -0.871525 0.036659 -0.854929 -0.233543 -0.037324
17.833333 -0.149950 -0.879239 0.041593 -0.854471 -0.233669 -0.025704
17.866667 -0.178116 -0.886848 0.033147 -0.854265 -0.233948 -0.008310
17.900000 -0.206315 -0.894522 0.035778 -0.854376 -0.234438 0.008803
17.933333 -0.234646 -0.902147 0.026811 -0.854861 -0.235203 0.027295
17.966667 -0.263115 -0.909835 0.032635 -0.855733 -0.236266 0.040743
18.000000 -0.291651 -0.917678 0.042280 -0.856957 -0.237567 0.044676
18.033333 -0.320290 -0.925680 0.044747 -0.858496 -0.239029 0.041208
18.066667 -0.348957 -0.933732 0.045636 -0.860243 -0.240530 0.030446
18.100000 -0.377651 -0.941830 0.062077 -0.862080 -0.241949 0.015197
18.133333 -0.406370 -0.949972 0.070681 -0.863880 -0.243152 -0.007459
18.166667 -0.435113 -0.958154 0.064830 -0.865537 -0.244035 -0.032473
18.200000 -0.464019 -0.966465 0.052570 -0.866993 -0.244542 -0.056248
18.233333 -0.493013 -0.974776 0.044385 -0.868198 -0.244655 -0.078814
18.266667 -0.522117 -0.983076 0.042581 -0.869141 -0.244401 -0.097520
18.300000 -0.551325 -0.991325 0.035584 -0.869821 -0.243840 -0.110893
18.333333 -0.580462 -0.999536 0.028885 -0.870268 -0.243049 -0.116588
18.366667 -0.609571 -1.007656 0.026450 -0.870495 -0.242113 -0.116715
18.400000 -0.638636 -1.015687 0.017371 -0.870499 -0.241125 -0.110266
18.433333 -0.667628 -1.023598 0.021179 -0.870285 -0.240168 -0.097403
18.466667 -0.696501 -1.031468 0.018197 -0.869879 -0.239314 -0.079361
18.500000 -0.725386 -1.039347 0.022010 -0.869324 -0.238592 -0.057686
18.533333 -0.754397 -1.047222 0.006626 -0.868641 -0.238008 -0.031469
18.566667 -0.783408 -1.055093 -0.000938 -0.867877 -0.237542 -0.002066
18.600000 -0.812427 -1.062965 0.012947 -0.867101 -0.237155 0.025964
18.633333 -0.841434 -1.070910 0.009179 -0.866357 -0.236737 0.054058
18.666667 -0.870447 -1.078850 0.000287 -0.865663 -0.236176 0.079444
18.700000 -0.899279 -1.086805 0.004667 -0.865027 -0.235373 0.102227
18.733333 -0.927896 -1.094723 0.017788 -0.864471 -0.234226 0.117310
18.766667 -0.956518 -1.102628 0.025804 -0.863983 -0.232611 0.127627
18.800000 -0.985143 -1.110517 0.049334 -0.863539 -0.230411 0.134391
18.833333 -1.013838 -1.118348 0.053705 -0.863145 -0.227605 0.132504
18.866667 -1.042702 -1.125998 0.056402 -0.862816 -0.224182 0.121889
18.900000 -1.071567 -1.133624 0.036561 -0.862557 -0.220130 0.104815
18.933333 -1.100432 -1.141224 0.043248 -0.862353 -0.215492 0.086904
18.966667 -1.129216 -1.148290 0.064530 -0.862240 -0.210417 0.063908
19.000000 -1.157998 -1.155327 0.059691 -0.862249 -0.205058 0.039514
19.033333 -1.186779 -1.162331 0.063222 -0.862387 -0.199539 0.019193
19.066667 -1.215482 -1.168834 0.053540 -0.862665 -0.194019 0.006310
19.100000 -1.243951 -1.174921 0.065403 -0.863127 -0.188703 -0.004314
19.133333 -1.272416 -1.180971 0.066873 -0.863838 -0.183782 -0.015179
19.166667 -1.301105 -1.186810 0.055969 -0.864811 -0.179353 -0.020287
19.200000 -1.329955 -1.192506 0.039344 -0.866037 -0.175528 -0.022528
19.233333 -1.358942 -1.198116 0.044452 -0.867503 -0.172407 -0.024897
19.266667 -1.387975 -1.203633 0.054945 -0.869177 -0.170024 -0.029315
19.300000 -1.417000 -1.209113 0.045208 -0.870954 -0.168317 -0.031263
19.333333 -1.446015 -1.214556 0.047689 -0.872685 -0.167195 -0.030116
19.366667 -1.475070 -1.219971 0.061273 -0.874263 -0.166561 -0.030846
19.400000 -1.504113 -1.225349 0.049286 -0.875640 -0.166304 -0.032809
19.433333 -1.533425 -1.230839 0.049733 -0.876791 -0.166303 -0.034352
19.466667 -1.562897 -1.236416 0.051624 -0.877689 -0.166455 -0.034389
19.500000 -1.592375 -1.242068 0.046809 -0.878358 -0.166704 -0.035497
19.533333 -1.621765 -1.247750 0.032200 -0.878879 -0.167001 -0.036548
19.566667 -1.651133 -1.253394 0.036756 -0.879320 -0.167335 -0.034760
19.600000 -1.680479 -1.258999 0.038915 -0.879664 -0.167686 -0.030391
19.633333 -1.709799 -1.264564 0.035608 -0.879902 -0.168041 -0.025953
19.666667 -1.738900 -1.270065 0.042641 -0.880069 -0.168414 -0.022010
19.700000 -1.767972 -1.275525 0.039748 -0.880176 -0.168817 -0.016986
19.733333 -1.797323 -1.281128 0.032198 -0.880198 -0.169270 -0.013676
19.766667 -1.826795 -1.286821 0.041345 -0.880089 -0.169760 -0.013161
19.800000 -1.856231 -1.292472 0.041873 -0.879869 -0.170282 -0.015193
19.833333 -1.885766 -1.298210 0.030435 -0.879536 -0.170819 -0.014965
19.866667 -1.915260 -1.303905 0.038037 -0.879041 -0.171338 -0.014216
19.900000 -1.944716 -1.309691 0.036944 -0.878376 -0.171812 -0.013053
19.933333 -1.973924 -1.315517 0.042841 -0.877581 -0.172196 -0.011490
19.966667 -2.003084 -1.321297 0.027354 -0.876723 -0.172482 -0.007743
20.000000 -2.032194 -1.327030 0.033237 -0.875842 -0.172652 -0.002841
20.033333 -2.061251 -1.332714 0.029568 -0.874999 -0.172710 -0.003599
20.066667 -2.090399 -1.338533 0.028349 -0.874275 -0.172636 -0.005130
20.100000 -2.119489 -1.344302 0.029704 -0.873688 -0.172411 -0.009002
20.133333 -2.148582 -1.350113 0.036258 -0.873204 -0.172020 -0.014119
20.166667 -2.177611 -1.355872 0.049421 -0.872776 -0.171438 -0.024177
20.200000 -2.206573 -1.361576 0.035248 -0.872364 -0.170645 -0.036260
20.233333 -2.235835 -1.367369 0.037912 -0.871885 -0.169593 -0.045165
20.266667 -2.265024 -1.373105 0.034126 -0.871293 -0.168294 -0.054534
20.300000 -2.294136 -1.378782 0.030071 -0.870600 -0.166768 -0.061519
20.333333 -2.323169 -1.384400 0.031959 -0.869847 -0.165042 -0.065650
20.366667 -2.352118 -1.389958 0.007861 -0.869076 -0.163144 -0.061399
20.400000 -2.381152 -1.395334 0.022903 -0.868327 -0.161123 -0.053561
20.433333 -2.410095 -1.400647 0.013731 -0.867709 -0.159041 -0.042228
20.466667 -2.438945 -1.405895 0.007736 -0.867251 -0.156928 -0.028406
20.500000 -2.467696 -1.411078 0.007204 -0.866927 -0.154788 -0.014418
20.533333 -2.496360 -1.416125 0.014006 -0.866745 -0.152620 -0.000220
20.566667 -2.524919 -1.421105 0.013645 -0.866709 -0.150428 0.008351
20.600000 -2.553853 -1.426066 0.020455 -0.866822 -0.148187 0.014165
20.633333 -2.583026 -1.431059 0.025777 -0.867044 -0.145870 0.013616
20.666667 -2.612082 -1.435982 0.017868 -0.867376 -0.143454 0.009494
20.700000 -2.641014 -1.440832 0.021290 -0.867839 -0.140946 0.003049
20.733333 -2.670019 -1.445572 0.024754 -0.868383 -0.138333 -0.006301
20.766667 -2.698961 -1.450149 0.028836 -0.868968 -0.135614 -0.016931
20.800000 -2.727765 -1.454650 0.015712 -0.869567 -0.132799 -0.027113
20.833333 -2.756487 -1.458951 0.016579 -0.870153 -0.129919 -0.033532
20.866667 -2.785517 -1.463186 0.016859 -0.870706 -0.127001 -0.037526
20.900000 -2.814394 -1.467345 0.015211 -0.871248 -0.124061 -0.041017
20.933333 -2.843576 -1.471413 0.012310 -0.871818 -0.121131 -0.042499
20.966667 -2.872982 -1.475417 0.003883 -0.872407 -0.118224 -0.039741
21.000000 -2.902216 -1.479342 0.004625 -0.873005 -0.115360 -0.034645
21.033333 -2.931270 -1.483188 0.016457 -0.873614 -0.112528 -0.029008
21.066667 -2.960404 -1.486865 0.009691 -0.874206 -0.109741 -0.022564
21.100000 -2.989493 -1.490472 0.003183 -0.874675 -0.107019 -0.012744
21.133333 -3.018533 -1.493964 0.002947 -0.874965 -0.104383 0.000239
21.166667 -3.047366 -1.497376 0.002830 -0.875093 -0.101865 0.014365
21.200000 -3.076568 -1.500704 0.011506 -0.875017 -0.099483 0.028086
21.233333 -3.105984 -1.503921 0.002195 -0.874663 -0.097259 0.042879
21.266667 -3.135518 -1.507051 0.003455 -0.873953 -0.095179 0.056617
21.300000 -3.164814 -1.510100 0.001882 -0.872856 -0.093195 0.067316
21.333333 -3.194132 -1.513130 0.015303 -0.871234 -0.091231 0.070206
21.366667 -3.223193 -1.516078 0.017337 -0.868887 -0.089181 0.064081
21.400000 -3.252186 -1.519075 0.021922 -0.865621 -0.086909 0.049886
21.433333 -3.280925 -1.522046 0.022500 -0.861262 -0.084255 0.025058
21.466667 -3.309890 -1.524981 0.038243 -0.855645 -0.081074 -0.008769
21.500000 -3.338562 -1.527833 0.038203 -0.848549 -0.077242 -0.053524
21.533333 -3.367170 -1.530596 0.040772 -0.839758 -0.072644 -0.102433
21.566667 -3.395622 -1.533178 0.030558 -0.829112 -0.067222 -0.152269
21.600000 -3.423754 -1.535676 0.020609 -0.816563 -0.060999 -0.201183
21.633333 -3.451451 -1.537835 0.017075 -0.802114 -0.054080 -0.245661
21.666667 -3.478605 -1.539749 0.001024 -0.785704 -0.046577 -0.282597
21.700000 -3.505038 -1.541289 -0.018078 -0.767266 -0.038661 -0.304936
21.733333 -3.530458 -1.542400 -0.027081 -0.746957 -0.030583 -0.314013
21.766667 -3.555160 -1.543088 -0.049240 -0.724956 -0.022583 -0.308164
21.800000 -3.579493 -1.543698 -0.047671 -0.701375 -0.014861 -0.288507
21.833333 -3.602640 -1.543918 -0.081858 -0.676345 -0.007566 -0.252542
21.866667 -3.624436 -1.543624 -0.072939 -0.650284 -0.000885 -0.206072
21.900000 -3.645845 -1.543256 -0.086752 -0.623639 0.005046 -0.153449
21.933333 -3.666863 -1.542818 -0.095620 -0.596492 0.010160 -0.098596
21.966667 -3.687487 -1.542312 -0.101514 -0.568851 0.014440 -0.047620
22.000000 -3.706029 -1.541560 -0.097463 -0.540868 0.017855 -0.001550
22.033333 -3.722240 -1.540757 -0.098231 -0.512613 0.020386 0.031037
22.066667 -3.738051 -1.539892 -0.081089 -0.483789 0.022069 0.053476
22.100000 -3.753462 -1.538970 -0.069322 -0.454296 0.022974 0.063146
22.133333 -3.768475 -1.537993 -0.065424 -0.424404 0.023190 0.062066
22.166667 -3.783090 -1.536964 -0.051614 -0.394412 0.022778 0.053059
22.200000 -3.797309 -1.535886 -0.057932 -0.364339 0.021831 0.040127
22.233333 -3.809168 -1.535110 -0.053162 -0.334341 0.020480 0.029787
22.266667 -3.818751 -1.534579 -0.063164 -0.304981 0.018891 0.025222
22.300000 -3.827949 -1.534006 -0.070903 -0.276681 0.017170 0.034147
22.333333 -3.836767 -1.533393 -0.075602 -0.249736 0.015369 0.059180
22.366667 -3.843850 -1.532973 -0.080951 -0.224583 0.013529 0.102321
22.400000 -3.849543 -1.532780 -0.074362 -0.201881 0.011698 0.157178
22.433333 -3.854879 -1.532553 -0.075228 -0.182007 0.009850 0.219102
22.466667 -3.859866 -1.532292 -0.075497 -0.164963 0.007884 0.281496
22.500000 -3.864515 -1.532001 -0.065431 -0.150707 0.005755 0.334811
22.533333 -3.868835 -1.531681 -0.043557 -0.139125 0.003483 0.372668
22.566667 -3.872835 -1.531333 -0.017737 -0.129853 0.001109 0.389077
22.600000 -3.876525 -1.530959 0.004578 -0.122394 -0.001366 0.386067
22.633333 -3.880170 -1.530902 0.045580 -0.116393 -0.003881 0.362324
22.666667 -3.883932 -1.531196 0.065090 -0.111603 -0.006304 0.320771
22.700000 -3.887737 -1.531817 0.078099 -0.107806 -0.008495 0.264280
