t x y theta dxdt dydt dthetadt
0.000000 0.000000 0.000000 -0.298596 0.118510 0.092300 -0.016540
0.033333 0.004001 0.003100 -0.287361 0.122472 0.093892 -0.024531
0.066667 0.008135 0.006258 -0.292805 0.126500 0.095501 -0.035347
0.100000 0.012404 0.009473 -0.302563 0.130592 0.097118 -0.050572
0.133333 0.016809 0.012729 -0.294166 0.134748 0.098741 -0.069810
0.166667 0.021354 0.016044 -0.299804 0.138969 0.100363 -0.092300
0.200000 0.026042 0.019418 -0.307641 0.143253 0.101978 -0.118574
0.233333 0.030876 0.022850 -0.299822 0.147597 0.103578 -0.150296
0.266667 0.035857 0.026341 -0.312876 0.151998 0.105159 -0.188849
0.300000 0.040982 0.029872 -0.320916 0.156453 0.106715 -0.233651
0.333333 0.046260 0.033462 -0.320808 0.160961 0.108243 -0.288342
0.366667 0.051693 0.037111 -0.325215 0.165515 0.109736 -0.355671
0.400000 0.057274 0.040799 -0.343838 0.170116 0.111194 -0.434861
0.433333 0.063016 0.044544 -0.366464 0.174763 0.112619 -0.518641
0.466667 0.068908 0.048327 -0.365610 0.179458 0.114016 -0.603915
0.500000 0.074965 0.052167 -0.371747 0.184200 0.115387 -0.688133
0.533333 0.081176 0.056044 -0.390643 0.188991 0.116737 -0.764573
0.566667 0.087542 0.059957 -0.440953 0.193832 0.118069 -0.823947
0.600000 0.094064 0.063905 -0.489721 0.198720 0.119386 -0.862436
0.633333 0.100757 0.067906 -0.524134 0.203652 0.120687 -0.882334
0.666667 0.107609 0.071942 -0.568902 0.208624 0.121964 -0.883177
0.700000 0.114635 0.076028 -0.599261 0.213631 0.123218 -0.868808
0.733333 0.121834 0.080164 -0.629961 0.218671 0.124444 -0.849830
0.766667 0.129208 0.084350 -0.665952 0.223741 0.125637 -0.844277
0.800000 0.136758 0.088583 -0.686201 0.228835 0.126793 -0.864771
0.833333 0.144474 0.092848 -0.701600 0.233955 0.127910 -0.922301
0.866667 0.152356 0.097143 -0.722057 0.239098 0.128987 -1.024358
0.900000 0.160405 0.101469 -0.712313 0.244265 0.130024 -1.171990
0.933333 0.168623 0.105824 -0.728344 0.249455 0.131020 -1.353312
0.966667 0.177011 0.110207 -0.758880 0.254667 0.131977 -1.551073
1.000000 0.185569 0.114619 -0.804577 0.259903 0.132902 -1.747548
1.033333 0.194311 0.119067 -0.873212 0.265163 0.133795 -1.917282
1.066667 0.203235 0.123550 -0.989389 0.270445 0.134661 -2.037187
1.100000 0.212343 0.128067 -1.095716 0.275745 0.135500 -2.086637
1.133333 0.221625 0.132608 -1.189895 0.281061 0.136312 -2.055152
1.166667 0.231083 0.137174 -1.316026 0.286389 0.137096 -1.931638
1.200000 0.240717 0.141764 -1.407147 0.291722 0.137850 -1.714870
1.233333 0.250528 0.146377 -1.477271 0.297059 0.138570 -1.417329
1.266667 0.260518 0.151012 -1.520053 0.302398 0.139256 -1.060481
1.300000 0.270687 0.155668 -1.544329 0.307738 0.139906 -0.667154
1.333333 0.281032 0.160351 -1.557896 0.313083 0.140519 -0.263655
1.366667 0.291558 0.165053 -1.546433 0.318432 0.141092 0.115654
1.400000 0.302258 0.169777 -1.525952 0.323788 0.141620 0.446940
1.433333 0.313140 0.174519 -1.506209 0.329153 0.142102 0.715501
1.466667 0.324198 0.179277 -1.442680 0.334531 0.142532 0.912846
1.500000 0.335439 0.184051 -1.352793 0.339920 0.142905 1.033163
1.533333 0.346855 0.188835 -1.291063 0.345325 0.143217 1.078786
1.566667 0.358447 0.193623 -1.240000 0.350749 0.143470 1.060770
1.600000 0.370224 0.198426 -1.196404 0.356195 0.143669 0.987526
1.633333 0.382187 0.203242 -1.162614 0.361668 0.143814 0.865648
1.666667 0.394328 0.208054 -1.149684 0.367172 0.143910 0.707328
1.700000 0.406649 0.212860 -1.124808 0.372714 0.143966 0.526440
1.733333 0.419153 0.217656 -1.116739 0.378299 0.143988 0.334275
1.766667 0.431845 0.222464 -1.111136 0.383931 0.143978 0.138414
1.800000 0.444724 0.227262 -1.113418 0.389613 0.143942 -0.051812
1.833333 0.457794 0.232051 -1.103211 0.395346 0.143890 -0.228859
1.866667 0.471053 0.236849 -1.118179 0.401127 0.143828 -0.387190
1.900000 0.484501 0.241655 -1.123653 0.406950 0.143763 -0.525494
1.933333 0.498148 0.246453 -1.156792 0.412807 0.143697 -0.641569
1.966667 0.511997 0.251244 -1.193354 0.418692 0.143638 -0.735384
2.000000 0.526050 0.256026 -1.252106 0.424602 0.143587 -0.808435
2.033333 0.540308 0.260802 -1.278172 0.430535 0.143541 -0.864196
2.066667 0.554774 0.265571 -1.314520 0.436488 0.143499 -0.910295
2.100000 0.569430 0.270346 -1.344418 0.442465 0.143459 -0.953886
2.133333 0.584278 0.275125 -1.375774 0.448466 0.143420 -1.002433
2.166667 0.599317 0.279909 -1.401624 0.454492 0.143379 -1.059603
2.200000 0.614546 0.284697 -1.427697 0.460539 0.143334 -1.128656
2.233333 0.629967 0.289489 -1.439633 0.466602 0.143283 -1.205885
2.266667 0.645603 0.294273 -1.458490 0.472679 0.143225 -1.282355
2.300000 0.661455 0.299050 -1.509143 0.478760 0.143158 -1.345302
2.333333 0.677525 0.303820 -1.567264 0.484838 0.143083 -1.385791
2.366667 0.693812 0.308581 -1.636787 0.490906 0.142999 -1.392048
2.400000 0.710289 0.313344 -1.715171 0.496960 0.142907 -1.354895
2.433333 0.726983 0.318100 -1.792935 0.502996 0.142805 -1.268008
2.466667 0.743866 0.322857 -1.840855 0.509010 0.142690 -1.135450
2.500000 0.760938 0.327614 -1.903399 0.515006 0.142559 -0.964076
2.533333 0.778197 0.332371 -1.938244 0.520987 0.142404 -0.764115
2.566667 0.795644 0.337128 -1.956565 0.526958 0.142220 -0.550137
2.600000 0.813305 0.341876 -1.941168 0.532920 0.142003 -0.341548
2.633333 0.831152 0.346624 -1.927929 0.538873 0.141748 -0.160911
2.666667 0.849209 0.351361 -1.926215 0.544813 0.141456 -0.023229
2.700000 0.867474 0.356085 -1.913780 0.550732 0.141126 0.050597
2.733333 0.885945 0.360791 -1.900178 0.556617 0.140759 0.048134
2.766667 0.904620 0.365479 -1.871383 0.562455 0.140357 -0.046258
2.800000 0.923496 0.370144 -1.857504 0.568235 0.139922 -0.239860
2.833333 0.942553 0.374807 -1.826665 0.573946 0.139461 -0.535816
2.866667 0.961805 0.379441 -1.848018 0.579579 0.138976 -0.932497
2.900000 0.981236 0.384073 -1.840572 0.585131 0.138474 -1.431704
2.933333 1.000845 0.388702 -1.865302 0.590602 0.137964 -2.019246
2.966667 1.020639 0.393295 -1.903316 0.595994 0.137449 -2.677643
3.000000 1.040609 0.397885 -1.992301 0.601310 0.136928 -3.372346
3.033333 1.060756 0.402436 -2.107793 0.606550 0.136396 -4.064059
3.066667 1.081075 0.406945 -2.276251 0.611716 0.135850 -4.711788
3.100000 1.101566 0.411451 -2.465545 0.616808 0.135282 -5.246067
3.133333 1.122228 0.415955 -2.711286 0.621823 0.134684 -5.620639
3.166667 1.143058 0.420455 -2.927237 0.626760 0.134047 -5.782928
3.200000 1.164050 0.424918 3.110948 0.631620 0.133374 -5.709970
3.233333 1.185207 0.429378 2.747538 0.636407 0.132667 -5.383313
3.266667 1.206529 0.433836 2.515490 0.641124 0.131930 -4.809312
3.300000 1.227998 0.438243 2.225299 0.645779 0.131171 -4.016450
3.333333 1.249612 0.442606 2.071770 0.650380 0.130404 -3.047401
3.366667 1.271373 0.446925 1.985530 0.654936 0.129651 -1.956913
3.400000 1.293280 0.451206 1.952376 0.659456 0.128928 -0.798795
3.433333 1.315332 0.455453 1.982915 0.663948 0.128259 0.352459
3.466667 1.337540 0.459698 2.059655 0.668419 0.127666 1.448534
3.500000 1.359896 0.463917 2.188374 0.672873 0.127167 2.434302
3.533333 1.382400 0.468115 2.349469 0.677312 0.126776 3.280991
3.566667 1.405055 0.472314 2.512769 0.681735 0.126497 3.967112
3.600000 1.427858 0.476502 2.698710 0.686140 0.126331 4.478597
3.633333 1.450811 0.480686 2.877270 0.690521 0.126268 4.825210
3.666667 1.473911 0.484871 3.063909 0.694869 0.126297 5.006695
3.700000 1.497154 0.489058 -3.020959 0.699183 0.126410 5.032033
3.733333 1.520537 0.493247 -2.823093 0.703459 0.126592 4.906301
3.766667 1.544073 0.497470 -2.662319 0.707700 0.126837 4.639837
3.800000 1.567744 0.501696 -2.464684 0.711909 0.127133 4.249569
3.833333 1.591551 0.505926 -2.279824 0.716094 0.127481 3.750237
3.866667 1.615506 0.510192 -2.106134 0.720265 0.127876 3.162177
3.900000 1.639591 0.514464 -1.976270 0.724430 0.128312 2.515928
3.933333 1.663805 0.518740 -1.903191 0.728596 0.128786 1.845070
3.966667 1.688145 0.523021 -1.873711 0.732768 0.129297 1.179147
4.000000 1.712609 0.527308 -1.866338 0.736947 0.129842 0.548534
4.033333 1.737229 0.531629 -1.916723 0.741132 0.130416 -0.014808
4.066667 1.762005 0.535984 -1.972904 0.745325 0.131019 -0.483017
4.100000 1.786941 0.540371 -2.039500 0.749517 0.131647 -0.839697
4.133333 1.811991 0.544765 -2.095497 0.753698 0.132296 -1.083206
4.166667 1.837203 0.549192 -2.162125 0.757864 0.132960 -1.215024
4.200000 1.862525 0.553627 -2.223840 0.762010 0.133636 -1.244117
4.233333 1.888010 0.558095 -2.281054 0.766130 0.134321 -1.189501
4.266667 1.913658 0.562597 -2.325698 0.770214 0.135010 -1.072145
4.300000 1.939407 0.567107 -2.363017 0.774269 0.135708 -0.914261
4.333333 1.965254 0.571625 -2.385510 0.778300 0.136416 -0.727941
4.366667 1.991263 0.576177 -2.406280 0.782305 0.137136 -0.527127
4.400000 2.017433 0.580764 -2.419672 0.786274 0.137867 -0.325012
4.433333 2.043691 0.585359 -2.414938 0.790198 0.138607 -0.132211
4.466667 2.070106 0.589989 -2.432656 0.794069 0.139356 0.046460
4.500000 2.096676 0.594654 -2.423264 0.797860 0.140103 0.203346
4.533333 2.123324 0.599327 -2.398674 0.801542 0.140839 0.328381
4.566667 2.150120 0.604034 -2.373353 0.805096 0.141557 0.412043
4.600000 2.177059 0.608774 -2.348651 0.808511 0.142253 0.445005
4.633333 2.204138 0.613546 -2.322777 0.811778 0.142924 0.423623
4.666667 2.231352 0.618348 -2.296081 0.814886 0.143563 0.336836
4.700000 2.258626 0.623159 -2.265329 0.817826 0.144171 0.183302
4.733333 2.285957 0.627978 -2.234558 0.820601 0.144747 -0.034283
4.766667 2.313340 0.632804 -2.221748 0.823208 0.145291 -0.309739
4.800000 2.340837 0.637657 -2.201340 0.825635 0.145803 -0.632841
4.833333 2.368442 0.642532 -2.228776 0.827872 0.146283 -0.988301
4.866667 2.396087 0.647415 -2.264873 0.829925 0.146734 -1.350387
4.900000 2.423825 0.652319 -2.326775 0.831792 0.147159 -1.692630
4.933333 2.451651 0.657243 -2.412002 0.833470 0.147559 -1.988841
4.966667 2.479556 0.662185 -2.496223 0.834950 0.147932 -2.209907
5.000000 2.507485 0.667134 -2.595361 0.836235 0.148281 -2.327216
5.033333 2.535433 0.672090 -2.717542 0.837329 0.148608 -2.324886
5.066667 2.563394 0.677050 -2.825018 0.838229 0.148917 -2.197010
5.100000 2.591366 0.682016 -2.963975 0.838937 0.149216 -1.941277
5.133333 2.619344 0.686988 -3.084924 0.839466 0.149519 -1.564260
5.166667 2.647360 0.691982 3.126038 0.839828 0.149842 -1.082146
5.200000 2.675399 0.696981 3.108920 0.840032 0.150200 -0.517080
5.233333 2.703452 0.701986 3.095626 0.840074 0.150605 0.109619
5.266667 2.731493 0.706994 3.108838 0.839953 0.151063 0.778858
5.300000 2.759534 0.712012 -3.125516 0.839660 0.151575 1.461464
5.333333 2.787553 0.717032 -3.054097 0.839177 0.152137 2.146009
5.366667 2.815563 0.722087 -2.965158 0.838487 0.152740 2.824828
5.400000 2.843554 0.727177 -2.837979 0.837573 0.153374 3.465416
5.433333 2.871514 0.732304 -2.699048 0.836424 0.154021 4.038587
5.466667 2.899433 0.737467 -2.563746 0.835031 0.154665 4.608308
5.500000 2.927300 0.742665 -2.412342 0.833397 0.155287 5.200991
5.533333 2.955117 0.747863 -2.212730 0.831523 0.155865 5.270805
5.566667 2.982860 0.753092 -2.014821 0.829420 0.156377 4.817723
5.600000 3.010544 0.758319 -1.780401 0.827108 0.156807 3.896000
5.633333 3.038132 0.763569 -1.574474 0.824602 0.157142 2.564097
5.666667 3.065616 0.768839 -1.226128 0.821918 0.157372 0.680239
5.700000 3.092983 0.774120 -0.914957 0.819067 0.157488 -1.805474
5.733333 3.120224 0.779405 -0.914957 0.816068 0.157490 -3.813361
5.766667 3.147384 0.784685 -0.914957 0.812935 0.157377 -5.357506
5.800000 3.174459 0.789958 0.195719 0.809674 0.157151 -6.044256
5.833333 3.201442 0.795223 0.700357 0.806292 0.156814 -5.963317
5.866667 3.228280 0.800461 0.930779 0.802799 0.156378 -5.056353
5.900000 3.255018 0.805690 1.349213 0.799202 0.155857 -3.320204
5.933333 3.281653 0.810908 1.763595 0.795496 0.155263 -1.338502
5.966667 3.308140 0.816088 2.181995 0.791674 0.154609 0.865724
6.000000 3.334476 0.821228 2.558584 0.787732 0.153906 2.411198
6.033333 3.360659 0.826326 2.820332 0.783671 0.153170 3.384702
6.066667 3.386723 0.831411 2.994812 0.779484 0.152410 3.816170
6.100000 3.412663 0.836482 3.044635 0.775169 0.151633 3.771103
6.133333 3.438477 0.841539 3.083056 0.770729 0.150852 3.333493
6.166667 3.464128 0.846556 3.075101 0.766171 0.150076 2.580180
6.200000 3.489644 0.851557 3.086657 0.761499 0.149314 2.007042
6.233333 3.514990 0.856522 3.090951 0.756716 0.148566 1.612638
6.266667 3.540162 0.861452 3.103074 0.751832 0.147837 1.404957
6.300000 3.565156 0.866351 3.124252 0.746857 0.147130 1.355377
6.333333 3.589967 0.871219 -3.115767 0.741802 0.146445 1.431045
6.366667 3.614598 0.876081 -3.050292 0.736676 0.145780 1.586364
6.400000 3.639073 0.880922 -2.982578 0.731490 0.145131 1.783223
6.433333 3.663388 0.885743 -2.925591 0.726243 0.144497 1.987648
6.466667 3.687506 0.890560 -2.858278 0.720934 0.143871 2.169946
6.500000 3.711459 0.895354 -2.788417 0.715550 0.143243 2.310982
6.533333 3.735241 0.900126 -2.704079 0.710076 0.142603 2.391461
6.566667 3.758851 0.904875 -2.597065 0.704493 0.141940 2.402814
6.600000 3.782285 0.909601 -2.483714 0.698782 0.141248 2.328885
6.633333 3.805540 0.914302 -2.377544 0.692932 0.140519 2.159300
6.666667 3.828561 0.918984 -2.268561 0.686935 0.139750 1.887472
6.700000 3.851397 0.923641 -2.197412 0.680787 0.138938 1.508742
6.733333 3.874045 0.928272 -2.108030 0.674492 0.138086 1.024294
6.766667 3.896447 0.932872 -2.057011 0.668053 0.137192 0.443892
6.800000 3.918656 0.937445 -2.036812 0.661476 0.136256 -0.207224
6.833333 3.940611 0.941980 -2.033746 0.654773 0.135279 -0.899502
6.866667 3.962310 0.946474 -2.078195 0.647947 0.134261 -1.593727
6.900000 3.983808 0.950939 -2.140485 0.641005 0.133201 -2.247586
6.933333 4.005103 0.955374 -2.250460 0.633954 0.132100 -2.811961
6.966667 4.026134 0.959763 -2.383421 0.626803 0.130957 -3.251111
7.000000 4.046958 0.964122 -2.548927 0.619562 0.129776 -3.539428
7.033333 4.067517 0.968436 -2.752298 0.612239 0.128558 -3.656194
7.066667 4.087813 0.972708 -2.972086 0.604846 0.127309 -3.594824
7.100000 4.107846 0.976940 3.135007 0.597404 0.126035 -3.363714
7.133333 4.127664 0.981139 2.989780 0.589934 0.124747 -2.986117
7.166667 4.147212 0.985281 2.875142 0.582450 0.123450 -2.491118
7.200000 4.166493 0.989370 2.799435 0.574968 0.122154 -1.914931
7.233333 4.185506 0.993407 2.762655 0.567495 0.120866 -1.301110
7.266667 4.204253 0.997394 2.752532 0.560043 0.119592 -0.697014
7.300000 4.222776 1.001347 2.763550 0.552610 0.118337 -0.133029
7.333333 4.241074 1.005264 2.797811 0.545183 0.117107 0.366918
7.366667 4.259146 1.009146 2.846795 0.537748 0.115902 0.792369
7.400000 4.276948 1.012986 2.917974 0.530293 0.114726 1.142469
7.433333 4.294522 1.016790 2.966682 0.522794 0.113575 1.427754
7.466667 4.311867 1.020558 3.051301 0.515222 0.112447 1.668538
7.500000 4.328935 1.024284 3.102699 0.507564 0.111336 1.876837
7.533333 4.345723 1.027969 -3.125800 0.499821 0.110239 2.062566
7.566667 4.362279 1.031617 -3.062801 0.492000 0.109149 2.230549
7.600000 4.378603 1.035227 -3.028051 0.484116 0.108062 2.382780
7.633333 4.394645 1.038811 -2.957578 0.476198 0.106975 2.510809
7.666667 4.410401 1.042366 -2.850593 0.468279 0.105881 2.602253
7.700000 4.425867 1.045887 -2.739008 0.460383 0.104775 2.645544
7.733333 4.441040 1.049371 -2.617079 0.452518 0.103648 2.631621
7.766667 4.455917 1.052814 -2.494729 0.444695 0.102493 2.552490
7.800000 4.470559 1.056217 -2.367576 0.436922 0.101304 2.402173
7.833333 4.484967 1.059581 -2.277856 0.429192 0.100073 2.188777
7.866667 4.499140 1.062905 -2.188598 0.421497 0.098799 1.925782
7.900000 4.513079 1.066189 -2.108547 0.413833 0.097485 1.630258
7.933333 4.526784 1.069433 -2.078769 0.406201 0.096137 1.321205
7.966667 4.540255 1.072637 -2.062179 0.398589 0.094759 1.019122
8.000000 4.553433 1.075782 -2.063591 0.390989 0.093360 0.745492
8.033333 4.566323 1.078867 -2.073649 0.383409 0.091947 0.511804
8.066667 4.578926 1.081894 -2.064021 0.375859 0.090530 0.324570
8.100000 4.591298 1.084881 -2.066101 0.368353 0.089115 0.186024
8.133333 4.603438 1.087826 -2.071372 0.360898 0.087707 0.092556
8.166667 4.615301 1.090714 -2.065784 0.353512 0.086309 0.036561
8.200000 4.626934 1.093561 -2.074085 0.346206 0.084925 0.007970
8.233333 4.638339 1.096367 -2.070814 0.338975 0.083554 -0.004466
8.266667 4.649515 1.099132 -2.072202 0.331807 0.082189 -0.007329
8.300000 4.660464 1.101855 -2.075537 0.324689 0.080827 -0.005598
8.333333 4.671152 1.104524 -2.079020 0.317612 0.079464 -0.002619
8.366667 4.681615 1.107151 -2.065608 0.310565 0.078095 0.000117
8.400000 4.691855 1.109737 -2.064550 0.303541 0.076718 0.001038
8.433333 4.701872 1.112282 -2.071737 0.296538 0.075333 0.003244
8.466667 4.711640 1.114774 -2.070362 0.289562 0.073941 0.004821
8.500000 4.721162 1.117214 -2.071452 0.282624 0.072546 0.005239
8.533333 4.730442 1.119603 -2.072302 0.275730 0.071151 0.003663
8.566667 4.739505 1.121951 -2.072946 0.268890 0.069760 0.001860
8.600000 4.748331 1.124248 -2.072882 0.262114 0.068376 0.000980
8.633333 4.756944 1.126504 -2.069428 0.255412 0.067003 -0.000850
8.666667 4.765326 1.128711 -2.068582 0.248790 0.065643 -0.001417
8.700000 4.773483 1.130869 -2.066493 0.242251 0.064298 -0.002424
8.733333 4.781430 1.132986 -2.067345 0.235795 0.062965 -0.001842
8.766667 4.789157 1.135056 -2.068622 0.229423 0.061646 -0.002063
8.800000 4.796680 1.137086 -2.078739 0.223133 0.060339 -0.003121
8.833333 4.803999 1.139076 -2.067511 0.216924 0.059044 -0.003621
8.866667 4.811116 1.141026 -2.076368 0.210793 0.057759 -0.004161
8.900000 4.818027 1.142930 -2.071771 0.204740 0.056483 -0.003380
8.933333 4.824734 1.144790 -2.069174 0.198766 0.055218 -0.002638
8.966667 4.831241 1.146605 -2.072466 0.192869 0.053962 -0.000179
9.000000 4.837551 1.148377 -2.069512 0.187049 0.052716 0.002529
9.033333 4.843670 1.150110 -2.069995 0.181307 0.051482 0.005381
9.066667 4.849599 1.151804 -2.066834 0.175644 0.050261 0.006999
9.100000 4.855341 1.153457 -2.075033 0.170060 0.049054 0.007397
9.133333 4.860899 1.155069 -2.078573 0.164554 0.047863 0.007825
9.166667 4.866276 1.156639 -2.070006 0.159129 0.046688 0.006582
9.200000 4.871473 1.158172 -2.070324 0.153784 0.045529 0.004863
9.233333 4.876495 1.159666 -2.066866 0.148520 0.044386 0.003291
9.266667 4.881341 1.161122 -2.064560 0.143339 0.043258 0.002275
9.300000 4.886013 1.162543 -2.065841 0.138243 0.042145 0.001698
9.333333 4.890520 1.163926 -2.069919 0.133234 0.041047 0.000281
9.366667 4.894858 1.165273 -2.070206 0.128314 0.039963 -0.001080
