t x y theta dxdt dydt dthetadt
0.000000 0.000000 0.000000 -2.821790 0.106716 0.106763 -0.001095
0.033333 0.003594 0.003587 -2.823086 0.109405 0.108659 -0.002297
0.066667 0.007268 0.007221 -2.827804 0.112133 0.110580 -0.002286
0.100000 0.011039 0.010928 -2.831488 0.114894 0.112516 -0.000821
0.133333 0.014908 0.014708 -2.819618 0.117684 0.114456 0.000149
0.166667 0.018875 0.018561 -2.822326 0.120499 0.116396 0.000801
0.200000 0.022942 0.022489 -2.825860 0.123332 0.118323 0.002425
0.233333 0.027109 0.026491 -2.830393 0.126172 0.120220 0.004912
0.266667 0.031360 0.030537 -2.820966 0.129008 0.122071 0.005471
0.300000 0.035695 0.034625 -2.827287 0.131833 0.123865 0.004983
0.333333 0.040134 0.038789 -2.821408 0.134638 0.125589 0.005111
0.366667 0.044679 0.043028 -2.825543 0.137416 0.127232 0.006127
0.400000 0.049331 0.047342 -2.816817 0.140160 0.128789 0.005679
0.433333 0.054067 0.051696 -2.824935 0.142874 0.130263 0.004196
0.466667 0.058887 0.056089 -2.826046 0.145560 0.131659 0.003496
0.500000 0.063791 0.060519 -2.826693 0.148223 0.132987 0.002216
0.533333 0.068780 0.064986 -2.820643 0.150874 0.134262 0.000955
0.566667 0.073852 0.069489 -2.822574 0.153527 0.135502 -0.000425
0.600000 0.079010 0.074027 -2.820733 0.156200 0.136736 -0.000260
0.633333 0.084251 0.078598 -2.822363 0.158905 0.137978 -0.000861
0.666667 0.089576 0.083203 -2.824284 0.161657 0.139252 -0.000962
0.700000 0.094986 0.087839 -2.823997 0.164464 0.140568 -0.000080
0.733333 0.100480 0.092506 -2.824332 0.167328 0.141930 0.000659
0.766667 0.106092 0.097250 -2.819263 0.170247 0.143337 -0.005036
0.800000 0.111788 0.102022 -2.827176 0.173219 0.144781 -0.033475
0.833333 0.117605 0.106871 -2.830359 0.176236 0.146256 -0.105265
0.866667 0.123544 0.111796 -2.819729 0.179284 0.147741 -0.243345
0.900000 0.129566 0.116746 -2.816539 0.182350 0.149219 -0.465581
0.933333 0.135712 0.121772 -2.822447 0.185423 0.150677 -0.784852
0.966667 0.141939 0.126821 -2.828037 0.188494 0.152102 -1.195997
1.000000 0.148293 0.131946 -2.820759 0.191544 0.153473 -1.671972
1.033333 0.154728 0.137090 -2.824470 0.194562 0.154775 -2.171428
1.066667 0.161243 0.142252 -2.821332 0.197546 0.156010 -2.654171
1.100000 0.167887 0.147490 -2.885961 0.200495 0.157174 -3.079297
1.133333 0.174660 0.152802 -3.096005 0.203401 0.158262 -3.404066
1.166667 0.181512 0.158129 2.915584 0.206257 0.159263 -3.599069
1.200000 0.188442 0.163467 2.676156 0.209071 0.160184 -3.649862
1.233333 0.195450 0.168815 2.459494 0.211845 0.161025 -3.555066
1.266667 0.202565 0.174212 2.301409 0.214575 0.161776 -3.318030
1.300000 0.209787 0.179656 2.213224 0.217262 0.162432 -2.958292
1.333333 0.217084 0.185105 2.148527 0.219916 0.162998 -2.516730
1.366667 0.224455 0.190557 2.108121 0.222545 0.163478 -2.038847
1.400000 0.231931 0.196045 2.084299 0.225147 0.163869 -1.566428
1.433333 0.239478 0.201533 2.074785 0.227717 0.164164 -1.136111
1.466667 0.247097 0.207019 2.069813 0.230259 0.164368 -0.774487
1.500000 0.254817 0.212522 2.055627 0.232776 0.164480 -0.490101
1.533333 0.262637 0.218034 2.047705 0.235262 0.164496 -0.276238
1.566667 0.270526 0.223539 2.042619 0.237716 0.164410 -0.117525
1.600000 0.278512 0.229042 2.040475 0.240146 0.164221 0.000242
1.633333 0.286564 0.234535 2.047922 0.242562 0.163927 0.092077
1.666667 0.294712 0.240017 2.055008 0.244968 0.163521 0.168542
1.700000 0.302923 0.245485 2.065992 0.247372 0.162999 0.233128
1.733333 0.311197 0.250938 2.075717 0.249782 0.162356 0.288390
1.766667 0.319533 0.256372 2.086411 0.252206 0.161593 0.335323
1.800000 0.327959 0.261778 2.101186 0.254645 0.160710 0.375247
1.833333 0.336476 0.267150 2.120597 0.257098 0.159708 0.406866
1.866667 0.345082 0.272485 2.131774 0.259564 0.158590 0.427882
1.900000 0.353777 0.277778 2.156512 0.262037 0.157364 0.436222
1.933333 0.362559 0.283025 2.160404 0.264498 0.156038 0.432049
1.966667 0.371428 0.288224 2.176874 0.266935 0.154620 0.408164
2.000000 0.380383 0.293369 2.194244 0.269334 0.153120 0.359531
2.033333 0.389423 0.298458 2.218679 0.271682 0.151545 0.286583
2.066667 0.398548 0.303487 2.225496 0.273964 0.149908 0.192259
2.100000 0.407720 0.308480 2.256373 0.276172 0.148218 0.080802
2.133333 0.416975 0.313407 2.265521 0.278305 0.146479 -0.043026
2.166667 0.426312 0.318262 2.267208 0.280357 0.144700 -0.162962
2.200000 0.435730 0.323044 2.251630 0.282323 0.142892 -0.262665
2.233333 0.445188 0.327785 2.244824 0.284196 0.141064 -0.333705
2.266667 0.454684 0.332485 2.225722 0.285981 0.139215 -0.370460
2.300000 0.464257 0.337104 2.166366 0.287676 0.137352 -0.365097
2.333333 0.473906 0.341643 2.106006 0.289279 0.135473 -0.317267
2.366667 0.483626 0.346102 2.091176 0.290792 0.133580 -0.235779
2.400000 0.493378 0.350514 2.069464 0.292221 0.131661 -0.133458
2.433333 0.503157 0.354878 2.074702 0.293571 0.129707 -0.021010
2.466667 0.512963 0.359194 2.097937 0.294840 0.127713 0.091205
2.500000 0.522828 0.363430 2.122927 0.296028 0.125668 0.187306
2.533333 0.532715 0.367615 2.153623 0.297137 0.123564 0.257100
2.566667 0.542652 0.371719 2.187158 0.298170 0.121391 0.297014
2.600000 0.552634 0.375739 2.205214 0.299120 0.119152 0.306363
2.633333 0.562634 0.379706 2.220131 0.299982 0.116852 0.289324
2.666667 0.572669 0.383586 2.215134 0.300748 0.114499 0.255401
2.700000 0.582735 0.387377 2.217008 0.301414 0.112104 0.214053
2.733333 0.592825 0.391076 2.211680 0.301969 0.109685 0.175956
2.766667 0.602934 0.394681 2.208405 0.302399 0.107252 0.148308
2.800000 0.613054 0.398189 2.210158 0.302698 0.104812 0.136357
2.833333 0.623180 0.401640 2.218749 0.302863 0.102376 0.141143
2.866667 0.633305 0.404988 2.223794 0.302896 0.099950 0.155187
2.900000 0.643432 0.408278 2.224535 0.302796 0.097537 0.177365
2.933333 0.653557 0.411509 2.220872 0.302569 0.095137 0.202966
2.966667 0.663661 0.414630 2.228547 0.302227 0.092756 0.228746
3.000000 0.673761 0.417692 2.257476 0.301779 0.090399 0.250683
3.033333 0.683854 0.420694 2.265797 0.301230 0.088062 0.267501
3.066667 0.693902 0.423584 2.281894 0.300574 0.085739 0.280350
3.100000 0.703896 0.426361 2.282730 0.299810 0.083431 0.288822
3.133333 0.713879 0.429078 2.287612 0.298944 0.081144 0.291928
3.166667 0.723848 0.431735 2.302721 0.297967 0.078875 0.289608
3.200000 0.733803 0.434330 2.307360 0.296861 0.076621 0.286376
3.233333 0.743740 0.436865 2.323891 0.295622 0.074386 0.281355
3.266667 0.753590 0.439297 2.332210 0.294259 0.072175 0.277430
3.300000 0.763420 0.441669 2.341962 0.292768 0.069986 0.271250
3.333333 0.773229 0.443981 2.350610 0.291137 0.067814 0.264435
3.366667 0.782934 0.446199 2.363899 0.289380 0.065662 0.255818
3.400000 0.792530 0.448329 2.359050 0.287523 0.063539 0.242684
3.433333 0.802101 0.450398 2.380139 0.285581 0.061452 0.222900
3.466667 0.811646 0.452408 2.375683 0.283540 0.059403 0.195283
3.500000 0.821069 0.454341 2.390102 0.281409 0.057400 0.161306
3.533333 0.830365 0.456200 2.405246 0.279200 0.055454 0.121264
3.566667 0.839633 0.458000 2.414645 0.276891 0.053567 0.077929
3.600000 0.848873 0.459742 2.416114 0.274458 0.051735 0.030034
3.633333 0.857976 0.461424 2.410367 0.271899 0.049954 -0.014912
3.666667 0.867050 0.463048 2.407792 0.269225 0.048220 -0.055714
3.700000 0.876095 0.464614 2.403617 0.266437 0.046526 -0.087254
3.733333 0.885001 0.466129 2.407477 0.263537 0.044859 -0.111184
3.766667 0.893770 0.467594 2.383754 0.260560 0.043211 -0.128895
3.800000 0.902404 0.469008 2.372338 0.257541 0.041573 -0.137557
3.833333 0.910908 0.470371 2.353185 0.254508 0.039938 -0.140528
3.866667 0.919286 0.471681 2.358746 0.251498 0.038298 -0.139932
3.900000 0.927543 0.472936 2.367199 0.248563 0.036650 -0.141614
3.933333 0.935773 0.474138 2.360349 0.245749 0.034992 -0.142093
3.966667 0.943894 0.475283 2.362236 0.243081 0.033326 -0.142581
4.000000 0.951915 0.476369 2.366931 0.240585 0.031656 -0.145574
4.033333 0.959843 0.477395 2.372525 0.238278 0.029989 -0.153660
4.066667 0.967683 0.478359 2.348608 0.236159 0.028332 -0.163829
4.100000 0.975499 0.479272 2.323770 0.234208 0.026694 -0.170730
4.133333 0.983236 0.480127 2.320978 0.232408 0.025086 -0.178702
4.166667 0.990896 0.480923 2.321584 0.230743 0.023516 -0.184872
4.200000 0.998537 0.481670 2.323189 0.229182 0.021992 -0.188033
4.233333 1.006108 0.482362 2.314591 0.227702 0.020518 -0.184966
4.266667 1.013662 0.483006 2.303546 0.226281 0.019098 -0.180007
4.300000 1.021201 0.483605 2.289613 0.224908 0.017734 -0.176562
4.333333 1.028727 0.484159 2.289907 0.223571 0.016426 -0.170305
4.366667 1.036185 0.484670 2.296345 0.222262 0.015170 -0.163291
4.400000 1.043573 0.485142 2.293350 0.220987 0.013965 -0.154898
4.433333 1.050893 0.485579 2.288870 0.219748 0.012806 -0.147259
4.466667 1.058145 0.485983 2.253391 0.218560 0.011689 -0.134925
4.500000 1.065394 0.486346 2.257942 0.217444 0.010610 -0.119477
4.533333 1.072582 0.486677 2.256604 0.216420 0.009564 -0.102070
4.566667 1.079772 0.486970 2.268571 0.215500 0.008549 -0.083566
4.600000 1.086908 0.487233 2.251300 0.214691 0.007564 -0.063685
4.633333 1.093995 0.487467 2.254235 0.214006 0.006605 -0.043138
4.666667 1.101092 0.487665 2.245295 0.213445 0.005674 -0.027281
4.700000 1.108199 0.487829 2.250757 0.212997 0.004771 -0.013790
4.733333 1.115270 0.487966 2.253757 0.212652 0.003897 -0.004174
4.766667 1.122308 0.488079 2.263968 0.212415 0.003052 0.003474
4.800000 1.129366 0.488159 2.260483 0.212288 0.002235 0.007300
4.833333 1.136446 0.488208 2.259465 0.212259 0.001448 0.007466
4.866667 1.143507 0.488235 2.258479 0.212329 0.000692 0.006637
4.900000 1.150552 0.488241 2.254196 0.212503 -0.000033 0.003830
4.933333 1.157587 0.488226 2.255223 0.212787 -0.000728 0.001168
4.966667 1.164656 0.488184 2.258443 0.213175 -0.001393 -0.001388
5.000000 1.171763 0.488116 2.255438 0.213669 -0.002026 -0.003869
5.033333 1.178872 0.488030 2.260795 0.214281 -0.002630 -0.004540
5.066667 1.185990 0.487927 2.255628 0.215017 -0.003205 -0.004421
5.100000 1.193155 0.487801 2.257178 0.215874 -0.003751 -0.002728
5.133333 1.200337 0.487661 2.262065 0.216853 -0.004268 -0.001648
5.166667 1.207541 0.487507 2.248857 0.217960 -0.004757 -0.000499
5.200000 1.214803 0.487332 2.259742 0.219199 -0.005219 0.000284
5.233333 1.222096 0.487146 2.248996 0.220570 -0.005654 0.000598
5.266667 1.229427 0.486948 2.258841 0.222078 -0.006063 0.000537
5.300000 1.236825 0.486733 2.260506 0.223731 -0.006450 -0.000317
5.333333 1.244293 0.486501 2.255582 0.225531 -0.006815 0.000145
5.366667 1.251814 0.486262 2.257089 0.227476 -0.007156 0.000082
5.400000 1.259392 0.486014 2.257496 0.229567 -0.007474 0.000524
5.433333 1.267032 0.485760 2.255625 0.231802 -0.007768 0.001347
5.466667 1.274757 0.485494 2.260066 0.234176 -0.008035 0.002724
5.500000 1.282570 0.485217 2.260617 0.236684 -0.008273 0.004712
5.533333 1.290475 0.484929 2.254049 0.239323 -0.008483 0.005312
5.566667 1.298475 0.484632 2.246563 0.242094 -0.008662 0.005439
5.600000 1.306574 0.484327 2.256809 0.244994 -0.008811 0.006309
5.633333 1.314766 0.484021 2.253089 0.248018 -0.008926 0.006680
5.666667 1.323057 0.483714 2.263755 0.251169 -0.009009 0.006597
5.700000 1.331452 0.483408 2.272251 0.254446 -0.009057 0.005809
5.733333 1.339956 0.483103 2.252030 0.257847 -0.009072 0.005942
5.766667 1.348576 0.482795 2.259031 0.261373 -0.009053 0.005908
5.800000 1.357316 0.482486 2.260782 0.265027 -0.009004 0.004645
5.833333 1.366178 0.482175 2.254669 0.268811 -0.008924 0.003535
5.866667 1.375171 0.481870 2.255728 0.272728 -0.008814 0.002854
5.900000 1.384300 0.481572 2.259467 0.276779 -0.008676 0.003899
5.933333 1.393569 0.481280 2.260476 0.280968 -0.008507 0.003588
5.966667 1.402984 0.480997 2.256347 0.285294 -0.008308 0.002964
6.000000 1.412538 0.480718 2.261783 0.289754 -0.008078 0.002385
6.033333 1.422236 0.480445 2.259293 0.294345 -0.007818 0.001101
6.066667 1.432079 0.480178 2.258280 0.299063 -0.007528 -0.000181
6.100000 1.442089 0.479924 2.267668 0.303901 -0.007208 -0.003485
6.133333 1.452271 0.479682 2.258840 0.308853 -0.006859 -0.005448
6.166667 1.462629 0.479453 2.259609 0.313913 -0.006482 -0.006620
6.200000 1.473171 0.479239 2.256212 0.319079 -0.006076 -0.006483
6.233333 1.483873 0.479037 2.260216 0.324350 -0.005640 -0.005956
6.266667 1.494768 0.478852 2.255027 0.329725 -0.005175 -0.005174
6.300000 1.505829 0.478681 2.256959 0.335210 -0.004681 -0.002623
6.333333 1.517060 0.478525 2.254762 0.340812 -0.004157 0.000049
6.366667 1.528498 0.478389 2.257463 0.346536 -0.003603 0.002615
6.400000 1.540111 0.478271 2.261247 0.352390 -0.003018 0.003347
6.433333 1.551900 0.478172 2.257858 0.358383 -0.002400 0.004814
6.466667 1.563912 0.478095 2.257789 0.364519 -0.001751 0.005489
6.500000 1.576106 0.478038 2.261690 0.370811 -0.001068 0.004840
6.533333 1.588532 0.478006 2.259810 0.377262 -0.000351 0.003003
6.566667 1.601194 0.478000 2.256301 0.383877 0.000399 0.001018
6.600000 1.614098 0.478019 2.263546 0.390653 0.001182 -0.000067
6.633333 1.627193 0.478064 2.257799 0.397590 0.001998 -0.001278
6.666667 1.640538 0.478138 2.259577 0.404684 0.002847 -0.002519
6.700000 1.654077 0.478239 2.259731 0.411922 0.003728 -0.002908
6.733333 1.667876 0.478371 2.253461 0.419291 0.004642 -0.002115
6.766667 1.681939 0.478533 2.260670 0.426779 0.005587 -0.001327
6.800000 1.696272 0.478728 2.262370 0.434369 0.006564 -0.001517
6.833333 1.710877 0.478957 2.257280 0.442037 0.007573 -0.007291
6.866667 1.725759 0.479219 2.256239 0.449759 0.008614 -0.023002
6.900000 1.740842 0.479516 2.256982 0.457526 0.009688 -0.054309
6.933333 1.756211 0.479850 2.255177 0.465321 0.010794 -0.107781
6.966667 1.771869 0.480221 2.265819 0.473124 0.011933 -0.190048
7.000000 1.787820 0.480631 2.259855 0.480923 0.013106 -0.304110
7.033333 1.803974 0.481080 2.260307 0.488710 0.014312 -0.444893
7.066667 1.820429 0.481569 2.255684 0.496470 0.015553 -0.600346
7.100000 1.837088 0.482100 2.259702 0.504184 0.016831 -0.756945
7.133333 1.853951 0.482674 2.241687 0.511855 0.018149 -0.894083
7.166667 1.871125 0.483292 2.203500 0.519494 0.019511 -0.985432
7.200000 1.888612 0.483955 2.132969 0.527114 0.020921 -1.005758
7.233333 1.906412 0.484667 2.075389 0.534720 0.022384 -0.940541
7.266667 1.924415 0.485426 1.997216 0.542318 0.023901 -0.782894
7.300000 1.942620 0.486233 1.917665 0.549906 0.025472 -0.528958
7.333333 1.961026 0.487090 1.845315 0.557464 0.027096 -0.186362
7.366667 1.979633 0.487998 1.824072 0.564969 0.028767 0.217300
7.400000 1.998548 0.488968 1.832838 0.572402 0.030479 0.635758
7.433333 2.017767 0.490004 1.882178 0.579759 0.032227 1.022066
7.466667 2.037286 0.491108 1.957073 0.587033 0.033999 1.321318
7.500000 2.057103 0.492279 2.057630 0.594227 0.035787 1.472811
7.533333 2.077113 0.493508 2.176843 0.601345 0.037579 1.422600
7.566667 2.097315 0.494794 2.283221 0.608390 0.039366 1.141434
7.600000 2.117706 0.496139 2.383951 0.615360 0.041141 0.635037
7.633333 2.138285 0.497544 2.499685 0.622269 0.042899 -0.077821
7.666667 2.159142 0.499007 2.597963 0.629133 0.044639 -0.956590
7.700000 2.180183 0.500533 2.613291 0.635969 0.046365 -1.930459
7.733333 2.201498 0.502111 2.512667 0.642785 0.048086 -2.918075
7.766667 2.222991 0.503753 2.348265 0.649601 0.049808 -3.841309
7.800000 2.244757 0.505442 2.108735 0.656431 0.051538 -4.639445
7.833333 2.266792 0.507178 1.826074 0.663260 0.053288 -5.250684
7.866667 2.289096 0.508960 1.546308 0.670059 0.055068 -5.628639
7.900000 2.311567 0.510812 1.236057 0.676799 0.056889 -5.763832
7.933333 2.334201 0.512734 0.996974 0.683460 0.058758 -5.672973
7.966667 2.357096 0.514711 0.746501 0.689994 0.060683 -5.382947
8.000000 2.380252 0.516745 0.523609 0.696345 0.062675 -4.930242
8.033333 2.403560 0.518854 0.426966 0.702486 0.064737 -4.373888
8.066667 2.427121 0.521029 0.333985 0.708401 0.066870 -3.769145
8.100000 2.450929 0.523273 0.237307 0.714067 0.069079 -3.159629
8.133333 2.474979 0.525593 0.156119 0.719458 0.071368 -2.569735
8.166667 2.499166 0.527993 0.096394 0.724573 0.073739 -2.022634
8.200000 2.523486 0.530474 0.045340 0.729432 0.076194 -1.533593
8.233333 2.547934 0.533038 0.008102 0.734036 0.078735 -1.094988
8.266667 2.572507 0.535686 -0.017220 0.738398 0.081365 -0.700002
8.300000 2.597198 0.538419 -0.038254 0.742539 0.084084 -0.342848
8.333333 2.622005 0.541239 -0.042497 0.746492 0.086888 -0.023772
8.366667 2.646984 0.544165 -0.035421 0.750275 0.089774 0.258949
8.400000 2.672069 0.547180 -0.012935 0.753892 0.092736 0.507236
8.433333 2.697301 0.550306 0.024996 0.757350 0.095766 0.715552
8.466667 2.722668 0.553543 0.070957 0.760638 0.098852 0.877890
8.500000 2.748126 0.556874 0.124321 0.763741 0.101982 0.992654
8.533333 2.773692 0.560318 0.169032 0.766634 0.105144 1.062907
8.566667 2.799356 0.563875 0.207768 0.769299 0.108325 1.094205
8.600000 2.825104 0.567544 0.266484 0.771725 0.111514 1.091301
8.633333 2.850927 0.571326 0.311087 0.773902 0.114701 1.061692
8.666667 2.876815 0.575207 0.344451 0.775825 0.117879 1.014879
8.700000 2.902756 0.579197 0.368926 0.777496 0.121043 0.958721
8.733333 2.928751 0.583289 0.387333 0.778925 0.124191 0.899591
8.766667 2.954797 0.587484 0.407073 0.780119 0.127326 0.840044
8.800000 2.980886 0.591784 0.433555 0.781087 0.130450 0.788792
8.833333 3.006988 0.596184 0.464419 0.781844 0.133571 0.747350
8.866667 3.033091 0.600684 0.493957 0.782407 0.136696 0.714925
8.900000 3.059223 0.605292 0.521067 0.782785 0.139829 0.695055
8.933333 3.085378 0.610009 0.532922 0.782980 0.142968 0.693484
8.966667 3.111510 0.614821 0.555097 0.782995 0.146112 0.721731
9.000000 3.137613 0.619724 0.579507 0.782832 0.149255 0.787355
9.033333 3.163723 0.624741 0.587633 0.782481 0.152384 0.901253
9.066667 3.189835 0.629871 0.614579 0.781933 0.155490 1.069888
9.100000 3.215943 0.635118 0.624313 0.781182 0.158567 1.290123
9.133333 3.242041 0.640480 0.665710 0.780233 0.161613 1.541272
9.166667 3.268126 0.645961 0.688075 0.779078 0.164622 1.793437
9.200000 3.294141 0.651523 0.709682 0.777719 0.167595 2.008872
9.233333 3.320082 0.657164 0.769045 0.776167 0.170546 2.152458
9.266667 3.345946 0.662883 0.882074 0.774440 0.173490 2.197548
9.300000 3.371774 0.668725 1.034090 0.772555 0.176447 2.122802
9.333333 3.397514 0.674643 1.225904 0.770532 0.179438 1.925913
9.366667 3.423163 0.680636 1.370232 0.768399 0.182494 1.615222
9.400000 3.448762 0.686757 1.467808 0.766179 0.185637 1.215063
9.433333 3.474265 0.692954 1.520767 0.763884 0.188881 0.749941
9.466667 3.499706 0.699283 1.507727 0.761517 0.192229 0.252440
9.500000 3.525051 0.705692 1.441022 0.759083 0.195686 -0.239849
9.533333 3.550325 0.712235 1.329563 0.756577 0.199245 -0.686785
9.566667 3.575523 0.718913 1.248384 0.753984 0.202892 -1.058858
9.600000 3.600639 0.725729 1.190867 0.751294 0.206612 -1.342391
9.633333 3.625670 0.732684 1.140990 0.748495 0.210394 -1.526939
9.666667 3.650609 0.739779 1.095054 0.745580 0.214228 -1.622737
9.700000 3.675445 0.746975 1.031529 0.742535 0.218099 -1.644500
9.733333 3.700179 0.754314 0.987537 0.739351 0.222003 -1.620523
9.766667 3.724802 0.761756 0.917306 0.736024 0.225935 -1.567556
9.800000 3.749314 0.769344 0.883531 0.732549 0.229898 -1.497936
9.833333 3.773710 0.777082 0.820900 0.728923 0.233893 -1.420460
9.866667 3.797979 0.784923 0.770103 0.725145 0.237926 -1.333696
9.900000 3.822123 0.792917 0.716380 0.721214 0.242001 -1.237634
9.933333 3.846127 0.801016 0.672913 0.717132 0.246129 -1.125496
9.966667 3.869996 0.809270 0.642562 0.712901 0.250312 -1.002896
10.000000 3.893727 0.817682 0.602865 0.708521 0.254553 -0.866675
10.033333 3.917314 0.826253 0.572813 0.703995 0.258858 -0.720528
10.066667 3.940734 0.834932 0.548337 0.699322 0.263223 -0.568830
10.100000 3.964001 0.843773 0.539886 0.694504 0.267648 -0.418000
10.133333 3.987090 0.852724 0.527732 0.689536 0.272119 -0.275187
10.166667 4.010017 0.861842 0.521771 0.684417 0.276631 -0.141431
10.200000 4.032778 0.871127 0.521381 0.679144 0.281172 -0.032707
10.233333 4.055368 0.880582 0.530638 0.673713 0.285730 0.035311
10.266667 4.077783 0.890208 0.546896 0.668118 0.290289 0.044749
10.300000 4.099989 0.899947 0.545258 0.662356 0.294841 -0.013000
10.333333 4.122012 0.909862 0.572680 0.656427 0.299384 -0.146335
10.366667 4.143846 0.919953 0.592087 0.650336 0.303920 -0.354904
10.400000 4.165457 0.930157 0.609699 0.644087 0.308457 -0.622323
10.433333 4.186871 0.940542 0.616711 0.637687 0.313006 -0.915095
10.466667 4.208052 0.951043 0.618679 0.631150 0.317596 -1.192463
10.500000 4.228995 0.961664 0.595909 0.624484 0.322245 -1.416829
10.533333 4.249730 0.972472 0.516420 0.617694 0.326973 -1.547086
10.566667 4.270219 0.983407 0.379847 0.610784 0.331798 -1.550797
10.600000 4.290461 0.994477 0.215372 0.603755 0.336738 -1.408185
10.633333 4.310483 1.005739 0.078417 0.596611 0.341812 -1.119084
10.666667 4.330283 1.017194 -0.026431 0.589346 0.347024 -0.693708
10.700000 4.349856 1.028845 -0.065156 0.581954 0.352378 -0.157918
10.733333 4.369175 1.040662 -0.076231 0.574437 0.357884 0.451850
10.766667 4.388236 1.052654 -0.008375 0.566794 0.363539 1.087310
10.800000 4.407035 1.064829 0.079108 0.559026 0.369341 1.708434
10.833333 4.425568 1.077196 0.221426 0.551129 0.375291 2.277520
10.866667 4.443830 1.089763 0.356553 0.543107 0.381387 2.763455
10.900000 4.461816 1.102538 0.509789 0.534969 0.387637 3.150430
10.933333 4.479520 1.115528 0.604334 0.526722 0.394038 3.439504
10.966667 4.496972 1.128729 0.736916 0.518370 0.400591 3.643799
11.000000 4.514131 1.142161 0.861241 0.509922 0.407288 3.770278
11.033333 4.530988 1.155833 0.977689 0.501394 0.414113 3.830238
11.066667 4.547586 1.169720 1.090879 0.492789 0.421058 3.832398
11.100000 4.563922 1.183823 1.217068 0.484113 0.428104 3.782175
11.133333 4.579936 1.198190 1.370925 0.475372 0.435236 3.661917
11.166667 4.595623 1.212825 1.539042 0.466578 0.442433 3.458487
11.200000 4.611041 1.227681 1.673668 0.457733 0.449690 3.162845
11.233333 4.626125 1.242815 1.782448 0.448837 0.457000 2.764865
11.266667 4.640936 1.258172 1.923606 0.439900 0.464350 2.253788
11.300000 4.655472 1.273753 2.040508 0.430929 0.471734 1.622530
11.333333 4.669730 1.289559 2.122124 0.421923 0.479151 0.891838
11.366667 4.683653 1.305647 2.156190 0.412873 0.486610 0.090216
11.400000 4.697241 1.322018 2.143842 0.403780 0.494105 -0.742486
11.433333 4.710548 1.338616 2.090946 0.394636 0.501644 -1.548061
11.466667 4.723571 1.355441 2.001927 0.385439 0.509227 -2.251839
11.500000 4.736309 1.372496 1.922727 0.376176 0.516861 -2.783953
11.533333 4.748718 1.389831 1.797072 0.366848 0.524543 -3.093800
11.566667 4.760796 1.407445 1.593769 0.357453 0.532270 -3.150681
11.600000 4.772542 1.425339 1.355267 0.347987 0.540042 -2.946650
11.633333 4.784000 1.443463 1.073426 0.338454 0.547850 -2.501018
11.666667 4.795167 1.461817 0.871648 0.328854 0.555690 -1.863784
11.700000 4.805996 1.480453 0.768804 0.319197 0.563548 -1.087810
11.733333 4.816483 1.499372 0.756821 0.309481 0.571417 -0.233650
11.766667 4.826623 1.518576 0.860593 0.299715 0.579285 0.632059
11.800000 4.836471 1.538010 1.033864 0.289909 0.587136 1.444617
11.833333 4.845965 1.557731 1.174656 0.280079 0.594956 2.150643
11.866667 4.855165 1.577680 1.332304 0.270228 0.602734 2.722970
11.900000 4.864007 1.597917 1.470918 0.260369 0.610457 3.149895
11.933333 4.872487 1.618442 1.588768 0.250520 0.618108 3.441224
11.966667 4.880673 1.639193 1.700607 0.240682 0.625685 3.627901
12.000000 4.888567 1.660170 1.803073 0.230845 0.633190 3.755082
12.033333 4.896089 1.681423 1.904634 0.220998 0.640632 3.859294
12.066667 4.903236 1.702949 2.016003 0.211149 0.648007 3.958864
12.100000 4.910091 1.724697 2.140848 0.201295 0.655322 4.055484
12.133333 4.916656 1.746666 2.250091 0.191429 0.662594 4.134933
12.166667 4.922931 1.768854 2.380980 0.181564 0.669828 4.170329
12.200000 4.928827 1.791302 2.558833 0.171731 0.677024 4.123597
12.233333 4.934434 1.813966 2.745813 0.161952 0.684196 3.961712
12.266667 4.939666 1.836890 2.944751 0.152234 0.691364 3.662409
12.300000 4.944524 1.860073 3.128152 0.142595 0.698548 3.212367
12.333333 4.949013 1.883520 -2.995115 0.133065 0.705744 2.614259
12.366667 4.953219 1.907175 -2.868715 0.123664 0.712953 1.880202
12.400000 4.957145 1.931038 -2.801257 0.114399 0.720170 1.038500
12.433333 4.960792 1.955105 -2.763775 0.105284 0.727370 0.128646
12.466667 4.964119 1.979470 -2.786361 0.096328 0.734531 -0.801073
12.500000 4.967171 2.004034 -2.856012 0.087530 0.741623 -1.693926
12.533333 4.969920 2.028896 -2.956110 0.078872 0.748637 -2.492651
12.566667 4.972375 2.054054 -3.105860 0.070336 0.755564 -3.140604
12.600000 4.974560 2.079405 3.001056 0.061907 0.762398 -3.599264
12.633333 4.976441 2.105022 2.801509 0.053570 0.769147 -3.840936
12.666667 4.978058 2.130825 2.648759 0.045312 0.775825 -3.859183
12.700000 4.979413 2.156812 2.447931 0.037124 0.782450 -3.664395
12.733333 4.980508 2.182979 2.241674 0.029005 0.789032 -3.291515
12.766667 4.981346 2.209323 2.054780 0.020954 0.795580 -2.782551
12.800000 4.981901 2.235932 1.905129 0.012970 0.802107 -2.178430
12.833333 4.982204 2.262711 1.837713 0.005049 0.808627 -1.527550
12.866667 4.982229 2.289765 1.931255 -0.002802 0.815127 -0.881266
12.900000 4.981978 2.317095 2.007307 -0.010576 0.821581 -0.292240
12.933333 4.981483 2.344583 2.023834 -0.018266 0.827977 0.206386
12.966667 4.980715 2.372348 2.044591 -0.025862 0.834292 0.581462
13.000000 4.979678 2.400387 2.090159 -0.033352 0.840488 0.811986
13.033333 4.978406 2.428572 2.152076 -0.040722 0.846517 0.890744
13.066667 4.976902 2.456899 2.226449 -0.047963 0.852362 0.838205
13.100000 4.975170 2.485363 2.314279 -0.055071 0.858032 0.680587
13.133333 4.973188 2.514088 2.332837 -0.062039 0.863506 0.437507
13.166667 4.970962 2.543070 2.349613 -0.068860 0.868780 0.136279
13.200000 4.968518 2.572174 2.350594 -0.075533 0.873874 -0.196466
13.233333 4.965858 2.601396 2.317964 -0.082060 0.878808 -0.532668
13.266667 4.962976 2.630855 2.304406 -0.088434 0.883588 -0.860650
13.300000 4.959886 2.660421 2.250997 -0.094647 0.888200 -1.160429
13.333333 4.956591 2.690088 2.188181 -0.100696 0.892668 -1.414360
13.366667 4.953098 2.719969 2.111616 -0.106578 0.897002 -1.610272
13.400000 4.949407 2.749942 2.048150 -0.112293 0.901200 -1.741443
13.433333 4.945533 2.780109 1.970499 -0.117840 0.905252 -1.809311
13.466667 4.941469 2.810355 1.883658 -0.123224 0.909151 -1.811636
13.500000 4.937237 2.840775 1.805164 -0.128456 0.912884 -1.758270
13.533333 4.932822 2.871263 1.740711 -0.133546 0.916414 -1.655959
13.566667 4.928251 2.901902 1.683663 -0.138503 0.919716 -1.512678
13.600000 4.923528 2.932685 1.627111 -0.143335 0.922757 -1.336855
13.633333 4.918657 2.963598 1.591226 -0.148053 0.925517 -1.139292
13.666667 4.913642 2.994628 1.559408 -0.152669 0.927964 -0.932146
13.700000 4.908463 3.025694 1.512548 -0.157189 0.930086 -0.722049
13.733333 4.903121 3.056790 1.507259 -0.161623 0.931872 -0.518444
13.766667 4.897643 3.087961 1.501993 -0.165976 0.933312 -0.326748
13.800000 4.892010 3.119148 1.493886 -0.170254 0.934405 -0.151002
13.833333 4.886245 3.150382 1.497686 -0.174457 0.935155 0.009697
13.866667 4.880349 3.181645 1.519678 -0.178581 0.935573 0.155348
13.900000 4.874310 3.212906 1.521630 -0.182625 0.935668 0.287111
13.933333 4.868145 3.244169 1.545711 -0.186586 0.935443 0.412265
13.966667 4.861844 3.275415 1.549395 -0.190458 0.934900 0.537701
14.000000 4.855411 3.306637 1.572160 -0.194238 0.934039 0.665263
14.033333 4.848849 3.337827 1.592762 -0.197924 0.932866 0.798119
14.066667 4.842163 3.368980 1.616076 -0.201511 0.931380 0.937287
14.100000 4.835357 3.400089 1.634076 -0.204993 0.929581 1.076679
14.133333 4.828439 3.431112 1.680572 -0.208367 0.927481 1.205382
14.166667 4.821414 3.462037 1.701981 -0.211631 0.925105 1.310875
14.200000 4.814280 3.492896 1.754372 -0.214781 0.922473 1.382816
14.233333 4.807040 3.523684 1.822876 -0.217816 0.919598 1.408250
14.266667 4.799703 3.554338 1.905072 -0.220739 0.916511 1.375344
14.300000 4.792275 3.584845 1.978984 -0.223553 0.913244 1.282242
14.333333 4.784752 3.615261 2.052432 -0.226260 0.909821 1.132797
14.366667 4.777138 3.645578 2.106724 -0.228860 0.906246 0.932314
14.400000 4.769448 3.675719 2.148453 -0.231352 0.902530 0.691505
14.433333 4.761674 3.705748 2.159040 -0.233735 0.898677 0.430114
14.466667 4.753821 3.735660 2.162206 -0.236007 0.894676 0.170857
14.500000 4.745892 3.765448 2.150564 -0.238163 0.890506 -0.068053
14.533333 4.737891 3.795106 2.125592 -0.240199 0.886143 -0.270957
14.566667 4.729821 3.824628 2.088440 -0.242110 0.881571 -0.423382
14.600000 4.721687 3.854007 2.035035 -0.243891 0.876757 -0.512590
14.633333 4.713493 3.883237 2.005328 -0.245537 0.871676 -0.541849
14.666667 4.705240 3.912312 1.980217 -0.247042 0.866298 -0.515083
14.700000 4.696953 3.941149 1.961842 -0.248399 0.860600 -0.441515
14.733333 4.688616 3.969820 1.926715 -0.249604 0.854565 -0.331544
14.766667 4.680252 3.998241 1.929213 -0.250654 0.848189 -0.199896
14.800000 4.671845 4.026484 1.915374 -0.251554 0.841486 -0.063832
14.833333 4.663399 4.054542 1.922438 -0.252304 0.834472 0.067992
14.866667 4.654936 4.082335 1.931614 -0.252912 0.827181 0.184022
14.900000 4.646460 4.109857 1.955835 -0.253389 0.819653 0.279957
14.933333 4.637976 4.137101 1.978936 -0.253747 0.811936 0.350545
14.966667 4.629489 4.164061 1.999505 -0.253992 0.804066 0.397585
15.000000 4.621001 4.190732 2.028890 -0.254135 0.796078 0.421387
15.033333 4.612519 4.217109 2.040873 -0.254189 0.788020 0.423690
15.066667 4.604047 4.243185 2.047808 -0.254161 0.779923 0.410362
15.100000 4.595563 4.269035 2.069009 -0.254055 0.771801 0.383808
15.133333 4.587071 4.294655 2.077903 -0.253873 0.763660 0.349317
15.166667 4.578602 4.319959 2.089740 -0.253615 0.755503 0.308253
15.200000 4.570132 4.345025 2.086271 -0.253278 0.747320 0.266987
15.233333 4.561663 4.369846 2.100867 -0.252851 0.739076 0.226578
15.266667 4.553233 4.394338 2.110950 -0.252327 0.730748 0.180915
15.300000 4.544810 4.418578 2.129124 -0.251699 0.722313 0.120298
15.333333 4.536398 4.442561 2.131185 -0.250962 0.713754 0.031984
15.366667 4.528000 4.466284 2.123321 -0.250107 0.705047 -0.096624
15.400000 4.519657 4.489661 2.120869 -0.249129 0.696177 -0.278756
15.433333 4.511334 4.512771 2.121325 -0.248029 0.687141 -0.514413
15.466667 4.503076 4.535525 2.125604 -0.246801 0.677923 -0.791988
15.500000 4.494843 4.558005 2.130309 -0.245450 0.668524 -1.081810
15.533333 4.486639 4.580206 2.125904 -0.243978 0.658943 -1.349522
15.566667 4.478510 4.602042 2.108744 -0.242397 0.649188 -1.557094
15.600000 4.470415 4.623593 2.039366 -0.240716 0.639260 -1.660622
15.633333 4.462400 4.644773 1.909280 -0.238949 0.629167 -1.630928
15.666667 4.454463 4.665579 1.762200 -0.237115 0.618928 -1.444877
15.700000 4.446569 4.686091 1.591318 -0.235229 0.608556 -1.100704
15.733333 4.438754 4.706231 1.455550 -0.233306 0.598076 -0.606199
15.766667 4.431016 4.725996 1.412340 -0.231360 0.587518 0.016423
15.800000 4.423354 4.745387 1.406351 -0.229407 0.576929 0.722465
15.833333 4.415744 4.764477 1.491335 -0.227456 0.566340 1.455314
15.866667 4.408200 4.783189 1.605571 -0.225512 0.555769 2.152135
15.900000 4.400722 4.801523 1.725835 -0.223583 0.545228 2.757173
15.933333 4.393304 4.819475 1.917623 -0.221671 0.534718 3.217929
15.966667 4.385944 4.837043 2.082096 -0.219776 0.524222 3.504365
16.000000 4.378647 4.854301 2.271568 -0.217897 0.513697 3.600622
16.033333 4.371413 4.871248 2.430679 -0.216032 0.503115 3.525811
16.066667 4.364245 4.887883 2.587849 -0.214178 0.492453 3.307498
16.100000 4.357145 4.904204 2.715921 -0.212327 0.481679 2.980981
16.133333 4.350115 4.920212 2.829243 -0.210476 0.470748 2.593208
16.166667 4.343135 4.935805 2.867623 -0.208619 0.459636 2.184471
16.200000 4.336206 4.950977 2.911232 -0.206746 0.448354 1.799977
16.233333 4.329327 4.965726 2.942123 -0.204845 0.436915 1.463774
16.266667 4.322525 4.980159 2.971176 -0.202904 0.425343 1.196215
16.300000 4.315779 4.994157 2.980339 -0.200910 0.413688 1.007524
16.333333 4.309090 5.007716 2.956927 -0.198841 0.402034 0.898780
16.366667 4.302484 5.020959 2.957636 -0.196682 0.390443 0.859217
16.400000 4.295942 5.033761 2.967773 -0.194420 0.378953 0.873200
16.433333 4.289468 5.046121 3.010698 -0.192041 0.367590 0.922835
16.466667 4.283066 5.058041 3.068968 -0.189533 0.356395 0.989309
16.500000 4.276754 5.069650 3.108966 -0.186892 0.345378 1.058948
16.533333 4.270532 5.080947 -3.133218 -0.184118 0.334527 1.118768
16.566667 4.264404 5.091935 -3.083944 -0.181210 0.323840 1.165333
16.600000 4.258387 5.102523 -3.034093 -0.178168 0.313315 1.194732
16.633333 4.252466 5.112804 -2.983156 -0.175001 0.302954 1.210737
16.666667 4.246666 5.122697 -2.941007 -0.171717 0.292730 1.217590
16.700000 4.240964 5.132288 -2.910932 -0.168314 0.282629 1.214505
16.733333 4.235394 5.141504 -2.880756 -0.164793 0.272648 1.197343
16.766667 4.229960 5.150352 -2.857366 -0.161158 0.262793 1.164095
16.800000 4.224629 5.158904 -2.836259 -0.157408 0.253066 1.115315
16.833333 4.219402 5.167162 -2.791629 -0.153532 0.243469 1.046856
16.866667 4.214330 5.175076 -2.720260 -0.149523 0.234015 0.957205
16.900000 4.209364 5.182701 -2.655126 -0.145376 0.224718 0.847978
16.933333 4.204561 5.189999 -2.609502 -0.141095 0.215582 0.728014
16.966667 4.199867 5.197013 -2.570759 -0.136669 0.206601 0.599204
17.000000 4.195344 5.203718 -2.572834 -0.132103 0.197777 0.460471
17.033333 4.190998 5.210122 -2.584687 -0.127414 0.189116 0.311443
17.066667 4.186830 5.216234 -2.609022 -0.122616 0.180621 0.148514
17.100000 4.182773 5.222073 -2.607388 -0.117729 0.172297 -0.049866
17.133333 4.178902 5.227635 -2.608099 -0.112762 0.164144 -0.315740
17.166667 4.175219 5.232928 -2.618119 -0.107752 0.156167 -0.677447
17.200000 4.171729 5.237961 -2.616167 -0.102723 0.148367 -1.158852
17.233333 4.168435 5.242741 -2.620142 -0.097701 0.140735 -1.769210
17.266667 4.165250 5.247264 -2.607839 -0.092710 0.133260 -2.509984
17.300000 4.162266 5.251550 -2.605770 -0.087793 0.125927 -3.338670
17.333333 4.159391 5.255585 -2.660186 -0.082975 0.118724 -4.202989
17.366667 4.156717 5.259395 -2.773597 -0.078268 0.111641 -5.044065
17.400000 4.154243 5.262985 -2.935823 -0.073679 0.104669 -5.805210
17.433333 4.151965 5.266358 2.994105 -0.069220 0.097799 -6.434907
17.466667 4.149794 5.269495 2.596752 -0.064900 0.091026 -6.882614
17.500000 4.147729 5.272400 2.195064 -0.060700 0.084352 -7.130737
17.533333 4.145770 5.275076 1.827784 -0.056619 0.077777 -7.164764
17.566667 4.143980 5.277533 1.564279 -0.052659 0.071302 -6.993524
17.600000 4.142293 5.279768 1.352658 -0.048807 0.064937 -6.632454
17.633333 4.140707 5.281786 1.224101 -0.045041 0.058694 -6.128788
17.666667 4.139283 5.283608 1.037077 -0.041339 0.052585 -5.536579
17.700000 4.138018 5.285242 0.883511 -0.037700 0.046617 -4.907135
17.733333 4.136850 5.286669 0.715407 -0.034117 0.040797 -4.288750
17.766667 4.135780 5.287894 0.562873 -0.030586 0.035126 -3.707656
17.800000 4.134804 5.288918 0.462050 -0.027111 0.029602 -3.184242
17.833333 4.133973 5.289779 0.365152 -0.023710 0.024218 -2.709294
17.866667 4.133235 5.290448 0.303406 -0.020397 0.018964 -2.280310
17.900000 4.132630 5.290965 0.245341 -0.017173 0.013836 -1.888444
17.933333 4.132155 5.291333 0.205940 -0.014044 0.008830 -1.531537
17.966667 4.131767 5.291522 0.171558 -0.011016 0.003947 -1.212322
18.000000 4.131496 5.291573 0.152863 -0.008098 -0.000823 -0.932766
18.033333 4.131308 5.291451 0.123829 -0.005292 -0.005479 -0.698774
18.066667 4.131202 5.291160 0.119869 -0.002600 -0.010019 -0.508431
18.100000 4.131175 5.290704 0.103584 -0.000025 -0.014441 -0.359269
18.133333 4.131242 5.290129 0.108397 0.002435 -0.018747 -0.246376
