t x y theta dxdt dydt dthetadt
0.000000 0.000000 0.000000 -0.046438 -0.000982 0.010464 0.003828
0.033333 0.000000 0.000185 -0.048924 -0.002836 0.014187 0.010455
0.066667 0.000305 0.000563 -0.043859 -0.005495 0.019418 0.020332
0.100000 0.000377 0.000953 -0.051316 -0.009114 0.026400 0.034559
0.133333 0.000209 0.001355 -0.045516 -0.013700 0.035555 0.053000
0.166667 -0.000206 0.001766 -0.045554 -0.019243 0.047280 0.072353
0.200000 -0.000703 0.002791 -0.049842 -0.025569 0.061569 0.092916
0.233333 -0.001221 0.004628 -0.047494 -0.032319 0.078357 0.111754
0.266667 -0.002012 0.006469 -0.046003 -0.039030 0.097655 0.128216
0.300000 -0.003085 0.008311 -0.033942 -0.045189 0.120119 0.139086
0.333333 -0.004991 0.012325 -0.026144 -0.050506 0.145841 0.148354
0.366667 -0.007642 0.018525 -0.015305 -0.054664 0.174726 0.160356
0.400000 -0.010601 0.024709 -0.004805 -0.057440 0.207288 0.176186
0.433333 -0.013873 0.030868 0.015550 -0.058992 0.243946 0.197747
0.466667 -0.015890 0.039341 0.007345 -0.059636 0.285126 0.224773
0.500000 -0.018237 0.047772 -0.002289 -0.059719 0.330152 0.260874
0.533333 -0.020924 0.056151 -0.003180 -0.059395 0.378853 0.298000
0.566667 -0.021720 0.068882 -0.002384 -0.059084 0.431049 0.330569
0.600000 -0.022877 0.081537 0.008406 -0.058907 0.485552 0.352788
0.633333 -0.023837 0.101151 0.025385 -0.058636 0.539841 0.359486
0.666667 -0.025184 0.120652 0.062418 -0.057808 0.591348 0.345022
0.700000 -0.026928 0.140017 0.090610 -0.055986 0.637345 0.304288
0.733333 -0.029475 0.163225 0.114155 -0.052946 0.674698 0.242547
0.766667 -0.032526 0.190190 0.140934 -0.048261 0.700031 0.162222
0.800000 -0.035830 0.219590 0.142685 -0.042373 0.710321 0.068692
0.833333 -0.038745 0.249695 0.158393 -0.036549 0.704464 -0.035381
0.866667 -0.040343 0.278910 0.133391 -0.032321 0.681447 -0.141771
0.900000 -0.042409 0.307809 0.111489 -0.031632 0.641331 -0.245647
0.933333 -0.042014 0.332883 0.075460 -0.036823 0.584894 -0.343345
0.966667 -0.039515 0.352986 0.044795 -0.050360 0.514352 -0.427212
1.000000 -0.037524 0.372690 0.024753 -0.073855 0.432546 -0.490003
1.033333 -0.035248 0.384905 0.037407 -0.107848 0.342678 -0.521411
1.066667 -0.033511 0.396680 0.046645 -0.152571 0.247858 -0.518638
1.100000 -0.034881 0.402318 0.039750 -0.207263 0.151196 -0.480016
1.133333 -0.040791 0.403256 -0.000612 -0.269831 0.055650 -0.407199
1.166667 -0.052218 0.400275 -0.054691 -0.337369 -0.037010 -0.303256
1.200000 -0.064222 0.396817 -0.105093 -0.407138 -0.125098 -0.173274
1.233333 -0.081027 0.390469 -0.125419 -0.476524 -0.208440 -0.024292
1.266667 -0.101212 0.381188 -0.121998 -0.542828 -0.286609 0.134967
1.300000 -0.123694 0.369058 -0.105469 -0.603996 -0.359547 0.297167
1.333333 -0.147812 0.353504 -0.075998 -0.659215 -0.427620 0.450640
1.366667 -0.172483 0.337492 -0.031567 -0.708811 -0.490957 0.579424
1.400000 -0.197701 0.321035 0.017513 -0.753388 -0.549895 0.670745
1.433333 -0.223416 0.300633 0.049334 -0.794281 -0.603906 0.715900
1.466667 -0.249658 0.279814 0.082304 -0.833298 -0.652878 0.714614
1.500000 -0.277877 0.254917 0.119491 -0.872195 -0.696610 0.668424
1.533333 -0.306598 0.229638 0.149161 -0.912205 -0.734961 0.586767
1.566667 -0.337427 0.202021 0.177719 -0.953755 -0.767685 0.484077
1.600000 -0.368734 0.174066 0.181557 -0.997046 -0.794540 0.374181
1.633333 -0.400503 0.145795 0.185888 -1.041611 -0.815964 0.268735
1.666667 -0.434972 0.116690 0.182570 -1.086768 -0.832134 0.174710
1.700000 -0.472139 0.087551 0.170788 -1.131745 -0.843670 0.100647
1.733333 -0.511937 0.058640 0.177221 -1.175682 -0.851031 0.048363
1.766667 -0.554779 0.030269 0.170598 -1.217963 -0.854978 0.018768
1.800000 -0.597987 0.001696 0.161247 -1.257810 -0.856277 0.009274
1.833333 -0.641537 -0.027055 0.153767 -1.294555 -0.855177 0.015356
1.866667 -0.685403 -0.055959 0.157794 -1.327567 -0.851972 0.032989
1.900000 -0.729560 -0.084994 0.155833 -1.356474 -0.846611 0.053749
1.933333 -0.775719 -0.113110 0.160263 -1.381059 -0.838915 0.073638
1.966667 -0.822116 -0.141310 0.178669 -1.401409 -0.828570 0.087580
2.000000 -0.871213 -0.169388 0.173951 -1.417583 -0.815293 0.093616
2.033333 -0.920490 -0.197507 0.187532 -1.429799 -0.798950 0.089069
2.066667 -0.969915 -0.225645 0.197264 -1.438038 -0.779395 0.075314
2.100000 -1.019497 -0.252856 0.196749 -1.441952 -0.756453 0.055039
2.133333 -1.068530 -0.278479 0.200156 -1.441509 -0.730222 0.030509
2.166667 -1.116168 -0.302120 0.204980 -1.436579 -0.700860 0.004211
2.200000 -1.164758 -0.324731 0.200219 -1.427434 -0.668727 -0.023138
2.233333 -1.213351 -0.347262 0.192575 -1.414366 -0.634344 -0.045720
2.266667 -1.261002 -0.368070 0.181263 -1.397955 -0.598483 -0.063102
2.300000 -1.308598 -0.388765 0.181481 -1.379064 -0.562015 -0.074445
2.333333 -1.355198 -0.407364 0.178206 -1.358228 -0.525645 -0.079473
2.366667 -1.400653 -0.423754 0.170163 -1.335748 -0.490068 -0.076339
2.400000 -1.444648 -0.438559 0.180251 -1.311873 -0.455837 -0.064804
2.433333 -1.486837 -0.451688 0.175247 -1.286821 -0.423465 -0.048610
2.466667 -1.528843 -0.464649 0.171048 -1.260726 -0.393163 -0.029541
2.500000 -1.570558 -0.476330 0.163244 -1.233591 -0.365185 -0.007975
2.533333 -1.611607 -0.487258 0.157207 -1.205512 -0.339677 0.015617
2.566667 -1.651973 -0.497692 0.163834 -1.176755 -0.316616 0.036509
2.600000 -1.690992 -0.507385 0.167202 -1.147486 -0.295842 0.055064
2.633333 -1.729722 -0.516885 0.174200 -1.117789 -0.276949 0.071177
2.666667 -1.767211 -0.525909 0.174784 -1.087728 -0.259598 0.084822
2.700000 -1.803217 -0.534243 0.181817 -1.057450 -0.243306 0.092662
2.733333 -1.837624 -0.541787 0.190786 -1.026996 -0.227641 0.093521
2.766667 -1.869789 -0.548604 0.191040 -0.996480 -0.212295 0.090322
2.800000 -1.901581 -0.555216 0.194438 -0.965911 -0.197087 0.082705
2.833333 -1.932984 -0.561623 0.200144 -0.935450 -0.182025 0.071156
2.866667 -1.963987 -0.567824 0.203786 -0.905210 -0.167227 0.056512
2.900000 -1.994575 -0.573819 0.196478 -0.875117 -0.152820 0.043956
2.933333 -2.023954 -0.578758 0.203248 -0.845190 -0.139082 0.033805
2.966667 -2.051870 -0.582856 0.205205 -0.815225 -0.126332 0.026285
3.000000 -2.078333 -0.586235 0.206020 -0.785106 -0.114939 0.019637
3.033333 -2.104340 -0.589412 0.193232 -0.754630 -0.105219 0.016546
3.066667 -2.128251 -0.591901 0.203598 -0.723844 -0.097363 0.016033
3.100000 -2.151690 -0.594193 0.195986 -0.692891 -0.091606 0.015307
3.133333 -2.173898 -0.596392 0.202962 -0.661963 -0.087936 0.013814
3.166667 -2.195622 -0.598401 0.199193 -0.631139 -0.086207 0.010993
3.200000 -2.216139 -0.601072 0.205724 -0.600499 -0.086018 0.009778
3.233333 -2.236163 -0.603560 0.207462 -0.570032 -0.086961 0.005842
3.266667 -2.254813 -0.606455 0.211146 -0.539385 -0.088543 0.000951
3.300000 -2.272618 -0.609758 0.214036 -0.508159 -0.090184 -0.005054
3.333333 -2.288153 -0.613499 0.197485 -0.475906 -0.091345 -0.008266
3.366667 -2.303186 -0.617064 0.203002 -0.442547 -0.091535 -0.010012
3.400000 -2.317717 -0.620456 0.207190 -0.408111 -0.090484 -0.012861
3.433333 -2.331746 -0.623675 0.203961 -0.372843 -0.087918 -0.013737
3.466667 -2.345275 -0.626724 0.196759 -0.337208 -0.083720 -0.013428
3.500000 -2.356466 -0.629914 0.195966 -0.301911 -0.077917 -0.010891
3.533333 -2.365674 -0.632898 0.199403 -0.267660 -0.070742 -0.010904
3.566667 -2.373303 -0.635673 0.195297 -0.235069 -0.062484 -0.011477
3.600000 -2.379421 -0.637980 0.204932 -0.204677 -0.053432 -0.011812
3.633333 -2.384191 -0.639695 0.205637 -0.176896 -0.043966 -0.013520
3.666667 -2.387741 -0.640701 0.210693 -0.152099 -0.034534 -0.017864
3.700000 -2.390834 -0.641550 0.205317 -0.130334 -0.025553 -0.024886
3.733333 -2.394051 -0.641942 0.189840 -0.111461 -0.017332 -0.031879
3.766667 -2.397200 -0.642068 0.193540 -0.095229 -0.010157 -0.039598
3.800000 -2.400616 -0.641630 0.194952 -0.081235 -0.004282 -0.045754
3.833333 -2.403616 -0.641051 0.197941 -0.069087 0.000166 -0.050038
3.866667 -2.406028 -0.640513 0.201419 -0.058323 0.003249 -0.051380
3.900000 -2.407673 -0.640123 0.196430 -0.048615 0.005082 -0.050708
3.933333 -2.408931 -0.639606 0.179406 -0.039836 0.005815 -0.047324
3.966667 -2.409298 -0.639393 0.180494 -0.031941 0.005668 -0.042425
4.000000 -2.409636 -0.639396 0.181664 -0.025078 0.004931 -0.036644
4.033333 -2.409930 -0.639303 0.185520 -0.019316 0.003886 -0.030531
4.066667 -2.409879 -0.639099 0.181014 -0.014697 0.002725 -0.022843
