t x y theta dxdt dydt dthetadt
0.000000 0.000000 0.000000 0.766596 0.042812 -0.146347 -0.002786
0.033333 0.001445 -0.004921 0.764900 0.044013 -0.149064 0.000749
0.066667 0.002931 -0.009941 0.774361 0.045225 -0.151800 0.005055
0.100000 0.004456 -0.015042 0.776043 0.046448 -0.154552 0.013120
0.133333 0.006020 -0.020225 0.766881 0.047682 -0.157318 0.034885
0.166667 0.007627 -0.025509 0.764574 0.048925 -0.160094 0.078581
0.200000 0.009278 -0.030895 0.770728 0.050176 -0.162876 0.158317
0.233333 0.010972 -0.036382 0.776262 0.051434 -0.165657 0.285031
0.266667 0.012706 -0.041952 0.767842 0.052698 -0.168435 0.475724
0.300000 0.014480 -0.047604 0.763647 0.053968 -0.171208 0.739171
0.333333 0.016300 -0.053360 0.769929 0.055242 -0.173973 1.077149
0.366667 0.018165 -0.059222 0.777582 0.056520 -0.176725 1.482538
0.400000 0.020071 -0.065165 0.790290 0.057801 -0.179460 1.948209
0.433333 0.022017 -0.071191 0.846571 0.059082 -0.182177 2.460642
0.466667 0.024004 -0.077299 0.914393 0.060364 -0.184872 2.998968
0.500000 0.026038 -0.083515 1.045161 0.061644 -0.187539 3.539215
0.533333 0.028113 -0.089811 1.201923 0.062921 -0.190180 4.058532
0.566667 0.030236 -0.096215 1.372586 0.064195 -0.192799 4.540663
0.600000 0.032401 -0.102700 1.567230 0.065466 -0.195397 4.957781
0.633333 0.034606 -0.109266 1.769428 0.066732 -0.197976 5.291825
0.666667 0.036853 -0.115913 1.965039 0.067993 -0.200539 5.525754
0.700000 0.039141 -0.122640 2.145030 0.069250 -0.203089 5.655555
0.733333 0.041471 -0.129447 2.372724 0.070503 -0.205627 5.676207
0.766667 0.043842 -0.136334 2.587685 0.071752 -0.208156 5.583798
0.800000 0.046254 -0.143300 2.807951 0.072999 -0.210681 5.386623
0.833333 0.048708 -0.150367 3.009241 0.074244 -0.213202 5.091010
0.866667 0.051204 -0.157532 -3.089707 0.075488 -0.215722 4.709478
0.900000 0.053741 -0.164775 -2.902514 0.076733 -0.218238 4.249033
0.933333 0.056320 -0.172096 -2.762447 0.077979 -0.220749 3.728453
0.966667 0.058940 -0.179493 -2.624741 0.079228 -0.223252 3.164849
1.000000 0.061601 -0.186968 -2.531808 0.080482 -0.225743 2.579555
1.033333 0.064304 -0.194534 -2.465302 0.081744 -0.228220 1.993913
1.066667 0.067048 -0.202193 -2.432251 0.083017 -0.230684 1.428328
1.100000 0.069833 -0.209927 -2.403509 0.084303 -0.233136 0.904810
1.133333 0.072661 -0.217750 -2.407839 0.085607 -0.235576 0.438199
1.166667 0.075531 -0.225646 -2.418289 0.086932 -0.238001 0.043994
1.200000 0.078441 -0.233615 -2.441615 0.088280 -0.240412 -0.272179
1.233333 0.081398 -0.241669 -2.467841 0.089654 -0.242807 -0.506460
1.266667 0.084401 -0.249806 -2.519203 0.091055 -0.245183 -0.659887
1.300000 0.087454 -0.258025 -2.565126 0.092482 -0.247537 -0.736814
1.333333 0.090556 -0.266324 -2.610814 0.093933 -0.249868 -0.747498
1.366667 0.093710 -0.274702 -2.647182 0.095403 -0.252173 -0.703429
1.400000 0.096904 -0.283149 -2.681713 0.096888 -0.254450 -0.614274
1.433333 0.100152 -0.291673 -2.702223 0.098383 -0.256697 -0.495794
1.466667 0.103456 -0.300274 -2.716667 0.099880 -0.258910 -0.361212
1.500000 0.106815 -0.308952 -2.722185 0.101375 -0.261088 -0.225793
1.533333 0.110232 -0.317705 -2.730632 0.102865 -0.263232 -0.098583
1.566667 0.113688 -0.326522 -2.704558 0.104344 -0.265341 0.009145
1.600000 0.117202 -0.335414 -2.695973 0.105810 -0.267413 0.088021
1.633333 0.120755 -0.344367 -2.679233 0.107258 -0.269450 0.138875
1.666667 0.124345 -0.353381 -2.676794 0.108695 -0.271457 0.162332
1.700000 0.127995 -0.362469 -2.657546 0.110123 -0.273436 0.165192
1.733333 0.131703 -0.371632 -2.639714 0.111544 -0.275391 0.150267
1.766667 0.135449 -0.380852 -2.641867 0.112966 -0.277325 0.126621
1.800000 0.139231 -0.390127 -2.627539 0.114395 -0.279246 0.102865
1.833333 0.143072 -0.399475 -2.641624 0.115832 -0.281151 0.081970
1.866667 0.146949 -0.408877 -2.652285 0.117270 -0.283036 0.065145
1.900000 0.150861 -0.418331 -2.655172 0.118704 -0.284897 0.049558
1.933333 0.154832 -0.427855 -2.669169 0.120128 -0.286726 0.037083
1.966667 0.158862 -0.437450 -2.658076 0.121530 -0.288515 0.023573
2.000000 0.162950 -0.447113 -2.650536 0.122896 -0.290251 0.005123
2.033333 0.167097 -0.456845 -2.629475 0.124219 -0.291928 -0.023008
2.066667 0.171276 -0.466623 -2.630465 0.125493 -0.293541 -0.059382
2.100000 0.175512 -0.476466 -2.637378 0.126711 -0.295083 -0.098540
2.133333 0.179779 -0.486353 -2.617260 0.127872 -0.296555 -0.139392
2.166667 0.184076 -0.496281 -2.625324 0.128982 -0.297960 -0.173318
2.200000 0.188402 -0.506249 -2.640059 0.130050 -0.299307 -0.195150
2.233333 0.192758 -0.516256 -2.664738 0.131085 -0.300604 -0.191038
2.266667 0.197142 -0.526300 -2.691677 0.132096 -0.301857 -0.157768
2.300000 0.201553 -0.536380 -2.710895 0.133093 -0.303076 -0.098822
2.333333 0.205991 -0.546494 -2.716067 0.134083 -0.304265 -0.017640
2.366667 0.210476 -0.556661 -2.734202 0.135063 -0.305423 0.071619
2.400000 0.214987 -0.566859 -2.731188 0.136032 -0.306549 0.159297
2.433333 0.219541 -0.577105 -2.717981 0.136987 -0.307639 0.219551
2.466667 0.224138 -0.587396 -2.691863 0.137921 -0.308691 0.237246
2.500000 0.228776 -0.597731 -2.652334 0.138826 -0.309696 0.203112
2.533333 0.233436 -0.608091 -2.636276 0.139696 -0.310649 0.116046
2.566667 0.238117 -0.618474 -2.579166 0.140526 -0.311547 -0.016337
2.600000 0.242819 -0.628880 -2.555455 0.141312 -0.312386 -0.185382
2.633333 0.247551 -0.639319 -2.554416 0.142052 -0.313161 -0.362922
2.666667 0.252303 -0.649777 -2.575930 0.142745 -0.313872 -0.522202
2.700000 0.257079 -0.660262 -2.638492 0.143393 -0.314519 -0.636358
2.733333 0.261879 -0.670772 -2.677043 0.143997 -0.315101 -0.688082
2.766667 0.266701 -0.681303 -2.771217 0.144556 -0.315617 -0.660678
2.800000 0.271542 -0.691854 -2.829395 0.145069 -0.316064 -0.545976
2.833333 0.276398 -0.702415 -2.880720 0.145534 -0.316442 -0.350017
2.866667 0.281268 -0.712986 -2.916591 0.145951 -0.316748 -0.093314
2.900000 0.286152 -0.723566 -2.904528 0.146316 -0.316981 0.194272
2.933333 0.291047 -0.734152 -2.890902 0.146629 -0.317142 0.484676
2.966667 0.295952 -0.744741 -2.848405 0.146887 -0.317232 0.739711
3.000000 0.300868 -0.755334 -2.768081 0.147093 -0.317254 0.925553
3.033333 0.305786 -0.765923 -2.710267 0.147248 -0.317212 1.010832
3.066667 0.310704 -0.776506 -2.628623 0.147352 -0.317109 0.979143
3.100000 0.315631 -0.787088 -2.568118 0.147408 -0.316947 0.827051
3.133333 0.320550 -0.797659 -2.506852 0.147417 -0.316728 0.554066
3.166667 0.325476 -0.808225 -2.440382 0.147380 -0.316453 0.171236
3.200000 0.330407 -0.818785 -2.434429 0.147298 -0.316122 -0.299977
3.233333 0.335320 -0.829327 -2.449095 0.147168 -0.315732 -0.833317
3.266667 0.340237 -0.839860 -2.479935 0.146986 -0.315281 -1.406405
3.300000 0.345129 -0.850368 -2.541268 0.146753 -0.314768 -1.996429
3.333333 0.350024 -0.860864 -2.617861 0.146468 -0.314189 -2.588047
3.366667 0.354920 -0.871346 -2.742362 0.146128 -0.313541 -3.166612
3.400000 0.359818 -0.881814 -2.875761 0.145728 -0.312814 -3.726161
3.433333 0.364678 -0.892243 -3.030323 0.145267 -0.312004 -4.254499
3.466667 0.369538 -0.902654 3.099140 0.144745 -0.311105 -4.741887
3.500000 0.374354 -0.913022 2.935835 0.144154 -0.310106 -5.192042
3.533333 0.379168 -0.923368 2.766056 0.143492 -0.308999 -5.589055
3.566667 0.383934 -0.933662 2.584041 0.142764 -0.307780 -5.920613
3.600000 0.388699 -0.943932 2.349828 0.141980 -0.306451 -6.169178
3.633333 0.393460 -0.954179 2.158857 0.141148 -0.305019 -6.335413
3.666667 0.398174 -0.964360 1.880823 0.140282 -0.303491 -6.398651
3.700000 0.402841 -0.974474 1.576401 0.139396 -0.301882 -6.322856
3.733333 0.407462 -0.984516 1.319991 0.138511 -0.300212 -6.094808
3.766667 0.412039 -0.994485 1.159386 0.137644 -0.298503 -5.710714
3.800000 0.416611 -1.004425 0.930846 0.136808 -0.296773 -5.176663
3.833333 0.421144 -1.014287 0.678702 0.136016 -0.295038 -4.490574
3.866667 0.425639 -1.024070 0.511967 0.135278 -0.293313 -3.690924
3.900000 0.430097 -1.033774 0.347614 0.134604 -0.291614 -2.831351
3.933333 0.434550 -1.043445 0.253579 0.133992 -0.289946 -1.960611
3.966667 0.438999 -1.053082 0.209912 0.133441 -0.288312 -1.113633
4.000000 0.443442 -1.062684 0.233623 0.132947 -0.286711 -0.329851
4.033333 0.447858 -1.072210 0.313591 0.132504 -0.285146 0.348326
4.066667 0.452269 -1.081700 0.423347 0.132104 -0.283610 0.909371
4.100000 0.456655 -1.091114 0.523513 0.131739 -0.282094 1.353122
4.133333 0.461036 -1.100492 0.625257 0.131401 -0.280591 1.687838
4.166667 0.465396 -1.109797 0.698755 0.131086 -0.279095 1.927641
4.200000 0.469751 -1.119064 0.748583 0.130790 -0.277604 2.098219
4.233333 0.474102 -1.128292 0.798210 0.130509 -0.276109 2.230212
4.266667 0.478449 -1.137481 0.848383 0.130241 -0.274606 2.343356
4.300000 0.482791 -1.146631 0.889443 0.129982 -0.273092 2.446911
4.333333 0.487118 -1.155711 0.960345 0.129729 -0.271561 2.545770
4.366667 0.491441 -1.164750 1.035379 0.129479 -0.270005 2.628404
4.400000 0.495749 -1.173720 1.138202 0.129227 -0.268418 2.678236
4.433333 0.500054 -1.182650 1.279989 0.128970 -0.266797 2.678511
4.466667 0.504355 -1.191538 1.403085 0.128707 -0.265140 2.617118
4.500000 0.508643 -1.200356 1.554730 0.128438 -0.263448 2.488622
4.533333 0.512917 -1.209104 1.676925 0.128162 -0.261724 2.291336
4.566667 0.517188 -1.217810 1.758706 0.127883 -0.259975 2.035460
4.600000 0.521444 -1.226445 1.815282 0.127603 -0.258203 1.739614
4.633333 0.525699 -1.235039 1.836745 0.127325 -0.256420 1.426042
4.666667 0.529939 -1.243564 1.864830 0.127053 -0.254633 1.114721
4.700000 0.534167 -1.252020 1.873111 0.126792 -0.252851 0.828207
4.733333 0.538382 -1.260409 1.874532 0.126547 -0.251085 0.583456
4.766667 0.542586 -1.268731 1.884519 0.126322 -0.249347 0.388961
4.800000 0.546790 -1.277011 1.882001 0.126122 -0.247643 0.244562
4.833333 0.550984 -1.285228 1.887631 0.125950 -0.245980 0.144281
4.866667 0.555169 -1.293381 1.882583 0.125807 -0.244361 0.082030
4.900000 0.559348 -1.301473 1.875117 0.125695 -0.242790 0.045587
4.933333 0.563527 -1.309525 1.879961 0.125614 -0.241264 0.025521
4.966667 0.567708 -1.317536 1.872587 0.125560 -0.239778 0.016832
5.000000 0.571890 -1.325506 1.882785 0.125534 -0.238328 0.014023
5.033333 0.576069 -1.333421 1.889286 0.125533 -0.236909 0.013946
5.066667 0.580251 -1.341296 1.882533 0.125555 -0.235517 0.013018
5.100000 0.584432 -1.349117 1.882667 0.125598 -0.234144 0.012028
5.133333 0.588616 -1.356899 1.876186 0.125661 -0.232790 0.010995
5.166667 0.592801 -1.364631 1.884204 0.125744 -0.231455 0.006785
5.200000 0.596990 -1.372324 1.895936 0.125847 -0.230140 0.002147
5.233333 0.601182 -1.379969 1.884263 0.125969 -0.228847 -0.001274
5.266667 0.605377 -1.387567 1.886819 0.126112 -0.227580 -0.003656
5.300000 0.609578 -1.395120 1.889004 0.126276 -0.226342 -0.006035
5.333333 0.613785 -1.402637 1.877037 0.126463 -0.225137 -0.008992
5.366667 0.617998 -1.410111 1.879380 0.126672 -0.223965 -0.009412
5.400000 0.622219 -1.417550 1.881064 0.126903 -0.222827 -0.008192
5.433333 0.626449 -1.424949 1.884034 0.127158 -0.221724 -0.007845
5.466667 0.630688 -1.432314 1.881391 0.127437 -0.220655 -0.006876
5.500000 0.634934 -1.439645 1.880767 0.127737 -0.219618 -0.004375
5.533333 0.639190 -1.446943 1.885121 0.128059 -0.218611 -0.000505
5.566667 0.643459 -1.454208 1.882483 0.128400 -0.217633 0.001339
5.600000 0.647739 -1.461440 1.882993 0.128760 -0.216680 0.001303
5.633333 0.652033 -1.468641 1.882633 0.129135 -0.215750 0.002293
5.666667 0.656344 -1.475813 1.873643 0.129523 -0.214840 0.003826
5.700000 0.660666 -1.482955 1.886536 0.129922 -0.213950 0.003854
5.733333 0.665000 -1.490067 1.884874 0.130332 -0.213080 0.002704
5.766667 0.669353 -1.497154 1.879884 0.130753 -0.212229 0.004347
5.800000 0.673719 -1.504212 1.882687 0.131183 -0.211397 0.006959
5.833333 0.678098 -1.511241 1.885038 0.131625 -0.210587 0.008389
5.866667 0.682490 -1.518243 1.889555 0.132082 -0.209800 0.006349
5.900000 0.686896 -1.525218 1.875916 0.132555 -0.209037 0.006468
5.933333 0.691317 -1.532165 1.878877 0.133046 -0.208300 0.007783
5.966667 0.695751 -1.539087 1.888417 0.133559 -0.207593 0.006383
6.000000 0.700201 -1.545983 1.886574 0.134096 -0.206916 0.004795
6.033333 0.704678 -1.552865 1.883390 0.134658 -0.206272 0.003124
6.066667 0.709170 -1.559723 1.883011 0.135248 -0.205664 0.005301
6.100000 0.713679 -1.566557 1.893104 0.135870 -0.205096 0.003735
6.133333 0.718218 -1.573382 1.882272 0.136527 -0.204572 0.001041
6.166667 0.722773 -1.580183 1.886568 0.137218 -0.204091 -0.001477
6.200000 0.727345 -1.586962 1.872484 0.137946 -0.203659 -0.003606
6.233333 0.731950 -1.593736 1.891269 0.138712 -0.203276 -0.005685
6.266667 0.736572 -1.600488 1.885064 0.139513 -0.202939 -0.009071
6.300000 0.741229 -1.607238 1.888846 0.140345 -0.202644 -0.009570
6.333333 0.745904 -1.613966 1.887593 0.141203 -0.202384 -0.008473
6.366667 0.750616 -1.620695 1.879692 0.142082 -0.202157 0.001722
6.400000 0.755364 -1.627426 1.882099 0.142978 -0.201955 0.025859
6.433333 0.760150 -1.634159 1.882035 0.143887 -0.201775 0.077997
6.466667 0.764975 -1.640895 1.882981 0.144806 -0.201614 0.168067
6.500000 0.769818 -1.647613 1.876322 0.145735 -0.201471 0.313130
6.533333 0.774701 -1.654336 1.879597 0.146674 -0.201349 0.530435
6.566667 0.779603 -1.661041 1.882948 0.147622 -0.201246 0.824536
6.600000 0.784524 -1.667727 1.884626 0.148580 -0.201164 1.198938
6.633333 0.789488 -1.674423 1.885996 0.149545 -0.201099 1.644558
6.666667 0.794470 -1.681101 1.901975 0.150520 -0.201056 2.153654
6.700000 0.799495 -1.687790 1.967946 0.151502 -0.201035 2.698158
6.733333 0.804564 -1.694490 2.062619 0.152490 -0.201035 3.244453
6.766667 0.809677 -1.701204 2.205088 0.153481 -0.201057 3.757481
6.800000 0.814808 -1.707900 2.338212 0.154473 -0.201104 4.202032
6.833333 0.819982 -1.714609 2.541595 0.155465 -0.201177 4.542928
6.866667 0.825197 -1.721331 2.774575 0.156448 -0.201272 4.742535
6.900000 0.830430 -1.728036 2.991242 0.157418 -0.201389 4.783041
6.933333 0.835681 -1.734723 -3.081028 0.158373 -0.201526 4.655567
6.966667 0.840971 -1.741422 -2.888130 0.159308 -0.201682 4.366563
7.000000 0.846299 -1.748134 -2.708607 0.160220 -0.201846 3.925975
7.033333 0.851661 -1.754860 -2.556945 0.161103 -0.202016 3.358262
7.066667 0.857057 -1.761600 -2.423494 0.161960 -0.202190 2.701011
7.100000 0.862484 -1.768356 -2.348976 0.162785 -0.202358 1.987325
7.133333 0.867942 -1.775129 -2.312144 0.163575 -0.202509 1.250981
7.166667 0.873415 -1.781881 -2.290389 0.164330 -0.202639 0.521441
7.200000 0.878916 -1.788651 -2.314102 0.165052 -0.202748 -0.167449
7.233333 0.884443 -1.795438 -2.349840 0.165742 -0.202827 -0.789447
7.266667 0.889983 -1.802203 -2.397628 0.166401 -0.202869 -1.328669
7.300000 0.895537 -1.808946 -2.476542 0.167035 -0.202877 -1.768146
7.333333 0.901114 -1.815704 -2.579479 0.167650 -0.202850 -2.095664
7.366667 0.906714 -1.822474 -2.689111 0.168245 -0.202781 -2.303077
7.400000 0.912338 -1.829255 -2.781528 0.168819 -0.202660 -2.392324
7.433333 0.917972 -1.836011 -2.900292 0.169374 -0.202485 -2.365295
7.466667 0.923630 -1.842773 -3.014309 0.169908 -0.202251 -2.222010
7.500000 0.929312 -1.849537 -3.114679 0.170417 -0.201945 -1.973284
7.533333 0.935019 -1.856301 3.082293 0.170897 -0.201558 -1.633168
7.566667 0.940734 -1.863036 3.020528 0.171349 -0.201086 -1.218904
7.600000 0.946456 -1.869744 2.968295 0.171771 -0.200533 -0.747210
7.633333 0.952200 -1.876442 2.958845 0.172161 -0.199892 -0.245887
7.666667 0.957951 -1.883110 2.959483 0.172520 -0.199164 0.253256
7.700000 0.963706 -1.889746 2.975161 0.172849 -0.198356 0.724762
7.733333 0.969484 -1.896363 3.016952 0.173149 -0.197474 1.145772
7.766667 0.975265 -1.902946 3.084722 0.173418 -0.196522 1.495994
7.800000 0.981048 -1.909495 -3.095718 0.173653 -0.195499 1.757563
7.833333 0.986852 -1.916009 -2.993658 0.173853 -0.194410 1.928210
7.866667 0.992656 -1.922487 -2.890510 0.174013 -0.193259 2.008086
7.900000 0.998475 -1.928922 -2.786411 0.174127 -0.192046 2.000716
7.933333 1.004293 -1.935319 -2.708353 0.174190 -0.190773 1.913873
7.966667 1.010117 -1.941667 -2.652309 0.174199 -0.189441 1.762729
8.000000 1.015938 -1.947974 -2.595427 0.174148 -0.188056 1.567246
8.033333 1.021759 -1.954229 -2.549830 0.174036 -0.186618 1.340094
8.066667 1.027575 -1.960441 -2.507196 0.173860 -0.185131 1.096755
8.100000 1.033381 -1.966596 -2.476506 0.173625 -0.183599 0.848341
8.133333 1.039176 -1.972693 -2.461784 0.173331 -0.182028 0.604770
8.166667 1.044963 -1.978744 -2.442487 0.172986 -0.180421 0.366688
8.200000 1.050732 -1.984735 -2.441797 0.172597 -0.178785 0.131398
8.233333 1.056492 -1.990680 -2.437996 0.172173 -0.177127 -0.098641
8.266667 1.062232 -1.996563 -2.454341 0.171721 -0.175450 -0.320831
8.300000 1.067950 -2.002385 -2.456249 0.171253 -0.173759 -0.529915
8.333333 1.073647 -2.008144 -2.466168 0.170773 -0.172055 -0.722522
8.366667 1.079323 -2.013842 -2.499537 0.170291 -0.170340 -0.888430
8.400000 1.084987 -2.019489 -2.532297 0.169812 -0.168613 -1.015953
8.433333 1.090636 -2.025085 -2.598765 0.169337 -0.166876 -1.096033
8.466667 1.096271 -2.030627 -2.654693 0.168867 -0.165128 -1.123934
8.500000 1.101890 -2.036107 -2.706442 0.168400 -0.163368 -1.096831
8.533333 1.107493 -2.041533 -2.783718 0.167932 -0.161596 -1.010148
8.566667 1.113083 -2.046896 -2.825567 0.167456 -0.159812 -0.869988
8.600000 1.118662 -2.052196 -2.859067 0.166965 -0.158014 -0.686137
8.633333 1.124229 -2.057432 -2.891902 0.166453 -0.156203 -0.473903
8.666667 1.129776 -2.062610 -2.908288 0.165914 -0.154379 -0.248793
8.700000 1.135311 -2.067723 -2.903106 0.165344 -0.152543 -0.024556
8.733333 1.140825 -2.072778 -2.884787 0.164739 -0.150695 0.176005
8.766667 1.146315 -2.077772 -2.854893 0.164098 -0.148835 0.340045
8.800000 1.151783 -2.082706 -2.812878 0.163420 -0.146962 0.454923
8.833333 1.157226 -2.087578 -2.795459 0.162705 -0.145074 0.515944
8.866667 1.162643 -2.092389 -2.760079 0.161950 -0.143169 0.521103
8.900000 1.168035 -2.097136 -2.727018 0.161157 -0.141243 0.469567
8.933333 1.173399 -2.101819 -2.697841 0.160326 -0.139294 0.371301
8.966667 1.178738 -2.106433 -2.675997 0.159456 -0.137320 0.236792
9.000000 1.184048 -2.110983 -2.665416 0.158545 -0.135321 0.082621
9.033333 1.189329 -2.115466 -2.655963 0.157593 -0.133295 -0.081425
9.066667 1.194580 -2.119883 -2.679504 0.156600 -0.131242 -0.240997
9.100000 1.199799 -2.124232 -2.692474 0.155560 -0.129162 -0.383973
9.133333 1.204976 -2.128509 -2.727881 0.154471 -0.127054 -0.498823
9.166667 1.210110 -2.132711 -2.753799 0.153332 -0.124917 -0.581420
9.200000 1.215209 -2.136844 -2.786494 0.152142 -0.122751 -0.632762
9.233333 1.220275 -2.140907 -2.824055 0.150903 -0.120555 -0.649757
9.266667 1.225305 -2.144899 -2.871682 0.149614 -0.118330 -0.635144
9.300000 1.230279 -2.148813 -2.884618 0.148279 -0.116076 -0.594699
9.333333 1.235217 -2.152654 -2.892602 0.146897 -0.113792 -0.538200
9.366667 1.240094 -2.156413 -2.907040 0.145470 -0.111478 -0.471403
9.400000 1.244934 -2.160099 -2.921521 0.143999 -0.109132 -0.399656
9.433333 1.249708 -2.163700 -2.934538 0.142483 -0.106753 -0.330146
9.466667 1.254444 -2.167227 -2.943336 0.140926 -0.104344 -0.269808
9.500000 1.259112 -2.170667 -2.946416 0.139334 -0.101904 -0.217315
9.533333 1.263741 -2.174032 -2.950811 0.137714 -0.099439 -0.171145
9.566667 1.268328 -2.177321 -2.955707 0.136073 -0.096952 -0.130190
9.600000 1.272848 -2.180520 -2.950009 0.134418 -0.094446 -0.093597
9.633333 1.277302 -2.183630 -2.961711 0.132758 -0.091927 -0.058433
9.666667 1.281691 -2.186650 -2.957034 0.131100 -0.089400 -0.023638
9.700000 1.286015 -2.189579 -2.960066 0.129448 -0.086869 0.007853
9.733333 1.290296 -2.192431 -2.963579 0.127805 -0.084335 0.034964
9.766667 1.294513 -2.195191 -2.973595 0.126178 -0.081803 0.057622
9.800000 1.298686 -2.197873 -2.968037 0.124572 -0.079277 0.075015
