t x y theta dxdt dydt dthetadt
0.000000 0.000000 0.000000 -1.979337 -0.000463 -0.007824 -0.020787
0.033333 -0.000096 0.000084 -1.982191 -0.000468 -0.010943 -0.019506
0.066667 -0.000236 -0.000149 -1.979093 -0.000462 -0.016119 -0.016421
0.100000 -0.000362 -0.000506 -1.989523 -0.000409 -0.023870 -0.006639
0.133333 -0.000189 -0.000727 -1.976054 -0.000232 -0.035358 0.009107
0.166667 0.000058 -0.001099 -1.984542 0.000156 -0.051519 0.031354
0.200000 -0.000044 -0.001692 -1.980882 0.000806 -0.073000 0.062561
0.233333 -0.000198 -0.002646 -1.991616 0.001837 -0.100359 0.102816
0.266667 -0.000261 -0.003941 -1.980329 0.003428 -0.134580 0.150701
0.300000 -0.000427 -0.006507 -1.979443 0.005856 -0.176891 0.199248
0.333333 -0.000313 -0.011199 -1.982284 0.009301 -0.227126 0.250952
0.366667 -0.000085 -0.019178 -1.977635 0.014033 -0.285167 0.301256
0.400000 0.000087 -0.027547 -1.962557 0.020301 -0.351015 0.351572
0.433333 0.000200 -0.036310 -1.928923 0.028270 -0.424165 0.397370
0.466667 0.001068 -0.052561 -1.914805 0.037913 -0.502702 0.442117
0.500000 0.001877 -0.069199 -1.891366 0.048978 -0.584208 0.488266
0.533333 0.002624 -0.086219 -1.882663 0.061190 -0.667188 0.533482
0.566667 0.004436 -0.109960 -1.861862 0.073904 -0.749636 0.580528
0.600000 0.007075 -0.138889 -1.851815 0.086421 -0.829151 0.626658
0.633333 0.010895 -0.172163 -1.836005 0.097588 -0.902824 0.674726
0.666667 0.014644 -0.205752 -1.816867 0.106451 -0.969336 0.721152
0.700000 0.019444 -0.242280 -1.806150 0.111867 -1.027273 0.766363
0.733333 0.024163 -0.279074 -1.763036 0.112898 -1.075067 0.808823
0.766667 0.029877 -0.319292 -1.728191 0.108950 -1.111812 0.846179
0.800000 0.035498 -0.359719 -1.686926 0.099585 -1.137419 0.877012
0.833333 0.041018 -0.400323 -1.648260 0.085193 -1.153103 0.899927
0.866667 0.045062 -0.441192 -1.624283 0.066216 -1.159487 0.916051
0.900000 0.047686 -0.481669 -1.590101 0.043806 -1.157972 0.922752
0.933333 0.050190 -0.522232 -1.561975 0.019004 -1.149974 0.922276
0.966667 0.049418 -0.560696 -1.541052 -0.006800 -1.137462 0.916923
1.000000 0.048521 -0.599190 -1.509320 -0.032292 -1.122007 0.910228
1.033333 0.045048 -0.635979 -1.477960 -0.056393 -1.104545 0.904487
1.066667 0.041449 -0.672743 -1.444710 -0.078256 -1.086036 0.899993
1.100000 0.037109 -0.707021 -1.417391 -0.097499 -1.067195 0.899021
1.133333 0.032647 -0.741225 -1.385048 -0.114153 -1.048614 0.898251
1.166667 0.028065 -0.775330 -1.354101 -0.128919 -1.030058 0.893676
1.200000 0.023366 -0.809311 -1.318560 -0.142832 -1.011115 0.879537
1.233333 0.018553 -0.843146 -1.289906 -0.157384 -0.991397 0.850934
1.266667 0.013629 -0.876810 -1.269832 -0.174122 -0.970187 0.802718
1.300000 0.008598 -0.910281 -1.249727 -0.194584 -0.946405 0.733421
1.333333 0.003462 -0.943533 -1.211503 -0.219483 -0.919218 0.647070
1.366667 -0.002702 -0.973385 -1.173156 -0.249202 -0.887864 0.548286
1.400000 -0.008964 -1.002976 -1.125841 -0.283458 -0.851946 0.443230
1.433333 -0.015320 -1.032287 -1.102939 -0.321137 -0.810942 0.337253
1.466667 -0.026695 -1.059839 -1.116653 -0.360379 -0.765101 0.241134
1.500000 -0.038151 -1.087076 -1.127921 -0.399268 -0.714881 0.160753
1.533333 -0.053658 -1.111833 -1.139558 -0.435969 -0.660802 0.099371
1.566667 -0.071670 -1.133663 -1.148039 -0.468570 -0.603819 0.060298
1.600000 -0.091729 -1.151248 -1.173168 -0.495329 -0.545037 0.046074
1.633333 -0.111814 -1.168468 -1.173985 -0.515289 -0.486222 0.057088
1.666667 -0.131906 -1.185316 -1.171508 -0.527591 -0.428329 0.084887
1.700000 -0.152161 -1.197303 -1.161316 -0.531369 -0.372683 0.120823
1.733333 -0.172388 -1.208908 -1.140922 -0.525905 -0.320127 0.157597
1.766667 -0.189095 -1.214868 -1.135059 -0.510753 -0.271285 0.189000
1.800000 -0.205743 -1.220446 -1.123900 -0.485563 -0.226089 0.208774
1.833333 -0.222316 -1.225644 -1.102023 -0.449709 -0.184029 0.213493
1.866667 -0.238799 -1.230466 -1.099985 -0.403965 -0.145200 0.207587
1.900000 -0.255178 -1.234916 -1.082827 -0.349142 -0.108948 0.194901
1.933333 -0.271437 -1.238999 -1.084145 -0.287152 -0.075252 0.180518
1.966667 -0.287563 -1.242719 -1.077238 -0.219877 -0.043649 0.165211
2.000000 -0.292750 -1.243149 -1.081243 -0.150873 -0.014599 0.152121
2.033333 -0.297786 -1.243225 -1.087627 -0.083694 0.011438 0.144618
2.066667 -0.296403 -1.241460 -1.091704 -0.021517 0.034126 0.139303
2.100000 -0.290380 -1.238032 -1.080933 0.032129 0.052644 0.138283
2.133333 -0.281292 -1.233768 -1.070318 0.074688 0.066584 0.139012
2.166667 -0.272077 -1.229186 -1.057059 0.103666 0.075174 0.142327
2.200000 -0.262749 -1.224299 -1.039718 0.119565 0.078691 0.145437
2.233333 -0.253319 -1.219121 -1.042709 0.122897 0.077416 0.144390
2.266667 -0.248311 -1.216147 -1.045637 0.115611 0.072091 0.142490
