t x y theta dxdt dydt dthetadt
0.000000 0.000000 0.000000 2.602098 -0.072846 -0.000374 -0.021549
0.033333 -0.002485 -0.000050 2.602583 -0.078006 -0.001528 -0.022151
0.066667 -0.005137 -0.000097 2.595932 -0.083324 -0.002758 -0.022217
0.100000 -0.007972 -0.000202 2.590413 -0.088808 -0.004066 -0.021337
0.133333 -0.010997 -0.000303 2.587201 -0.094458 -0.005445 -0.016866
0.166667 -0.014210 -0.000467 2.587944 -0.100290 -0.006886 -0.011942
0.200000 -0.017614 -0.000696 2.591144 -0.106312 -0.008387 -0.006240
0.233333 -0.021212 -0.000993 2.592961 -0.112533 -0.009949 -0.000922
0.266667 -0.025005 -0.001359 2.588020 -0.118980 -0.011559 0.005821
0.300000 -0.028997 -0.001796 2.591349 -0.125658 -0.013213 0.012490
0.333333 -0.033264 -0.002243 2.588979 -0.132573 -0.014907 0.016660
0.366667 -0.037734 -0.002766 2.597945 -0.139703 -0.016646 0.019178
0.400000 -0.042409 -0.003366 2.591952 -0.147032 -0.018431 0.022266
0.433333 -0.047407 -0.003985 2.596869 -0.154533 -0.020265 0.024764
0.466667 -0.052613 -0.004685 2.601117 -0.162149 -0.022168 0.024720
0.500000 -0.058185 -0.005410 2.598320 -0.169814 -0.024157 0.023085
0.533333 -0.063969 -0.006220 2.589005 -0.177477 -0.026245 0.023092
0.566667 -0.069967 -0.007117 2.594577 -0.185099 -0.028441 0.023327
0.600000 -0.076390 -0.008051 2.602408 -0.192625 -0.030758 0.021361
0.633333 -0.083029 -0.009076 2.606159 -0.200016 -0.033197 0.018712
0.666667 -0.089883 -0.010193 2.597024 -0.207296 -0.035756 0.016817
0.700000 -0.096954 -0.011404 2.600453 -0.214514 -0.038424 0.017820
0.733333 -0.104242 -0.012711 2.607628 -0.221762 -0.041194 0.025405
0.766667 -0.111748 -0.014116 2.597671 -0.229129 -0.044059 0.058689
0.800000 -0.119471 -0.015619 2.603353 -0.236798 -0.047005 0.133410
0.833333 -0.127411 -0.017224 2.602402 -0.244996 -0.050021 0.269901
0.866667 -0.135569 -0.018932 2.610879 -0.253907 -0.053137 0.483994
0.900000 -0.143945 -0.020743 2.591950 -0.263701 -0.056388 0.786451
0.933333 -0.152537 -0.022661 2.609492 -0.274451 -0.059808 1.179785
0.966667 -0.161346 -0.024685 2.597957 -0.286274 -0.063465 1.642508
1.000000 -0.170881 -0.026814 2.596145 -0.299117 -0.067434 2.158155
1.033333 -0.180632 -0.029053 2.628592 -0.312811 -0.071787 2.699778
1.066667 -0.191173 -0.031408 2.722309 -0.327144 -0.076551 3.244291
1.100000 -0.201925 -0.033875 2.898296 -0.341953 -0.081783 3.760878
1.133333 -0.213544 -0.036460 3.099102 -0.357064 -0.087538 4.219713
1.166667 -0.226057 -0.039158 -2.956762 -0.372201 -0.093825 4.602422
1.200000 -0.239265 -0.042442 -2.745075 -0.387184 -0.100611 4.881131
1.233333 -0.252669 -0.045843 -2.578666 -0.401936 -0.107883 5.041126
1.266667 -0.266264 -0.049362 -2.375685 -0.416422 -0.115605 5.065440
1.300000 -0.280603 -0.053433 -2.248672 -0.430469 -0.123640 4.965690
1.333333 -0.295121 -0.057621 -2.067553 -0.444054 -0.131870 4.757641
1.366667 -0.309812 -0.061926 -1.886641 -0.457270 -0.140175 4.461521
1.400000 -0.325247 -0.066742 -1.670848 -0.470241 -0.148492 4.102403
1.433333 -0.341399 -0.072036 -1.523000 -0.482991 -0.156696 3.698696
1.466667 -0.357703 -0.077444 -1.395775 -0.495580 -0.164706 3.277527
1.500000 -0.374695 -0.083268 -1.297781 -0.508198 -0.172522 2.844314
1.533333 -0.391822 -0.089204 -1.249855 -0.520922 -0.180120 2.411992
1.566667 -0.409616 -0.095502 -1.191353 -0.533693 -0.187453 1.990718
1.600000 -0.427528 -0.101908 -1.151026 -0.546424 -0.194477 1.596993
1.633333 -0.445547 -0.108419 -1.126226 -0.559115 -0.201212 1.241365
1.666667 -0.464181 -0.115225 -1.088550 -0.571654 -0.207645 0.927385
1.700000 -0.483398 -0.122294 -1.062074 -0.583863 -0.213752 0.661667
1.733333 -0.503169 -0.129605 -1.055868 -0.595520 -0.219502 0.440390
1.766667 -0.523467 -0.137137 -1.051405 -0.606495 -0.224910 0.261190
1.800000 -0.544236 -0.144861 -1.046015 -0.616625 -0.229963 0.116990
1.833333 -0.565443 -0.152755 -1.059323 -0.625659 -0.234618 0.009295
1.866667 -0.587068 -0.160811 -1.069452 -0.633435 -0.238868 -0.060902
1.900000 -0.608706 -0.168948 -1.068633 -0.639865 -0.242718 -0.093841
1.933333 -0.630342 -0.177162 -1.085692 -0.644936 -0.246202 -0.087195
1.966667 -0.652260 -0.185495 -1.113198 -0.648645 -0.249350 -0.042352
2.000000 -0.674148 -0.193897 -1.113902 -0.651027 -0.252208 0.036635
2.033333 -0.695992 -0.202364 -1.128460 -0.652211 -0.254837 0.139708
2.066667 -0.717974 -0.210928 -1.140775 -0.652305 -0.257288 0.258038
2.100000 -0.739883 -0.219550 -1.125601 -0.651374 -0.259594 0.383489
2.133333 -0.761809 -0.228262 -1.110322 -0.649464 -0.261767 0.506470
2.166667 -0.783632 -0.237024 -1.066818 -0.646597 -0.263816 0.614066
2.200000 -0.805381 -0.245874 -1.019921 -0.642793 -0.265735 0.698556
2.233333 -0.826993 -0.254801 -0.992780 -0.637992 -0.267503 0.755045
2.266667 -0.848402 -0.263809 -0.960889 -0.632190 -0.269098 0.778262
2.300000 -0.869650 -0.272849 -0.925939 -0.625382 -0.270498 0.769506
2.333333 -0.890563 -0.281954 -0.898135 -0.617589 -0.271689 0.729056
2.366667 -0.911287 -0.291083 -0.867433 -0.608882 -0.272654 0.666509
2.400000 -0.931539 -0.300255 -0.833293 -0.599345 -0.273387 0.588745
2.433333 -0.951573 -0.309442 -0.822055 -0.589157 -0.273893 0.502975
2.466667 -0.971375 -0.318638 -0.805444 -0.578450 -0.274184 0.416767
2.500000 -0.990511 -0.327830 -0.802719 -0.567303 -0.274262 0.331330
2.533333 -1.009389 -0.337023 -0.801355 -0.555759 -0.274132 0.256166
2.566667 -1.027436 -0.346171 -0.799252 -0.543874 -0.273804 0.197755
2.600000 -1.045199 -0.355312 -0.794706 -0.531556 -0.273270 0.160748
2.633333 -1.062668 -0.364439 -0.778387 -0.518666 -0.272517 0.147726
2.666667 -1.079830 -0.373550 -0.793498 -0.505073 -0.271527 0.163915
2.700000 -1.096673 -0.382640 -0.791663 -0.490651 -0.270283 0.212892
2.733333 -1.113185 -0.391703 -0.794531 -0.475293 -0.268763 0.288378
2.766667 -1.129357 -0.400736 -0.792100 -0.458796 -0.266940 0.375401
2.800000 -1.145175 -0.409735 -0.785811 -0.441096 -0.264792 0.464422
2.833333 -1.159572 -0.418566 -0.801916 -0.422216 -0.262310 0.546633
2.866667 -1.173596 -0.427353 -0.773682 -0.402183 -0.259483 0.605351
2.900000 -1.187237 -0.436094 -0.710769 -0.381163 -0.256334 0.626607
2.933333 -1.199287 -0.444587 -0.678896 -0.359426 -0.252902 0.604664
2.966667 -1.210937 -0.453026 -0.624194 -0.337287 -0.249232 0.541766
3.000000 -1.222180 -0.461405 -0.569881 -0.315136 -0.245397 0.436705
3.033333 -1.231845 -0.469466 -0.544152 -0.293280 -0.241474 0.291114
3.066667 -1.241090 -0.477461 -0.525719 -0.271971 -0.237510 0.115357
3.100000 -1.249909 -0.485385 -0.552470 -0.251303 -0.233502 -0.070943
3.133333 -1.257260 -0.492944 -0.568967 -0.231203 -0.229412 -0.258028
3.166667 -1.264177 -0.500427 -0.605205 -0.211595 -0.225201 -0.432429
3.200000 -1.270654 -0.507830 -0.627994 -0.192316 -0.220807 -0.581354
3.233333 -1.276689 -0.515150 -0.666094 -0.173052 -0.216106 -0.694454
3.266667 -1.282278 -0.522383 -0.687340 -0.153602 -0.211034 -0.768800
3.300000 -1.287418 -0.529528 -0.724871 -0.133885 -0.205580 -0.810795
3.333333 -1.292107 -0.536581 -0.757962 -0.113853 -0.199762 -0.819965
3.366667 -1.296342 -0.543540 -0.791283 -0.093463 -0.193596 -0.802677
3.400000 -1.299410 -0.550063 -0.819952 -0.072729 -0.187127 -0.764117
3.433333 -1.301339 -0.556151 -0.837142 -0.051884 -0.180482 -0.712756
3.466667 -1.302143 -0.561793 -0.864084 -0.031124 -0.173766 -0.650322
3.500000 -1.302490 -0.567332 -0.893984 -0.010590 -0.167056 -0.581371
3.533333 -1.302382 -0.572766 -0.915295 0.009547 -0.160424 -0.511133
3.566667 -1.301241 -0.577763 -0.927162 0.029099 -0.153951 -0.443365
3.600000 -1.299648 -0.582652 -0.956447 0.047997 -0.147661 -0.380797
3.633333 -1.297606 -0.587434 -0.950669 0.066300 -0.141521 -0.324465
3.666667 -1.295117 -0.592107 -0.945867 0.084145 -0.135468 -0.278431
3.700000 -1.292184 -0.596671 -0.950650 0.101670 -0.129438 -0.242192
3.733333 -1.288811 -0.601124 -0.951221 0.119043 -0.123354 -0.215982
3.766667 -1.284609 -0.605189 -0.958538 0.136469 -0.117128 -0.198416
3.800000 -1.279592 -0.608875 -0.975181 0.154059 -0.110727 -0.189892
3.833333 -1.274147 -0.612450 -0.982719 0.171841 -0.104158 -0.185514
3.866667 -1.268279 -0.615913 -0.980531 0.189755 -0.097470 -0.181067
3.900000 -1.261630 -0.619026 -0.986755 0.207714 -0.090731 -0.175800
3.933333 -1.254569 -0.622027 -0.994090 0.225566 -0.084044 -0.168226
3.966667 -1.246737 -0.624697 -1.007226 0.243153 -0.077515 -0.157257
4.000000 -1.238141 -0.627045 -1.022521 0.260351 -0.071225 -0.141618
4.033333 -1.229153 -0.629286 -1.019868 0.277065 -0.065234 -0.123855
4.066667 -1.219412 -0.631229 -1.014134 0.293245 -0.059608 -0.104740
4.100000 -1.208919 -0.632896 -1.022087 0.308871 -0.054382 -0.083096
4.133333 -1.198060 -0.634458 -1.027698 0.324003 -0.049586 -0.059441
4.166667 -1.186844 -0.635918 -1.024189 0.338686 -0.045222 -0.032929
4.200000 -1.175281 -0.637278 -1.021918 0.352992 -0.041282 -0.003746
4.233333 -1.163380 -0.638538 -1.026611 0.366996 -0.037753 0.031307
4.266667 -1.151151 -0.639701 -1.027002 0.380807 -0.034599 0.072717
4.300000 -1.138145 -0.640748 -1.033994 0.394529 -0.031773 0.121101
4.333333 -1.124832 -0.641701 -1.033868 0.408165 -0.029214 0.176703
4.366667 -1.111222 -0.642563 -1.020767 0.421800 -0.026889 0.235173
4.400000 -1.096797 -0.643383 -1.004022 0.435442 -0.024780 0.290670
4.433333 -1.082100 -0.644115 -1.002244 0.449099 -0.022869 0.336459
4.466667 -1.066547 -0.644854 -1.006473 0.462620 -0.021124 0.367040
4.500000 -1.050746 -0.645509 -0.979881 0.475895 -0.019526 0.374417
4.533333 -1.034709 -0.646082 -0.960052 0.488869 -0.018062 0.355740
4.566667 -1.018451 -0.646574 -0.916505 0.501413 -0.016708 0.308665
4.600000 -1.001238 -0.647131 -0.889091 0.513496 -0.015456 0.239220
4.633333 -0.983830 -0.647611 -0.870773 0.525089 -0.014296 0.148485
4.666667 -0.966243 -0.648016 -0.871897 0.536323 -0.013246 0.041026
4.700000 -0.947635 -0.648509 -0.870952 0.547219 -0.012311 -0.072228
4.733333 -0.928878 -0.648930 -0.904638 0.557800 -0.011498 -0.182828
4.766667 -0.909987 -0.649280 -0.897612 0.568076 -0.010810 -0.279440
4.800000 -0.890979 -0.649560 -0.923272 0.577995 -0.010234 -0.356943
4.833333 -0.871869 -0.649773 -0.951723 0.587507 -0.009759 -0.406906
4.866667 -0.852673 -0.649920 -0.969976 0.596562 -0.009378 -0.427058
4.900000 -0.832536 -0.650205 -1.001968 0.605183 -0.009096 -0.417123
4.933333 -0.811495 -0.650637 -1.020629 0.613321 -0.008901 -0.384560
4.966667 -0.790421 -0.651007 -1.027102 0.620913 -0.008773 -0.333276
5.000000 -0.769331 -0.651316 -1.044076 0.627938 -0.008709 -0.266571
5.033333 -0.748244 -0.651564 -1.047403 0.634376 -0.008707 -0.193449
5.066667 -0.727178 -0.651753 -1.054618 0.640102 -0.008734 -0.118185
5.100000 -0.705405 -0.652093 -1.050486 0.645025 -0.008768 -0.049780
5.133333 -0.683691 -0.652376 -1.056426 0.649210 -0.008832 0.013531
5.166667 -0.662055 -0.652602 -1.038540 0.652721 -0.008948 0.065645
5.200000 -0.639890 -0.652950 -1.039805 0.655503 -0.009102 0.099236
5.233333 -0.617842 -0.653242 -1.021972 0.657504 -0.009282 0.113781
5.266667 -0.595932 -0.653480 -1.039146 0.658717 -0.009496 0.112275
5.300000 -0.573723 -0.653810 -1.022713 0.659102 -0.009748 0.096886
5.333333 -0.551298 -0.654214 -0.993815 0.658468 -0.010005 0.065314
5.366667 -0.529071 -0.654563 -0.987689 0.656639 -0.010228 0.022192
5.400000 -0.507063 -0.654859 -0.996396 0.653581 -0.010422 -0.026444
5.433333 -0.485053 -0.655203 -0.996347 0.649208 -0.010584 -0.076578
5.466667 -0.463118 -0.655591 -1.004614 0.643431 -0.010690 -0.130771
5.500000 -0.441334 -0.656020 -1.011251 0.636160 -0.010713 -0.184033
5.533333 -0.419851 -0.656396 -1.028400 0.627424 -0.010641 -0.230821
5.566667 -0.398690 -0.656716 -1.044293 0.617259 -0.010471 -0.268070
5.600000 -0.377930 -0.657069 -1.045475 0.605605 -0.010181 -0.297419
5.633333 -0.357655 -0.657452 -1.061022 0.592512 -0.009748 -0.315339
5.666667 -0.337952 -0.657855 -1.065888 0.578075 -0.009170 -0.321230
5.700000 -0.318652 -0.658201 -1.076084 0.562447 -0.008448 -0.318209
5.733333 -0.299772 -0.658491 -1.090014 0.545734 -0.007580 -0.309178
5.766667 -0.281701 -0.658773 -1.118688 0.528004 -0.006563 -0.300432
5.800000 -0.264089 -0.658996 -1.124204 0.509348 -0.005410 -0.290536
5.833333 -0.247461 -0.659191 -1.130830 0.489754 -0.004146 -0.285249
5.866667 -0.231328 -0.659327 -1.146665 0.469165 -0.002803 -0.282216
5.900000 -0.215707 -0.659401 -1.133921 0.447387 -0.001412 -0.283066
5.933333 -0.201265 -0.659439 -1.149297 0.424284 -0.000006 -0.285799
5.966667 -0.187367 -0.659414 -1.146246 0.399801 0.001386 -0.289865
6.000000 -0.174028 -0.659326 -1.154398 0.373892 0.002736 -0.297441
6.033333 -0.161263 -0.659174 -1.169975 0.346499 0.004018 -0.309207
6.066667 -0.149086 -0.658956 -1.182364 0.317580 0.005212 -0.332367
6.100000 -0.138369 -0.658719 -1.212964 0.287236 0.006310 -0.364965
6.133333 -0.129153 -0.658472 -1.224420 0.255435 0.007292 -0.418539
6.166667 -0.121488 -0.658223 -1.234253 0.222186 0.008145 -0.495133
6.200000 -0.114460 -0.657905 -1.231140 0.187511 0.008861 -0.599401
6.233333 -0.109062 -0.657609 -1.248720 0.151575 0.009449 -0.733081
6.266667 -0.104320 -0.657242 -1.238330 0.114543 0.009916 -0.892546
6.300000 -0.100243 -0.656802 -1.261165 0.076457 0.010263 -1.075379
6.333333 -0.097934 -0.656418 -1.293123 0.037466 0.010495 -1.258821
6.366667 -0.097415 -0.656090 -1.341872 -0.002432 0.010606 -1.423030
6.400000 -0.097579 -0.655684 -1.399547 -0.043139 0.010598 -1.540586
6.433333 -0.099579 -0.655325 -1.461920 -0.084614 0.010466 -1.583424
6.466667 -0.103423 -0.655005 -1.561844 -0.126805 0.010199 -1.526507
6.500000 -0.107956 -0.654602 -1.646059 -0.169586 0.009791 -1.353612
6.533333 -0.114314 -0.654248 -1.740463 -0.212847 0.009235 -1.064035
6.566667 -0.122480 -0.653951 -1.842036 -0.256320 0.008553 -0.663321
6.600000 -0.131329 -0.653565 -1.897646 -0.299830 0.007756 -0.171021
6.633333 -0.141941 -0.653259 -1.924687 -0.343143 0.006875 0.383986
6.666667 -0.154291 -0.653044 -1.886254 -0.385964 0.005972 0.966492
6.700000 -0.168359 -0.652922 -1.819760 -0.427829 0.005141 1.540774
6.733333 -0.183085 -0.652702 -1.719638 -0.468374 0.004471 2.070382
6.766667 -0.199484 -0.652579 -1.580046 -0.507410 0.004033 2.516684
6.800000 -0.217531 -0.652549 -1.466216 -0.544743 0.003907 2.857467
6.833333 -0.237220 -0.652603 -1.332428 -0.580265 0.004154 3.077851
6.866667 -0.258529 -0.652733 -1.189104 -0.613953 0.004814 3.173471
6.900000 -0.280436 -0.652750 -1.052356 -0.646042 0.005877 3.151157
6.933333 -0.302925 -0.652649 -0.929488 -0.676604 0.007350 3.025766
6.966667 -0.325980 -0.652426 -0.815125 -0.705698 0.009234 2.822899
7.000000 -0.349584 -0.652079 -0.705700 -0.733460 0.011515 2.559800
7.033333 -0.373722 -0.651604 -0.627670 -0.760105 0.014163 2.256442
7.066667 -0.399321 -0.651107 -0.559876 -0.785852 0.017138 1.933674
7.100000 -0.426346 -0.650566 -0.522460 -0.810805 0.020434 1.607681
7.133333 -0.454777 -0.649956 -0.476051 -0.835122 0.024056 1.293072
7.166667 -0.483665 -0.649204 -0.439960 -0.858863 0.028022 1.000193
7.200000 -0.512988 -0.648308 -0.420789 -0.881959 0.032347 0.738857
7.233333 -0.542724 -0.647263 -0.397014 -0.904291 0.037082 0.516312
7.266667 -0.572852 -0.646066 -0.398251 -0.925813 0.042271 0.332392
7.300000 -0.604129 -0.644665 -0.419348 -0.946488 0.047940 0.187337
7.333333 -0.636493 -0.643037 -0.416304 -0.966276 0.054070 0.076001
7.366667 -0.669178 -0.641248 -0.435412 -0.985130 0.060640 -0.006274
7.400000 -0.702161 -0.639294 -0.436715 -1.003075 0.067657 -0.065255
7.433333 -0.736046 -0.637048 -0.442560 -1.020018 0.075083 -0.107387
7.466667 -0.770751 -0.634482 -0.436739 -1.035739 0.082902 -0.137923
7.500000 -0.806190 -0.631575 -0.445224 -1.050034 0.091070 -0.163833
7.533333 -0.841822 -0.628495 -0.453657 -1.062784 0.099598 -0.184101
7.566667 -0.878022 -0.625040 -0.439466 -1.073855 0.108452 -0.201162
7.600000 -0.914359 -0.621408 -0.456755 -1.083093 0.117550 -0.212023
7.633333 -0.951074 -0.617363 -0.448506 -1.090464 0.126830 -0.218794
7.666667 -0.987871 -0.613139 -0.464287 -1.095993 0.136234 -0.216198
7.700000 -1.024871 -0.608469 -0.492995 -1.099740 0.145726 -0.201405
7.733333 -1.062016 -0.603349 -0.512304 -1.101671 0.155219 -0.175079
7.766667 -1.099157 -0.598047 -0.517539 -1.101834 0.164685 -0.134134
7.800000 -1.136250 -0.592265 -0.537759 -1.100226 0.174124 -0.080192
7.833333 -1.173281 -0.586302 -0.527916 -1.096771 0.183604 -0.007212
7.866667 -1.210063 -0.579846 -0.521244 -1.091357 0.193156 0.081128
7.900000 -1.246726 -0.573210 -0.510876 -1.083855 0.202840 0.181715
7.933333 -1.283244 -0.566395 -0.500666 -1.074245 0.212726 0.291856
7.966667 -1.319588 -0.559402 -0.506923 -1.062472 0.222863 0.407797
8.000000 -1.355268 -0.551876 -0.495430 -1.048548 0.233299 0.523270
8.033333 -1.390718 -0.544176 -0.482860 -1.032499 0.244031 0.630428
8.066667 -1.425328 -0.535923 -0.461093 -1.014385 0.255071 0.726422
8.100000 -1.459655 -0.527501 -0.427355 -0.994148 0.266451 0.809126
8.133333 -1.492923 -0.518496 -0.394021 -0.971627 0.278213 0.873152
8.166667 -1.525025 -0.508893 -0.341321 -0.946730 0.290362 0.909406
8.200000 -1.555846 -0.498677 -0.298180 -0.919396 0.302876 0.917142
8.233333 -1.586286 -0.488306 -0.260964 -0.889587 0.315708 0.891981
8.266667 -1.616323 -0.477782 -0.215997 -0.857208 0.328825 0.828161
8.300000 -1.645934 -0.467112 -0.185555 -0.822382 0.342111 0.723446
8.333333 -1.673910 -0.455770 -0.169650 -0.785427 0.355401 0.578965
8.366667 -1.700189 -0.443772 -0.151046 -0.746518 0.368566 0.404046
8.400000 -1.724720 -0.431144 -0.117771 -0.705838 0.381462 0.200846
8.433333 -1.747453 -0.417912 -0.097159 -0.663801 0.393899 -0.022223
8.466667 -1.768353 -0.404115 -0.100033 -0.621096 0.405613 -0.253271
8.500000 -1.788721 -0.390211 -0.122024 -0.578206 0.416365 -0.481182
8.533333 -1.807200 -0.375853 -0.132584 -0.535382 0.425955 -0.697726
8.566667 -1.823793 -0.361088 -0.178681 -0.493068 0.434196 -0.900159
8.600000 -1.838484 -0.345982 -0.216339 -0.451790 0.440962 -1.082191
8.633333 -1.852603 -0.330804 -0.265802 -0.411659 0.446197 -1.242566
8.666667 -1.866143 -0.315564 -0.343540 -0.372374 0.449913 -1.384633
8.700000 -1.877783 -0.300210 -0.399081 -0.333943 0.452158 -1.514835
8.733333 -1.887541 -0.284822 -0.451720 -0.296550 0.453041 -1.629568
8.766667 -1.896706 -0.269402 -0.502844 -0.260149 0.452686 -1.722832
8.800000 -1.905273 -0.253959 -0.539781 -0.224405 0.451200 -1.790144
8.833333 -1.912034 -0.238728 -0.575075 -0.189302 0.448715 -1.823373
8.866667 -1.917022 -0.223771 -0.637951 -0.155138 0.445406 -1.808121
8.900000 -1.921412 -0.208820 -0.724719 -0.121844 0.441432 -1.726029
8.933333 -1.925206 -0.193885 -0.805017 -0.089147 0.436897 -1.576458
8.966667 -1.927373 -0.179364 -0.899567 -0.056970 0.431915 -1.360873
9.000000 -1.927970 -0.165268 -1.002997 -0.025524 0.426659 -1.075250
9.033333 -1.927981 -0.151215 -1.082565 0.005146 0.421269 -0.724700
9.066667 -1.927410 -0.137215 -1.102931 0.035180 0.415843 -0.329442
9.100000 -1.926262 -0.123275 -1.089242 0.064511 0.410490 0.078679
9.133333 -1.923777 -0.109665 -1.071779 0.092904 0.405362 0.482551
9.166667 -1.920009 -0.096335 -1.027917 0.120235 0.400564 0.857270
9.200000 -1.915032 -0.083231 -0.935356 0.146484 0.396135 1.168656
9.233333 -1.908925 -0.070299 -0.836545 0.171542 0.392123 1.391329
9.266667 -1.902282 -0.057470 -0.792324 0.195233 0.388552 1.518904
9.300000 -1.895111 -0.044752 -0.734168 0.217430 0.385440 1.556075
9.333333 -1.887039 -0.032056 -0.637846 0.238101 0.382705 1.503365
9.366667 -1.878462 -0.019487 -0.575370 0.257250 0.380265 1.375343
9.400000 -1.869233 -0.006852 -0.501790 0.274919 0.378003 1.191878
9.433333 -1.859523 0.005640 -0.475053 0.291230 0.375812 0.975929
9.466667 -1.849326 0.018260 -0.446168 0.306316 0.373579 0.737388
9.500000 -1.838671 0.030719 -0.460553 0.320285 0.371204 0.494442
9.533333 -1.827651 0.043331 -0.433061 0.333250 0.368620 0.261649
9.566667 -1.816198 0.055765 -0.433858 0.345270 0.365778 0.049952
9.600000 -1.804325 0.068011 -0.433811 0.356407 0.362658 -0.130833
9.633333 -1.792046 0.080061 -0.478822 0.366722 0.359204 -0.280945
9.666667 -1.779374 0.091906 -0.477883 0.376236 0.355408 -0.397154
9.700000 -1.766322 0.103538 -0.509785 0.384981 0.351226 -0.487268
9.733333 -1.753150 0.115206 -0.527664 0.392967 0.346640 -0.553051
9.766667 -1.739886 0.126899 -0.566690 0.400173 0.341595 -0.599430
9.800000 -1.726282 0.138351 -0.601380 0.406543 0.336043 -0.633315
9.833333 -1.712701 0.149718 -0.616910 0.412033 0.329941 -0.654229
9.866667 -1.698806 0.160826 -0.616910 0.416679 0.323225 -0.661811
9.900000 -1.684610 0.171667 -0.616910 0.420587 0.315859 -0.660691
9.933333 -1.670127 0.182231 -0.616910 0.423830 0.307821 -0.658614
9.966667 -1.655368 0.192509 -0.696701 0.426539 0.299167 -0.656017
10.000000 -1.640853 0.202494 -0.739990 0.428891 0.289948 -0.652761
10.033333 -1.626665 0.212095 -0.764697 0.431051 0.280254 -0.653144
10.066667 -1.612241 0.221385 -0.763363 0.433144 0.270173 -0.658301
10.100000 -1.598221 0.230175 -0.765526 0.435297 0.259802 -0.662404
10.133333 -1.583987 0.238637 -0.791768 0.437584 0.249156 -0.655567
10.166667 -1.569552 0.246763 -0.805386 0.439976 0.238151 -0.645916
10.200000 -1.554926 0.254544 -0.825922 0.442292 0.226645 -0.642554
10.233333 -1.540121 0.261975 -0.865958 0.444221 0.214409 -0.652588
10.266667 -1.525149 0.269046 -0.892972 0.445395 0.201155 -0.687351
10.300000 -1.510021 0.275750 -0.905081 0.445341 0.186564 -0.756356
10.333333 -1.494748 0.282080 -0.929753 0.443687 0.170377 -0.874476
10.366667 -1.479342 0.288030 -0.967443 0.440159 0.152390 -1.036264
10.400000 -1.463814 0.293591 -0.976565 0.434618 0.132456 -1.226417
10.433333 -1.448176 0.298758 -0.996066 0.427064 0.110486 -1.420888
10.466667 -1.433336 0.302778 -0.976923 0.417688 0.086581 -1.590698
10.500000 -1.419264 0.305663 -0.989538 0.406809 0.060920 -1.709979
10.533333 -1.405920 0.307421 -1.090515 0.394838 0.033812 -1.741131
10.566667 -1.393260 0.308045 -1.243748 0.382275 0.005702 -1.657968
10.600000 -1.381237 0.307514 -1.407095 0.369693 -0.022827 -1.441826
10.633333 -1.369157 0.306563 -1.528022 0.357659 -0.051170 -1.086036
10.666667 -1.357625 0.304395 -1.613385 0.346579 -0.078840 -0.596884
10.700000 -1.346607 0.301000 -1.651375 0.336763 -0.105407 0.014849
10.733333 -1.336056 0.296378 -1.656376 0.328376 -0.130559 0.710460
10.766667 -1.325944 0.290543 -1.600704 0.321450 -0.154106 1.445121
10.800000 -1.315798 0.284292 -1.496048 0.315826 -0.176080 2.169618
10.833333 -1.305622 0.277626 -1.398524 0.311330 -0.196508 2.831669
10.866667 -1.295419 0.270549 -1.215071 0.307758 -0.215488 3.391371
10.900000 -1.285192 0.263065 -1.055690 0.304854 -0.233213 3.817855
10.933333 -1.274945 0.255177 -0.906371 0.302343 -0.249952 4.097558
10.966667 -1.264985 0.246298 -0.683742 0.299958 -0.265999 4.224983
11.000000 -1.255009 0.237023 -0.537150 0.297545 -0.281527 4.208345
11.033333 -1.245022 0.227357 -0.375453 0.294943 -0.296714 4.062857
11.066667 -1.235025 0.217304 -0.215310 0.292006 -0.311674 3.807300
11.100000 -1.225020 0.206868 -0.072049 0.288660 -0.326412 3.458628
11.133333 -1.215335 0.195705 0.063236 0.284866 -0.340830 3.035612
11.166667 -1.205984 0.183868 0.145318 0.280604 -0.354838 2.567427
11.200000 -1.196631 0.171664 0.228336 0.275826 -0.368375 2.071237
11.233333 -1.187650 0.158874 0.306530 0.270561 -0.381378 1.568521
11.266667 -1.178670 0.145730 0.338943 0.264912 -0.393782 1.080877
11.300000 -1.169691 0.132240 0.358171 0.259006 -0.405523 0.625428
11.333333 -1.160714 0.118410 0.351934 0.252968 -0.416579 0.220643
11.366667 -1.152180 0.104190 0.321757 0.246919 -0.426889 -0.124388
11.400000 -1.144088 0.089636 0.274442 0.241011 -0.436354 -0.396222
11.433333 -1.136429 0.074796 0.259090 0.235332 -0.444922 -0.589884
11.466667 -1.129187 0.059725 0.220661 0.229966 -0.452546 -0.708611
11.500000 -1.121943 0.044349 0.158476 0.225007 -0.459180 -0.753798
11.533333 -1.114696 0.028675 0.111148 0.220570 -0.464798 -0.734497
11.566667 -1.107444 0.012710 0.078801 0.216745 -0.469432 -0.664988
11.600000 -1.100185 -0.003539 0.055911 0.213562 -0.473195 -0.564200
11.633333 -1.093145 -0.019755 0.044556 0.211045 -0.476146 -0.449260
11.666667 -1.086274 -0.035877 0.029449 0.209188 -0.478309 -0.341674
11.700000 -1.079520 -0.051845 0.023205 0.207961 -0.479824 -0.268500
11.733333 -1.072829 -0.067593 0.029334 0.207350 -0.480804 -0.248521
11.766667 -1.066118 -0.083592 0.044494 0.207365 -0.481321 -0.299624
11.800000 -1.059385 -0.099835 0.064062 0.208069 -0.481381 -0.438709
11.833333 -1.052560 -0.115670 0.082600 0.209480 -0.481109 -0.680919
11.866667 -1.045706 -0.131738 0.082590 0.211596 -0.480667 -1.027649
11.900000 -1.038821 -0.148035 0.071053 0.214420 -0.480089 -1.471644
11.933333 -1.031902 -0.164555 0.058222 0.217910 -0.479405 -2.011006
11.966667 -1.024721 -0.180617 0.012915 0.222024 -0.478707 -2.632265
12.000000 -1.017249 -0.196265 -0.088955 0.226647 -0.478190 -3.310835
12.033333 -1.009734 -0.212122 -0.227880 0.231729 -0.477923 -4.011885
12.066667 -1.001899 -0.227705 -0.343645 0.237200 -0.478033 -4.717342
12.100000 -0.994017 -0.243490 -0.525430 0.242964 -0.478698 -5.405550
12.133333 -0.985809 -0.259157 -0.741993 0.248896 -0.480121 -6.042455
12.166667 -0.977550 -0.275021 -1.003586 0.254876 -0.482388 -6.591664
12.200000 -0.968987 -0.290922 -1.251854 0.260835 -0.485458 -7.024801
12.233333 -0.960140 -0.306928 -1.522429 0.266663 -0.489317 -7.323350
12.266667 -0.951028 -0.323101 -1.803573 0.272292 -0.493829 -7.447792
12.300000 -0.941671 -0.339493 -2.101960 0.277656 -0.498843 -7.370620
12.333333 -0.932256 -0.356068 -2.391095 0.282752 -0.504157 -7.088616
12.366667 -0.922641 -0.372962 -2.638384 0.287565 -0.509612 -6.625560
12.400000 -0.912813 -0.390218 -2.946999 0.292105 -0.515085 -6.008579
12.433333 -0.902926 -0.407646 3.028852 0.296447 -0.520464 -5.273985
12.466667 -0.892979 -0.425243 2.806221 0.300692 -0.525703 -4.482431
12.500000 -0.882972 -0.443008 2.672140 0.304972 -0.530763 -3.695240
12.533333 -0.872837 -0.460827 2.625953 0.309423 -0.535647 -2.961668
12.566667 -0.862524 -0.478738 2.641000 0.314195 -0.540390 -2.312807
12.600000 -0.851969 -0.496767 2.696630 0.319370 -0.545056 -1.782683
12.633333 -0.841353 -0.514949 2.736258 0.324989 -0.549708 -1.391344
12.666667 -0.830677 -0.533282 2.741937 0.331029 -0.554395 -1.133972
12.700000 -0.819942 -0.551763 2.717376 0.337483 -0.559168 -0.986662
12.733333 -0.808774 -0.570429 2.674684 0.344295 -0.564039 -0.918480
12.766667 -0.797164 -0.589298 2.611186 0.351382 -0.568995 -0.890021
12.800000 -0.785112 -0.608387 2.527124 0.358714 -0.573993 -0.851283
12.833333 -0.773005 -0.627610 2.458766 0.366256 -0.578970 -0.760713
12.866667 -0.760457 -0.647068 2.417190 0.373972 -0.583865 -0.596972
12.900000 -0.747856 -0.666653 2.377066 0.381758 -0.588605 -0.359668
12.933333 -0.735206 -0.686361 2.354165 0.389550 -0.593120 -0.059162
12.966667 -0.722105 -0.706282 2.355257 0.397306 -0.597350 0.280173
13.000000 -0.708960 -0.726320 2.359127 0.404980 -0.601243 0.629010
13.033333 -0.695359 -0.746534 2.414854 0.412471 -0.604739 0.961234
13.066667 -0.681303 -0.766887 2.457760 0.419708 -0.607797 1.268422
13.100000 -0.667213 -0.787345 2.534079 0.426674 -0.610391 1.550162
13.133333 -0.652691 -0.807859 2.627044 0.433293 -0.612537 1.816475
13.166667 -0.637754 -0.828387 2.736416 0.439502 -0.614271 2.079325
13.200000 -0.622796 -0.849010 2.808724 0.445207 -0.615656 2.351973
13.233333 -0.607820 -0.869722 2.868140 0.450399 -0.616801 2.649368
13.266667 -0.592568 -0.890343 2.887519 0.455081 -0.617825 2.976556
13.300000 -0.577309 -0.911047 2.930911 0.459219 -0.618824 3.332331
13.333333 -0.561863 -0.931613 3.015460 0.462825 -0.619873 3.701402
13.366667 -0.546301 -0.952003 -3.131381 0.465890 -0.621026 4.064203
13.400000 -0.530747 -0.972466 -2.959992 0.468420 -0.622319 4.387253
13.433333 -0.514974 -0.993146 -2.769802 0.470348 -0.623738 4.631059
13.466667 -0.499047 -1.013985 -2.557638 0.471573 -0.625223 4.750204
13.500000 -0.483039 -1.034932 -2.359897 0.472005 -0.626718 4.712401
13.533333 -0.467063 -1.055938 -2.144152 0.471532 -0.628141 4.500076
13.566667 -0.451125 -1.077000 -1.921834 0.470059 -0.629402 4.111293
13.600000 -0.435232 -1.098114 -1.698809 0.467490 -0.630411 3.564783
13.633333 -0.419388 -1.119276 -1.541705 0.463795 -0.631124 2.892583
13.666667 -0.403601 -1.140484 -1.444507 0.458983 -0.631549 2.140069
13.700000 -0.388166 -1.161578 -1.408548 0.453107 -0.631712 1.352592
13.733333 -0.372798 -1.182711 -1.432703 0.446238 -0.631673 0.576911
13.766667 -0.357857 -1.203751 -1.471263 0.438509 -0.631513 -0.145374
13.800000 -0.343368 -1.224721 -1.525281 0.430057 -0.631328 -0.779480
13.833333 -0.328962 -1.245719 -1.601455 0.421010 -0.631197 -1.303225
13.866667 -0.315027 -1.266692 -1.690462 0.411548 -0.631181 -1.703371
13.900000 -0.301577 -1.287660 -1.780552 0.401801 -0.631320 -1.979044
13.933333 -0.288222 -1.308645 -1.867258 0.391911 -0.631649 -2.139371
13.966667 -0.275356 -1.329661 -1.946115 0.381938 -0.632187 -2.200854
14.000000 -0.262978 -1.350721 -2.040425 0.371969 -0.632917 -2.182397
14.033333 -0.250704 -1.371789 -2.121790 0.362094 -0.633819 -2.101049
14.066667 -0.238906 -1.392915 -2.206983 0.352326 -0.634870 -1.974194
14.100000 -0.227217 -1.414044 -2.270792 0.342679 -0.636040 -1.816568
14.133333 -0.215970 -1.435248 -2.331312 0.333197 -0.637288 -1.640944
14.166667 -0.205154 -1.456531 -2.384483 0.323946 -0.638575 -1.456799
14.200000 -0.194450 -1.477805 -2.431472 0.314927 -0.639881 -1.273254
14.233333 -0.184140 -1.499156 -2.471796 0.306172 -0.641171 -1.097964
14.266667 -0.174203 -1.520584 -2.485368 0.297733 -0.642399 -0.936883
14.300000 -0.164616 -1.542083 -2.500317 0.289692 -0.643522 -0.791042
14.333333 -0.155143 -1.563558 -2.524758 0.282070 -0.644511 -0.660668
14.366667 -0.145982 -1.585094 -2.528739 0.274887 -0.645329 -0.545598
14.400000 -0.137107 -1.606689 -2.547007 0.268204 -0.645943 -0.444347
14.433333 -0.128345 -1.628247 -2.570782 0.262020 -0.646342 -0.353933
14.466667 -0.119834 -1.649868 -2.577283 0.256319 -0.646534 -0.271011
14.500000 -0.111557 -1.671549 -2.591095 0.251053 -0.646536 -0.192885
14.533333 -0.103390 -1.693181 -2.601315 0.246199 -0.646358 -0.119633
14.566667 -0.095333 -1.714759 -2.601718 0.241718 -0.646039 -0.049545
14.600000 -0.087384 -1.736278 -2.594918 0.237546 -0.645625 0.016838
14.633333 -0.079542 -1.757733 -2.591936 0.233642 -0.645152 0.076799
14.666667 -0.071855 -1.779237 -2.584189 0.229969 -0.644635 0.129528
14.700000 -0.064272 -1.800668 -2.571407 0.226489 -0.644112 0.171718
14.733333 -0.056815 -1.822154 -2.568204 0.223165 -0.643597 0.205511
14.766667 -0.049459 -1.843556 -2.553705 0.219974 -0.643084 0.229958
14.800000 -0.042210 -1.865006 -2.546276 0.216909 -0.642538 0.247399
14.833333 -0.035058 -1.886363 -2.531883 0.213963 -0.641937 0.259516
14.866667 -0.028002 -1.907763 -2.532695 0.211131 -0.641268 0.268425
14.900000 -0.021035 -1.929204 -2.518422 0.208416 -0.640470 0.276662
14.933333 -0.014154 -1.950683 -2.511917 0.205815 -0.639504 0.282395
14.966667 -0.007363 -1.972047 -2.504929 0.203322 -0.638331 0.285729
15.000000 -0.000659 -1.993290 -2.499411 0.200931 -0.636947 0.284612
15.033333 0.005980 -2.014575 -2.487836 0.198631 -0.635323 0.280723
15.066667 0.012534 -2.035727 -2.472283 0.196413 -0.633443 0.271259
15.100000 0.019039 -2.056911 -2.456606 0.194270 -0.631317 0.254214
15.133333 0.025463 -2.077950 -2.443146 0.192199 -0.628987 0.230800
15.166667 0.031839 -2.099013 -2.438836 0.190191 -0.626458 0.203779
15.200000 0.038140 -2.119918 -2.432638 0.188240 -0.623727 0.175425
15.233333 0.044368 -2.140660 -2.418558 0.186342 -0.620796 0.144431
15.266667 0.050524 -2.161231 -2.418747 0.184492 -0.617656 0.115351
15.300000 0.056636 -2.181825 -2.422811 0.182690 -0.614296 0.092356
15.333333 0.062681 -2.202236 -2.429568 0.180929 -0.610657 0.077480
15.366667 0.068679 -2.222678 -2.421997 0.179214 -0.606726 0.066889
15.400000 0.074615 -2.242923 -2.423869 0.177545 -0.602486 0.060040
15.433333 0.080490 -2.262964 -2.431409 0.175929 -0.597942 0.058186
15.466667 0.086325 -2.283011 -2.429161 0.174369 -0.593080 0.056597
15.500000 0.092104 -2.302840 -2.414977 0.172868 -0.587905 0.050059
15.533333 0.097828 -2.322444 -2.412078 0.171435 -0.582440 0.034828
15.566667 0.103502 -2.341816 -2.411619 0.170070 -0.576702 0.013313
15.600000 0.109125 -2.360950 -2.398999 0.168778 -0.570704 -0.017251
15.633333 0.114702 -2.379837 -2.399261 0.167558 -0.564444 -0.057025
15.666667 0.120234 -2.398472 -2.397336 0.166414 -0.557968 -0.103434
15.700000 0.125747 -2.417035 -2.404976 0.165351 -0.551296 -0.151636
15.733333 0.131220 -2.435330 -2.407701 0.164370 -0.544451 -0.198664
15.766667 0.136685 -2.453522 -2.423421 0.163476 -0.537446 -0.243348
15.800000 0.142113 -2.471434 -2.434894 0.162672 -0.530293 -0.278317
15.833333 0.147508 -2.489057 -2.452474 0.161964 -0.523003 -0.303143
15.866667 0.152871 -2.506385 -2.465911 0.161358 -0.515555 -0.316242
15.900000 0.158205 -2.523411 -2.476842 0.160858 -0.507937 -0.316520
15.933333 0.163512 -2.540128 -2.495804 0.160467 -0.500138 -0.303099
15.966667 0.168821 -2.556659 -2.500751 0.160194 -0.492149 -0.276291
16.000000 0.174130 -2.572993 -2.508176 0.160048 -0.483951 -0.241664
16.033333 0.179447 -2.589115 -2.525026 0.160033 -0.475510 -0.198409
16.066667 0.184745 -2.604900 -2.533521 0.160141 -0.466796 -0.148522
16.100000 0.190063 -2.620431 -2.542753 0.160373 -0.457756 -0.096658
16.133333 0.195366 -2.635611 -2.528092 0.160735 -0.448327 -0.047104
16.166667 0.200708 -2.650506 -2.541726 0.161232 -0.438443 -0.000903
16.200000 0.206094 -2.665097 -2.541140 0.161854 -0.428060 0.042745
16.233333 0.211472 -2.679315 -2.525585 0.162613 -0.417139 0.079422
16.266667 0.216842 -2.693153 -2.529229 0.163534 -0.405628 0.108580
16.300000 0.222277 -2.706609 -2.513546 0.164630 -0.393507 0.130098
16.333333 0.227782 -2.719648 -2.503938 0.165903 -0.380748 0.147614
16.366667 0.233284 -2.732288 -2.498503 0.167351 -0.367353 0.159429
16.400000 0.238786 -2.744521 -2.493562 0.168987 -0.353319 0.164456
16.433333 0.244377 -2.756242 -2.496455 0.170790 -0.338681 0.167640
16.466667 0.250063 -2.767429 -2.496849 0.172730 -0.323482 0.169407
16.500000 0.255856 -2.778044 -2.488208 0.174783 -0.307766 0.172672
16.533333 0.261653 -2.788229 -2.470112 0.176919 -0.291617 0.178665
16.566667 0.267582 -2.797764 -2.466932 0.179099 -0.275120 0.190350
16.600000 0.273651 -2.806604 -2.464311 0.181291 -0.258327 0.208361
16.633333 0.279727 -2.815000 -2.463890 0.183487 -0.241257 0.229363
16.666667 0.285975 -2.822612 -2.456053 0.185675 -0.223953 0.251780
16.700000 0.292232 -2.829770 -2.447086 0.187873 -0.206393 0.270604
16.733333 0.298498 -2.836471 -2.437193 0.190132 -0.188489 0.274500
16.766667 0.304773 -2.842710 -2.427791 0.192521 -0.170120 0.249540
16.800000 0.311282 -2.847991 -2.423983 0.195095 -0.151229 0.184889
16.833333 0.317801 -2.852803 -2.417211 0.197906 -0.131769 0.068436
16.866667 0.324330 -2.857145 -2.372849 0.201021 -0.111677 -0.112602
16.900000 0.330870 -2.861013 -2.349319 0.204461 -0.090985 -0.366697
16.933333 0.337656 -2.863824 -2.346680 0.208183 -0.069850 -0.692412
16.966667 0.344452 -2.866157 -2.349337 0.212133 -0.048450 -1.077836
17.000000 0.351503 -2.867479 -2.358246 0.216236 -0.026917 -1.509688
17.033333 0.358809 -2.867821 -2.397869 0.220397 -0.005387 -1.966289
17.066667 0.366379 -2.867220 -2.469690 0.224453 0.015975 -2.419163
17.100000 0.373956 -2.866139 -2.590252 0.228266 0.037046 -2.834259
17.133333 0.381815 -2.864222 -2.721393 0.231732 0.057810 -3.182219
17.166667 0.389679 -2.861829 -2.878378 0.234742 0.078276 -3.440732
17.200000 0.397826 -2.858725 -3.025118 0.237208 0.098431 -3.591622
17.233333 0.405975 -2.855148 3.084612 0.239076 0.118292 -3.623447
17.266667 0.414122 -2.851101 2.914809 0.240357 0.137923 -3.535399
17.300000 0.422268 -2.846584 2.774814 0.241050 0.157406 -3.343210
17.333333 0.430407 -2.841122 2.655340 0.241182 0.176792 -3.065980
17.366667 0.438527 -2.834756 2.551453 0.240786 0.196061 -2.726738
17.400000 0.446599 -2.827527 2.455867 0.239916 0.215203 -2.347271
17.433333 0.454660 -2.819844 2.398538 0.238610 0.234175 -1.956555
17.466667 0.462709 -2.811709 2.356545 0.236894 0.252898 -1.578914
17.500000 0.470650 -2.802832 2.322550 0.234811 0.271246 -1.228691
17.533333 0.478576 -2.793514 2.307761 0.232381 0.289142 -0.917484
17.566667 0.486368 -2.783522 2.306834 0.229635 0.306562 -0.651764
17.600000 0.494015 -2.772890 2.290295 0.226595 0.323491 -0.437433
17.633333 0.501515 -2.761643 2.284963 0.223306 0.339900 -0.269149
17.666667 0.508993 -2.749979 2.287048 0.219819 0.355760 -0.138991
17.700000 0.516321 -2.737747 2.290110 0.216177 0.371080 -0.040052
17.733333 0.523492 -2.724979 2.307554 0.212432 0.385808 0.036132
17.766667 0.530504 -2.711706 2.311833 0.208628 0.399894 0.097682
17.800000 0.537353 -2.697953 2.308237 0.204808 0.413283 0.152480
17.833333 0.544037 -2.683750 2.308233 0.200996 0.425956 0.205052
17.866667 0.550693 -2.669172 2.308234 0.197222 0.437910 0.255717
17.900000 0.557189 -2.654209 2.320556 0.193518 0.449145 0.305719
17.933333 0.563526 -2.638895 2.327306 0.189924 0.459698 0.354994
17.966667 0.569833 -2.623230 2.336768 0.186468 0.469609 0.402098
18.000000 0.575992 -2.607261 2.357434 0.183181 0.478938 0.442375
18.033333 0.582009 -2.591018 2.376706 0.180089 0.487729 0.471920
18.066667 0.587892 -2.574525 2.403718 0.177219 0.496032 0.488788
18.100000 0.593649 -2.557802 2.425020 0.174591 0.503897 0.489362
18.133333 0.599297 -2.540878 2.449561 0.172219 0.511350 0.471140
18.166667 0.604915 -2.523650 2.471821 0.170122 0.518412 0.432734
18.200000 0.610503 -2.506127 2.474440 0.168305 0.525079 0.378940
18.233333 0.616025 -2.488457 2.500104 0.166772 0.531359 0.311266
18.266667 0.621518 -2.470508 2.510443 0.165510 0.537227 0.233645
18.300000 0.626967 -2.452437 2.523359 0.164499 0.542677 0.150739
18.333333 0.632388 -2.434102 2.521153 0.163708 0.547698 0.067535
18.366667 0.637793 -2.415682 2.523288 0.163104 0.552293 -0.012413
18.400000 0.643171 -2.397012 2.513623 0.162661 0.556469 -0.087387
18.433333 0.648551 -2.378281 2.501991 0.162349 0.560231 -0.152346
18.466667 0.653937 -2.359499 2.494128 0.162134 0.563638 -0.205773
18.500000 0.659340 -2.340667 2.489601 0.161990 0.566731 -0.247122
18.533333 0.664717 -2.321617 2.475895 0.161891 0.569579 -0.275029
18.566667 0.670115 -2.302543 2.463113 0.161808 0.572255 -0.287384
18.600000 0.675534 -2.283454 2.444698 0.161709 0.574850 -0.285576
18.633333 0.680927 -2.264167 2.434318 0.161571 0.577453 -0.271014
18.666667 0.686332 -2.244886 2.423578 0.161375 0.580110 -0.242999
18.700000 0.691746 -2.225620 2.411334 0.161104 0.582867 -0.201162
18.733333 0.697135 -2.206173 2.412496 0.160742 0.585741 -0.150665
18.766667 0.702513 -2.186753 2.401620 0.160278 0.588730 -0.094770
18.800000 0.707867 -2.167165 2.391101 0.159705 0.591789 -0.035025
18.833333 0.713198 -2.147416 2.379499 0.159005 0.594864 0.026788
18.866667 0.718507 -2.127512 2.397475 0.158163 0.597895 0.085366
18.900000 0.723793 -2.107459 2.408045 0.157168 0.600805 0.136364
18.933333 0.729057 -2.087262 2.410951 0.156013 0.603532 0.180758
18.966667 0.734299 -2.066928 2.423613 0.154678 0.605986 0.214980
19.000000 0.739467 -2.046621 2.444704 0.153160 0.608127 0.236660
19.033333 0.744613 -2.026187 2.446033 0.151463 0.609928 0.242948
19.066667 0.749668 -2.005784 2.457160 0.149605 0.611398 0.234687
19.100000 0.754703 -1.985267 2.468208 0.147603 0.612565 0.215706
19.133333 0.759632 -1.964766 2.470940 0.145490 0.613472 0.187584
19.166667 0.764450 -1.944289 2.483262 0.143318 0.614207 0.156775
19.200000 0.769153 -1.923840 2.503953 0.141118 0.614821 0.126722
19.233333 0.773837 -1.903297 2.496571 0.138933 0.615376 0.102212
19.266667 0.778402 -1.882787 2.499456 0.136793 0.615907 0.087216
19.300000 0.782848 -1.862316 2.489784 0.134738 0.616461 0.080925
19.333333 0.787278 -1.841765 2.487637 0.132780 0.617045 0.081684
19.366667 0.791595 -1.821253 2.479556 0.130933 0.617659 0.086236
19.400000 0.795899 -1.800671 2.474407 0.129218 0.618307 0.095083
19.433333 0.800190 -1.780023 2.481911 0.127645 0.618979 0.103509
19.466667 0.804469 -1.759312 2.493602 0.126214 0.619655 0.106214
19.500000 0.808632 -1.738627 2.516761 0.124916 0.620304 0.099767
19.533333 0.812683 -1.717971 2.519058 0.123765 0.620923 0.083811
19.566667 0.816725 -1.697265 2.526371 0.122758 0.621496 0.057244
19.600000 0.820761 -1.676514 2.541633 0.121891 0.622009 0.018018
19.633333 0.824791 -1.655722 2.533132 0.121161 0.622461 -0.029150
19.666667 0.828772 -1.634972 2.529058 0.120578 0.622868 -0.080054
19.700000 0.832750 -1.614189 2.525886 0.120140 0.623243 -0.128771
19.733333 0.836726 -1.593375 2.513232 0.119828 0.623576 -0.170984
19.766667 0.840692 -1.572610 2.502947 0.119628 0.623875 -0.204376
19.800000 0.844660 -1.551822 2.492049 0.119536 0.624141 -0.225874
19.833333 0.848629 -1.531015 2.479925 0.119550 0.624360 -0.236254
19.866667 0.852602 -1.510192 2.465139 0.119671 0.624500 -0.235757
19.900000 0.856579 -1.489356 2.458196 0.119905 0.624536 -0.226234
19.933333 0.860561 -1.468511 2.452269 0.120277 0.624440 -0.212281
19.966667 0.864551 -1.447659 2.450099 0.120808 0.624174 -0.194713
20.000000 0.868549 -1.426806 2.438940 0.121518 0.623708 -0.174045
20.033333 0.872555 -1.405952 2.435120 0.122410 0.623027 -0.152501
20.066667 0.876572 -1.385103 2.442008 0.123479 0.622134 -0.132646
20.100000 0.880600 -1.364261 2.426127 0.124727 0.621027 -0.114433
20.133333 0.884717 -1.343512 2.417215 0.126135 0.619726 -0.095496
20.166667 0.888927 -1.322858 2.426255 0.127689 0.618259 -0.074903
20.200000 0.893235 -1.302299 2.416969 0.129365 0.616657 -0.054331
20.233333 0.897558 -1.281758 2.421825 0.131147 0.614947 -0.033267
20.266667 0.901988 -1.261321 2.416890 0.133017 0.613154 -0.008736
20.300000 0.906434 -1.240907 2.408017 0.134951 0.611311 0.016413
20.333333 0.910999 -1.220585 2.415832 0.136949 0.609428 0.039200
20.366667 0.915581 -1.200291 2.421323 0.139015 0.607512 0.057768
20.400000 0.920180 -1.180028 2.415520 0.141159 0.605556 0.070439
20.433333 0.924906 -1.159862 2.424449 0.143376 0.603564 0.077317
20.466667 0.929650 -1.139731 2.426373 0.145682 0.601522 0.076417
20.500000 0.934527 -1.119704 2.438778 0.148076 0.599422 0.068216
20.533333 0.939545 -1.099778 2.445324 0.150538 0.597267 0.056485
20.566667 0.944579 -1.079895 2.453825 0.153025 0.595070 0.042778
20.600000 0.949631 -1.060055 2.453675 0.155497 0.592846 0.030888
20.633333 0.954838 -1.040314 2.448442 0.157920 0.590606 0.019994
20.666667 0.960201 -1.020677 2.441194 0.160242 0.588368 0.012391
20.700000 0.965725 -1.001149 2.437824 0.162420 0.586149 0.010169
20.733333 0.971264 -0.981670 2.424581 0.164445 0.583950 0.012812
20.766667 0.976817 -0.962244 2.432721 0.166324 0.581766 0.018782
20.800000 0.982382 -0.942870 2.433088 0.168060 0.579593 0.025327
20.833333 0.988099 -0.923612 2.433711 0.169676 0.577422 0.035449
20.866667 0.993827 -0.904409 2.444512 0.171218 0.575235 0.044679
20.900000 0.999563 -0.885264 2.450599 0.172744 0.573008 0.052868
20.933333 1.005307 -0.866177 2.465254 0.174297 0.570729 0.055494
20.966667 1.011058 -0.847150 2.444925 0.175917 0.568384 0.057238
21.000000 1.016813 -0.828184 2.457337 0.177658 0.565954 0.056833
21.033333 1.022727 -0.809333 2.451836 0.179549 0.563433 0.052111
21.066667 1.028801 -0.790605 2.455971 0.181608 0.560815 0.046471
21.100000 1.034876 -0.771941 2.449697 0.183821 0.558109 0.039099
21.133333 1.040948 -0.753341 2.454086 0.186174 0.555321 0.035249
21.166667 1.047186 -0.734874 2.461335 0.188654 0.552462 0.026733
21.200000 1.053417 -0.716474 2.459370 0.191217 0.549551 0.017566
21.233333 1.059824 -0.698198 2.471202 0.193829 0.546602 0.006756
21.266667 1.066412 -0.680049 2.462083 0.196438 0.543635 -0.005159
21.300000 1.072987 -0.661969 2.471528 0.199004 0.540664 -0.019756
21.333333 1.079738 -0.644015 2.461970 0.201457 0.537712 -0.037700
21.366667 1.086471 -0.626130 2.458791 0.203733 0.534794 -0.052645
21.400000 1.093375 -0.608376 2.458516 0.205783 0.531924 -0.066891
21.433333 1.100254 -0.590693 2.456121 0.207575 0.529111 -0.078107
21.466667 1.107300 -0.573124 2.458620 0.209111 0.526356 -0.088770
21.500000 1.114512 -0.555672 2.441557 0.210382 0.523664 -0.094212
21.533333 1.121689 -0.538292 2.439843 0.211431 0.521027 -0.096632
21.566667 1.128828 -0.520982 2.437759 0.212285 0.518444 -0.098267
21.600000 1.135923 -0.503745 2.439057 0.212976 0.515909 -0.097308
21.633333 1.142972 -0.486580 2.431603 0.213527 0.513421 -0.094405
21.666667 1.149971 -0.469486 2.434028 0.213952 0.510980 -0.087939
21.700000 1.157075 -0.452498 2.428625 0.214270 0.508584 -0.083231
21.733333 1.164285 -0.435605 2.423222 0.214471 0.506244 -0.078420
21.766667 1.171433 -0.418784 2.418637 0.214542 0.503968 -0.072377
21.800000 1.178655 -0.402045 2.416660 0.214454 0.501778 -0.067680
21.833333 1.185936 -0.385384 2.417937 0.214157 0.499689 -0.064670
21.866667 1.193142 -0.368795 2.415683 0.213592 0.497727 -0.063983
21.900000 1.200369 -0.352269 2.406632 0.212704 0.495909 -0.059445
21.933333 1.207514 -0.335815 2.419123 0.211463 0.494237 -0.053232
21.966667 1.214637 -0.319407 2.413403 0.209827 0.492714 -0.045186
22.000000 1.221668 -0.303071 2.415879 0.207773 0.491339 -0.032998
22.033333 1.228648 -0.286765 2.400226 0.205284 0.490123 -0.015820
22.066667 1.235550 -0.270480 2.404084 0.202335 0.489072 0.007996
22.100000 1.242350 -0.254207 2.401320 0.198888 0.488207 0.032978
22.133333 1.249024 -0.237933 2.395941 0.194896 0.487552 0.064201
22.166667 1.255583 -0.221734 2.398781 0.190323 0.487132 0.100455
22.200000 1.261962 -0.205515 2.393456 0.185124 0.486968 0.141728
22.233333 1.268217 -0.189371 2.419686 0.179253 0.487074 0.185494
22.266667 1.274344 -0.173304 2.425098 0.172701 0.487456 0.228631
22.300000 1.280209 -0.157184 2.431887 0.165468 0.488107 0.269924
22.333333 1.285791 -0.140996 2.444084 0.157566 0.489017 0.299817
22.366667 1.291055 -0.124726 2.440001 0.149017 0.490161 0.315895
22.400000 1.295968 -0.108364 2.457420 0.139848 0.491512 0.311752
22.433333 1.300501 -0.091904 2.469834 0.130099 0.493023 0.286576
22.466667 1.304885 -0.075526 2.501908 0.119790 0.494660 0.238355
22.500000 1.308834 -0.059033 2.513448 0.108986 0.496363 0.171210
22.533333 1.312319 -0.042424 2.530801 0.097754 0.498072 0.096152
22.566667 1.315329 -0.025687 2.548320 0.086156 0.499744 0.018911
22.600000 1.318181 -0.009041 2.546447 0.074219 0.501360 -0.047626
22.633333 1.320499 0.007740 2.533732 0.062027 0.502885 -0.088918
22.666667 1.322656 0.024427 2.513236 0.049664 0.504284 -0.087922
22.700000 1.324213 0.041254 2.485076 0.037183 0.505546 -0.033781
22.733333 1.325129 0.058226 2.461254 0.024637 0.506659 0.078344
22.766667 1.325354 0.075359 2.434934 0.012161 0.507576 0.258518
22.800000 1.325417 0.092384 2.414722 -0.000022 0.508198 0.508327
22.833333 1.325321 0.109300 2.421533 -0.011802 0.508462 0.818254
22.866667 1.325066 0.126102 2.468200 -0.023085 0.508294 1.170452
22.900000 1.323984 0.143121 2.497595 -0.033775 0.507618 1.547972
22.933333 1.322085 0.160369 2.545214 -0.043787 0.506344 1.934599
22.966667 1.320032 0.177491 2.638243 -0.053152 0.504436 2.301643
23.000000 1.317830 0.194485 2.724971 -0.061968 0.501885 2.624507
23.033333 1.315479 0.211344 2.837130 -0.070253 0.498672 2.882743
23.066667 1.312984 0.228065 2.962725 -0.077989 0.494804 3.067963
23.100000 1.310347 0.244644 3.104982 -0.085228 0.490314 3.167045
23.133333 1.307571 0.261077 -3.039130 -0.092066 0.485290 3.167426
23.166667 1.304384 0.277239 -2.896322 -0.098534 0.479809 3.072912
23.200000 1.300833 0.293131 -2.797073 -0.104617 0.473962 2.891718
23.233333 1.297153 0.308865 -2.685693 -0.110309 0.467835 2.637170
23.266667 1.293191 0.324344 -2.563155 -0.115609 0.461512 2.318284
23.300000 1.289109 0.339658 -2.489115 -0.120471 0.455062 1.955079
23.333333 1.284837 0.354726 -2.428478 -0.124781 0.448510 1.570949
23.366667 1.280439 0.369547 -2.395444 -0.128452 0.441856 1.186144
23.400000 1.275932 0.384190 -2.372556 -0.131466 0.435089 0.813322
23.433333 1.271383 0.398579 -2.364119 -0.133821 0.428201 0.465636
23.466667 1.266735 0.412784 -2.375390 -0.135517 0.421151 0.158721
23.500000 1.261990 0.426801 -2.393444 -0.136528 0.413876 -0.101887
23.533333 1.257305 0.440534 -2.407102 -0.136891 0.406329 -0.313451
23.566667 1.252709 0.453971 -2.430049 -0.136682 0.398497 -0.479554
23.600000 1.248030 0.467211 -2.457300 -0.135941 0.390372 -0.599892
23.633333 1.243271 0.480252 -2.492682 -0.134730 0.381949 -0.678803
23.666667 1.238674 0.492946 -2.526920 -0.133143 0.373259 -0.725205
23.700000 1.234245 0.505278 -2.553617 -0.131321 0.364354 -0.744613
23.733333 1.229747 0.517401 -2.578543 -0.129333 0.355244 -0.742499
23.766667 1.225451 0.529136 -2.601822 -0.127201 0.345905 -0.721548
23.800000 1.221367 0.540457 -2.622327 -0.124971 0.336329 -0.686930
23.833333 1.217501 0.551342 -2.658982 -0.122694 0.326519 -0.639615
23.866667 1.213577 0.562010 -2.679196 -0.120387 0.316466 -0.582729
23.900000 1.209598 0.572461 -2.703732 -0.118041 0.306162 -0.517402
23.933333 1.205567 0.582693 -2.710081 -0.115685 0.295642 -0.446775
23.966667 1.201485 0.592704 -2.726591 -0.113357 0.284964 -0.374150
24.000000 1.197609 0.602207 -2.736548 -0.111055 0.274164 -0.301504
24.033333 1.193934 0.611195 -2.757193 -0.108737 0.263254 -0.236244
24.066667 1.190448 0.619669 -2.766028 -0.106403 0.252286 -0.178727
24.100000 1.187146 0.627632 -2.764972 -0.104068 0.241326 -0.131455
24.133333 1.183802 0.635371 -2.757898 -0.101749 0.230443 -0.093639
24.166667 1.180417 0.642886 -2.736729 -0.099455 0.219690 -0.066691
24.200000 1.177191 0.649932 -2.736670 -0.097212 0.209133 -0.049226
24.233333 1.173927 0.656755 -2.744055 -0.095051 0.198835 -0.035614
24.266667 1.170810 0.663147 -2.749360 -0.092990 0.188827 -0.025956
24.300000 1.167655 0.669319 -2.755223 -0.091003 0.179094 -0.017291
24.333333 1.164633 0.675095 -2.754660 -0.089076 0.169634 -0.008766
24.366667 1.161732 0.680501 -2.767411 -0.087221 0.160471 0.005266
24.400000 1.158945 0.685557 -2.764267 -0.085454 0.151624 0.023456
24.433333 1.156121 0.690399 -2.764973 -0.083788 0.143125 0.042586
24.466667 1.153398 0.694930 -2.762453 -0.082222 0.135000 0.063764
24.500000 1.150760 0.699177 -2.761249 -0.080794 0.127312 0.085499
24.533333 1.148205 0.703155 -2.751130 -0.079520 0.120093 0.107916
24.566667 1.145611 0.706926 -2.732969 -0.078393 0.113351 0.124658
24.600000 1.142979 0.710491 -2.735815 -0.077397 0.107077 0.138849
24.633333 1.140401 0.713852 -2.726822 -0.076535 0.101252 0.151490
24.666667 1.137867 0.717030 -2.726168 -0.075821 0.095845 0.163021
24.700000 1.135371 0.720040 -2.721736 -0.075255 0.090796 0.172333
24.733333 1.132908 0.722898 -2.725185 -0.074839 0.086032 0.179449
24.766667 1.130466 0.725619 -2.721298 -0.074593 0.081471 0.191619
