t x y theta dxdt dydt dthetadt
0.000000 0.000000 0.000000 -2.617559 -0.091381 -0.004328 -0.462233
0.033333 -0.002145 0.000187 -2.622157 -0.088455 -0.008422 -0.369543
0.066667 -0.004688 0.000003 -2.609398 -0.088010 -0.014129 -0.290957
0.100000 -0.006597 -0.000188 -2.614816 -0.091063 -0.021851 -0.235845
0.133333 -0.008187 -0.000389 -2.621486 -0.098488 -0.032032 -0.209494
0.166667 -0.010212 -0.000998 -2.623461 -0.110632 -0.044959 -0.211450
0.200000 -0.012685 -0.002028 -2.615441 -0.127597 -0.060977 -0.241872
0.233333 -0.015649 -0.003369 -2.615038 -0.149049 -0.080357 -0.289332
0.266667 -0.019511 -0.005260 -2.618119 -0.174718 -0.103510 -0.338761
0.300000 -0.024603 -0.008009 -2.620624 -0.203885 -0.130495 -0.379947
0.333333 -0.031446 -0.011910 -2.630783 -0.235567 -0.161040 -0.403122
0.366667 -0.040336 -0.017129 -2.669068 -0.268841 -0.194879 -0.401880
0.400000 -0.049739 -0.022839 -2.711154 -0.302807 -0.231487 -0.370167
0.433333 -0.060937 -0.030499 -2.749793 -0.336625 -0.270026 -0.312644
0.466667 -0.073723 -0.040263 -2.789023 -0.369388 -0.309343 -0.233277
0.500000 -0.087038 -0.050542 -2.788808 -0.400506 -0.348505 -0.138016
0.533333 -0.101519 -0.063256 -2.789114 -0.429700 -0.386698 -0.032065
0.566667 -0.116952 -0.078179 -2.757454 -0.456897 -0.423068 0.072205
0.600000 -0.133273 -0.094796 -2.733508 -0.482003 -0.456809 0.165029
0.633333 -0.150135 -0.111938 -2.717786 -0.505179 -0.487488 0.241489
0.666667 -0.167540 -0.129604 -2.707733 -0.526747 -0.515010 0.292445
0.700000 -0.185489 -0.147795 -2.678337 -0.546968 -0.539252 0.319551
0.733333 -0.204261 -0.166618 -2.679605 -0.566105 -0.560324 0.323545
0.766667 -0.223578 -0.185964 -2.678004 -0.584394 -0.578629 0.312004
0.800000 -0.243533 -0.205836 -2.655914 -0.602212 -0.594778 0.291703
0.833333 -0.264034 -0.226228 -2.657432 -0.619815 -0.609310 0.269913
0.866667 -0.285081 -0.247140 -2.647192 -0.637448 -0.622629 0.253294
0.900000 -0.306464 -0.268101 -2.630807 -0.655376 -0.635184 0.238683
0.933333 -0.328393 -0.289577 -2.634105 -0.673959 -0.647317 0.221433
0.966667 -0.350952 -0.311301 -2.628153 -0.693621 -0.659207 0.196521
1.000000 -0.374102 -0.333337 -2.632182 -0.714640 -0.670945 0.161053
1.033333 -0.397794 -0.355886 -2.604615 -0.737299 -0.682600 0.106483
1.066667 -0.422268 -0.378652 -2.596156 -0.761706 -0.694321 0.031754
1.100000 -0.447281 -0.401928 -2.601871 -0.787963 -0.706199 -0.055042
1.133333 -0.473594 -0.425750 -2.593760 -0.815854 -0.718302 -0.143158
1.166667 -0.500440 -0.450078 -2.567840 -0.844933 -0.730628 -0.223438
1.200000 -0.528764 -0.474492 -2.567136 -0.874737 -0.743177 -0.289203
1.233333 -0.557612 -0.499410 -2.590647 -0.904803 -0.755951 -0.326535
1.266667 -0.588706 -0.524710 -2.640794 -0.934642 -0.768875 -0.326105
1.300000 -0.621796 -0.550386 -2.694479 -0.963536 -0.781758 -0.284273
1.333333 -0.655388 -0.576562 -2.733946 -0.990883 -0.794248 -0.203190
1.366667 -0.689474 -0.603236 -2.744292 -1.016182 -0.806097 -0.083465
1.400000 -0.724042 -0.630405 -2.753507 -1.039093 -0.817007 0.071060
1.433333 -0.759484 -0.658341 -2.740065 -1.059241 -0.826656 0.248894
1.466667 -0.795817 -0.686686 -2.706431 -1.076405 -0.834527 0.435112
1.500000 -0.832677 -0.714954 -2.682599 -1.090753 -0.840394 0.609838
1.533333 -0.869978 -0.743709 -2.658633 -1.102602 -0.844371 0.763841
1.566667 -0.907706 -0.772949 -2.618393 -1.112278 -0.846522 0.886505
1.600000 -0.945849 -0.802672 -2.582419 -1.120152 -0.846878 0.972880
1.633333 -0.983722 -0.831414 -2.514204 -1.126717 -0.845638 1.019912
1.666667 -1.020942 -0.858576 -2.481575 -1.132651 -0.843589 1.032541
1.700000 -1.058542 -0.886218 -2.443783 -1.138583 -0.841318 1.020637
1.733333 -1.096513 -0.914341 -2.417148 -1.145057 -0.839238 0.987570
1.766667 -1.134843 -0.942947 -2.376158 -1.152721 -0.837805 0.939275
1.800000 -1.172520 -0.969512 -2.331732 -1.162067 -0.837834 0.877473
1.833333 -1.210534 -0.996563 -2.321754 -1.173437 -0.839871 0.812170
1.866667 -1.248876 -1.024104 -2.289891 -1.186878 -0.843911 0.743876
1.900000 -1.287533 -1.052138 -2.278695 -1.202189 -0.849996 0.675328
1.933333 -1.327943 -1.079782 -2.253657 -1.219122 -0.858359 0.609848
1.966667 -1.368646 -1.107926 -2.230776 -1.237264 -0.869251 0.552020
2.000000 -1.409629 -1.136572 -2.203381 -1.256196 -0.882500 0.505675
2.033333 -1.452312 -1.165735 -2.196757 -1.275483 -0.898130 0.468936
2.066667 -1.495247 -1.195405 -2.186005 -1.294777 -0.916337 0.443884
2.100000 -1.539720 -1.226114 -2.179999 -1.313739 -0.937267 0.431723
2.133333 -1.584414 -1.257336 -2.172659 -1.332182 -0.960800 0.432814
2.166667 -1.629313 -1.289072 -2.160815 -1.349972 -0.986758 0.443350
2.200000 -1.674400 -1.321323 -2.144087 -1.366969 -1.015031 0.462777
2.233333 -1.719658 -1.354091 -2.148537 -1.383181 -1.045344 0.488472
2.266667 -1.765979 -1.388849 -2.123300 -1.398552 -1.077398 0.519132
2.300000 -1.813071 -1.425428 -2.086327 -1.413196 -1.110955 0.549754
2.333333 -1.860814 -1.463388 -2.076213 -1.426994 -1.145747 0.576701
2.366667 -1.909209 -1.502822 -2.043019 -1.439688 -1.181365 0.596855
2.400000 -1.957683 -1.542759 -2.032355 -1.451068 -1.217475 0.610063
2.433333 -2.006214 -1.583193 -2.012017 -1.460864 -1.253986 0.614677
2.466667 -2.055531 -1.625626 -1.984068 -1.468875 -1.290725 0.609466
2.500000 -2.105449 -1.670026 -1.954742 -1.474837 -1.327399 0.596575
2.533333 -2.155363 -1.714900 -1.942118 -1.478667 -1.363961 0.578138
2.566667 -2.205249 -1.760236 -1.926796 -1.480516 -1.400479 0.558851
2.600000 -2.255231 -1.807230 -1.902214 -1.480527 -1.436918 0.536981
2.633333 -2.305216 -1.855680 -1.880981 -1.478807 -1.472831 0.515023
2.666667 -2.354852 -1.905702 -1.873487 -1.475548 -1.507900 0.496968
2.700000 -2.403817 -1.957152 -1.856833 -1.470998 -1.542073 0.485208
2.733333 -2.452647 -2.008997 -1.838941 -1.465397 -1.575195 0.478856
2.766667 -2.501501 -2.063205 -1.825406 -1.458877 -1.606955 0.476258
2.800000 -2.550178 -2.117771 -1.813430 -1.451592 -1.637241 0.479027
2.833333 -2.598655 -2.172674 -1.804208 -1.443728 -1.666278 0.486963
2.866667 -2.646730 -2.229894 -1.791793 -1.435379 -1.694192 0.497763
2.900000 -2.694565 -2.287409 -1.770704 -1.426562 -1.721033 0.508086
2.933333 -2.742138 -2.345196 -1.748361 -1.417233 -1.746601 0.518780
2.966667 -2.789430 -2.403232 -1.730549 -1.407337 -1.771110 0.528582
3.000000 -2.836420 -2.461494 -1.706456 -1.396741 -1.794750 0.536070
3.033333 -2.882603 -2.521433 -1.685581 -1.385362 -1.817654 0.540209
3.066667 -2.928724 -2.584075 -1.676117 -1.373082 -1.840134 0.538819
3.100000 -2.974484 -2.646866 -1.654368 -1.359819 -1.862442 0.533184
3.133333 -3.019863 -2.709777 -1.634726 -1.345516 -1.885038 0.523151
3.166667 -3.064842 -2.772780 -1.627951 -1.330179 -1.908047 0.509793
3.200000 -3.109403 -2.835846 -1.593991 -1.313949 -1.931449 0.491995
3.233333 -3.153317 -2.900459 -1.584473 -1.296841 -1.955102 0.470831
3.266667 -3.196775 -2.965075 -1.568583 -1.278879 -1.978874 0.446551
3.300000 -3.239273 -3.030683 -1.555265 -1.260064 -2.002385 0.419666
3.333333 -3.280495 -3.097103 -1.530667 -1.240436 -2.025301 0.388739
3.366667 -3.321349 -3.165263 -1.523699 -1.219988 -2.047224 0.353067
3.400000 -3.361702 -3.235101 -1.513882 -1.198643 -2.067673 0.316268
3.433333 -3.401412 -3.306612 -1.504095 -1.176341 -2.086167 0.281751
3.466667 -3.440566 -3.377919 -1.490780 -1.152993 -2.102021 0.253018
3.500000 -3.479149 -3.448982 -1.488307 -1.128556 -2.114832 0.233763
3.533333 -3.517147 -3.519763 -1.474408 -1.102752 -2.123971 0.228903
3.566667 -3.554085 -3.591040 -1.477359 -1.075269 -2.129004 0.244203
3.600000 -3.589824 -3.662591 -1.479301 -1.045849 -2.129754 0.282706
3.633333 -3.624123 -3.733996 -1.472223 -1.014326 -2.126134 0.339899
3.666667 -3.657521 -3.806379 -1.471042 -0.980580 -2.117903 0.417484
3.700000 -3.690269 -3.878279 -1.476643 -0.944332 -2.104554 0.511848
3.733333 -3.722356 -3.949653 -1.464020 -0.905648 -2.085908 0.620012
3.766667 -3.752722 -4.020486 -1.424376 -0.864641 -2.061532 0.731989
3.800000 -3.781128 -4.090241 -1.405033 -0.821434 -2.030992 0.838292
3.833333 -3.808848 -4.159348 -1.358766 -0.776029 -1.993628 0.935528
3.866667 -3.834099 -4.226098 -1.326371 -0.728583 -1.949087 1.014676
3.900000 -3.857471 -4.291615 -1.280953 -0.679622 -1.897485 1.069703
3.933333 -3.880142 -4.356370 -1.220734 -0.629524 -1.838806 1.093668
3.966667 -3.900734 -4.418721 -1.195629 -0.578754 -1.773233 1.092029
4.000000 -3.918922 -4.478185 -1.144111 -0.527753 -1.700997 1.065081
4.033333 -3.934804 -4.534278 -1.099266 -0.477272 -1.622630 1.016575
4.066667 -3.949989 -4.589478 -1.061968 -0.427901 -1.538854 0.950392
4.100000 -3.962696 -4.639858 -1.032854 -0.380045 -1.450430 0.869654
4.133333 -3.974717 -4.689295 -1.005867 -0.334095 -1.357592 0.784552
4.166667 -3.984385 -4.733025 -0.994085 -0.290474 -1.261353 0.695260
4.200000 -3.991850 -4.771266 -0.975323 -0.249553 -1.162803 0.608958
4.233333 -3.998656 -4.808515 -0.945187 -0.211416 -1.062928 0.529419
4.266667 -4.004815 -4.844763 -0.937405 -0.176165 -0.962481 0.461672
4.300000 -4.009228 -4.874165 -0.916244 -0.143791 -0.862092 0.407982
4.333333 -4.013020 -4.902553 -0.908051 -0.114295 -0.763355 0.360435
4.366667 -4.015506 -4.923333 -0.905192 -0.087460 -0.667273 0.312405
4.400000 -4.017400 -4.943104 -0.898934 -0.062951 -0.574264 0.255634
4.433333 -4.018716 -4.961874 -0.913349 -0.040492 -0.485181 0.184844
4.466667 -4.019304 -4.973293 -0.893637 -0.019807 -0.401537 0.089020
4.500000 -4.019345 -4.983732 -0.877110 -0.000583 -0.324191 -0.031725
4.533333 -4.018856 -4.993208 -0.866502 0.017472 -0.253809 -0.171011
4.566667 -4.017932 -4.997056 -0.840553 0.034583 -0.190863 -0.319743
4.600000 -4.016511 -4.999977 -0.820895 0.050814 -0.136306 -0.467170
4.633333 -4.014608 -5.001995 -0.844298 0.066175 -0.090782 -0.606532
4.666667 -4.012068 -5.001986 -0.893213 0.080607 -0.053766 -0.719634
4.700000 -4.008859 -5.001156 -0.956432 0.093883 -0.025258 -0.797802
4.733333 -4.005219 -4.999493 -1.022232 0.105750 -0.004898 -0.835132
4.766667 -4.001167 -4.997024 -1.066392 0.115870 0.008135 -0.829098
4.800000 -3.996580 -4.995363 -1.124056 0.123902 0.014976 -0.779888
4.833333 -3.991616 -4.992946 -1.151766 0.129600 0.016949 -0.691665
4.866667 -3.986398 -4.991642 -1.171559 0.132820 0.015157 -0.578243
