t x y theta dxdt dydt dthetadt
0.000000 0.000000 0.000000 0.222306 0.086217 0.039185 -0.067604
0.033333 0.002853 0.001302 0.236711 0.084068 0.044368 -0.077611
0.066667 0.005746 0.002811 0.237165 0.080770 0.049560 -0.096855
0.100000 0.008801 0.004474 0.227769 0.075833 0.054426 -0.121105
0.133333 0.011905 0.006343 0.232238 0.068840 0.058604 -0.144712
0.166667 0.014868 0.008506 0.225350 0.059542 0.061772 -0.168890
0.200000 0.017659 0.010993 0.216816 0.047614 0.063713 -0.192879
0.233333 0.019992 0.013748 0.206448 0.032552 0.064248 -0.215773
0.266667 0.021764 0.016686 0.190251 0.013904 0.063231 -0.237159
0.300000 0.022568 0.019534 0.183780 -0.008298 0.060880 -0.259632
0.333333 0.022083 0.021827 0.170893 -0.034026 0.057595 -0.289517
0.366667 0.021491 0.024111 0.161955 -0.063385 0.053887 -0.323727
0.400000 0.020787 0.026387 0.144226 -0.096063 0.050362 -0.355025
0.433333 0.016760 0.027115 0.133809 -0.131114 0.047822 -0.378148
0.466667 0.012618 0.027837 0.173336 -0.167667 0.047124 -0.391957
0.500000 0.008358 0.028554 0.162800 -0.204973 0.048852 -0.391801
0.533333 0.000669 0.029077 0.121013 -0.242007 0.053321 -0.372402
0.566667 -0.009777 0.029831 0.082281 -0.277404 0.060623 -0.335222
0.600000 -0.020329 0.030587 0.033132 -0.309952 0.070592 -0.283593
0.633333 -0.032699 0.032164 0.014127 -0.339003 0.082599 -0.221973
0.666667 -0.046218 0.034755 0.008426 -0.363800 0.095819 -0.145741
0.700000 -0.060477 0.038377 0.026126 -0.383572 0.109290 -0.060475
0.733333 -0.075100 0.042939 0.038978 -0.398133 0.122081 0.026873
0.766667 -0.089887 0.048280 0.058325 -0.407791 0.133322 0.111449
0.800000 -0.104632 0.054174 0.063811 -0.413032 0.142293 0.186161
0.833333 -0.119184 0.060286 0.085028 -0.414392 0.148590 0.244566
0.866667 -0.133370 0.066317 0.085897 -0.412614 0.152029 0.279029
0.900000 -0.147565 0.072329 0.086549 -0.408712 0.152797 0.289675
0.933333 -0.160919 0.077608 0.091821 -0.403510 0.151310 0.281227
0.966667 -0.174261 0.082860 0.107223 -0.397649 0.148102 0.256671
1.000000 -0.187581 0.088082 0.121838 -0.391682 0.143744 0.221568
1.033333 -0.199987 0.092227 0.148652 -0.386052 0.138861 0.183353
1.066667 -0.212351 0.096335 0.156190 -0.381052 0.133986 0.146905
1.100000 -0.224664 0.100403 0.169419 -0.376787 0.129476 0.114954
1.133333 -0.236915 0.104430 0.168083 -0.373196 0.125490 0.086893
1.166667 -0.249095 0.108413 0.151014 -0.370080 0.122047 0.066838
1.200000 -0.261195 0.112349 0.134943 -0.367253 0.119123 0.057042
1.233333 -0.273543 0.116246 0.123555 -0.364213 0.116394 0.058612
1.266667 -0.285791 0.120091 0.132254 -0.360490 0.113547 0.068930
1.300000 -0.298119 0.123973 0.131833 -0.355629 0.110259 0.087565
1.333333 -0.310275 0.127762 0.145136 -0.349250 0.106269 0.113641
1.366667 -0.322302 0.131491 0.150178 -0.341187 0.101451 0.142680
1.400000 -0.334189 0.135160 0.162073 -0.331032 0.095521 0.168315
1.433333 -0.345927 0.138765 0.174880 -0.318826 0.088486 0.187261
1.466667 -0.357507 0.142303 0.178411 -0.304613 0.080358 0.199934
1.500000 -0.367724 0.145020 0.185211 -0.288570 0.071227 0.203718
1.533333 -0.377765 0.147668 0.200366 -0.270868 0.061176 0.197971
1.566667 -0.385706 0.149010 0.197022 -0.251643 0.050230 0.183890
1.600000 -0.393456 0.150281 0.199956 -0.231441 0.038636 0.166387
1.633333 -0.401010 0.151480 0.205543 -0.210624 0.026542 0.145308
1.666667 -0.408362 0.152609 0.214655 -0.189549 0.014095 0.121191
1.700000 -0.415507 0.153666 0.229516 -0.168257 0.001224 0.095517
1.733333 -0.419525 0.152758 0.228769 -0.146915 -0.012062 0.070826
1.766667 -0.423328 0.151782 0.240021 -0.125564 -0.025754 0.045357
1.800000 -0.426914 0.150739 0.232670 -0.104056 -0.039891 0.017798
1.833333 -0.430282 0.149632 0.220494 -0.082245 -0.054514 -0.008434
1.866667 -0.433430 0.148464 0.214703 -0.059985 -0.069662 -0.031073
1.900000 -0.435219 0.145996 0.221494 -0.037538 -0.085039 -0.045673
1.933333 -0.435844 0.142396 0.226859 -0.014992 -0.100408 -0.053211
1.966667 -0.436248 0.138745 0.219449 0.007250 -0.115415 -0.051844
2.000000 -0.436432 0.135050 0.219009 0.028668 -0.129649 -0.044326
2.033333 -0.435117 0.130294 0.207700 0.048635 -0.142615 -0.034071
2.066667 -0.432180 0.124519 0.199716 0.065921 -0.153470 -0.026067
2.100000 -0.429032 0.118718 0.200280 0.079062 -0.161365 -0.028462
2.133333 -0.424477 0.112021 0.194709 0.086529 -0.165487 -0.043754
2.166667 -0.419722 0.105313 0.199081 0.087293 -0.165262 -0.074913
2.200000 -0.414772 0.098605 0.212274 0.080430 -0.160196 -0.119610
2.233333 -0.409634 0.091903 0.239042 0.065242 -0.149968 -0.181425
2.266667 -0.404314 0.085217 0.239171 0.041816 -0.134720 -0.258264
2.300000 -0.401774 0.079979 0.222347 0.011474 -0.115212 -0.342798
2.333333 -0.399061 0.074772 0.190001 -0.024337 -0.092263 -0.427597
2.366667 -0.396178 0.069604 0.183805 -0.064407 -0.066579 -0.504747
2.400000 -0.398958 0.067699 0.163501 -0.107037 -0.039136 -0.567170
2.433333 -0.407994 0.069417 0.132399 -0.150044 -0.011143 -0.602024
2.466667 -0.416849 0.071185 0.093625 -0.190785 0.015964 -0.601989
2.500000 -0.425513 0.073002 0.054209 -0.227648 0.041285 -0.565172
2.533333 -0.433976 0.074867 0.029769 -0.259127 0.063993 -0.492791
2.566667 -0.442227 0.076779 0.007238 -0.283722 0.083266 -0.386474
2.600000 -0.455377 0.081668 -0.011107 -0.300484 0.098575 -0.250279
2.633333 -0.468290 0.086600 -0.023315 -0.309652 0.110025 -0.093069
2.666667 -0.480952 0.091569 -0.027645 -0.312318 0.118147 0.078105
2.700000 -0.493347 0.096572 -0.017056 -0.309332 0.123358 0.257568
2.733333 -0.505461 0.101603 0.004229 -0.300762 0.125800 0.437613
2.766667 -0.516635 0.106464 0.023501 -0.286738 0.125632 0.614726
2.800000 -0.525005 0.110277 0.047960 -0.267968 0.123330 0.784071
2.833333 -0.533055 0.114106 0.072158 -0.243999 0.118853 0.946600
2.866667 -0.540775 0.117947 0.122315 -0.213658 0.111926 1.104256
2.900000 -0.548156 0.121797 0.157624 -0.175316 0.102173 1.260462
2.933333 -0.555187 0.125653 0.211398 -0.128498 0.089723 1.419345
2.966667 -0.561859 0.129511 0.242868 -0.072181 0.074657 1.581667
3.000000 -0.568164 0.133368 0.298864 -0.004511 0.056634 1.748264
3.033333 -0.574092 0.137220 0.363978 0.075605 0.035800 1.916214
3.066667 -0.570170 0.137731 0.413950 0.167817 0.013001 2.079376
3.100000 -0.565866 0.138232 0.489952 0.270830 -0.010707 2.229123
3.133333 -0.561182 0.138724 0.559026 0.383606 -0.034235 2.364205
3.166667 -0.549148 0.136785 0.631637 0.503884 -0.056002 2.482290
3.200000 -0.530588 0.133050 0.762507 0.628672 -0.074189 2.578051
3.233333 -0.506101 0.128081 0.884360 0.754262 -0.087235 2.649210
3.266667 -0.476082 0.122465 0.970399 0.878157 -0.094215 2.697089
3.300000 -0.440404 0.116629 1.066666 0.997878 -0.094297 2.724759
3.333333 -0.404473 0.110806 1.149779 1.110694 -0.087113 2.729601
3.366667 -0.363358 0.105925 1.232997 1.214439 -0.073277 2.707277
3.400000 -0.317437 0.102566 1.310377 1.307599 -0.053832 2.665435
3.433333 -0.271391 0.099236 1.401401 1.390046 -0.029826 2.606456
3.466667 -0.221107 0.098378 1.491325 1.461027 -0.002671 2.525539
3.500000 -0.166991 0.100390 1.608815 1.520142 0.025989 2.415554
3.533333 -0.112908 0.102434 1.685384 1.567349 0.054713 2.271999
3.566667 -0.058914 0.104509 1.767702 1.603185 0.082650 2.093395
3.600000 -0.001148 0.109813 1.843693 1.628129 0.109082 1.870131
3.633333 0.056410 0.115140 1.920329 1.642148 0.133138 1.597870
3.666667 0.113698 0.120485 1.981439 1.645331 0.154473 1.282798
3.700000 0.170655 0.125843 2.037551 1.637737 0.173120 0.932986
3.733333 0.227220 0.131207 2.071020 1.618707 0.189109 0.558505
3.766667 0.283694 0.138121 2.093400 1.587150 0.202266 0.167394
3.800000 0.338432 0.146024 2.078241 1.541628 0.212782 -0.226803
3.833333 0.389767 0.154473 2.055876 1.480278 0.220976 -0.607760
3.866667 0.440473 0.162901 2.013569 1.401447 0.227198 -0.968115
3.900000 0.490498 0.171298 1.979036 1.304353 0.231655 -1.296162
3.933333 0.539786 0.179657 1.906188 1.188970 0.234672 -1.588003
3.966667 0.588284 0.187967 1.833020 1.055355 0.236833 -1.836949
4.000000 0.627815 0.195771 1.768241 0.905187 0.238590 -2.040586
4.033333 0.658036 0.203251 1.661140 0.741808 0.240421 -2.202543
4.066667 0.678577 0.210561 1.599696 0.569469 0.242627 -2.321145
4.100000 0.698175 0.217797 1.511945 0.391731 0.245483 -2.391952
4.133333 0.708067 0.225374 1.405571 0.213162 0.248895 -2.405060
4.166667 0.708493 0.233383 1.348133 0.038570 0.252424 -2.352940
4.200000 0.699400 0.242167 1.247477 -0.128511 0.255436 -2.225632
4.233333 0.689339 0.250849 1.166851 -0.286751 0.256973 -2.017444
4.266667 0.669660 0.260615 1.069831 -0.435391 0.255724 -1.725790
4.300000 0.649044 0.270260 0.973510 -0.573678 0.250383 -1.365092
4.333333 0.627512 0.279772 0.904126 -0.702176 0.240069 -0.957030
4.366667 0.605087 0.289142 0.833111 -0.822272 0.223988 -0.522127
4.400000 0.574803 0.298300 0.800962 -0.935526 0.201541 -0.091487
4.433333 0.543679 0.307297 0.837541 -1.042158 0.172706 0.303555
4.466667 0.506482 0.314608 0.896568 -1.142710 0.138443 0.635620
4.500000 0.463254 0.319699 0.993301 -1.237455 0.099634 0.885536
4.533333 0.419302 0.324607 1.094171 -1.326380 0.057007 1.041386
4.566667 0.370793 0.326023 1.189101 -1.408421 0.011862 1.093537
4.600000 0.318399 0.323403 1.240035 -1.482735 -0.034413 1.047697
4.633333 0.265431 0.320596 1.265433 -1.548804 -0.080702 0.925526
4.666667 0.211944 0.317606 1.290833 -1.606552 -0.126562 0.745549
4.700000 0.154678 0.310279 1.305053 -1.656134 -0.171117 0.529337
4.733333 0.097009 0.302779 1.307313 -1.697715 -0.213490 0.295821
4.766667 0.038995 0.295115 1.282888 -1.732218 -0.253332 0.056360
4.800000 -0.019301 0.287296 1.279988 -1.760474 -0.290632 -0.192033
4.833333 -0.079780 0.276326 1.265770 -1.783155 -0.325126 -0.469472
4.866667 -0.140419 0.265220 1.247786 -1.800503 -0.356433 -0.793903
4.900000 -0.202186 0.251758 1.243419 -1.812726 -0.384627 -1.180805
4.933333 -0.264346 0.236371 1.230165 -1.820006 -0.409639 -1.635125
4.966667 -0.326472 0.220892 1.217908 -1.822295 -0.431309 -2.147643
5.000000 -0.388498 0.205338 1.193784 -1.819002 -0.449346 -2.690400
5.033333 -0.449789 0.188864 1.123258 -1.809915 -0.463889 -3.216539
5.066667 -0.510851 0.172350 1.020187 -1.794828 -0.475080 -3.674941
5.100000 -0.571618 0.155814 0.848244 -1.774039 -0.483138 -4.013874
5.133333 -0.632028 0.139274 0.646709 -1.747546 -0.488435 -4.196765
5.166667 -0.692015 0.122749 0.376815 -1.715353 -0.491349 -4.196088
5.200000 -0.751515 0.106257 0.106377 -1.677741 -0.492002 -4.006132
5.233333 -0.806581 0.089644 -0.142297 -1.634698 -0.490202 -3.642582
5.266667 -0.861038 0.073099 -0.306722 -1.585845 -0.485580 -3.142222
5.300000 -0.914828 0.056641 -0.404069 -1.530052 -0.477431 -2.554780
5.333333 -0.964217 0.039932 -0.425769 -1.466805 -0.465033 -1.935221
5.366667 -1.012829 0.023346 -0.407716 -1.395152 -0.447573 -1.347439
5.400000 -1.060610 0.006900 -0.352741 -1.314522 -0.424671 -0.842953
5.433333 -1.107508 -0.009385 -0.307755 -1.223942 -0.396294 -0.460934
5.466667 -1.149103 -0.023716 -0.267445 -1.122997 -0.362925 -0.215036
5.500000 -1.189718 -0.037854 -0.229678 -1.011980 -0.325390 -0.103892
5.533333 -1.225206 -0.049406 -0.228096 -0.891345 -0.284901 -0.101011
5.566667 -1.255244 -0.058373 -0.232164 -0.762325 -0.243007 -0.167498
5.600000 -1.279744 -0.064974 -0.269453 -0.626190 -0.201242 -0.262963
5.633333 -1.298922 -0.069318 -0.285374 -0.485614 -0.161112 -0.351599
5.666667 -1.312245 -0.071783 -0.331771 -0.343279 -0.123660 -0.406471
5.700000 -1.318989 -0.072873 -0.380066 -0.201616 -0.089719 -0.410194
5.733333 -1.324553 -0.073719 -0.401674 -0.061956 -0.059422 -0.366547
5.766667 -1.322402 -0.074198 -0.426127 0.074325 -0.032379 -0.282833
5.800000 -1.312369 -0.074511 -0.453423 0.206039 -0.007833 -0.173256
5.833333 -1.301156 -0.074577 -0.453334 0.333244 0.015322 -0.051001
5.866667 -1.288770 -0.074394 -0.425103 0.456421 0.038218 0.066839
5.900000 -1.269238 -0.073363 -0.402796 0.575756 0.061869 0.167914
5.933333 -1.248560 -0.072083 -0.380567 0.690431 0.086818 0.249981
5.966667 -1.226754 -0.070555 -0.350318 0.800231 0.113197 0.309542
6.000000 -1.198961 -0.067420 -0.335819 0.905480 0.140953 0.348254
6.033333 -1.165841 -0.062506 -0.332282 1.005803 0.169734 0.371101
6.066667 -1.127690 -0.055708 -0.321252 1.100004 0.198760 0.386929
6.100000 -1.084770 -0.047004 -0.314240 1.187482 0.227249 0.403239
6.133333 -1.040873 -0.038075 -0.316353 1.267974 0.254553 0.423103
6.166667 -0.996038 -0.028928 -0.312722 1.340976 0.280187 0.450010
6.200000 -0.947254 -0.017984 -0.300199 1.405737 0.303560 0.484197
6.233333 -0.897621 -0.006842 -0.284758 1.462227 0.324333 0.522922
6.266667 -0.847186 0.004489 -0.250813 1.511326 0.342554 0.560404
6.300000 -0.795998 0.015998 -0.225977 1.554026 0.358457 0.589401
6.333333 -0.741768 0.029082 -0.200751 1.591083 0.372101 0.605103
6.366667 -0.686884 0.042321 -0.176487 1.623315 0.383437 0.605731
6.400000 -0.631398 0.055703 -0.151638 1.651596 0.392568 0.591069
6.433333 -0.575360 0.069215 -0.120155 1.676451 0.399408 0.558852
6.466667 -0.518826 0.082845 -0.094624 1.698104 0.403785 0.513546
6.500000 -0.462031 0.096940 -0.091404 1.716542 0.405364 0.462806
6.533333 -0.403263 0.111449 -0.079770 1.732101 0.404138 0.410472
6.566667 -0.344081 0.125972 -0.059343 1.745060 0.400148 0.358751
6.600000 -0.284797 0.140277 -0.051390 1.755572 0.393395 0.309049
6.633333 -0.225596 0.154088 -0.057669 1.763801 0.384072 0.270383
6.666667 -0.166760 0.167252 -0.046589 1.769940 0.372405 0.241610
6.700000 -0.107519 0.179811 -0.039091 1.774104 0.358770 0.218959
6.733333 -0.048019 0.191604 -0.029314 1.776417 0.343486 0.201548
6.766667 0.011639 0.202525 -0.035784 1.776990 0.326990 0.189759
6.800000 0.071241 0.213443 -0.022468 1.775947 0.309719 0.183526
6.833333 0.130782 0.223334 -0.014069 1.773401 0.291957 0.174784
6.866667 0.190156 0.233206 -0.012299 1.769378 0.273877 0.164041
6.900000 0.249440 0.241917 0.001474 1.763937 0.255643 0.151266
6.933333 0.308617 0.249498 -0.002926 1.756983 0.237299 0.138297
6.966667 0.367458 0.257041 0.018077 1.748483 0.218825 0.121532
7.000000 0.425908 0.264539 0.017021 1.738330 0.200276 0.102178
7.033333 0.484003 0.270881 0.020741 1.726303 0.181778 0.082416
7.066667 0.541596 0.277169 0.014337 1.712069 0.163485 0.063114
7.100000 0.598436 0.282386 0.015916 1.695104 0.145516 0.047450
7.133333 0.655296 0.286676 0.018812 1.674569 0.128052 0.035043
7.166667 0.711860 0.290047 0.022950 1.649569 0.111335 0.032165
7.200000 0.767704 0.293356 0.018751 1.618742 0.095542 0.041013
7.233333 0.822658 0.295813 0.019411 1.580361 0.080834 0.068301
7.266667 0.876262 0.297563 0.014577 1.532438 0.067496 0.114882
7.300000 0.928985 0.299253 0.015112 1.472755 0.055716 0.178514
7.333333 0.980776 0.300883 0.020055 1.399873 0.045573 0.259992
7.366667 1.030601 0.301978 0.014119 1.311798 0.037073 0.356983
7.400000 1.077556 0.302629 0.018364 1.207759 0.030235 0.459427
7.433333 1.120569 0.302995 0.035608 1.088299 0.024994 0.551344
7.466667 1.158133 0.303306 0.049237 0.954711 0.021251 0.618542
7.500000 1.194540 0.303572 0.079682 0.809416 0.018963 0.645961
7.533333 1.223451 0.303896 0.124246 0.654503 0.018302 0.610158
7.566667 1.244134 0.304320 0.190432 0.493885 0.019363 0.482312
7.600000 1.256140 0.304775 0.223102 0.330975 0.022319 0.253802
7.633333 1.258900 0.305263 0.241162 0.168805 0.027375 -0.078104
7.666667 1.260412 0.305725 0.277554 0.010359 0.034552 -0.504726
7.700000 1.252128 0.306527 0.316709 -0.141524 0.043892 -1.005532
7.733333 1.242607 0.307310 0.291763 -0.284150 0.055131 -1.536125
7.766667 1.231863 0.308077 0.257939 -0.416777 0.068022 -2.039944
7.800000 1.212405 0.310257 0.165637 -0.538660 0.081836 -2.471972
7.833333 1.191758 0.312425 0.034742 -0.650162 0.095871 -2.788132
7.866667 1.164467 0.316492 -0.149845 -0.751461 0.109386 -2.949947
7.900000 1.136041 0.320547 -0.365643 -0.843795 0.121432 -2.931791
7.933333 1.103001 0.326339 -0.543558 -0.928084 0.130911 -2.738877
7.966667 1.068894 0.332116 -0.725947 -1.004384 0.136865 -2.385533
8.000000 1.033757 0.337873 -0.834769 -1.073463 0.138944 -1.899313
8.033333 0.995405 0.344176 -0.889429 -1.135171 0.136689 -1.318618
8.066667 0.956101 0.350453 -0.871355 -1.190186 0.129963 -0.699579
8.100000 0.914127 0.355811 -0.835518 -1.238538 0.119065 -0.096244
8.133333 0.869995 0.359772 -0.779583 -1.280551 0.105145 0.450300
8.166667 0.825040 0.363700 -0.731392 -1.316704 0.089280 0.902435
8.200000 0.779309 0.367592 -0.638758 -1.346964 0.072317 1.237446
8.233333 0.732963 0.369373 -0.573318 -1.371838 0.055493 1.449606
8.266667 0.685499 0.369226 -0.498620 -1.391532 0.040053 1.554335
8.300000 0.637400 0.369047 -0.431613 -1.406537 0.026921 1.568864
8.333333 0.588715 0.368838 -0.364045 -1.417546 0.016245 1.514177
8.366667 0.540427 0.367881 -0.320896 -1.425357 0.008626 1.412942
8.400000 0.492763 0.366832 -0.276719 -1.430866 0.004666 1.287786
8.433333 0.444657 0.365764 -0.233176 -1.434689 0.004511 1.153079
8.466667 0.397555 0.366133 -0.208093 -1.437446 0.008175 1.015807
8.500000 0.350107 0.366488 -0.182158 -1.439499 0.016012 0.884368
8.533333 0.302359 0.366833 -0.157586 -1.440990 0.028603 0.765362
8.566667 0.254358 0.367169 -0.144340 -1.441744 0.045805 0.658978
8.600000 0.206151 0.367499 -0.109597 -1.441402 0.067454 0.562475
8.633333 0.157785 0.367825 -0.101656 -1.439424 0.093588 0.476235
8.666667 0.109307 0.368150 -0.096594 -1.435188 0.124007 0.403654
8.700000 0.060424 0.373205 -0.075341 -1.427981 0.157461 0.347364
8.733333 0.011524 0.378259 -0.072151 -1.416782 0.192545 0.309912
8.766667 -0.037343 0.383307 -0.058358 -1.400543 0.227743 0.298688
8.800000 -0.085006 0.392133 -0.055466 -1.378040 0.261032 0.327486
8.833333 -0.131218 0.404159 -0.054595 -1.348208 0.289851 0.410286
8.866667 -0.177260 0.416159 -0.044974 -1.309630 0.311643 0.553538
8.900000 -0.221877 0.430347 -0.050999 -1.261111 0.324772 0.760376
8.933333 -0.266235 0.444484 -0.063060 -1.201682 0.327739 1.034480
8.966667 -0.307970 0.458931 -0.057839 -1.131148 0.319597 1.378581
9.000000 -0.349363 0.473300 -0.016461 -1.049551 0.300310 1.788224
9.033333 -0.386970 0.486183 0.045312 -0.957498 0.270956 2.243215
9.066667 -0.420390 0.497157 0.111691 -0.856691 0.233170 2.728749
9.100000 -0.449341 0.505706 0.197497 -0.749318 0.188926 3.232646
9.133333 -0.473363 0.511769 0.313310 -0.638369 0.140504 3.725852
9.166667 -0.492783 0.515200 0.506239 -0.526459 0.090268 4.166393
9.200000 -0.507085 0.516123 0.688095 -0.416970 0.040522 4.510816
9.233333 -0.516052 0.514671 0.825780 -0.312885 -0.006954 4.733466
9.266667 -0.519522 0.511018 0.999195 -0.216578 -0.050709 4.807693
9.300000 -0.522471 0.507243 1.200498 -0.129739 -0.089853 4.703796
9.333333 -0.520930 0.501852 1.461060 -0.053640 -0.123584 4.420289
9.366667 -0.518878 0.496351 1.667338 0.010726 -0.151307 3.982171
9.400000 -0.516319 0.490750 1.864205 0.063477 -0.172953 3.418770
9.433333 -0.511501 0.483877 2.050765 0.104923 -0.188306 2.753366
9.466667 -0.505116 0.475808 2.125686 0.135641 -0.196962 2.021913
9.500000 -0.498253 0.467665 2.135080 0.156032 -0.198433 1.274269
9.533333 -0.490922 0.459460 2.120931 0.167212 -0.192542 0.550446
9.566667 -0.483134 0.451204 2.047741 0.170420 -0.179407 -0.122395
9.600000 -0.474901 0.442906 1.990062 0.166518 -0.158955 -0.716910
9.633333 -0.466235 0.434580 1.892779 0.156534 -0.131796 -1.197857
9.666667 -0.460027 0.428349 1.868226 0.141850 -0.099327 -1.558354
9.700000 -0.456118 0.425074 1.811360 0.124079 -0.063200 -1.804772
9.733333 -0.451802 0.421795 1.748964 0.104518 -0.025344 -1.949458
9.766667 -0.449413 0.422294 1.648615 0.084402 0.012052 -2.004627
9.800000 -0.448683 0.426344 1.562318 0.065122 0.046336 -1.987814
9.833333 -0.447554 0.430396 1.472086 0.047972 0.075203 -1.925949
9.866667 -0.447883 0.436759 1.408735 0.033658 0.096816 -1.826663
9.900000 -0.447814 0.443115 1.318731 0.022434 0.109837 -1.694581
9.933333 -0.447349 0.449459 1.266657 0.014493 0.113554 -1.536771
9.966667 -0.447965 0.455365 1.229326 0.009793 0.108387 -1.366383
10.000000 -0.448183 0.461248 1.196035 0.007915 0.095843 -1.191367
10.033333 -0.448000 0.467103 1.162037 0.008202 0.077889 -1.020674
10.066667 -0.448104 0.470638 1.138186 0.009982 0.057074 -0.866151
10.100000 -0.448185 0.471871 1.120784 0.012839 0.035890 -0.743312
10.133333 -0.448075 0.471066 1.094521 0.016164 0.016923 -0.656746
10.166667 -0.447541 0.468549 1.087958 0.019333 0.002156 -0.607162
10.200000 -0.446583 0.464962 1.076786 0.022002 -0.007106 -0.593967
