t x y theta dxdt dydt dthetadt
0.000000 0.000000 0.000000 0.019788 0.013793 0.002695 0.048296
0.033333 0.000477 0.000057 0.055598 0.017369 0.004494 0.051323
0.066667 0.001045 0.000095 0.065307 0.022277 0.007015 0.045506
0.100000 0.001507 0.000071 0.058532 0.028675 0.010349 0.030773
0.133333 0.001691 0.000035 0.047526 0.036762 0.014595 0.016804
0.166667 0.002417 0.000307 0.048469 0.046744 0.019805 0.005596
0.200000 0.003698 0.000895 0.058241 0.058718 0.025968 -0.014934
0.233333 0.005546 0.001809 0.052027 0.072778 0.033112 -0.030525
0.266667 0.007776 0.002829 0.066463 0.088965 0.041235 -0.040068
0.300000 0.010514 0.004136 0.031354 0.107274 0.050306 -0.038396
0.333333 0.013855 0.005799 0.063382 0.127593 0.060252 -0.039779
0.366667 0.018128 0.007736 0.029454 0.149534 0.070967 -0.045001
0.400000 0.023027 0.010047 0.026432 0.173022 0.082457 -0.048944
0.433333 0.028563 0.012742 0.027730 0.198244 0.094796 -0.063187
0.466667 0.034746 0.015831 0.048226 0.225564 0.108110 -0.089695
0.500000 0.043304 0.019702 0.049839 0.255456 0.122597 -0.140922
0.533333 0.052527 0.023985 0.028235 0.288461 0.138477 -0.198825
0.566667 0.062423 0.028686 0.042888 0.325444 0.156041 -0.264033
0.600000 0.072999 0.033814 0.040942 0.366898 0.175485 -0.326259
0.633333 0.084262 0.039376 0.066411 0.412972 0.196945 -0.381295
0.666667 0.096219 0.045381 0.015872 0.463592 0.220513 -0.415135
0.700000 0.108875 0.051834 -0.006243 0.518534 0.246182 -0.412236
0.733333 0.125395 0.059729 -0.061836 0.577376 0.273924 -0.375374
0.766667 0.145462 0.069002 -0.087995 0.639197 0.303593 -0.302422
0.800000 0.168385 0.079552 -0.111123 0.702912 0.334981 -0.202566
0.833333 0.194618 0.091581 -0.145883 0.767225 0.367760 -0.068509
0.866667 0.221545 0.104080 -0.147583 0.830780 0.401517 0.082486
0.900000 0.250770 0.117681 -0.117547 0.892161 0.435839 0.238438
0.933333 0.282544 0.132659 -0.069800 0.950190 0.470265 0.383801
0.966667 0.316638 0.149208 -0.069617 1.004109 0.504433 0.514150
1.000000 0.352818 0.167146 -0.022956 1.053446 0.538063 0.624143
1.033333 0.389627 0.185549 0.008129 1.098200 0.570984 0.699440
1.066667 0.427859 0.205216 0.041597 1.138431 0.603035 0.743157
1.100000 0.467173 0.226023 0.059898 1.174429 0.634105 0.760574
1.133333 0.507823 0.248174 0.078519 1.206582 0.664273 0.764525
1.166667 0.549649 0.271686 0.108190 1.235280 0.693643 0.754164
1.200000 0.592007 0.295632 0.137371 1.261045 0.722404 0.736934
1.233333 0.634875 0.320003 0.166409 1.284253 0.750858 0.719434
1.266667 0.678229 0.344791 0.185808 1.305416 0.779440 0.703059
1.300000 0.722396 0.371150 0.206437 1.324967 0.808551 0.685680
1.333333 0.767154 0.399094 0.222794 1.343211 0.838386 0.663358
1.366667 0.812330 0.427420 0.235963 1.360391 0.869038 0.640154
1.400000 0.857899 0.456116 0.271362 1.376585 0.900381 0.614464
1.433333 0.903837 0.485168 0.297840 1.391864 0.932141 0.588552
1.466667 0.950584 0.516135 0.324714 1.406219 0.963926 0.562971
1.500000 0.997999 0.548984 0.340653 1.419632 0.995350 0.540255
1.533333 1.046048 0.583590 0.356802 1.432087 1.026056 0.521460
1.566667 1.094559 0.619952 0.364780 1.443544 1.055657 0.506824
1.600000 1.143312 0.656583 0.373867 1.453996 1.083901 0.498265
1.633333 1.192278 0.693462 0.386330 1.463470 1.110501 0.493990
1.666667 1.241308 0.731571 0.400254 1.472088 1.135187 0.496552
1.700000 1.290498 0.769884 0.414250 1.480001 1.157854 0.504822
1.733333 1.339821 0.808378 0.434640 1.487405 1.178460 0.519549
1.766667 1.389515 0.848197 0.464092 1.494481 1.197038 0.536865
1.800000 1.439627 0.889112 0.475032 1.501359 1.213419 0.557092
1.833333 1.489791 0.930135 0.496880 1.508068 1.227471 0.580059
1.866667 1.540096 0.971970 0.512582 1.514472 1.239115 0.602239
1.900000 1.590572 1.014310 0.538787 1.520287 1.247955 0.623369
1.933333 1.641055 1.056874 0.553921 1.525143 1.253605 0.639225
1.966667 1.692218 1.099834 0.571875 1.528649 1.255758 0.653822
2.000000 1.744035 1.142767 0.594861 1.530444 1.254468 0.658688
2.033333 1.795732 1.185645 0.615323 1.530039 1.249623 0.651885
2.066667 1.847670 1.227933 0.646213 1.527010 1.241198 0.631394
2.100000 1.899428 1.270110 0.664902 1.521172 1.229556 0.593700
2.133333 1.950816 1.311080 0.706778 1.512396 1.215144 0.538697
2.166667 2.001966 1.351886 0.734613 1.500656 1.198382 0.460415
2.200000 2.052848 1.392502 0.742023 1.485714 1.179253 0.367202
2.233333 2.102180 1.431030 0.772112 1.467814 1.158302 0.258578
2.266667 2.151188 1.469320 0.758004 1.447025 1.135694 0.140745
2.300000 2.199845 1.507347 0.784371 1.423300 1.111404 0.018844
2.333333 2.248123 1.545090 0.761533 1.396564 1.085213 -0.098527
2.366667 2.293754 1.580124 0.765217 1.366735 1.056875 -0.203714
2.400000 2.338955 1.614831 0.746223 1.334173 1.026493 -0.295981
2.433333 2.383702 1.649189 0.724056 1.298844 0.993659 -0.368343
2.466667 2.427973 1.683180 0.695644 1.261143 0.958320 -0.420586
2.500000 2.471742 1.716784 0.679464 1.221468 0.920424 -0.451415
2.533333 2.511418 1.746786 0.664440 1.180519 0.880160 -0.466460
2.566667 2.550552 1.776367 0.649227 1.138892 0.837709 -0.470945
2.600000 2.586338 1.802706 0.618086 1.097309 0.793595 -0.468258
2.633333 2.621548 1.828598 0.620534 1.056509 0.748462 -0.467973
2.666667 2.656168 1.854030 0.589541 1.016904 0.703010 -0.473751
2.700000 2.688574 1.876650 0.588645 0.978893 0.658126 -0.490442
2.733333 2.719209 1.896547 0.579412 0.942399 0.614588 -0.515714
2.766667 2.749217 1.915961 0.567255 0.907174 0.573213 -0.542085
2.800000 2.778524 1.932991 0.557225 0.872186 0.534366 -0.566546
2.833333 2.807186 1.949529 0.549611 0.836578 0.498485 -0.577702
2.866667 2.835062 1.964147 0.520992 0.799707 0.466024 -0.571544
2.900000 2.862274 1.978271 0.477946 0.760952 0.437055 -0.541671
2.933333 2.888814 1.991901 0.448127 0.719624 0.411457 -0.489707
2.966667 2.913593 2.004587 0.400981 0.675563 0.389075 -0.420735
3.000000 2.936463 2.016427 0.379872 0.629281 0.369586 -0.339476
3.033333 2.956898 2.027702 0.361814 0.581245 0.352581 -0.257374
3.066667 2.976641 2.038488 0.361534 0.531800 0.337379 -0.184750
3.100000 2.993079 2.049192 0.388078 0.481499 0.323454 -0.133298
3.133333 3.006051 2.060000 0.407043 0.431552 0.310341 -0.107984
3.166667 3.018336 2.070326 0.426962 0.382629 0.297361 -0.114283
3.200000 3.029940 2.080171 0.447839 0.335068 0.283824 -0.154166
3.233333 3.040869 2.089538 0.438717 0.289122 0.269133 -0.221017
3.266667 3.049162 2.098874 0.420918 0.245214 0.252774 -0.307800
3.300000 3.056796 2.107738 0.417997 0.203331 0.234302 -0.406681
3.333333 3.062388 2.115970 0.396911 0.162954 0.213272 -0.508641
3.366667 3.066106 2.123107 0.346189 0.124033 0.189675 -0.603728
3.400000 3.069197 2.129781 0.311163 0.086841 0.163774 -0.679674
3.433333 3.071676 2.135996 0.282382 0.051770 0.135685 -0.736072
3.466667 3.073554 2.141756 0.256847 0.018887 0.105602 -0.767106
3.500000 3.073173 2.144987 0.260821 -0.011389 0.073861 -0.768437
3.533333 3.070613 2.145561 0.229085 -0.038521 0.041211 -0.741799
3.566667 3.067502 2.145703 0.206500 -0.062321 0.008130 -0.693544
3.600000 3.063856 2.145422 0.154136 -0.082715 -0.024744 -0.630666
3.633333 3.059696 2.144729 0.100678 -0.099656 -0.056413 -0.550258
3.666667 3.055116 2.141801 0.086759 -0.112942 -0.085761 -0.461208
3.700000 3.050059 2.138484 0.079388 -0.122655 -0.112027 -0.368540
3.733333 3.045350 2.133364 0.086302 -0.129091 -0.134839 -0.278666
3.766667 3.041203 2.126669 0.068141 -0.132533 -0.153675 -0.190559
3.800000 3.036634 2.119628 0.078036 -0.133512 -0.168362 -0.110220
3.833333 3.031659 2.112260 0.088305 -0.132650 -0.178980 -0.048429
3.866667 3.026296 2.104580 0.094610 -0.130557 -0.185920 -0.001985
3.900000 3.020563 2.096605 0.098433 -0.127608 -0.189284 0.028537
3.933333 3.016350 2.089689 0.098655 -0.124062 -0.189340 0.047884
3.966667 3.013557 2.084383 0.114773 -0.120086 -0.186633 0.052860
4.000000 3.010441 2.078828 0.099611 -0.115624 -0.181523 0.051003
4.033333 3.007016 2.073036 0.095102 -0.110651 -0.174470 0.047882
4.066667 3.003297 2.067022 0.093970 -0.105149 -0.165781 0.043694
4.100000 2.999297 2.060798 0.097600 -0.099246 -0.155959 0.040215
4.133333 2.995030 2.054379 0.098734 -0.092828 -0.145164 0.036428
4.166667 2.991949 2.049720 0.108146 -0.085836 -0.133480 0.036045
4.200000 2.988628 2.044890 0.114972 -0.078310 -0.121106 0.035151
4.233333 2.986280 2.041355 0.111306 -0.070390 -0.108343 0.033775
4.266667 2.983717 2.037670 0.114368 -0.062217 -0.095493 0.031624
4.300000 2.981834 2.034900 0.109302 -0.053990 -0.082894 0.027248
4.333333 2.980581 2.032897 0.114491 -0.046133 -0.071076 0.021034
4.366667 2.979872 2.031624 0.105530 -0.038934 -0.060355 0.013552
4.400000 2.978984 2.030233 0.109034 -0.032696 -0.051048 0.007211
4.433333 2.978578 2.029352 0.116132 -0.027491 -0.043185 0.002005
4.466667 2.978009 2.028367 0.118804 -0.023371 -0.036786 -0.003290
4.500000 2.977286 2.027282 0.108594 -0.020235 -0.031700 -0.006660
4.533333 2.976927 2.026555 0.117890 -0.017883 -0.027664 -0.008342
4.566667 2.976428 2.025740 0.106555 -0.016158 -0.024470 -0.008455
