t x y theta dxdt dydt dthetadt
0.000000 0.000000 0.000000 0.594699 0.151273 0.018198 3.483565
0.033333 0.005095 0.000590 0.728253 0.153795 0.017030 3.846191
0.066667 0.010278 0.001140 0.864731 0.156277 0.015852 4.187102
0.100000 0.015549 0.001651 1.052744 0.158706 0.014664 4.503174
0.133333 0.020887 0.002123 1.237302 0.161069 0.013469 4.779499
0.166667 0.026310 0.002554 1.427813 0.163361 0.012267 5.001400
0.200000 0.031816 0.002944 1.628385 0.165572 0.011060 5.160725
0.233333 0.037405 0.003292 1.801404 0.167697 0.009850 5.261790
0.266667 0.043054 0.003600 2.002317 0.169739 0.008640 5.301984
0.300000 0.048760 0.003870 2.192081 0.171704 0.007433 5.287672
0.333333 0.054542 0.004094 2.359472 0.173595 0.006231 5.229356
0.366667 0.060379 0.004279 2.507628 0.175417 0.005039 5.139649
0.400000 0.066267 0.004425 2.694079 0.177173 0.003859 5.021978
0.433333 0.072205 0.004531 2.866422 0.178868 0.002688 4.869992
0.466667 0.078192 0.004598 3.032904 0.180502 0.001524 4.683784
0.500000 0.084238 0.004617 -3.088961 0.182070 0.000365 4.455369
0.533333 0.090346 0.004605 -2.929501 0.183569 -0.000794 4.174937
0.566667 0.096512 0.004562 -2.774058 0.184993 -0.001960 3.829935
0.600000 0.102731 0.004485 -2.633987 0.186336 -0.003141 3.418078
0.633333 0.108998 0.004371 -2.499140 0.187587 -0.004342 2.934719
0.666667 0.115300 0.004217 -2.396155 0.188738 -0.005568 2.377953
0.700000 0.121635 0.004024 -2.302281 0.189787 -0.006823 1.740260
0.733333 0.128003 0.003783 -2.238848 0.190727 -0.008112 1.025061
0.766667 0.134400 0.003503 -2.192472 0.191558 -0.009435 0.231773
0.800000 0.140820 0.003168 -2.196528 0.192281 -0.010789 -0.644926
0.833333 0.147264 0.002794 -2.225198 0.192901 -0.012171 -1.594578
0.866667 0.153730 0.002380 -2.294188 0.193422 -0.013576 -2.598857
0.900000 0.160206 0.001905 -2.368758 0.193848 -0.015000 -3.619449
0.933333 0.166686 0.001368 -2.461033 0.194185 -0.016436 -4.621866
0.966667 0.173181 0.000792 -2.616311 0.194439 -0.017875 -5.556621
1.000000 0.179689 0.000177 -2.816406 0.194614 -0.019316 -6.364131
1.033333 0.186208 -0.000476 -3.137842 0.194713 -0.020757 -6.987426
1.066667 0.192718 -0.001187 2.857341 0.194740 -0.022198 -7.388386
1.100000 0.199209 -0.001973 2.490955 0.194699 -0.023640 -7.532547
1.133333 0.205704 -0.002798 2.081387 0.194596 -0.025085 -7.394196
1.166667 0.212200 -0.003660 1.723907 0.194434 -0.026536 -6.968669
1.200000 0.218695 -0.004559 1.439227 0.194218 -0.027991 -6.277611
1.233333 0.225187 -0.005496 1.183775 0.193958 -0.029446 -5.367123
1.266667 0.231661 -0.006491 1.030964 0.193660 -0.030895 -4.284722
1.300000 0.238116 -0.007544 0.873983 0.193326 -0.032334 -3.095219
1.333333 0.244556 -0.008652 0.810243 0.192960 -0.033755 -1.874486
1.366667 0.250981 -0.009813 0.804919 0.192561 -0.035150 -0.685078
1.400000 0.257393 -0.011025 0.846079 0.192129 -0.036512 0.420850
1.433333 0.263795 -0.012287 0.946804 0.191657 -0.037830 1.405399
1.466667 0.270177 -0.013583 1.076142 0.191143 -0.039100 2.248353
1.500000 0.276555 -0.014924 1.183996 0.190582 -0.040315 2.935173
1.533333 0.282908 -0.016299 1.317803 0.189971 -0.041474 3.476518
1.566667 0.289261 -0.017714 1.470155 0.189305 -0.042577 3.887823
1.600000 0.295585 -0.019162 1.621174 0.188583 -0.043628 4.197314
1.633333 0.301879 -0.020642 1.801562 0.187805 -0.044634 4.432111
1.666667 0.308139 -0.022153 1.965697 0.186969 -0.045598 4.612154
1.700000 0.314364 -0.023696 2.142082 0.186076 -0.046526 4.753835
1.733333 0.320551 -0.025269 2.258012 0.185132 -0.047417 4.865331
1.766667 0.326698 -0.026871 2.403441 0.184142 -0.048275 4.937904
1.800000 0.332841 -0.028499 2.568684 0.183113 -0.049097 4.950183
1.833333 0.338940 -0.030155 2.709690 0.182051 -0.049881 4.889843
1.866667 0.344991 -0.031839 2.888263 0.180958 -0.050629 4.737285
1.900000 0.351026 -0.033548 3.123906 0.179832 -0.051339 4.479117
1.933333 0.357009 -0.035284 -2.938483 0.178671 -0.052013 4.098044
1.966667 0.362937 -0.037047 -2.751061 0.177468 -0.052652 3.593873
2.000000 0.368845 -0.038818 -2.579661 0.176217 -0.053257 2.980386
2.033333 0.374692 -0.040615 -2.477630 0.174911 -0.053833 2.269108
2.066667 0.380512 -0.042423 -2.401933 0.173542 -0.054383 1.489691
2.100000 0.386302 -0.044243 -2.376491 0.172105 -0.054910 0.683919
2.133333 0.392061 -0.046075 -2.402888 0.170594 -0.055420 -0.098591
2.166667 0.397750 -0.047930 -2.440451 0.168996 -0.055919 -0.811874
2.200000 0.403367 -0.049809 -2.518415 0.167305 -0.056413 -1.417534
2.233333 0.408909 -0.051710 -2.625355 0.165514 -0.056904 -1.881142
2.266667 0.414417 -0.053617 -2.737316 0.163625 -0.057394 -2.183152
2.300000 0.419890 -0.055527 -2.875490 0.161635 -0.057885 -2.316557
2.333333 0.425281 -0.057458 -2.991754 0.159551 -0.058375 -2.288203
2.366667 0.430587 -0.059409 -3.115585 0.157383 -0.058858 -2.113410
2.400000 0.435806 -0.061382 3.078766 0.155147 -0.059324 -1.815923
2.433333 0.440935 -0.063373 2.994809 0.152859 -0.059764 -1.425417
2.466667 0.446020 -0.065376 2.938532 0.150529 -0.060166 -0.970462
2.500000 0.451010 -0.067398 2.921350 0.148173 -0.060519 -0.485190
2.533333 0.455903 -0.069438 2.920449 0.145804 -0.060806 0.004334
2.566667 0.460696 -0.071495 2.953498 0.143426 -0.061022 0.474233
2.600000 0.465437 -0.073556 3.003568 0.141030 -0.061165 0.909028
2.633333 0.470072 -0.075634 3.073268 0.138601 -0.061240 1.296860
2.666667 0.474647 -0.077713 -3.135352 0.136128 -0.061249 1.626306
