t x y theta dxdt dydt dthetadt
0.000000 0.000000 0.000000 0.017088 0.059626 -0.068532 -0.241352
0.033333 0.000943 -0.001215 0.014102 0.071344 -0.073002 -0.164000
0.066667 0.001365 -0.002460 0.020703 0.088529 -0.081752 -0.078579
0.100000 0.001276 -0.003739 0.030990 0.111016 -0.094690 0.000454
0.133333 0.003369 -0.005610 0.028889 0.138676 -0.111841 0.065123
0.166667 0.007587 -0.009112 0.049063 0.171326 -0.133012 0.108304
0.200000 0.014948 -0.014153 0.040658 0.208131 -0.157599 0.129922
0.233333 0.021816 -0.019238 0.056143 0.248810 -0.185307 0.134437
0.266667 0.028191 -0.024369 0.061104 0.293220 -0.215815 0.123559
0.300000 0.038230 -0.031464 0.066725 0.340762 -0.248771 0.103802
0.333333 0.052044 -0.040945 0.076927 0.390396 -0.283385 0.077092
0.366667 0.065350 -0.050464 0.075489 0.441258 -0.319085 0.052371
0.400000 0.081658 -0.062021 0.082497 0.492867 -0.355451 0.028778
0.433333 0.097437 -0.073606 0.080366 0.544061 -0.391703 0.009303
0.466667 0.115861 -0.087213 0.076294 0.592542 -0.426473 -0.004319
0.500000 0.136431 -0.102422 0.065908 0.636446 -0.458531 -0.013551
0.533333 0.158153 -0.118380 0.052378 0.674525 -0.487100 -0.016478
0.566667 0.183351 -0.136502 0.053034 0.704889 -0.511060 -0.020673
0.600000 0.213045 -0.156816 0.061820 0.724998 -0.529068 -0.018705
0.633333 0.242086 -0.177091 0.060463 0.732662 -0.539973 -0.014990
0.666667 0.270444 -0.197312 0.062656 0.727281 -0.543578 -0.011108
0.700000 0.298088 -0.217464 0.086693 0.708443 -0.539906 -0.006057
0.733333 0.324987 -0.237532 0.059627 0.675024 -0.528625 -0.000880
0.766667 0.351112 -0.257502 0.062169 0.627217 -0.510105 0.004427
0.800000 0.372724 -0.274761 0.086188 0.566959 -0.485556 -0.000097
0.833333 0.393066 -0.291273 0.056674 0.496237 -0.456245 -0.006507
0.866667 0.412552 -0.307651 0.052092 0.416146 -0.422926 -0.019838
0.900000 0.427408 -0.321873 0.043385 0.327842 -0.386343 -0.037029
0.933333 0.433440 -0.332198 0.078308 0.234334 -0.348074 -0.065218
0.966667 0.438562 -0.342366 0.048154 0.137823 -0.309251 -0.092668
1.000000 0.442763 -0.352375 0.083723 0.039735 -0.270502 -0.115461
1.033333 0.446034 -0.362218 0.088522 -0.058576 -0.232350 -0.142003
1.066667 0.440404 -0.368386 0.074840 -0.154432 -0.195874 -0.163022
1.100000 0.433835 -0.374386 0.033223 -0.245784 -0.161816 -0.178959
1.133333 0.420770 -0.377665 0.024060 -0.332350 -0.130215 -0.176890
1.166667 0.406773 -0.380779 0.027629 -0.413531 -0.101309 -0.172738
1.200000 0.387899 -0.382143 0.001268 -0.488743 -0.075486 -0.159738
1.233333 0.368112 -0.383351 0.009967 -0.557540 -0.053144 -0.134692
1.266667 0.347427 -0.384407 -0.022960 -0.621166 -0.033975 -0.101114
1.300000 0.323915 -0.384117 0.008790 -0.680398 -0.017937 -0.068273
1.333333 0.299535 -0.383685 -0.001147 -0.735703 -0.004865 -0.041577
1.366667 0.274302 -0.383118 -0.002248 -0.787734 0.005508 -0.011922
1.400000 0.248235 -0.382421 0.018402 -0.837627 0.013748 0.011329
1.433333 0.221350 -0.381600 0.025534 -0.886074 0.020305 0.027251
1.466667 0.190751 -0.380720 0.022395 -0.932800 0.025371 0.031078
1.500000 0.159374 -0.379729 0.002834 -0.977858 0.029342 0.033201
1.533333 0.125023 -0.378856 -0.000159 -1.021086 0.032425 0.031970
1.566667 0.087934 -0.377416 0.002020 -1.062114 0.034790 0.023314
1.600000 0.049787 -0.376066 0.017370 -1.100018 0.036482 0.012715
1.633333 0.010965 -0.374629 0.017977 -1.134272 0.037668 0.001878
1.666667 -0.027359 -0.373179 0.023070 -1.164977 0.038467 -0.005031
1.700000 -0.066564 -0.371662 0.023025 -1.192053 0.038899 -0.013448
1.733333 -0.108638 -0.370130 0.023569 -1.215516 0.038893 -0.022309
1.766667 -0.149914 -0.369035 0.012452 -1.235853 0.038495 -0.026734
1.800000 -0.191717 -0.367886 0.014374 -1.253810 0.037674 -0.028521
1.833333 -0.234018 -0.366687 0.008426 -1.270010 0.036335 -0.026906
1.866667 -0.276786 -0.365445 0.009706 -1.284442 0.034437 -0.023394
1.900000 -0.319991 -0.364164 -0.011738 -1.297151 0.031918 -0.013742
1.933333 -0.363602 -0.362851 0.005815 -1.308370 0.028841 -0.000432
1.966667 -0.407587 -0.361512 -0.003099 -1.317884 0.025108 0.012745
2.000000 -0.452066 -0.360493 0.013833 -1.325422 0.020757 0.024423
2.033333 -0.496858 -0.359459 0.006924 -1.330651 0.015809 0.033471
2.066667 -0.541997 -0.359077 0.013755 -1.333689 0.010311 0.040016
2.100000 -0.587385 -0.358688 0.012905 -1.334627 0.004236 0.040090
2.133333 -0.633071 -0.358828 0.017747 -1.333362 -0.002452 0.037810
2.166667 -0.678772 -0.359232 0.020187 -1.330032 -0.009656 0.033743
2.200000 -0.722508 -0.359619 0.022008 -1.324982 -0.017379 0.030195
2.233333 -0.766519 -0.360239 0.024154 -1.318454 -0.025807 0.025684
2.266667 -0.810624 -0.360870 0.020218 -1.310520 -0.035234 0.025081
2.300000 -0.854140 -0.361929 0.009963 -1.301299 -0.045702 0.029850
2.333333 -0.897690 -0.363004 0.014152 -1.290924 -0.057342 0.038808
2.366667 -0.940086 -0.364842 0.019961 -1.279149 -0.070856 0.053277
2.400000 -0.982459 -0.366699 0.017549 -1.265362 -0.086910 0.075108
2.433333 -1.024934 -0.369976 0.023146 -1.249422 -0.105547 0.107832
2.466667 -1.067329 -0.373275 0.028117 -1.231184 -0.126754 0.145215
2.500000 -1.109619 -0.376595 0.024414 -1.210408 -0.150698 0.187317
2.533333 -1.151776 -0.379938 0.025495 -1.186848 -0.177501 0.231659
2.566667 -1.190466 -0.386920 0.026920 -1.161146 -0.205971 0.274262
2.600000 -1.228970 -0.393918 0.062394 -1.134120 -0.234916 0.303126
2.633333 -1.267266 -0.400929 0.059014 -1.106327 -0.263659 0.312852
2.666667 -1.305328 -0.407947 0.070762 -1.078379 -0.291674 0.301168
2.700000 -1.338422 -0.421631 0.081488 -1.051335 -0.317848 0.263633
2.733333 -1.371240 -0.435306 0.112546 -1.026251 -0.341067 0.200009
2.766667 -1.403764 -0.448959 0.146358 -1.003306 -0.361355 0.113183
2.800000 -1.435977 -0.462580 0.164581 -0.982675 -0.378740 0.018442
2.833333 -1.467861 -0.476158 0.168907 -0.964518 -0.393136 -0.080169
2.866667 -1.499400 -0.489680 0.155218 -0.948883 -0.404160 -0.172541
2.900000 -1.530577 -0.503134 0.124885 -0.934809 -0.412456 -0.247942
2.933333 -1.561375 -0.516511 0.084038 -0.921115 -0.418558 -0.295633
2.966667 -1.591777 -0.529797 0.073016 -0.906678 -0.422424 -0.311645
3.000000 -1.622414 -0.544781 0.044582 -0.890317 -0.423862 -0.301000
3.033333 -1.652621 -0.559650 0.011224 -0.870608 -0.422401 -0.263026
3.066667 -1.682383 -0.574392 0.002311 -0.846181 -0.417721 -0.207127
3.100000 -1.711317 -0.589434 0.002329 -0.816387 -0.408662 -0.145105
3.133333 -1.739773 -0.604321 0.017896 -0.781083 -0.393815 -0.093545
3.166667 -1.767737 -0.619039 0.027260 -0.740665 -0.372214 -0.058267
3.200000 -1.795193 -0.633574 0.041269 -0.695643 -0.343203 -0.041145
3.233333 -1.819464 -0.646887 0.043499 -0.647252 -0.306787 -0.044724
3.266667 -1.840609 -0.658608 0.066378 -0.596945 -0.263092 -0.064246
3.300000 -1.857840 -0.667690 0.067140 -0.546485 -0.213292 -0.090110
3.333333 -1.874525 -0.676542 0.049446 -0.497276 -0.159419 -0.109646
3.366667 -1.887675 -0.681754 0.041872 -0.450689 -0.103595 -0.119305
3.400000 -1.900277 -0.686725 0.015696 -0.408036 -0.047791 -0.115590
3.433333 -1.910475 -0.686373 -0.016701 -0.370421 0.006330 -0.098435
3.466667 -1.920981 -0.679960 -0.032727 -0.338684 0.057059 -0.067887
3.500000 -1.930946 -0.673311 -0.035853 -0.312972 0.103555 -0.030132
3.533333 -1.940372 -0.666437 -0.020193 -0.293497 0.145464 0.005870
3.566667 -1.949261 -0.659345 -0.001966 -0.279965 0.183006 0.035983
3.600000 -1.957614 -0.652044 0.015790 -0.272079 0.216441 0.052018
3.633333 -1.965435 -0.644545 0.034351 -0.268722 0.246172 0.052638
3.666667 -1.972725 -0.636855 0.041798 -0.268638 0.273052 0.034426
3.700000 -1.979489 -0.628984 0.040051 -0.270850 0.297735 0.000565
3.733333 -1.985728 -0.620942 0.048386 -0.274170 0.320653 -0.042121
3.766667 -1.995469 -0.609376 0.023008 -0.277323 0.341678 -0.085400
3.800000 -2.007639 -0.595196 0.013438 -0.278781 0.360407 -0.120426
3.833333 -2.019285 -0.580885 0.004071 -0.277620 0.376417 -0.141501
3.866667 -2.030403 -0.566461 -0.005896 -0.272958 0.388592 -0.144094
3.900000 -2.040990 -0.551939 -0.013173 -0.263919 0.395821 -0.129563
3.933333 -2.051092 -0.536906 -0.026295 -0.250038 0.397184 -0.101262
3.966667 -2.059975 -0.522532 -0.025756 -0.231631 0.392240 -0.067734
4.000000 -2.068317 -0.508107 -0.041258 -0.209573 0.380917 -0.031640
4.033333 -2.076116 -0.493649 -0.035105 -0.184748 0.363027 -0.000889
4.066667 -2.080889 -0.481852 -0.021276 -0.158516 0.339445 0.022075
4.100000 -2.085115 -0.470050 -0.004694 -0.132240 0.311053 0.037732
4.133333 -2.088797 -0.458254 -0.004386 -0.107133 0.279027 0.046904
4.166667 -2.091934 -0.446479 0.011554 -0.083923 0.244443 0.051622
4.200000 -2.092929 -0.439748 0.003612 -0.063152 0.208773 0.049307
4.233333 -2.093381 -0.433056 0.002079 -0.045345 0.173603 0.046623
4.266667 -2.093276 -0.429090 -0.014669 -0.030540 0.139880 0.045093
4.300000 -2.093227 -0.426973 -0.007236 -0.018723 0.108701 0.042194
4.333333 -2.093341 -0.425902 -0.004023 -0.009721 0.080992 0.036790
4.366667 -2.093671 -0.425659 -0.024148 -0.003278 0.057652 0.032269
4.400000 -2.093470 -0.425473 -0.012659 0.001073 0.038661 0.030460
4.433333 -2.092740 -0.425343 0.013292 0.003953 0.023963 0.026375
4.466667 -2.092030 -0.425330 0.010709 0.005865 0.013274 0.018029
4.500000 -2.091551 -0.425374 0.022843 0.007191 0.006019 0.007482
4.533333 -2.091098 -0.425308 0.011510 0.008201 0.001435 -0.002551
4.566667 -2.091404 -0.425488 0.012089 0.008991 -0.001343 -0.015898
4.600000 -2.091936 -0.425675 0.006900 0.009648 -0.002820 -0.030789
