t x y theta dxdt dydt dthetadt
0.000000 0.000000 0.000000 -0.008122 0.005231 0.008550 0.009174
0.033333 0.001030 0.000368 0.003037 0.000282 0.009765 0.008541
0.066667 0.001470 0.000678 0.002471 -0.006550 0.011238 0.003056
0.100000 0.001300 0.000928 -0.002056 -0.015453 0.013232 -0.004934
0.133333 0.000502 0.001115 -0.000528 -0.026763 0.015953 -0.021948
0.166667 -0.000942 0.001235 0.008422 -0.040598 0.019495 -0.049882
0.200000 -0.001848 0.001749 0.009294 -0.057024 0.023909 -0.085714
0.233333 -0.003439 0.002192 0.000238 -0.076173 0.029243 -0.122164
0.266667 -0.005197 0.002842 0.013611 -0.098192 0.035553 -0.154871
0.300000 -0.007805 0.004363 0.000195 -0.123216 0.042433 -0.180402
0.333333 -0.011154 0.005801 -0.002388 -0.151660 0.049411 -0.190810
0.366667 -0.015264 0.007153 -0.012617 -0.184369 0.055999 -0.177408
0.400000 -0.020152 0.008414 -0.033522 -0.222456 0.061669 -0.143132
0.433333 -0.028847 0.011800 -0.062237 -0.266777 0.065710 -0.093220
0.466667 -0.038352 0.015083 -0.086458 -0.318092 0.067458 -0.029587
0.500000 -0.048682 0.018257 -0.110020 -0.376869 0.066510 0.042829
0.533333 -0.059848 0.021314 -0.077721 -0.443104 0.062545 0.115131
0.566667 -0.071865 0.024249 -0.046202 -0.516131 0.055394 0.172275
0.600000 -0.084742 0.027055 -0.023362 -0.594862 0.044995 0.207591
0.633333 -0.103594 0.029737 -0.019452 -0.678494 0.031582 0.215992
0.666667 -0.127256 0.031251 -0.006469 -0.766106 0.015386 0.192502
0.700000 -0.155717 0.031733 0.031893 -0.856432 -0.003254 0.132961
0.733333 -0.189537 0.030733 0.037200 -0.947774 -0.023787 0.044485
0.766667 -0.224216 0.029574 0.048180 -1.038871 -0.045806 -0.063274
0.800000 -0.259743 0.028253 0.040225 -1.128530 -0.068895 -0.180076
0.833333 -0.299655 0.025789 0.016278 -1.215535 -0.092599 -0.299488
0.866667 -0.342697 0.022048 -0.001332 -1.298792 -0.116400 -0.415165
0.900000 -0.386535 0.018141 -0.020635 -1.377893 -0.139893 -0.516878
0.933333 -0.433969 0.013157 -0.056832 -1.453157 -0.162898 -0.602284
0.966667 -0.484714 0.007064 -0.075162 -1.524469 -0.185008 -0.669019
1.000000 -0.538242 -0.000015 -0.098813 -1.591458 -0.205752 -0.719020
1.033333 -0.594454 -0.007913 -0.128477 -1.653771 -0.224816 -0.751131
1.066667 -0.651322 -0.015965 -0.153168 -1.711431 -0.242049 -0.763882
1.100000 -0.710167 -0.025052 -0.176587 -1.764176 -0.257245 -0.758271
1.133333 -0.771547 -0.034706 -0.205953 -1.811693 -0.270257 -0.736685
1.166667 -0.834678 -0.044701 -0.236877 -1.854166 -0.281170 -0.701087
1.200000 -0.898316 -0.054824 -0.267891 -1.892285 -0.290266 -0.647414
1.233333 -0.963152 -0.064993 -0.300100 -1.926842 -0.297879 -0.577574
1.266667 -1.028649 -0.075111 -0.318273 -1.958129 -0.304283 -0.495150
1.300000 -1.094527 -0.085333 -0.326214 -1.986704 -0.309868 -0.405239
1.333333 -1.160744 -0.095653 -0.356896 -2.013231 -0.314952 -0.309399
1.366667 -1.227257 -0.106061 -0.364384 -2.038317 -0.319788 -0.212731
1.400000 -1.295750 -0.116470 -0.361640 -2.062259 -0.324529 -0.123757
1.433333 -1.365672 -0.127220 -0.354793 -2.085169 -0.329234 -0.046300
1.466667 -1.436398 -0.138339 -0.346766 -2.107113 -0.333900 0.016954
1.500000 -1.507817 -0.149691 -0.346073 -2.127787 -0.338386 0.066251
1.533333 -1.579272 -0.161325 -0.320969 -2.146576 -0.342529 0.095850
1.566667 -1.650984 -0.173014 -0.324770 -2.162486 -0.346111 0.110475
1.600000 -1.722662 -0.184733 -0.317635 -2.174813 -0.348921 0.111804
1.633333 -1.796364 -0.196704 -0.313325 -2.182844 -0.350779 0.104467
1.666667 -1.871189 -0.208646 -0.305925 -2.186203 -0.351586 0.091581
1.700000 -1.946433 -0.220670 -0.321806 -2.184164 -0.351278 0.076311
1.733333 -2.021437 -0.232688 -0.302021 -2.176100 -0.349828 0.065598
1.766667 -2.096148 -0.244689 -0.306444 -2.161895 -0.347297 0.057993
1.800000 -2.168395 -0.256603 -0.307443 -2.141080 -0.343686 0.054999
1.833333 -2.240761 -0.268108 -0.309577 -2.113400 -0.339047 0.055274
1.866667 -2.312680 -0.279566 -0.314595 -2.078130 -0.333289 0.059054
1.900000 -2.381653 -0.290513 -0.310105 -2.035845 -0.326461 0.062838
1.933333 -2.450083 -0.301396 -0.304868 -1.986603 -0.318504 0.065166
1.966667 -2.517922 -0.312204 -0.295940 -1.930247 -0.309317 0.064646
2.000000 -2.585125 -0.322931 -0.294515 -1.866469 -0.298836 0.062166
2.033333 -2.645686 -0.332755 -0.290313 -1.795380 -0.286983 0.055632
2.066667 -2.705527 -0.342477 -0.285557 -1.717324 -0.273818 0.044781
2.100000 -2.764608 -0.352092 -0.282403 -1.631171 -0.259171 0.031281
2.133333 -2.818231 -0.360760 -0.286189 -1.537243 -0.243126 0.016396
2.166667 -2.871026 -0.369304 -0.283935 -1.435866 -0.225773 0.004546
2.200000 -2.917471 -0.376440 -0.289029 -1.328361 -0.207384 -0.004327
2.233333 -2.963033 -0.383439 -0.283580 -1.214688 -0.188085 -0.005004
2.266667 -3.001376 -0.389173 -0.295774 -1.095939 -0.168094 0.004334
2.300000 -3.038799 -0.394761 -0.296702 -0.974478 -0.147823 0.024172
2.333333 -3.068325 -0.399049 -0.288300 -0.851950 -0.127546 0.054011
2.366667 -3.096909 -0.403184 -0.305052 -0.729998 -0.107539 0.092373
2.400000 -3.117577 -0.406201 -0.297632 -0.610380 -0.088003 0.137259
2.433333 -3.130961 -0.408062 -0.292649 -0.496735 -0.069414 0.184683
2.466667 -3.143413 -0.409764 -0.301073 -0.391433 -0.052107 0.231720
2.500000 -3.154945 -0.411310 -0.273086 -0.296297 -0.036365 0.275200
2.533333 -3.160492 -0.412086 -0.262132 -0.212787 -0.022398 0.313972
2.566667 -3.161186 -0.412174 -0.240341 -0.142800 -0.010495 0.340928
2.600000 -3.159782 -0.411457 -0.225315 -0.086827 -0.000787 0.355862
2.633333 -3.157587 -0.410405 -0.217715 -0.043654 0.006839 0.358047
2.666667 -3.154580 -0.409210 -0.207155 -0.012212 0.012467 0.345440
2.700000 -3.150786 -0.407878 -0.180319 0.008581 0.016198 0.321346
2.733333 -3.148426 -0.407029 -0.171762 0.020215 0.018184 0.286712
2.766667 -3.147730 -0.406467 -0.160969 0.025185 0.018763 0.247776
2.800000 -3.148287 -0.405995 -0.152736 0.025601 0.018268 0.206401
2.833333 -3.148152 -0.405407 -0.147542 0.023051 0.016987 0.165300
2.866667 -3.147345 -0.404708 -0.141454 0.019028 0.015240 0.129742
