t x y theta dxdt dydt dthetadt
0.000000 0.000000 0.000000 0.507794 0.007794 0.002851 -0.011295
0.033333 -0.000415 -0.000008 0.508958 0.010917 0.002624 -0.013266
0.066667 -0.000410 0.000064 0.506339 0.015642 0.002414 -0.012397
0.100000 -0.000437 0.000135 0.506079 0.022238 0.002266 -0.009362
0.133333 -0.000017 0.000292 0.503399 0.031500 0.002198 -0.007894
0.166667 0.000542 0.000384 0.508554 0.044114 0.002259 -0.008114
0.200000 0.001358 0.000388 0.502905 0.060724 0.002438 -0.014888
0.233333 0.002663 0.000487 0.503044 0.082409 0.002654 -0.027375
0.266667 0.005208 0.000380 0.507432 0.110644 0.002768 -0.050701
0.300000 0.008269 0.000375 0.504975 0.146821 0.002627 -0.087298
0.333333 0.011859 0.000476 0.511821 0.190942 0.002165 -0.134663
0.366667 0.015990 0.000686 0.504156 0.243071 0.001266 -0.191998
0.400000 0.020673 0.001008 0.509583 0.303183 -0.000201 -0.256234
0.433333 0.025922 0.001446 0.516492 0.370170 -0.002235 -0.329245
0.466667 0.040677 0.001402 0.484967 0.441197 -0.004634 -0.404693
0.500000 0.056010 0.001484 0.477848 0.513462 -0.007188 -0.480147
0.533333 0.071924 0.001697 0.438620 0.584908 -0.009739 -0.551788
0.566667 0.095279 0.001261 0.426683 0.652777 -0.012026 -0.620522
0.600000 0.124070 0.000090 0.397639 0.714078 -0.013649 -0.682675
0.633333 0.153428 -0.000933 0.372893 0.766403 -0.014279 -0.733990
0.666667 0.183340 -0.001801 0.346868 0.809760 -0.013846 -0.778149
0.700000 0.214725 -0.002668 0.327355 0.843888 -0.012109 -0.814330
0.733333 0.245732 -0.003672 0.294163 0.868452 -0.008668 -0.844807
0.766667 0.277255 -0.004506 0.263288 0.884364 -0.003148 -0.867115
0.800000 0.305796 -0.004494 0.232884 0.893567 0.004598 -0.884389
0.833333 0.334833 -0.004305 0.203207 0.897974 0.014874 -0.898730
0.866667 0.364355 -0.003933 0.172888 0.898469 0.028084 -0.908947
0.900000 0.394355 -0.003376 0.138682 0.896505 0.044288 -0.914837
0.933333 0.424821 -0.002628 0.110060 0.893699 0.063222 -0.920002
0.966667 0.455745 -0.001685 0.072886 0.891070 0.084441 -0.925647
1.000000 0.487116 -0.000544 0.038382 0.888651 0.107683 -0.930812
1.033333 0.516458 0.002713 0.005882 0.886757 0.132213 -0.934669
1.066667 0.544354 0.007778 -0.003890 0.885857 0.157160 -0.939615
1.100000 0.572837 0.014527 -0.037891 0.886182 0.181776 -0.947015
1.133333 0.601736 0.021477 -0.066448 0.887880 0.205471 -0.954129
1.166667 0.630586 0.030488 -0.108401 0.891127 0.227645 -0.960681
1.200000 0.659840 0.039694 -0.142520 0.896421 0.247613 -0.969231
1.233333 0.689490 0.049091 -0.177693 0.903806 0.265165 -0.980434
1.266667 0.719532 0.058674 -0.211619 0.913037 0.280327 -0.990097
1.300000 0.749958 0.068440 -0.247230 0.923779 0.293163 -0.998438
1.333333 0.780763 0.078384 -0.266930 0.935693 0.303741 -1.005199
1.366667 0.811940 0.088502 -0.301645 0.948408 0.312399 -1.011994
1.400000 0.843482 0.098789 -0.339291 0.961488 0.319541 -1.016474
1.433333 0.876069 0.110105 -0.378605 0.974908 0.325321 -1.017902
1.466667 0.909007 0.121581 -0.408328 0.988745 0.329834 -1.019570
1.500000 0.942029 0.133453 -0.440714 1.003148 0.333235 -1.018779
1.533333 0.975749 0.145101 -0.477782 1.018220 0.335669 -1.014729
1.566667 1.009797 0.156891 -0.512972 1.034046 0.337112 -1.004700
1.600000 1.044463 0.168382 -0.548541 1.050627 0.337521 -0.988058
1.633333 1.079412 0.179222 -0.596418 1.067560 0.337095 -0.964557
1.666667 1.114665 0.190188 -0.610056 1.084468 0.336000 -0.931162
1.700000 1.150213 0.201274 -0.646551 1.100952 0.334383 -0.889270
1.733333 1.186048 0.212477 -0.676729 1.116760 0.332431 -0.841054
1.766667 1.225269 0.223577 -0.705012 1.131435 0.330442 -0.787025
1.800000 1.264755 0.234784 -0.749647 1.144753 0.328699 -0.728119
1.833333 1.304496 0.246094 -0.768872 1.156688 0.327267 -0.666673
1.866667 1.344303 0.256990 -0.783046 1.167230 0.326251 -0.604113
1.900000 1.383957 0.267593 -0.798711 1.176271 0.325747 -0.540088
1.933333 1.422740 0.277931 -0.808813 1.183646 0.325840 -0.475408
1.966667 1.461730 0.288353 -0.831638 1.189733 0.326530 -0.412088
2.000000 1.500917 0.298854 -0.837037 1.194829 0.327903 -0.353045
2.033333 1.540626 0.309521 -0.851730 1.199224 0.330139 -0.296522
2.066667 1.581128 0.320426 -0.868241 1.203127 0.333318 -0.242882
2.100000 1.621718 0.331760 -0.861820 1.206911 0.337444 -0.195720
2.133333 1.662460 0.343156 -0.874229 1.210822 0.342475 -0.151591
2.166667 1.703341 0.354609 -0.882439 1.214719 0.348315 -0.111990
2.200000 1.744350 0.366115 -0.882308 1.218291 0.354653 -0.075309
2.233333 1.784298 0.377587 -0.863333 1.221352 0.361126 -0.045445
2.266667 1.824352 0.389101 -0.878714 1.223831 0.367445 -0.023229
2.300000 1.865007 0.401174 -0.875835 1.225593 0.373219 -0.007057
2.333333 1.906169 0.414255 -0.877255 1.226569 0.377827 -0.001808
2.366667 1.947582 0.427777 -0.873876 1.226791 0.380686 -0.004734
2.400000 1.989053 0.441316 -0.874393 1.226527 0.381403 -0.015778
2.433333 2.030573 0.454864 -0.863618 1.225835 0.379598 -0.030101
2.466667 2.072129 0.468414 -0.858912 1.224723 0.374881 -0.049092
2.500000 2.113279 0.481779 -0.868360 1.222945 0.367008 -0.069883
2.533333 2.153247 0.494509 -0.873201 1.220084 0.356174 -0.087066
2.566667 2.193220 0.507219 -0.875871 1.215525 0.342568 -0.101666
2.600000 2.233186 0.519901 -0.883525 1.208552 0.326329 -0.112770
2.633333 2.273764 0.530851 -0.887344 1.198496 0.307750 -0.121538
2.666667 2.314467 0.539606 -0.907793 1.184186 0.287681 -0.121771
2.700000 2.355135 0.548320 -0.899616 1.164511 0.267628 -0.113129
2.733333 2.395759 0.556988 -0.913371 1.138770 0.249009 -0.091570
2.766667 2.436328 0.565609 -0.905914 1.106379 0.233695 -0.052962
2.800000 2.476832 0.574178 -0.918386 1.066731 0.223772 0.008365
2.833333 2.513940 0.580170 -0.911174 1.019750 0.221328 0.093074
2.866667 2.547193 0.584411 -0.906312 0.967095 0.227520 0.192556
2.900000 2.578000 0.587867 -0.910418 0.911257 0.242473 0.297947
2.933333 2.608727 0.591267 -0.928644 0.854968 0.265959 0.393649
2.966667 2.639372 0.594613 -0.931372 0.801305 0.296952 0.465448
3.000000 2.663987 0.602470 -0.919506 0.754517 0.333274 0.494844
3.033333 2.683312 0.615601 -0.867233 0.718383 0.371859 0.469422
3.066667 2.702571 0.628663 -0.794051 0.694743 0.409809 0.384513
3.100000 2.718537 0.646010 -0.744675 0.685047 0.443901 0.243809
3.133333 2.734107 0.665931 -0.697027 0.689849 0.471210 0.051458
3.166667 2.751415 0.686701 -0.676346 0.709522 0.489007 -0.176476
3.200000 2.773451 0.708005 -0.692978 0.741920 0.496042 -0.417087
3.233333 2.795483 0.729172 -0.731949 0.784436 0.492255 -0.644208
3.266667 2.822996 0.747102 -0.773141 0.834706 0.478045 -0.833912
3.300000 2.850520 0.764864 -0.861201 0.889590 0.455283 -0.968951
3.333333 2.885503 0.778556 -0.940492 0.945631 0.426449 -1.029676
3.366667 2.920496 0.792057 -1.011374 0.999164 0.394374 -1.013037
3.400000 2.955495 0.805358 -1.069511 1.048204 0.361635 -0.925262
3.433333 2.992654 0.815051 -1.089672 1.091058 0.330752 -0.783099
3.466667 3.029808 0.824526 -1.125085 1.127007 0.303813 -0.599651
3.500000 3.069965 0.832663 -1.124253 1.155668 0.282139 -0.395981
3.533333 3.111896 0.839286 -1.108427 1.177953 0.266195 -0.194234
3.566667 3.153793 0.845676 -1.093187 1.194890 0.256354 -0.009969
3.600000 3.195643 0.851827 -1.088376 1.207115 0.252568 0.146731
3.633333 3.236626 0.859016 -1.073702 1.215632 0.253905 0.273431
3.666667 3.276528 0.867052 -1.060337 1.220969 0.259420 0.363041
3.700000 3.316345 0.874831 -1.048985 1.224089 0.268081 0.419754
3.733333 3.356957 0.883877 -1.025798 1.225489 0.278732 0.448463
3.766667 3.397867 0.893857 -1.015339 1.225705 0.290013 0.455702
3.800000 3.439305 0.904623 -0.984684 1.225356 0.300657 0.443251
3.833333 3.480610 0.915098 -0.961596 1.224781 0.309994 0.415010
3.866667 3.521736 0.926449 -0.943131 1.224278 0.317571 0.375152
3.900000 3.562752 0.938503 -0.930281 1.223898 0.322984 0.325168
3.933333 3.603593 0.950228 -0.916290 1.223689 0.326288 0.268811
3.966667 3.644248 0.961613 -0.923788 1.223603 0.327690 0.207294
4.000000 3.684702 0.972643 -0.909387 1.223583 0.327468 0.147607
4.033333 3.724943 0.983307 -0.905935 1.223771 0.325859 0.092534
4.066667 3.764958 0.993590 -0.911400 1.224253 0.323118 0.045605
4.100000 3.805734 1.004304 -0.909566 1.225097 0.319566 0.009607
4.133333 3.846964 1.015258 -0.920498 1.226294 0.315407 -0.014071
4.166667 3.887925 1.025791 -0.925592 1.227917 0.310869 -0.025014
4.200000 3.929448 1.036433 -0.921029 1.229975 0.306099 -0.025352
4.233333 3.970784 1.047040 -0.928346 1.232194 0.301086 -0.015435
4.266667 4.011807 1.057185 -0.929268 1.234274 0.295778 0.001495
4.300000 4.052499 1.066853 -0.937081 1.235921 0.290143 0.023890
4.333333 4.092846 1.076029 -0.931126 1.236857 0.284130 0.047652
4.366667 4.134469 1.085461 -0.928471 1.236592 0.277512 0.070131
4.400000 4.175716 1.094372 -0.920430 1.234820 0.270142 0.090469
4.433333 4.217558 1.103174 -0.917564 1.231308 0.261877 0.106093
4.466667 4.259615 1.112169 -0.913023 1.225614 0.252257 0.118814
4.500000 4.301682 1.121274 -0.905119 1.216867 0.240423 0.128532
4.533333 4.343299 1.129798 -0.901435 1.203776 0.225217 0.137566
4.566667 4.384449 1.137726 -0.886370 1.184819 0.205375 0.146389
4.600000 4.423939 1.145237 -0.885267 1.157793 0.179269 0.158411
4.633333 4.462926 1.152120 -0.889430 1.120666 0.145495 0.174822
4.666667 4.501394 1.158358 -0.886796 1.072126 0.103240 0.195525
4.700000 4.539327 1.163938 -0.889625 1.011742 0.052439 0.217999
4.733333 4.577193 1.168687 -0.885207 0.939882 -0.006338 0.233691
4.766667 4.614473 1.171642 -0.867638 0.857889 -0.071897 0.235729
4.800000 4.646948 1.171238 -0.850832 0.767740 -0.141844 0.209045
4.833333 4.674064 1.166374 -0.837845 0.671210 -0.213315 0.144178
4.866667 4.695632 1.157078 -0.828462 0.569756 -0.283202 0.032716
4.900000 4.710002 1.143569 -0.831683 0.464620 -0.348411 -0.124523
4.933333 4.716221 1.125325 -0.796040 0.357106 -0.405991 -0.320286
4.966667 4.721873 1.106360 -0.778865 0.247967 -0.453477 -0.546693
5.000000 4.726974 1.086683 -0.754931 0.138391 -0.489776 -0.794892
5.033333 4.731540 1.066301 -0.781456 0.029817 -0.514991 -1.060304
5.066667 4.735589 1.045222 -0.864988 -0.076482 -0.530284 -1.332433
5.100000 4.739136 1.023455 -0.960949 -0.179664 -0.537542 -1.604204
5.133333 4.732168 1.004444 -1.052263 -0.278206 -0.539594 -1.859748
5.166667 4.718462 0.988100 -1.124838 -0.369261 -0.539517 -2.081687
5.200000 4.700371 0.973661 -1.186071 -0.450138 -0.540098 -2.243686
5.233333 4.677862 0.959340 -1.231937 -0.517947 -0.543597 -2.315861
5.266667 4.652151 0.942654 -1.290861 -0.568186 -0.551323 -2.280027
5.300000 4.626142 0.925286 -1.387901 -0.596155 -0.564220 -2.122228
5.333333 4.599881 0.907241 -1.508530 -0.599800 -0.581911 -1.840330
5.366667 4.573414 0.888519 -1.672567 -0.579752 -0.603343 -1.431530
5.400000 4.546788 0.869125 -1.792667 -0.537325 -0.627025 -0.911632
5.433333 4.520049 0.849060 -1.865342 -0.473347 -0.651297 -0.307433
5.466667 4.501298 0.825044 -1.867400 -0.392422 -0.675073 0.348562
5.500000 4.492199 0.799681 -1.846329 -0.299980 -0.697209 1.018964
5.533333 4.483098 0.773675 -1.772564 -0.199421 -0.717307 1.661712
5.566667 4.474022 0.747034 -1.649267 -0.092434 -0.735516 2.229142
5.600000 4.480654 0.723159 -1.492510 0.018605 -0.752726 2.693931
5.633333 4.487345 0.698670 -1.332850 0.129624 -0.770289 3.044229
5.666667 4.494105 0.673575 -1.154793 0.239438 -0.789681 3.280519
5.700000 4.500942 0.647878 -0.983703 0.348812 -0.813030 3.411516
5.733333 4.507866 0.621586 -0.878865 0.457440 -0.842098 3.458539
5.766667 4.529123 0.595138 -0.797277 0.563050 -0.878261 3.448018
5.800000 4.550467 0.568115 -0.721473 0.665400 -0.921845 3.399799
5.833333 4.571890 0.540524 -0.658947 0.764743 -0.972487 3.327619
5.866667 4.599815 0.510199 -0.581813 0.860129 -1.029365 3.244903
5.900000 4.632487 0.476834 -0.453859 0.948742 -1.090309 3.159974
5.933333 4.668700 0.440054 -0.310092 1.028345 -1.153739 3.067786
5.966667 4.709094 0.398906 -0.153292 1.099124 -1.217892 2.959651
6.000000 4.749476 0.357263 -0.029384 1.160360 -1.281936 2.826076
6.033333 4.793838 0.308692 0.072494 1.211354 -1.344827 2.654970
6.066667 4.838129 0.259674 0.141213 1.252128 -1.406091 2.436164
6.100000 4.882314 0.210236 0.214145 1.283828 -1.466210 2.163521
6.133333 4.926360 0.160405 0.277187 1.307546 -1.524837 1.841900
6.166667 4.970233 0.110208 0.344570 1.323885 -1.582303 1.476895
6.200000 5.013898 0.059674 0.396651 1.332395 -1.638081 1.075280
6.233333 5.057320 0.008831 0.444599 1.333305 -1.692722 0.648975
6.266667 5.104381 -0.050140 0.452192 1.326713 -1.745520 0.207093
6.300000 5.151130 -0.109355 0.482789 1.312336 -1.795563 -0.236599
6.333333 5.198696 -0.173760 0.480240 1.289257 -1.841818 -0.668733
6.366667 5.245874 -0.238330 0.449588 1.255725 -1.882773 -1.070807
6.400000 5.288274 -0.305544 0.400347 1.212200 -1.917184 -1.425662
6.433333 5.330213 -0.372838 0.308808 1.158513 -1.943310 -1.715465
6.466667 5.371657 -0.440166 0.193944 1.094797 -1.960934 -1.923052
6.500000 5.412571 -0.507484 0.084698 1.021010 -1.969602 -2.036948
6.533333 5.442501 -0.574411 -0.022081 0.939244 -1.969680 -2.051165
6.566667 5.471842 -0.641243 -0.101006 0.852592 -1.961863 -1.969190
6.600000 5.500573 -0.707936 -0.194933 0.762557 -1.947242 -1.796641
6.633333 5.528669 -0.774447 -0.248050 0.671242 -1.926848 -1.550784
6.666667 5.549182 -0.839247 -0.309844 0.581002 -1.901187 -1.251664
6.700000 5.563094 -0.901858 -0.345520 0.495172 -1.871199 -0.922886
6.733333 5.576324 -0.964166 -0.380112 0.414848 -1.837821 -0.586478
6.766667 5.585288 -1.026537 -0.378863 0.340922 -1.801797 -0.264317
6.800000 5.593558 -1.088526 -0.372859 0.274471 -1.763210 0.022706
6.833333 5.598876 -1.147119 -0.347341 0.216196 -1.721955 0.261162
6.866667 5.602443 -1.201733 -0.322862 0.165722 -1.677979 0.440363
6.900000 5.605308 -1.255856 -0.277050 0.121003 -1.630547 0.555995
6.933333 5.607472 -1.309455 -0.250215 0.080465 -1.578226 0.606134
6.966667 5.608934 -1.362499 -0.198109 0.041933 -1.519656 0.596880
7.000000 5.609696 -1.414956 -0.157159 0.003308 -1.453879 0.536017
7.033333 5.611089 -1.464121 -0.122866 -0.037638 -1.380091 0.433627
7.066667 5.611783 -1.512639 -0.100020 -0.082727 -1.297033 0.301037
7.100000 5.611776 -1.560483 -0.106814 -0.132640 -1.203964 0.151667
7.133333 5.609013 -1.602179 -0.124634 -0.187281 -1.101479 -0.001464
7.166667 5.602447 -1.637523 -0.142579 -0.245994 -0.990622 -0.145477
7.200000 5.595185 -1.672131 -0.161752 -0.307638 -0.872687 -0.267844
7.233333 5.584042 -1.699272 -0.162526 -0.370336 -0.749660 -0.360320
7.266667 5.568620 -1.720410 -0.175172 -0.431813 -0.624082 -0.416484
7.300000 5.552527 -1.740795 -0.190681 -0.490000 -0.498914 -0.439230
7.333333 5.532582 -1.754265 -0.224733 -0.543133 -0.376261 -0.432325
7.366667 5.510120 -1.760741 -0.261614 -0.589661 -0.257906 -0.404314
7.400000 5.487034 -1.766486 -0.292879 -0.628439 -0.146009 -0.363049
7.433333 5.463363 -1.764911 -0.301791 -0.659134 -0.042349 -0.315377
7.466667 5.439106 -1.762640 -0.299760 -0.682086 0.051108 -0.268306
7.500000 5.414283 -1.759696 -0.290359 -0.697764 0.132715 -0.226764
7.533333 5.390335 -1.752155 -0.285380 -0.707274 0.201040 -0.193512
7.566667 5.365882 -1.741018 -0.286082 -0.712085 0.255183 -0.166214
7.600000 5.341033 -1.727084 -0.286264 -0.713769 0.294878 -0.146794
7.633333 5.316439 -1.711147 -0.294141 -0.713690 0.320542 -0.129285
7.666667 5.292276 -1.694421 -0.294212 -0.712890 0.333735 -0.109930
7.700000 5.269461 -1.678371 -0.311331 -0.712498 0.336248 -0.077475
7.733333 5.247445 -1.664715 -0.313517 -0.713285 0.329549 -0.031064
7.766667 5.225005 -1.650630 -0.333270 -0.715771 0.314477 0.025364
7.800000 5.201603 -1.644582 -0.336288 -0.720327 0.292400 0.093057
7.833333 5.177810 -1.638161 -0.368651 -0.727200 0.264380 0.163506
7.866667 5.153641 -1.631391 -0.348703 -0.736530 0.230828 0.229853
7.900000 5.129112 -1.624293 -0.309169 -0.748177 0.191842 0.276231
7.933333 5.104238 -1.616893 -0.298455 -0.761678 0.148198 0.301019
7.966667 5.079035 -1.609214 -0.256482 -0.776264 0.101384 0.301133
8.000000 5.053517 -1.601278 -0.234011 -0.791225 0.051932 0.273794
8.033333 5.027700 -1.593111 -0.207271 -0.805436 0.000083 0.219240
8.066667 5.000208 -1.593579 -0.203201 -0.817731 -0.053202 0.143536
8.100000 4.971746 -1.600016 -0.209530 -0.826995 -0.106108 0.060241
8.133333 4.942760 -1.610041 -0.204848 -0.831079 -0.157496 -0.040989
8.166667 4.913553 -1.619885 -0.228779 -0.827634 -0.206782 -0.166609
8.200000 4.884140 -1.629554 -0.241001 -0.814018 -0.252962 -0.325427
8.233333 4.854263 -1.640507 -0.262391 -0.788191 -0.294469 -0.522555
8.266667 4.824217 -1.651291 -0.273567 -0.748358 -0.331213 -0.766148
8.300000 4.796246 -1.662750 -0.282018 -0.693064 -0.364189 -1.066004
8.333333 4.768140 -1.674044 -0.288359 -0.623383 -0.394037 -1.397207
8.366667 4.745596 -1.687248 -0.291784 -0.541864 -0.420870 -1.729753
8.400000 4.722942 -1.700285 -0.301782 -0.451644 -0.444879 -2.035854
8.433333 4.700186 -1.713154 -0.311140 -0.356200 -0.467036 -2.292639
8.466667 4.692118 -1.731756 -0.480598 -0.260261 -0.487231 -2.473280
8.500000 4.691586 -1.752350 -0.696268 -0.168984 -0.504935 -2.553427
8.533333 4.694274 -1.772354 -0.879525 -0.086760 -0.519934 -2.534645
8.566667 4.700848 -1.790979 -1.030998 -0.016920 -0.532781 -2.435726
8.600000 4.707263 -1.809392 -1.136005 0.037538 -0.543980 -2.278206
8.633333 4.713498 -1.827585 -1.207180 0.074094 -0.553340 -2.087511
8.666667 4.719526 -1.845553 -1.240920 0.092931 -0.561238 -1.910170
8.700000 4.726509 -1.862452 -1.217332 0.095678 -0.568146 -1.797995
8.733333 4.732989 -1.879236 -1.207144 0.084969 -0.573871 -1.787417
8.766667 4.738159 -1.897745 -1.172042 0.063718 -0.577058 -1.905452
8.800000 4.741421 -1.917698 -1.193181 0.034609 -0.575316 -2.160551
8.833333 4.741699 -1.938990 -1.239039 0.000605 -0.566592 -2.553904
8.866667 4.739047 -1.961189 -1.321755 -0.036381 -0.548658 -3.056958
8.900000 4.736033 -1.983103 -1.452961 -0.075092 -0.519105 -3.620591
8.933333 4.732642 -2.004719 -1.605001 -0.114759 -0.476481 -4.199003
8.966667 4.728038 -2.024223 -1.762262 -0.154825 -0.421035 -4.731606
9.000000 4.722443 -2.041791 -1.963915 -0.194680 -0.355952 -5.175670
9.033333 4.716421 -2.059029 -2.159688 -0.234221 -0.284546 -5.487314
9.066667 4.709666 -2.071193 -2.358219 -0.273802 -0.210591 -5.644414
9.100000 4.701112 -2.076328 -2.633768 -0.313760 -0.138493 -5.644033
9.133333 4.687834 -2.070268 -2.870581 -0.354618 -0.073267 -5.493213
9.166667 4.674065 -2.063886 3.135840 -0.397055 -0.018899 -5.211571
9.200000 4.659802 -2.057194 2.911602 -0.441197 0.023344 -4.824891
9.233333 4.645037 -2.050205 2.761341 -0.487032 0.052289 -4.367001
9.266667 4.629761 -2.042935 2.640927 -0.534631 0.067598 -3.870036
9.300000 4.613966 -2.035399 2.569129 -0.584408 0.070027 -3.368552
9.333333 4.592430 -2.035968 2.495942 -0.636046 0.063046 -2.888877
9.366667 4.570371 -2.036294 2.450997 -0.689157 0.049980 -2.463672
9.400000 4.547787 -2.036383 2.402846 -0.743669 0.033314 -2.107577
9.433333 4.524676 -2.036243 2.343773 -0.799481 0.015604 -1.827662
9.466667 4.494605 -2.037204 2.294433 -0.855528 -0.000747 -1.620451
9.500000 4.464013 -2.037949 2.263836 -0.910417 -0.013822 -1.474629
9.533333 4.432907 -2.038483 2.202811 -0.963674 -0.024062 -1.376436
9.566667 4.400250 -2.039411 2.179160 -1.014737 -0.031860 -1.309200
9.600000 4.364081 -2.040946 2.115411 -1.062938 -0.037478 -1.261307
9.633333 4.325946 -2.042682 2.080953 -1.107273 -0.041136 -1.226100
9.666667 4.286531 -2.044558 2.035151 -1.147802 -0.043288 -1.199411
9.700000 4.246655 -2.046247 2.005138 -1.184617 -0.044415 -1.178504
9.733333 4.207210 -2.047992 1.979280 -1.217517 -0.044307 -1.167518
9.766667 4.165539 -2.049922 1.937751 -1.246331 -0.042826 -1.163254
9.800000 4.122308 -2.051714 1.893068 -1.271089 -0.040002 -1.166882
9.833333 4.078309 -2.053298 1.856468 -1.292193 -0.035966 -1.174195
9.866667 4.033929 -2.054709 1.827844 -1.309805 -0.030792 -1.186509
9.900000 3.989184 -2.055949 1.787961 -1.324242 -0.024545 -1.202683
9.933333 3.944178 -2.056711 1.744958 -1.335671 -0.017310 -1.217145
9.966667 3.898844 -2.057307 1.698857 -1.344476 -0.009187 -1.228652
10.000000 3.853284 -2.057511 1.655730 -1.351280 -0.000282 -1.237084
10.033333 3.807845 -2.057351 1.609181 -1.356639 0.009371 -1.244103
10.066667 3.762132 -2.057035 1.571095 -1.360853 0.019728 -1.247384
10.100000 3.716162 -2.056567 1.520543 -1.363981 0.030706 -1.244711
10.133333 3.671739 -2.055520 1.481033 -1.366309 0.042166 -1.238778
10.166667 3.627094 -2.054328 1.454063 -1.367976 0.053998 -1.232874
10.200000 3.581627 -2.052451 1.410371 -1.368855 0.066164 -1.224340
10.233333 3.535381 -2.049922 1.357079 -1.368702 0.078543 -1.212993
10.266667 3.489090 -2.046726 1.324103 -1.367462 0.090962 -1.199285
10.300000 3.442644 -2.043405 1.291106 -1.365355 0.103234 -1.187687
10.333333 3.396061 -2.039965 1.239012 -1.362249 0.115272 -1.176909
10.366667 3.349856 -2.035820 1.203416 -1.358055 0.126937 -1.166155
10.400000 3.304508 -2.031108 1.160422 -1.352669 0.138100 -1.157371
10.433333 3.260408 -2.025965 1.126194 -1.346154 0.148677 -1.150649
10.466667 3.216236 -2.020729 1.086625 -1.338637 0.158761 -1.147156
10.500000 3.172006 -2.015406 1.055427 -1.330144 0.168518 -1.145022
10.533333 3.127204 -2.009546 1.020526 -1.320906 0.178029 -1.144763
10.566667 3.083009 -2.003267 0.981702 -1.311123 0.187442 -1.144646
10.600000 3.039179 -1.996654 0.948578 -1.301094 0.196850 -1.144887
10.633333 2.995348 -1.989986 0.907958 -1.291081 0.206364 -1.147143
10.666667 2.952131 -1.983186 0.861226 -1.281005 0.215902 -1.148757
10.700000 2.908940 -1.976348 0.813596 -1.270628 0.225284 -1.149296
10.733333 2.867182 -1.968865 0.773811 -1.259867 0.234359 -1.148140
10.766667 2.827205 -1.961223 0.756464 -1.248724 0.242984 -1.148259
10.800000 2.786053 -1.952432 0.707498 -1.236919 0.250985 -1.147738
10.833333 2.744885 -1.943082 0.667175 -1.224106 0.258108 -1.145379
10.866667 2.703796 -1.933741 0.636849 -1.210175 0.264140 -1.144753
10.900000 2.662799 -1.924422 0.599006 -1.195268 0.268881 -1.144773
10.933333 2.621902 -1.915134 0.560902 -1.179266 0.272168 -1.146432
10.966667 2.581117 -1.905889 0.519686 -1.161702 0.273734 -1.144943
11.000000 2.542440 -1.896369 0.486213 -1.142639 0.273345 -1.141812
11.033333 2.505604 -1.887002 0.433140 -1.122282 0.270748 -1.134161
11.066667 2.468904 -1.877710 0.404578 -1.100916 0.265748 -1.120800
11.100000 2.432283 -1.868394 0.365584 -1.078757 0.258238 -1.102568
11.133333 2.396763 -1.859141 0.326451 -1.056194 0.248107 -1.078104
11.166667 2.361724 -1.850153 0.282410 -1.034032 0.235293 -1.052443
11.200000 2.328022 -1.841492 0.245157 -1.012758 0.219766 -1.025803
11.233333 2.294951 -1.833556 0.218595 -0.992722 0.201769 -1.002471
11.266667 2.261901 -1.826072 0.186443 -0.974079 0.181438 -0.980478
11.300000 2.230224 -1.819728 0.158401 -0.957195 0.158896 -0.961108
11.333333 2.199116 -1.814771 0.131485 -0.942318 0.134346 -0.945071
11.366667 2.169050 -1.811734 0.106135 -0.929628 0.108237 -0.928484
11.400000 2.139157 -1.808857 0.064720 -0.919153 0.081084 -0.909116
11.433333 2.109436 -1.806146 0.043670 -0.910864 0.053111 -0.885113
11.466667 2.079886 -1.803604 0.021554 -0.905019 0.024663 -0.857592
11.500000 2.050048 -1.802870 -0.034912 -0.901493 -0.003843 -0.822330
11.533333 2.020011 -1.804142 -0.071512 -0.900138 -0.032047 -0.778931
11.566667 1.990148 -1.805589 -0.090339 -0.900550 -0.059868 -0.728688
11.600000 1.961467 -1.808613 -0.117646 -0.902571 -0.087098 -0.672514
11.633333 1.931277 -1.812643 -0.136501 -0.906123 -0.113336 -0.611094
11.666667 1.901262 -1.816845 -0.143833 -0.910828 -0.138154 -0.545109
11.700000 1.870361 -1.822045 -0.160633 -0.916289 -0.161280 -0.481623
11.733333 1.839869 -1.828281 -0.180510 -0.922247 -0.182577 -0.421308
11.766667 1.810157 -1.835325 -0.191577 -0.928657 -0.201780 -0.364563
11.800000 1.779432 -1.843228 -0.204553 -0.935183 -0.218873 -0.313738
11.833333 1.747181 -1.851647 -0.209922 -0.941420 -0.233934 -0.269320
11.866667 1.715120 -1.860207 -0.219586 -0.947061 -0.247105 -0.230607
11.900000 1.683253 -1.868899 -0.224441 -0.952073 -0.258430 -0.195563
11.933333 1.651584 -1.877717 -0.220265 -0.956298 -0.267940 -0.167666
11.966667 1.619160 -1.887061 -0.235106 -0.959403 -0.275737 -0.147178
12.000000 1.586943 -1.896514 -0.237178 -0.961335 -0.281929 -0.134643
12.033333 1.554507 -1.906375 -0.245738 -0.962276 -0.286567 -0.128304
12.066667 1.521964 -1.916397 -0.239389 -0.962394 -0.289638 -0.129057
12.100000 1.489644 -1.926503 -0.235843 -0.961751 -0.291214 -0.134442
12.133333 1.457554 -1.936684 -0.235619 -0.960436 -0.291273 -0.140287
12.166667 1.425699 -1.946932 -0.248757 -0.958752 -0.289811 -0.146218
12.200000 1.394085 -1.957237 -0.248620 -0.956901 -0.286764 -0.149715
12.233333 1.361964 -1.966642 -0.263686 -0.954991 -0.282271 -0.149346
12.266667 1.330095 -1.976086 -0.275709 -0.953166 -0.276600 -0.144385
12.300000 1.298485 -1.985563 -0.278441 -0.951555 -0.269962 -0.133792
12.333333 1.267139 -1.995062 -0.292129 -0.950324 -0.262627 -0.117484
12.366667 1.235548 -2.003864 -0.299166 -0.949514 -0.254886 -0.096560
12.400000 1.204097 -2.011998 -0.289208 -0.949176 -0.247050 -0.071740
12.433333 1.172060 -2.019712 -0.284807 -0.949142 -0.239199 -0.049045
12.466667 1.140530 -2.027109 -0.293162 -0.949257 -0.231302 -0.028774
12.500000 1.109298 -2.034494 -0.292179 -0.949296 -0.223377 -0.014676
12.533333 1.078371 -2.041861 -0.298256 -0.949018 -0.215420 -0.006351
12.566667 1.046218 -2.048996 -0.285307 -0.948199 -0.207250 -0.003952
12.600000 1.014386 -2.056101 -0.291215 -0.946600 -0.198653 -0.005591
12.633333 0.982036 -2.062652 -0.269544 -0.944123 -0.189509 -0.008715
12.666667 0.950025 -2.069163 -0.283185 -0.940541 -0.179764 -0.013228
12.700000 0.918360 -2.075626 -0.287287 -0.935695 -0.169319 -0.017333
12.733333 0.886806 -2.081556 -0.286768 -0.929245 -0.158058 -0.023484
12.766667 0.855883 -2.086749 -0.300138 -0.920969 -0.146090 -0.028632
12.800000 0.825195 -2.090979 -0.303424 -0.910547 -0.133556 -0.035152
12.833333 0.794889 -2.095145 -0.299509 -0.897718 -0.120531 -0.039258
12.866667 0.764974 -2.099242 -0.292098 -0.882307 -0.107088 -0.042163
12.900000 0.734727 -2.102397 -0.289238 -0.864081 -0.093376 -0.044473
12.933333 0.704890 -2.105479 -0.285157 -0.843036 -0.079559 -0.045363
12.966667 0.675956 -2.107807 -0.296393 -0.819101 -0.065688 -0.047371
13.000000 0.648337 -2.109668 -0.304876 -0.792487 -0.051821 -0.048441
13.033333 0.621151 -2.111449 -0.305944 -0.763292 -0.038139 -0.050336
13.066667 0.596364 -2.112419 -0.307958 -0.731767 -0.024912 -0.050346
13.100000 0.572022 -2.113309 -0.307831 -0.698288 -0.012265 -0.047096
13.133333 0.549229 -2.113386 -0.310230 -0.663423 -0.000412 -0.039422
13.166667 0.527793 -2.112518 -0.308893 -0.627713 0.010392 -0.028089
13.200000 0.507919 -2.111377 -0.310805 -0.591506 0.019895 -0.015563
13.233333 0.488500 -2.110156 -0.312100 -0.555332 0.027899 -0.003019
13.266667 0.471227 -2.108561 -0.316639 -0.519617 0.034339 0.008271
13.300000 0.454408 -2.106889 -0.321275 -0.484729 0.039079 0.017724
13.333333 0.438042 -2.105145 -0.313289 -0.450711 0.042131 0.024698
13.366667 0.424018 -2.103262 -0.307765 -0.417616 0.043594 0.030387
13.400000 0.411900 -2.101645 -0.301054 -0.385584 0.043654 0.034469
13.433333 0.400224 -2.099960 -0.295783 -0.354683 0.042525 0.036722
13.466667 0.388985 -2.098208 -0.298912 -0.324870 0.040456 0.036469
13.500000 0.378686 -2.096726 -0.307062 -0.296146 0.037724 0.034318
13.533333 0.369261 -2.095528 -0.306498 -0.268638 0.034576 0.030591
13.566667 0.360948 -2.094397 -0.306147 -0.242633 0.031293 0.025450
13.600000 0.353831 -2.093646 -0.299173 -0.218291 0.028090 0.020455
13.633333 0.347114 -2.092836 -0.296354 -0.195774 0.025177 0.016511
13.666667 0.340788 -2.091966 -0.288928 -0.175316 0.022700 0.014060
13.700000 0.336270 -2.091662 -0.294628 -0.157328 0.020788 0.011564
13.733333 0.332123 -2.091299 -0.303326 -0.142144 0.019511 0.008841
13.766667 0.328684 -2.090898 -0.304001 -0.129806 0.018830 0.006977
13.800000 0.325592 -2.090437 -0.300951 -0.120343 0.018663 0.006731
13.833333 0.322836 -2.089917 -0.292059 -0.113714 0.018905 0.007116
13.866667 0.320405 -2.089338 -0.287996 -0.109874 0.019450 0.006621
13.900000 0.316534 -2.088617 -0.298663 -0.108145 0.020140 0.007417
