t x y theta dxdt dydt dthetadt
0.000000 0.000000 0.000000 -2.875938 -0.149952 -0.008668 0.005449
0.033333 -0.005020 -0.000286 -2.866110 -0.152407 -0.008543 0.000313
0.066667 -0.010131 -0.000568 -2.879533 -0.154878 -0.008415 -0.006431
0.100000 -0.015335 -0.000847 -2.875262 -0.157359 -0.008285 -0.012606
0.133333 -0.020630 -0.001123 -2.872303 -0.159840 -0.008150 -0.018691
0.166667 -0.026017 -0.001396 -2.880403 -0.162315 -0.008011 -0.021730
0.200000 -0.031465 -0.001661 -2.878757 -0.164781 -0.007868 -0.021530
0.233333 -0.037005 -0.001922 -2.882644 -0.167231 -0.007719 -0.018389
0.266667 -0.042636 -0.002179 -2.884595 -0.169659 -0.007564 -0.013503
0.300000 -0.048324 -0.002429 -2.875392 -0.172065 -0.007403 -0.009012
0.333333 -0.054104 -0.002674 -2.887112 -0.174446 -0.007236 -0.003086
0.366667 -0.059976 -0.002915 -2.878723 -0.176803 -0.007064 0.001317
0.400000 -0.065900 -0.003147 -2.876642 -0.179130 -0.006885 0.003463
0.433333 -0.071916 -0.003375 -2.883899 -0.181424 -0.006700 0.004736
0.466667 -0.078021 -0.003598 -2.882715 -0.183686 -0.006509 0.004211
0.500000 -0.084175 -0.003812 -2.875615 -0.185909 -0.006311 0.003767
0.533333 -0.090419 -0.004020 -2.876033 -0.188082 -0.006105 0.002614
0.566667 -0.096751 -0.004224 -2.880269 -0.190199 -0.005891 0.000857
0.600000 -0.103127 -0.004417 -2.868747 -0.192258 -0.005668 0.000285
0.633333 -0.109590 -0.004605 -2.887384 -0.194251 -0.005437 -0.000455
0.666667 -0.116140 -0.004787 -2.885224 -0.196162 -0.005195 -0.000418
0.700000 -0.122727 -0.004958 -2.871890 -0.197977 -0.004941 -0.000163
0.733333 -0.129348 -0.005118 -2.887094 -0.199698 -0.004676 -0.000773
0.766667 -0.136054 -0.005272 -2.877025 -0.201317 -0.004399 0.000132
0.800000 -0.142844 -0.005420 -2.875472 -0.202826 -0.004110 0.000810
0.833333 -0.149661 -0.005555 -2.889999 -0.204231 -0.003809 0.001619
0.866667 -0.156503 -0.005678 -2.870358 -0.205556 -0.003499 0.001383
0.900000 -0.163426 -0.005795 -2.878629 -0.206819 -0.003183 0.001141
0.933333 -0.170369 -0.005899 -2.878156 -0.208028 -0.002860 0.000355
0.966667 -0.177329 -0.005989 -2.878024 -0.209203 -0.002535 -0.002984
1.000000 -0.184304 -0.006066 -2.877266 -0.210361 -0.002208 -0.004224
1.033333 -0.191290 -0.006129 -2.886048 -0.211502 -0.001879 -0.005976
1.066667 -0.198351 -0.006185 -2.888027 -0.212608 -0.001548 -0.005123
1.100000 -0.205418 -0.006227 -2.862379 -0.213675 -0.001214 -0.003863
1.133333 -0.212557 -0.006262 -2.886581 -0.214686 -0.000876 0.001873
1.166667 -0.219766 -0.006289 -2.876566 -0.215615 -0.000531 0.009545
1.200000 -0.227043 -0.006308 -2.874225 -0.216438 -0.000176 0.013377
1.233333 -0.234314 -0.006312 -2.892645 -0.217138 0.000189 0.018026
1.266667 -0.241650 -0.006308 -2.892215 -0.217715 0.000565 0.021489
1.300000 -0.248974 -0.006288 -2.881008 -0.218157 0.000952 0.024705
1.333333 -0.256282 -0.006252 -2.864885 -0.218478 0.001350 0.020532
1.366667 -0.263571 -0.006200 -2.874699 -0.218706 0.001754 0.015612
1.400000 -0.270837 -0.006132 -2.872452 -0.218870 0.002162 0.012447
1.433333 -0.278159 -0.006054 -2.871362 -0.218995 0.002572 0.006627
1.466667 -0.285452 -0.005960 -2.860057 -0.219098 0.002980 -0.003203
1.500000 -0.292711 -0.005849 -2.873951 -0.219195 0.003385 -0.012885
1.533333 -0.300019 -0.005728 -2.884430 -0.219275 0.003788 -0.016394
1.566667 -0.307287 -0.005590 -2.873579 -0.219319 0.004190 -0.018109
1.600000 -0.314599 -0.005443 -2.871434 -0.219298 0.004594 -0.016502
1.633333 -0.321953 -0.005286 -2.887919 -0.219191 0.005003 -0.008790
1.666667 -0.329346 -0.005120 -2.886444 -0.218977 0.005419 0.007928
1.700000 -0.336682 -0.004935 -2.875449 -0.218621 0.005845 0.022860
1.733333 -0.344053 -0.004741 -2.884187 -0.218104 0.006284 0.033783
1.766667 -0.351359 -0.004528 -2.876435 -0.217408 0.006738 0.033660
1.800000 -0.358596 -0.004296 -2.882184 -0.216522 0.007207 0.015906
1.833333 -0.365858 -0.004054 -2.877020 -0.215417 0.007693 -0.028004
1.866667 -0.373042 -0.003792 -2.879997 -0.214086 0.008198 -0.106640
1.900000 -0.380145 -0.003511 -2.856173 -0.212538 0.008723 -0.220900
1.933333 -0.387256 -0.003215 -2.844828 -0.210789 0.009268 -0.379521
1.966667 -0.394368 -0.002904 -2.843871 -0.208847 0.009833 -0.571888
2.000000 -0.401384 -0.002572 -2.843400 -0.206722 0.010420 -0.798574
2.033333 -0.408300 -0.002221 -2.896122 -0.204438 0.011026 -1.046579
2.066667 -0.415111 -0.001849 -2.901866 -0.202006 0.011649 -1.308053
2.100000 -0.421813 -0.001457 -2.973413 -0.199422 0.012287 -1.561956
2.133333 -0.428400 -0.001045 -3.028818 -0.196679 0.012941 -1.791012
2.166667 -0.434869 -0.000612 -3.097730 -0.193786 0.013613 -1.992984
2.200000 -0.441267 -0.000131 3.094694 -0.190750 0.014305 -2.148350
2.233333 -0.447628 0.000361 2.961250 -0.187559 0.015020 -2.260251
2.266667 -0.453934 0.000871 2.866244 -0.184201 0.015766 -2.326000
2.300000 -0.460104 0.001403 2.822985 -0.180665 0.016550 -2.376058
2.333333 -0.466131 0.001954 2.708087 -0.176934 0.017377 -2.415398
2.366667 -0.472011 0.002527 2.645782 -0.172981 0.018251 -2.456601
2.400000 -0.477739 0.003120 2.559644 -0.168789 0.019177 -2.524386
2.433333 -0.483337 0.003753 2.489778 -0.164351 0.020157 -2.626320
2.466667 -0.488793 0.004427 2.425983 -0.159671 0.021190 -2.773139
2.500000 -0.494095 0.005145 2.374787 -0.154758 0.022273 -2.937001
2.533333 -0.499229 0.005908 2.337196 -0.149622 0.023396 -3.134645
2.566667 -0.504187 0.006692 2.220973 -0.144275 0.024552 -3.366852
2.600000 -0.508957 0.007523 2.085224 -0.138728 0.025728 -3.620426
2.633333 -0.513531 0.008403 1.837045 -0.132987 0.026913 -3.874072
2.666667 -0.517899 0.009336 1.752041 -0.127061 0.028090 -4.105327
2.700000 -0.522074 0.010288 1.618429 -0.120959 0.029249 -4.307665
2.733333 -0.526033 0.011295 1.457354 -0.114691 0.030380 -4.442490
2.766667 -0.529790 0.012319 1.340724 -0.108265 0.031478 -4.474480
2.800000 -0.533320 0.013399 1.147001 -0.101689 0.032533 -4.382991
2.833333 -0.536618 0.014534 1.018377 -0.094973 0.033540 -4.179794
2.866667 -0.539700 0.015686 0.848108 -0.088118 0.034497 -3.861944
2.900000 -0.542563 0.016854 0.562171 -0.081122 0.035402 -3.425371
2.933333 -0.545173 0.018071 0.381749 -0.073979 0.036255 -2.883257
2.966667 -0.547555 0.019303 0.278344 -0.066687 0.037054 -2.259570
3.000000 -0.549706 0.020550 0.243790 -0.059242 0.037801 -1.585810
3.033333 -0.551584 0.021838 0.238557 -0.051631 0.038503 -0.872227
3.066667 -0.553223 0.023138 0.245378 -0.043836 0.039165 -0.152100
3.100000 -0.554570 0.024474 0.284497 -0.035846 0.039790 0.524621
3.133333 -0.555671 0.025821 0.324084 -0.027660 0.040380 1.118658
3.166667 -0.556522 0.027178 0.390527 -0.019266 0.040941 1.605135
3.200000 -0.557120 0.028546 0.486422 -0.010656 0.041477 1.975727
3.233333 -0.557383 0.029941 0.583522 -0.001835 0.041987 2.224572
3.266667 -0.557301 0.031363 0.713373 0.007172 0.042469 2.355389
3.300000 -0.556958 0.032793 0.803560 0.016341 0.042923 2.392987
3.333333 -0.556348 0.034228 0.902314 0.025652 0.043349 2.368299
3.366667 -0.555380 0.035684 1.019433 0.035064 0.043742 2.307919
3.400000 -0.554050 0.037159 1.108787 0.044528 0.044096 2.236713
3.433333 -0.552356 0.038652 1.186189 0.054009 0.044408 2.169287
3.466667 -0.550388 0.040148 1.207103 0.063490 0.044674 2.127183
3.500000 -0.548056 0.041659 1.206466 0.072947 0.044890 2.124250
3.533333 -0.545445 0.043171 1.235767 0.082357 0.045052 2.164363
3.566667 -0.542552 0.044682 1.312170 0.091720 0.045160 2.244717
3.600000 -0.539302 0.046208 1.385534 0.101050 0.045213 2.357418
3.633333 -0.535767 0.047730 1.466959 0.110359 0.045212 2.497761
3.666667 -0.531946 0.049248 1.589305 0.119647 0.045157 2.633605
3.700000 -0.527836 0.050762 1.697785 0.128929 0.045050 2.731169
3.733333 -0.523437 0.052269 1.819041 0.138220 0.044894 2.756930
3.766667 -0.518685 0.053774 1.907974 0.147525 0.044689 2.697378
3.800000 -0.513576 0.055271 1.991884 0.156846 0.044440 2.544837
3.833333 -0.508175 0.056759 2.101619 0.166185 0.044147 2.301405
3.866667 -0.502482 0.058236 2.243281 0.175550 0.043813 2.000371
3.900000 -0.496494 0.059701 2.335825 0.184943 0.043440 1.679350
3.933333 -0.490148 0.061149 2.444862 0.194359 0.043028 1.378109
3.966667 -0.483507 0.062583 2.513581 0.203794 0.042581 1.115715
4.000000 -0.476571 0.064001 2.432719 0.213251 0.042097 0.914998
4.033333 -0.469340 0.065403 2.365342 0.222720 0.041578 0.784204
4.066667 -0.461813 0.066786 2.285440 0.232201 0.041022 0.726898
4.100000 -0.453932 0.068153 2.253174 0.241692 0.040428 0.737073
4.133333 -0.445696 0.069500 2.284412 0.251206 0.039794 0.803354
4.166667 -0.437108 0.070825 2.382387 0.260758 0.039118 0.912153
4.200000 -0.428226 0.072128 2.454113 0.270350 0.038396 1.031580
4.233333 -0.419052 0.073407 2.535932 0.279997 0.037625 1.138925
4.266667 -0.409585 0.074661 2.607512 0.289711 0.036804 1.201300
4.300000 -0.399827 0.075889 2.646491 0.299500 0.035930 1.196656
4.333333 -0.389712 0.077084 2.698563 0.309356 0.035005 1.116602
4.366667 -0.379309 0.078251 2.719337 0.319280 0.034029 0.969583
4.400000 -0.368543 0.079381 2.745541 0.329267 0.033006 0.768884
4.433333 -0.357414 0.080475 2.795606 0.339303 0.031937 0.527393
4.466667 -0.345918 0.081529 2.816584 0.349369 0.030827 0.263808
4.500000 -0.334054 0.082542 2.813227 0.359449 0.029680 -0.009038
4.533333 -0.321910 0.083521 2.820819 0.369542 0.028500 -0.289318
4.566667 -0.309393 0.084456 2.818162 0.379633 0.027291 -0.579128
4.600000 -0.296500 0.085347 2.777237 0.389726 0.026055 -0.867017
4.633333 -0.283335 0.086199 2.727024 0.399821 0.024795 -1.139609
4.666667 -0.269902 0.087011 2.695334 0.409933 0.023513 -1.384826
4.700000 -0.256084 0.087778 2.644524 0.420070 0.022208 -1.589106
4.733333 -0.242004 0.088502 2.568955 0.430248 0.020881 -1.730848
4.766667 -0.227533 0.089181 2.516566 0.440474 0.019529 -1.802934
4.800000 -0.212670 0.089814 2.430802 0.450742 0.018148 -1.811257
4.833333 -0.197414 0.090401 2.320733 0.461055 0.016734 -1.773435
4.866667 -0.181911 0.090942 2.192967 0.471390 0.015282 -1.711025
4.900000 -0.166014 0.091436 2.123356 0.481729 0.013787 -1.653074
4.933333 -0.149725 0.091883 2.080397 0.492009 0.012242 -1.645502
4.966667 -0.133203 0.092280 2.070281 0.502195 0.010644 -1.721893
5.000000 -0.116293 0.092624 2.082555 0.512236 0.008988 -1.908782
5.033333 -0.098997 0.092914 2.070238 0.522080 0.007276 -2.223860
5.066667 -0.081316 0.093144 2.066942 0.531672 0.005507 -2.674610
5.100000 -0.063425 0.093319 2.037641 0.540957 0.003684 -3.244551
5.133333 -0.045153 0.093425 1.978863 0.549903 0.001812 -3.889770
5.166667 -0.026502 0.093457 1.840017 0.558454 -0.000101 -4.555099
5.200000 -0.007661 0.093430 1.648261 0.566583 -0.002051 -5.185456
5.233333 0.011555 0.093323 1.413750 0.574243 -0.004029 -5.717168
5.266667 0.030947 0.093155 1.099695 0.581435 -0.006028 -6.089343
5.300000 0.050509 0.092925 0.799661 0.588165 -0.008042 -6.263373
5.333333 0.070232 0.092632 0.549557 0.594453 -0.010068 -6.225268
5.366667 0.090323 0.092260 0.227276 0.600335 -0.012103 -5.978150
5.400000 0.110559 0.091822 -0.037752 0.605850 -0.014145 -5.533592
5.433333 0.130934 0.091318 -0.237581 0.611074 -0.016194 -4.924970
5.466667 0.151440 0.090746 -0.383876 0.616031 -0.018254 -4.201104
5.500000 0.172068 0.090107 -0.463606 0.620761 -0.020323 -3.410289
5.533333 0.192809 0.089398 -0.546125 0.625306 -0.022400 -2.588923
5.566667 0.213657 0.088618 -0.607726 0.629746 -0.024483 -1.780665
5.600000 0.234836 0.087773 -0.650534 0.634116 -0.026569 -1.026571
5.633333 0.256104 0.086854 -0.663444 0.638440 -0.028656 -0.346315
5.666667 0.277451 0.085863 -0.649609 0.642770 -0.030740 0.246805
5.700000 0.298870 0.084797 -0.601176 0.647129 -0.032818 0.750267
5.733333 0.320574 0.083670 -0.524260 0.651484 -0.034892 1.154220
5.766667 0.342331 0.082467 -0.468790 0.655764 -0.036965 1.458316
5.800000 0.364132 0.081187 -0.396724 0.659927 -0.039042 1.674440
5.833333 0.386173 0.079846 -0.311206 0.663922 -0.041124 1.799185
5.866667 0.408439 0.078445 -0.215098 0.667656 -0.043221 1.843378
5.900000 0.430911 0.076981 -0.118302 0.671034 -0.045341 1.809378
5.933333 0.453573 0.075455 -0.079137 0.674010 -0.047488 1.712471
5.966667 0.476227 0.073846 0.009554 0.676528 -0.049669 1.565265
6.000000 0.499038 0.072174 0.029297 0.678524 -0.051888 1.378368
6.033333 0.521820 0.070417 0.090831 0.679950 -0.054150 1.168256
6.066667 0.544562 0.068574 0.142859 0.680806 -0.056456 0.942477
6.100000 0.567402 0.066666 0.140223 0.681115 -0.058803 0.719945
6.133333 0.590181 0.064670 0.176907 0.680897 -0.061191 0.501249
6.166667 0.613020 0.062605 0.169467 0.680177 -0.063617 0.302200
6.200000 0.635775 0.060452 0.188917 0.678995 -0.066079 0.123612
6.233333 0.658435 0.058208 0.175011 0.677374 -0.068576 -0.020342
6.266667 0.681092 0.055890 0.169184 0.675311 -0.071109 -0.117222
6.300000 0.703631 0.053480 0.134571 0.672813 -0.073680 -0.165880
6.333333 0.726124 0.050991 0.128876 0.669867 -0.076290 -0.153499
6.366667 0.748549 0.048422 0.100584 0.666469 -0.078942 -0.081160
6.400000 0.770822 0.045758 0.083987 0.662609 -0.081637 0.058639
6.433333 0.792930 0.042998 0.073812 0.658282 -0.084378 0.250946
6.466667 0.814906 0.040150 0.052454 0.653493 -0.087164 0.480737
6.500000 0.836731 0.037213 0.046246 0.648229 -0.089998 0.732660
6.533333 0.858356 0.034177 0.059987 0.642494 -0.092882 0.989659
6.566667 0.879769 0.031041 0.129446 0.636297 -0.095815 1.231125
6.600000 0.900974 0.027808 0.212318 0.629642 -0.098796 1.435819
6.633333 0.921949 0.024476 0.287090 0.622532 -0.101827 1.594959
6.666667 0.942676 0.021043 0.364127 0.614975 -0.104908 1.701776
6.700000 0.963146 0.017506 0.448609 0.606985 -0.108036 1.755679
6.733333 0.983347 0.013865 0.536078 0.598568 -0.111211 1.754497
6.766667 1.003268 0.010118 0.603026 0.589715 -0.114435 1.707693
6.800000 1.022870 0.006260 0.647402 0.580433 -0.117708 1.627054
6.833333 1.042135 0.002288 0.683279 0.570721 -0.121031 1.522457
6.866667 1.061086 -0.001793 0.715845 0.560562 -0.124406 1.402581
6.900000 1.079712 -0.005981 0.762334 0.549947 -0.127837 1.271124
6.933333 1.097945 -0.010293 0.804156 0.538860 -0.131326 1.135286
6.966667 1.115831 -0.014715 0.844443 0.527302 -0.134872 0.995368
7.000000 1.133360 -0.019247 0.883008 0.515251 -0.138479 0.847932
7.033333 1.150435 -0.023912 0.935190 0.502708 -0.142145 0.686626
7.066667 1.167131 -0.028688 0.951524 0.489678 -0.145866 0.508263
7.100000 1.183332 -0.033604 0.973310 0.476157 -0.149639 0.314922
7.133333 1.199134 -0.038632 0.972966 0.462154 -0.153458 0.109128
7.166667 1.214404 -0.043804 0.981268 0.447679 -0.157319 -0.105794
7.200000 1.229122 -0.049121 0.975321 0.432771 -0.161207 -0.324684
7.233333 1.243412 -0.054552 0.959493 0.417426 -0.165119 -0.541318
7.266667 1.257114 -0.060129 0.926617 0.401675 -0.169042 -0.751006
7.300000 1.270371 -0.065821 0.903152 0.385544 -0.172970 -0.951424
7.333333 1.283004 -0.071660 0.852101 0.369065 -0.176890 -1.137555
7.366667 1.295174 -0.077614 0.807361 0.352232 -0.180800 -1.303582
7.400000 1.306691 -0.083713 0.746920 0.335054 -0.184698 -1.434764
7.433333 1.317541 -0.089955 0.701311 0.317575 -0.188575 -1.507783
7.466667 1.327903 -0.096312 0.652995 0.299804 -0.192431 -1.492111
7.500000 1.337771 -0.102784 0.618886 0.281756 -0.196265 -1.354743
7.533333 1.346936 -0.109393 0.540305 0.263419 -0.200080 -1.071489
7.566667 1.355386 -0.116139 0.432936 0.244824 -0.203878 -0.619817
7.600000 1.363321 -0.123000 0.341273 0.225947 -0.207665 0.004959
7.633333 1.370524 -0.129994 0.273242 0.206752 -0.211451 0.786326
7.666667 1.377199 -0.137102 0.261136 0.187214 -0.215245 1.683119
7.700000 1.383130 -0.144341 0.265125 0.167347 -0.219052 2.648777
7.733333 1.388522 -0.151694 0.325956 0.147180 -0.222873 3.630228
7.766667 1.393155 -0.159179 0.473961 0.126729 -0.226709 4.563221
7.800000 1.397240 -0.166777 0.751220 0.106061 -0.230557 5.383804
7.833333 1.400552 -0.174511 1.091403 0.085263 -0.234406 6.038396
7.866667 1.403084 -0.182384 1.428992 0.064441 -0.238243 6.495160
7.900000 1.404832 -0.190398 1.731858 0.043649 -0.242057 6.723753
7.933333 1.405791 -0.198553 2.011609 0.022959 -0.245834 6.712070
7.966667 1.405957 -0.206851 2.224185 0.002464 -0.249555 6.477559
8.000000 1.405554 -0.215258 2.428045 -0.017776 -0.253202 6.057422
8.033333 1.404580 -0.223775 2.666456 -0.037754 -0.256760 5.498337
8.066667 1.403033 -0.232400 2.883814 -0.057511 -0.260212 4.844325
8.100000 1.400679 -0.241164 3.032529 -0.077072 -0.263544 4.148102
8.133333 1.397749 -0.250034 -3.119240 -0.096510 -0.266743 3.453022
8.166667 1.394243 -0.259011 -3.054436 -0.115948 -0.269795 2.788269
8.200000 1.390158 -0.268093 -2.992540 -0.135482 -0.272695 2.173832
8.233333 1.385317 -0.277258 -2.959241 -0.155149 -0.275442 1.626843
8.266667 1.379896 -0.286525 -2.927852 -0.174942 -0.278039 1.156358
8.300000 1.373897 -0.295895 -2.914731 -0.194866 -0.280502 0.754380
8.333333 1.367155 -0.305335 -2.927522 -0.214869 -0.282851 0.414711
8.366667 1.359679 -0.314838 -2.960364 -0.234848 -0.285118 0.122561
8.400000 1.351476 -0.324399 -2.982105 -0.254700 -0.287338 -0.139756
8.433333 1.342555 -0.334010 -2.974339 -0.274365 -0.289538 -0.395740
8.466667 1.332925 -0.343667 -2.975933 -0.293782 -0.291746 -0.661120
8.500000 1.322596 -0.353365 -2.960535 -0.312875 -0.293990 -0.944816
8.533333 1.311697 -0.363158 -2.946239 -0.331603 -0.296287 -1.254269
8.566667 1.300230 -0.373046 -2.974483 -0.349975 -0.298641 -1.590570
8.600000 1.288197 -0.383028 -3.036928 -0.368030 -0.301047 -1.947477
8.633333 1.275601 -0.393102 -3.132097 -0.385799 -0.303499 -2.307070
8.666667 1.262446 -0.403269 3.046260 -0.403333 -0.305981 -2.652378
8.700000 1.248734 -0.413527 2.936588 -0.420707 -0.308470 -2.957898
8.733333 1.234470 -0.423875 2.824049 -0.437988 -0.310943 -3.201500
8.766667 1.219533 -0.434282 2.698008 -0.455203 -0.313387 -3.361860
8.800000 1.204052 -0.444778 2.559065 -0.472351 -0.315798 -3.427147
8.833333 1.188029 -0.455360 2.391823 -0.489435 -0.318173 -3.396229
8.866667 1.171470 -0.466028 2.265745 -0.506449 -0.320513 -3.272639
8.900000 1.154270 -0.476755 2.120150 -0.523375 -0.322831 -3.069168
8.933333 1.136437 -0.487540 1.998624 -0.540171 -0.325140 -2.799720
8.966667 1.118083 -0.498408 1.912432 -0.556834 -0.327452 -2.486601
9.000000 1.099211 -0.509357 1.830368 -0.573368 -0.329776 -2.153877
9.033333 1.079828 -0.520387 1.769770 -0.589773 -0.332124 -1.830606
9.066667 1.059835 -0.531488 1.734056 -0.606048 -0.334513 -1.538350
9.100000 1.039343 -0.542667 1.706042 -0.622193 -0.336951 -1.289104
9.133333 1.018357 -0.553923 1.681698 -0.638246 -0.339449 -1.086359
9.166667 0.996777 -0.565267 1.679817 -0.654219 -0.342015 -0.913281
9.200000 0.974717 -0.576685 1.694213 -0.670123 -0.344658 -0.740867
9.233333 0.952070 -0.588205 1.675908 -0.685960 -0.347385 -0.527511
9.266667 0.928957 -0.599796 1.681569 -0.701727 -0.350187 -0.241408
9.300000 0.905265 -0.611503 1.641110 -0.717426 -0.353065 0.141425
9.333333 0.881121 -0.623277 1.558520 -0.733041 -0.356019 0.631403
9.366667 0.856404 -0.635178 1.470970 -0.748565 -0.359041 1.217959
9.400000 0.831118 -0.647209 1.434719 -0.763995 -0.362130 1.873362
9.433333 0.805405 -0.659302 1.468254 -0.779342 -0.365282 2.549296
9.466667 0.779131 -0.671530 1.579563 -0.794609 -0.368493 3.201417
9.500000 0.752298 -0.683893 1.773138 -0.809776 -0.371747 3.775467
9.533333 0.725065 -0.696314 2.019924 -0.824819 -0.375021 4.220504
9.566667 0.697280 -0.708874 2.281609 -0.839694 -0.378285 4.496846
9.600000 0.669114 -0.721487 2.527392 -0.854346 -0.381504 4.583078
9.633333 0.640403 -0.734241 2.770536 -0.868686 -0.384633 4.481377
9.666667 0.611151 -0.747135 2.957041 -0.882633 -0.387628 4.204733
9.700000 0.581360 -0.760168 3.087867 -0.896134 -0.390461 3.788467
9.733333 0.551037 -0.773340 -3.099022 -0.909119 -0.393096 3.280880
9.766667 0.520239 -0.786604 -3.058354 -0.921550 -0.395512 2.734716
9.800000 0.489124 -0.799906 -2.998413 -0.933396 -0.397691 2.191725
9.833333 0.457705 -0.813242 -2.950243 -0.944674 -0.399640 1.686886
9.866667 0.425839 -0.826662 -2.912248 -0.955423 -0.401368 1.242584
9.900000 0.393693 -0.840111 -2.885437 -0.965681 -0.402893 0.867108
9.933333 0.361277 -0.853585 -2.863946 -0.975512 -0.404243 0.557065
9.966667 0.328605 -0.867083 -2.860387 -0.984966 -0.405447 0.300274
10.000000 0.295690 -0.880600 -2.860865 -0.994103 -0.406532 0.088578
10.033333 0.262398 -0.894174 -2.880604 -1.002944 -0.407511 -0.088019
10.066667 0.228746 -0.907798 -2.891363 -1.011492 -0.408391 -0.236771
10.100000 0.194752 -0.921465 -2.905902 -1.019728 -0.409171 -0.362489
10.133333 0.160566 -0.935140 -2.926078 -1.027635 -0.409847 -0.467596
10.166667 0.126072 -0.948847 -2.944471 -1.035188 -0.410411 -0.553428
10.200000 0.091290 -0.962578 -2.960459 -1.042333 -0.410853 -0.621980
10.233333 0.056239 -0.976328 -2.989898 -1.049023 -0.411166 -0.676237
10.266667 0.021050 -0.990071 -3.014447 -1.055218 -0.411346 -0.719561
10.300000 -0.014261 -1.003805 -3.032605 -1.060898 -0.411395 -0.752696
10.333333 -0.049785 -1.017539 -3.066891 -1.066016 -0.411311 -0.775729
10.366667 -0.085503 -1.031269 -3.100142 -1.070551 -0.411096 -0.788080
10.400000 -0.121394 -1.044986 -3.118915 -1.074507 -0.410759 -0.789978
10.433333 -0.157437 -1.058686 3.130041 -1.077898 -0.410311 -0.782001
10.466667 -0.193661 -1.072405 3.095790 -1.080728 -0.409759 -0.761971
10.500000 -0.229920 -1.086094 3.073129 -1.083004 -0.409108 -0.733258
10.533333 -0.266197 -1.099747 3.045689 -1.084745 -0.408364 -0.698045
10.566667 -0.302478 -1.113363 3.019985 -1.085963 -0.407531 -0.658170
10.600000 -0.338748 -1.126937 2.993033 -1.086668 -0.406606 -0.614760
10.633333 -0.374991 -1.140466 2.982828 -1.086877 -0.405589 -0.568346
10.666667 -0.411286 -1.153978 2.965379 -1.086608 -0.404480 -0.521067
10.700000 -0.447612 -1.167468 2.952286 -1.085866 -0.403273 -0.467510
10.733333 -0.483945 -1.180930 2.941646 -1.084648 -0.401963 -0.408514
10.766667 -0.520189 -1.194332 2.921488 -1.082942 -0.400541 -0.343555
10.800000 -0.556394 -1.207693 2.916561 -1.080726 -0.398999 -0.276248
10.833333 -0.592537 -1.221008 2.889058 -1.077958 -0.397321 -0.204923
10.866667 -0.628544 -1.234252 2.883188 -1.074609 -0.395496 -0.134263
10.900000 -0.664440 -1.247438 2.879995 -1.070656 -0.393517 -0.074551
10.933333 -0.700206 -1.260560 2.867249 -1.066088 -0.391380 -0.024103
10.966667 -0.735816 -1.273613 2.875068 -1.060889 -0.389080 0.009761
11.000000 -0.771229 -1.286579 2.893000 -1.055058 -0.386619 0.029758
11.033333 -0.806438 -1.299465 2.927236 -1.048597 -0.384000 0.025683
11.066667 -0.841419 -1.312256 2.932828 -1.041509 -0.381224 0.001484
11.100000 -0.876154 -1.324950 2.943820 -1.033800 -0.378295 -0.037589
11.133333 -0.910629 -1.337542 2.915789 -1.025478 -0.375215 -0.094658
11.166667 -0.944828 -1.350030 2.930318 -1.016553 -0.371988 -0.160780
11.200000 -0.978707 -1.362407 2.909663 -1.007025 -0.368615 -0.233224
11.233333 -1.012246 -1.374669 2.882594 -0.996894 -0.365095 -0.299051
11.266667 -1.045422 -1.386810 2.900954 -0.986163 -0.361431 -0.360065
11.300000 -1.078209 -1.398824 2.860709 -0.974820 -0.357619 -0.410941
11.333333 -1.110646 -1.410714 2.850832 -0.962864 -0.353658 -0.452976
11.366667 -1.142648 -1.422466 2.828657 -0.950298 -0.349548 -0.486211
11.400000 -1.174271 -1.434087 2.816669 -0.937138 -0.345292 -0.514319
11.433333 -1.205499 -1.445574 2.795584 -0.923409 -0.340894 -0.542386
11.466667 -1.236223 -1.456904 2.776060 -0.909122 -0.336357 -0.566090
11.500000 -1.266418 -1.468071 2.770629 -0.894311 -0.331690 -0.593208
11.533333 -1.296066 -1.479071 2.750246 -0.879014 -0.326901 -0.618824
11.566667 -1.325142 -1.489899 2.723572 -0.863265 -0.322000 -0.645577
11.600000 -1.353756 -1.500575 2.699912 -0.847076 -0.316989 -0.670770
11.633333 -1.381754 -1.511068 2.683301 -0.830443 -0.311869 -0.693600
11.666667 -1.409263 -1.521404 2.643757 -0.813364 -0.306640 -0.712022
11.700000 -1.436111 -1.531545 2.629244 -0.795823 -0.301299 -0.722005
11.733333 -1.462446 -1.541524 2.601520 -0.777788 -0.295841 -0.721321
11.766667 -1.488256 -1.551336 2.576611 -0.759233 -0.290261 -0.709394
11.800000 -1.513342 -1.560939 2.542501 -0.740163 -0.284560 -0.684176
11.833333 -1.537881 -1.570371 2.523078 -0.720576 -0.278739 -0.645389
11.866667 -1.561860 -1.579627 2.493847 -0.700480 -0.272799 -0.599336
11.900000 -1.585060 -1.588663 2.470785 -0.679860 -0.266740 -0.544913
11.933333 -1.607463 -1.597473 2.447758 -0.658729 -0.260565 -0.487152
11.966667 -1.629051 -1.606054 2.432732 -0.637090 -0.254274 -0.425371
12.000000 -1.649808 -1.614402 2.430580 -0.614935 -0.247868 -0.365100
12.033333 -1.669956 -1.622563 2.412804 -0.592292 -0.241351 -0.304294
12.066667 -1.689485 -1.630535 2.423810 -0.569189 -0.234731 -0.243090
12.100000 -1.708386 -1.638314 2.405370 -0.545657 -0.228014 -0.185370
12.133333 -1.726400 -1.645849 2.412828 -0.521686 -0.221196 -0.137823
12.166667 -1.743516 -1.653137 2.403753 -0.497274 -0.214277 -0.114194
12.200000 -1.759720 -1.660174 2.388226 -0.472445 -0.207261 -0.129577
12.233333 -1.775003 -1.666959 2.385916 -0.447220 -0.200150 -0.211471
12.266667 -1.789620 -1.673542 2.388775 -0.421625 -0.192951 -0.378397
12.300000 -1.803296 -1.679867 2.391285 -0.395727 -0.185674 -0.651395
12.333333 -1.816023 -1.685933 2.405277 -0.369616 -0.178337 -1.021918
12.366667 -1.828067 -1.691792 2.431127 -0.343361 -0.170951 -1.464547
12.400000 -1.839150 -1.697387 2.430534 -0.316983 -0.163519 -1.943989
12.433333 -1.849266 -1.702716 2.410251 -0.290463 -0.156031 -2.410168
12.466667 -1.858415 -1.707778 2.350503 -0.263823 -0.148489 -2.815278
12.500000 -1.866593 -1.712572 2.205089 -0.237087 -0.140895 -3.101188
12.533333 -1.874071 -1.717155 1.999147 -0.210272 -0.133252 -3.245780
12.566667 -1.880845 -1.721524 1.743740 -0.183441 -0.125572 -3.237531
12.600000 -1.886648 -1.725623 1.487472 -0.156674 -0.117873 -3.071586
12.633333 -1.891481 -1.729448 1.213055 -0.130094 -0.110186 -2.753362
12.666667 -1.895345 -1.732998 1.169295 -0.103755 -0.102523 -2.313111
12.700000 -1.898240 -1.736268 1.209994 -0.077673 -0.094889 -1.806301
12.733333 -1.900166 -1.739255 1.235912 -0.051882 -0.087293 -1.283618
12.766667 -1.901126 -1.741954 1.266731 -0.026398 -0.079738 -0.807834
12.800000 -1.901378 -1.744439 1.274001 -0.001236 -0.072230 -0.440493
12.833333 -1.900925 -1.746708 1.274157 0.023634 -0.064763 -0.237100
12.866667 -1.899767 -1.748763 1.285307 0.048222 -0.057339 -0.205412
12.900000 -1.897906 -1.750604 1.334249 0.072536 -0.049959 -0.322963
12.933333 -1.895099 -1.752154 1.379640 0.096609 -0.042621 -0.555209
12.966667 -1.891594 -1.753490 1.395551 0.120496 -0.035313 -0.847379
13.000000 -1.887154 -1.754540 1.381919 0.144244 -0.028029 -1.139812
13.033333 -1.881786 -1.755305 1.325075 0.167876 -0.020763 -1.372274
13.066667 -1.875731 -1.755858 1.234671 0.191428 -0.013507 -1.509401
13.100000 -1.868765 -1.756132 1.106112 0.214891 -0.006263 -1.526640
13.133333 -1.861119 -1.756195 0.951635 0.238294 0.000976 -1.405010
13.166667 -1.852799 -1.756050 0.815287 0.261636 0.008214 -1.142254
13.200000 -1.843810 -1.755697 0.726604 0.284943 0.015456 -0.752572
13.233333 -1.833947 -1.755073 0.704473 0.308238 0.022711 -0.264158
13.266667 -1.823425 -1.754243 0.714662 0.331519 0.029977 0.287395
13.300000 -1.812053 -1.753148 0.764712 0.354793 0.037254 0.856283
13.333333 -1.799845 -1.751790 0.841866 0.378013 0.044527 1.389121
13.366667 -1.786814 -1.750173 0.944485 0.401112 0.051772 1.839418
13.400000 -1.772977 -1.748302 1.048671 0.423977 0.058952 2.176600
13.433333 -1.758350 -1.746182 1.170121 0.446499 0.066033 2.382193
13.466667 -1.742949 -1.743817 1.289362 0.468569 0.072979 2.448429
13.500000 -1.726790 -1.741214 1.407730 0.490094 0.079760 2.380085
13.533333 -1.709888 -1.738379 1.491989 0.511004 0.086353 2.197996
13.566667 -1.692260 -1.735318 1.586937 0.531258 0.092746 1.926680
13.600000 -1.674051 -1.732070 1.659037 0.550864 0.098940 1.590469
13.633333 -1.655269 -1.728637 1.730527 0.569835 0.104941 1.215201
13.666667 -1.635811 -1.724999 1.749696 0.588205 0.110760 0.831160
13.700000 -1.615801 -1.721181 1.769712 0.606023 0.116412 0.463073
13.733333 -1.595248 -1.717186 1.762119 0.623339 0.121915 0.132369
13.766667 -1.574072 -1.713003 1.736570 0.640208 0.127286 -0.141320
13.800000 -1.552374 -1.708649 1.691836 0.656657 0.132537 -0.343894
13.833333 -1.530165 -1.704125 1.660370 0.672709 0.137678 -0.464652
13.866667 -1.507381 -1.699428 1.605002 0.688380 0.142716 -0.504682
13.900000 -1.484109 -1.694567 1.574215 0.703667 0.147656 -0.467201
13.933333 -1.460297 -1.689540 1.541810 0.718554 0.152497 -0.364117
13.966667 -1.436019 -1.684356 1.512274 0.733032 0.157239 -0.213338
14.000000 -1.411238 -1.679013 1.504998 0.747088 0.161881 -0.032937
14.033333 -1.385972 -1.673515 1.500621 0.760705 0.166420 0.156962
14.066667 -1.360275 -1.667869 1.528906 0.773872 0.170853 0.333984
14.100000 -1.334159 -1.662076 1.570086 0.786579 0.175177 0.482164
14.133333 -1.307635 -1.656140 1.597309 0.798830 0.179390 0.590171
14.166667 -1.280700 -1.650067 1.639215 0.810613 0.183490 0.651101
14.200000 -1.253383 -1.643856 1.681868 0.821933 0.187475 0.660246
14.233333 -1.225694 -1.637511 1.713520 0.832796 0.191344 0.618697
14.266667 -1.197648 -1.631035 1.749614 0.843200 0.195095 0.538451
14.300000 -1.169267 -1.624442 1.764362 0.853148 0.198728 0.431645
14.333333 -1.140571 -1.617737 1.788635 0.862631 0.202241 0.306839
14.366667 -1.111554 -1.610910 1.790544 0.871643 0.205632 0.175805
14.400000 -1.082260 -1.603981 1.772812 0.880170 0.208897 0.053963
14.433333 -1.052670 -1.596936 1.771681 0.888201 0.212036 -0.049358
14.466667 -1.022798 -1.589779 1.764051 0.895737 0.215050 -0.127814
14.500000 -0.992704 -1.582534 1.744954 0.902771 0.217941 -0.182300
14.533333 -0.962352 -1.575182 1.722251 0.909306 0.220709 -0.206414
14.566667 -0.931814 -1.567750 1.706186 0.915358 0.223362 -0.197765
14.600000 -0.901108 -1.560241 1.696208 0.920950 0.225907 -0.162967
14.633333 -0.870184 -1.552636 1.709510 0.926099 0.228350 -0.107856
14.666667 -0.839128 -1.544962 1.698323 0.930811 0.230694 -0.040270
14.700000 -0.807960 -1.537222 1.675203 0.935100 0.232944 0.036251
14.733333 -0.776698 -1.529421 1.680231 0.938981 0.235106 0.107486
14.766667 -0.745267 -1.521536 1.689357 0.942442 0.237177 0.158544
14.800000 -0.713680 -1.513569 1.711703 0.945475 0.239156 0.179534
14.833333 -0.682050 -1.505552 1.721296 0.948068 0.241039 0.168645
14.866667 -0.650290 -1.497459 1.739360 0.950206 0.242823 0.124335
14.900000 -0.618410 -1.489295 1.762910 0.951876 0.244504 0.043876
14.933333 -0.586542 -1.481091 1.784459 0.953052 0.246074 -0.060103
14.966667 -0.554580 -1.472822 1.795939 0.953733 0.247532 -0.172273
15.000000 -0.522665 -1.464521 1.796747 0.953911 0.248877 -0.280129
15.033333 -0.490816 -1.456192 1.789955 0.953584 0.250108 -0.386024
15.066667 -0.458908 -1.447806 1.741333 0.952770 0.251230 -0.493267
15.100000 -0.427096 -1.439399 1.676024 0.951482 0.252246 -0.604335
15.133333 -0.395248 -1.430941 1.619965 0.949745 0.253162 -0.735226
15.166667 -0.363528 -1.422468 1.593922 0.947571 0.253983 -0.905103
15.200000 -0.331951 -1.413981 1.587511 0.944992 0.254716 -1.127420
15.233333 -0.300373 -1.405453 1.582287 0.942029 0.255365 -1.396747
15.266667 -0.268967 -1.396917 1.607300 0.938701 0.255936 -1.710106
15.300000 -0.237581 -1.388344 1.614270 0.935021 0.256431 -2.060038
15.333333 -0.206399 -1.379772 1.576788 0.931011 0.256857 -2.429621
15.366667 -0.175439 -1.371203 1.472298 0.926715 0.257223 -2.789305
15.400000 -0.144528 -1.362605 1.323048 0.922130 0.257528 -3.108457
15.433333 -0.113864 -1.354014 1.154113 0.917297 0.257783 -3.367280
15.466667 -0.083269 -1.345400 0.966684 0.912212 0.257987 -3.535131
15.500000 -0.052944 -1.336796 0.776079 0.906914 0.258150 -3.587677
15.533333 -0.022707 -1.328173 0.610053 0.901414 0.258272 -3.508963
15.566667 0.007241 -1.319561 0.510224 0.895705 0.258354 -3.297971
15.600000 0.037083 -1.310934 0.394191 0.889830 0.258398 -2.956683
15.633333 0.066615 -1.302320 0.312197 0.883778 0.258403 -2.489664
15.666667 0.096024 -1.293697 0.211578 0.877592 0.258371 -1.908147
15.700000 0.125300 -1.285067 0.137076 0.871264 0.258297 -1.229686
15.733333 0.154230 -1.276451 0.074469 0.864820 0.258181 -0.469648
15.766667 0.183011 -1.267834 0.051589 0.858251 0.258020 0.353819
15.800000 0.211419 -1.259234 0.050417 0.851529 0.257808 1.212784
15.833333 0.239663 -1.250636 0.077494 0.844633 0.257541 2.067085
15.866667 0.267738 -1.242043 0.108040 0.837523 0.257212 2.873830
15.900000 0.295634 -1.233456 0.244965 0.830157 0.256816 3.594006
15.933333 0.323346 -1.224877 0.438044 0.822462 0.256345 4.184900
15.966667 0.350639 -1.216329 0.687971 0.814432 0.255797 4.605850
16.000000 0.377734 -1.207793 0.966135 0.806051 0.255169 4.819583
16.033333 0.404624 -1.199272 1.205318 0.797317 0.254462 4.820191
16.066667 0.431302 -1.190768 1.414565 0.788232 0.253675 4.602208
16.100000 0.457549 -1.182304 1.617445 0.778847 0.252812 4.172691
16.133333 0.483363 -1.173879 1.812669 0.769235 0.251880 3.555997
16.166667 0.508745 -1.165498 1.875614 0.759424 0.250879 2.799431
16.200000 0.533893 -1.157141 1.962738 0.749460 0.249812 1.960975
16.233333 0.558613 -1.148830 2.041205 0.739414 0.248683 1.081726
16.266667 0.583089 -1.140547 2.068875 0.729355 0.247499 0.212044
16.300000 0.607317 -1.132295 2.045600 0.719300 0.246258 -0.583372
16.333333 0.631132 -1.124093 1.960197 0.709261 0.244962 -1.248244
16.366667 0.654540 -1.115944 1.868275 0.699255 0.243609 -1.747155
16.400000 0.677687 -1.107831 1.746321 0.689303 0.242201 -2.054297
16.433333 0.700569 -1.099754 1.603265 0.679384 0.240737 -2.149382
16.466667 0.723064 -1.091737 1.488113 0.669477 0.239211 -2.029636
16.500000 0.745176 -1.083783 1.346552 0.659590 0.237624 -1.732771
16.533333 0.766911 -1.075893 1.205936 0.649731 0.235978 -1.306727
16.566667 0.788369 -1.068047 1.079476 0.639900 0.234277 -0.805237
16.600000 0.809547 -1.060245 0.992498 0.630087 0.232522 -0.271942
16.633333 0.830441 -1.052489 1.112189 0.620293 0.230710 0.239966
16.666667 0.850968 -1.044814 1.246777 0.610511 0.228845 0.688193
16.700000 0.871121 -1.037226 1.444060 0.600718 0.226924 1.037981
16.733333 0.890984 -1.029687 1.539879 0.590874 0.224936 1.269726
16.766667 0.910555 -1.022198 1.561537 0.580952 0.222873 1.382650
16.800000 0.929742 -1.014805 1.581577 0.570934 0.220732 1.370490
16.833333 0.948633 -1.007465 1.619330 0.560809 0.218511 1.260528
16.866667 0.967228 -1.000178 1.653814 0.550566 0.216207 1.082250
16.900000 0.985437 -0.992991 1.665445 0.540208 0.213824 0.883440
16.933333 1.003347 -0.985859 1.718094 0.529757 0.211374 0.691176
16.966667 1.020872 -0.978828 1.733806 0.519250 0.208873 0.520165
17.000000 1.038015 -0.971898 1.745914 0.508713 0.206338 0.382795
17.033333 1.054778 -0.965067 1.741746 0.498182 0.203787 0.278002
17.066667 1.071165 -0.958335 1.732551 0.487711 0.201251 0.200980
17.100000 1.087179 -0.951701 1.731836 0.477344 0.198752 0.136397
17.133333 1.102891 -0.945127 1.738199 0.467121 0.196313 0.085369
17.166667 1.118237 -0.938649 1.730672 0.457061 0.193944 0.047438
17.200000 1.133222 -0.932267 1.738835 0.447184 0.191656 0.023599
17.233333 1.147905 -0.925945 1.741653 0.437489 0.189448 0.009439
17.266667 1.162287 -0.919685 1.734108 0.427958 0.187307 0.002210
17.300000 1.176369 -0.913487 1.743476 0.418567 0.185220 0.000506
17.333333 1.190152 -0.907350 1.737252 0.409291 0.183172 -0.000452
17.366667 1.203635 -0.901274 1.733739 0.400106 0.181147 -0.001164
17.400000 1.216821 -0.895261 1.736696 0.390982 0.179125 -0.002205
17.433333 1.229710 -0.889310 1.735850 0.381900 0.177094 -0.002290
17.466667 1.242304 -0.883421 1.740211 0.372846 0.175042 -0.002720
17.500000 1.254571 -0.877619 1.736866 0.363816 0.172962 -0.002156
17.533333 1.266545 -0.871880 1.734011 0.354806 0.170852 -0.000358
17.566667 1.278202 -0.866225 1.730432 0.345820 0.168711 0.001139
17.600000 1.289569 -0.860632 1.740556 0.336871 0.166546 0.002760
17.633333 1.300647 -0.855101 1.741587 0.327970 0.164362 0.003213
17.666667 1.311420 -0.849652 1.734228 0.319131 0.162168 0.004178
17.700000 1.321892 -0.844282 1.739392 0.310364 0.159970 0.003576
17.733333 1.332069 -0.838991 1.731777 0.301683 0.157774 0.002318
17.766667 1.341953 -0.833778 1.732877 0.293093 0.155586 0.001578
17.800000 1.351550 -0.828641 1.744837 0.284603 0.153413 -0.000094
17.833333 1.360871 -0.823564 1.740991 0.276218 0.151261 -0.000410
17.866667 1.369912 -0.818562 1.740759 0.267942 0.149136 -0.001837
17.900000 1.378679 -0.813632 1.731932 0.259775 0.147044 -0.001327
17.933333 1.387176 -0.808773 1.737033 0.251717 0.144989 -0.002184
17.966667 1.395407 -0.803984 1.732842 0.243765 0.142976 -0.003530
18.000000 1.403377 -0.799263 1.743174 0.235916 0.141006 -0.003359
18.033333 1.411090 -0.794609 1.730734 0.228168 0.139079 -0.004398
18.066667 1.418551 -0.790021 1.740411 0.220520 0.137197 -0.005287
18.100000 1.425756 -0.785491 1.736452 0.212972 0.135360 -0.007379
18.133333 1.432706 -0.781017 1.731529 0.205527 0.133565 -0.007700
18.166667 1.439417 -0.776604 1.742732 0.198187 0.131811 -0.008688
18.200000 1.445879 -0.772248 1.740703 0.190951 0.130097 -0.009661
18.233333 1.452096 -0.767946 1.733737 0.183822 0.128418 -0.009951
18.266667 1.458071 -0.763698 1.731153 0.176798 0.126772 -0.008033
18.300000 1.463805 -0.759504 1.732617 0.169877 0.125156 -0.005226
18.333333 1.469324 -0.755365 1.738283 0.163057 0.123568 -0.003480
18.366667 1.474629 -0.751278 1.728449 0.156338 0.122008 0.001485
18.400000 1.479727 -0.747244 1.733139 0.149719 0.120476 0.005714
18.433333 1.484597 -0.743260 1.734301 0.143199 0.118970 0.009776
18.466667 1.489244 -0.739326 1.732373 0.136778 0.117494 0.011858
18.500000 1.493670 -0.735441 1.730703 0.130454 0.116046 0.013555
18.533333 1.497879 -0.731604 1.744421 0.124235 0.114629 0.015983
18.566667 1.501901 -0.727812 1.735614 0.118124 0.113244 0.014687
18.600000 1.505712 -0.724067 1.743153 0.112129 0.111891 0.012848
18.633333 1.509316 -0.720368 1.737188 0.106253 0.110571 0.010398
18.666667 1.512716 -0.716715 1.733125 0.100503 0.109286 0.006927
18.700000 1.515947 -0.713100 1.743238 0.094887 0.108036 0.002086
18.733333 1.518980 -0.709529 1.736627 0.089409 0.106822 -0.003321
18.766667 1.521853 -0.705994 1.738340 0.084071 0.105645 -0.007327
18.800000 1.524535 -0.702500 1.739888 0.078874 0.104507 -0.011373
18.833333 1.527030 -0.699048 1.737379 0.073825 0.103411 -0.015271
18.866667 1.529377 -0.695628 1.742023 0.068923 0.102356 -0.018211
