t x y theta dxdt dydt dthetadt
0.000000 0.000000 0.000000 -2.629392 0.081045 -0.013900 -0.002197
0.033333 0.002786 -0.000464 -2.630570 0.086082 -0.013492 -0.002769
0.066667 0.005730 -0.000913 -2.635997 0.091227 -0.013055 -0.002702
0.100000 0.008835 -0.001347 -2.624502 0.096482 -0.012592 -0.001445
0.133333 0.012106 -0.001765 -2.630999 0.101851 -0.012101 0.000096
0.166667 0.015548 -0.002166 -2.630838 0.107338 -0.011583 0.000441
0.200000 0.019199 -0.002550 -2.632736 0.112942 -0.011038 0.000296
0.233333 0.023030 -0.002914 -2.637400 0.118671 -0.010466 0.000363
0.266667 0.027047 -0.003259 -2.637264 0.124533 -0.009868 -0.000723
0.300000 0.031253 -0.003584 -2.626805 0.130537 -0.009245 -0.001332
0.333333 0.035683 -0.003888 -2.626096 0.136684 -0.008595 -0.002919
0.366667 0.040312 -0.004169 -2.628042 0.142974 -0.007920 -0.003127
0.400000 0.045147 -0.004427 -2.632097 0.149414 -0.007220 -0.002949
0.433333 0.050193 -0.004661 -2.632682 0.156004 -0.006495 -0.003160
0.466667 0.055476 -0.004871 -2.632415 0.162743 -0.005746 -0.002276
0.500000 0.060979 -0.005056 -2.636688 0.169627 -0.004971 -0.001277
0.533333 0.066709 -0.005214 -2.630168 0.176658 -0.004172 0.001592
0.566667 0.072685 -0.005345 -2.631738 0.183837 -0.003348 0.005391
0.600000 0.078899 -0.005448 -2.639101 0.191160 -0.002501 0.008984
0.633333 0.085366 -0.005523 -2.627994 0.198624 -0.001630 0.012287
0.666667 0.092081 -0.005569 -2.633875 0.206229 -0.000736 0.014728
0.700000 0.099050 -0.005583 -2.633681 0.213971 0.000181 0.015958
0.733333 0.106282 -0.005567 -2.625637 0.221848 0.001119 0.014786
0.766667 0.113779 -0.005519 -2.628544 0.229859 0.002078 0.011789
0.800000 0.121546 -0.005437 -2.626852 0.238006 0.003059 0.007603
0.833333 0.129589 -0.005322 -2.629500 0.246287 0.004061 0.003979
0.866667 0.137906 -0.005174 -2.621881 0.254705 0.005082 -0.000194
0.900000 0.146502 -0.004994 -2.625993 0.263264 0.006126 -0.005038
0.933333 0.155390 -0.004777 -2.631233 0.271970 0.007191 -0.007530
0.966667 0.164577 -0.004522 -2.628856 0.280823 0.008278 -0.009017
1.000000 0.174051 -0.004233 -2.631244 0.289819 0.009386 -0.008315
1.033333 0.183812 -0.003910 -2.632669 0.298960 0.010516 -0.007948
1.066667 0.193890 -0.003547 -2.630091 0.308242 0.011668 -0.006090
1.100000 0.204289 -0.003143 -2.633325 0.317654 0.012838 -0.002271
1.133333 0.215017 -0.002698 -2.631834 0.327183 0.014025 -0.000561
1.166667 0.226041 -0.002217 -2.628635 0.336824 0.015228 0.000924
1.200000 0.237406 -0.001693 -2.628761 0.346572 0.016445 0.000507
1.233333 0.249115 -0.001124 -2.639211 0.356416 0.017675 0.000923
1.266667 0.261176 -0.000511 -2.620195 0.366347 0.018916 -0.001806
1.300000 0.273542 0.000139 -2.632113 0.376356 0.020165 -0.006492
1.333333 0.286213 0.000827 -2.622799 0.386438 0.021422 -0.014392
1.366667 0.299253 0.001561 -2.634109 0.396580 0.022685 -0.025109
1.400000 0.312602 0.002333 -2.628582 0.406775 0.023951 -0.037388
1.433333 0.326331 0.003154 -2.637237 0.417016 0.025218 -0.051114
1.466667 0.340371 0.004012 -2.630626 0.427313 0.026484 -0.057922
1.500000 0.354803 0.004920 -2.633059 0.437673 0.027746 -0.054517
1.533333 0.369548 0.005865 -2.629708 0.448111 0.029001 -0.028531
1.566667 0.384696 0.006862 -2.632969 0.458644 0.030245 0.029741
1.600000 0.400157 0.007897 -2.648036 0.469286 0.031472 0.133984
1.633333 0.415932 0.008969 -2.650194 0.480047 0.032679 0.293954
1.666667 0.432020 0.010079 -2.669987 0.490912 0.033863 0.517559
1.700000 0.448530 0.011236 -2.673518 0.501885 0.035020 0.803904
1.733333 0.465354 0.012429 -2.657653 0.512947 0.036148 1.146486
1.766667 0.482608 0.013663 -2.640677 0.524077 0.037251 1.530972
1.800000 0.500296 0.014933 -2.604811 0.535247 0.038329 1.933220
1.833333 0.518296 0.016240 -2.542753 0.546445 0.039385 2.330931
1.866667 0.536739 0.017574 -2.454317 0.557673 0.040422 2.695707
1.900000 0.555630 0.018936 -2.319923 0.568919 0.041448 3.010708
1.933333 0.574828 0.020333 -2.153588 0.580200 0.042471 3.255840
1.966667 0.594334 0.021765 -1.994590 0.591539 0.043501 3.418698
2.000000 0.614145 0.023232 -1.826904 0.602981 0.044546 3.494199
2.033333 0.634417 0.024727 -1.721932 0.614530 0.045616 3.488547
2.066667 0.654990 0.026257 -1.584842 0.626197 0.046717 3.411740
2.100000 0.676027 0.027820 -1.472340 0.637990 0.047858 3.279525
2.133333 0.697361 0.029416 -1.373686 0.649890 0.049039 3.112532
2.166667 0.719159 0.031053 -1.282547 0.661852 0.050263 2.930898
2.200000 0.741419 0.032734 -1.189198 0.673820 0.051535 2.755801
2.233333 0.764138 0.034464 -1.104341 0.685778 0.052862 2.590022
2.266667 0.787313 0.036246 -1.021802 0.697682 0.054252 2.440768
2.300000 0.810940 0.038085 -0.958237 0.709490 0.055709 2.305543
2.333333 0.834844 0.039952 -0.907403 0.721174 0.057238 2.184829
2.366667 0.859020 0.041847 -0.830941 0.732722 0.058840 2.077477
2.400000 0.883633 0.043811 -0.751563 0.744108 0.060505 1.978155
2.433333 0.908677 0.045847 -0.657655 0.755294 0.062217 1.891378
2.466667 0.933979 0.047907 -0.600257 0.766260 0.063958 1.815794
2.500000 0.959697 0.050045 -0.553861 0.776973 0.065701 1.753179
2.533333 0.985825 0.052263 -0.502886 0.787389 0.067418 1.697491
2.566667 1.012355 0.054563 -0.470748 0.797460 0.069082 1.647334
2.600000 1.039276 0.056944 -0.422069 0.807153 0.070671 1.601769
2.633333 1.066580 0.059408 -0.376095 0.816426 0.072160 1.558899
2.666667 1.094108 0.061890 -0.318196 0.825246 0.073531 1.517961
2.700000 1.121853 0.064388 -0.249580 0.833606 0.074777 1.471906
2.733333 1.149809 0.066900 -0.202072 0.841535 0.075906 1.421695
2.766667 1.178111 0.069492 -0.130932 0.849065 0.076924 1.358944
2.800000 1.206610 0.072094 -0.099755 0.856249 0.077848 1.284529
2.833333 1.235298 0.074706 -0.048629 0.863174 0.078710 1.195016
2.866667 1.264170 0.077325 -0.014784 0.869912 0.079537 1.090033
2.900000 1.293345 0.080012 0.029668 0.876521 0.080348 0.975172
2.933333 1.322688 0.082703 0.045699 0.883033 0.081155 0.851183
2.966667 1.352191 0.085395 0.076100 0.889491 0.081973 0.723061
3.000000 1.381968 0.088144 0.106264 0.895897 0.082802 0.583375
3.033333 1.411890 0.090891 0.117336 0.902222 0.083628 0.433457
3.066667 1.442062 0.093683 0.135052 0.908431 0.084433 0.274008
3.100000 1.472474 0.096518 0.138064 0.914481 0.085201 0.110551
3.133333 1.503113 0.099389 0.146312 0.920324 0.085910 -0.053027
3.166667 1.533966 0.102292 0.147871 0.925889 0.086531 -0.205912
3.200000 1.565021 0.105222 0.147991 0.931127 0.087044 -0.329806
3.233333 1.596266 0.108176 0.139738 0.935994 0.087430 -0.415422
3.266667 1.627689 0.111149 0.122302 0.940456 0.087677 -0.458061
3.300000 1.659280 0.114136 0.064082 0.944490 0.087774 -0.458549
3.333333 1.690937 0.117101 -0.008146 0.948091 0.087719 -0.415131
3.366667 1.722652 0.120039 -0.064641 0.951263 0.087515 -0.332841
3.400000 1.754498 0.122981 -0.078225 0.954015 0.087166 -0.225322
3.433333 1.786383 0.125892 -0.056810 0.956359 0.086677 -0.105501
3.466667 1.818370 0.128797 -0.039049 0.958308 0.086055 0.015790
3.500000 1.850445 0.131689 -0.016862 0.959869 0.085304 0.123424
3.533333 1.882530 0.134541 0.021008 0.961042 0.084427 0.201548
3.566667 1.914672 0.137370 0.038619 0.961819 0.083422 0.237482
3.600000 1.946851 0.140168 0.048689 0.962191 0.082289 0.230019
3.633333 1.979046 0.142929 0.070093 0.962135 0.081023 0.182833
3.666667 2.011239 0.145645 0.071385 0.961630 0.079622 0.104073
3.700000 2.043392 0.148307 0.084375 0.960656 0.078083 0.004479
3.733333 2.075496 0.150912 0.084978 0.959189 0.076405 -0.102202
3.766667 2.107541 0.153458 0.070540 0.957206 0.074586 -0.203789
3.800000 2.139516 0.155940 0.044647 0.954696 0.072629 -0.294036
3.833333 2.171412 0.158357 0.026155 0.951655 0.070537 -0.364719
3.866667 2.203218 0.160705 0.011306 0.948084 0.068316 -0.415394
3.900000 2.234925 0.162981 -0.004895 0.943983 0.065969 -0.442114
3.933333 2.266467 0.165173 -0.018677 0.939361 0.063500 -0.444893
3.966667 2.297828 0.167274 -0.050775 0.934242 0.060918 -0.424057
4.000000 2.328988 0.169284 -0.066495 0.928642 0.058227 -0.380976
4.033333 2.359933 0.171199 -0.085609 0.922579 0.055432 -0.323527
4.066667 2.390647 0.173016 -0.099001 0.916081 0.052539 -0.256725
4.100000 2.421117 0.174731 -0.104378 0.909191 0.049556 -0.186585
4.133333 2.451422 0.176355 -0.117207 0.901955 0.046490 -0.116859
4.166667 2.481456 0.177873 -0.108164 0.894408 0.043345 -0.057390
4.200000 2.511210 0.179282 -0.108051 0.886593 0.040126 -0.016161
4.233333 2.540670 0.180581 -0.100427 0.878546 0.036834 0.000542
4.266667 2.569827 0.181765 -0.089629 0.870310 0.033471 -0.008531
4.300000 2.598774 0.182844 -0.073729 0.861897 0.030033 -0.050390
4.333333 2.627399 0.183804 -0.055890 0.853313 0.026514 -0.132333
4.366667 2.655694 0.184642 -0.060967 0.844565 0.022907 -0.250431
4.400000 2.683653 0.185358 -0.087593 0.835656 0.019204 -0.396072
4.433333 2.711370 0.185957 -0.085411 0.826577 0.015393 -0.559748
4.466667 2.738837 0.186436 -0.080088 0.817289 0.011456 -0.737267
4.500000 2.766046 0.186795 -0.102239 0.807778 0.007383 -0.918279
4.533333 2.792895 0.187012 -0.143872 0.798036 0.003166 -1.090344
4.566667 2.819376 0.187080 -0.211138 0.788042 -0.001203 -1.247202
4.600000 2.845577 0.187019 -0.256771 0.777776 -0.005729 -1.390325
4.633333 2.871398 0.186795 -0.333683 0.767229 -0.010409 -1.513651
4.666667 2.896829 0.186398 -0.391727 0.756433 -0.015227 -1.610033
4.700000 2.921960 0.185864 -0.460002 0.745407 -0.020171 -1.675271
4.733333 2.946679 0.185141 -0.500370 0.734151 -0.025233 -1.716449
4.766667 2.970974 0.184219 -0.547896 0.722673 -0.030399 -1.742807
4.800000 2.994831 0.183094 -0.591890 0.710989 -0.035654 -1.765310
4.833333 3.018365 0.181824 -0.683039 0.699100 -0.040985 -1.800769
4.866667 3.041569 0.180406 -0.745293 0.686981 -0.046390 -1.866824
4.900000 3.064292 0.178770 -0.832645 0.674619 -0.051862 -1.973920
4.933333 3.086674 0.176982 -0.881687 0.662024 -0.057389 -2.121223
4.966667 3.108544 0.174967 -0.910377 0.649213 -0.062957 -2.307243
5.000000 3.130063 0.172798 -0.924864 0.636158 -0.068565 -2.524494
5.033333 3.151228 0.170472 -0.987918 0.622868 -0.074204 -2.768035
5.066667 3.171834 0.167914 -1.078662 0.609352 -0.079859 -3.027508
5.100000 3.191866 0.165125 -1.214034 0.595612 -0.085518 -3.291932
5.133333 3.211531 0.162175 -1.382679 0.581646 -0.091174 -3.545069
5.166667 3.230593 0.158997 -1.529406 0.567454 -0.096819 -3.759777
5.200000 3.249281 0.155656 -1.666927 0.553072 -0.102436 -3.909465
5.233333 3.267592 0.152149 -1.800173 0.538498 -0.108016 -3.971741
5.266667 3.285521 0.148476 -1.919320 0.523740 -0.113556 -3.932746
5.300000 3.302810 0.144597 -2.085766 0.508804 -0.119058 -3.790159
5.333333 3.319452 0.140517 -2.256286 0.493718 -0.124520 -3.554073
5.366667 3.335707 0.136267 -2.419448 0.478492 -0.129949 -3.247079
5.400000 3.351311 0.131829 -2.579965 0.463173 -0.135352 -2.893008
5.433333 3.366524 0.127219 -2.680602 0.447846 -0.140734 -2.513841
5.466667 3.381345 0.122437 -2.744198 0.432579 -0.146099 -2.130123
5.500000 3.395528 0.117477 -2.752905 0.417425 -0.151447 -1.763746
5.533333 3.409081 0.112339 -2.758729 0.402403 -0.156786 -1.433496
5.566667 3.422014 0.107025 -2.767935 0.387570 -0.162118 -1.156834
5.600000 3.434552 0.101534 -2.785034 0.372910 -0.167448 -0.947164
5.633333 3.446695 0.095866 -2.808273 0.358383 -0.172780 -0.808660
5.666667 3.458443 0.090020 -2.819702 0.343969 -0.178122 -0.737751
5.700000 3.469620 0.083997 -2.840160 0.329657 -0.183477 -0.721232
5.733333 3.480402 0.077795 -2.867226 0.315440 -0.188847 -0.745365
5.766667 3.490792 0.071414 -2.883430 0.301270 -0.194239 -0.789216
5.800000 3.500652 0.064854 -2.919719 0.287147 -0.199663 -0.835233
5.833333 3.509994 0.058114 -2.939447 0.273098 -0.205130 -0.875560
5.866667 3.518831 0.051195 -2.957558 0.259147 -0.210652 -0.906279
5.900000 3.527171 0.044093 -3.028924 0.245321 -0.216240 -0.920182
5.933333 3.535022 0.036808 -3.071662 0.231663 -0.221915 -0.909400
5.966667 3.542392 0.029339 -3.100152 0.218243 -0.227686 -0.871018
6.000000 3.549381 0.021687 -3.116177 0.205105 -0.233562 -0.806347
6.033333 3.555901 0.013848 3.139781 0.192270 -0.239545 -0.710721
6.066667 3.562045 0.005824 3.093883 0.179740 -0.245642 -0.580352
6.100000 3.567765 -0.002444 3.061872 0.167511 -0.251841 -0.426172
6.133333 3.573068 -0.010955 3.051474 0.155571 -0.258118 -0.258766
6.166667 3.578004 -0.019651 3.031106 0.143887 -0.264445 -0.088310
6.200000 3.582578 -0.028532 3.023475 0.132434 -0.270787 0.077391
6.233333 3.586765 -0.037654 3.036121 0.121191 -0.277106 0.229216
6.266667 3.590579 -0.047015 3.062411 0.110149 -0.283359 0.358758
6.300000 3.594030 -0.056613 3.099462 0.099300 -0.289511 0.471397
6.333333 3.597130 -0.066446 -3.138069 0.088636 -0.295543 0.579577
6.366667 3.599862 -0.076458 -3.105328 0.078161 -0.301438 0.700597
6.400000 3.602252 -0.086653 -3.080205 0.067879 -0.307181 0.858904
6.433333 3.604294 -0.097023 -3.068639 0.057796 -0.312771 1.079355
6.466667 3.605999 -0.107564 -3.049127 0.047912 -0.318221 1.383486
6.500000 3.607376 -0.118288 -3.044746 0.038229 -0.323544 1.778203
6.533333 3.608438 -0.129176 -3.048569 0.028753 -0.328761 2.247956
6.566667 3.609195 -0.140227 -3.024781 0.019477 -0.333894 2.762150
6.600000 3.609658 -0.151438 -2.967824 0.010392 -0.338972 3.275898
6.633333 3.609810 -0.162828 -2.863083 0.001482 -0.344018 3.734165
6.666667 3.609656 -0.174397 -2.677289 -0.007265 -0.349050 4.075124
6.700000 3.609231 -0.186120 -2.453000 -0.015863 -0.354080 4.246958
6.733333 3.608539 -0.197997 -2.188604 -0.024330 -0.359118 4.218963
6.766667 3.607584 -0.210031 -1.916413 -0.032679 -0.364170 3.974965
6.800000 3.606342 -0.222242 -1.648165 -0.040917 -0.369235 3.515333
6.833333 3.604818 -0.234628 -1.469108 -0.049048 -0.374315 2.863175
6.866667 3.603034 -0.247185 -1.409153 -0.057077 -0.379409 2.073277
6.900000 3.600977 -0.259916 -1.394171 -0.065004 -0.384515 1.211692
6.933333 3.598652 -0.272820 -1.401126 -0.072824 -0.389627 0.344275
6.966667 3.596065 -0.285898 -1.446672 -0.080528 -0.394736 -0.460501
7.000000 3.593220 -0.299147 -1.536022 -0.088110 -0.399838 -1.143897
7.033333 3.590122 -0.312567 -1.651856 -0.095558 -0.404925 -1.663473
7.066667 3.586780 -0.326154 -1.768504 -0.102859 -0.409989 -2.010796
7.100000 3.583196 -0.339910 -1.899553 -0.109996 -0.415024 -2.193655
7.133333 3.579374 -0.353834 -1.993979 -0.116956 -0.420025 -2.232330
7.166667 3.575321 -0.367926 -2.098831 -0.123726 -0.424988 -2.156085
7.200000 3.571041 -0.382183 -2.180454 -0.130295 -0.429910 -1.995020
7.233333 3.566539 -0.396606 -2.227768 -0.136660 -0.434789 -1.784275
7.266667 3.561822 -0.411193 -2.270328 -0.142819 -0.439624 -1.546025
7.300000 3.556894 -0.425943 -2.291867 -0.148771 -0.444415 -1.304009
7.333333 3.551760 -0.440855 -2.337778 -0.154517 -0.449159 -1.064853
7.366667 3.546476 -0.455915 -2.361891 -0.160051 -0.453854 -0.844782
7.400000 3.540997 -0.471134 -2.385327 -0.165367 -0.458499 -0.652387
7.433333 3.535393 -0.486494 -2.394320 -0.170462 -0.463091 -0.483160
7.466667 3.529606 -0.502011 -2.422282 -0.175322 -0.467624 -0.331758
7.500000 3.523640 -0.517684 -2.427040 -0.179945 -0.472098 -0.190692
7.533333 3.517501 -0.533512 -2.420314 -0.184330 -0.476511 -0.074323
7.566667 3.511194 -0.549493 -2.421949 -0.188487 -0.480865 0.022928
7.600000 3.504725 -0.565626 -2.402617 -0.192415 -0.485160 0.095072
7.633333 3.498205 -0.581880 -2.402617 -0.196112 -0.489393 0.129072
7.666667 3.491533 -0.598284 -2.359497 -0.199598 -0.493569 0.103977
7.700000 3.484830 -0.614804 -2.402123 -0.202893 -0.497694 0.019039
7.733333 3.477985 -0.631470 -2.395422 -0.206017 -0.501771 -0.108784
7.766667 3.471005 -0.648281 -2.350650 -0.208974 -0.505803 -0.279818
7.800000 3.464018 -0.665200 -2.283942 -0.211799 -0.509799 -0.486051
7.833333 3.456906 -0.682262 -2.277794 -0.214515 -0.513764 -0.716395
7.866667 3.449673 -0.699464 -2.331820 -0.217125 -0.517701 -0.943004
7.900000 3.442324 -0.716805 -2.403626 -0.219611 -0.521604 -1.161280
7.933333 3.434984 -0.734251 -2.484228 -0.221965 -0.525472 -1.358124
7.966667 3.427538 -0.751833 -2.578829 -0.224190 -0.529306 -1.505466
8.000000 3.419990 -0.769550 -2.659656 -0.226248 -0.533098 -1.572658
8.033333 3.412346 -0.787400 -2.711007 -0.228098 -0.536840 -1.527361
8.066667 3.404610 -0.805382 -2.711337 -0.229720 -0.540528 -1.357727
8.100000 3.396910 -0.823466 -2.792300 -0.231115 -0.544163 -1.047145
8.133333 3.389127 -0.841679 -2.859452 -0.232262 -0.547742 -0.598896
8.166667 3.381267 -0.860018 -2.963226 -0.233146 -0.551263 -0.023290
8.200000 3.373458 -0.878457 -3.025664 -0.233783 -0.554735 0.656286
8.233333 3.365580 -0.897019 -3.070638 -0.234211 -0.558169 1.407214
8.266667 3.357638 -0.915703 -2.947363 -0.234459 -0.561576 2.183894
8.300000 3.349762 -0.934488 -2.886434 -0.234538 -0.564967 2.944444
8.333333 3.341960 -0.953372 -2.767261 -0.234476 -0.568364 3.635978
8.366667 3.334232 -0.972357 -2.555781 -0.234314 -0.571795 4.200788
8.400000 3.326455 -0.991457 -2.306836 -0.234079 -0.575275 4.589339
8.433333 3.318634 -1.010670 -2.126057 -0.233785 -0.578818 4.767227
8.466667 3.310772 -1.029994 -1.817815 -0.233450 -0.582438 4.734734
8.500000 3.302979 -1.049446 -1.608485 -0.233098 -0.586144 4.493446
8.533333 3.295252 -1.069034 -1.417732 -0.232747 -0.589936 4.068159
8.566667 3.287496 -1.088728 -1.218539 -0.232398 -0.593797 3.499504
8.600000 3.279712 -1.108525 -1.135482 -0.232050 -0.597715 2.839755
8.633333 3.271979 -1.128491 -1.080498 -0.231708 -0.601681 2.132551
8.666667 3.264287 -1.148633 -1.049047 -0.231385 -0.605678 1.418647
8.700000 3.256629 -1.168957 -1.059383 -0.231084 -0.609687 0.734548
8.733333 3.248956 -1.189376 -1.098473 -0.230801 -0.613680 0.110182
8.766667 3.241272 -1.209888 -1.105042 -0.230537 -0.617648 -0.432180
8.800000 3.233579 -1.230491 -1.123122 -0.230291 -0.621586 -0.886547
8.833333 3.225901 -1.251283 -1.168405 -0.230053 -0.625485 -1.251467
8.866667 3.218234 -1.272264 -1.230917 -0.229800 -0.629338 -1.531659
8.900000 3.210568 -1.293327 -1.300905 -0.229513 -0.633140 -1.732832
8.933333 3.202904 -1.314470 -1.419816 -0.229178 -0.636898 -1.856213
8.966667 3.195254 -1.335793 -1.460030 -0.228779 -0.640596 -1.915094
9.000000 3.187612 -1.357190 -1.551927 -0.228304 -0.644206 -1.913177
9.033333 3.179987 -1.378757 -1.627519 -0.227745 -0.647701 -1.855937
9.066667 3.172375 -1.400392 -1.726245 -0.227089 -0.651071 -1.750904
9.100000 3.164791 -1.422181 -1.782138 -0.226331 -0.654297 -1.607897
9.133333 3.157240 -1.444116 -1.844206 -0.225463 -0.657355 -1.446962
9.166667 3.149729 -1.466190 -1.875121 -0.224482 -0.660229 -1.269952
9.200000 3.142241 -1.488319 -1.914633 -0.223376 -0.662913 -1.088874
9.233333 3.134779 -1.510499 -1.929034 -0.222139 -0.665408 -0.912697
9.266667 3.127346 -1.532728 -1.928658 -0.220769 -0.667700 -0.755038
9.300000 3.119979 -1.555063 -1.957871 -0.219267 -0.669783 -0.619067
9.333333 3.112645 -1.577438 -1.980181 -0.217629 -0.671669 -0.499270
9.366667 3.105390 -1.599899 -1.997543 -0.215854 -0.673368 -0.395184
9.400000 3.098223 -1.622435 -2.017284 -0.213957 -0.674885 -0.296987
9.433333 3.091094 -1.645001 -2.014567 -0.211950 -0.676220 -0.187292
9.466667 3.084006 -1.667594 -2.018985 -0.209848 -0.677378 -0.049307
9.500000 3.077024 -1.690234 -2.000794 -0.207657 -0.678362 0.117931
9.533333 3.070152 -1.712912 -2.001260 -0.205395 -0.679169 0.308130
9.566667 3.063326 -1.735605 -2.021160 -0.203079 -0.679800 0.510381
9.600000 3.056623 -1.758318 -2.049253 -0.200718 -0.680261 0.707391
9.633333 3.049968 -1.781037 -2.054837 -0.198320 -0.680564 0.872418
9.666667 3.043365 -1.803759 -2.015000 -0.195893 -0.680720 0.984419
9.700000 3.036891 -1.826477 -1.939579 -0.193452 -0.680741 1.035124
9.733333 3.030471 -1.849191 -1.832946 -0.190999 -0.680644 1.018664
9.766667 3.024106 -1.871896 -1.690820 -0.188533 -0.680441 0.928229
9.800000 3.017867 -1.894592 -1.629655 -0.186050 -0.680142 0.768556
9.833333 3.011748 -1.917282 -1.611271 -0.183559 -0.679754 0.555593
9.866667 3.005687 -1.939951 -1.620575 -0.181063 -0.679279 0.310795
9.900000 2.999685 -1.962595 -1.634937 -0.178559 -0.678715 0.057970
9.933333 2.993743 -1.985210 -1.656847 -0.176052 -0.678054 -0.176333
9.966667 2.987900 -2.007815 -1.699008 -0.173549 -0.677289 -0.362297
10.000000 2.982157 -2.030407 -1.752062 -0.171051 -0.676408 -0.484534
10.033333 2.976511 -2.052979 -1.799113 -0.168550 -0.675399 -0.537693
10.066667 2.970964 -2.075528 -1.842744 -0.166037 -0.674250 -0.527877
10.100000 2.965480 -2.098028 -1.864039 -0.163517 -0.672948 -0.472881
10.133333 2.960061 -2.120475 -1.860026 -0.160988 -0.671478 -0.394119
10.166667 2.954706 -2.142865 -1.862857 -0.158451 -0.669830 -0.314051
10.200000 2.949455 -2.165204 -1.866038 -0.155914 -0.667995 -0.250457
10.233333 2.944307 -2.187484 -1.839854 -0.153391 -0.665968 -0.217483
10.266667 2.939225 -2.209695 -1.834861 -0.150891 -0.663752 -0.222128
10.300000 2.934241 -2.231832 -1.851608 -0.148425 -0.661348 -0.259859
10.333333 2.929353 -2.253883 -1.840480 -0.146015 -0.658760 -0.321839
10.366667 2.924554 -2.275842 -1.829180 -0.143679 -0.655997 -0.399606
10.400000 2.919838 -2.297703 -1.840905 -0.141437 -0.653066 -0.484368
10.433333 2.915199 -2.319459 -1.872178 -0.139305 -0.649975 -0.565134
10.466667 2.910629 -2.341104 -1.921064 -0.137308 -0.646726 -0.631846
10.500000 2.906117 -2.362630 -1.979169 -0.135458 -0.643327 -0.681185
10.533333 2.901657 -2.384029 -2.010187 -0.133750 -0.639790 -0.711232
10.566667 2.897262 -2.405324 -2.015843 -0.132178 -0.636124 -0.719953
10.600000 2.892934 -2.426510 -2.037151 -0.130728 -0.632337 -0.706987
10.633333 2.888633 -2.447555 -2.060000 -0.129372 -0.628442 -0.675049
10.666667 2.884351 -2.468457 -2.075529 -0.128075 -0.624452 -0.631976
10.700000 2.880136 -2.489239 -2.098656 -0.126808 -0.620375 -0.583305
10.733333 2.875931 -2.509871 -2.124719 -0.125548 -0.616211 -0.534601
10.766667 2.871735 -2.530347 -2.146144 -0.124269 -0.611962 -0.491003
10.800000 2.867549 -2.550664 -2.158823 -0.122948 -0.607635 -0.455392
10.833333 2.863428 -2.570848 -2.179348 -0.121574 -0.603223 -0.429108
10.866667 2.859374 -2.590896 -2.187740 -0.120142 -0.598721 -0.411439
10.900000 2.855385 -2.610805 -2.182565 -0.118647 -0.594128 -0.401951
10.933333 2.851464 -2.630572 -2.200390 -0.117087 -0.589441 -0.397081
10.966667 2.847609 -2.650192 -2.204283 -0.115467 -0.584654 -0.390696
11.000000 2.843777 -2.669624 -2.215137 -0.113801 -0.579752 -0.375182
11.033333 2.840013 -2.688904 -2.223443 -0.112096 -0.574729 -0.343246
11.066667 2.836283 -2.707984 -2.244377 -0.110355 -0.569581 -0.286064
11.100000 2.832620 -2.726907 -2.271387 -0.108582 -0.564303 -0.197609
11.133333 2.829023 -2.745669 -2.297325 -0.106779 -0.558899 -0.077240
11.166667 2.825478 -2.764218 -2.305888 -0.104942 -0.553379 0.074411
11.200000 2.821999 -2.782601 -2.332564 -0.103069 -0.547757 0.256826
11.233333 2.818587 -2.800816 -2.330122 -0.101160 -0.542055 0.462985
11.266667 2.815241 -2.818805 -2.317589 -0.099224 -0.536284 0.682843
11.300000 2.811961 -2.836620 -2.269849 -0.097268 -0.530460 0.902541
11.333333 2.808751 -2.854204 -2.219369 -0.095305 -0.524592 1.106894
11.366667 2.805610 -2.871554 -2.135166 -0.093355 -0.518684 1.270332
11.400000 2.802535 -2.888722 -2.091470 -0.091441 -0.512732 1.365626
11.433333 2.799527 -2.905708 -2.066439 -0.089585 -0.506731 1.375145
11.466667 2.796586 -2.922507 -2.029093 -0.087808 -0.500671 1.286827
11.500000 2.793711 -2.939119 -1.936394 -0.086133 -0.494541 1.098528
11.533333 2.790902 -2.955541 -1.833369 -0.084572 -0.488331 0.812458
11.566667 2.788159 -2.971772 -1.742087 -0.083127 -0.482031 0.445448
11.600000 2.785452 -2.987766 -1.702571 -0.081783 -0.475642 0.017762
11.633333 2.782811 -3.003564 -1.714311 -0.080538 -0.469158 -0.447604
11.666667 2.780185 -3.019123 -1.749843 -0.079371 -0.462587 -0.925251
11.700000 2.777565 -3.034439 -1.821594 -0.078256 -0.455941 -1.386663
11.733333 2.774940 -3.049508 -1.906571 -0.077178 -0.449226 -1.798857
11.766667 2.772382 -3.064375 -2.007957 -0.076125 -0.442450 -2.130834
11.800000 2.769799 -3.078979 -2.126008 -0.075088 -0.435616 -2.359892
11.833333 2.767283 -3.093379 -2.230030 -0.074040 -0.428743 -2.476037
11.866667 2.764834 -3.107572 -2.335813 -0.072975 -0.421825 -2.476855
11.900000 2.762452 -3.121557 -2.455708 -0.071901 -0.414854 -2.369423
11.933333 2.760137 -3.135335 -2.560084 -0.070820 -0.407818 -2.173998
11.966667 2.757766 -3.148803 -2.637539 -0.069727 -0.400715 -1.919763
12.000000 2.755463 -3.162061 -2.706068 -0.068633 -0.393526 -1.636173
12.033333 2.753227 -3.175107 -2.769577 -0.067561 -0.386225 -1.344913
12.066667 2.750937 -3.187828 -2.790370 -0.066501 -0.378817 -1.070508
12.100000 2.748715 -3.200336 -2.786170 -0.065441 -0.371303 -0.836002
12.133333 2.746563 -3.212631 -2.790907 -0.064364 -0.363686 -0.653036
12.166667 2.744481 -3.224712 -2.779999 -0.063271 -0.355956 -0.523238
12.200000 2.742368 -3.236454 -2.767439 -0.062138 -0.348137 -0.433302
12.233333 2.740326 -3.247982 -2.759034 -0.060939 -0.340256 -0.371732
12.266667 2.738272 -3.259168 -2.769315 -0.059670 -0.332308 -0.313073
12.300000 2.736290 -3.270139 -2.774629 -0.058324 -0.324312 -0.231514
12.333333 2.734313 -3.280766 -2.826094 -0.056885 -0.316298 -0.109890
12.366667 2.732410 -3.291179 -2.854244 -0.055330 -0.308292 0.056944
12.400000 2.730582 -3.301379 -2.899657 -0.053658 -0.300293 0.251742
12.433333 2.728790 -3.311236 -2.923623 -0.051861 -0.292296 0.451305
12.466667 2.727048 -3.320753 -2.944052 -0.049938 -0.284317 0.616679
12.500000 2.725383 -3.330058 -2.913992 -0.047887 -0.276352 0.705830
12.533333 2.723794 -3.339153 -2.820921 -0.045722 -0.268376 0.686138
12.566667 2.722284 -3.348038 -2.718808 -0.043454 -0.260379 0.536475
12.600000 2.720857 -3.356591 -2.591185 -0.041086 -0.252368 0.257135
12.633333 2.719509 -3.364937 -2.471409 -0.038627 -0.244348 -0.138810
12.666667 2.718250 -3.372956 -2.442385 -0.036085 -0.236315 -0.627743
12.700000 2.717083 -3.380649 -2.442603 -0.033467 -0.228291 -1.172686
12.733333 2.715998 -3.388137 -2.551033 -0.030775 -0.220315 -1.731185
12.766667 2.715005 -3.395304 -2.701329 -0.028016 -0.212433 -2.254311
12.800000 2.714096 -3.402271 -2.888770 -0.025200 -0.204680 -2.697783
12.833333 2.713280 -3.408925 -3.084764 -0.022334 -0.197098 -3.025311
12.866667 2.712556 -3.415273 3.076697 -0.019422 -0.189732 -3.210818
12.900000 2.711954 -3.421375 2.962013 -0.016469 -0.182606 -3.240932
12.933333 2.711470 -3.427241 2.886598 -0.013485 -0.175743 -3.124206
12.966667 2.711073 -3.432918 2.816881 -0.010478 -0.169148 -2.893307
13.000000 2.710762 -3.438409 2.657374 -0.007451 -0.162835 -2.583405
13.033333 2.710563 -3.443689 2.523697 -0.004411 -0.156799 -2.228672
13.066667 2.710471 -3.448764 2.414641 -0.001367 -0.151030 -1.853766
13.100000 2.710484 -3.453644 2.389950 0.001675 -0.145518 -1.486784
13.133333 2.710584 -3.458348 2.390851 0.004715 -0.140237 -1.146077
13.166667 2.710788 -3.462880 2.377658 0.007750 -0.135170 -0.833634
13.200000 2.711095 -3.467248 2.358809 0.010772 -0.130292 -0.557415
13.233333 2.711506 -3.471465 2.363731 0.013779 -0.125585 -0.327694
13.266667 2.712021 -3.475539 2.399237 0.016768 -0.121028 -0.155648
13.300000 2.712640 -3.479478 2.405498 0.019741 -0.116609 -0.037603
13.333333 2.713362 -3.483288 2.403686 0.022695 -0.112317 0.035666
13.366667 2.714173 -3.486943 2.415042 0.025630 -0.108141 0.068822
13.400000 2.715087 -3.490476 2.404354 0.028548 -0.104070 0.071219
13.433333 2.716090 -3.493859 2.415197 0.031451 -0.100096 0.056780
