t x y theta dxdt dydt dthetadt
0.000000 0.000000 0.000000 1.725131 -0.133763 -0.026338 -0.029670
0.033333 -0.004517 -0.000894 1.722728 -0.138360 -0.028725 -0.030907
0.066667 -0.009195 -0.001863 1.731610 -0.143034 -0.031206 -0.029221
0.100000 -0.014015 -0.002928 1.737162 -0.147781 -0.033785 -0.027133
0.133333 -0.019004 -0.004075 1.732172 -0.152599 -0.036465 -0.022931
0.166667 -0.024165 -0.005306 1.734460 -0.157476 -0.039251 -0.014934
0.200000 -0.029502 -0.006626 1.714594 -0.162395 -0.042150 -0.009456
0.233333 -0.034985 -0.008053 1.722787 -0.167345 -0.045165 -0.005326
0.266667 -0.040617 -0.009592 1.724672 -0.172316 -0.048296 -0.002384
0.300000 -0.046436 -0.011230 1.732156 -0.177299 -0.051546 0.000528
0.333333 -0.052445 -0.012971 1.736531 -0.182285 -0.054917 0.000632
0.366667 -0.058604 -0.014832 1.735537 -0.187284 -0.058406 -0.001505
0.400000 -0.064961 -0.016805 1.726947 -0.192307 -0.062007 -0.004628
0.433333 -0.071470 -0.018903 1.729526 -0.197369 -0.065718 -0.010443
0.466667 -0.078130 -0.021132 1.732744 -0.202479 -0.069538 -0.018651
0.500000 -0.084942 -0.023492 1.729331 -0.207658 -0.073463 -0.028158
0.533333 -0.091908 -0.025989 1.721086 -0.212920 -0.077488 -0.035689
0.566667 -0.099026 -0.028623 1.734527 -0.218265 -0.081610 -0.042878
0.600000 -0.106363 -0.031392 1.721672 -0.223691 -0.085829 -0.047238
0.633333 -0.113854 -0.034305 1.726272 -0.229192 -0.090141 -0.047066
0.666667 -0.121569 -0.037361 1.720894 -0.234771 -0.094547 -0.041603
0.700000 -0.129513 -0.040562 1.723541 -0.240406 -0.099047 -0.032036
0.733333 -0.137610 -0.043917 1.716681 -0.246077 -0.103641 -0.020961
0.766667 -0.145942 -0.047426 1.707914 -0.251764 -0.108330 -0.004583
0.800000 -0.154427 -0.051093 1.702679 -0.257454 -0.113116 0.012479
0.833333 -0.163153 -0.054922 1.709614 -0.263115 -0.117998 0.029106
0.866667 -0.172029 -0.058915 1.712946 -0.268708 -0.122972 0.043650
0.900000 -0.181056 -0.063074 1.719774 -0.274216 -0.128033 0.055130
0.933333 -0.190231 -0.067402 1.728595 -0.279632 -0.133181 0.063528
0.966667 -0.199662 -0.071910 1.725696 -0.284969 -0.138416 0.063641
1.000000 -0.209351 -0.076601 1.727243 -0.290224 -0.143737 0.061146
1.033333 -0.219185 -0.081469 1.739249 -0.295431 -0.149146 0.058002
1.066667 -0.229164 -0.086516 1.734135 -0.300644 -0.154653 0.055913
1.100000 -0.239285 -0.091744 1.754035 -0.305908 -0.160265 0.056807
1.133333 -0.249547 -0.097156 1.735005 -0.311244 -0.165985 0.064887
1.166667 -0.259948 -0.102754 1.724859 -0.316659 -0.171812 0.086033
1.200000 -0.270487 -0.108539 1.730707 -0.322193 -0.177751 0.118154
1.233333 -0.281161 -0.114515 1.734142 -0.327867 -0.183801 0.162295
1.266667 -0.292119 -0.120711 1.734655 -0.333659 -0.189957 0.216291
1.300000 -0.303363 -0.127132 1.733281 -0.339538 -0.196206 0.281820
1.333333 -0.314736 -0.133749 1.753662 -0.345481 -0.202540 0.350582
1.366667 -0.326401 -0.140600 1.762533 -0.351459 -0.208951 0.415207
1.400000 -0.338360 -0.147688 1.775969 -0.357386 -0.215418 0.470969
1.433333 -0.350440 -0.154979 1.802855 -0.363175 -0.221921 0.512095
1.466667 -0.362638 -0.162472 1.815899 -0.368797 -0.228446 0.540324
1.500000 -0.374952 -0.170170 1.850701 -0.374265 -0.234987 0.549014
1.533333 -0.387563 -0.178110 1.882932 -0.379576 -0.241533 0.542822
1.566667 -0.400472 -0.186292 1.909696 -0.384757 -0.248082 0.522688
1.600000 -0.413485 -0.194684 1.918815 -0.389896 -0.254640 0.494947
1.633333 -0.426600 -0.203285 1.954956 -0.395062 -0.261216 0.461592
1.666667 -0.439812 -0.212098 1.948190 -0.400279 -0.267815 0.420717
1.700000 -0.453118 -0.221123 1.956983 -0.405522 -0.274437 0.376254
1.733333 -0.466512 -0.230362 1.947646 -0.410796 -0.281089 0.332080
1.766667 -0.480197 -0.239826 1.955038 -0.416076 -0.287774 0.292665
1.800000 -0.494167 -0.249514 1.987634 -0.421266 -0.294486 0.251871
1.833333 -0.508419 -0.259431 2.010752 -0.426288 -0.301229 0.210169
1.866667 -0.522743 -0.269566 2.012514 -0.431080 -0.308005 0.166147
1.900000 -0.537341 -0.279942 2.005456 -0.435595 -0.314829 0.122034
1.933333 -0.552209 -0.290572 2.018644 -0.439750 -0.321706 0.073945
1.966667 -0.567133 -0.301419 2.016410 -0.443502 -0.328644 0.023081
2.000000 -0.582107 -0.312486 2.017265 -0.446858 -0.335656 -0.021648
2.033333 -0.597126 -0.323772 2.012356 -0.449842 -0.342750 -0.051079
2.066667 -0.612183 -0.335277 2.015748 -0.452478 -0.349933 -0.058063
2.100000 -0.627274 -0.347001 2.009213 -0.454810 -0.357209 -0.042075
2.133333 -0.642392 -0.358945 1.999067 -0.456918 -0.364586 -0.000340
2.166667 -0.657710 -0.371216 1.970589 -0.458848 -0.372065 0.067798
2.200000 -0.673044 -0.383707 1.951084 -0.460641 -0.379655 0.161583
2.233333 -0.688554 -0.396539 1.955056 -0.462298 -0.387342 0.270671
2.266667 -0.704067 -0.409590 1.977559 -0.463828 -0.395123 0.388271
2.300000 -0.719576 -0.422858 1.995692 -0.465214 -0.402979 0.509250
2.333333 -0.735077 -0.436344 2.013919 -0.466432 -0.410902 0.628544
2.366667 -0.750710 -0.450185 2.054162 -0.467481 -0.418902 0.737286
2.400000 -0.766322 -0.464241 2.093167 -0.468347 -0.426977 0.825618
2.433333 -0.782048 -0.478659 2.128712 -0.469047 -0.435145 0.893574
2.466667 -0.797739 -0.493289 2.157744 -0.469583 -0.443413 0.942826
2.500000 -0.813387 -0.508131 2.191826 -0.469974 -0.451811 0.973166
2.533333 -0.829118 -0.523332 2.240731 -0.470212 -0.460334 0.986204
2.566667 -0.844793 -0.538741 2.262454 -0.470281 -0.468961 0.989004
2.600000 -0.860526 -0.554509 2.295985 -0.470151 -0.477646 0.986567
2.633333 -0.876188 -0.570482 2.325623 -0.469799 -0.486357 0.982145
2.666667 -0.891883 -0.586811 2.352157 -0.469195 -0.495049 0.974672
2.700000 -0.907597 -0.603497 2.390718 -0.468286 -0.503635 0.967223
2.733333 -0.923318 -0.620537 2.430892 -0.467047 -0.512065 0.958248
2.766667 -0.938940 -0.637771 2.457175 -0.465447 -0.520307 0.944330
2.800000 -0.954541 -0.655356 2.492745 -0.463479 -0.528353 0.925504
2.833333 -0.970106 -0.673290 2.505247 -0.461118 -0.536179 0.903304
2.866667 -0.985549 -0.691408 2.550887 -0.458356 -0.543779 0.878115
2.900000 -1.000864 -0.709704 2.591487 -0.455210 -0.551184 0.848564
2.933333 -1.016042 -0.728175 2.618945 -0.451696 -0.558424 0.820312
2.966667 -1.031077 -0.746818 2.651322 -0.447825 -0.565507 0.794137
3.000000 -1.046002 -0.765786 2.667126 -0.443608 -0.572451 0.773693
3.033333 -1.060770 -0.784918 2.687919 -0.439062 -0.579287 0.754539
3.066667 -1.075399 -0.804365 2.694656 -0.434191 -0.586045 0.741138
3.100000 -1.089872 -0.824122 2.719358 -0.428983 -0.592742 0.737241
3.133333 -1.104165 -0.844028 2.742055 -0.423426 -0.599366 0.738888
3.166667 -1.118268 -0.864229 2.787687 -0.417501 -0.605919 0.745005
3.200000 -1.132177 -0.884569 2.809950 -0.411198 -0.612391 0.752438
3.233333 -1.145885 -0.905044 2.820137 -0.404513 -0.618749 0.763283
3.266667 -1.159349 -0.925791 2.851901 -0.397449 -0.624960 0.772334
3.300000 -1.172599 -0.946662 2.871576 -0.390018 -0.631004 0.777083
3.333333 -1.185574 -0.967791 2.911564 -0.382219 -0.636871 0.777100
3.366667 -1.198259 -0.989169 2.942571 -0.374058 -0.642543 0.777073
3.400000 -1.210638 -1.010785 2.966863 -0.365536 -0.647990 0.774449
3.433333 -1.222696 -1.032630 2.993491 -0.356635 -0.653184 0.767605
3.466667 -1.234506 -1.054569 3.010740 -0.347325 -0.658100 0.757208
3.500000 -1.245967 -1.076713 3.019651 -0.337571 -0.662680 0.742419
3.533333 -1.257169 -1.098938 3.065309 -0.327335 -0.666874 0.724109
3.566667 -1.268107 -1.121236 3.087940 -0.316574 -0.670647 0.696987
3.600000 -1.278657 -1.143706 3.115731 -0.305222 -0.673976 0.664455
3.633333 -1.288809 -1.166339 3.139561 -0.293251 -0.676852 0.626536
3.666667 -1.298554 -1.189122 -3.123989 -0.280658 -0.679253 0.585182
3.700000 -1.307778 -1.211955 -3.097469 -0.267472 -0.681189 0.540407
3.733333 -1.316714 -1.234828 -3.081205 -0.253740 -0.682666 0.492378
3.766667 -1.325111 -1.257724 -3.059383 -0.239555 -0.683687 0.445225
3.800000 -1.332962 -1.280632 -3.059625 -0.225068 -0.684268 0.397614
3.833333 -1.340257 -1.303536 -3.054410 -0.210386 -0.684427 0.351847
3.866667 -1.346988 -1.326422 -3.033536 -0.195648 -0.684208 0.304587
3.900000 -1.353147 -1.349278 -3.046669 -0.180932 -0.683642 0.258850
3.933333 -1.358728 -1.372093 -3.017499 -0.166340 -0.682763 0.212734
3.966667 -1.363999 -1.394896 -3.015445 -0.151883 -0.681598 0.164121
4.000000 -1.368678 -1.417633 -3.003399 -0.137516 -0.680154 0.112295
4.033333 -1.373045 -1.440343 -2.988264 -0.123210 -0.678441 0.055119
4.066667 -1.376805 -1.462965 -2.999197 -0.108905 -0.676455 -0.002895
4.100000 -1.380253 -1.485546 -2.994860 -0.094542 -0.674191 -0.065996
4.133333 -1.383387 -1.508079 -3.000341 -0.080048 -0.671647 -0.126902
4.166667 -1.385897 -1.530494 -3.006233 -0.065449 -0.668837 -0.180854
4.200000 -1.388094 -1.552848 -3.023084 -0.050773 -0.665776 -0.224066
4.233333 -1.389657 -1.575064 -3.019110 -0.036073 -0.662480 -0.252601
4.266667 -1.390584 -1.597134 -3.042374 -0.021397 -0.658966 -0.264104
4.300000 -1.390873 -1.619052 -3.064946 -0.006877 -0.655263 -0.253599
4.333333 -1.390522 -1.640808 -3.073333 0.007336 -0.651407 -0.223778
4.366667 -1.389867 -1.662468 -3.084284 0.021169 -0.647416 -0.178569
4.400000 -1.388910 -1.684025 -3.108951 0.034496 -0.643318 -0.118653
4.433333 -1.387316 -1.705400 -3.109988 0.047245 -0.639128 -0.045503
4.466667 -1.385426 -1.726659 -3.105754 0.059373 -0.634857 0.034830
4.500000 -1.383245 -1.747797 -3.086306 0.070941 -0.630490 0.116190
4.533333 -1.380443 -1.768735 -3.093366 0.082041 -0.626003 0.195297
4.566667 -1.377356 -1.789539 -3.083195 0.092739 -0.621383 0.269640
4.600000 -1.373990 -1.810203 -3.067948 0.103148 -0.616598 0.334792
4.633333 -1.370349 -1.830720 -3.058672 0.113364 -0.611626 0.388456
4.666667 -1.366436 -1.851086 -3.027493 0.123455 -0.606449 0.431114
4.700000 -1.362258 -1.871293 -3.010269 0.133434 -0.601061 0.466570
4.733333 -1.357818 -1.891337 -3.003099 0.143361 -0.595442 0.492817
4.766667 -1.352833 -1.911134 -2.983332 0.153270 -0.589580 0.511939
4.800000 -1.347596 -1.930755 -2.960953 0.163154 -0.583475 0.525688
4.833333 -1.341842 -1.950117 -2.946302 0.172995 -0.577127 0.536578
4.866667 -1.335848 -1.969291 -2.923310 0.182788 -0.570527 0.545822
4.900000 -1.329621 -1.988272 -2.912253 0.192514 -0.563676 0.555642
4.933333 -1.322922 -2.006971 -2.896263 0.202086 -0.556594 0.568145
4.966667 -1.316002 -2.025466 -2.879130 0.211461 -0.549287 0.585527
5.000000 -1.308868 -2.043753 -2.844392 0.220621 -0.541758 0.609832
5.033333 -1.301312 -2.061734 -2.822957 0.229552 -0.534007 0.637563
5.066667 -1.293348 -2.079404 -2.819340 0.238197 -0.526063 0.672507
5.100000 -1.285190 -2.096851 -2.800948 0.246526 -0.517934 0.707597
5.133333 -1.276847 -2.114070 -2.787925 0.254540 -0.509628 0.747620
5.166667 -1.268151 -2.130957 -2.748175 0.262211 -0.501153 0.787341
5.200000 -1.259120 -2.147507 -2.721668 0.269498 -0.492518 0.825202
5.233333 -1.249927 -2.163815 -2.670706 0.276375 -0.483721 0.861556
5.266667 -1.240437 -2.179772 -2.666615 0.282852 -0.474748 0.891209
5.300000 -1.230802 -2.195479 -2.626749 0.288925 -0.465600 0.916097
5.333333 -1.221030 -2.210934 -2.586954 0.294581 -0.456282 0.926657
5.366667 -1.211017 -2.226019 -2.565129 0.299817 -0.446807 0.927136
5.400000 -1.200884 -2.240844 -2.512598 0.304650 -0.437197 0.916806
5.433333 -1.190551 -2.255288 -2.503417 0.309070 -0.427487 0.900815
5.466667 -1.180115 -2.269465 -2.453188 0.313072 -0.417694 0.876099
5.500000 -1.169523 -2.283248 -2.429426 0.316647 -0.407820 0.847580
5.533333 -1.158794 -2.296632 -2.402136 0.319782 -0.397879 0.823259
5.566667 -1.147950 -2.309610 -2.371266 0.322463 -0.387860 0.801502
5.600000 -1.137039 -2.322309 -2.335187 0.324667 -0.377753 0.783390
5.633333 -1.126071 -2.334728 -2.330412 0.326387 -0.367527 0.765128
5.666667 -1.115054 -2.346864 -2.319064 0.327600 -0.357173 0.755326
5.700000 -1.103998 -2.358716 -2.300994 0.328294 -0.346673 0.752149
5.733333 -1.092912 -2.370280 -2.260668 0.328464 -0.335990 0.751192
5.766667 -1.081840 -2.381408 -2.230296 0.328121 -0.325112 0.753329
5.800000 -1.070803 -2.392095 -2.201780 0.327267 -0.314027 0.758483
5.833333 -1.059825 -2.402338 -2.179919 0.325898 -0.302751 0.763150
5.866667 -1.048852 -2.412288 -2.150714 0.324012 -0.291301 0.757018
5.900000 -1.037984 -2.421788 -2.130973 0.321608 -0.279720 0.736990
5.933333 -1.027139 -2.430993 -2.107115 0.318681 -0.268061 0.700938
5.966667 -1.016440 -2.439746 -2.085420 0.315219 -0.256366 0.646132
6.000000 -1.005910 -2.448048 -2.046151 0.311247 -0.244685 0.568370
6.033333 -0.995571 -2.455903 -2.018814 0.306813 -0.233066 0.471140
6.066667 -0.985289 -2.463461 -1.999084 0.301969 -0.221554 0.362890
6.100000 -0.975073 -2.470724 -1.976710 0.296778 -0.210176 0.246514
6.133333 -0.965118 -2.477553 -1.961364 0.291320 -0.198971 0.132479
6.166667 -0.955448 -2.483955 -1.968905 0.285675 -0.187975 0.028787
6.200000 -0.946083 -2.489936 -1.985877 0.279909 -0.177207 -0.052630
6.233333 -0.937045 -2.495500 -1.982870 0.274071 -0.166677 -0.111748
6.266667 -0.928109 -2.500774 -2.027666 0.268213 -0.156393 -0.149251
6.300000 -0.919283 -2.505757 -2.043581 0.262352 -0.146355 -0.169884
6.333333 -0.910573 -2.510452 -2.068869 0.256447 -0.136534 -0.184897
6.366667 -0.901986 -2.514861 -2.075388 0.250407 -0.126883 -0.211185
6.400000 -0.893816 -2.518859 -2.074566 0.244120 -0.117348 -0.268476
6.433333 -0.885782 -2.522573 -2.060192 0.237441 -0.107867 -0.367816
6.466667 -0.877889 -2.526007 -2.035955 0.230260 -0.098388 -0.527239
6.500000 -0.870144 -2.529162 -2.014713 0.222493 -0.088868 -0.751027
6.533333 -0.862552 -2.532040 -2.004421 0.214122 -0.079295 -1.045665
6.566667 -0.855118 -2.534644 -2.039434 0.205176 -0.069673 -1.403393
6.600000 -0.848162 -2.536864 -2.084105 0.195726 -0.060026 -1.814745
6.633333 -0.841682 -2.538708 -2.156202 0.185891 -0.050394 -2.262613
6.666667 -0.835676 -2.540182 -2.230059 0.175788 -0.040815 -2.722230
6.700000 -0.830142 -2.541295 -2.344141 0.165551 -0.031345 -3.175335
6.733333 -0.825076 -2.542056 -2.460972 0.155286 -0.022037 -3.594059
6.766667 -0.820195 -2.542559 -2.621336 0.145120 -0.012949 -3.954519
6.800000 -0.815503 -2.542809 -2.794349 0.135102 -0.004129 -4.230909
6.833333 -0.811269 -2.542726 -2.928842 0.125252 0.004390 -4.412927
6.866667 -0.807230 -2.542395 -3.102416 0.115519 0.012587 -4.488804
6.900000 -0.803639 -2.541738 2.994974 0.105834 0.020457 -4.450626
6.933333 -0.800248 -2.540842 2.801320 0.096109 0.028006 -4.300158
6.966667 -0.797058 -2.539711 2.623072 0.086220 0.035244 -4.050418
7.000000 -0.794073 -2.538348 2.451791 0.076097 0.042170 -3.719295
7.033333 -0.791606 -2.536767 2.301550 0.065660 0.048781 -3.314950
7.066667 -0.789649 -2.534977 2.199985 0.054924 0.055075 -2.853737
7.100000 -0.787901 -2.532969 2.132208 0.043884 0.061054 -2.354503
7.133333 -0.786641 -2.530772 2.088566 0.032582 0.066714 -1.835740
7.166667 -0.785589 -2.528364 2.040140 0.021097 0.072063 -1.306138
7.200000 -0.785005 -2.525787 2.010166 0.009540 0.077121 -0.774457
7.233333 -0.784874 -2.523052 2.002780 -0.001954 0.081920 -0.254158
7.266667 -0.785184 -2.520174 2.002346 -0.013314 0.086479 0.244835
7.300000 -0.785922 -2.517165 2.003825 -0.024421 0.090829 0.716360
7.333333 -0.787076 -2.514041 2.025608 -0.035172 0.095015 1.156087
7.366667 -0.788635 -2.510813 2.055718 -0.045479 0.099071 1.558008
7.400000 -0.790396 -2.507404 2.142525 -0.055313 0.103022 1.912988
7.433333 -0.792548 -2.503910 2.241569 -0.064662 0.106885 2.215500
7.466667 -0.795083 -2.500338 2.347197 -0.073485 0.110696 2.460614
7.500000 -0.797813 -2.496598 2.461364 -0.081795 0.114470 2.646471
7.533333 -0.800736 -2.492692 2.582999 -0.089630 0.118204 2.771220
7.566667 -0.803848 -2.488624 2.688758 -0.097036 0.121896 2.831486
7.600000 -0.807303 -2.484510 2.802338 -0.104022 0.125558 2.833651
7.633333 -0.810941 -2.480242 2.885128 -0.110608 0.129189 2.784632
7.666667 -0.814760 -2.475824 2.960281 -0.116838 0.132771 2.691429
7.700000 -0.818882 -2.471375 3.063733 -0.122730 0.136301 2.553257
7.733333 -0.823178 -2.466784 -3.132110 -0.128290 0.139786 2.376053
7.766667 -0.827642 -2.462055 -3.053440 -0.133516 0.143235 2.167412
7.800000 -0.832266 -2.457218 -2.967320 -0.138439 0.146646 1.926356
7.833333 -0.837050 -2.452250 -2.879655 -0.143065 0.150026 1.650033
7.866667 -0.841960 -2.447178 -2.822775 -0.147381 0.153394 1.335634
7.900000 -0.846980 -2.442005 -2.773411 -0.151400 0.156752 0.999164
7.933333 -0.852092 -2.436728 -2.733789 -0.155129 0.160105 0.651182
7.966667 -0.857348 -2.431337 -2.721897 -0.158578 0.163457 0.301711
8.000000 -0.862746 -2.425834 -2.715773 -0.161753 0.166812 -0.030739
8.033333 -0.868281 -2.420225 -2.756043 -0.164674 0.170167 -0.326816
8.066667 -0.873948 -2.414512 -2.780357 -0.167370 0.173509 -0.572317
8.100000 -0.879662 -2.408686 -2.796650 -0.169858 0.176831 -0.777099
8.133333 -0.885417 -2.402738 -2.870739 -0.172169 0.180112 -0.955430
8.166667 -0.891209 -2.396663 -2.938719 -0.174346 0.183321 -1.126328
8.200000 -0.897033 -2.390460 -3.034080 -0.176435 0.186430 -1.311416
8.233333 -0.902968 -2.384174 -3.053617 -0.178469 0.189410 -1.537507
8.266667 -0.908926 -2.377762 -3.045843 -0.180484 0.192234 -1.829042
8.300000 -0.914900 -2.371229 -3.047194 -0.182506 0.194872 -2.198539
8.333333 -0.920974 -2.364624 -3.065428 -0.184545 0.197306 -2.651653
8.366667 -0.927144 -2.357952 -3.113850 -0.186582 0.199523 -3.182555
8.400000 -0.933404 -2.351216 3.080002 -0.188582 0.201518 -3.783742
8.433333 -0.939752 -2.344422 2.951343 -0.190510 0.203289 -4.435048
8.466667 -0.946182 -2.337572 2.753999 -0.192319 0.204840 -5.099718
8.500000 -0.952692 -2.330671 2.526274 -0.193955 0.206187 -5.733460
8.533333 -0.959276 -2.323724 2.282923 -0.195363 0.207339 -6.291844
8.566667 -0.965874 -2.316762 2.080991 -0.196518 0.208310 -6.750064
8.600000 -0.972538 -2.309761 1.817676 -0.197399 0.209111 -7.081873
8.633333 -0.979179 -2.302754 1.510260 -0.198012 0.209757 -7.276309
8.666667 -0.985879 -2.295715 1.209516 -0.198368 0.210260 -7.341048
8.700000 -0.992525 -2.288678 0.924788 -0.198494 0.210627 -7.298714
8.733333 -0.999221 -2.281618 0.653877 -0.198429 0.210866 -7.173567
8.766667 -1.005844 -2.274564 0.410556 -0.198200 0.210979 -6.969818
8.800000 -1.012510 -2.267495 0.177135 -0.197836 0.210969 -6.704183
8.833333 -1.019091 -2.260442 -0.018862 -0.197352 0.210833 -6.386633
8.866667 -1.025583 -2.253412 -0.170815 -0.196773 0.210573 -6.025940
8.900000 -1.032107 -2.246378 -0.387945 -0.196120 0.210192 -5.615148
8.933333 -1.038658 -2.239342 -0.551467 -0.195430 0.209700 -5.155584
8.966667 -1.045234 -2.232309 -0.774246 -0.194725 0.209109 -4.646038
9.000000 -1.051832 -2.225282 -0.968198 -0.194027 0.208429 -4.081665
9.033333 -1.058299 -2.218322 -1.154867 -0.193356 0.207671 -3.454835
9.066667 -1.064627 -2.211442 -1.251599 -0.192712 0.206835 -2.758028
9.100000 -1.070966 -2.204579 -1.339548 -0.192079 0.205902 -2.003146
9.133333 -1.077313 -2.197735 -1.392386 -0.191427 0.204850 -1.198880
9.166667 -1.083665 -2.190913 -1.424120 -0.190739 0.203657 -0.372006
9.200000 -1.090019 -2.184118 -1.431656 -0.189985 0.202288 0.452949
9.233333 -1.096373 -2.177351 -1.400928 -0.189120 0.200703 1.244240
9.266667 -1.102722 -2.170617 -1.323419 -0.188103 0.198866 1.968944
9.300000 -1.109065 -2.163917 -1.205746 -0.186916 0.196773 2.598352
9.333333 -1.115397 -2.157256 -1.080159 -0.185531 0.194406 3.108120
9.366667 -1.121717 -2.150636 -0.931394 -0.183924 0.191749 3.481189
9.400000 -1.127868 -2.144230 -0.755856 -0.182095 0.188815 3.702017
9.433333 -1.133854 -2.138039 -0.588945 -0.180070 0.185640 3.763559
9.466667 -1.139820 -2.131898 -0.438213 -0.177886 0.182263 3.676284
9.500000 -1.145761 -2.125808 -0.265720 -0.175561 0.178705 3.460360
9.533333 -1.151552 -2.119931 -0.109079 -0.173141 0.175021 3.141337
9.566667 -1.157314 -2.114111 0.047301 -0.170673 0.171267 2.746032
9.600000 -1.162937 -2.108498 0.129869 -0.168183 0.167483 2.312127
9.633333 -1.168527 -2.102946 0.164884 -0.165674 0.163681 1.876405
9.666667 -1.173986 -2.097591 0.164462 -0.163157 0.159885 1.461089
9.700000 -1.179407 -2.092300 0.176521 -0.160655 0.156133 1.088017
9.733333 -1.184705 -2.087193 0.174367 -0.158167 0.152436 0.771174
9.766667 -1.189962 -2.082153 0.172602 -0.155692 0.148802 0.524394
9.800000 -1.195099 -2.077285 0.186817 -0.153231 0.145238 0.341824
9.833333 -1.200115 -2.072581 0.181154 -0.150799 0.141770 0.213089
9.866667 -1.205086 -2.067948 0.188798 -0.148397 0.138401 0.127053
9.900000 -1.210011 -2.063386 0.189355 -0.146017 0.135126 0.069257
9.933333 -1.214820 -2.058971 0.204537 -0.143652 0.131936 0.024848
9.966667 -1.219580 -2.054628 0.217939 -0.141299 0.128829 -0.018809
10.000000 -1.224229 -2.050420 0.206112 -0.138949 0.125795 -0.063774
10.033333 -1.228826 -2.046287 0.206562 -0.136587 0.122814 -0.113261
10.066667 -1.233370 -2.042228 0.200250 -0.134209 0.119877 -0.165358
10.100000 -1.237808 -2.038289 0.189555 -0.131812 0.116976 -0.217162
10.133333 -1.242190 -2.034426 0.176445 -0.129393 0.114106 -0.264001
10.166667 -1.246469 -2.030674 0.171737 -0.126959 0.111264 -0.303706
10.200000 -1.250647 -2.027030 0.159456 -0.124514 0.108450 -0.337071
10.233333 -1.254767 -2.023463 0.141436 -0.122074 0.105669 -0.359979
10.266667 -1.258788 -2.019999 0.119080 -0.119650 0.102928 -0.372335
10.300000 -1.262712 -2.016634 0.118815 -0.117254 0.100230 -0.377780
10.333333 -1.266575 -2.013347 0.094992 -0.114897 0.097580 -0.374884
10.366667 -1.270343 -2.010156 0.080415 -0.112582 0.094977 -0.364814
