t x y theta dxdt dydt dthetadt
0.000000 0.000000 0.000000 -0.185065 -0.033428 0.042980 -0.348397
0.033333 -0.000816 0.001356 -0.188006 -0.027582 0.038284 -0.225435
0.066667 -0.001721 0.002982 -0.175810 -0.021558 0.032317 -0.093468
0.100000 -0.002722 0.004882 -0.161958 -0.015226 0.025261 0.036172
0.133333 -0.001734 0.004800 -0.161276 -0.008288 0.017498 0.155347
0.166667 -0.000856 0.004997 -0.132154 -0.000328 0.009553 0.247518
0.200000 -0.000094 0.005476 -0.108326 0.009548 0.001553 0.309735
0.233333 -0.000288 0.005188 -0.108247 0.022395 -0.006201 0.349050
0.266667 -0.000613 0.005191 -0.095892 0.038923 -0.013334 0.374277
0.300000 -0.001627 0.004610 -0.056201 0.059382 -0.019394 0.389040
0.333333 -0.002485 0.003535 -0.046262 0.083793 -0.024166 0.392459
0.366667 -0.002128 0.002093 -0.051361 0.111924 -0.027401 0.396044
0.400000 0.000268 0.000446 -0.052433 0.143043 -0.028613 0.400581
0.433333 0.005862 -0.001310 -0.054833 0.175259 -0.027344 0.401763
0.466667 0.014997 -0.003037 -0.023289 0.206553 -0.023160 0.389091
0.500000 0.023931 -0.004424 -0.011435 0.234434 -0.015545 0.361018
0.533333 0.032649 -0.005464 0.017991 0.256101 -0.003671 0.307661
0.566667 0.044416 -0.006189 0.042867 0.268893 0.013074 0.208173
0.600000 0.055927 -0.006552 0.067355 0.270876 0.035009 0.044887
0.633333 0.068854 -0.006484 0.065089 0.261233 0.062505 -0.198701
0.666667 0.082348 -0.005750 0.069910 0.239710 0.095853 -0.521708
0.700000 0.094437 -0.004005 0.078178 0.207102 0.134811 -0.931424
0.733333 0.104093 -0.000683 0.072816 0.165148 0.178453 -1.415942
0.766667 0.109749 0.004960 0.070501 0.116244 0.225785 -1.950831
0.800000 0.115028 0.011001 0.013568 0.062435 0.275954 -2.498920
0.833333 0.115347 0.020743 -0.060787 0.006375 0.327295 -3.015334
0.866667 0.111011 0.034915 -0.191067 -0.049092 0.377880 -3.463069
0.900000 0.106270 0.049477 -0.372340 -0.101861 0.426167 -3.792206
0.933333 0.101121 0.064422 -0.574038 -0.150738 0.471184 -3.961235
0.966667 0.092416 0.084172 -0.798982 -0.195353 0.511956 -3.937751
1.000000 0.083300 0.104286 -0.972653 -0.235342 0.547513 -3.716413
1.033333 0.073772 0.124750 -1.182322 -0.271713 0.577885 -3.303840
1.066667 0.063835 0.145553 -1.359099 -0.306471 0.603832 -2.720057
1.100000 0.053488 0.166680 -1.493900 -0.341380 0.626145 -2.003527
1.133333 0.042733 0.188119 -1.552871 -0.377852 0.645539 -1.206406
1.166667 0.031572 0.209855 -1.534167 -0.417108 0.663235 -0.386764
1.200000 0.020008 0.231876 -1.488891 -0.460364 0.680454 0.410651
1.233333 0.005886 0.254237 -1.420816 -0.507869 0.697983 1.141141
1.266667 -0.011040 0.277273 -1.307511 -0.558884 0.716073 1.767691
1.300000 -0.030821 0.301010 -1.202430 -0.612432 0.734879 2.266047
1.333333 -0.050978 0.324972 -1.089884 -0.667448 0.754498 2.629534
1.366667 -0.073916 0.350088 -0.970181 -0.722738 0.774666 2.863893
1.400000 -0.099774 0.376351 -0.857675 -0.776894 0.795038 2.980238
1.433333 -0.128425 0.403828 -0.737395 -0.828861 0.815275 2.993965
1.466667 -0.160089 0.432563 -0.620808 -0.877982 0.835091 2.929946
1.500000 -0.192040 0.461433 -0.506405 -0.923812 0.854155 2.807257
1.533333 -0.224255 0.490419 -0.423638 -0.965805 0.872041 2.643573
1.566667 -0.256709 0.519499 -0.326259 -1.003560 0.888381 2.451392
1.600000 -0.289377 0.548653 -0.254112 -1.037114 0.902946 2.241485
1.633333 -0.324648 0.579135 -0.179279 -1.066481 0.915544 2.022774
1.666667 -0.362083 0.610760 -0.110706 -1.091655 0.926020 1.795639
1.700000 -0.401193 0.642992 -0.060753 -1.112503 0.934235 1.566154
1.733333 -0.440401 0.675207 -0.026094 -1.129062 0.940149 1.332441
1.766667 -0.479677 0.707381 0.008163 -1.141026 0.943622 1.096411
1.800000 -0.518988 0.739489 0.051607 -1.147875 0.944483 0.854618
1.833333 -0.558301 0.771508 0.079358 -1.149405 0.942737 0.607912
1.866667 -0.597585 0.803412 0.110712 -1.145408 0.938417 0.359073
1.900000 -0.636807 0.835179 0.122865 -1.135587 0.931513 0.106652
1.933333 -0.675953 0.866517 0.131085 -1.119648 0.922039 -0.145717
1.966667 -0.714310 0.897387 0.111641 -1.097909 0.910177 -0.393895
2.000000 -0.751235 0.927758 0.079633 -1.070803 0.896114 -0.629000
2.033333 -0.787972 0.957898 0.059418 -1.038512 0.879907 -0.843917
2.066667 -0.824490 0.987784 0.012683 -1.001246 0.861312 -1.029101
2.100000 -0.857453 1.016548 -0.030805 -0.960080 0.840404 -1.174329
2.133333 -0.890142 1.045015 -0.078754 -0.915789 0.816757 -1.270891
2.166667 -0.922531 1.073164 -0.143303 -0.868768 0.789827 -1.315296
2.200000 -0.950677 1.099600 -0.206614 -0.819234 0.758693 -1.306469
2.233333 -0.974210 1.123909 -0.265556 -0.767764 0.722582 -1.244700
2.266667 -0.997380 1.147842 -0.325071 -0.715322 0.681448 -1.136791
2.300000 -1.020169 1.171385 -0.365127 -0.661765 0.634669 -0.991774
2.333333 -1.042564 1.194521 -0.409417 -0.607380 0.582352 -0.818237
2.366667 -1.064546 1.217235 -0.434568 -0.552514 0.524633 -0.628566
2.400000 -1.081829 1.234514 -0.455510 -0.497905 0.462767 -0.433814
2.433333 -1.098674 1.251345 -0.448335 -0.443583 0.397718 -0.248380
2.466667 -1.111416 1.262209 -0.445865 -0.389522 0.330498 -0.082440
2.500000 -1.123705 1.272611 -0.431986 -0.336380 0.262767 0.056664
2.533333 -1.132031 1.277142 -0.415569 -0.285112 0.196602 0.159724
2.566667 -1.139898 1.281212 -0.395571 -0.236639 0.134075 0.226545
2.600000 -1.147304 1.284828 -0.390445 -0.191131 0.076078 0.257426
2.633333 -1.151810 1.284517 -0.366471 -0.149315 0.023936 0.257941
2.666667 -1.153761 1.281128 -0.345247 -0.111482 -0.021732 0.235171
2.700000 -1.155257 1.277308 -0.341553 -0.077746 -0.060535 0.194166
2.733333 -1.156303 1.273069 -0.323399 -0.047584 -0.093093 0.142337
2.766667 -1.156903 1.268423 -0.326182 -0.020540 -0.120031 0.085220
2.800000 -1.157064 1.263383 -0.342367 0.003360 -0.141549 0.025895
2.833333 -1.156790 1.257962 -0.339163 0.024499 -0.158435 -0.032313
2.866667 -1.155653 1.251946 -0.352646 0.043144 -0.171291 -0.088162
2.900000 -1.153668 1.245562 -0.355728 0.059479 -0.180712 -0.139704
2.933333 -1.150487 1.238760 -0.348554 0.073365 -0.186886 -0.185218
2.966667 -1.146898 1.231631 -0.356536 0.084593 -0.189885 -0.224978
3.000000 -1.142910 1.224189 -0.352302 0.093018 -0.189791 -0.261856
3.033333 -1.138960 1.217251 -0.373384 0.098335 -0.186466 -0.295147
3.066667 -1.135241 1.211010 -0.391614 0.100401 -0.179917 -0.325269
3.100000 -1.131146 1.204496 -0.402954 0.099354 -0.170376 -0.350349
3.133333 -1.126684 1.197723 -0.417199 0.095636 -0.158274 -0.370276
3.166667 -1.121863 1.190703 -0.428041 0.089980 -0.144285 -0.385413
3.200000 -1.118238 1.185255 -0.441937 0.083320 -0.129257 -0.389826
3.233333 -1.115706 1.181305 -0.460539 0.076716 -0.114067 -0.384502
3.266667 -1.114120 1.178806 -0.475563 0.071216 -0.099531 -0.368357
3.300000 -1.113523 1.177530 -0.480874 0.067823 -0.086439 -0.344244
3.333333 -1.112590 1.176054 -0.509281 0.067345 -0.075445 -0.309399
3.366667 -1.111324 1.174384 -0.518041 0.070306 -0.067056 -0.264327
3.400000 -1.110267 1.173256 -0.525093 0.076809 -0.061466 -0.211730
3.433333 -1.108881 1.171946 -0.520257 0.086495 -0.058563 -0.155311
3.466667 -1.107060 1.170602 -0.541159 0.098539 -0.057918 -0.097664
3.500000 -1.104123 1.169065 -0.542470 0.111671 -0.058791 -0.041641
3.533333 -1.100040 1.167126 -0.552382 0.124559 -0.060435 0.005056
3.566667 -1.094679 1.164765 -0.544114 0.135748 -0.062065 0.040156
