t x y theta dxdt dydt dthetadt
0.000000 0.000000 0.000000 -0.771069 -0.003554 0.003815 -0.001017
0.033333 0.000301 -0.000735 -0.767959 -0.004575 0.006018 0.000860
0.066667 0.000297 -0.000964 -0.776315 -0.006104 0.009147 0.004029
0.100000 -0.000020 -0.000672 -0.768657 -0.008513 0.013579 0.005790
0.133333 -0.000659 0.000156 -0.776786 -0.012364 0.019957 0.003976
0.166667 -0.001111 0.000690 -0.778592 -0.018616 0.029322 0.000606
0.200000 -0.001103 0.001119 -0.769920 -0.028162 0.042702 -0.007574
0.233333 -0.000976 0.001328 -0.768727 -0.041630 0.060726 -0.025813
0.266667 -0.001199 0.002144 -0.769947 -0.059468 0.084026 -0.054199
0.300000 -0.001683 0.003484 -0.774249 -0.082270 0.113425 -0.088527
0.333333 -0.002610 0.005338 -0.777147 -0.110242 0.149217 -0.129814
0.366667 -0.004979 0.008849 -0.757634 -0.143051 0.191211 -0.181689
0.400000 -0.009440 0.014329 -0.760048 -0.180172 0.239066 -0.239086
0.433333 -0.014292 0.020492 -0.780928 -0.221239 0.292720 -0.295982
0.466667 -0.021798 0.030578 -0.797369 -0.265646 0.351533 -0.348568
0.500000 -0.033026 0.044552 -0.807532 -0.312274 0.414266 -0.397041
0.533333 -0.044661 0.059228 -0.836059 -0.360305 0.479964 -0.433600
0.566667 -0.056701 0.074613 -0.854857 -0.409113 0.547636 -0.448914
0.600000 -0.071252 0.094046 -0.863629 -0.458374 0.616254 -0.442288
0.633333 -0.088058 0.116635 -0.876196 -0.507423 0.684212 -0.416032
0.666667 -0.105266 0.139930 -0.912497 -0.556083 0.750515 -0.370949
0.700000 -0.125280 0.167395 -0.938172 -0.604502 0.814438 -0.306080
0.733333 -0.145687 0.195556 -0.952502 -0.652613 0.875188 -0.228699
0.766667 -0.167811 0.227054 -0.957497 -0.700423 0.931851 -0.145827
0.800000 -0.192242 0.261002 -0.949286 -0.747727 0.983872 -0.061758
0.833333 -0.218153 0.296719 -0.949808 -0.794644 1.031239 0.021452
0.866667 -0.245678 0.333585 -0.943192 -0.840644 1.073606 0.097806
0.900000 -0.274710 0.371524 -0.932063 -0.885321 1.110799 0.159829
0.933333 -0.305622 0.409741 -0.919117 -0.928473 1.142796 0.204990
0.966667 -0.336830 0.448558 -0.907638 -0.969815 1.170151 0.228988
1.000000 -0.371427 0.489011 -0.896737 -1.009188 1.193446 0.230147
1.033333 -0.406278 0.530029 -0.883333 -1.046516 1.213337 0.207279
1.066667 -0.441359 0.571596 -0.881283 -1.082198 1.230654 0.164070
1.100000 -0.479920 0.613278 -0.865484 -1.116377 1.246510 0.106169
1.133333 -0.518657 0.655470 -0.853440 -1.149043 1.261822 0.039319
1.166667 -0.557544 0.698156 -0.846420 -1.180069 1.277206 -0.028426
1.200000 -0.596553 0.741319 -0.842033 -1.209413 1.293065 -0.091361
1.233333 -0.635700 0.782537 -0.852088 -1.236846 1.309727 -0.142668
1.266667 -0.677649 0.825111 -0.871885 -1.261992 1.327463 -0.179452
1.300000 -0.721311 0.868397 -0.900356 -1.284728 1.346101 -0.199369
1.333333 -0.766267 0.913527 -0.923638 -1.304982 1.365395 -0.200250
1.366667 -0.811757 0.960131 -0.933426 -1.322923 1.384947 -0.185504
1.400000 -0.857179 1.007103 -0.938821 -1.338681 1.404393 -0.155283
1.433333 -0.902875 1.055123 -0.936673 -1.352732 1.423059 -0.116303
1.466667 -0.948882 1.103650 -0.937589 -1.365593 1.440281 -0.073012
1.500000 -0.994715 1.152483 -0.934605 -1.377724 1.455197 -0.030258
1.533333 -1.039643 1.201574 -0.933970 -1.389622 1.467252 0.004731
1.566667 -1.084324 1.250931 -0.916112 -1.401592 1.476001 0.032191
1.600000 -1.130974 1.301297 -0.913858 -1.413690 1.480938 0.046776
1.633333 -1.177306 1.351884 -0.920301 -1.425125 1.481342 0.051054
1.666667 -1.224917 1.402400 -0.910736 -1.435000 1.476544 0.043229
1.700000 -1.273847 1.452037 -0.929552 -1.442152 1.466293 0.023238
1.733333 -1.322341 1.501825 -0.910104 -1.445328 1.450201 -0.014154
1.766667 -1.374147 1.552450 -0.909505 -1.442596 1.427701 -0.076209
1.800000 -1.425433 1.603178 -0.912272 -1.431911 1.398024 -0.166808
1.833333 -1.474988 1.649955 -0.909744 -1.411666 1.361488 -0.294149
1.866667 -1.523930 1.696801 -0.917208 -1.380502 1.318363 -0.456856
1.900000 -1.572190 1.740746 -0.910515 -1.337621 1.269302 -0.655788
1.933333 -1.619749 1.784730 -0.918994 -1.281728 1.215083 -0.877362
1.966667 -1.663262 1.823769 -0.925619 -1.212833 1.157874 -1.106506
2.000000 -1.705985 1.862831 -0.963368 -1.131200 1.100726 -1.325342
2.033333 -1.745711 1.898063 -1.005875 -1.037819 1.046095 -1.513540
2.066667 -1.784569 1.933310 -1.098299 -0.933560 0.996454 -1.653833
2.100000 -1.816882 1.963286 -1.198132 -0.819451 0.953987 -1.729456
2.133333 -1.842377 1.989192 -1.293799 -0.697798 0.921268 -1.732046
2.166667 -1.860920 2.014099 -1.388453 -0.570823 0.899671 -1.659080
2.200000 -1.878480 2.039061 -1.472168 -0.441374 0.889684 -1.516022
2.233333 -1.895044 2.064085 -1.522737 -0.311405 0.891628 -1.313090
2.266667 -1.903782 2.090582 -1.583844 -0.183436 0.905694 -1.068641
2.300000 -1.904836 2.119748 -1.599312 -0.059570 0.931421 -0.803686
2.333333 -1.898235 2.152155 -1.597593 0.058436 0.967203 -0.540949
2.366667 -1.890644 2.184670 -1.590304 0.169374 1.010915 -0.298761
2.400000 -1.882071 2.217289 -1.580742 0.272598 1.060682 -0.091175
2.433333 -1.872528 2.250011 -1.570212 0.367022 1.114464 0.074955
2.466667 -1.857683 2.286406 -1.558895 0.452344 1.170151 0.198712
2.500000 -1.837470 2.328666 -1.540552 0.528491 1.225820 0.284050
2.533333 -1.816354 2.371022 -1.517991 0.596236 1.280303 0.340998
2.566667 -1.792728 2.416339 -1.494382 0.656099 1.332767 0.375088
2.600000 -1.768251 2.461724 -1.495583 0.708458 1.382363 0.396483
2.633333 -1.742498 2.509807 -1.485161 0.753796 1.428266 0.406893
2.666667 -1.715127 2.561386 -1.489568 0.792694 1.469847 0.411238
2.700000 -1.686997 2.612975 -1.467383 0.825804 1.507046 0.412615
2.733333 -1.658134 2.664553 -1.453399 0.853145 1.539489 0.409915
2.766667 -1.628569 2.716095 -1.426542 0.874867 1.567283 0.405904
2.800000 -1.598330 2.767578 -1.408405 0.891246 1.590492 0.396188
2.833333 -1.567256 2.821826 -1.401199 0.902381 1.609380 0.386049
2.866667 -1.535650 2.878053 -1.377514 0.907862 1.624274 0.371165
2.900000 -1.503469 2.934141 -1.370745 0.907174 1.635113 0.351338
2.933333 -1.472562 2.989877 -1.347421 0.900292 1.642026 0.324337
2.966667 -1.441141 3.045413 -1.357984 0.887353 1.644914 0.292929
3.000000 -1.409235 3.100720 -1.349633 0.868633 1.643870 0.260324
3.033333 -1.378356 3.156655 -1.338450 0.845075 1.639070 0.222448
3.066667 -1.349063 3.212314 -1.329386 0.818408 1.630608 0.182824
3.100000 -1.321136 3.267600 -1.317924 0.790619 1.618280 0.139479
3.133333 -1.294999 3.321602 -1.307881 0.763404 1.601937 0.092267
3.166667 -1.271423 3.375108 -1.295589 0.738827 1.581096 0.031889
3.200000 -1.251079 3.427620 -1.305078 0.719222 1.555158 -0.046907
3.233333 -1.230419 3.479677 -1.311541 0.706547 1.523413 -0.142796
3.266667 -1.209459 3.531254 -1.325967 0.701923 1.485424 -0.256516
3.300000 -1.188217 3.582323 -1.317271 0.705709 1.441517 -0.385178
3.333333 -1.167629 3.633432 -1.311114 0.718493 1.391986 -0.520433
3.366667 -1.146108 3.682537 -1.317658 0.739763 1.337926 -0.650284
3.400000 -1.123112 3.728169 -1.345424 0.768430 1.280755 -0.761393
3.433333 -1.097147 3.768602 -1.373108 0.802912 1.222607 -0.849263
3.466667 -1.070975 3.808417 -1.435381 0.841888 1.165374 -0.901512
3.500000 -1.041344 3.843452 -1.480770 0.884129 1.110909 -0.912206
3.533333 -1.011543 3.877846 -1.549591 0.927487 1.060862 -0.879440
3.566667 -0.978594 3.908481 -1.580669 0.970169 1.016569 -0.804415
3.600000 -0.945523 3.938461 -1.644466 1.010310 0.978630 -0.691685
3.633333 -0.912358 3.967779 -1.666130 1.046626 0.946594 -0.542639
3.666667 -0.874718 3.998204 -1.666691 1.077472 0.919851 -0.372283
3.700000 -0.837048 4.027957 -1.663888 1.101273 0.896829 -0.187984
3.733333 -0.796870 4.058579 -1.648059 1.117114 0.876074 -0.002784
3.766667 -0.755966 4.088612 -1.653281 1.124511 0.855690 0.176618
3.800000 -0.715139 4.117948 -1.628899 1.123404 0.834226 0.338182
3.833333 -0.674424 4.146579 -1.624640 1.113581 0.810622 0.476196
3.866667 -0.636334 4.173581 -1.611732 1.095298 0.783916 0.591269
3.900000 -0.598671 4.200040 -1.580839 1.069528 0.754003 0.682107
3.933333 -0.563071 4.225304 -1.552751 1.037210 0.720782 0.755848
3.966667 -0.527713 4.249820 -1.521570 0.998722 0.684214 0.812745
4.000000 -0.492629 4.273580 -1.479506 0.954300 0.644229 0.861974
4.033333 -0.463595 4.293417 -1.435459 0.904317 0.600914 0.906668
4.066667 -0.434883 4.312477 -1.405942 0.849335 0.554614 0.948509
4.100000 -0.406517 4.330759 -1.376985 0.789263 0.505409 0.986424
4.133333 -0.378520 4.348261 -1.356878 0.724273 0.453718 1.014738
4.166667 -0.350917 4.364979 -1.337942 0.655316 0.400416 1.033035
4.200000 -0.329506 4.377568 -1.319145 0.583853 0.346812 1.037489
4.233333 -0.308522 4.389364 -1.270917 0.511077 0.293915 1.022038
4.266667 -0.292901 4.397649 -1.211550 0.438313 0.242757 0.983752
4.300000 -0.282758 4.402402 -1.170935 0.367600 0.194668 0.924107
4.333333 -0.273065 4.406363 -1.119187 0.300901 0.150769 0.845539
4.366667 -0.267956 4.408204 -1.061055 0.240141 0.112150 0.747946
4.400000 -0.263302 4.409266 -1.042176 0.186280 0.079142 0.632546
4.433333 -0.260755 4.409073 -1.032692 0.140542 0.052263 0.510464
4.466667 -0.259182 4.409237 -1.031806 0.103366 0.031479 0.390461
4.500000 -0.258059 4.408654 -1.033158 0.074206 0.016255 0.276763
4.533333 -0.257063 4.409197 -1.036653 0.052352 0.005817 0.175845
4.566667 -0.256517 4.409016 -1.047672 0.036382 -0.000895 0.095943
4.600000 -0.256418 4.408121 -1.050617 0.025262 -0.004738 0.042027
4.633333 -0.256764 4.406522 -1.048576 0.017675 -0.006655 0.009420
4.666667 -0.256400 4.406260 -1.037332 0.012596 -0.007264 -0.006676
4.700000 -0.255927 4.406335 -1.030422 0.009370 -0.007039 -0.008606
4.733333 -0.255191 4.407069 -1.051189 0.007287 -0.006385 -0.000887
4.766667 -0.254900 4.407136 -1.040793 0.005920 -0.005607 0.008654
