t x y theta dxdt dydt dthetadt
0.000000 0.000000 0.000000 -1.686502 0.029559 -0.012803 0.093082
0.033333 0.004478 -0.003855 -1.684756 0.062507 -0.026504 0.199364
0.066667 0.010114 -0.005636 -1.684968 0.110139 -0.046200 0.352228
0.100000 0.015879 -0.007715 -1.678765 0.174570 -0.072980 0.555356
0.133333 0.021818 -0.010108 -1.643967 0.257928 -0.107926 0.811471
0.166667 0.027964 -0.012833 -1.583499 0.343434 -0.143833 1.058640
0.200000 0.042011 -0.017663 -1.511541 0.429956 -0.181362 1.281265
0.233333 0.060054 -0.024516 -1.447119 0.514651 -0.220180 1.460099
0.266667 0.081103 -0.033219 -1.400765 0.594767 -0.259323 1.582069
0.300000 0.102452 -0.042176 -1.327006 0.667264 -0.297569 1.635831
0.333333 0.128988 -0.053114 -1.264766 0.728858 -0.333678 1.612175
0.366667 0.158003 -0.064892 -1.178737 0.785865 -0.370442 1.542636
0.400000 0.186314 -0.077565 -1.125977 0.837589 -0.406702 1.436187
0.433333 0.217476 -0.092732 -1.075601 0.884438 -0.441829 1.308945
0.466667 0.248945 -0.108109 -1.008114 0.927884 -0.475840 1.170872
0.500000 0.279466 -0.124873 -0.995619 0.969396 -0.508605 1.036885
0.533333 0.312165 -0.143362 -0.962590 1.010753 -0.539918 0.918474
0.566667 0.345190 -0.162062 -0.960569 1.053830 -0.569683 0.826063
0.600000 0.378554 -0.180973 -0.965149 1.100040 -0.597941 0.768630
0.633333 0.414230 -0.201454 -0.939179 1.150864 -0.624926 0.746282
0.666667 0.452384 -0.223467 -0.922071 1.205673 -0.650479 0.761732
0.700000 0.493119 -0.246566 -0.901207 1.263590 -0.674679 0.806966
0.733333 0.534232 -0.269806 -0.892719 1.323795 -0.697831 0.878400
0.766667 0.575722 -0.293180 -0.858042 1.385035 -0.720113 0.964216
0.800000 0.626800 -0.318303 -0.825833 1.445013 -0.741649 1.050265
0.833333 0.678229 -0.343461 -0.774105 1.501308 -0.762637 1.127465
0.866667 0.729969 -0.368644 -0.726147 1.552935 -0.783607 1.188672
0.900000 0.784553 -0.394794 -0.681381 1.599184 -0.805072 1.229487
0.933333 0.841846 -0.421674 -0.627862 1.638874 -0.827493 1.243061
0.966667 0.900940 -0.449530 -0.569585 1.670928 -0.851331 1.227820
1.000000 0.958474 -0.478915 -0.539547 1.696331 -0.877063 1.188132
1.033333 1.016149 -0.508222 -0.488603 1.716017 -0.904748 1.126815
1.066667 1.073918 -0.537437 -0.448136 1.730581 -0.934019 1.048400
1.100000 1.131736 -0.566546 -0.404600 1.740889 -0.964644 0.956923
1.133333 1.190337 -0.598499 -0.381723 1.748575 -0.995992 0.860660
1.166667 1.249196 -0.632592 -0.358652 1.755611 -1.027282 0.768419
1.200000 1.308275 -0.669127 -0.335308 1.762178 -1.057109 0.683005
1.233333 1.367326 -0.705467 -0.322390 1.768194 -1.084016 0.613454
1.266667 1.424696 -0.743117 -0.302027 1.773710 -1.106638 0.559266
1.300000 1.481981 -0.780539 -0.287669 1.778506 -1.123413 0.526659
1.333333 1.542437 -0.821343 -0.281975 1.781569 -1.133074 0.514931
1.366667 1.602777 -0.861834 -0.286846 1.781580 -1.134888 0.520935
1.400000 1.662970 -0.901983 -0.254147 1.778117 -1.129076 0.544104
1.433333 1.723183 -0.942493 -0.255978 1.771268 -1.116291 0.577206
1.466667 1.784884 -0.982423 -0.232066 1.759967 -1.096816 0.620560
1.500000 1.847475 -1.020555 -0.200000 1.743071 -1.071122 0.668024
1.533333 1.907023 -1.056227 -0.182353 1.720302 -1.040207 0.716731
1.566667 1.963002 -1.088510 -0.143969 1.691737 -1.005014 0.761761
1.600000 2.018497 -1.120310 -0.120528 1.657227 -0.966111 0.802714
1.633333 2.073468 -1.151604 -0.090444 1.615745 -0.923568 0.837692
1.666667 2.127875 -1.182372 -0.057955 1.568195 -0.878607 0.863800
1.700000 2.181671 -1.212591 -0.038660 1.515059 -0.831812 0.881806
1.733333 2.234820 -1.242240 0.000161 1.456115 -0.783132 0.888854
1.766667 2.287276 -1.271299 0.018298 1.390190 -0.731805 0.890939
1.800000 2.330000 -1.291976 0.059976 1.316865 -0.677726 0.886221
1.833333 2.371875 -1.312114 0.095140 1.236454 -0.621289 0.875563
1.866667 2.412871 -1.331704 0.130950 1.148395 -0.562252 0.858547
1.900000 2.452959 -1.350735 0.149638 1.053172 -0.501232 0.835268
1.933333 2.492116 -1.369199 0.186198 0.951511 -0.439011 0.803659
1.966667 2.522309 -1.382489 0.207979 0.845952 -0.377464 0.751339
2.000000 2.551479 -1.395274 0.238199 0.737564 -0.317150 0.672960
2.033333 2.571967 -1.402632 0.257180 0.629243 -0.259017 0.568819
2.066667 2.591370 -1.409557 0.271241 0.523902 -0.203989 0.439312
2.100000 2.604530 -1.413210 0.297772 0.424544 -0.152956 0.279345
2.133333 2.616587 -1.416489 0.337473 0.334164 -0.106794 0.095805
2.166667 2.620435 -1.416768 0.346444 0.254848 -0.065588 -0.092987
2.200000 2.623181 -1.416762 0.354923 0.189428 -0.030096 -0.275114
2.233333 2.623181 -1.415471 0.371009 0.137611 -0.000322 -0.448094
2.266667 2.622124 -1.413936 0.315112 0.099182 0.023631 -0.599947
2.300000 2.620071 -1.412174 0.224774 0.072897 0.042221 -0.712327
2.333333 2.617100 -1.410197 0.173761 0.057307 0.055834 -0.777921
2.366667 2.621043 -1.407241 0.152221 0.049311 0.064870 -0.803516
2.400000 2.624152 -1.404029 0.118646 0.045953 0.069811 -0.790342
2.433333 2.626463 -1.400574 0.079145 0.045569 0.071172 -0.733607
2.466667 2.627804 -1.397091 0.041355 0.046313 0.069618 -0.646233
2.500000 2.631457 -1.393706 0.037531 0.046497 0.065588 -0.547530
