t x y theta dxdt dydt dthetadt
0.000000 0.000000 0.000000 0.326633 0.004524 -0.001140 -0.002670
0.033333 -0.000034 0.000081 0.313935 0.007342 -0.002168 0.002578
0.066667 -0.000003 0.000259 0.311834 0.011678 -0.003507 0.014936
0.100000 -0.000077 0.000104 0.314823 0.018353 -0.005142 0.034503
0.133333 0.000289 0.000126 0.317576 0.028184 -0.006979 0.061538
0.166667 0.000937 0.000216 0.307318 0.041965 -0.008898 0.099267
0.200000 0.001747 0.000156 0.317460 0.060345 -0.010882 0.145716
0.233333 0.002429 -0.000281 0.314646 0.084032 -0.012785 0.198262
0.266667 0.002976 -0.001108 0.325157 0.113210 -0.014534 0.250305
0.300000 0.005248 -0.002091 0.322688 0.147256 -0.016265 0.300190
0.333333 0.009657 -0.002875 0.333021 0.185213 -0.018292 0.343492
0.366667 0.013906 -0.004079 0.347927 0.225663 -0.020949 0.377252
0.400000 0.021403 -0.004726 0.386843 0.266671 -0.024603 0.400455
0.433333 0.032595 -0.004684 0.405749 0.305961 -0.029767 0.412472
0.466667 0.043583 -0.005094 0.434247 0.340759 -0.037164 0.417565
0.500000 0.058481 -0.005493 0.434417 0.368586 -0.047424 0.419534
0.533333 0.075942 -0.006151 0.443371 0.387481 -0.060824 0.423741
0.566667 0.093132 -0.007293 0.464953 0.395804 -0.077634 0.432643
0.600000 0.110028 -0.008936 0.468746 0.392387 -0.098031 0.449300
0.633333 0.126603 -0.011092 0.476409 0.376489 -0.122165 0.473397
0.666667 0.140381 -0.015658 0.476886 0.349131 -0.149512 0.506139
0.700000 0.153796 -0.020768 0.485737 0.311798 -0.179564 0.536245
0.733333 0.166825 -0.026432 0.505600 0.265987 -0.212041 0.554777
0.766667 0.179447 -0.032662 0.538134 0.213143 -0.246685 0.552114
0.800000 0.182376 -0.042565 0.563330 0.155730 -0.282937 0.518575
0.833333 0.184869 -0.053065 0.613437 0.096358 -0.320003 0.447615
0.866667 0.186915 -0.064169 0.641284 0.036268 -0.357759 0.328186
0.900000 0.188501 -0.075885 0.669823 -0.023687 -0.396050 0.164214
0.933333 0.185794 -0.089088 0.673405 -0.082426 -0.434546 -0.037187
0.966667 0.179831 -0.104885 0.680151 -0.138515 -0.472699 -0.264301
1.000000 0.173392 -0.121317 0.695209 -0.192167 -0.510502 -0.504085
1.033333 0.165524 -0.139373 0.658413 -0.243926 -0.548118 -0.739731
1.066667 0.156309 -0.158797 0.618682 -0.293683 -0.585287 -0.950746
1.100000 0.145893 -0.179151 0.555732 -0.341007 -0.621682 -1.120070
1.133333 0.133667 -0.200467 0.483373 -0.386070 -0.657158 -1.237503
1.166667 0.120963 -0.222430 0.439482 -0.429687 -0.692190 -1.296597
1.200000 0.105520 -0.246305 0.367221 -0.471826 -0.726917 -1.291928
1.233333 0.087189 -0.271949 0.301637 -0.512061 -0.761363 -1.226443
1.266667 0.068395 -0.298240 0.252521 -0.550298 -0.795779 -1.107121
1.300000 0.049147 -0.325176 0.201900 -0.586574 -0.830653 -0.945107
1.333333 0.029450 -0.352751 0.178611 -0.620828 -0.866454 -0.751599
1.366667 0.007205 -0.382076 0.156416 -0.652355 -0.902854 -0.537167
1.400000 -0.015468 -0.412033 0.147798 -0.680829 -0.939737 -0.315832
1.433333 -0.039270 -0.443396 0.146977 -0.706369 -0.977115 -0.099110
1.466667 -0.063476 -0.475378 0.151211 -0.728996 -1.015222 0.104286
1.500000 -0.089508 -0.511194 0.165443 -0.748769 -1.053605 0.284827
1.533333 -0.115915 -0.547613 0.179154 -0.765640 -1.091787 0.436818
1.566667 -0.142684 -0.584623 0.201381 -0.780033 -1.129741 0.555694
1.600000 -0.169802 -0.622211 0.230867 -0.792189 -1.167341 0.639288
1.633333 -0.196329 -0.663099 0.264881 -0.802293 -1.204234 0.688090
1.666667 -0.223174 -0.704538 0.313092 -0.810595 -1.239411 0.700848
1.700000 -0.250324 -0.746510 0.337680 -0.817509 -1.272628 0.683772
1.733333 -0.277765 -0.789001 0.371105 -0.823449 -1.303645 0.639774
1.766667 -0.305483 -0.831994 0.393103 -0.828656 -1.332129 0.574630
1.800000 -0.333144 -0.878821 0.418863 -0.833449 -1.357504 0.493545
1.833333 -0.361050 -0.926113 0.425912 -0.838032 -1.379644 0.403262
1.866667 -0.389189 -0.973849 0.437670 -0.842578 -1.398871 0.312539
1.900000 -0.417546 -1.022010 0.440571 -0.847141 -1.415159 0.225103
1.933333 -0.446108 -1.070575 0.442167 -0.851772 -1.428485 0.148100
1.966667 -0.474267 -1.119150 0.439876 -0.856566 -1.438837 0.082912
2.000000 -0.502686 -1.166858 0.437527 -0.861603 -1.447184 0.034742
2.033333 -0.531271 -1.214908 0.437637 -0.866989 -1.454240 0.003064
2.066667 -0.560008 -1.263280 0.430584 -0.872820 -1.460706 -0.011694
2.100000 -0.588881 -1.311953 0.436461 -0.879140 -1.467424 -0.011231
2.133333 -0.618484 -1.361253 0.426874 -0.885883 -1.475222 0.002496
2.166667 -0.648194 -1.410814 0.419401 -0.892808 -1.484868 0.028976
2.200000 -0.678107 -1.460086 0.413607 -0.899457 -1.495966 0.063530
2.233333 -0.708092 -1.508616 0.419458 -0.905374 -1.508195 0.103753
2.266667 -0.738144 -1.557349 0.427797 -0.910026 -1.521105 0.144186
2.300000 -0.768151 -1.605989 0.429196 -0.912982 -1.534224 0.182976
2.333333 -0.799978 -1.659307 0.446460 -0.913807 -1.546588 0.213275
2.366667 -0.831819 -1.712768 0.447525 -0.912288 -1.557328 0.232040
2.400000 -0.863657 -1.766347 0.461060 -0.908414 -1.565993 0.233528
2.433333 -0.894911 -1.819791 0.476926 -0.902223 -1.571994 0.216809
2.466667 -0.925378 -1.873480 0.497831 -0.893993 -1.574900 0.180941
2.500000 -0.954743 -1.926714 0.507713 -0.884012 -1.574120 0.126079
2.533333 -0.984044 -1.979968 0.520348 -0.873017 -1.570221 0.057814
2.566667 -1.013265 -2.033219 0.513786 -0.861656 -1.563736 -0.022462
2.600000 -1.041339 -2.085414 0.515324 -0.850629 -1.555282 -0.104111
2.633333 -1.069308 -2.137558 0.511521 -0.840512 -1.545513 -0.181808
2.666667 -1.096169 -2.187944 0.500856 -0.831756 -1.535207 -0.245225
2.700000 -1.122902 -2.238234 0.496416 -0.824484 -1.525017 -0.290494
2.733333 -1.149977 -2.288767 0.458298 -0.818269 -1.514753 -0.312067
2.766667 -1.176900 -2.339164 0.437194 -0.812685 -1.504221 -0.305961
2.800000 -1.203658 -2.389405 0.412635 -0.806949 -1.492969 -0.269997
2.833333 -1.230019 -2.437780 0.403963 -0.800399 -1.480720 -0.205320
2.866667 -1.257357 -2.487598 0.397347 -0.792168 -1.466690 -0.120012
2.900000 -1.284494 -2.537201 0.379121 -0.781624 -1.450444 -0.013304
2.933333 -1.312042 -2.586749 0.386581 -0.768433 -1.431777 0.104220
2.966667 -1.339046 -2.635924 0.385157 -0.752152 -1.410428 0.231246
3.000000 -1.365854 -2.685282 0.414294 -0.732568 -1.386231 0.353889
3.033333 -1.390104 -2.730188 0.424364 -0.709438 -1.358757 0.468619
3.066667 -1.413104 -2.774491 0.442263 -0.682884 -1.328058 0.574490
3.100000 -1.435838 -2.818465 0.451115 -0.653273 -1.294332 0.663965
3.133333 -1.456929 -2.861001 0.516204 -0.621069 -1.257848 0.736157
3.166667 -1.477739 -2.903177 0.535528 -0.586958 -1.218996 0.783870
3.200000 -1.498260 -2.944981 0.556988 -0.551662 -1.178159 0.812289
3.233333 -1.515884 -2.983453 0.595564 -0.515971 -1.135764 0.819936
3.266667 -1.533210 -3.021525 0.607320 -0.480411 -1.092055 0.808375
3.300000 -1.548607 -3.058355 0.661673 -0.445439 -1.047045 0.775534
3.333333 -1.562069 -3.092955 0.697587 -0.411447 -1.000693 0.727401
3.366667 -1.573250 -3.123302 0.718896 -0.378881 -0.953219 0.665056
3.400000 -1.584136 -3.153214 0.741805 -0.348410 -0.905268 0.586969
3.433333 -1.594728 -3.182690 0.759297 -0.320617 -0.857622 0.493602
3.466667 -1.605028 -3.211728 0.766327 -0.296217 -0.811119 0.382601
3.500000 -1.615038 -3.240326 0.780879 -0.275628 -0.766570 0.262041
3.533333 -1.623201 -3.264910 0.788491 -0.259075 -0.724889 0.133437
3.566667 -1.629708 -3.285586 0.803785 -0.246689 -0.686654 0.002249
3.600000 -1.635944 -3.305826 0.816279 -0.238232 -0.652190 -0.125222
3.633333 -1.642059 -3.324937 0.806223 -0.233361 -0.621789 -0.243033
3.666667 -1.648859 -3.343528 0.793599 -0.231549 -0.595877 -0.345460
3.700000 -1.655403 -3.361704 0.762525 -0.232506 -0.575028 -0.430425
3.733333 -1.662940 -3.379671 0.732624 -0.235915 -0.559585 -0.495186
3.766667 -1.671364 -3.397519 0.697848 -0.241131 -0.549803 -0.536015
3.800000 -1.680192 -3.415308 0.673092 -0.247615 -0.545753 -0.551201
3.833333 -1.688773 -3.432718 0.647096 -0.255051 -0.547713 -0.539775
3.866667 -1.697111 -3.449755 0.633855 -0.263317 -0.555593 -0.501279
3.900000 -1.706728 -3.466579 0.614685 -0.271983 -0.569000 -0.436956
3.933333 -1.715753 -3.484070 0.611023 -0.280799 -0.587650 -0.352774
3.966667 -1.724534 -3.501211 0.591017 -0.289742 -0.611454 -0.253169
4.000000 -1.733167 -3.520257 0.582778 -0.298865 -0.640268 -0.143727
4.033333 -1.742649 -3.540663 0.559961 -0.307902 -0.673239 -0.030329
4.066667 -1.753390 -3.563654 0.569787 -0.316335 -0.709699 0.081026
4.100000 -1.764935 -3.589050 0.563200 -0.323905 -0.748913 0.184625
4.133333 -1.776217 -3.614108 0.579469 -0.330188 -0.789829 0.278694
4.166667 -1.788513 -3.642566 0.597489 -0.334424 -0.830778 0.357322
4.200000 -1.800535 -3.670676 0.630282 -0.335824 -0.870439 0.415729
4.233333 -1.812278 -3.698430 0.653264 -0.333621 -0.908120 0.451976
4.266667 -1.824534 -3.730104 0.678296 -0.327350 -0.942783 0.467348
4.300000 -1.836198 -3.765120 0.695898 -0.316434 -0.973438 0.464449
4.333333 -1.847560 -3.799745 0.718829 -0.300394 -0.999371 0.444993
4.366667 -1.858615 -3.833963 0.723429 -0.279364 -1.020397 0.415988
4.400000 -1.868687 -3.870628 0.748936 -0.253532 -1.035913 0.383762
4.433333 -1.878440 -3.906851 0.749866 -0.223532 -1.045106 0.354915
4.466667 -1.887872 -3.942611 0.762484 -0.189932 -1.047960 0.328471
4.500000 -1.893723 -3.979252 0.756608 -0.153874 -1.044675 0.305284
4.533333 -1.899247 -4.015388 0.753347 -0.116488 -1.035524 0.288384
4.566667 -1.901235 -4.051427 0.763899 -0.079101 -1.020773 0.276054
4.600000 -1.902898 -4.086915 0.789653 -0.042927 -1.001173 0.269050
4.633333 -1.901910 -4.120777 0.811416 -0.009104 -0.977605 0.260628
4.666667 -1.900608 -4.154047 0.818890 0.020921 -0.950043 0.256409
4.700000 -1.897495 -4.184557 0.822196 0.045971 -0.918714 0.256028
4.733333 -1.894084 -4.214436 0.820370 0.064846 -0.883714 0.257511
4.766667 -1.890383 -4.243670 0.848205 0.077124 -0.845322 0.258726
4.800000 -1.886091 -4.273189 0.834889 0.081880 -0.803331 0.258964
4.833333 -1.882147 -4.299095 0.840073 0.078182 -0.757521 0.263241
4.866667 -1.877756 -4.325106 0.845887 0.065465 -0.708402 0.267041
4.900000 -1.873770 -4.348726 0.857169 0.043722 -0.656380 0.267440
4.933333 -1.869534 -4.371628 0.873357 0.012972 -0.601934 0.260484
4.966667 -1.865054 -4.393801 0.880443 -0.027222 -0.545308 0.247454
5.000000 -1.864265 -4.410469 0.902777 -0.076282 -0.487511 0.222596
5.033333 -1.868322 -4.423369 0.919676 -0.132582 -0.429585 0.179996
5.066667 -1.872152 -4.435532 0.927748 -0.194170 -0.372460 0.117623
5.100000 -1.875752 -4.446954 0.932763 -0.259190 -0.316787 0.037282
5.133333 -1.884216 -4.455635 0.919140 -0.325407 -0.263311 -0.055828
5.166667 -1.897939 -4.462479 0.928252 -0.389828 -0.212978 -0.160607
5.200000 -1.915089 -4.467669 0.935537 -0.449687 -0.166053 -0.268638
5.233333 -1.935309 -4.471685 0.927848 -0.502986 -0.122466 -0.372091
5.266667 -1.955243 -4.474993 0.907314 -0.547744 -0.081970 -0.462746
5.300000 -1.976576 -4.476929 0.883403 -0.582071 -0.044470 -0.534984
5.333333 -2.000284 -4.476587 0.845642 -0.604064 -0.009742 -0.586053
5.366667 -2.023639 -4.475560 0.814088 -0.612920 0.022691 -0.612916
5.400000 -2.046616 -4.473858 0.785896 -0.608065 0.053348 -0.618235
5.433333 -2.069190 -4.471488 0.761029 -0.589039 0.082554 -0.606342
5.466667 -2.091928 -4.467630 0.726434 -0.555968 0.110510 -0.584949
5.500000 -2.114061 -4.463165 0.709603 -0.509018 0.137466 -0.562805
5.533333 -2.134258 -4.458352 0.697977 -0.449428 0.163725 -0.546978
5.566667 -2.151430 -4.452745 0.683434 -0.377991 0.189432 -0.540991
5.600000 -2.164349 -4.446175 0.687541 -0.296324 0.214386 -0.543775
5.633333 -2.176730 -4.438987 0.690255 -0.206476 0.238352 -0.549031
5.666667 -2.182004 -4.430471 0.680300 -0.110741 0.261274 -0.548543
5.700000 -2.186715 -4.421352 0.664311 -0.011753 0.283222 -0.531348
5.733333 -2.184402 -4.410414 0.626426 0.087873 0.304077 -0.485431
5.766667 -2.176060 -4.398828 0.584345 0.185037 0.323928 -0.406749
5.800000 -2.167149 -4.386663 0.542732 0.277506 0.343038 -0.289752
5.833333 -2.154376 -4.374750 0.504057 0.363091 0.362021 -0.138599
5.866667 -2.138302 -4.362487 0.484202 0.440192 0.381700 0.039560
5.900000 -2.119297 -4.350278 0.484434 0.507154 0.403198 0.233585
5.933333 -2.097992 -4.337631 0.500917 0.563248 0.428110 0.425430
5.966667 -2.076167 -4.324461 0.551633 0.608762 0.457795 0.600867
6.000000 -2.052711 -4.309889 0.601597 0.643730 0.493494 0.740911
6.033333 -2.028145 -4.294147 0.646858 0.668917 0.535952 0.835161
6.066667 -2.003113 -4.277922 0.708872 0.685387 0.585303 0.876807
6.100000 -1.978265 -4.260144 0.729311 0.694658 0.640849 0.867132
6.133333 -1.952988 -4.241915 0.788728 0.698245 0.701249 0.811039
6.166667 -1.928988 -4.219877 0.813374 0.697121 0.764896 0.722926
6.200000 -1.906297 -4.193939 0.834566 0.692502 0.830160 0.614953
6.233333 -1.883524 -4.162464 0.845478 0.685444 0.894915 0.499738
6.266667 -1.861774 -4.127535 0.853410 0.676749 0.957088 0.390497
6.300000 -1.839690 -4.092289 0.843681 0.666971 1.014741 0.292788
6.333333 -1.817286 -4.056758 0.855490 0.656402 1.066210 0.214610
6.366667 -1.795296 -4.017830 0.854585 0.645480 1.110273 0.152293
6.400000 -1.773017 -3.978690 0.857053 0.634486 1.145394 0.106694
6.433333 -1.751665 -3.937391 0.853005 0.623885 1.170473 0.071128
6.466667 -1.730051 -3.895956 0.854244 0.613915 1.184940 0.033377
6.500000 -1.710365 -3.855250 0.868274 0.605205 1.188771 -0.021122
6.533333 -1.691544 -3.813034 0.858030 0.598509 1.181034 -0.108498
6.566667 -1.672492 -3.770806 0.864703 0.594418 1.160987 -0.246165
6.600000 -1.653216 -3.728603 0.871109 0.593303 1.128292 -0.452557
6.633333 -1.635271 -3.688826 0.868399 0.594728 1.083103 -0.737002
6.666667 -1.617116 -3.649153 0.868407 0.597994 1.024785 -1.097691
6.700000 -1.598758 -3.609620 0.862675 0.601909 0.952384 -1.516537
6.733333 -1.579808 -3.577318 0.850698 0.604998 0.867384 -1.965731
6.766667 -1.557728 -3.550885 0.804125 0.605498 0.771016 -2.403058
6.800000 -1.535457 -3.524675 0.715240 0.602140 0.664832 -2.781405
6.833333 -1.513004 -3.498710 0.593036 0.594405 0.550287 -3.050825
6.866667 -1.489976 -3.482591 0.423825 0.582489 0.430720 -3.171254
6.900000 -1.466778 -3.466748 0.222499 0.566773 0.309546 -3.114572
6.933333 -1.445840 -3.458527 0.010226 0.548026 0.188698 -2.868272
6.966667 -1.427957 -3.457406 -0.185228 0.528347 0.071005 -2.434348
7.000000 -1.414392 -3.463063 -0.342211 0.509894 -0.040131 -1.833758
7.033333 -1.400659 -3.469005 -0.410412 0.494842 -0.140912 -1.110020
7.066667 -1.386763 -3.475219 -0.394798 0.485055 -0.229684 -0.307769
7.100000 -1.373902 -3.487405 -0.345978 0.483029 -0.304030 0.519138
7.133333 -1.360217 -3.503673 -0.292408 0.490762 -0.361858 1.317686
7.166667 -1.344835 -3.522718 -0.158212 0.508491 -0.402663 2.031208
7.200000 -1.329282 -3.541951 -0.070519 0.536046 -0.427122 2.631727
7.233333 -1.313561 -3.561345 0.076906 0.572720 -0.436676 3.104197
7.266667 -1.297675 -3.580872 0.228845 0.617905 -0.431833 3.440574
7.300000 -1.277204 -3.596628 0.408263 0.669334 -0.414989 3.639402
7.333333 -1.256586 -3.612461 0.503370 0.725317 -0.388573 3.715073
7.366667 -1.230815 -3.624179 0.618493 0.784634 -0.354910 3.695785
7.400000 -1.204923 -3.635925 0.769287 0.845851 -0.316265 3.585278
7.433333 -1.172421 -3.644094 0.931796 0.907116 -0.275062 3.396680
7.466667 -1.139838 -3.652247 1.050016 0.966289 -0.234026 3.144247
7.500000 -1.107194 -3.660369 1.158562 1.022618 -0.194466 2.852944
7.533333 -1.070999 -3.665602 1.272248 1.074237 -0.157123 2.530410
7.566667 -1.032624 -3.668815 1.349380 1.119812 -0.121992 2.185860
7.600000 -0.992552 -3.670155 1.418241 1.157950 -0.088510 1.840459
7.633333 -0.952526 -3.671406 1.458821 1.188404 -0.055608 1.512170
7.666667 -0.909351 -3.672402 1.491707 1.210730 -0.021697 1.210970
7.700000 -0.866281 -3.673287 1.519043 1.224120 0.014486 0.933573
7.733333 -0.823349 -3.674054 1.514615 1.229096 0.053668 0.686361
7.766667 -0.779835 -3.673155 1.510755 1.226042 0.096599 0.463563
7.800000 -0.736523 -3.672120 1.498696 1.216055 0.143407 0.262035
7.833333 -0.693444 -3.670945 1.515472 1.199653 0.194029 0.068221
7.866667 -0.653433 -3.663511 1.531713 1.178058 0.247032 -0.126994
7.900000 -0.613724 -3.655933 1.569523 1.152016 0.300778 -0.324800
7.933333 -0.576931 -3.642541 1.555917 1.121964 0.353430 -0.528394
7.966667 -0.540500 -3.629015 1.549609 1.088346 0.402903 -0.733678
8.000000 -0.505383 -3.610764 1.524726 1.051344 0.446992 -0.937113
8.033333 -0.470682 -3.592398 1.467960 1.011365 0.483539 -1.119883
8.066667 -0.436421 -3.573928 1.407414 0.968457 0.512015 -1.262103
8.100000 -0.402941 -3.553310 1.343462 0.922769 0.531889 -1.346937
8.133333 -0.370040 -3.532235 1.283966 0.874029 0.543556 -1.361534
8.166667 -0.338967 -3.511336 1.210645 0.821496 0.547331 -1.298878
8.200000 -0.311114 -3.491795 1.132271 0.764497 0.544456 -1.161238
8.233333 -0.289655 -3.474658 1.079355 0.702497 0.536372 -0.969442
8.266667 -0.268750 -3.457508 1.012589 0.634804 0.523890 -0.746410
8.300000 -0.248411 -3.440355 0.974602 0.561999 0.508453 -0.517320
8.333333 -0.228650 -3.423210 0.979773 0.484865 0.491096 -0.308991
8.366667 -0.209474 -3.406084 1.015508 0.404895 0.473136 -0.144863
8.400000 -0.190896 -3.388986 1.062108 0.323190 0.455270 -0.043233
8.433333 -0.183764 -3.374860 1.102838 0.241273 0.438009 -0.008145
8.466667 -0.177232 -3.360795 1.147362 0.161004 0.421885 -0.043630
8.500000 -0.177189 -3.348550 1.154951 0.083903 0.407143 -0.145059
8.533333 -0.177733 -3.336386 1.156912 0.011454 0.393993 -0.296204
8.566667 -0.181727 -3.324135 1.129143 -0.054862 0.382498 -0.476193
8.600000 -0.188328 -3.312116 1.096259 -0.113129 0.372850 -0.662542
8.633333 -0.195478 -3.300202 1.056206 -0.163023 0.364975 -0.836333
8.666667 -0.203162 -3.288396 1.000770 -0.204398 0.358780 -0.978293
8.700000 -0.212038 -3.276414 0.948705 -0.238135 0.353900 -1.077962
8.733333 -0.221677 -3.264584 0.906373 -0.265021 0.349970 -1.133995
8.766667 -0.231672 -3.252878 0.856368 -0.286462 0.346597 -1.148928
8.800000 -0.242135 -3.241305 0.813125 -0.304236 0.343193 -1.128640
8.833333 -0.252483 -3.230115 0.767447 -0.319335 0.339295 -1.080013
8.866667 -0.263750 -3.219084 0.738937 -0.332713 0.334445 -1.009873
8.900000 -0.275023 -3.207735 0.705086 -0.344875 0.328269 -0.921839
8.933333 -0.286693 -3.196539 0.683839 -0.356223 0.320435 -0.817340
8.966667 -0.298743 -3.185502 0.664164 -0.366864 0.310639 -0.702768
9.000000 -0.311154 -3.174629 0.630609 -0.376386 0.299264 -0.581733
9.033333 -0.323907 -3.163926 0.599575 -0.384123 0.286917 -0.458301
9.066667 -0.336984 -3.153398 0.573056 -0.389492 0.274205 -0.337320
9.100000 -0.350367 -3.143051 0.568263 -0.391657 0.262257 -0.226663
9.133333 -0.364072 -3.134944 0.566680 -0.390046 0.252656 -0.133673
9.166667 -0.379009 -3.128609 0.569886 -0.384021 0.247115 -0.060400
9.200000 -0.394188 -3.122464 0.591021 -0.373643 0.246508 -0.011549
9.233333 -0.408864 -3.117119 0.609056 -0.359439 0.251596 0.008734
9.266667 -0.421520 -3.111359 0.632751 -0.342621 0.262615 -0.001066
9.300000 -0.434362 -3.105788 0.632901 -0.324884 0.278963 -0.036831
9.333333 -0.443236 -3.096438 0.627690 -0.308263 0.298655 -0.093712
9.366667 -0.452269 -3.087278 0.625252 -0.294952 0.319432 -0.168410
9.400000 -0.461450 -3.078312 0.617983 -0.286795 0.339363 -0.253970
9.433333 -0.467744 -3.065128 0.601439 -0.285214 0.356145 -0.339398
9.466667 -0.473101 -3.047604 0.585821 -0.290265 0.368139 -0.414641
9.500000 -0.478582 -3.030299 0.558855 -0.301741 0.374077 -0.470568
9.533333 -0.484180 -3.013225 0.538560 -0.318650 0.373912 -0.500899
9.566667 -0.493143 -2.996984 0.515161 -0.339787 0.367198 -0.496358
9.600000 -0.508656 -2.986650 0.509525 -0.363394 0.353657 -0.451570
9.633333 -0.524237 -2.976594 0.483699 -0.387396 0.333571 -0.367346
9.666667 -0.539865 -2.966825 0.463669 -0.410062 0.307363 -0.248106
9.700000 -0.555523 -2.957348 0.420658 -0.429330 0.275394 -0.100132
9.733333 -0.571192 -2.948170 0.385627 -0.443484 0.237703 0.072786
9.766667 -0.586851 -2.939298 0.389556 -0.451063 0.195407 0.262413
9.800000 -0.602484 -2.930738 0.416663 -0.451707 0.149317 0.462766
9.833333 -0.618070 -2.922496 0.459073 -0.444913 0.100377 0.666640
9.866667 -0.633592 -2.914580 0.498531 -0.430673 0.049365 0.867418
9.900000 -0.650814 -2.914019 0.535454 -0.408969 -0.002170 1.057151
9.933333 -0.667798 -2.917526 0.580247 -0.379805 -0.052368 1.223686
9.966667 -0.682905 -2.923609 0.627067 -0.343214 -0.099719 1.359810
10.000000 -0.695468 -2.931260 0.668760 -0.298558 -0.142576 1.456021
10.033333 -0.703843 -2.940072 0.715109 -0.246588 -0.179808 1.506585
10.066667 -0.712031 -2.949169 0.768915 -0.187753 -0.210582 1.511415
10.100000 -0.720024 -2.958539 0.835246 -0.123545 -0.235395 1.468483
10.133333 -0.727811 -2.968171 0.919166 -0.055433 -0.255493 1.380792
10.166667 -0.727044 -2.976558 0.999951 0.014694 -0.272664 1.247911
10.200000 -0.726061 -2.985174 1.040720 0.084604 -0.288541 1.079766
10.233333 -0.718404 -2.993550 1.091594 0.152495 -0.304526 0.885599
10.266667 -0.710537 -3.002127 1.108481 0.216343 -0.321640 0.675307
10.300000 -0.702465 -3.010894 1.133218 0.274816 -0.340286 0.464206
10.333333 -0.690193 -3.021322 1.124092 0.326221 -0.360189 0.270922
10.366667 -0.675356 -3.033670 1.105731 0.369950 -0.380421 0.114842
10.400000 -0.658976 -3.048441 1.099395 0.405389 -0.399801 -0.000546
10.433333 -0.642429 -3.063340 1.079935 0.432873 -0.417149 -0.068202
10.466667 -0.625590 -3.079793 1.055243 0.452684 -0.431163 -0.091733
10.500000 -0.608803 -3.096763 1.024276 0.464986 -0.440367 -0.077538
10.533333 -0.592797 -3.112337 1.025704 0.470702 -0.443782 -0.043190
10.566667 -0.576683 -3.127969 1.019707 0.470446 -0.440884 -0.003986
10.600000 -0.560474 -3.143643 1.033748 0.465196 -0.431685 0.034196
10.633333 -0.544185 -3.159340 1.056756 0.455395 -0.416242 0.059948
10.666667 -0.527832 -3.175046 1.081811 0.441650 -0.394850 0.071539
10.700000 -0.511429 -3.190742 1.094665 0.424564 -0.367734 0.066531
10.733333 -0.497193 -3.202485 1.102352 0.404448 -0.335084 0.050877
10.766667 -0.482940 -3.214193 1.118315 0.381414 -0.296948 0.023784
10.800000 -0.470592 -3.223544 1.104792 0.355614 -0.253470 -0.016905
10.833333 -0.459949 -3.231145 1.079377 0.327346 -0.204943 -0.068347
10.866667 -0.449326 -3.238684 1.046905 0.297008 -0.151892 -0.131520
10.900000 -0.438732 -3.246154 1.031529 0.265388 -0.095526 -0.205796
10.933333 -0.430107 -3.248964 1.042401 0.232977 -0.036897 -0.292955
10.966667 -0.421532 -3.251697 1.056254 0.200271 0.022941 -0.387907
11.000000 -0.415239 -3.249639 1.085704 0.167768 0.082611 -0.485329
11.033333 -0.412076 -3.242372 1.082144 0.135749 0.140406 -0.582628
11.066667 -0.408988 -3.235044 1.059274 0.104510 0.194530 -0.674097
11.100000 -0.405977 -3.227660 1.015775 0.074095 0.243617 -0.752715
11.133333 -0.404824 -3.216049 0.955968 0.045008 0.285854 -0.807251
11.166667 -0.403754 -3.204407 0.910977 0.017757 0.319435 -0.832412
11.200000 -0.403973 -3.189830 0.864350 -0.007413 0.343261 -0.827357
11.233333 -0.404275 -3.175254 0.818163 -0.029796 0.356688 -0.793783
11.266667 -0.406649 -3.160578 0.780449 -0.048626 0.359319 -0.741161
11.300000 -0.409101 -3.145939 0.745824 -0.063138 0.350767 -0.679873
11.333333 -0.411628 -3.131351 0.749775 -0.073115 0.332029 -0.630507
11.366667 -0.416537 -3.119033 0.747312 -0.078026 0.303963 -0.604449
11.400000 -0.421509 -3.106800 0.760249 -0.077246 0.267350 -0.607925
11.433333 -0.426536 -3.094667 0.755762 -0.070822 0.223517 -0.641007
11.466667 -0.430168 -3.088924 0.764132 -0.059261 0.174341 -0.695088
11.500000 -0.433836 -3.083301 0.745146 -0.042990 0.121649 -0.761667
11.533333 -0.437536 -3.077804 0.703909 -0.022190 0.066453 -0.819511
11.566667 -0.435960 -3.080093 0.659138 0.001801 0.010892 -0.854007
11.600000 -0.434402 -3.082507 0.593519 0.027505 -0.042788 -0.847844
11.633333 -0.432864 -3.085046 0.543159 0.053569 -0.092719 -0.791625
11.666667 -0.431346 -3.087707 0.485003 0.079048 -0.137923 -0.680191
11.700000 -0.428346 -3.094526 0.446369 0.102741 -0.176884 -0.511696
11.733333 -0.423953 -3.103596 0.420893 0.123385 -0.207945 -0.293011
11.766667 -0.417716 -3.114325 0.417281 0.140940 -0.230937 -0.040566
11.800000 -0.411504 -3.125144 0.437299 0.155582 -0.245724 0.210140
11.833333 -0.404291 -3.136704 0.449856 0.167559 -0.252250 0.424703
11.866667 -0.397275 -3.147676 0.471021 0.177064 -0.250342 0.572236
11.900000 -0.391199 -3.156582 0.503259 0.184601 -0.241157 0.629419
11.933333 -0.385178 -3.165540 0.563151 0.190887 -0.226604 0.574958
11.966667 -0.379216 -3.174541 0.625896 0.196387 -0.208385 0.408000
12.000000 -0.373289 -3.181500 0.680855 0.201375 -0.188696 0.157363
12.033333 -0.366922 -3.187306 0.743174 0.206037 -0.170302 -0.141072
12.066667 -0.360298 -3.192173 0.822179 0.210406 -0.155769 -0.454759
12.100000 -0.353456 -3.195002 0.811585 0.214291 -0.146604 -0.754089
12.133333 -0.345569 -3.195941 0.695041 0.216443 -0.143762 -1.001555
12.166667 -0.337794 -3.196897 0.520099 0.214501 -0.147967 -1.167305
12.200000 -0.329494 -3.197838 0.385200 0.206154 -0.159438 -1.242254
12.233333 -0.321514 -3.201418 0.307965 0.189550 -0.177198 -1.225061
12.266667 -0.313131 -3.208411 0.258872 0.162923 -0.199875 -1.118281
12.300000 -0.304889 -3.215412 0.220427 0.124627 -0.226147 -0.932102
12.333333 -0.296796 -3.222417 0.222561 0.074831 -0.254421 -0.694809
12.366667 -0.291475 -3.233732 0.227342 0.015906 -0.282588 -0.439702
12.400000 -0.286315 -3.245037 0.271659 -0.049666 -0.308700 -0.193878
12.433333 -0.281321 -3.256321 0.296476 -0.119691 -0.331706 0.025511
12.466667 -0.285924 -3.268972 0.307575 -0.191283 -0.351114 0.209702
12.500000 -0.302536 -3.282531 0.295441 -0.260593 -0.366521 0.358025
12.533333 -0.319299 -3.296061 0.300490 -0.324318 -0.377515 0.479829
12.566667 -0.336198 -3.309550 0.311759 -0.380578 -0.384479 0.586410
12.600000 -0.353216 -3.322984 0.318688 -0.427559 -0.387800 0.691561
12.633333 -0.370340 -3.336350 0.338297 -0.463198 -0.387471 0.800620
12.666667 -0.387552 -3.349637 0.365274 -0.486440 -0.383175 0.915179
12.700000 -0.404838 -3.362831 0.397267 -0.497781 -0.374560 1.030766
12.733333 -0.422181 -3.375920 0.449137 -0.497845 -0.361683 1.143946
12.766667 -0.439566 -3.388891 0.502671 -0.487051 -0.344246 1.248605
12.800000 -0.458880 -3.402062 0.555346 -0.465075 -0.321838 1.335660
12.833333 -0.478202 -3.415092 0.615880 -0.432079 -0.294416 1.399579
12.866667 -0.493418 -3.424505 0.655153 -0.388077 -0.262462 1.436352
12.900000 -0.508617 -3.433751 0.693592 -0.332974 -0.226776 1.446715
12.933333 -0.523785 -3.442821 0.741201 -0.267479 -0.188223 1.432312
12.966667 -0.536047 -3.449544 0.793777 -0.192204 -0.147821 1.399985
13.000000 -0.544611 -3.453647 0.867008 -0.109358 -0.106950 1.355946
13.033333 -0.547898 -3.455194 0.932607 -0.021083 -0.066933 1.303008
13.066667 -0.544348 -3.454439 0.986872 0.070164 -0.028567 1.239546
13.100000 -0.540755 -3.453467 0.994162 0.162359 0.007544 1.166223
13.133333 -0.529956 -3.451212 1.011637 0.253615 0.040914 1.082338
13.166667 -0.519136 -3.448735 1.043017 0.341839 0.071352 0.987166
13.200000 -0.502498 -3.445048 1.085089 0.425530 0.098974 0.878621
13.233333 -0.485874 -3.441139 1.126919 0.503531 0.124132 0.759734
13.266667 -0.469286 -3.437012 1.164824 0.575268 0.147128 0.638199
13.300000 -0.448659 -3.432299 1.179823 0.639425 0.168176 0.516854
13.333333 -0.425326 -3.426490 1.216541 0.694765 0.187455 0.400092
13.366667 -0.398921 -3.419529 1.224612 0.739288 0.204765 0.295066
13.400000 -0.369786 -3.411333 1.218729 0.770657 0.219581 0.218246
13.433333 -0.340828 -3.402932 1.207137 0.786382 0.231257 0.184506
13.466667 -0.310064 -3.393981 1.194416 0.783428 0.238712 0.204464
13.500000 -0.279546 -3.384840 1.188159 0.760276 0.241049 0.287577
13.533333 -0.247249 -3.375376 1.167398 0.716403 0.237609 0.439476
13.566667 -0.215271 -3.365736 1.159678 0.653060 0.228196 0.650721
13.600000 -0.186255 -3.356196 1.166837 0.573033 0.213276 0.896533
13.633333 -0.162505 -3.347223 1.174716 0.479454 0.193498 1.143008
13.666667 -0.145842 -3.339068 1.213483 0.377062 0.170461 1.355463
13.700000 -0.136935 -3.332599 1.269671 0.270472 0.145979 1.499009
13.733333 -0.136411 -3.329085 1.372297 0.164515 0.122000 1.535758
13.766667 -0.136339 -3.325473 1.497603 0.063145 0.100247 1.445982
13.800000 -0.142712 -3.326102 1.610959 -0.030216 0.082501 1.218775
13.833333 -0.149538 -3.326642 1.722824 -0.112842 0.070298 0.859945
13.866667 -0.156816 -3.327091 1.803949 -0.183809 0.064477 0.386598
13.900000 -0.164544 -3.327446 1.816804 -0.243748 0.065445 -0.175900
13.933333 -0.174948 -3.327445 1.806455 -0.294669 0.073050 -0.781254
13.966667 -0.186766 -3.326021 1.730862 -0.338722 0.087100 -1.386599
14.000000 -0.199915 -3.323229 1.636301 -0.379045 0.106432 -1.945555
14.033333 -0.213457 -3.318611 1.517213 -0.418380 0.129709 -2.419446
14.066667 -0.227431 -3.313905 1.366877 -0.458779 0.155623 -2.778932
14.100000 -0.241828 -3.309116 1.248507 -0.501048 0.182826 -3.004919
14.133333 -0.257362 -3.302760 1.087452 -0.545789 0.210172 -3.100249
14.166667 -0.273732 -3.295176 0.965183 -0.593508 0.236537 -3.078806
14.200000 -0.292410 -3.286707 0.858823 -0.643974 0.261289 -2.961632
14.233333 -0.315242 -3.276208 0.707420 -0.696750 0.283951 -2.770358
14.266667 -0.339213 -3.265712 0.644792 -0.751282 0.304145 -2.533161
14.300000 -0.366065 -3.254271 0.575660 -0.807117 0.321586 -2.268967
14.333333 -0.395745 -3.241908 0.506320 -0.863230 0.335997 -1.991250
14.366667 -0.425747 -3.229539 0.466572 -0.918487 0.347069 -1.708014
14.400000 -0.457304 -3.217335 0.426671 -0.971842 0.354583 -1.420902
14.433333 -0.489136 -3.205150 0.384184 -1.022715 0.358654 -1.137653
14.466667 -0.524537 -3.192764 0.337430 -1.070359 0.359135 -0.852543
14.500000 -0.562591 -3.179815 0.305155 -1.114049 0.355797 -0.566250
14.533333 -0.602380 -3.166750 0.271125 -1.152840 0.348378 -0.284577
14.566667 -0.643344 -3.154616 0.252995 -1.185681 0.336841 -0.009339
14.600000 -0.684437 -3.142570 0.260575 -1.211704 0.321072 0.249023
14.633333 -0.725624 -3.130625 0.280356 -1.229819 0.300731 0.484394
14.666667 -0.769164 -3.119995 0.330220 -1.239491 0.276073 0.683506
14.700000 -0.813889 -3.110645 0.367945 -1.240190 0.247693 0.833240
14.733333 -0.858601 -3.101430 0.427771 -1.232330 0.216585 0.925885
14.766667 -0.903261 -3.092357 0.479622 -1.216191 0.183443 0.955274
14.800000 -0.946352 -3.086138 0.531522 -1.192077 0.149203 0.923485
14.833333 -0.986962 -3.082309 0.593076 -1.159982 0.114985 0.834898
14.866667 -1.023259 -3.081887 0.613504 -1.120234 0.081738 0.700059
14.900000 -1.059363 -3.081614 0.638546 -1.073948 0.050305 0.532566
14.933333 -1.095247 -3.081488 0.647955 -1.021319 0.021186 0.353374
14.966667 -1.130882 -3.081508 0.649774 -0.962815 -0.004909 0.175361
15.000000 -1.166241 -3.081674 0.667522 -0.898130 -0.027616 0.009016
15.033333 -1.195403 -3.083950 0.646548 -0.828101 -0.046784 -0.133344
15.066667 -1.224239 -3.086360 0.603555 -0.752689 -0.062707 -0.245074
15.100000 -1.247796 -3.089650 0.590286 -0.671681 -0.075687 -0.324643
15.133333 -1.270990 -3.093059 0.571048 -0.585777 -0.085921 -0.374946
15.166667 -1.287570 -3.096593 0.554910 -0.496433 -0.093594 -0.395595
15.200000 -1.303764 -3.100230 0.538976 -0.406047 -0.098844 -0.391500
15.233333 -1.319565 -3.103963 0.515983 -0.315775 -0.101895 -0.368058
15.266667 -1.329529 -3.108440 0.516756 -0.227564 -0.102632 -0.333196
15.300000 -1.333434 -3.112797 0.499711 -0.143218 -0.100976 -0.289083
15.333333 -1.330528 -3.115954 0.499190 -0.064622 -0.097011 -0.246104
15.366667 -1.327236 -3.119165 0.488632 0.007262 -0.091033 -0.211999
15.400000 -1.323570 -3.122426 0.484748 0.071501 -0.083305 -0.184742
15.433333 -1.319541 -3.125733 0.452482 0.126532 -0.074012 -0.167900
15.466667 -1.315161 -3.129081 0.484073 0.171445 -0.063502 -0.166512
15.500000 -1.306863 -3.131140 0.499952 0.205675 -0.052458 -0.183381
15.533333 -1.295189 -3.132804 0.459729 0.229483 -0.041389 -0.209466
15.566667 -1.284003 -3.133705 0.470471 0.242986 -0.030758 -0.242192
15.600000 -1.272406 -3.134471 0.490726 0.246556 -0.021003 -0.286184
15.633333 -1.263114 -3.133895 0.457661 0.241225 -0.012812 -0.337335
15.666667 -1.253581 -3.133341 0.442842 0.228060 -0.006720 -0.384448
15.700000 -1.243825 -3.132809 0.422284 0.208675 -0.002775 -0.418820
15.733333 -1.233864 -3.132299 0.412414 0.184652 -0.001023 -0.446569
15.766667 -1.227070 -3.131210 0.394386 0.157711 -0.001370 -0.462510
15.800000 -1.223010 -3.130478 0.365386 0.129842 -0.003665 -0.457760
15.833333 -1.222675 -3.130850 0.334553 0.102751 -0.007168 -0.436395
15.866667 -1.222185 -3.131255 0.323433 0.077882 -0.011236 -0.401478
15.900000 -1.221548 -3.131692 0.313039 0.056095 -0.015397 -0.359777
15.933333 -1.220770 -3.132160 0.290109 0.038020 -0.019278 -0.306051
15.966667 -1.220538 -3.133878 0.301069 0.023872 -0.022478 -0.247940
16.000000 -1.220414 -3.135297 0.279963 0.013389 -0.024671 -0.192455
16.033333 -1.220406 -3.136890 0.286425 0.005832 -0.025956 -0.139120
16.066667 -1.220469 -3.138131 0.275650 0.000500 -0.026420 -0.089220
16.100000 -1.220577 -3.138730 0.287562 -0.003428 -0.026242 -0.043455
16.133333 -1.220588 -3.139351 0.284773 -0.006791 -0.025575 -0.008964
16.166667 -1.220659 -3.139842 0.278852 -0.010544 -0.024908 0.020052
16.200000 -1.221326 -3.140545 0.278984 -0.015390 -0.024681 0.043293
16.233333 -1.221918 -3.141267 0.288134 -0.021703 -0.025219 0.058583
16.266667 -1.222439 -3.142006 0.297161 -0.029808 -0.026777 0.062704
16.300000 -1.222897 -3.142761 0.297492 -0.040019 -0.029506 0.055746
16.333333 -1.223215 -3.143274 0.287832 -0.052740 -0.033605 0.043086
16.366667 -1.223836 -3.143997 0.305809 -0.067843 -0.038943 0.019602
16.400000 -1.225212 -3.144893 0.308411 -0.085218 -0.045413 -0.011994
16.433333 -1.227898 -3.146106 0.323999 -0.104641 -0.052861 -0.048644
16.466667 -1.230548 -3.147332 0.300356 -0.125937 -0.061179 -0.082514
16.500000 -1.236530 -3.150104 0.312810 -0.148250 -0.070067 -0.112833
16.533333 -1.242479 -3.152888 0.306047 -0.170382 -0.079065 -0.138270
16.566667 -1.248397 -3.155680 0.287181 -0.191146 -0.087753 -0.153249
16.600000 -1.254284 -3.158476 0.273103 -0.209379 -0.095609 -0.158049
16.633333 -1.262447 -3.161999 0.262331 -0.223897 -0.102086 -0.149691
16.666667 -1.271579 -3.165823 0.243525 -0.233433 -0.106613 -0.131349
16.700000 -1.281802 -3.170506 0.247411 -0.237675 -0.108827 -0.100398
16.733333 -1.291986 -3.175183 0.257317 -0.236733 -0.108549 -0.062773
16.766667 -1.301998 -3.179571 0.242068 -0.231038 -0.105581 -0.022471
16.800000 -1.311965 -3.183941 0.252839 -0.221060 -0.099936 0.017042
16.833333 -1.320526 -3.188048 0.248654 -0.207670 -0.091878 0.053725
16.866667 -1.327075 -3.191314 0.260448 -0.192003 -0.081803 0.078349
16.900000 -1.332032 -3.194723 0.261915 -0.174995 -0.070241 0.090438
16.933333 -1.336322 -3.196732 0.266008 -0.157386 -0.057804 0.094651
16.966667 -1.339575 -3.197970 0.257310 -0.139887 -0.045280 0.092466
17.000000 -1.342792 -3.199161 0.292356 -0.123155 -0.033345 0.085760
17.033333 -1.346717 -3.199402 0.305575 -0.107575 -0.022534 0.071635
17.066667 -1.350614 -3.199593 0.290509 -0.093258 -0.013192 0.062336
17.100000 -1.354254 -3.198851 0.282058 -0.080079 -0.005660 0.053461
17.133333 -1.357874 -3.198060 0.280279 -0.067930 -0.000026 0.046869
17.166667 -1.359740 -3.197559 0.286575 -0.056669 0.003822 0.040239
17.200000 -1.360759 -3.197173 0.260924 -0.046226 0.006013 0.038114
17.233333 -1.361773 -3.196733 0.291971 -0.036594 0.006762 0.041442
17.266667 -1.361765 -3.196617 0.283487 -0.027947 0.006237 0.044096
17.300000 -1.361768 -3.196446 0.285772 -0.020415 0.004772 0.050205
17.333333 -1.361788 -3.196220 0.300085 -0.014049 0.002595 0.054216
17.366667 -1.361835 -3.195938 0.297407 -0.008694 -0.000181 0.054521
17.400000 -1.361916 -3.195601 0.300551 -0.004055 -0.003470 0.044015
17.433333 -1.362488 -3.195688 0.289090 0.000471 -0.007314 0.024822
17.466667 -1.362482 -3.196203 0.309433 0.005603 -0.011774 -0.003468
17.500000 -1.362534 -3.196660 0.303066 0.012164 -0.016903 -0.042249
17.533333 -1.362652 -3.197058 0.303005 0.020727 -0.022711 -0.086618
17.566667 -1.362535 -3.197592 0.303139 0.031919 -0.029203 -0.126329
17.600000 -1.362502 -3.198063 0.295013 0.046496 -0.036419 -0.155791
17.633333 -1.361872 -3.199393 0.311241 0.064551 -0.044122 -0.172156
17.666667 -1.359560 -3.201160 0.315726 0.085803 -0.052029 -0.170475
17.700000 -1.357362 -3.202855 0.257469 0.109480 -0.059862 -0.144133
17.733333 -1.355291 -3.204477 0.247237 0.134559 -0.067168 -0.095702
17.766667 -1.350258 -3.207520 0.215359 0.159366 -0.073316 -0.031717
17.800000 -1.345376 -3.210478 0.213271 0.181814 -0.077582 0.045129
17.833333 -1.337370 -3.213756 0.221093 0.200118 -0.079588 0.125235
17.866667 -1.329550 -3.216937 0.238066 0.213301 -0.079198 0.204431
17.900000 -1.319259 -3.220538 0.262670 0.220441 -0.076273 0.266543
17.933333 -1.306726 -3.224603 0.269294 0.221212 -0.071018 0.311987
17.966667 -1.294925 -3.228058 0.309779 0.216051 -0.063962 0.336425
18.000000 -1.286238 -3.230700 0.328425 0.205841 -0.055739 0.334964
18.033333 -1.277845 -3.233218 0.363987 0.191589 -0.046657 0.312630
18.066667 -1.274478 -3.232969 0.366783 0.174144 -0.036980 0.266973
18.100000 -1.271445 -3.232597 0.361001 0.154632 -0.027054 0.207595
18.133333 -1.268760 -3.232104 0.369489 0.134141 -0.017100 0.128983
18.166667 -1.265428 -3.232125 0.331025 0.113296 -0.006852 0.034548
18.200000 -1.261469 -3.232997 0.348696 0.092366 0.004401 -0.071245
18.233333 -1.257905 -3.233741 0.352680 0.071757 0.017008 -0.186332
18.266667 -1.254623 -3.233761 0.373308 0.051291 0.031913 -0.308385
18.300000 -1.251770 -3.233649 0.389456 0.031005 0.050288 -0.440633
18.333333 -1.249365 -3.233404 0.355787 0.010914 0.073408 -0.573748
18.366667 -1.249414 -3.230977 0.334848 -0.008399 0.101980 -0.704541
18.400000 -1.249944 -3.228419 0.295454 -0.026245 0.136169 -0.827552
18.433333 -1.253066 -3.225656 0.269859 -0.041925 0.176299 -0.938689
18.466667 -1.257119 -3.221588 0.227157 -0.054547 0.221896 -1.029627
18.500000 -1.262167 -3.214695 0.154869 -0.063524 0.272033 -1.087296
18.533333 -1.265371 -3.204723 0.110900 -0.068650 0.325342 -1.112691
18.566667 -1.269127 -3.194643 0.072945 -0.070407 0.380722 -1.104884
18.600000 -1.271927 -3.181032 0.036431 -0.069497 0.436758 -1.064317
18.633333 -1.274200 -3.164917 -0.005182 -0.067181 0.491917 -0.991969
18.666667 -1.275844 -3.146277 -0.043297 -0.064775 0.544899 -0.892265
18.700000 -1.276722 -3.125099 -0.069277 -0.063735 0.594501 -0.776569
18.733333 -1.277007 -3.101761 -0.114117 -0.065235 0.639799 -0.646292
18.766667 -1.277950 -3.078411 -0.117979 -0.070473 0.679564 -0.502956
18.800000 -1.279571 -3.055073 -0.132882 -0.080287 0.713320 -0.349698
18.833333 -1.281660 -3.029698 -0.144036 -0.095402 0.740275 -0.190091
18.866667 -1.283759 -3.002914 -0.157645 -0.116358 0.759831 -0.024627
18.900000 -1.286578 -2.975464 -0.160726 -0.143777 0.771227 0.151742
18.933333 -1.290148 -2.948132 -0.151795 -0.178553 0.773499 0.338845
18.966667 -1.295866 -2.920033 -0.119757 -0.220843 0.766114 0.533650
19.000000 -1.302369 -2.892111 -0.098218 -0.271059 0.747839 0.733938
19.033333 -1.309671 -2.864394 -0.080544 -0.328843 0.718458 0.932175
19.066667 -1.317786 -2.836914 -0.077156 -0.393813 0.677808 1.122324
19.100000 -1.330402 -2.812330 -0.024485 -0.464743 0.626408 1.291755
19.133333 -1.343852 -2.788042 0.019300 -0.539813 0.565501 1.431571
19.166667 -1.363727 -2.768788 0.090839 -0.617343 0.496369 1.532654
19.200000 -1.384441 -2.749884 0.162836 -0.695377 0.421154 1.586077
19.233333 -1.410543 -2.736961 0.246504 -0.772067 0.341909 1.589080
19.266667 -1.441605 -2.729746 0.319479 -0.845284 0.261013 1.534549
19.300000 -1.473486 -2.722935 0.393322 -0.913913 0.180608 1.422285
19.333333 -1.507821 -2.721622 0.460176 -0.977053 0.102817 1.251015
19.366667 -1.542952 -2.720727 0.479160 -1.034488 0.029490 1.031383
19.400000 -1.578869 -2.720251 0.521682 -1.086143 -0.037951 0.771427
19.433333 -1.616891 -2.725022 0.552611 -1.132601 -0.098624 0.482467
19.466667 -1.655669 -2.730214 0.569516 -1.175138 -0.152539 0.176153
19.500000 -1.696031 -2.739367 0.558713 -1.214515 -0.199290 -0.131791
19.533333 -1.737118 -2.748932 0.555515 -1.251774 -0.239328 -0.426564
19.566667 -1.778916 -2.758899 0.525996 -1.287561 -0.273012 -0.704896
19.600000 -1.821410 -2.769261 0.506269 -1.322979 -0.300541 -0.960479
19.633333 -1.867441 -2.780934 0.447491 -1.358736 -0.322381 -1.187946
19.666667 -1.914133 -2.792988 0.381260 -1.395195 -0.338561 -1.378892
19.700000 -1.961468 -2.805414 0.321489 -1.432643 -0.350105 -1.532998
19.733333 -2.009426 -2.818201 0.264749 -1.471230 -0.357621 -1.648530
19.766667 -2.057987 -2.831340 0.203849 -1.511100 -0.361717 -1.721352
19.800000 -2.107131 -2.844821 0.136006 -1.551485 -0.363351 -1.745717
19.833333 -2.159547 -2.856709 0.070395 -1.591755 -0.363390 -1.721632
19.866667 -2.212504 -2.868923 0.005521 -1.631344 -0.362674 -1.653437
19.900000 -2.265980 -2.881456 -0.059923 -1.669845 -0.361585 -1.543569
19.933333 -2.325421 -2.892252 -0.127305 -1.706634 -0.360749 -1.393027
19.966667 -2.385329 -2.903358 -0.192122 -1.741208 -0.360873 -1.205804
20.000000 -2.445671 -2.914767 -0.234293 -1.773606 -0.362564 -0.990355
20.033333 -2.506419 -2.926473 -0.267240 -1.804123 -0.366109 -0.752594
20.066667 -2.567541 -2.938467 -0.293437 -1.832918 -0.371928 -0.496219
20.100000 -2.629005 -2.950744 -0.297799 -1.860152 -0.380439 -0.226682
20.133333 -2.690781 -2.963296 -0.292713 -1.886281 -0.391605 0.044662
20.166667 -2.752836 -2.976114 -0.278683 -1.911352 -0.405264 0.308395
20.200000 -2.815960 -2.988805 -0.262742 -1.935317 -0.421233 0.558286
20.233333 -2.879299 -3.001749 -0.249004 -1.957912 -0.439435 0.787998
20.266667 -2.945726 -3.015843 -0.205582 -1.978704 -0.459543 0.989400
20.300000 -3.013724 -3.031123 -0.169325 -1.997165 -0.481202 1.157974
20.333333 -3.082840 -3.047532 -0.119459 -2.012736 -0.504145 1.291900
20.366667 -3.152542 -3.065111 -0.058020 -2.025280 -0.528038 1.390578
20.400000 -3.222254 -3.083739 0.008941 -2.034637 -0.552271 1.450561
20.433333 -3.291951 -3.102568 0.070720 -2.040525 -0.576052 1.469491
20.466667 -3.360021 -3.122075 0.130605 -2.043284 -0.598770 1.447913
20.500000 -3.425918 -3.142154 0.177229 -2.043934 -0.619817 1.387299
20.533333 -3.493364 -3.163587 0.229527 -2.043398 -0.638683 1.288270
20.566667 -3.561816 -3.186413 0.276375 -2.042416 -0.654945 1.154976
20.600000 -3.630060 -3.209366 0.327718 -2.041905 -0.668369 0.992896
20.633333 -3.698335 -3.233093 0.362850 -2.042869 -0.678809 0.808271
20.666667 -3.766325 -3.256914 0.389691 -2.045884 -0.685966 0.609265
20.700000 -3.833990 -3.280813 0.408022 -2.050451 -0.689606 0.398597
20.733333 -3.901642 -3.304627 0.414303 -2.056235 -0.689632 0.185768
20.766667 -3.969248 -3.327839 0.419635 -2.062751 -0.685867 -0.023819
20.800000 -4.036416 -3.351079 0.408718 -2.069271 -0.678107 -0.222391
20.833333 -4.106899 -3.374235 0.404635 -2.074656 -0.666204 -0.404399
20.866667 -4.176863 -3.397392 0.363516 -2.077735 -0.650298 -0.566401
20.900000 -4.246266 -3.420533 0.341377 -2.077827 -0.630489 -0.702558
20.933333 -4.317101 -3.442306 0.300750 -2.073862 -0.606769 -0.810948
20.966667 -4.388101 -3.463160 0.264746 -2.065150 -0.579436 -0.889766
21.000000 -4.459397 -3.482008 0.240050 -2.050874 -0.549124 -0.943259
21.033333 -4.529964 -3.500791 0.190714 -2.030378 -0.516528 -0.973475
21.066667 -4.599759 -3.519497 0.147201 -2.002492 -0.482166 -0.986803
21.100000 -4.665470 -3.534889 0.122495 -1.965369 -0.446614 -0.987284
21.133333 -4.731172 -3.548120 0.081611 -1.917685 -0.410609 -0.976617
21.166667 -4.795515 -3.559381 0.058275 -1.856771 -0.374633 -0.958132
21.200000 -4.858932 -3.570535 0.026192 -1.779419 -0.338653 -0.926548
21.233333 -4.921385 -3.581580 -0.010510 -1.683277 -0.302700 -0.881383
21.266667 -4.981158 -3.591304 -0.034227 -1.566751 -0.266949 -0.817317
21.300000 -5.039126 -3.599785 -0.039679 -1.429706 -0.231549 -0.732531
21.333333 -5.095103 -3.607399 -0.083292 -1.271933 -0.196377 -0.630533
21.366667 -5.142789 -3.613620 -0.124582 -1.096352 -0.161557 -0.511170
21.400000 -5.182155 -3.619492 -0.175151 -0.907859 -0.127577 -0.376814
21.433333 -5.208872 -3.622722 -0.209801 -0.711526 -0.094974 -0.227081
21.466667 -5.234447 -3.625814 -0.187466 -0.512755 -0.064046 -0.067028
21.500000 -5.242593 -3.625924 -0.159619 -0.317411 -0.035235 0.102559
21.533333 -5.238318 -3.624240 -0.136199 -0.132008 -0.009135 0.277613
21.566667 -5.232945 -3.622406 -0.131772 0.039388 0.013869 0.453097
21.600000 -5.219279 -3.620580 -0.114803 0.193445 0.033432 0.616961
21.633333 -5.204577 -3.618615 -0.103730 0.328142 0.049395 0.760220
21.666667 -5.188873 -3.616521 -0.079934 0.441575 0.061362 0.880477
21.700000 -5.172204 -3.614309 -0.047560 0.534012 0.069254 0.970529
21.733333 -5.150288 -3.611585 0.003331 0.607060 0.073104 1.023992
21.766667 -5.125084 -3.608074 0.047484 0.661706 0.072946 1.016139
21.800000 -5.099038 -3.604468 0.097582 0.699469 0.068902 0.933023
21.833333 -5.071219 -3.601150 0.158973 0.721147 0.061140 0.760681
21.866667 -5.041871 -3.597330 0.205214 0.728225 0.050043 0.490123
21.900000 -5.012776 -3.594391 0.245305 0.721511 0.035941 0.120644
21.933333 -4.984233 -3.592348 0.265128 0.701775 0.019213 -0.331285
21.966667 -4.957758 -3.591695 0.284839 0.670342 0.000395 -0.811308
22.000000 -4.935109 -3.592506 0.294714 0.629510 -0.019789 -1.269216
22.033333 -4.915947 -3.594828 0.291204 0.582519 -0.040499 -1.659068
22.066667 -4.896287 -3.597145 0.243742 0.532252 -0.060882 -1.942268
22.100000 -4.876163 -3.599463 -0.011178 0.481171 -0.080095 -2.070877
22.133333 -4.863415 -3.602535 -0.224198 0.431824 -0.097424 -2.020414
22.166667 -4.854380 -3.606585 -0.391882 0.386451 -0.112367 -1.795313
22.200000 -4.844966 -3.610663 -0.509128 0.345372 -0.124853 -1.412844
22.233333 -4.837125 -3.616259 -0.582811 0.307509 -0.135281 -0.890446
22.266667 -4.828949 -3.621892 -0.584862 0.271954 -0.144210 -0.255807
22.300000 -4.820459 -3.627561 -0.546690 0.238228 -0.152294 0.422632
22.333333 -4.811678 -3.633270 -0.463408 0.204512 -0.160658 1.084936
22.366667 -4.803015 -3.638933 -0.382392 0.168559 -0.170477 1.686020
22.400000 -4.795532 -3.643894 -0.279768 0.129677 -0.182629 2.192807
22.433333 -4.790894 -3.648644 -0.151082 0.088522 -0.197781 2.571950
22.466667 -4.786046 -3.653447 -0.015730 0.045695 -0.216606 2.803454
22.500000 -4.781004 -3.658304 0.099375 0.001640 -0.239757 2.899840
22.533333 -4.782206 -3.664641 0.184840 -0.041729 -0.266964 2.881075
22.566667 -4.789512 -3.674327 0.299979 -0.081713 -0.297640 2.759039
22.600000 -4.796648 -3.684083 0.429371 -0.116392 -0.331182 2.550167
22.633333 -4.803617 -3.693909 0.527203 -0.144880 -0.366698 2.277798
22.666667 -4.812104 -3.708910 0.609909 -0.166315 -0.402741 1.966119
22.700000 -4.820421 -3.723971 0.697004 -0.180077 -0.437862 1.630343
22.733333 -4.828572 -3.739083 0.734734 -0.186773 -0.471044 1.285475
22.766667 -4.835886 -3.756666 0.756365 -0.188091 -0.501453 0.949677
22.800000 -4.842262 -3.775162 0.764576 -0.185693 -0.528128 0.638098
22.833333 -4.847329 -3.793724 0.765652 -0.180943 -0.550311 0.361241
22.866667 -4.852189 -3.813691 0.741192 -0.175401 -0.567926 0.127848
22.900000 -4.857082 -3.834301 0.728260 -0.170398 -0.580667 -0.051755
22.933333 -4.861818 -3.854885 0.722375 -0.166728 -0.588238 -0.177933
22.966667 -4.866932 -3.875574 0.697341 -0.164408 -0.590347 -0.249839
23.000000 -4.872194 -3.896459 0.684568 -0.163249 -0.587071 -0.271565
23.033333 -4.877834 -3.917409 0.666508 -0.162877 -0.578505 -0.247807
23.066667 -4.883326 -3.938274 0.665014 -0.162740 -0.564756 -0.190960
23.100000 -4.889085 -3.958295 0.642369 -0.162390 -0.546444 -0.110929
23.133333 -4.894980 -3.976774 0.626708 -0.161355 -0.524310 -0.011645
23.166667 -4.900735 -3.995127 0.615149 -0.159342 -0.499183 0.097569
23.200000 -4.906644 -4.012247 0.631764 -0.156064 -0.471617 0.209325
23.233333 -4.912060 -4.027287 0.646478 -0.151445 -0.442345 0.316385
23.266667 -4.917342 -4.042169 0.667682 -0.145442 -0.411896 0.418067
23.300000 -4.921941 -4.053308 0.692328 -0.138076 -0.380759 0.509414
23.333333 -4.926412 -4.064273 0.717998 -0.129387 -0.349045 0.584201
23.366667 -4.930757 -4.075058 0.741162 -0.119499 -0.317102 0.640075
23.400000 -4.934977 -4.085658 0.768571 -0.108764 -0.285461 0.676452
23.433333 -4.939072 -4.096068 0.787510 -0.097427 -0.254318 0.693437
23.466667 -4.943045 -4.106284 0.818068 -0.085740 -0.223875 0.689068
23.500000 -4.945824 -4.113047 0.838291 -0.073915 -0.194068 0.666233
23.533333 -4.947178 -4.116986 0.866993 -0.062322 -0.165446 0.627409
23.566667 -4.948424 -4.120723 0.889938 -0.051240 -0.138282 0.575984
23.600000 -4.949563 -4.124259 0.919696 -0.040870 -0.112863 0.514375
23.633333 -4.950600 -4.127597 0.940360 -0.031442 -0.089635 0.445883
23.666667 -4.951123 -4.129100 0.956698 -0.023227 -0.069178 0.375073
23.700000 -4.951553 -4.130410 0.965495 -0.016373 -0.051849 0.302577
23.733333 -4.951651 -4.130938 0.971641 -0.010783 -0.037490 0.233671
23.766667 -4.951664 -4.131282 0.967079 -0.006356 -0.025942 0.171229
23.800000 -4.951625 -4.131474 0.962274 -0.002942 -0.016940 0.117799
23.833333 -4.951508 -4.131490 0.967636 -0.000398 -0.010220 0.074325
23.866667 -4.951316 -4.131336 0.961158 0.001509 -0.005233 0.042091
23.900000 -4.951053 -4.131015 0.964252 0.002887 -0.001699 0.022383
