t x y theta dxdt dydt dthetadt
0.000000 0.000000 0.000000 -2.238529 0.003421 0.151841 -0.126669
0.033333 0.000114 0.005075 -2.227622 0.003467 0.154319 -0.174587
0.066667 0.000230 0.010242 -2.230511 0.003515 0.156828 -0.231536
0.100000 0.000347 0.015502 -2.234679 0.003565 0.159363 -0.294150
0.133333 0.000466 0.020853 -2.258003 0.003615 0.161915 -0.356170
0.166667 0.000587 0.026295 -2.259331 0.003667 0.164473 -0.417330
0.200000 0.000710 0.031827 -2.286955 0.003719 0.167022 -0.475292
0.233333 0.000835 0.037448 -2.303979 0.003770 0.169544 -0.527013
0.266667 0.000962 0.043156 -2.327611 0.003821 0.172024 -0.569249
0.300000 0.001091 0.048949 -2.347476 0.003870 0.174452 -0.604265
0.333333 0.001221 0.054826 -2.375125 0.003916 0.176818 -0.634175
0.366667 0.001354 0.060785 -2.400811 0.003960 0.179117 -0.652088
0.400000 0.001488 0.066812 -2.435151 0.004000 0.181347 -0.657573
0.433333 0.001623 0.072907 -2.438931 0.004036 0.183509 -0.649583
0.466667 0.001759 0.079068 -2.447473 0.004067 0.185607 -0.630416
0.500000 0.001896 0.085302 -2.475440 0.004093 0.187644 -0.595738
0.533333 0.002033 0.091600 -2.500594 0.004113 0.189623 -0.546267
0.566667 0.002172 0.097964 -2.539057 0.004128 0.191552 -0.488079
0.600000 0.002311 0.104392 -2.568063 0.004138 0.193435 -0.422396
0.633333 0.002452 0.110883 -2.596537 0.004144 0.195278 -0.345082
0.666667 0.002591 0.117431 -2.599337 0.004146 0.197087 -0.250702
0.700000 0.002732 0.124041 -2.577575 0.004145 0.198867 -0.141914
0.733333 0.002870 0.130706 -2.576700 0.004143 0.200622 -0.016987
0.766667 0.003007 0.137423 -2.574207 0.004141 0.202357 0.126518
0.800000 0.003143 0.144194 -2.589598 0.004139 0.204078 0.291086
0.833333 0.003279 0.151024 -2.583198 0.004138 0.205791 0.459751
0.866667 0.003416 0.157912 -2.582012 0.004139 0.207502 0.621303
0.900000 0.003554 0.164858 -2.571882 0.004143 0.209215 0.770635
0.933333 0.003692 0.171861 -2.547588 0.004149 0.210938 0.900620
0.966667 0.003831 0.178919 -2.492430 0.004158 0.212674 0.996764
1.000000 0.003969 0.186035 -2.438344 0.004168 0.214428 1.041479
1.033333 0.004108 0.193205 -2.371145 0.004179 0.216197 1.043379
1.066667 0.004247 0.200428 -2.321647 0.004191 0.217983 1.003614
1.100000 0.004387 0.207715 -2.240154 0.004202 0.219784 0.918873
1.133333 0.004527 0.215067 -2.154342 0.004213 0.221594 0.786081
1.166667 0.004668 0.222487 -2.190548 0.004222 0.223405 0.627492
1.200000 0.004810 0.229957 -2.203254 0.004231 0.225210 0.465417
1.233333 0.004952 0.237498 -2.197905 0.004238 0.226998 0.309817
1.266667 0.005093 0.245113 -2.188241 0.004244 0.228756 0.171646
1.300000 0.005235 0.252773 -2.197573 0.004250 0.230472 0.065747
1.333333 0.005377 0.260509 -2.205464 0.004255 0.232132 0.009438
1.366667 0.005519 0.268290 -2.203730 0.004260 0.233729 -0.014702
1.400000 0.005661 0.276113 -2.225101 0.004265 0.235258 -0.019705
1.433333 0.005803 0.284012 -2.238336 0.004269 0.236718 -0.015371
1.466667 0.005945 0.291952 -2.267315 0.004274 0.238111 -0.001012
1.500000 0.006087 0.299930 -2.244458 0.004279 0.239444 0.019207
1.533333 0.006230 0.307947 -2.214579 0.004282 0.240733 0.039635
1.566667 0.006373 0.316000 -2.178025 0.004283 0.241990 0.071765
1.600000 0.006516 0.324089 -2.164757 0.004282 0.243224 0.125244
1.633333 0.006660 0.332212 -2.180663 0.004276 0.244448 0.207340
1.666667 0.006804 0.340367 -2.195663 0.004267 0.245677 0.308081
1.700000 0.006949 0.348554 -2.220384 0.004251 0.246925 0.427118
1.733333 0.007091 0.356812 -2.250988 0.004229 0.248189 0.563747
1.766667 0.007233 0.365098 -2.253943 0.004202 0.249469 0.713231
1.800000 0.007376 0.373412 -2.196600 0.004169 0.250766 0.860683
1.833333 0.007516 0.381794 -2.142140 0.004131 0.252069 0.987709
1.866667 0.007652 0.390243 -2.079485 0.004090 0.253357 1.087579
1.900000 0.007788 0.398715 -2.017006 0.004048 0.254604 1.144607
1.933333 0.007924 0.407208 -1.949010 0.004007 0.255802 1.140219
1.966667 0.008057 0.415764 -1.888356 0.003970 0.256937 1.062571
2.000000 0.008186 0.424381 -1.853979 0.003940 0.257994 0.918708
2.033333 0.008312 0.433057 -1.813104 0.003918 0.258965 0.717800
2.066667 0.008439 0.441747 -1.779500 0.003906 0.259854 0.464633
2.100000 0.008565 0.450450 -1.760992 0.003907 0.260665 0.172023
2.133333 0.008693 0.459163 -1.763596 0.003921 0.261393 -0.141508
2.166667 0.008820 0.467887 -1.787035 0.003950 0.262038 -0.459750
2.200000 0.008948 0.476617 -1.792698 0.003993 0.262607 -0.782580
2.233333 0.009078 0.485383 -1.818875 0.004049 0.263105 -1.101552
2.266667 0.009211 0.494180 -1.878120 0.004116 0.263532 -1.404157
2.300000 0.009348 0.503002 -1.942595 0.004194 0.263886 -1.683923
2.333333 0.009486 0.511825 -1.998300 0.004280 0.264165 -1.935766
2.366667 0.009630 0.520663 -2.079734 0.004373 0.264366 -2.148391
2.400000 0.009775 0.529498 -2.174724 0.004470 0.264479 -2.294575
2.433333 0.009928 0.538342 -2.245322 0.004571 0.264495 -2.359098
2.466667 0.010081 0.547178 -2.344345 0.004675 0.264411 -2.327522
2.500000 0.010243 0.556015 -2.445015 0.004781 0.264227 -2.181839
2.533333 0.010405 0.564841 -2.569388 0.004888 0.263941 -1.905698
2.566667 0.010567 0.573655 -2.660951 0.004993 0.263559 -1.501336
2.600000 0.010729 0.582453 -2.758939 0.005095 0.263085 -0.983564
2.633333 0.010900 0.591235 -2.835329 0.005194 0.262524 -0.363850
2.666667 0.011077 0.599997 -2.895616 0.005285 0.261879 0.338915
2.700000 0.011261 0.608733 -2.870837 0.005368 0.261155 1.089653
2.733333 0.011444 0.617447 -2.786485 0.005441 0.260357 1.848612
2.766667 0.011631 0.626126 -2.682913 0.005503 0.259485 2.584669
2.800000 0.011821 0.634766 -2.557571 0.005551 0.258538 3.267205
2.833333 0.012011 0.643378 -2.376870 0.005585 0.257513 3.863347
2.866667 0.012201 0.651960 -2.217771 0.005605 0.256404 4.347846
2.900000 0.012390 0.660510 -2.046530 0.005611 0.255203 4.717572
2.933333 0.012580 0.669027 -1.844854 0.005604 0.253900 4.975898
2.966667 0.012767 0.677482 -1.645124 0.005585 0.252495 5.130683
3.000000 0.012955 0.685900 -1.444639 0.005557 0.250988 5.191791
3.033333 0.013142 0.694280 -1.266143 0.005522 0.249388 5.177897
3.066667 0.013328 0.702618 -1.087274 0.005481 0.247702 5.102108
3.100000 0.013512 0.710880 -0.937799 0.005436 0.245941 4.971847
3.133333 0.013693 0.719060 -0.759884 0.005388 0.244112 4.794581
3.166667 0.013871 0.727157 -0.595608 0.005338 0.242223 4.576401
3.200000 0.014045 0.735167 -0.442308 0.005287 0.240279 4.324567
3.233333 0.014219 0.743129 -0.282549 0.005236 0.238285 4.038479
3.266667 0.014392 0.751040 -0.134859 0.005184 0.236246 3.723522
3.300000 0.014565 0.758899 -0.011809 0.005132 0.234163 3.384463
3.333333 0.014736 0.766706 0.112534 0.005081 0.232042 3.024544
3.366667 0.014906 0.774457 0.206150 0.005030 0.229878 2.651078
3.400000 0.015074 0.782110 0.269930 0.004979 0.227662 2.271566
3.433333 0.015239 0.789662 0.331813 0.004926 0.225386 1.900257
3.466667 0.015401 0.797113 0.396828 0.004873 0.223048 1.549391
3.500000 0.015562 0.804504 0.434948 0.004818 0.220651 1.225277
3.533333 0.015722 0.811834 0.470493 0.004762 0.218196 0.938166
3.566667 0.015881 0.819102 0.469734 0.004704 0.215691 0.692863
3.600000 0.016038 0.826267 0.457648 0.004646 0.213145 0.491901
3.633333 0.016191 0.833330 0.474218 0.004586 0.210571 0.331482
3.666667 0.016344 0.840328 0.465637 0.004526 0.207967 0.208401
3.700000 0.016494 0.847224 0.471387 0.004465 0.205332 0.121958
3.733333 0.016642 0.854017 0.465809 0.004402 0.202671 0.066562
3.766667 0.016787 0.860708 0.462520 0.004339 0.199994 0.033475
3.800000 0.016931 0.867330 0.469949 0.004275 0.197307 0.015002
3.833333 0.017073 0.873882 0.458423 0.004210 0.194612 0.008587
3.866667 0.017213 0.880332 0.464024 0.004145 0.191920 0.008267
3.900000 0.017350 0.886681 0.471336 0.004080 0.189235 0.008910
3.933333 0.017484 0.892928 0.468708 0.004015 0.186565 0.008139
3.966667 0.017617 0.899103 0.469859 0.003950 0.183904 0.006371
4.000000 0.017747 0.905178 0.467436 0.003885 0.181257 0.005989
4.033333 0.017876 0.911179 0.471957 0.003821 0.178629 0.005063
4.066667 0.018002 0.917079 0.472328 0.003757 0.176024 0.003719
4.100000 0.018126 0.922906 0.468208 0.003693 0.173444 0.004381
4.133333 0.018248 0.928633 0.471544 0.003630 0.170887 0.004810
4.166667 0.018368 0.934284 0.463704 0.003568 0.168355 0.006103
4.200000 0.018485 0.939838 0.467639 0.003506 0.165843 0.005826
4.233333 0.018601 0.945315 0.460558 0.003444 0.163348 0.004825
4.266667 0.018714 0.950716 0.471243 0.003383 0.160862 0.004223
4.300000 0.018826 0.956041 0.467670 0.003321 0.158380 0.002139
4.333333 0.018936 0.961288 0.476200 0.003259 0.155895 0.000583
4.366667 0.019044 0.966440 0.480359 0.003197 0.153403 -0.002389
4.400000 0.019150 0.971515 0.472723 0.003134 0.150901 -0.004773
4.433333 0.019254 0.976513 0.470167 0.003070 0.148385 -0.006974
