t x y theta dxdt dydt dthetadt
0.000000 0.000000 0.000000 0.481146 -0.019638 0.001054 -0.002227
0.033333 -0.000403 -0.000096 0.479854 -0.022522 0.001840 -0.009993
0.066667 -0.001529 0.000187 0.499595 -0.026367 0.002853 -0.034310
0.100000 -0.002581 0.000428 0.492256 -0.032006 0.004266 -0.081254
0.133333 -0.003555 0.000624 0.487133 -0.040344 0.006347 -0.155648
0.166667 -0.004448 0.000773 0.499804 -0.052164 0.009414 -0.266042
0.200000 -0.005256 0.000873 0.491021 -0.067880 0.013720 -0.411382
0.233333 -0.005976 0.000921 0.490034 -0.087869 0.019508 -0.586698
0.266667 -0.006603 0.000914 0.498704 -0.111841 0.026915 -0.780646
0.300000 -0.008912 0.001289 0.499499 -0.138745 0.035819 -0.987928
0.333333 -0.013322 0.002025 0.455148 -0.167335 0.046035 -1.194778
0.366667 -0.017623 0.002697 0.368790 -0.195572 0.056983 -1.380984
0.400000 -0.025256 0.004499 0.297762 -0.221315 0.068020 -1.531215
0.433333 -0.036226 0.007624 0.245786 -0.242138 0.078385 -1.628910
0.466667 -0.047052 0.010673 0.170415 -0.255782 0.087225 -1.670447
0.500000 -0.059845 0.015191 0.100382 -0.259993 0.093655 -1.646590
0.533333 -0.072461 0.019617 0.019084 -0.252529 0.096814 -1.559336
0.566667 -0.084885 0.023944 -0.098260 -0.232162 0.096255 -1.414485
0.600000 -0.094460 0.028423 -0.121128 -0.198048 0.091652 -1.229676
0.633333 -0.103811 0.032785 -0.156665 -0.149935 0.082914 -1.020080
0.666667 -0.112923 0.037023 -0.177865 -0.088366 0.070208 -0.799033
0.700000 -0.114802 0.039096 -0.197954 -0.015504 0.054279 -0.583545
0.733333 -0.116424 0.041030 -0.188399 0.066173 0.035917 -0.389801
0.766667 -0.117782 0.042819 -0.189316 0.154204 0.015924 -0.238107
0.800000 -0.112881 0.043065 -0.193519 0.245497 -0.004711 -0.127961
0.833333 -0.102808 0.042072 -0.180751 0.336732 -0.024946 -0.064807
0.866667 -0.088069 0.040316 -0.169466 0.424723 -0.043806 -0.048135
0.900000 -0.069010 0.037714 -0.141153 0.507695 -0.060818 -0.075357
0.933333 -0.044624 0.034206 -0.142012 0.583327 -0.075454 -0.135836
0.966667 -0.020030 0.030531 -0.141135 0.649400 -0.087376 -0.216271
1.000000 0.004750 0.026690 -0.148492 0.704549 -0.096521 -0.310452
1.033333 0.029693 0.022682 -0.170762 0.747999 -0.103120 -0.406459
1.066667 0.057746 0.018226 -0.193413 0.779471 -0.107487 -0.486592
1.100000 0.087384 0.014397 -0.212957 0.798239 -0.109927 -0.531943
1.133333 0.117106 0.010398 -0.247699 0.804308 -0.110846 -0.524752
1.166667 0.145622 0.007164 -0.278498 0.797925 -0.110663 -0.450352
1.200000 0.174168 0.003756 -0.304574 0.779314 -0.109774 -0.300641
1.233333 0.202717 0.000175 -0.332354 0.748980 -0.108452 -0.073955
1.266667 0.231242 -0.003583 -0.362574 0.707569 -0.106970 0.210217
1.300000 0.259716 -0.007519 -0.385004 0.656610 -0.105285 0.526408
1.333333 0.283808 -0.011092 -0.400923 0.598334 -0.103442 0.836939
1.366667 0.302371 -0.014338 -0.403691 0.535470 -0.101117 1.109215
1.400000 0.320819 -0.017767 -0.302505 0.471185 -0.097670 1.309060
1.433333 0.333896 -0.021155 -0.205174 0.408880 -0.092517 1.404400
1.466667 0.342279 -0.024123 -0.053312 0.352091 -0.085105 1.381813
1.500000 0.350517 -0.027284 0.063919 0.303597 -0.075253 1.239950
1.533333 0.355573 -0.030663 0.148474 0.265342 -0.062603 0.989897
1.566667 0.358971 -0.033771 0.223235 0.238092 -0.047341 0.643598
1.600000 0.362219 -0.037082 0.244190 0.221773 -0.030195 0.232354
1.633333 0.366433 -0.038656 0.205971 0.214672 -0.012094 -0.207822
1.666667 0.370499 -0.040443 0.140513 0.214306 0.006132 -0.648514
1.700000 0.377353 -0.039404 0.065931 0.218032 0.023565 -1.065770
1.733333 0.387506 -0.035360 -0.013135 0.222125 0.038885 -1.441856
1.766667 0.397502 -0.031557 -0.115130 0.223304 0.051067 -1.757859
1.800000 0.407334 -0.028010 -0.145815 0.218579 0.059358 -2.018025
1.833333 0.416996 -0.024729 -0.193233 0.206236 0.063489 -2.231629
1.866667 0.426638 -0.021272 -0.261311 0.184566 0.063038 -2.399594
1.900000 0.436098 -0.018106 -0.334894 0.152357 0.058091 -2.525822
1.933333 0.445369 -0.015245 -0.409448 0.110491 0.049333 -2.609853
1.966667 0.448006 -0.014061 -0.516722 0.060411 0.037364 -2.655162
2.000000 0.450450 -0.013203 -0.657455 0.003558 0.022607 -2.648553
2.033333 0.452703 -0.012682 -0.758111 -0.058400 0.005313 -2.579478
2.066667 0.447345 -0.012574 -0.880094 -0.122244 -0.014204 -2.449215
2.100000 0.441808 -0.012822 -0.980019 -0.184998 -0.035884 -2.257781
2.133333 0.436102 -0.013436 -1.072419 -0.244240 -0.060131 -2.006099
2.166667 0.425119 -0.015048 -1.169928 -0.297983 -0.087200 -1.694664
2.200000 0.409553 -0.017907 -1.217066 -0.343394 -0.117127 -1.335205
2.233333 0.393867 -0.021156 -1.224982 -0.378078 -0.149998 -0.932658
2.266667 0.378081 -0.024803 -1.227215 -0.401586 -0.185682 -0.485676
2.300000 0.360929 -0.030782 -1.223719 -0.412960 -0.224023 0.000057
2.333333 0.343546 -0.039360 -1.233993 -0.411586 -0.264551 0.520350
2.366667 0.326131 -0.048350 -1.239223 -0.397021 -0.307221 1.065363
2.400000 0.310592 -0.059768 -1.259379 -0.370645 -0.351703 1.631730
2.433333 0.295066 -0.071598 -1.202103 -0.333767 -0.398004 2.204415
2.466667 0.283836 -0.086138 -1.118007 -0.287287 -0.446105 2.761924
2.500000 0.272655 -0.101085 -1.002008 -0.233153 -0.496020 3.284340
2.533333 0.266951 -0.119096 -0.867255 -0.174176 -0.547592 3.742541
2.566667 0.261323 -0.137504 -0.693441 -0.113387 -0.600370 4.109919
2.600000 0.255781 -0.156302 -0.496819 -0.052795 -0.654618 4.357590
2.633333 0.255287 -0.177172 -0.312788 0.004909 -0.710130 4.473133
2.666667 0.259266 -0.201449 -0.092690 0.057381 -0.766830 4.451015
2.700000 0.266589 -0.229413 0.100271 0.102439 -0.824668 4.296869
2.733333 0.274009 -0.257718 0.273015 0.139190 -0.884108 4.028042
2.766667 0.282573 -0.290473 0.417912 0.167129 -0.944916 3.672447
2.800000 0.291224 -0.323529 0.539960 0.185830 -1.006223 3.261291
2.833333 0.299956 -0.356864 0.620812 0.195989 -1.067257 2.821110
2.866667 0.308764 -0.390454 0.690367 0.198702 -1.127666 2.382190
2.900000 0.316455 -0.428062 0.727757 0.195961 -1.186761 1.969698
2.933333 0.322858 -0.468657 0.781665 0.189429 -1.243401 1.601673
2.966667 0.328181 -0.513746 0.810181 0.181073 -1.297228 1.289417
3.000000 0.333564 -0.558975 0.840906 0.172749 -1.348120 1.038224
3.033333 0.337865 -0.608244 0.850643 0.166032 -1.395461 0.850308
3.066667 0.342224 -0.657577 0.870788 0.162096 -1.438181 0.720829
3.100000 0.346638 -0.706934 0.879599 0.161427 -1.475731 0.639058
3.133333 0.351108 -0.756273 0.897801 0.164336 -1.507763 0.590758
3.166667 0.355734 -0.807869 0.898429 0.170592 -1.533407 0.558769
3.200000 0.360611 -0.860609 0.914728 0.179891 -1.551047 0.526107
3.233333 0.366269 -0.914178 0.922809 0.191314 -1.559121 0.473997
3.266667 0.371978 -0.967559 0.953201 0.203960 -1.556185 0.384156
3.300000 0.379291 -1.022359 0.981579 0.216954 -1.540431 0.243678
3.333333 0.386649 -1.076880 1.010858 0.229430 -1.510380 0.051695
3.366667 0.395801 -1.131075 1.042233 0.240284 -1.464284 -0.189146
3.400000 0.404988 -1.184900 1.087160 0.248554 -1.401926 -0.472767
3.433333 0.414204 -1.238309 1.091835 0.253793 -1.324380 -0.784240
3.466667 0.424066 -1.287983 1.044738 0.255507 -1.233007 -1.097760
3.500000 0.434050 -1.331992 0.975284 0.253455 -1.129888 -1.385216
3.533333 0.443406 -1.367620 0.888705 0.247506 -1.017498 -1.624989
3.566667 0.451864 -1.394058 0.795008 0.238402 -0.900369 -1.799983
3.600000 0.460324 -1.419916 0.708818 0.226819 -0.782283 -1.895052
3.633333 0.468782 -1.445179 0.603337 0.213401 -0.665810 -1.909189
3.666667 0.477232 -1.469831 0.515150 0.199047 -0.552635 -1.862606
3.700000 0.481863 -1.478169 0.438242 0.185042 -0.444451 -1.781558
3.733333 0.486483 -1.485883 0.351797 0.172562 -0.341634 -1.689995
3.766667 0.491092 -1.492975 0.310418 0.162437 -0.243136 -1.610363
3.800000 0.495689 -1.499448 0.315043 0.155578 -0.147647 -1.563484
3.833333 0.500275 -1.505306 0.319326 0.152695 -0.054679 -1.563602
3.866667 0.504849 -1.510553 0.322548 0.154139 0.035314 -1.608185
3.900000 0.507816 -1.507264 0.287526 0.159342 0.122998 -1.686614
3.933333 0.510774 -1.503382 0.223206 0.167707 0.208507 -1.791725
3.966667 0.514945 -1.493989 0.139492 0.178437 0.291524 -1.908305
4.000000 0.520896 -1.479987 0.028790 0.190359 0.370792 -2.020203
4.033333 0.529002 -1.461856 -0.081868 0.202161 0.444957 -2.112918
4.066667 0.537098 -1.443220 -0.158608 0.212680 0.513008 -2.181757
4.100000 0.545177 -1.424108 -0.243742 0.221076 0.573862 -2.228317
4.133333 0.554305 -1.401511 -0.313843 0.226575 0.625959 -2.254211
4.166667 0.563409 -1.378501 -0.390922 0.228379 0.668543 -2.265518
4.200000 0.572484 -1.355112 -0.454053 0.226163 0.701998 -2.270242
4.233333 0.580975 -1.329021 -0.502891 0.220137 0.727545 -2.271906
4.266667 0.588517 -1.301227 -0.551623 0.210593 0.746297 -2.260479
4.300000 0.595526 -1.272953 -0.598980 0.197954 0.758891 -2.224169
4.333333 0.601993 -1.245634 -0.687187 0.182789 0.766694 -2.142707
4.366667 0.607668 -1.220672 -0.808320 0.166219 0.770875 -1.997615
4.400000 0.613298 -1.195550 -0.938944 0.149054 0.771407 -1.766771
4.433333 0.618882 -1.170301 -1.037110 0.131774 0.768146 -1.428948
4.466667 0.624418 -1.144959 -1.105114 0.114707 0.760285 -0.979651
4.500000 0.626142 -1.119437 -1.138655 0.098414 0.747048 -0.422750
4.533333 0.627821 -1.093893 -1.178118 0.083281 0.727212 0.220075
4.566667 0.629460 -1.068360 -1.208832 0.069258 0.699146 0.919176
4.600000 0.631062 -1.042874 -1.178604 0.056466 0.661883 1.633824
4.633333 0.632631 -1.017469 -1.096706 0.045072 0.614268 2.313988
4.666667 0.634171 -0.992179 -0.953071 0.035110 0.556006 2.913772
4.700000 0.635686 -0.967039 -0.801758 0.026026 0.486813 3.396317
4.733333 0.635749 -0.951257 -0.642063 0.017423 0.407282 3.736461
4.766667 0.635796 -0.935682 -0.438801 0.008970 0.318232 3.917451
4.800000 0.635867 -0.931116 -0.241047 0.000145 0.221807 3.938896
4.833333 0.635932 -0.926792 -0.049499 -0.009575 0.120161 3.815724
4.866667 0.635997 -0.922722 0.112473 -0.020404 0.015835 3.575510
4.900000 0.636067 -0.918915 0.227340 -0.032243 -0.088634 3.250111
4.933333 0.635403 -0.925876 0.325788 -0.045190 -0.191581 2.872880
4.966667 0.634757 -0.933109 0.392052 -0.059340 -0.291585 2.481949
5.000000 0.631706 -0.950623 0.437471 -0.074223 -0.388110 2.107903
5.033333 0.628687 -0.968396 0.467421 -0.089301 -0.480722 1.773338
5.066667 0.625709 -0.986416 0.496182 -0.104035 -0.569052 1.493069
5.100000 0.622782 -1.004668 0.517132 -0.117794 -0.652662 1.272644
5.133333 0.617626 -1.029908 0.556330 -0.129716 -0.731113 1.112593
5.166667 0.612541 -1.055346 0.594285 -0.138946 -0.803480 1.008080
5.200000 0.606305 -1.085601 0.625000 -0.145085 -0.869203 0.950781
5.233333 0.600164 -1.116007 0.654319 -0.147790 -0.927204 0.932292
5.266667 0.593848 -1.149088 0.689708 -0.146739 -0.976292 0.936391
5.300000 0.587687 -1.185223 0.703341 -0.141726 -1.014716 0.948565
5.333333 0.582095 -1.223453 0.730459 -0.132930 -1.041033 0.953945
5.366667 0.577430 -1.262905 0.739997 -0.120595 -1.053959 0.935115
5.400000 0.572925 -1.302345 0.782251 -0.105054 -1.052277 0.875702
5.433333 0.569672 -1.340852 0.820036 -0.086678 -1.035126 0.764359
5.466667 0.566600 -1.379275 0.870414 -0.065806 -1.002295 0.605871
5.500000 0.563720 -1.417576 0.927388 -0.042568 -0.954680 0.408649
5.533333 0.562412 -1.452744 0.980163 -0.016647 -0.892988 0.187443
5.566667 0.562243 -1.483805 1.021398 0.012710 -0.818281 -0.035043
5.600000 0.563053 -1.511108 1.020385 0.046188 -0.732408 -0.230145
5.633333 0.564909 -1.532529 0.979074 0.084830 -0.638089 -0.373761
5.666667 0.566998 -1.553688 0.913168 0.129341 -0.538322 -0.454316
5.700000 0.569323 -1.574568 0.804399 0.179978 -0.435924 -0.459071
5.733333 0.573230 -1.588490 0.712596 0.236478 -0.334065 -0.382234
5.766667 0.579095 -1.596330 0.658454 0.297735 -0.236009 -0.230373
5.800000 0.587748 -1.599212 0.679965 0.362665 -0.144261 -0.022646
5.833333 0.599679 -1.598597 0.711148 0.429189 -0.060427 0.215689
5.866667 0.615425 -1.594923 0.743676 0.495252 0.013936 0.460779
5.900000 0.636097 -1.588731 0.801744 0.558658 0.077362 0.681101
5.933333 0.656991 -1.582251 0.854516 0.617625 0.129487 0.850806
5.966667 0.683658 -1.574343 0.906657 0.670378 0.170498 0.954559
6.000000 0.710512 -1.566168 0.958330 0.715320 0.200901 0.989982
6.033333 0.737534 -1.557739 1.005796 0.751525 0.221179 0.963015
6.066667 0.764702 -1.549067 1.036001 0.778447 0.232519 0.883198
6.100000 0.791996 -1.540164 1.055048 0.796016 0.236328 0.768730
6.133333 0.819396 -1.531043 1.088256 0.803697 0.233326 0.633592
6.166667 0.846881 -1.521714 1.095204 0.802008 0.224330 0.491301
6.200000 0.875765 -1.513600 1.105512 0.791537 0.210232 0.351628
6.233333 0.904691 -1.505302 1.123555 0.773106 0.192052 0.223422
6.266667 0.933637 -1.496831 1.130416 0.746981 0.170404 0.112873
6.300000 0.961056 -1.490455 1.128077 0.713492 0.146187 0.021421
6.333333 0.986133 -1.485978 1.120811 0.673638 0.120732 -0.045271
6.366667 1.008334 -1.483660 1.097650 0.628074 0.095282 -0.084824
6.400000 1.030481 -1.481198 1.080314 0.577289 0.070658 -0.097182
6.433333 1.048736 -1.480513 1.081448 0.521864 0.047651 -0.085596
6.466667 1.062570 -1.481348 1.068623 0.463493 0.027308 -0.054048
6.500000 1.076322 -1.482044 1.055615 0.403946 0.010223 -0.009623
6.533333 1.089987 -1.482601 1.053584 0.344749 -0.003460 0.036943
6.566667 1.103560 -1.483018 1.060829 0.286757 -0.013955 0.071398
6.600000 1.112530 -1.484036 1.069083 0.231308 -0.021247 0.081371
6.633333 1.117565 -1.485407 1.088229 0.179264 -0.025596 0.057853
6.666667 1.119468 -1.486855 1.102763 0.130638 -0.027586 -0.003593
6.700000 1.121290 -1.488160 1.122727 0.085244 -0.027659 -0.101624
6.733333 1.120663 -1.489469 1.140320 0.043035 -0.026112 -0.232836
6.766667 1.119976 -1.490632 1.151465 0.004636 -0.023163 -0.387910
6.800000 1.119244 -1.491646 1.141176 -0.029836 -0.019238 -0.556940
6.833333 1.118478 -1.492511 1.104058 -0.060275 -0.014699 -0.728054
6.866667 1.117691 -1.493224 1.062806 -0.086591 -0.009795 -0.893290
6.900000 1.114482 -1.493438 1.005250 -0.108382 -0.004808 -1.044294
6.933333 1.109191 -1.493130 0.947223 -0.125475 -0.000032 -1.171102
6.966667 1.102038 -1.492616 0.889111 -0.137801 0.004373 -1.263846
7.000000 1.094930 -1.491946 0.854059 -0.145285 0.008368 -1.317677
7.033333 1.087889 -1.491119 0.820439 -0.147695 0.011961 -1.333701
