t x y theta dxdt dydt dthetadt
0.000000 0.000000 0.000000 0.030885 0.079890 -0.032001 0.021818
0.033333 0.015764 -0.006432 0.034102 0.133353 -0.053371 0.037865
0.066667 0.031569 -0.012828 0.033961 0.200407 -0.080140 0.059705
0.100000 0.047417 -0.019188 0.029593 0.281161 -0.112336 0.087705
0.133333 0.063308 -0.025513 0.029300 0.349131 -0.139331 0.115068
0.166667 0.079247 -0.031804 0.036973 0.404475 -0.161193 0.140503
0.200000 0.095198 -0.038139 0.044167 0.447182 -0.177946 0.164184
0.233333 0.111279 -0.044549 0.058883 0.477204 -0.189585 0.182237
0.266667 0.127413 -0.050926 0.069932 0.494507 -0.196122 0.192771
0.300000 0.143814 -0.057428 0.073209 0.499034 -0.197551 0.194371
0.333333 0.160526 -0.064071 0.073435 0.503985 -0.199174 0.188745
0.366667 0.177564 -0.070857 0.096261 0.509212 -0.200927 0.174869
0.400000 0.194660 -0.077608 0.103482 0.514623 -0.202759 0.151992
0.433333 0.211816 -0.084324 0.103503 0.520134 -0.204637 0.121159
0.466667 0.229283 -0.091186 0.108765 0.525618 -0.206495 0.082670
0.500000 0.246811 -0.098013 0.102439 0.530988 -0.208301 0.037893
0.533333 0.264611 -0.104967 0.108231 0.536179 -0.210027 -0.012332
0.566667 0.282662 -0.112042 0.115660 0.541159 -0.211663 -0.064022
0.600000 0.300955 -0.119247 0.118738 0.545897 -0.213188 -0.116043
0.633333 0.319311 -0.126413 0.113833 0.550357 -0.214569 -0.164694
0.666667 0.337863 -0.133697 0.102090 0.554538 -0.215784 -0.207531
0.700000 0.356478 -0.140938 0.083898 0.558412 -0.216789 -0.243020
0.733333 0.375155 -0.148136 0.081034 0.561978 -0.217565 -0.268687
0.766667 0.393989 -0.155437 0.059434 0.565236 -0.218091 -0.282315
0.800000 0.412953 -0.162808 0.044991 0.568211 -0.218366 -0.283429
0.833333 0.432034 -0.170223 0.034314 0.570936 -0.218385 -0.273965
0.866667 0.451175 -0.177588 0.020698 0.573448 -0.218154 -0.254475
0.900000 0.470376 -0.184901 0.007890 0.575790 -0.217681 -0.226829
0.933333 0.489634 -0.192162 0.005808 0.577987 -0.216953 -0.192310
0.966667 0.508937 -0.199405 0.009357 0.580066 -0.215969 -0.156422
1.000000 0.528315 -0.206640 -0.004496 0.582046 -0.214719 -0.119023
1.033333 0.547750 -0.213846 -0.004801 0.583953 -0.213215 -0.081415
1.066667 0.567244 -0.221002 -0.004815 0.585803 -0.211453 -0.044551
1.100000 0.586806 -0.228081 0.000718 0.587608 -0.209432 -0.010022
1.133333 0.606422 -0.235097 -0.008240 0.589378 -0.207166 0.021752
1.166667 0.626106 -0.242021 -0.003646 0.591112 -0.204650 0.049088
1.200000 0.645856 -0.248848 -0.008379 0.592798 -0.201880 0.070354
1.233333 0.665656 -0.255608 -0.003520 0.594423 -0.198846 0.085717
1.266667 0.685519 -0.262216 0.004123 0.595972 -0.195568 0.094067
1.300000 0.705429 -0.268754 0.016117 0.597435 -0.192063 0.095276
1.333333 0.725393 -0.275115 0.020115 0.598801 -0.188327 0.087708
1.366667 0.745401 -0.281403 0.026249 0.600069 -0.184376 0.075429
1.400000 0.765456 -0.287478 0.034698 0.601251 -0.180228 0.057025
1.433333 0.785553 -0.293478 0.038571 0.602363 -0.175866 0.033024
1.466667 0.805691 -0.299402 0.041181 0.603424 -0.171247 0.003006
1.500000 0.825833 -0.305079 0.015323 0.604457 -0.166302 -0.025569
1.533333 0.845972 -0.310457 0.021248 0.605489 -0.160970 -0.051433
1.566667 0.866148 -0.315757 0.025701 0.606551 -0.155133 -0.073419
1.600000 0.886359 -0.320979 0.028075 0.607664 -0.148653 -0.087810
1.633333 0.906603 -0.326123 0.017533 0.608844 -0.141417 -0.092479
1.666667 0.926880 -0.330896 0.015320 0.610110 -0.133307 -0.081986
1.700000 0.947187 -0.335590 0.000900 0.611477 -0.124231 -0.063358
1.733333 0.967576 -0.339854 -0.004168 0.612951 -0.114132 -0.034334
1.766667 0.988051 -0.343648 -0.001190 0.614530 -0.103053 0.003432
1.800000 1.008551 -0.347366 -0.022644 0.616212 -0.091083 0.050981
1.833333 1.029092 -0.350514 -0.002376 0.617989 -0.078404 0.103075
1.866667 1.049676 -0.353067 -0.005222 0.619842 -0.065263 0.154594
1.900000 1.070348 -0.355022 0.002559 0.621744 -0.051988 0.204208
1.933333 1.091093 -0.356403 0.011864 0.623667 -0.038917 0.247380
1.966667 1.111911 -0.357236 0.025443 0.625585 -0.026369 0.280607
2.000000 1.132795 -0.357577 0.045673 0.627464 -0.014698 0.297048
2.033333 1.153738 -0.357491 0.061705 0.629278 -0.004171 0.299781
2.066667 1.174788 -0.357026 0.072436 0.631008 0.005007 0.288625
2.100000 1.195922 -0.356229 0.082775 0.632643 0.012730 0.264592
2.133333 1.217135 -0.355154 0.101197 0.634169 0.018934 0.229772
2.166667 1.238348 -0.354050 0.107759 0.635582 0.023631 0.187673
2.200000 1.259560 -0.352923 0.112394 0.636888 0.026916 0.143362
2.233333 1.280767 -0.351780 0.119003 0.638088 0.028919 0.097352
2.266667 1.302083 -0.350593 0.114256 0.639177 0.029797 0.052433
2.300000 1.323389 -0.349403 0.097160 0.640158 0.029712 0.013267
2.333333 1.344751 -0.348250 0.108134 0.641032 0.028832 -0.019285
2.366667 1.366169 -0.347184 0.109575 0.641789 0.027262 -0.043553
2.400000 1.387632 -0.346240 0.110643 0.642406 0.025111 -0.061150
2.433333 1.409073 -0.345317 0.100335 0.642858 0.022453 -0.071582
2.466667 1.430588 -0.344582 0.099934 0.643134 0.019308 -0.078436
2.500000 1.452075 -0.343881 0.079881 0.643212 0.015675 -0.084175
2.533333 1.473606 -0.343428 0.086929 0.643076 0.011583 -0.089599
2.566667 1.495102 -0.343021 0.084221 0.642716 0.007110 -0.097595
2.600000 1.516559 -0.342666 0.086152 0.642139 0.002260 -0.109186
2.633333 1.537972 -0.342369 0.084865 0.641353 -0.002958 -0.125910
2.666667 1.559381 -0.342455 0.082587 0.640362 -0.008504 -0.143430
2.700000 1.580755 -0.342962 0.081509 0.639169 -0.014338 -0.164247
2.733333 1.602076 -0.343542 0.077308 0.637788 -0.020508 -0.186401
2.766667 1.623340 -0.344201 0.068877 0.636230 -0.027111 -0.206517
2.800000 1.644570 -0.345349 0.048455 0.634502 -0.034156 -0.218687
2.833333 1.665735 -0.346584 0.051114 0.632611 -0.041678 -0.220547
2.866667 1.686831 -0.347910 0.040871 0.630571 -0.049746 -0.213504
2.900000 1.707857 -0.349331 0.025113 0.628400 -0.058451 -0.194480
2.933333 1.728799 -0.351275 0.001800 0.626109 -0.067796 -0.163277
2.966667 1.749663 -0.353321 -0.004862 0.623713 -0.077730 -0.123907
3.000000 1.770408 -0.355853 -0.001831 0.621228 -0.088242 -0.082796
3.033333 1.791068 -0.358863 -0.003279 0.618672 -0.099255 -0.043327
3.066667 1.811646 -0.362328 -0.005314 0.616057 -0.110620 -0.007073
3.100000 1.832136 -0.366238 0.003186 0.613392 -0.122112 0.021568
3.133333 1.852561 -0.370572 0.008443 0.610679 -0.133531 0.038871
3.166667 1.872896 -0.375326 0.026830 0.607915 -0.144690 0.043887
3.200000 1.893122 -0.380496 0.030354 0.605083 -0.155399 0.039450
3.233333 1.913241 -0.386070 0.028074 0.602163 -0.165504 0.025075
3.266667 1.933290 -0.392053 0.028765 0.599127 -0.174918 -0.000380
3.300000 1.953226 -0.398150 0.020870 0.595946 -0.183638 -0.030974
3.333333 1.973084 -0.404615 0.023382 0.592593 -0.191683 -0.064550
3.366667 1.992849 -0.411414 0.018186 0.589038 -0.199088 -0.094737
3.400000 2.012490 -0.418324 0.019478 0.585250 -0.205912 -0.122766
3.433333 2.032003 -0.425341 0.002549 0.581187 -0.212238 -0.142120
3.466667 2.051384 -0.432465 0.008941 0.576811 -0.218158 -0.149502
3.500000 2.070615 -0.439823 -0.003460 0.572077 -0.223722 -0.147112
3.533333 2.089671 -0.447396 0.007351 0.566937 -0.228989 -0.136674
3.566667 2.108579 -0.455183 -0.023968 0.561361 -0.234025 -0.121138
3.600000 2.127310 -0.463160 -0.044092 0.555340 -0.238864 -0.098086
3.633333 2.145823 -0.471298 -0.045030 0.548876 -0.243513 -0.074042
3.666667 2.164186 -0.479527 -0.038382 0.541987 -0.247953 -0.049845
3.700000 2.182293 -0.487893 -0.027444 0.534692 -0.252181 -0.028702
3.733333 2.200115 -0.496395 -0.025862 0.527008 -0.256174 -0.010858
3.766667 2.217607 -0.505042 -0.018889 0.518954 -0.259912 0.000585
3.800000 2.234806 -0.513814 -0.017900 0.510543 -0.263388 0.000970
3.833333 2.251666 -0.522731 -0.017372 0.501829 -0.266601 -0.007272
3.866667 2.268171 -0.531768 -0.020089 0.492830 -0.269542 -0.025707
3.900000 2.284508 -0.540873 -0.023760 0.483561 -0.272188 -0.051109
3.933333 2.300677 -0.550041 -0.021578 0.474030 -0.274509 -0.077656
3.966667 2.316378 -0.559300 -0.023951 0.464249 -0.276473 -0.102685
4.000000 2.331909 -0.568614 -0.017384 0.454161 -0.278017 -0.124344
4.033333 2.346931 -0.578011 -0.026005 0.443642 -0.279051 -0.141441
4.066667 2.361340 -0.587420 -0.058570 0.432601 -0.279479 -0.149073
4.100000 2.375576 -0.596872 -0.049655 0.420996 -0.279225 -0.146159
4.133333 2.389639 -0.606362 -0.060232 0.408784 -0.278195 -0.137183
4.166667 2.403527 -0.615887 -0.057294 0.395887 -0.276299 -0.121185
4.200000 2.416792 -0.625327 -0.073576 0.382370 -0.273511 -0.093901
4.233333 2.429471 -0.634662 -0.090580 0.368384 -0.269888 -0.054107
4.266667 2.441506 -0.643812 -0.073283 0.354124 -0.265558 -0.002648
4.300000 2.453370 -0.652981 -0.067480 0.339748 -0.260603 0.060197
4.333333 2.464523 -0.661798 -0.084128 0.325529 -0.255203 0.136379
4.366667 2.474936 -0.670204 -0.072165 0.311839 -0.249541 0.221260
4.400000 2.484594 -0.678172 -0.072972 0.298982 -0.243785 0.306798
4.433333 2.494091 -0.686145 -0.058188 0.287168 -0.238044 0.379320
4.466667 2.502789 -0.693580 -0.058188 0.276573 -0.232405 0.430314
4.500000 2.511335 -0.701014 -0.029308 0.267374 -0.227031 0.438702
4.533333 2.519734 -0.708445 -0.029308 0.259606 -0.221984 0.389189
4.566667 2.527990 -0.715871 0.007140 0.253231 -0.217321 0.261707
4.600000 2.536109 -0.723288 0.091379 0.248150 -0.213036 0.047411
4.633333 2.544053 -0.730218 0.118904 0.244395 -0.209191 -0.258099
4.666667 2.551868 -0.737136 0.131716 0.242022 -0.205793 -0.665116
4.700000 2.559916 -0.743625 0.131716 0.241140 -0.202875 -1.144292
4.733333 2.567844 -0.750098 0.090194 0.241903 -0.200496 -1.678631
4.766667 2.575656 -0.756555 0.027212 0.244367 -0.198714 -2.234730
4.800000 2.583356 -0.762993 0.027212 0.248636 -0.197624 -2.794022
4.833333 2.590948 -0.769412 -0.159271 0.254615 -0.197208 -3.315735
4.866667 2.598436 -0.775809 -0.294479 0.262139 -0.197478 -3.763685
4.900000 2.606865 -0.782201 -0.548721 0.270903 -0.198346 -4.122557
4.933333 2.615198 -0.788569 -0.668315 0.280597 -0.199726 -4.384088
4.966667 2.624582 -0.795095 -0.902591 0.290903 -0.201513 -4.525451
5.000000 2.634968 -0.801862 -1.080231 0.301474 -0.203596 -4.526170
5.033333 2.646354 -0.808931 -1.180494 0.312038 -0.205903 -4.406075
5.066667 2.657646 -0.815966 -1.317963 0.322351 -0.208334 -4.180427
5.100000 2.668843 -0.822964 -1.549501 0.332271 -0.210802 -3.870618
5.133333 2.679944 -0.829924 -1.693654 0.341658 -0.213218 -3.477415
5.166667 2.690948 -0.836841 -1.836725 0.350620 -0.215542 -3.038495
5.200000 2.702626 -0.844080 -1.918605 0.359305 -0.217740 -2.582930
5.233333 2.714996 -0.851600 -1.974247 0.367846 -0.219784 -2.115831
5.266667 2.727261 -0.859068 -2.051374 0.376356 -0.221680 -1.642476
5.300000 2.739420 -0.866479 -2.058130 0.384923 -0.223462 -1.181575
5.333333 2.752243 -0.873994 -2.074536 0.393575 -0.225149 -0.753424
5.366667 2.765742 -0.881595 -2.064144 0.402092 -0.226744 -0.364938
5.400000 2.779911 -0.889281 -2.087631 0.410190 -0.228250 -0.018684
5.433333 2.793955 -0.896894 -2.078414 0.417692 -0.229707 0.276586
5.466667 2.807868 -0.904429 -2.050883 0.424413 -0.231159 0.512260
5.500000 2.822334 -0.912090 -2.022500 0.430113 -0.232634 0.697099
5.533333 2.837268 -0.919913 -1.986601 0.434629 -0.234163 0.834561
5.566667 2.852050 -0.927643 -1.925682 0.437926 -0.235729 0.930581
5.600000 2.867215 -0.935657 -1.891515 0.440039 -0.237345 0.987115
5.633333 2.882213 -0.943566 -1.839881 0.440943 -0.238999 1.008472
5.666667 2.897035 -0.951365 -1.798923 0.440613 -0.240645 1.001627
5.700000 2.912060 -0.959612 -1.756141 0.439090 -0.242269 0.972772
5.733333 2.926893 -0.967736 -1.736106 0.436430 -0.243920 0.928068
5.766667 2.941525 -0.975731 -1.709436 0.432622 -0.245718 0.875307
5.800000 2.956145 -0.984236 -1.676652 0.427623 -0.247710 0.816728
5.833333 2.970546 -0.992598 -1.667105 0.421390 -0.249941 0.759489
5.866667 2.984722 -1.000810 -1.646671 0.413864 -0.252450 0.705837
5.900000 2.998662 -1.008865 -1.621210 0.405030 -0.255268 0.657538
5.933333 3.012348 -1.017342 -1.594296 0.394875 -0.258279 0.614014
5.966667 3.025782 -1.025646 -1.572625 0.383456 -0.261299 0.573326
6.000000 3.038825 -1.034307 -1.548737 0.370914 -0.264164 0.538989
6.033333 3.051381 -1.043270 -1.527721 0.357307 -0.266679 0.507304
6.066667 3.063361 -1.052487 -1.522040 0.342815 -0.268601 0.477666
6.100000 3.074662 -1.061917 -1.505187 0.327604 -0.269647 0.446563
6.133333 3.085130 -1.071475 -1.503559 0.311719 -0.269640 0.415301
6.166667 3.095304 -1.080804 -1.485474 0.295029 -0.268425 0.379042
6.200000 3.104505 -1.090214 -1.477498 0.277375 -0.265890 0.334784
6.233333 3.113400 -1.099374 -1.455527 0.258780 -0.261988 0.276523
6.266667 3.121986 -1.108272 -1.448790 0.239016 -0.256760 0.199797
6.300000 3.130257 -1.116899 -1.434572 0.217789 -0.250321 0.103138
6.333333 3.138208 -1.125244 -1.423556 0.194993 -0.242800 -0.015250
6.366667 3.144529 -1.133394 -1.399903 0.170927 -0.234342 -0.146418
6.400000 3.150524 -1.141240 -1.409304 0.145787 -0.225099 -0.285362
6.433333 3.156190 -1.148773 -1.419824 0.119682 -0.215192 -0.417322
6.466667 3.159857 -1.155931 -1.428519 0.093065 -0.204726 -0.531730
6.500000 3.161452 -1.162640 -1.473580 0.066462 -0.193766 -0.614247
6.533333 3.162718 -1.169005 -1.496215 0.040305 -0.182344 -0.657524
6.566667 3.163656 -1.175014 -1.549563 0.014574 -0.170477 -0.659014
6.600000 3.162493 -1.180472 -1.614067 -0.010545 -0.158172 -0.616546
6.633333 3.161010 -1.185555 -1.668730 -0.034932 -0.145401 -0.535887
6.666667 3.159211 -1.190255 -1.679721 -0.058663 -0.132141 -0.421686
6.700000 3.157100 -1.194562 -1.667534 -0.081936 -0.118336 -0.291628
6.733333 3.154684 -1.198467 -1.665232 -0.104978 -0.103876 -0.156899
6.766667 3.151966 -1.201961 -1.651899 -0.127760 -0.088631 -0.032389
6.800000 3.147572 -1.204869 -1.661189 -0.150435 -0.072452 0.068618
6.833333 3.141595 -1.207167 -1.644574 -0.172918 -0.055275 0.136654
6.866667 3.135338 -1.209029 -1.612699 -0.195101 -0.036951 0.166666
6.900000 3.127774 -1.210175 -1.595277 -0.216669 -0.017438 0.167092
6.933333 3.119948 -1.210871 -1.579710 -0.237234 0.003271 0.143082
6.966667 3.111090 -1.210701 -1.580553 -0.256372 0.025122 0.104783
7.000000 3.101991 -1.210066 -1.577276 -0.273744 0.048071 0.059980
7.033333 3.092148 -1.208415 -1.585078 -0.289231 0.072156 0.019778
7.066667 3.081688 -1.205651 -1.585998 -0.302678 0.097202 -0.009328
7.100000 3.070743 -1.201687 -1.598304 -0.314096 0.123122 -0.028695
7.133333 3.059607 -1.197237 -1.618592 -0.323513 0.149781 -0.037294
7.166667 3.048293 -1.192300 -1.631800 -0.331136 0.177030 -0.035854
7.200000 3.036774 -1.185942 -1.631427 -0.337011 0.204673 -0.026172
7.233333 3.025104 -1.179092 -1.614402 -0.341156 0.232505 -0.014714
7.266667 3.013378 -1.170860 -1.597987 -0.343610 0.260468 -0.004047
7.300000 3.001646 -1.161289 -1.599116 -0.344382 0.288462 0.005741
7.333333 2.989802 -1.151224 -1.604485 -0.343471 0.316393 0.012494
7.366667 2.978076 -1.139915 -1.592496 -0.340821 0.344142 0.009255
7.400000 2.966263 -1.128115 -1.592752 -0.336465 0.371658 -0.001445
7.433333 2.954716 -1.115187 -1.602137 -0.330505 0.398770 -0.016686
7.466667 2.943463 -1.101167 -1.605172 -0.323071 0.425305 -0.041038
7.500000 2.932161 -1.086664 -1.602043 -0.314291 0.451176 -0.076129
7.533333 2.921327 -1.071166 -1.629551 -0.304381 0.476262 -0.122108
7.566667 2.911034 -1.054695 -1.620682 -0.293567 0.500523 -0.170862
7.600000 2.901384 -1.037294 -1.602278 -0.282044 0.523865 -0.225418
7.633333 2.892442 -1.019008 -1.598190 -0.269961 0.546310 -0.287400
7.666667 2.884281 -0.999847 -1.595803 -0.257544 0.567853 -0.347896
7.700000 2.876134 -0.980242 -1.634309 -0.245047 0.588411 -0.400783
7.733333 2.868009 -0.960202 -1.651338 -0.232653 0.607987 -0.442962
7.766667 2.859914 -0.939735 -1.661756 -0.220442 0.626615 -0.472054
7.800000 2.852572 -0.918509 -1.716336 -0.208531 0.644341 -0.479728
7.833333 2.845936 -0.896552 -1.725233 -0.197004 0.661203 -0.461012
7.866667 2.839998 -0.873913 -1.756246 -0.185820 0.677264 -0.417977
7.900000 2.834117 -0.850886 -1.767375 -0.174934 0.692592 -0.357777
7.933333 2.828840 -0.827262 -1.790947 -0.164379 0.707187 -0.282085
7.966667 2.823632 -0.803272 -1.800264 -0.154278 0.720993 -0.197229
8.000000 2.818498 -0.778926 -1.796004 -0.144634 0.733983 -0.110711
8.033333 2.813844 -0.754115 -1.790318 -0.135431 0.746140 -0.029101
8.066667 2.809636 -0.728847 -1.784910 -0.126671 0.757444 0.042826
8.100000 2.805836 -0.703169 -1.756280 -0.118379 0.767880 0.105503
8.133333 2.802128 -0.677183 -1.778071 -0.110484 0.777488 0.157594
8.166667 2.798514 -0.650900 -1.753084 -0.102915 0.786324 0.196498
8.200000 2.795208 -0.624341 -1.753666 -0.095695 0.794410 0.221643
8.233333 2.792188 -0.597543 -1.750215 -0.088851 0.801766 0.234650
8.266667 2.789443 -0.570593 -1.745487 -0.082412 0.808438 0.238337
8.300000 2.786944 -0.543430 -1.732652 -0.076346 0.814485 0.233910
8.333333 2.784673 -0.516093 -1.710875 -0.070669 0.819969 0.220499
8.366667 2.782512 -0.488534 -1.702827 -0.065388 0.824934 0.203304
8.400000 2.780528 -0.460876 -1.695750 -0.060469 0.829455 0.184607
8.433333 2.778659 -0.433023 -1.676949 -0.055883 0.833592 0.163461
8.466667 2.776929 -0.405127 -1.680604 -0.051594 0.837379 0.139866
8.500000 2.775316 -0.377060 -1.681596 -0.047583 0.840829 0.117295
8.533333 2.773813 -0.348995 -1.686764 -0.043815 0.843942 0.098912
8.566667 2.772429 -0.320785 -1.693049 -0.040243 0.846750 0.083246
8.600000 2.771168 -0.292442 -1.681587 -0.036836 0.849242 0.071090
8.633333 2.770030 -0.263978 -1.688520 -0.033581 0.851415 0.066517
8.666667 2.769016 -0.235407 -1.669204 -0.030485 0.853239 0.067896
8.700000 2.768048 -0.206916 -1.672863 -0.027537 0.854720 0.071605
8.733333 2.767207 -0.178343 -1.665110 -0.024736 0.855843 0.074560
8.766667 2.766494 -0.149700 -1.679492 -0.022081 0.856578 0.077694
8.800000 2.765911 -0.121000 -1.671355 -0.019571 0.856917 0.078557
8.833333 2.765338 -0.092345 -1.660380 -0.017204 0.856861 0.075050
8.866667 2.764777 -0.063715 -1.650620 -0.014946 0.856439 0.067128
8.900000 2.764350 -0.035065 -1.672015 -0.012788 0.855646 0.058186
8.933333 2.763929 -0.006497 -1.645094 -0.010704 0.854504 0.047908
8.966667 2.763643 0.022066 -1.659762 -0.008668 0.853038 0.036050
9.000000 2.763357 0.050519 -1.643195 -0.006643 0.851270 0.023493
9.033333 2.763209 0.078943 -1.646595 -0.004590 0.849215 0.009822
9.066667 2.763049 0.107231 -1.643540 -0.002488 0.846874 -0.001927
9.100000 2.763030 0.135466 -1.665247 -0.000322 0.844263 -0.014748
9.133333 2.763019 0.163617 -1.656253 0.001925 0.841381 -0.026266
9.166667 2.763018 0.191666 -1.652770 0.004266 0.838228 -0.035880
9.200000 2.763163 0.219626 -1.660823 0.006710 0.834793 -0.041065
9.233333 2.763455 0.247486 -1.652927 0.009259 0.831070 -0.042746
9.266667 2.763762 0.275193 -1.654147 0.011903 0.827042 -0.041285
9.300000 2.764218 0.302777 -1.671250 0.014643 0.822697 -0.037507
9.333333 2.764680 0.330192 -1.657886 0.017461 0.818014 -0.032293
9.366667 2.765294 0.357460 -1.673490 0.020337 0.812976 -0.024474
9.400000 2.766064 0.384572 -1.666896 0.023251 0.807568 -0.019588
9.433333 2.766855 0.411460 -1.666206 0.026184 0.801768 -0.013826
9.466667 2.767803 0.438169 -1.680289 0.029129 0.795562 -0.009708
9.500000 2.768778 0.464670 -1.667154 0.032091 0.788937 -0.007346
9.533333 2.769915 0.490970 -1.652146 0.035082 0.781892 -0.004120
9.566667 2.771216 0.517059 -1.672285 0.038115 0.774424 -0.003239
9.600000 2.772542 0.542877 -1.652952 0.041208 0.766517 -0.000497
9.633333 2.773922 0.568394 -1.664449 0.044388 0.758175 0.003787
9.666667 2.775344 0.593568 -1.679666 0.047694 0.749413 0.011169
9.700000 2.776937 0.618490 -1.659517 0.051149 0.740225 0.021948
9.733333 2.778702 0.643151 -1.670057 0.054777 0.730598 0.035225
9.766667 2.780513 0.667382 -1.667505 0.058621 0.720496 0.049625
9.800000 2.782499 0.691334 -1.674263 0.062708 0.709918 0.067848
9.833333 2.784565 0.714874 -1.673677 0.067067 0.698807 0.085604
9.866667 2.786810 0.738117 -1.661305 0.071719 0.687038 0.101677
9.900000 2.789237 0.761054 -1.658091 0.076700 0.674477 0.118911
9.933333 2.791791 0.783416 -1.645610 0.082070 0.660940 0.134086
9.966667 2.794531 0.805455 -1.629203 0.087853 0.646297 0.144790
10.000000 2.797458 0.827165 -1.631616 0.094101 0.630322 0.141888
10.033333 2.800590 0.848161 -1.638604 0.100833 0.612893 0.124065
10.066667 2.803912 0.868813 -1.636625 0.108051 0.594009 0.089077
10.100000 2.807499 0.888642 -1.639613 0.115724 0.573731 0.034922
10.133333 2.811278 0.908113 -1.610539 0.123775 0.552221 -0.041324
10.166667 2.815388 0.926687 -1.607498 0.132120 0.529602 -0.133980
10.200000 2.819852 0.944254 -1.591410 0.140598 0.506159 -0.238120
10.233333 2.824713 0.960679 -1.595827 0.149056 0.482147 -0.340673
10.266667 2.829980 0.975883 -1.594282 0.157298 0.457800 -0.429572
10.300000 2.835443 0.990710 -1.641267 0.165152 0.433355 -0.486679
10.333333 2.841340 1.004192 -1.674784 0.172419 0.409046 -0.482954
10.366667 2.847433 1.017293 -1.720547 0.178949 0.385135 -0.394677
10.400000 2.853723 1.030015 -1.750858 0.184684 0.361803 -0.200033
10.433333 2.860254 1.041498 -1.766008 0.189590 0.339178 0.103041
10.466667 2.866980 1.052602 -1.806399 0.193739 0.317322 0.518040
10.500000 2.873753 1.062621 -1.856442 0.197213 0.296310 1.028043
10.533333 2.880442 1.071648 -1.879276 0.200217 0.276159 1.603140
10.566667 2.887325 1.080304 -1.806861 0.202933 0.256872 2.205996
10.600000 2.893974 1.088139 -1.728784 0.205548 0.238493 2.804912
10.633333 2.900815 1.095610 -1.574831 0.208262 0.221045 3.367200
10.666667 2.907514 1.102331 -1.387832 0.211248 0.204636 3.855502
10.700000 2.914406 1.108697 -1.191752 0.214660 0.189287 4.243762
10.733333 2.921492 1.114712 -1.007029 0.218547 0.174981 4.513826
10.766667 2.928683 1.120100 -0.804959 0.222967 0.161725 4.658220
10.800000 2.936068 1.125149 -0.618069 0.227892 0.149439 4.666118
10.833333 2.943642 1.129685 -0.457133 0.233275 0.138086 4.545560
10.866667 2.951449 1.133772 -0.328387 0.238985 0.127579 4.314690
10.900000 2.959451 1.137539 -0.167213 0.244889 0.117926 3.993235
10.933333 2.967716 1.141036 -0.000538 0.250871 0.109234 3.603908
10.966667 2.976235 1.144363 0.118768 0.256793 0.101548 3.174770
11.000000 2.984977 1.147647 0.235486 0.262559 0.094934 2.736216
11.033333 2.993911 1.150636 0.339932 0.268074 0.089436 2.310576
11.066667 3.003035 1.153337 0.389446 0.273318 0.085033 1.918553
11.100000 3.012350 1.155757 0.437494 0.278297 0.081590 1.577375
11.133333 3.021853 1.157902 0.456659 0.283038 0.078898 1.300682
11.166667 3.031545 1.159780 0.427533 0.287586 0.076788 1.089061
11.200000 3.041211 1.161998 0.406164 0.292010 0.075086 0.942108
11.233333 3.050902 1.164616 0.409851 0.296406 0.073607 0.857106
11.266667 3.060726 1.167689 0.427036 0.300854 0.072167 0.819259
11.300000 3.070734 1.170520 0.486307 0.305445 0.070656 0.812153
11.333333 3.080923 1.173112 0.543714 0.310281 0.068974 0.819099
11.366667 3.091292 1.175471 0.570623 0.315462 0.067014 0.827322
11.400000 3.101841 1.177602 0.638625 0.321048 0.064742 0.822636
11.433333 3.112567 1.179510 0.670093 0.327039 0.062181 0.799869
11.466667 3.123478 1.181576 0.689143 0.333430 0.059439 0.760592
11.500000 3.134563 1.183430 0.701018 0.340248 0.056610 0.718478
11.533333 3.145819 1.185077 0.723917 0.347468 0.053783 0.683407
11.566667 3.157427 1.186863 0.729966 0.355053 0.051018 0.663404
11.600000 3.169203 1.188451 0.756709 0.362981 0.048327 0.665169
11.633333 3.181427 1.190098 0.743335 0.371344 0.045669 0.682731
11.666667 3.194115 1.191769 0.749730 0.380214 0.042989 0.706138
11.700000 3.206961 1.193256 0.765381 0.389630 0.040179 0.714669
11.733333 3.219963 1.194565 0.810996 0.399653 0.037150 0.681394
11.766667 3.233115 1.195701 0.862650 0.410480 0.033837 0.578975
11.800000 3.246415 1.196667 0.901204 0.422399 0.030139 0.386892
11.833333 3.260848 1.197782 0.948420 0.435538 0.025945 0.086167
11.866667 3.275418 1.198738 0.987983 0.450156 0.021109 -0.332529
11.900000 3.290122 1.199538 1.026818 0.466375 0.015556 -0.875366
11.933333 3.304953 1.200186 1.044910 0.484317 0.009212 -1.527179
11.966667 3.321218 1.200626 0.997905 0.503772 0.002043 -2.262819
12.000000 3.337598 1.200924 0.914315 0.524369 -0.005930 -3.056641
12.033333 3.355383 1.200828 0.824637 0.545693 -0.014567 -3.875198
12.066667 3.373267 1.200599 0.631454 0.567137 -0.023665 -4.682026
12.100000 3.392469 1.199856 0.431855 0.588097 -0.033012 -5.434029
12.133333 3.412906 1.198553 0.229280 0.607884 -0.042327 -6.100536
12.166667 3.434518 1.196690 -0.038715 0.626046 -0.051290 -6.656141
12.200000 3.457190 1.194258 -0.310543 0.642075 -0.059532 -7.083154
12.233333 3.479901 1.191724 -0.591781 0.655692 -0.066792 -7.363013
12.266667 3.502637 1.189093 -0.885936 0.666704 -0.072848 -7.490176
12.300000 3.525382 1.186373 -1.166470 0.675126 -0.077542 -7.472211
12.333333 3.548534 1.183303 -1.415926 0.681114 -0.080831 -7.317850
12.366667 3.571665 1.180158 -1.701005 0.684890 -0.082834 -7.041777
12.400000 3.594760 1.176946 -1.989456 0.686998 -0.083908 -6.658237
12.433333 3.617804 1.173674 -2.206681 0.687987 -0.084515 -6.192654
12.466667 3.640898 1.170708 -2.426929 0.688398 -0.085150 -5.666411
12.500000 3.663986 1.168263 -2.605841 0.688760 -0.086427 -5.096199
12.533333 3.686974 1.165779 -2.755999 0.689669 -0.089045 -4.494296
12.566667 3.709849 1.163262 -2.890085 0.691724 -0.093724 -3.872615
12.600000 3.732593 1.160718 -2.996868 0.695199 -0.100864 -3.240559
12.633333 3.755191 1.158154 -3.083413 0.700078 -0.110462 -2.599372
12.666667 3.777628 1.155576 3.122430 0.706289 -0.122307 -1.950830
12.700000 3.799888 1.152991 3.072860 0.713581 -0.135873 -1.297733
12.733333 3.823374 1.148749 3.022655 0.721291 -0.150141 -0.646744
12.766667 3.847994 1.143013 2.990060 0.728391 -0.163644 -0.009514
12.800000 3.872385 1.137292 2.983225 0.733882 -0.174955 0.601755
12.833333 3.897673 1.130295 3.009621 0.736833 -0.182885 1.172147
12.866667 3.923747 1.122079 3.074023 0.736362 -0.186463 1.682336
12.900000 3.950569 1.112636 -3.104258 0.731497 -0.184712 2.112773
12.933333 3.977081 1.103257 -2.969058 0.721655 -0.177240 2.441325
12.966667 4.002468 1.095800 -2.848430 0.706698 -0.164350 2.662022
13.000000 4.026631 1.090161 -2.707627 0.686737 -0.146695 2.766456
13.033333 4.050422 1.084619 -2.574173 0.662182 -0.125172 2.750953
13.066667 4.072853 1.080655 -2.447322 0.633522 -0.100862 2.623945
13.100000 4.093874 1.078110 -2.377260 0.601581 -0.075293 2.407026
13.133333 4.113453 1.076873 -2.284797 0.567270 -0.049930 2.129496
13.166667 4.131555 1.076815 -2.207669 0.531473 -0.025855 1.812880
13.200000 4.149201 1.076885 -2.152323 0.494732 -0.003787 1.485720
13.233333 4.165216 1.077802 -2.121241 0.457508 0.015696 1.174921
13.266667 4.179547 1.079432 -2.112106 0.420237 0.032279 0.897651
13.300000 4.192135 1.081630 -2.096795 0.383248 0.045982 0.654105
13.333333 4.204220 1.083964 -2.100257 0.346601 0.057080 0.439843
13.366667 4.215794 1.086433 -2.116605 0.310145 0.065903 0.249901
13.400000 4.225491 1.089127 -2.124833 0.274035 0.072702 0.078789
13.433333 4.233251 1.091919 -2.126316 0.238253 0.077879 -0.072386
13.466667 4.240479 1.094849 -2.111425 0.202746 0.081873 -0.193403
13.500000 4.247172 1.097916 -2.089306 0.167318 0.085161 -0.269738
13.533333 4.251991 1.100832 -2.079272 0.131878 0.088181 -0.281258
13.566667 4.256268 1.103886 -2.075673 0.096421 0.091287 -0.206848
13.600000 4.258811 1.106760 -2.121610 0.060815 0.094845 -0.029367
13.633333 4.259631 1.109542 -2.173249 0.025087 0.099118 0.250242
13.666667 4.259908 1.112463 -2.259041 -0.010814 0.104311 0.620840
13.700000 4.259642 1.115523 -2.339689 -0.046742 0.110498 1.076386
13.733333 4.257644 1.118920 -2.360132 -0.082559 0.117628 1.595779
13.766667 4.253920 1.122810 -2.253504 -0.118026 0.125620 2.144065
13.800000 4.249662 1.126840 -2.091019 -0.152917 0.134281 2.676782
13.833333 4.243744 1.131454 -1.956985 -0.187090 0.143378 3.160691
13.866667 4.236198 1.136651 -1.792414 -0.220197 0.152609 3.564206
13.900000 4.228138 1.141983 -1.609057 -0.252016 0.161715 3.852385
13.933333 4.218542 1.147832 -1.428409 -0.282290 0.170476 4.005743
13.966667 4.208450 1.153813 -1.247655 -0.310969 0.178737 4.025397
14.000000 4.196939 1.160154 -1.116848 -0.337914 0.186380 3.932406
14.033333 4.184955 1.166622 -0.979226 -0.363058 0.193394 3.742019
14.066667 4.171708 1.173374 -0.861474 -0.386422 0.199834 3.477695
14.100000 4.158012 1.180246 -0.750463 -0.407925 0.205746 3.163329
14.133333 4.143881 1.187233 -0.656156 -0.427584 0.211238 2.817302
14.166667 4.129326 1.194334 -0.564302 -0.445247 0.216371 2.455825
14.200000 4.113881 1.201642 -0.493156 -0.460814 0.221229 2.083142
14.233333 4.097634 1.209157 -0.404492 -0.474034 0.225816 1.707709
14.266667 4.081007 1.216774 -0.335791 -0.484728 0.230102 1.333954
14.300000 4.063908 1.224576 -0.312647 -0.492748 0.234016 0.969599
14.333333 4.046458 1.232472 -0.292060 -0.497951 0.237456 0.626498
14.366667 4.028909 1.240550 -0.288210 -0.500286 0.240296 0.310152
14.400000 4.011405 1.248784 -0.292393 -0.499865 0.242419 0.028900
14.433333 3.994017 1.257158 -0.302300 -0.496996 0.243739 -0.201521
14.466667 3.976870 1.265621 -0.349510 -0.492067 0.244187 -0.364465
14.500000 3.960113 1.274120 -0.382722 -0.485639 0.243751 -0.451947
14.533333 3.943839 1.282577 -0.412921 -0.478289 0.242433 -0.460417
14.566667 3.928133 1.290891 -0.448139 -0.470670 0.240296 -0.385158
14.600000 3.913030 1.298979 -0.476759 -0.463334 0.237403 -0.225545
14.633333 3.898512 1.306774 -0.508070 -0.456765 0.233852 0.005691
14.666667 3.883773 1.314619 -0.516350 -0.451299 0.229746 0.285271
14.700000 3.869434 1.322154 -0.538998 -0.447141 0.225224 0.597799
14.733333 3.854891 1.329731 -0.535579 -0.444370 0.220407 0.923747
14.766667 3.840431 1.337064 -0.470633 -0.442891 0.215407 1.236507
14.800000 3.825930 1.344154 -0.390809 -0.442472 0.210354 1.511133
14.833333 3.811316 1.351003 -0.316195 -0.442778 0.205365 1.727820
14.866667 3.796534 1.357882 -0.219994 -0.443538 0.200569 1.879192
14.900000 3.781633 1.364501 -0.126555 -0.444429 0.196041 1.954562
14.933333 3.766643 1.370856 -0.031109 -0.445198 0.191889 1.950878
14.966667 3.751626 1.376953 0.058390 -0.445691 0.188205 1.878862
15.000000 3.736647 1.382832 0.122134 -0.445822 0.185090 1.756276
15.033333 3.721540 1.388730 0.184869 -0.445556 0.182604 1.602328
15.066667 3.706313 1.394646 0.235599 -0.444840 0.180785 1.432321
15.100000 3.691404 1.400482 0.265078 -0.443617 0.179705 1.263629
15.133333 3.676960 1.406340 0.286059 -0.441776 0.179429 1.111259
15.166667 3.662417 1.412211 0.289795 -0.439175 0.179991 0.984650
15.200000 3.647783 1.418094 0.314496 -0.435771 0.181333 0.882516
15.233333 3.633062 1.423988 0.342615 -0.431463 0.183457 0.803070
15.266667 3.618263 1.429890 0.369685 -0.426096 0.186392 0.743076
15.300000 3.603391 1.435799 0.388228 -0.419626 0.190090 0.695819
15.333333 3.589427 1.442153 0.423390 -0.412149 0.194413 0.651143
15.366667 3.575402 1.448511 0.454047 -0.403754 0.199254 0.598888
15.400000 3.561321 1.454870 0.473384 -0.394466 0.204562 0.534306
15.433333 3.548251 1.461739 0.495322 -0.384527 0.210170 0.453851
15.466667 3.536194 1.469142 0.512338 -0.374375 0.215809 0.357199
15.500000 3.524092 1.476537 0.522896 -0.364396 0.221259 0.245246
15.533333 3.511948 1.483922 0.533837 -0.354862 0.226370 0.124925
15.566667 3.500538 1.491722 0.547243 -0.346177 0.230930 -0.001833
15.600000 3.489733 1.499858 0.544181 -0.338798 0.234694 -0.130703
15.633333 3.478890 1.507972 0.532394 -0.332940 0.237540 -0.257525
15.666667 3.468362 1.516230 0.506127 -0.328662 0.239437 -0.382214
15.700000 3.457997 1.524535 0.499462 -0.326095 0.240328 -0.501352
15.733333 3.447595 1.532805 0.462882 -0.325361 0.240175 -0.612161
15.766667 3.437156 1.541035 0.444920 -0.326359 0.239051 -0.706086
15.800000 3.426680 1.549219 0.429197 -0.328881 0.237091 -0.776930
15.833333 3.416166 1.557355 0.397357 -0.332806 0.234386 -0.821350
15.866667 3.405245 1.565219 0.372620 -0.337910 0.231065 -0.833487
15.900000 3.393862 1.572818 0.327741 -0.343789 0.227321 -0.807974
15.933333 3.382441 1.580353 0.278477 -0.350104 0.223305 -0.744774
15.966667 3.370984 1.587822 0.251546 -0.356649 0.219093 -0.649770
16.000000 3.358896 1.595012 0.190942 -0.363251 0.214726 -0.527285
16.033333 3.346103 1.601939 0.170825 -0.369700 0.210239 -0.385195
16.066667 3.333276 1.608788 0.157667 -0.375932 0.205601 -0.230990
16.100000 3.320418 1.615554 0.163109 -0.382021 0.200724 -0.079563
16.133333 3.307530 1.622234 0.185253 -0.387971 0.195561 0.055364
16.166667 3.294615 1.628825 0.203165 -0.393716 0.190117 0.168502
16.200000 3.281674 1.635322 0.212780 -0.399238 0.184405 0.250524
16.233333 3.268709 1.641723 0.247798 -0.404582 0.178450 0.299307
16.266667 3.255269 1.647760 0.281524 -0.409725 0.172316 0.312708
16.300000 3.241421 1.653410 0.289061 -0.414578 0.166111 0.297665
16.333333 3.227219 1.658686 0.298543 -0.419060 0.159940 0.263995
16.366667 3.212725 1.663596 0.298543 -0.423099 0.153907 0.217554
16.400000 3.198220 1.668395 0.298543 -0.426606 0.148112 0.165786
16.433333 3.183707 1.673081 0.298543 -0.429455 0.142648 0.116204
16.466667 3.169190 1.677651 0.298543 -0.431598 0.137563 0.075525
16.500000 3.154670 1.682104 0.298543 -0.433053 0.132857 0.057333
16.533333 3.140153 1.686436 0.298543 -0.433848 0.128551 0.061362
16.566667 3.125640 1.690647 0.298543 -0.434059 0.124620 0.086120
16.600000 3.111135 1.694733 0.298543 -0.433761 0.121040 0.131539
16.633333 3.096641 1.698694 0.298543 -0.433031 0.117786 0.194349
16.666667 3.082162 1.702527 0.298543 -0.431909 0.114854 0.269867
16.700000 3.067699 1.706230 0.298543 -0.430346 0.112329 0.332050
16.733333 3.053257 1.709801 0.298543 -0.428310 0.110250 0.377701
16.766667 3.038838 1.713238 0.298543 -0.425698 0.108737 0.407326
16.800000 3.024446 1.716540 0.298543 -0.422406 0.107909 0.419031
16.833333 3.010082 1.719705 0.451912 -0.418333 0.107883 0.402356
16.866667 2.996297 1.723492 0.451912 -0.413388 0.108753 0.362653
16.900000 2.982546 1.727138 0.451912 -0.407565 0.110517 0.311263
16.933333 2.968831 1.730640 0.460708 -0.400911 0.113111 0.251570
16.966667 2.955155 1.733995 0.456488 -0.393569 0.116351 0.185178
17.000000 2.941521 1.737201 0.434020 -0.385682 0.120061 0.115315
17.033333 2.928580 1.741025 0.435789 -0.377453 0.123993 0.064807
17.066667 2.916285 1.745431 0.406888 -0.369125 0.127875 0.029984
17.100000 2.904596 1.750378 0.412975 -0.360988 0.131379 0.012772
17.133333 2.892952 1.755161 0.407839 -0.353282 0.134239 0.012904
17.166667 2.881354 1.759776 0.427237 -0.346198 0.136248 0.023115
17.200000 2.870218 1.764715 0.446519 -0.340010 0.137111 0.036654
17.233333 2.859442 1.769847 0.432805 -0.334948 0.136587 0.041820
17.266667 2.848709 1.774795 0.424387 -0.331125 0.134552 0.039449
17.300000 2.838019 1.779555 0.451595 -0.328589 0.130973 0.026237
17.333333 2.827383 1.784158 0.448795 -0.327440 0.125754 0.000833
17.366667 2.816721 1.788536 0.460754 -0.327771 0.118803 -0.028732
17.400000 2.805946 1.792606 0.448844 -0.329498 0.110204 -0.053733
17.433333 2.795211 1.796465 0.448844 -0.332442 0.100138 -0.075644
17.466667 2.784514 1.800110 0.434974 -0.336484 0.088723 -0.096017
17.500000 2.773855 1.803535 0.423979 -0.341443 0.076138 -0.106264
17.533333 2.762687 1.806264 0.406703 -0.347007 0.062663 -0.102928
17.566667 2.750941 1.808149 0.406938 -0.352822 0.048628 -0.086601
17.600000 2.739234 1.809801 0.423246 -0.358651 0.034185 -0.060417
17.633333 2.726913 1.810489 0.412349 -0.364286 0.019383 -0.022904
17.666667 2.713988 1.810218 0.393075 -0.369476 0.004250 0.028476
17.700000 2.701104 1.809710 0.409209 -0.374022 -0.011248 0.084088
17.733333 2.688264 1.808962 0.409209 -0.377824 -0.027156 0.142601
17.766667 2.675470 1.807974 0.409209 -0.380885 -0.043696 0.199089
17.800000 2.662723 1.806745 0.409209 -0.383180 -0.060929 0.250864
17.833333 2.650026 1.805274 0.431120 -0.384786 -0.078946 0.297792
17.866667 2.637079 1.802764 0.431120 -0.385849 -0.097727 0.335454
17.900000 2.624186 1.800012 0.463003 -0.386515 -0.117250 0.368908
17.933333 2.611237 1.796073 0.502067 -0.386899 -0.137440 0.382808
17.966667 2.598251 1.790906 0.494907 -0.387042 -0.157923 0.384453
18.000000 2.585229 1.784502 0.509081 -0.386986 -0.178323 0.374331
18.033333 2.572272 1.777864 0.513524 -0.386702 -0.198124 0.346463
18.066667 2.559381 1.770999 0.548581 -0.386171 -0.216971 0.300715
18.100000 2.546459 1.762924 0.548581 -0.385360 -0.234424 0.232770
18.133333 2.533610 1.754630 0.549931 -0.384274 -0.250235 0.167325
18.166667 2.520701 1.745183 0.577708 -0.382930 -0.264327 0.088592
18.200000 2.507871 1.735531 0.577708 -0.381383 -0.276812 0.000088
18.233333 2.495122 1.725681 0.614002 -0.379704 -0.287893 -0.091545
18.266667 2.482458 1.715640 0.521736 -0.377942 -0.297710 -0.173840
18.300000 2.469882 1.705414 0.570518 -0.376161 -0.306568 -0.248096
18.333333 2.457396 1.695013 0.570518 -0.374387 -0.314632 -0.323409
18.366667 2.445003 1.684443 0.511181 -0.372671 -0.322150 -0.377240
18.400000 2.432707 1.673711 0.511181 -0.371010 -0.329246 -0.413888
18.433333 2.420509 1.662826 0.479906 -0.369403 -0.336022 -0.426241
18.466667 2.408238 1.651425 0.479906 -0.367829 -0.342551 -0.427310
18.500000 2.396072 1.639887 0.430089 -0.366263 -0.348823 -0.404001
18.533333 2.383759 1.627959 0.442621 -0.364673 -0.354834 -0.359552
18.566667 2.371481 1.615768 0.425173 -0.362994 -0.360474 -0.309903
18.600000 2.359317 1.603466 0.412399 -0.361183 -0.365645 -0.246486
18.633333 2.347272 1.591061 0.378643 -0.359183 -0.370252 -0.178251
18.666667 2.335349 1.578562 0.398113 -0.356968 -0.374251 -0.105815
18.700000 2.323428 1.565885 0.398113 -0.354495 -0.377572 -0.038746
18.733333 2.311635 1.553131 0.385771 -0.351751 -0.380180 0.026194
18.766667 2.299862 1.540260 0.396124 -0.348726 -0.382046 0.094324
18.800000 2.288224 1.527331 0.434048 -0.345405 -0.383162 0.149765
18.833333 2.276724 1.514355 0.407543 -0.341768 -0.383496 0.194141
18.866667 2.265307 1.501395 0.421523 -0.337778 -0.383020 0.230782
18.900000 2.254035 1.488406 0.409059 -0.333406 -0.381727 0.260585
18.933333 2.242878 1.475508 0.461869 -0.328583 -0.379599 0.275976
18.966667 2.231873 1.462598 0.457743 -0.323274 -0.376660 0.276752
19.000000 2.221053 1.449853 0.466130 -0.317420 -0.372907 0.274754
19.033333 2.210433 1.437313 0.480500 -0.310964 -0.368373 0.264366
19.066667 2.200030 1.425005 0.490427 -0.303834 -0.363058 0.248828
19.100000 2.189915 1.412991 0.515248 -0.296003 -0.357017 0.224204
19.133333 2.179967 1.401008 0.506123 -0.287468 -0.350301 0.203483
19.166667 2.170374 1.389375 0.516750 -0.278225 -0.342960 0.182938
19.200000 2.160955 1.377788 0.510600 -0.268326 -0.335085 0.162006
19.233333 2.151987 1.366599 0.514318 -0.257888 -0.326798 0.148143
19.266667 2.143528 1.355840 0.519342 -0.247097 -0.318284 0.136770
19.300000 2.135248 1.345148 0.536716 -0.236096 -0.309650 0.133329
19.333333 2.127533 1.334939 0.527523 -0.225093 -0.301081 0.129506
19.366667 2.120358 1.325186 0.519143 -0.214263 -0.292691 0.131244
19.400000 2.113702 1.315875 0.538747 -0.203754 -0.284556 0.134939
19.433333 2.107228 1.306655 0.534362 -0.193637 -0.276680 0.139147
19.466667 2.101314 1.297901 0.563235 -0.183939 -0.269025 0.145986
19.500000 2.095581 1.289246 0.557696 -0.174672 -0.261534 0.156359
19.533333 2.090029 1.280696 0.556661 -0.165737 -0.254013 0.171029
19.566667 2.084656 1.272255 0.567223 -0.157035 -0.246300 0.183844
19.600000 2.079461 1.263926 0.556789 -0.148456 -0.238237 0.198946
19.633333 2.074445 1.255714 0.564870 -0.139912 -0.229701 0.213247
19.666667 2.069605 1.247622 0.579694 -0.131276 -0.220515 0.227825
19.700000 2.065309 1.240230 0.588781 -0.122492 -0.210636 0.237378
19.733333 2.061531 1.233540 0.592967 -0.113597 -0.200161 0.240867
19.766667 2.057927 1.226981 0.607689 -0.104659 -0.189223 0.241259
19.800000 2.054493 1.220554 0.621376 -0.095771 -0.177989 0.233363
19.833333 2.051480 1.214753 0.637304 -0.087048 -0.166664 0.218048
19.866667 2.048847 1.209518 0.655446 -0.078670 -0.155544 0.193936
19.900000 2.046553 1.204790 0.643293 -0.070753 -0.144821 0.164900
19.933333 2.044569 1.200529 0.646617 -0.063353 -0.134605 0.131548
19.966667 2.042743 1.196406 0.649009 -0.056510 -0.124998 0.095596
20.000000 2.041143 1.192631 0.661846 -0.050265 -0.116089 0.059128
20.033333 2.039694 1.188993 0.659546 -0.044616 -0.107900 0.024564
20.066667 2.038415 1.185649 0.665605 -0.039514 -0.100385 -0.007547
20.100000 2.037282 1.182574 0.653031 -0.034904 -0.093504 -0.037421
20.133333 2.036289 1.179634 0.647347 -0.030732 -0.087195 -0.063232
20.166667 2.035400 1.176920 0.643233 -0.026950 -0.081391 -0.085881
20.200000 2.034600 1.174404 0.656039 -0.023484 -0.076002 -0.103509
20.233333 2.033895 1.172057 0.646129 -0.020277 -0.070978 -0.117292
20.266667 2.033317 1.169840 0.641311 -0.017285 -0.066269 -0.126630
20.300000 2.032862 1.167750 0.632422 -0.014492 -0.061835 -0.133392
20.333333 2.032457 1.165809 0.617772 -0.011889 -0.057665 -0.138441
