t x y theta dxdt dydt dthetadt
0.000000 0.000000 0.000000 -0.239984 -0.093951 -0.017187 0.001710
0.033333 -0.003196 -0.000577 -0.226533 -0.099000 -0.017761 -0.002278
0.066667 -0.006554 -0.001174 -0.226177 -0.104163 -0.018351 -0.006809
0.100000 -0.010079 -0.001792 -0.234721 -0.109451 -0.018957 -0.010626
0.133333 -0.013778 -0.002432 -0.238040 -0.114878 -0.019580 -0.012674
0.166667 -0.017655 -0.003094 -0.237743 -0.120448 -0.020221 -0.012468
0.200000 -0.021716 -0.003779 -0.233945 -0.126171 -0.020878 -0.012996
0.233333 -0.025983 -0.004481 -0.236775 -0.132053 -0.021552 -0.012334
0.266667 -0.030445 -0.005207 -0.236371 -0.138095 -0.022241 -0.010881
0.300000 -0.035118 -0.005951 -0.238056 -0.144296 -0.022946 -0.008822
0.333333 -0.039999 -0.006721 -0.236713 -0.150654 -0.023663 -0.007198
0.366667 -0.045094 -0.007517 -0.236023 -0.157167 -0.024392 -0.004990
0.400000 -0.050408 -0.008340 -0.229720 -0.163830 -0.025132 -0.001837
0.433333 -0.055948 -0.009192 -0.235673 -0.170640 -0.025882 0.000386
0.466667 -0.061720 -0.010072 -0.237790 -0.177594 -0.026638 0.001825
0.500000 -0.067722 -0.010971 -0.246841 -0.184691 -0.027401 0.003092
0.533333 -0.073968 -0.011899 -0.237449 -0.191926 -0.028168 0.004504
0.566667 -0.080451 -0.012847 -0.237221 -0.199293 -0.028937 0.005240
0.600000 -0.087191 -0.013825 -0.233980 -0.206783 -0.029704 0.005607
0.633333 -0.094173 -0.014823 -0.233797 -0.214390 -0.030470 0.007411
0.666667 -0.101427 -0.015854 -0.236001 -0.222105 -0.031231 0.009661
0.700000 -0.108927 -0.016903 -0.232490 -0.229922 -0.031989 0.011247
0.733333 -0.116713 -0.017989 -0.228678 -0.237841 -0.032745 0.012194
0.766667 -0.124751 -0.019092 -0.238223 -0.245866 -0.033502 0.012564
0.800000 -0.133088 -0.020233 -0.238866 -0.254015 -0.034266 0.013737
0.833333 -0.141681 -0.021392 -0.239448 -0.262293 -0.035039 0.013082
0.866667 -0.150532 -0.022570 -0.234533 -0.270711 -0.035828 0.012719
0.900000 -0.159643 -0.023766 -0.229165 -0.279270 -0.036632 0.011993
0.933333 -0.169016 -0.024981 -0.232818 -0.287982 -0.037457 0.011814
0.966667 -0.178726 -0.026237 -0.221220 -0.296853 -0.038305 0.009096
1.000000 -0.188701 -0.027512 -0.235184 -0.305886 -0.039178 0.003903
1.033333 -0.199027 -0.028832 -0.229928 -0.315083 -0.040076 -0.004548
1.066667 -0.209622 -0.030170 -0.231235 -0.324460 -0.041004 -0.018471
1.100000 -0.220583 -0.031554 -0.232568 -0.334039 -0.041968 -0.036479
1.133333 -0.231918 -0.032986 -0.227949 -0.343828 -0.042967 -0.062701
1.166667 -0.243525 -0.034436 -0.233670 -0.353826 -0.044000 -0.095217
1.200000 -0.255406 -0.035904 -0.228330 -0.364018 -0.045063 -0.140275
1.233333 -0.267561 -0.037389 -0.235787 -0.374400 -0.046154 -0.195536
1.266667 -0.280121 -0.038926 -0.234277 -0.384946 -0.047265 -0.262671
1.300000 -0.293093 -0.040515 -0.248444 -0.395622 -0.048385 -0.342239
1.333333 -0.306482 -0.042159 -0.244200 -0.406384 -0.049503 -0.431831
1.366667 -0.320147 -0.043819 -0.270055 -0.417207 -0.050610 -0.528184
1.400000 -0.334239 -0.045532 -0.285306 -0.428064 -0.051695 -0.621106
1.433333 -0.348762 -0.047298 -0.297389 -0.438924 -0.052746 -0.708376
1.466667 -0.363720 -0.049115 -0.326874 -0.449747 -0.053750 -0.778812
1.500000 -0.378952 -0.050947 -0.369314 -0.460494 -0.054698 -0.826740
1.533333 -0.394456 -0.052794 -0.407777 -0.471167 -0.055589 -0.841240
1.566667 -0.410233 -0.054655 -0.444251 -0.481753 -0.056416 -0.819454
1.600000 -0.426447 -0.056556 -0.491113 -0.492250 -0.057178 -0.762082
1.633333 -0.443096 -0.058493 -0.520667 -0.502643 -0.057877 -0.667146
1.666667 -0.460013 -0.060443 -0.560877 -0.512945 -0.058518 -0.544535
1.700000 -0.477363 -0.062423 -0.595250 -0.523157 -0.059106 -0.400939
1.733333 -0.494976 -0.064415 -0.594010 -0.533254 -0.059639 -0.253149
1.766667 -0.513014 -0.066429 -0.606362 -0.543198 -0.060115 -0.110141
1.800000 -0.531311 -0.068455 -0.584475 -0.552972 -0.060527 0.015409
1.833333 -0.549865 -0.070492 -0.578839 -0.562591 -0.060875 0.114716
1.866667 -0.568829 -0.072539 -0.541060 -0.572050 -0.061146 0.182027
1.900000 -0.588196 -0.074591 -0.523577 -0.581366 -0.061333 0.214967
1.933333 -0.607812 -0.076653 -0.502034 -0.590556 -0.061425 0.218667
1.966667 -0.627672 -0.078725 -0.479391 -0.599654 -0.061422 0.195533
2.000000 -0.647773 -0.080805 -0.487133 -0.608668 -0.061321 0.161146
2.033333 -0.668112 -0.082894 -0.490264 -0.617596 -0.061115 0.127242
2.066667 -0.688816 -0.084962 -0.493561 -0.626435 -0.060807 0.121899
2.100000 -0.709875 -0.087004 -0.497215 -0.635174 -0.060405 0.162449
2.133333 -0.731275 -0.089016 -0.507116 -0.643790 -0.059921 0.271362
2.166667 -0.752898 -0.091036 -0.502213 -0.652259 -0.059363 0.466236
2.200000 -0.774835 -0.093020 -0.519937 -0.660550 -0.058746 0.756160
2.233333 -0.797072 -0.094966 -0.516523 -0.668616 -0.058097 1.145493
2.266667 -0.819600 -0.096872 -0.518742 -0.676421 -0.057435 1.610501
2.300000 -0.842332 -0.098786 -0.503772 -0.683939 -0.056778 2.137435
2.333333 -0.865326 -0.100659 -0.456528 -0.691160 -0.056143 2.692375
2.366667 -0.888572 -0.102495 -0.372497 -0.698073 -0.055547 3.243605
2.400000 -0.912007 -0.104338 -0.182317 -0.704684 -0.055000 3.742706
2.433333 -0.935665 -0.106146 -0.037393 -0.711019 -0.054498 4.149367
2.466667 -0.959541 -0.107921 0.179385 -0.717107 -0.054033 4.436746
2.500000 -0.983589 -0.109705 0.371410 -0.722967 -0.053596 4.575495
2.533333 -1.007845 -0.111461 0.604523 -0.728618 -0.053172 4.552681
2.566667 -1.032262 -0.113226 0.835275 -0.734086 -0.052742 4.361162
2.600000 -1.056836 -0.115001 0.990740 -0.739388 -0.052289 4.029946
2.633333 -1.081599 -0.116752 1.151911 -0.744533 -0.051797 3.581571
2.666667 -1.106507 -0.118513 1.269265 -0.749527 -0.051253 3.051100
2.700000 -1.131594 -0.120246 1.354619 -0.754369 -0.050651 2.478151
2.733333 -1.156852 -0.121947 1.410432 -0.759057 -0.049984 1.902906
2.766667 -1.182275 -0.123612 1.439163 -0.763580 -0.049258 1.367964
2.800000 -1.207858 -0.125240 1.455721 -0.767922 -0.048491 0.889541
2.833333 -1.233593 -0.126827 1.439400 -0.772064 -0.047709 0.490971
2.866667 -1.259436 -0.128428 1.430847 -0.775982 -0.046947 0.181502
2.900000 -1.285415 -0.129984 1.391421 -0.779660 -0.046231 -0.036962
2.933333 -1.311523 -0.131496 1.375412 -0.783081 -0.045597 -0.169500
2.966667 -1.337751 -0.132965 1.347316 -0.786232 -0.045074 -0.230629
3.000000 -1.364090 -0.134390 1.327317 -0.789109 -0.044681 -0.229204
3.033333 -1.390505 -0.135835 1.325172 -0.791713 -0.044424 -0.183174
3.066667 -1.417014 -0.137243 1.309734 -0.794048 -0.044307 -0.105118
3.100000 -1.443584 -0.138673 1.307972 -0.796114 -0.044334 -0.013502
3.133333 -1.470209 -0.140126 1.310550 -0.797921 -0.044491 0.078434
3.166667 -1.496882 -0.141604 1.311886 -0.799477 -0.044759 0.162789
3.200000 -1.523596 -0.143107 1.339825 -0.800796 -0.045110 0.232209
3.233333 -1.550365 -0.144594 1.356601 -0.801882 -0.045531 0.285325
3.266667 -1.577162 -0.146109 1.378802 -0.802746 -0.046000 0.312513
3.300000 -1.603980 -0.147654 1.385706 -0.803394 -0.046501 0.319572
3.333333 -1.630811 -0.149231 1.402935 -0.803831 -0.047025 0.308785
3.366667 -1.657661 -0.150804 1.410013 -0.804055 -0.047574 0.280074
3.400000 -1.684511 -0.152411 1.453941 -0.804060 -0.048151 0.231225
3.433333 -1.711361 -0.154020 1.430510 -0.803847 -0.048749 0.165608
3.466667 -1.738203 -0.155630 1.421855 -0.803411 -0.049371 0.093271
3.500000 -1.765032 -0.157245 1.428889 -0.802749 -0.050021 0.015527
3.533333 -1.791833 -0.158900 1.457016 -0.801860 -0.050705 -0.066554
3.566667 -1.818600 -0.160597 1.458149 -0.800746 -0.051430 -0.149500
3.600000 -1.845326 -0.162337 1.447098 -0.799408 -0.052211 -0.221609
3.633333 -1.872004 -0.164123 1.424066 -0.797851 -0.053061 -0.282223
3.666667 -1.898621 -0.165908 1.407991 -0.796075 -0.053988 -0.331929
3.700000 -1.925172 -0.167693 1.390536 -0.794082 -0.054994 -0.367447
3.733333 -1.951646 -0.169480 1.371056 -0.791870 -0.056080 -0.380732
3.766667 -1.978046 -0.171319 1.347552 -0.789433 -0.057242 -0.370627
3.800000 -2.004364 -0.173211 1.333599 -0.786761 -0.058472 -0.341846
3.833333 -2.030594 -0.175159 1.318177 -0.783845 -0.059762 -0.296067
3.866667 -2.056729 -0.177165 1.303790 -0.780676 -0.061107 -0.234577
3.900000 -2.082762 -0.179230 1.291806 -0.777253 -0.062502 -0.163041
3.933333 -2.108687 -0.181355 1.294184 -0.773571 -0.063937 -0.091909
3.966667 -2.134498 -0.183543 1.294534 -0.769635 -0.065408 -0.024136
4.000000 -2.160160 -0.185760 1.294094 -0.765452 -0.066919 0.036308
4.033333 -2.185664 -0.188007 1.300993 -0.761027 -0.068473 0.084776
4.066667 -2.211002 -0.190291 1.326349 -0.756367 -0.070080 0.117458
4.100000 -2.236162 -0.192615 1.315023 -0.751474 -0.071751 0.136221
4.133333 -2.261136 -0.194984 1.334781 -0.746354 -0.073504 0.143216
4.166667 -2.285959 -0.197427 1.346034 -0.741010 -0.075357 0.138310
4.200000 -2.310624 -0.199945 1.352780 -0.735447 -0.077317 0.124194
4.233333 -2.335125 -0.202540 1.343987 -0.729666 -0.079390 0.107661
4.266667 -2.359405 -0.205199 1.353155 -0.723669 -0.081577 0.093726
4.300000 -2.383510 -0.207939 1.355501 -0.717463 -0.083872 0.082790
4.333333 -2.407378 -0.210754 1.361438 -0.711059 -0.086265 0.075704
4.366667 -2.431000 -0.213647 1.342518 -0.704467 -0.088749 0.076108
4.400000 -2.454431 -0.216627 1.348796 -0.697682 -0.091318 0.081467
4.433333 -2.477598 -0.219695 1.341899 -0.690719 -0.093968 0.090201
4.466667 -2.500492 -0.222856 1.356206 -0.683594 -0.096696 0.098972
4.500000 -2.523178 -0.226108 1.357695 -0.676307 -0.099500 0.105194
4.533333 -2.545654 -0.229453 1.375760 -0.668848 -0.102383 0.107904
4.566667 -2.567826 -0.232903 1.370185 -0.661209 -0.105343 0.102222
4.600000 -2.589778 -0.236449 1.380222 -0.653389 -0.108378 0.091357
4.633333 -2.611505 -0.240093 1.393079 -0.645354 -0.111487 0.070462
4.666667 -2.633003 -0.243835 1.391497 -0.637065 -0.114673 0.043066
4.700000 -2.654160 -0.247695 1.394769 -0.628497 -0.117935 0.011405
4.733333 -2.674967 -0.251675 1.386868 -0.619640 -0.121272 -0.022052
4.766667 -2.695533 -0.255758 1.393260 -0.610474 -0.124684 -0.056810
4.800000 -2.715854 -0.259946 1.388347 -0.600995 -0.128168 -0.094773
4.833333 -2.735793 -0.264262 1.375392 -0.591227 -0.131719 -0.128037
4.866667 -2.755481 -0.268685 1.372306 -0.581197 -0.135329 -0.157663
4.900000 -2.774768 -0.273240 1.362321 -0.570927 -0.138994 -0.181489
4.933333 -2.793646 -0.277929 1.371176 -0.560416 -0.142711 -0.202885
4.966667 -2.812102 -0.282754 1.349258 -0.549680 -0.146476 -0.218196
5.000000 -2.830295 -0.287690 1.350696 -0.538705 -0.150289 -0.230153
5.033333 -2.848046 -0.292765 1.341397 -0.527469 -0.154154 -0.249503
5.066667 -2.865531 -0.297953 1.328363 -0.515934 -0.158078 -0.283583
5.100000 -2.882552 -0.303282 1.309657 -0.504063 -0.162071 -0.341381
5.133333 -2.899303 -0.308727 1.293731 -0.491845 -0.166138 -0.421873
5.166667 -2.915570 -0.314317 1.292773 -0.479268 -0.170289 -0.531768
5.200000 -2.931564 -0.320022 1.302213 -0.466342 -0.174534 -0.668811
5.233333 -2.947057 -0.325876 1.307488 -0.453104 -0.178877 -0.824186
5.266667 -2.962039 -0.331880 1.286783 -0.439635 -0.183319 -0.988639
5.300000 -2.976505 -0.338038 1.262929 -0.426024 -0.187859 -1.153917
5.333333 -2.990452 -0.344354 1.210763 -0.412372 -0.192497 -1.316900
5.366667 -3.003883 -0.350833 1.131258 -0.398796 -0.197220 -1.467147
5.400000 -3.016802 -0.357482 1.052223 -0.385441 -0.202003 -1.597418
5.433333 -3.029220 -0.364305 0.968743 -0.372430 -0.206822 -1.703291
5.466667 -3.041367 -0.371246 0.911129 -0.359844 -0.211658 -1.786896
5.500000 -3.053039 -0.378374 0.850881 -0.347758 -0.216490 -1.848407
5.533333 -3.064252 -0.385696 0.791180 -0.336221 -0.221295 -1.892348
5.566667 -3.075202 -0.393134 0.749850 -0.325241 -0.226063 -1.929626
5.600000 -3.085727 -0.400779 0.695655 -0.314785 -0.230790 -1.969772
5.633333 -3.095845 -0.408636 0.626039 -0.304809 -0.235472 -2.023518
5.666667 -3.105707 -0.416607 0.557497 -0.295294 -0.240090 -2.091440
5.700000 -3.115317 -0.424689 0.486620 -0.286202 -0.244618 -2.176232
5.733333 -3.124678 -0.432883 0.409810 -0.277485 -0.249043 -2.274829
5.766667 -3.133794 -0.441186 0.356383 -0.269115 -0.253357 -2.379553
5.800000 -3.142579 -0.449721 0.272231 -0.261063 -0.257567 -2.483991
5.833333 -3.151050 -0.458490 0.183136 -0.253301 -0.261680 -2.580503
5.866667 -3.159285 -0.467364 0.078090 -0.245792 -0.265711 -2.664008
5.900000 -3.167290 -0.476342 -0.017567 -0.238513 -0.269696 -2.726830
5.933333 -3.175068 -0.485422 -0.112566 -0.231459 -0.273670 -2.763527
5.966667 -3.182623 -0.494602 -0.204235 -0.224623 -0.277647 -2.772066
6.000000 -3.189960 -0.503880 -0.299282 -0.218002 -0.281644 -2.750027
6.033333 -3.197082 -0.513254 -0.414419 -0.211596 -0.285698 -2.696629
6.066667 -3.203995 -0.522723 -0.528762 -0.205402 -0.289847 -2.614086
6.100000 -3.210697 -0.532423 -0.607341 -0.199421 -0.294106 -2.509055
6.133333 -3.217201 -0.542352 -0.698361 -0.193652 -0.298466 -2.386589
6.166667 -3.223507 -0.552368 -0.769950 -0.188092 -0.302929 -2.250552
6.200000 -3.229621 -0.562468 -0.840474 -0.182743 -0.307478 -2.108181
6.233333 -3.235568 -0.572785 -0.903716 -0.177602 -0.312051 -1.965192
6.266667 -3.241358 -0.583312 -0.963123 -0.172670 -0.316584 -1.826127
6.300000 -3.246970 -0.593916 -1.026365 -0.167940 -0.321028 -1.688077
6.333333 -3.252443 -0.604723 -1.065308 -0.163402 -0.325345 -1.553541
6.366667 -3.257788 -0.615730 -1.114009 -0.159050 -0.329497 -1.422811
6.400000 -3.262967 -0.626802 -1.159386 -0.154880 -0.333453 -1.293346
6.433333 -3.268036 -0.638063 -1.208727 -0.150897 -0.337218 -1.164724
6.466667 -3.273004 -0.649504 -1.251681 -0.147104 -0.340794 -1.037746
6.500000 -3.277820 -0.661001 -1.287642 -0.143508 -0.344184 -0.916694
6.533333 -3.282489 -0.672548 -1.325919 -0.140120 -0.347401 -0.801353
6.566667 -3.287016 -0.684142 -1.342393 -0.136947 -0.350459 -0.694616
6.600000 -3.291474 -0.695893 -1.352902 -0.133989 -0.353366 -0.600362
6.633333 -3.295798 -0.707682 -1.355163 -0.131238 -0.356120 -0.522111
6.666667 -3.300068 -0.719617 -1.363557 -0.128685 -0.358722 -0.459831
6.700000 -3.304294 -0.731687 -1.372941 -0.126325 -0.361167 -0.415644
6.733333 -3.308401 -0.743783 -1.379424 -0.124138 -0.363436 -0.389822
6.766667 -3.312480 -0.755999 -1.396609 -0.122102 -0.365498 -0.381554
6.800000 -3.316540 -0.768327 -1.420344 -0.120205 -0.367338 -0.385250
6.833333 -3.320493 -0.780664 -1.414961 -0.118450 -0.368945 -0.396670
6.866667 -3.324442 -0.793096 -1.437640 -0.116838 -0.370305 -0.411783
6.900000 -3.328294 -0.805528 -1.445803 -0.115364 -0.371413 -0.427254
6.933333 -3.332051 -0.817955 -1.457343 -0.114041 -0.372272 -0.440754
6.966667 -3.335718 -0.830371 -1.484270 -0.112899 -0.372904 -0.447750
7.000000 -3.339408 -0.842846 -1.502767 -0.111955 -0.373324 -0.451041
7.033333 -3.343125 -0.855370 -1.515892 -0.111210 -0.373534 -0.446611
7.066667 -3.346764 -0.867867 -1.524998 -0.110676 -0.373541 -0.437753
7.100000 -3.350329 -0.880332 -1.555150 -0.110375 -0.373352 -0.421191
7.133333 -3.353937 -0.892813 -1.552749 -0.110309 -0.372961 -0.399646
7.166667 -3.357591 -0.905298 -1.577979 -0.110477 -0.372351 -0.374859
7.200000 -3.361296 -0.917776 -1.591712 -0.110865 -0.371505 -0.347729
7.233333 -3.364941 -0.930199 -1.608693 -0.111479 -0.370420 -0.323079
7.266667 -3.368645 -0.942596 -1.613107 -0.112296 -0.369082 -0.299619
7.300000 -3.372295 -0.954926 -1.619899 -0.113276 -0.367478 -0.282383
7.333333 -3.376011 -0.967207 -1.618671 -0.114376 -0.365605 -0.269374
7.366667 -3.379795 -0.979426 -1.620166 -0.115551 -0.363466 -0.265811
7.400000 -3.383652 -0.991572 -1.640802 -0.116768 -0.361064 -0.269658
7.433333 -3.387585 -1.003631 -1.645527 -0.117974 -0.358397 -0.279600
7.466667 -3.391597 -1.015592 -1.658912 -0.119135 -0.355470 -0.294811
7.500000 -3.395691 -1.027443 -1.651785 -0.120216 -0.352287 -0.314502
7.533333 -3.399750 -1.039187 -1.663007 -0.121204 -0.348854 -0.339548
7.566667 -3.403897 -1.050799 -1.683982 -0.122075 -0.345183 -0.365535
7.600000 -3.408014 -1.062293 -1.704911 -0.122824 -0.341278 -0.395157
7.633333 -3.412104 -1.073663 -1.712470 -0.123457 -0.337152 -0.432119
7.666667 -3.416169 -1.084902 -1.725944 -0.123989 -0.332813 -0.478645
7.700000 -3.420326 -1.095961 -1.745516 -0.124457 -0.328268 -0.535701
7.733333 -3.424462 -1.106879 -1.756393 -0.124885 -0.323517 -0.603103
7.766667 -3.428693 -1.117593 -1.764975 -0.125310 -0.318561 -0.682884
7.800000 -3.432906 -1.128154 -1.789949 -0.125746 -0.313404 -0.772830
7.833333 -3.437102 -1.138557 -1.800310 -0.126210 -0.308044 -0.867594
7.866667 -3.441283 -1.148797 -1.835651 -0.126709 -0.302480 -0.961150
7.900000 -3.445452 -1.158869 -1.872162 -0.127241 -0.296721 -1.047006
7.933333 -3.449717 -1.168689 -1.908415 -0.127801 -0.290771 -1.123207
7.966667 -3.453972 -1.178329 -1.964167 -0.128394 -0.284626 -1.182730
8.000000 -3.458218 -1.187785 -2.010970 -0.129016 -0.278293 -1.219968
8.033333 -3.462559 -1.196963 -2.076363 -0.129656 -0.271786 -1.236389
8.066667 -3.466894 -1.205947 -2.118552 -0.130302 -0.265109 -1.233679
8.100000 -3.471224 -1.214732 -2.164538 -0.130942 -0.258249 -1.213519
8.133333 -3.475647 -1.223219 -2.203342 -0.131561 -0.251211 -1.176249
8.166667 -3.480068 -1.231497 -2.242081 -0.132135 -0.244002 -1.127326
8.200000 -3.484486 -1.239561 -2.260161 -0.132644 -0.236611 -1.076900
8.233333 -3.488904 -1.247408 -2.292940 -0.133084 -0.229011 -1.018995
8.266667 -3.493386 -1.254921 -2.344224 -0.133444 -0.221207 -0.954777
8.300000 -3.497868 -1.262208 -2.374972 -0.133719 -0.213223 -0.883164
8.333333 -3.502352 -1.269263 -2.366838 -0.133912 -0.205067 -0.799337
8.366667 -3.506838 -1.276084 -2.458407 -0.134020 -0.196734 -0.690333
8.400000 -3.511330 -1.282541 -2.452973 -0.134040 -0.188243 -0.535208
8.433333 -3.515814 -1.288630 -2.465845 -0.133953 -0.179621 -0.326851
8.466667 -3.520302 -1.294472 -2.507480 -0.133751 -0.170868 -0.044506
8.500000 -3.524796 -1.300064 -2.524300 -0.133417 -0.161962 0.326241
8.533333 -3.529226 -1.305265 -2.540461 -0.132929 -0.152903 0.790525
8.566667 -3.533663 -1.310209 -2.525503 -0.132287 -0.143713 1.336524
8.600000 -3.538107 -1.314892 -2.512812 -0.131497 -0.134393 1.944765
8.633333 -3.542559 -1.319311 -2.468067 -0.130572 -0.124940 2.588874
8.666667 -3.547020 -1.323464 -2.392731 -0.129511 -0.115350 3.215811
8.700000 -3.551373 -1.327217 -2.309913 -0.128336 -0.105644 3.782936
8.733333 -3.555622 -1.330575 -2.104260 -0.127065 -0.095829 4.245328
8.766667 -3.559770 -1.333544 -1.910136 -0.125717 -0.085910 4.573645
8.800000 -3.563930 -1.336236 -1.622387 -0.124313 -0.075901 4.731766
8.833333 -3.567993 -1.338548 -1.348350 -0.122884 -0.065830 4.707492
8.866667 -3.572070 -1.340579 -1.165668 -0.121481 -0.055739 4.519230
8.900000 -3.576163 -1.342327 -0.965719 -0.120135 -0.045642 4.176176
8.933333 -3.580167 -1.343710 -0.788176 -0.118870 -0.035547 3.715464
8.966667 -3.584088 -1.344729 -0.693671 -0.117695 -0.025439 3.170562
9.000000 -3.587931 -1.345387 -0.660029 -0.116634 -0.015315 2.603861
9.033333 -3.591702 -1.345684 -0.582654 -0.115695 -0.005162 2.055899
9.066667 -3.595495 -1.345691 -0.585589 -0.114882 0.005050 1.556943
9.100000 -3.599309 -1.345406 -0.547949 -0.114207 0.015331 1.138334
9.133333 -3.603078 -1.344753 -0.564187 -0.113685 0.025673 0.817194
9.166667 -3.606810 -1.343730 -0.544015 -0.113338 0.036050 0.601710
9.200000 -3.610569 -1.342413 -0.553200 -0.113163 0.046464 0.474699
9.233333 -3.614308 -1.340717 -0.544671 -0.113157 0.056902 0.433438
9.266667 -3.618036 -1.338640 -0.537507 -0.113319 0.067338 0.464811
9.300000 -3.621760 -1.336178 -0.539364 -0.113654 0.077753 0.559793
9.333333 -3.625517 -1.333422 -0.529855 -0.114160 0.088154 0.699395
9.366667 -3.629290 -1.330273 -0.523500 -0.114833 0.098550 0.872174
9.400000 -3.633086 -1.326729 -0.505294 -0.115675 0.108918 1.074174
9.433333 -3.636919 -1.322893 -0.468940 -0.116687 0.119255 1.293770
9.466667 -3.640791 -1.318765 -0.411899 -0.117862 0.129565 1.523642
9.500000 -3.644703 -1.314346 -0.329713 -0.119185 0.139864 1.747473
9.533333 -3.648669 -1.309527 -0.289388 -0.120643 0.150128 1.962536
9.566667 -3.652677 -1.304420 -0.201685 -0.122224 0.160346 2.158413
9.600000 -3.656753 -1.298911 -0.117784 -0.123919 0.170532 2.325091
9.633333 -3.660902 -1.293004 -0.039078 -0.125718 0.180683 2.453783
9.666667 -3.665130 -1.286698 0.059488 -0.127608 0.190771 2.540443
9.700000 -3.669406 -1.280111 0.148926 -0.129578 0.200760 2.594440
9.733333 -3.673731 -1.273245 0.242799 -0.131628 0.210649 2.610675
9.766667 -3.678106 -1.266101 0.369035 -0.133760 0.220430 2.594701
9.800000 -3.682582 -1.258572 0.470554 -0.135972 0.230085 2.551909
9.833333 -3.687165 -1.250661 0.519374 -0.138272 0.239617 2.494496
9.866667 -3.691801 -1.242480 0.631778 -0.140682 0.249062 2.425737
9.900000 -3.696491 -1.234032 0.698652 -0.143216 0.258451 2.344902
9.933333 -3.701301 -1.225214 0.764187 -0.145870 0.267780 2.255513
9.966667 -3.706166 -1.216136 0.838057 -0.148644 0.277052 2.159710
10.000000 -3.711087 -1.206800 0.900281 -0.151548 0.286281 2.057145
10.033333 -3.716145 -1.197109 0.954860 -0.154575 0.295465 1.933417
10.066667 -3.721343 -1.187071 1.042647 -0.157703 0.304576 1.795746
10.100000 -3.726598 -1.176785 1.110783 -0.160916 0.313592 1.644065
10.133333 -3.732000 -1.166162 1.164576 -0.164210 0.322511 1.484818
10.166667 -3.737551 -1.155204 1.260232 -0.167564 0.331313 1.321482
10.200000 -3.743249 -1.143911 1.294740 -0.170943 0.339960 1.165683
10.233333 -3.749004 -1.132387 1.316537 -0.174337 0.348439 1.034393
10.266667 -3.754817 -1.120637 1.340057 -0.177745 0.356752 0.924659
10.300000 -3.760791 -1.108569 1.344256 -0.181166 0.364904 0.838746
10.333333 -3.766930 -1.096192 1.325215 -0.184604 0.372907 0.770743
10.366667 -3.773126 -1.083602 1.305471 -0.188068 0.380780 0.718999
10.400000 -3.779493 -1.070718 1.360479 -0.191573 0.388556 0.663816
10.433333 -3.785914 -1.057633 1.372488 -0.195106 0.396244 0.592765
10.466667 -3.792389 -1.044351 1.425672 -0.198650 0.403843 0.498547
10.500000 -3.799025 -1.030791 1.481817 -0.202180 0.411346 0.376026
10.533333 -3.805818 -1.016959 1.541029 -0.205666 0.418737 0.222587
10.566667 -3.812760 -1.002855 1.571012 -0.209069 0.425990 0.036242
10.600000 -3.819843 -0.988482 1.571428 -0.212355 0.433069 -0.164769
10.633333 -3.827057 -0.973844 1.535635 -0.215495 0.439941 -0.367299
10.666667 -3.834394 -0.958945 1.486446 -0.218452 0.446559 -0.553243
10.700000 -3.841776 -0.943890 1.437557 -0.221203 0.452886 -0.707496
10.733333 -3.849263 -0.928585 1.386857 -0.223736 0.458884 -0.812742
10.766667 -3.856792 -0.913137 1.340413 -0.226055 0.464529 -0.859127
10.800000 -3.864415 -0.897456 1.292584 -0.228175 0.469804 -0.849302
10.833333 -3.872075 -0.881645 1.263225 -0.230118 0.474701 -0.790048
10.866667 -3.879822 -0.865629 1.231394 -0.231926 0.479226 -0.692339
10.900000 -3.887601 -0.849497 1.218713 -0.233631 0.483378 -0.568562
10.933333 -3.895411 -0.833255 1.201909 -0.235267 0.487165 -0.431306
10.966667 -3.903301 -0.816863 1.198775 -0.236846 0.490584 -0.292400
11.000000 -3.911217 -0.800375 1.187936 -0.238385 0.493633 -0.155197
11.033333 -3.919157 -0.783798 1.189282 -0.239889 0.496314 -0.017297
11.066667 -3.927175 -0.767125 1.194448 -0.241349 0.498636 0.124528
11.100000 -3.935270 -0.750378 1.210053 -0.242755 0.500611 0.277903
11.133333 -3.943381 -0.733563 1.201687 -0.244085 0.502245 0.451742
11.166667 -3.951565 -0.716713 1.214722 -0.245327 0.503551 0.657162
11.200000 -3.959819 -0.699849 1.228938 -0.246452 0.504539 0.895990
11.233333 -3.968081 -0.682938 1.253557 -0.247434 0.505221 1.159395
11.266667 -3.976403 -0.666046 1.288485 -0.248254 0.505603 1.436939
11.300000 -3.984728 -0.649121 1.310145 -0.248903 0.505694 1.710959
11.333333 -3.993099 -0.632243 1.355234 -0.249369 0.505515 1.952737
11.366667 -4.001468 -0.615346 1.437498 -0.249647 0.505095 2.131699
11.400000 -4.009832 -0.598436 1.535133 -0.249749 0.504461 2.221628
11.433333 -4.018189 -0.581521 1.666629 -0.249675 0.503635 2.207220
11.466667 -4.026547 -0.564687 1.812818 -0.249418 0.502629 2.071763
11.500000 -4.034891 -0.547940 1.946796 -0.248957 0.501457 1.804170
11.533333 -4.043206 -0.531283 2.055319 -0.248268 0.500111 1.413701
11.566667 -4.051502 -0.514648 2.093418 -0.247323 0.498583 0.919951
11.600000 -4.059777 -0.498040 2.141992 -0.246077 0.496851 0.347548
11.633333 -4.068027 -0.481465 2.146152 -0.244505 0.494907 -0.268181
11.666667 -4.076249 -0.464930 2.104013 -0.242590 0.492739 -0.882694
11.700000 -4.084442 -0.448441 2.036484 -0.240331 0.490323 -1.445861
11.733333 -4.092602 -0.432005 1.952208 -0.237741 0.487646 -1.921001
11.766667 -4.100608 -0.415695 1.846088 -0.234837 0.484688 -2.279854
11.800000 -4.108449 -0.399519 1.726557 -0.231669 0.481450 -2.500947
11.833333 -4.116117 -0.383487 1.576602 -0.228282 0.477924 -2.579023
11.866667 -4.123606 -0.367607 1.467233 -0.224737 0.474112 -2.523934
11.900000 -4.131049 -0.351809 1.319936 -0.221097 0.470024 -2.355625
11.933333 -4.138314 -0.336181 1.205929 -0.217424 0.465660 -2.097284
11.966667 -4.145530 -0.320645 1.145312 -0.213773 0.461018 -1.774261
12.000000 -4.152575 -0.305299 1.092567 -0.210176 0.456064 -1.407174
12.033333 -4.159457 -0.290150 1.076233 -0.206660 0.450770 -1.014686
12.066667 -4.166283 -0.275111 1.083597 -0.203232 0.445106 -0.603575
12.100000 -4.172963 -0.260292 1.095572 -0.199902 0.439049 -0.177464
12.133333 -4.179586 -0.245592 1.090478 -0.196661 0.432574 0.263494
12.166667 -4.186079 -0.231136 1.111664 -0.193515 0.425689 0.724961
12.200000 -4.192453 -0.216935 1.128591 -0.190465 0.418418 1.208318
12.233333 -4.198717 -0.203005 1.128259 -0.187505 0.410809 1.713668
12.266667 -4.204883 -0.189365 1.137186 -0.184638 0.402917 2.232247
12.300000 -4.210958 -0.176034 1.193937 -0.181853 0.394819 2.747742
12.333333 -4.216949 -0.163027 1.285239 -0.179153 0.386633 3.241957
12.366667 -4.222858 -0.150358 1.452015 -0.176528 0.378460 3.674879
12.400000 -4.228700 -0.137840 1.641238 -0.173969 0.370404 4.001956
12.433333 -4.234456 -0.125678 1.852457 -0.171469 0.362546 4.177410
12.466667 -4.240121 -0.113877 1.999781 -0.169014 0.354959 4.167629
12.500000 -4.245717 -0.102235 2.205531 -0.166590 0.347669 3.947040
12.533333 -4.251213 -0.090953 2.412693 -0.164177 0.340668 3.501528
12.566667 -4.256637 -0.079833 2.608677 -0.161751 0.333922 2.853338
12.600000 -4.261988 -0.068878 2.749858 -0.159294 0.327386 2.042002
12.633333 -4.267266 -0.058090 2.862380 -0.156790 0.321017 1.115669
12.666667 -4.272469 -0.047469 2.917231 -0.154227 0.314749 0.116932
12.700000 -4.277597 -0.037018 2.855597 -0.151599 0.308542 -0.897079
12.733333 -4.282649 -0.026738 2.746630 -0.148898 0.302351 -1.866291
12.766667 -4.287594 -0.016750 2.618047 -0.146125 0.296160 -2.747997
12.800000 -4.292462 -0.006936 2.444658 -0.143273 0.289954 -3.509484
12.833333 -4.297214 0.002616 2.255832 -0.140338 0.283728 -4.115987
12.866667 -4.301840 0.011921 2.068299 -0.137324 0.277504 -4.533512
12.900000 -4.306330 0.020990 1.889842 -0.134228 0.271295 -4.750000
12.933333 -4.310742 0.029882 1.718779 -0.131065 0.265132 -4.773706
12.966667 -4.315074 0.038595 1.533188 -0.127847 0.259020 -4.614744
13.000000 -4.319328 0.047130 1.325457 -0.124598 0.252964 -4.286804
13.033333 -4.323501 0.055486 1.104471 -0.121334 0.246957 -3.819531
13.066667 -4.327514 0.063631 0.963447 -0.118073 0.240980 -3.251167
13.100000 -4.331370 0.071566 0.826859 -0.114833 0.235014 -2.617397
13.133333 -4.335076 0.079288 0.719731 -0.111632 0.229042 -1.945851
13.166667 -4.338703 0.086831 0.691680 -0.108490 0.223061 -1.272305
13.200000 -4.342250 0.094194 0.707601 -0.105423 0.217071 -0.637286
13.233333 -4.345678 0.101333 0.749732 -0.102451 0.211078 -0.068808
13.266667 -4.349028 0.108293 0.810192 -0.099589 0.205084 0.425358
13.300000 -4.352275 0.115017 0.861660 -0.096841 0.199089 0.847848
13.333333 -4.355428 0.121502 0.934427 -0.094199 0.193093 1.201465
13.366667 -4.358502 0.127808 0.977352 -0.091656 0.187082 1.513895
13.400000 -4.361499 0.133936 1.046922 -0.089199 0.181043 1.818624
13.433333 -4.364418 0.139887 1.082625 -0.086811 0.174954 2.136215
13.466667 -4.367262 0.145662 1.139065 -0.084478 0.168818 2.473838
13.500000 -4.370029 0.151262 1.163797 -0.082190 0.162627 2.839405
13.533333 -4.372725 0.156587 1.188152 -0.079937 0.156366 3.243445
13.566667 -4.375346 0.161740 1.261151 -0.077704 0.150032 3.666695
13.600000 -4.377903 0.166608 1.446096 -0.075480 0.143643 4.093311
13.633333 -4.380385 0.171305 1.653188 -0.073256 0.137222 4.528427
13.666667 -4.382794 0.175832 1.855218 -0.071023 0.130783 4.970374
13.700000 -4.385131 0.180067 2.098864 -0.068775 0.124357 5.397401
13.733333 -4.387389 0.184012 2.306633 -0.066512 0.117992 5.788365
13.766667 -4.389576 0.187791 2.386937 -0.064241 0.111748 6.147650
13.800000 -4.391693 0.191408 2.567782 -0.061967 0.105654 6.470626
13.833333 -4.393739 0.194863 2.826406 -0.059697 0.099740 6.727611
13.866667 -4.395687 0.198041 3.072085 -0.057439 0.094042 6.896637
13.900000 -4.397530 0.200943 -3.020611 -0.055206 0.088591 6.973526
13.933333 -4.399313 0.203702 -2.757838 -0.053006 0.083395 6.944524
13.966667 -4.401029 0.206321 -2.430772 -0.050847 0.078453 6.777642
14.000000 -4.402674 0.208802 -2.124475 -0.048736 0.073773 6.460347
14.033333 -4.404255 0.211136 -1.829674 -0.046683 0.069359 6.004253
