t x y theta dxdt dydt dthetadt
0.000000 0.000000 0.000000 0.235568 0.042382 -0.006525 0.000878
0.033333 0.001928 -0.000477 0.243187 0.054213 -0.007689 0.000074
0.066667 0.003791 -0.000962 0.245486 0.065092 -0.008307 -0.001608
0.100000 0.006140 -0.001345 0.233539 0.074985 -0.008390 -0.003011
0.133333 0.008979 -0.001626 0.236022 0.083827 -0.007956 -0.004470
0.166667 0.011752 -0.001917 0.235044 0.091574 -0.007016 -0.004307
0.200000 0.015020 -0.002105 0.240442 0.098168 -0.005585 -0.003659
0.233333 0.018283 -0.002291 0.237114 0.105304 -0.004049 -0.001705
0.266667 0.022050 -0.002371 0.242317 0.112959 -0.002411 0.001825
0.300000 0.025859 -0.002441 0.241592 0.121158 -0.000664 0.004752
0.333333 0.029725 -0.002496 0.233558 0.130029 0.001217 0.007653
0.366667 0.034109 -0.002444 0.238700 0.139621 0.003244 0.009139
0.400000 0.038580 -0.002372 0.236341 0.150021 0.005434 0.010648
0.433333 0.043581 -0.002189 0.237682 0.161283 0.007800 0.011308
0.466667 0.048720 -0.001977 0.242246 0.173499 0.010361 0.011218
0.500000 0.054400 -0.001652 0.242246 0.186686 0.013120 0.011365
0.533333 0.060627 -0.001214 0.242246 0.200747 0.016058 0.010582
0.566667 0.067405 -0.000660 0.242246 0.215634 0.019166 0.009808
0.600000 0.074741 0.000010 0.242246 0.231222 0.022417 0.008200
0.633333 0.082640 0.000798 0.242246 0.247430 0.025796 0.006259
0.666667 0.091109 0.001704 0.242246 0.264110 0.029272 0.004313
0.700000 0.100151 0.002730 0.242246 0.281150 0.032822 0.002421
0.733333 0.109772 0.003876 0.242246 0.298479 0.036431 0.001253
0.766667 0.119978 0.005144 0.242246 0.316023 0.040084 0.000380
0.800000 0.130773 0.006534 0.242246 0.333746 0.043773 0.000000
0.833333 0.142162 0.008049 0.242246 0.351609 0.047491 0.000000
0.866667 0.154150 0.009688 0.242246 0.369609 0.051237 0.000000
0.900000 0.166741 0.011452 0.242246 0.387741 0.055009 0.000000
0.933333 0.179941 0.013343 0.242246 0.405999 0.058807 0.000000
0.966667 0.193752 0.015361 0.242246 0.424380 0.062630 -0.000684
1.000000 0.208178 0.017507 0.242246 0.443015 0.066505 -0.001410
1.033333 0.223225 0.019782 0.242246 0.462194 0.070489 -0.002976
1.066667 0.238895 0.022187 0.242246 0.482369 0.074675 -0.005904
1.100000 0.255192 0.024722 0.242246 0.504179 0.079192 -0.009266
1.133333 0.272119 0.027388 0.242246 0.528463 0.084210 -0.012279
1.166667 0.289680 0.030186 0.242246 0.556061 0.089898 -0.013738
1.200000 0.307876 0.033115 0.242246 0.587531 0.096372 -0.014852
1.233333 0.326711 0.036178 0.242246 0.623116 0.103680 -0.014329
1.266667 0.346187 0.039374 0.242246 0.663021 0.111865 -0.011980
1.300000 0.366306 0.042703 0.234042 0.707407 0.120961 -0.008586
1.333333 0.388728 0.046501 0.241741 0.755875 0.130889 -0.006089
1.366667 0.413662 0.050810 0.232160 0.808255 0.141618 -0.003570
1.400000 0.441249 0.055661 0.225901 0.864772 0.153197 -0.000506
1.433333 0.471658 0.061087 0.237049 0.926085 0.165765 0.002020
1.466667 0.505189 0.067152 0.246421 0.992203 0.179329 0.005185
1.500000 0.539338 0.073345 0.244493 1.062662 0.193796 0.007206
1.533333 0.574096 0.079665 0.245385 1.138082 0.209298 0.010596
1.566667 0.609450 0.086109 0.241711 1.219273 0.226005 0.012632
1.600000 0.649008 0.093417 0.231467 1.306937 0.244063 0.018265
1.633333 0.693032 0.101642 0.236188 1.400284 0.263311 0.029840
1.666667 0.737605 0.109983 0.239325 1.498713 0.283623 0.039967
1.700000 0.787377 0.119394 0.245115 1.601550 0.304860 0.060010
1.733333 0.842784 0.129969 0.239233 1.706345 0.326513 0.088518
1.766667 0.904243 0.141793 0.239608 1.809087 0.347754 0.123588
1.800000 0.966136 0.153708 0.248865 1.904895 0.367570 0.158912
1.833333 1.028424 0.165707 0.240267 1.990090 0.385201 0.189641
1.866667 1.098315 0.179280 0.252800 2.061243 0.399937 0.234847
1.900000 1.176467 0.194567 0.249129 2.114249 0.410928 0.278471
1.933333 1.263527 0.211704 0.298149 2.145000 0.417325 0.318550
1.966667 1.343669 0.227403 0.313159 2.151597 0.418736 0.361754
2.000000 1.417656 0.241826 0.237608 2.133023 0.414950 0.413416
2.033333 1.491728 0.256268 0.353502 2.089207 0.405957 0.471446
2.066667 1.565836 0.270720 0.358073 2.020791 0.391889 0.518835
2.100000 1.639929 0.285171 0.320223 1.930402 0.373293 0.563350
2.133333 1.710418 0.298882 0.371953 1.823516 0.351305 0.606191
2.166667 1.769766 0.310291 0.336506 1.704898 0.326911 0.647431
2.200000 1.828975 0.321673 0.420644 1.578805 0.300991 0.669290
2.233333 1.878312 0.331022 0.451144 1.449392 0.274404 0.682686
2.266667 1.918348 0.338459 0.485882 1.320973 0.248042 0.685503
2.300000 1.958183 0.345857 0.504468 1.197063 0.222627 0.664449
2.333333 1.989636 0.351537 0.518594 1.079652 0.198571 0.631105
2.366667 2.020880 0.357177 0.545426 0.969478 0.176023 0.574441
2.400000 2.051916 0.362777 0.567789 0.868192 0.155324 0.512255
2.433333 2.075579 0.366872 0.581373 0.775916 0.136497 0.424441
2.466667 2.099045 0.370928 0.608491 0.691244 0.119250 0.335335
2.500000 2.122324 0.374949 0.619302 0.613206 0.103382 0.258398
2.533333 2.138959 0.377617 0.626955 0.540553 0.088630 0.172039
2.566667 2.155436 0.380255 0.637197 0.472952 0.074922 0.072945
2.600000 2.171774 0.382868 0.610521 0.409333 0.062036 -0.032203
2.633333 2.181734 0.384179 0.538293 0.349760 0.049981 -0.109130
2.666667 2.190064 0.385171 0.656466 0.295174 0.038947 -0.198626
2.700000 2.198329 0.386154 0.639869 0.245390 0.028892 -0.310592
2.733333 2.206557 0.387131 0.633157 0.199691 0.019666 -0.418940
2.766667 2.208794 0.386888 0.454027 0.157217 0.011088 -0.506241
2.800000 2.211059 0.386653 0.632538 0.117480 0.003056 -0.585060
2.833333 2.213388 0.386435 0.571841 0.079044 -0.004730 -0.673407
2.866667 2.215818 0.386240 0.553091 0.040218 -0.012618 -0.747908
2.900000 2.218385 0.386077 0.390470 0.000460 -0.020719 -0.770778
2.933333 2.218873 0.385491 0.462294 -0.040041 -0.028993 -0.760510
2.966667 2.219573 0.384951 0.436200 -0.081517 -0.037488 -0.727575
3.000000 2.220524 0.384466 0.429104 -0.124475 -0.046307 -0.670187
3.033333 2.214526 0.382545 0.241462 -0.168295 -0.055322 -0.612668
3.066667 2.208865 0.380696 0.390991 -0.211089 -0.064144 -0.558106
3.100000 2.195944 0.377341 0.118687 -0.250828 -0.072355 -0.528264
3.133333 2.183460 0.374080 0.372502 -0.284746 -0.079382 -0.551397
3.166667 2.171470 0.370923 0.380663 -0.308824 -0.084397 -0.612891
3.200000 2.160028 0.367882 0.240478 -0.318880 -0.086532 -0.706471
3.233333 2.148544 0.364825 0.260680 -0.310779 -0.084932 -0.795097
3.266667 2.137716 0.361906 0.449484 -0.282683 -0.079215 -0.878824
3.300000 2.119216 0.357390 0.284263 -0.232259 -0.068899 -0.974162
3.333333 2.100445 0.352808 0.350677 -0.157981 -0.053665 -1.033759
3.366667 2.082510 0.348402 -0.037222 -0.057831 -0.033100 -1.033648
3.400000 2.079141 0.346995 -0.042350 0.070226 -0.006783 -0.993495
3.433333 2.076718 0.345786 -0.039142 0.227786 0.025610 -0.926811
3.466667 2.088691 0.347539 -0.046642 0.416430 0.064406 -0.814164
3.500000 2.101686 0.349506 -0.048197 0.634652 0.109293 -0.632995
3.533333 2.115732 0.351693 -0.041381 0.879499 0.159662 -0.401243
3.566667 2.144316 0.356867 -0.046059 1.144440 0.214168 -0.208854
3.600000 2.173991 0.362270 -0.045806 1.422645 0.271407 -0.041235
3.633333 2.218544 0.370728 -0.040933 1.704629 0.329429 0.100698
3.666667 2.278317 0.382312 -0.045900 1.981959 0.386501 0.243966
3.700000 2.353751 0.397115 -0.026519 2.246838 0.441025 0.343796
3.733333 2.445529 0.415280 -0.047137 2.491633 0.491432 0.429263
3.766667 2.554303 0.436943 -0.055561 2.710481 0.536520 0.558792
3.800000 2.663984 0.458798 -0.052315 2.897996 0.575184 0.730019
3.833333 2.774494 0.480829 0.281485 3.052461 0.607069 0.933198
3.866667 2.885758 0.503021 0.191614 3.173429 0.632084 1.087676
3.900000 2.997698 0.525357 -0.068147 3.262920 0.650641 1.257699
3.933333 3.110234 0.547823 -0.070756 3.324929 0.663560 1.421538
3.966667 3.223289 0.570400 -0.075267 3.365778 0.672140 1.570613
4.000000 3.336781 0.593075 0.454064 3.391054 0.677528 1.688019
4.033333 3.450633 0.615830 0.436782 3.404218 0.680437 1.795060
4.066667 3.566693 0.639044 0.643081 3.407411 0.681307 1.903842
4.100000 3.678454 0.661378 0.418305 3.401941 0.680409 1.969734
4.133333 3.794103 0.684522 0.402939 3.387481 0.677677 1.964358
4.166667 3.909788 0.707681 0.612658 3.361270 0.672545 1.900044
4.200000 4.025425 0.730837 0.612807 3.321137 0.664568 1.814108
4.233333 4.140933 0.753974 0.715314 3.266272 0.653578 1.684620
4.266667 4.252757 0.776366 1.002471 3.196495 0.639541 1.529517
4.300000 4.364291 0.798707 0.717396 3.110341 0.622155 1.365547
4.333333 4.473891 0.820671 1.009484 3.007909 0.601442 1.191253
4.366667 4.571149 0.840107 1.009084 2.891776 0.577929 1.014860
4.400000 4.667899 0.859447 1.006389 2.764403 0.552125 0.818356
4.433333 4.764079 0.878678 1.007260 2.628119 0.524505 0.622940
4.466667 4.850112 0.895840 1.003949 2.484940 0.495486 0.460259
4.500000 4.926641 0.911066 1.016868 2.339096 0.465936 0.299712
4.533333 5.002446 0.926152 1.008932 2.194471 0.436652 0.190151
4.566667 5.069897 0.939542 1.006109 2.052865 0.408000 0.117805
4.600000 5.136552 0.952776 1.000530 1.916071 0.380349 0.081639
4.633333 5.195786 0.964509 1.005431 1.786630 0.354214 0.067998
4.666667 5.248045 0.974832 1.014397 1.667042 0.330103 0.051188
4.700000 5.299439 0.984986 0.999645 1.557777 0.308106 0.058756
4.733333 5.349953 0.994968 1.001895 1.458915 0.288234 0.065599
4.766667 5.394569 1.003762 1.029588 1.370664 0.270525 0.067742
4.800000 5.433747 1.011466 1.029588 1.293600 0.255092 0.064667
4.833333 5.472019 1.018992 1.029588 1.226770 0.241737 0.059427
4.866667 5.509385 1.026341 1.029588 1.168603 0.230138 0.053792
4.900000 5.545843 1.033511 1.029588 1.118253 0.220122 0.044226
4.933333 5.581391 1.040503 1.029588 1.074866 0.211513 0.031765
4.966667 5.616030 1.047316 1.029588 1.037378 0.204095 0.021262
5.000000 5.649761 1.053950 1.029588 1.003960 0.197498 0.010814
5.033333 5.682583 1.060407 1.029588 0.973331 0.191462 0.000013
5.066667 5.714498 1.066685 1.029588 0.944715 0.185831 -0.009893
5.100000 5.745509 1.072785 1.029588 0.917335 0.180448 -0.017675
5.133333 5.775617 1.078708 1.029588 0.890411 0.175156 -0.024924
5.166667 5.804826 1.084454 1.029588 0.863580 0.169880 -0.032231
5.200000 5.833139 1.090024 1.029588 0.836857 0.164626 -0.034865
5.233333 5.860560 1.095418 1.029588 0.810255 0.159394 -0.032826
5.266667 5.887093 1.100638 1.029588 0.783788 0.154188 -0.030102
5.300000 5.912743 1.105684 1.029588 0.757471 0.149011 -0.026696
5.333333 5.937516 1.110557 1.001197 0.731316 0.143866 -0.017431
5.366667 5.961416 1.115259 1.001197 0.705337 0.138754 -0.005741
5.400000 5.984451 1.119791 1.025136 0.679545 0.133679 0.004011
5.433333 6.006626 1.124153 1.025136 0.653954 0.128643 0.011828
5.466667 6.027949 1.128348 1.008284 0.628575 0.123648 0.021106
5.500000 6.048427 1.132376 1.028888 0.603420 0.118698 0.030131
5.533333 6.068068 1.136239 1.028888 0.578501 0.113793 0.032765
5.566667 6.086880 1.139940 1.028888 0.553828 0.108937 0.030725
5.600000 6.104871 1.143478 1.028888 0.529413 0.104131 0.028002
5.633333 6.122050 1.146857 1.028888 0.505267 0.099378 0.024595
5.666667 6.138426 1.150078 1.028888 0.481398 0.094680 0.017696
5.700000 6.154009 1.153143 1.028888 0.457819 0.090038 0.010739
5.733333 6.168809 1.156053 1.028888 0.434538 0.085456 0.006089
5.766667 6.182836 1.158812 1.028888 0.411565 0.080934 0.003747
5.800000 6.196100 1.161420 1.028888 0.388909 0.076475 0.001717
5.833333 6.208612 1.163880 1.028888 0.366580 0.072080 0.000000
5.866667 6.220384 1.166195 1.028888 0.344585 0.067752 0.000000
5.900000 6.231426 1.168366 1.028888 0.322934 0.063491 0.000000
5.933333 6.241750 1.170395 1.028888 0.301633 0.059300 0.000000
5.966667 6.251369 1.172286 1.028888 0.280692 0.055180 0.000000
6.000000 6.260293 1.174041 1.028888 0.260117 0.051132 0.000000
6.033333 6.268537 1.175661 1.028888 0.239916 0.047158 0.000000
6.066667 6.276112 1.177150 1.028888 0.220094 0.043260 0.000000
6.100000 6.283031 1.178509 1.028888 0.200660 0.039438 0.000000
6.133333 6.289307 1.179743 1.028888 0.181619 0.035694 0.000000
6.166667 6.294954 1.180852 1.028888 0.162977 0.032029 -0.001615
6.200000 6.299985 1.181841 1.028888 0.144739 0.028445 -0.004713
6.233333 6.304414 1.182711 1.028888 0.126978 0.024956 -0.008297
6.266667 6.308254 1.183466 1.028888 0.109829 0.021590 -0.012877
6.300000 6.311520 1.184107 1.028888 0.093430 0.018377 -0.018454
6.333333 6.314225 1.184639 1.028888 0.077916 0.015345 -0.025027
6.366667 6.316384 1.185063 1.028888 0.063421 0.012521 -0.030618
6.400000 6.318012 1.185383 1.028888 0.050129 0.009945 -0.034180
6.433333 6.319122 1.185602 1.028888 0.038090 0.007625 -0.038122
6.466667 6.319730 1.185722 1.028888 0.027266 0.005555 -0.042792
6.500000 6.319851 1.185746 1.009503 0.017657 0.003733 -0.046494
6.533333 6.319498 1.185678 1.011101 0.009299 0.002165 -0.049345
6.566667 6.319479 1.185686 1.023055 0.002191 0.000851 -0.050735
6.600000 6.319807 1.185773 1.016929 -0.003832 -0.000246 -0.053548
6.633333 6.319705 1.185775 1.016929 -0.008844 -0.001143 -0.054952
6.666667 6.319186 1.185696 1.016929 -0.012921 -0.001856 -0.052091
