t x y theta dxdt dydt dthetadt
0.000000 0.000000 0.000000 -0.324743 0.001789 0.000463 -0.033705
0.033333 0.000264 -0.000144 -0.333086 -0.000752 0.000665 -0.030085
0.066667 0.000704 0.000130 -0.337270 -0.005531 0.001186 -0.023538
0.100000 0.000830 0.000321 -0.344443 -0.013252 0.002064 -0.011880
0.133333 0.000878 0.000432 -0.341549 -0.024604 0.003332 0.005264
0.166667 0.000842 0.000461 -0.337137 -0.040050 0.004959 0.026727
0.200000 0.000716 0.000406 -0.332301 -0.060145 0.006910 0.052641
0.233333 0.000017 0.000487 -0.332060 -0.085349 0.009123 0.081482
0.266667 -0.000785 0.000481 -0.330936 -0.115717 0.011585 0.115533
0.300000 -0.003078 0.000802 -0.323131 -0.151476 0.014234 0.153194
0.333333 -0.007302 0.001256 -0.320181 -0.192943 0.016956 0.193368
0.366667 -0.013758 0.001991 -0.310037 -0.240379 0.019637 0.235723
0.400000 -0.024114 0.003110 -0.313967 -0.293071 0.022072 0.279192
0.433333 -0.034579 0.004120 -0.305345 -0.350212 0.023988 0.325471
0.466667 -0.045149 0.005019 -0.297668 -0.410786 0.025019 0.372763
0.500000 -0.055819 0.005802 -0.285070 -0.473557 0.024912 0.421284
0.533333 -0.071384 0.006892 -0.252412 -0.536687 0.023479 0.469355
0.566667 -0.090816 0.007972 -0.239258 -0.598375 0.020594 0.517323
0.600000 -0.113554 0.009468 -0.215307 -0.657582 0.016201 0.565260
0.633333 -0.138902 0.010591 -0.193788 -0.712776 0.010439 0.610471
0.666667 -0.167298 0.011175 -0.184755 -0.762445 0.003528 0.653873
0.700000 -0.195702 0.011603 -0.168909 -0.804963 -0.004268 0.695460
0.733333 -0.224091 0.011870 -0.145384 -0.839616 -0.012664 0.738802
0.766667 -0.255611 0.010720 -0.109070 -0.865509 -0.021052 0.780857
0.800000 -0.287063 0.009401 -0.077543 -0.881533 -0.028616 0.818187
0.833333 -0.318420 0.007912 -0.050748 -0.886843 -0.034549 0.852378
0.866667 -0.349655 0.006250 -0.030835 -0.880579 -0.038094 0.881718
0.900000 -0.380741 0.004416 -0.010306 -0.862329 -0.038682 0.906347
0.933333 -0.411650 0.002407 0.041594 -0.830769 -0.036010 0.921578
0.966667 -0.441965 -0.000123 0.073255 -0.785589 -0.030429 0.932494
1.000000 -0.472049 -0.002828 0.118152 -0.726858 -0.022932 0.945794
1.033333 -0.499286 -0.004594 0.148615 -0.655430 -0.015013 0.963032
1.066667 -0.526243 -0.006535 0.183399 -0.572854 -0.008377 0.985251
1.100000 -0.548406 -0.005901 0.192263 -0.480845 -0.004867 1.016429
1.133333 -0.564847 -0.003593 0.210976 -0.382580 -0.006212 1.067665
1.166667 -0.574938 -0.000545 0.249405 -0.281067 -0.014072 1.139039
1.200000 -0.578366 0.002515 0.296637 -0.179830 -0.029646 1.226704
1.233333 -0.581459 0.005403 0.333882 -0.081859 -0.053379 1.327498
1.266667 -0.577983 0.005344 0.364803 0.009598 -0.085388 1.439946
1.300000 -0.574177 0.005113 0.395201 0.092053 -0.125326 1.555431
1.333333 -0.566910 0.001242 0.466893 0.164070 -0.172384 1.655977
1.366667 -0.556905 -0.005737 0.529129 0.225045 -0.225064 1.735294
1.400000 -0.545130 -0.015405 0.595223 0.275409 -0.281385 1.789320
1.433333 -0.533059 -0.025230 0.670609 0.315587 -0.339702 1.814427
1.466667 -0.520301 -0.037588 0.769307 0.347068 -0.398260 1.803714
1.500000 -0.507585 -0.051618 0.833632 0.370997 -0.455403 1.757912
1.533333 -0.493608 -0.068922 0.901087 0.388527 -0.509666 1.686650
1.566667 -0.479389 -0.086338 0.952300 0.400687 -0.560277 1.593301
1.600000 -0.465198 -0.107974 1.000833 0.408335 -0.606822 1.482631
1.633333 -0.450792 -0.129686 1.044147 0.412036 -0.648786 1.362209
1.666667 -0.436738 -0.155116 1.081086 0.411698 -0.685480 1.245190
1.700000 -0.422498 -0.180579 1.120875 0.407181 -0.716475 1.135844
1.733333 -0.408088 -0.206052 1.151889 0.398438 -0.741627 1.036848
1.766667 -0.393524 -0.231511 1.179910 0.385226 -0.760554 0.948994
1.800000 -0.380212 -0.258245 1.199697 0.366921 -0.773034 0.874613
1.833333 -0.366775 -0.284917 1.232110 0.343237 -0.778881 0.810032
1.866667 -0.354616 -0.313077 1.265626 0.314473 -0.778456 0.748798
1.900000 -0.342360 -0.341124 1.286518 0.280959 -0.771998 0.690891
1.933333 -0.330020 -0.369031 1.301874 0.242698 -0.759422 0.632603
1.966667 -0.321151 -0.395544 1.327299 0.199896 -0.740610 0.573869
2.000000 -0.317812 -0.419871 1.346673 0.153616 -0.715761 0.511589
2.033333 -0.314421 -0.443995 1.360952 0.105173 -0.685138 0.449571
2.066667 -0.310981 -0.467890 1.390981 0.055685 -0.649169 0.391200
2.100000 -0.307498 -0.491535 1.390305 0.006362 -0.608157 0.338076
2.133333 -0.308010 -0.512348 1.406789 -0.040980 -0.563017 0.292626
2.166667 -0.311582 -0.530764 1.406712 -0.084496 -0.514754 0.256846
2.200000 -0.317816 -0.546667 1.406568 -0.123116 -0.464223 0.233818
2.233333 -0.324008 -0.562255 1.408128 -0.156089 -0.412479 0.220297
2.266667 -0.331767 -0.575129 1.410949 -0.182644 -0.360458 0.212910
2.300000 -0.340619 -0.585985 1.408512 -0.202102 -0.309502 0.207735
2.333333 -0.350323 -0.594563 1.417264 -0.214305 -0.260421 0.199654
2.366667 -0.359626 -0.600548 1.430144 -0.219670 -0.214171 0.184357
2.400000 -0.368853 -0.606173 1.451050 -0.218682 -0.171342 0.153307
2.433333 -0.376894 -0.609856 1.456414 -0.211815 -0.132567 0.106696
2.466667 -0.384841 -0.613170 1.477935 -0.199821 -0.098075 0.044469
2.500000 -0.390621 -0.614142 1.474779 -0.183725 -0.067848 -0.033749
2.533333 -0.396294 -0.614737 1.493683 -0.164808 -0.041874 -0.124490
2.566667 -0.401853 -0.614955 1.485998 -0.144110 -0.019898 -0.224384
2.600000 -0.407291 -0.614795 1.463752 -0.122418 -0.001977 -0.323170
2.633333 -0.412601 -0.614259 1.445660 -0.100492 0.012299 -0.418223
2.666667 -0.415172 -0.612618 1.415600 -0.079177 0.023084 -0.503452
2.700000 -0.416184 -0.610835 1.398483 -0.058995 0.030743 -0.572705
2.733333 -0.417054 -0.608672 1.365650 -0.040176 0.035542 -0.619156
2.766667 -0.416841 -0.607341 1.356233 -0.022713 0.037921 -0.642440
2.800000 -0.416481 -0.605629 1.336084 -0.006419 0.038498 -0.645262
2.833333 -0.415973 -0.603538 1.291070 0.008877 0.037661 -0.626181
2.866667 -0.415315 -0.601066 1.268925 0.023784 0.035924 -0.588414
2.900000 -0.414553 -0.600121 1.244778 0.039202 0.033736 -0.532680
2.933333 -0.413279 -0.600386 1.219145 0.056108 0.031680 -0.464501
2.966667 -0.411847 -0.600268 1.212215 0.075310 0.030071 -0.384662
3.000000 -0.410258 -0.599763 1.196983 0.097206 0.029350 -0.294359
3.033333 -0.408510 -0.598870 1.185621 0.122120 0.030073 -0.202012
3.066667 -0.406603 -0.597587 1.191440 0.149962 0.032929 -0.114641
3.100000 -0.401945 -0.596434 1.183442 0.179709 0.038623 -0.040866
3.133333 -0.394292 -0.595935 1.177817 0.209889 0.047905 0.009955
3.166667 -0.386486 -0.595030 1.187191 0.238897 0.061784 0.031596
3.200000 -0.378530 -0.593717 1.197780 0.265295 0.081205 0.015802
3.233333 -0.367710 -0.592195 1.218364 0.287557 0.106888 -0.039897
3.266667 -0.355499 -0.590309 1.244829 0.304504 0.139350 -0.136342
3.300000 -0.341809 -0.587917 1.247778 0.315857 0.178759 -0.272647
3.333333 -0.327566 -0.584130 1.250611 0.322017 0.224752 -0.442089
3.366667 -0.314067 -0.578521 1.235845 0.323651 0.276412 -0.637665
3.400000 -0.302815 -0.570142 1.208059 0.321681 0.332283 -0.846092
3.433333 -0.293065 -0.558496 1.180322 0.317543 0.390749 -1.053118
3.466667 -0.284001 -0.543802 1.127947 0.312622 0.449836 -1.242194
3.500000 -0.275359 -0.526069 1.080941 0.308076 0.507502 -1.401590
3.533333 -0.266665 -0.505650 1.014088 0.304716 0.561864 -1.519216
3.566667 -0.257931 -0.484861 0.943828 0.303129 0.611400 -1.588453
3.600000 -0.248492 -0.461414 0.860265 0.303427 0.655056 -1.605852
3.633333 -0.238022 -0.436610 0.789623 0.305151 0.692193 -1.572847
3.666667 -0.227087 -0.410927 0.727553 0.307677 0.722649 -1.493994
3.700000 -0.216142 -0.384944 0.674166 0.310177 0.746784 -1.373677
3.733333 -0.205046 -0.359118 0.632840 0.311849 0.765305 -1.223064
3.766667 -0.193955 -0.333033 0.597835 0.312058 0.778994 -1.051234
3.800000 -0.183174 -0.306011 0.557599 0.310486 0.788807 -0.870874
3.833333 -0.172163 -0.278431 0.523914 0.307094 0.795610 -0.688506
3.866667 -0.161757 -0.251031 0.519078 0.302010 0.800291 -0.515176
3.900000 -0.151952 -0.224584 0.507399 0.295583 0.803538 -0.357541
3.933333 -0.142189 -0.197985 0.515561 0.288246 0.805958 -0.220082
3.966667 -0.132472 -0.171254 0.504049 0.280383 0.808065 -0.104220
4.000000 -0.122808 -0.144411 0.521580 0.272285 0.810111 -0.010787
4.033333 -0.113867 -0.116821 0.515846 0.264251 0.812265 0.058636
4.066667 -0.105636 -0.090455 0.529425 0.256426 0.814416 0.106496
4.100000 -0.097474 -0.064041 0.541259 0.248807 0.816318 0.137869
4.133333 -0.089708 -0.036682 0.545763 0.241348 0.817580 0.159884
4.166667 -0.082020 -0.009316 0.559359 0.233963 0.817608 0.175162
4.200000 -0.074323 0.018763 0.569024 0.226648 0.815839 0.191691
4.233333 -0.066715 0.046806 0.559449 0.219198 0.811553 0.213929
4.266667 -0.059201 0.074793 0.561628 0.211477 0.804223 0.249954
4.300000 -0.051785 0.102703 0.568155 0.203370 0.793231 0.298939
4.333333 -0.045018 0.130087 0.573464 0.194709 0.778001 0.360123
4.366667 -0.038356 0.157351 0.584190 0.185369 0.758187 0.433379
4.400000 -0.032532 0.182574 0.576535 0.175258 0.733690 0.515601
4.433333 -0.026817 0.207637 0.605838 0.164456 0.704699 0.601756
4.466667 -0.021214 0.232520 0.629019 0.153037 0.671358 0.682997
4.500000 -0.016236 0.254803 0.663300 0.141141 0.634282 0.756252
4.533333 -0.011371 0.276873 0.699640 0.128925 0.594097 0.816596
4.566667 -0.007466 0.295824 0.729204 0.116659 0.551831 0.860610
4.600000 -0.003674 0.314533 0.771332 0.104458 0.508024 0.883072
4.633333 -0.000335 0.330715 0.800793 0.092445 0.463363 0.886352
4.666667 0.002326 0.344870 0.840300 0.080786 0.418685 0.872558
4.700000 0.004381 0.356620 0.872836 0.069671 0.374585 0.841382
4.733333 0.006330 0.368094 0.893467 0.059301 0.331788 0.797150
4.766667 0.007882 0.377577 0.924203 0.049718 0.290502 0.741427
4.800000 0.009333 0.386776 0.942335 0.041069 0.251339 0.680885
4.833333 0.010271 0.394318 0.968186 0.033473 0.214680 0.614150
4.866667 0.010994 0.399938 0.995103 0.026967 0.180764 0.543002
4.900000 0.011624 0.405272 1.006614 0.021464 0.149669 0.472718
4.933333 0.011874 0.408964 1.015943 0.016880 0.121544 0.402371
4.966667 0.012060 0.411335 1.037582 0.013169 0.096615 0.334743
5.000000 0.012162 0.413430 1.052351 0.010269 0.074947 0.268655
5.033333 0.012460 0.414575 1.041375 0.008003 0.056519 0.209612
5.066667 0.012657 0.415084 1.060891 0.006244 0.041220 0.157620
5.100000 0.012777 0.415332 1.052478 0.004887 0.029075 0.112635
5.133333 0.012771 0.415595 1.056803 0.003821 0.019742 0.074937
5.166667 0.012998 0.415674 1.049086 0.002930 0.012802 0.046212
5.200000 0.013192 0.415711 1.052927 0.002100 0.007865 0.026501
5.233333 0.013317 0.415513 1.049183 0.001323 0.004554 0.011780
