t x y theta dxdt dydt dthetadt
0.000000 0.000000 0.000000 2.509689 0.019338 0.150644 0.004022
0.033333 0.000648 0.005057 2.491722 0.019542 0.152803 -0.001205
0.066667 0.001305 0.010193 2.491191 0.019744 0.154956 -0.005902
0.100000 0.001969 0.015408 2.499658 0.019941 0.157094 -0.011247
0.133333 0.002641 0.020701 2.496571 0.020132 0.159203 -0.014789
0.166667 0.003318 0.026053 2.490000 0.020315 0.161279 -0.017157
0.200000 0.003998 0.031461 2.495797 0.020490 0.163320 -0.018585
0.233333 0.004686 0.036949 2.495312 0.020657 0.165329 -0.018124
0.266667 0.005382 0.042516 2.478372 0.020818 0.167310 -0.015015
0.300000 0.006081 0.048139 2.502413 0.020974 0.169267 -0.012223
0.333333 0.006784 0.053817 2.499178 0.021125 0.171210 -0.009349
0.366667 0.007489 0.059548 2.481096 0.021273 0.173142 -0.010093
0.400000 0.008198 0.065334 2.481476 0.021418 0.175061 -0.012011
0.433333 0.008913 0.071198 2.490274 0.021558 0.176960 -0.023373
0.466667 0.009632 0.077114 2.484106 0.021693 0.178834 -0.053710
0.500000 0.010358 0.083109 2.510577 0.021821 0.180678 -0.109329
0.533333 0.011091 0.089182 2.482222 0.021942 0.182486 -0.201345
0.566667 0.011832 0.095334 2.499765 0.022056 0.184252 -0.340531
0.600000 0.012575 0.101534 2.485260 0.022162 0.185971 -0.534786
0.633333 0.013319 0.107782 2.483341 0.022260 0.187646 -0.776903
0.666667 0.014064 0.114076 2.491844 0.022352 0.189277 -1.057533
0.700000 0.014811 0.120417 2.468676 0.022437 0.190866 -1.366879
0.733333 0.015559 0.126803 2.450760 0.022517 0.192418 -1.690543
0.766667 0.016308 0.133232 2.396480 0.022594 0.193943 -2.004667
0.800000 0.017057 0.139704 2.279879 0.022668 0.195453 -2.287143
0.833333 0.017814 0.146247 2.178456 0.022740 0.196956 -2.528493
0.866667 0.018579 0.152858 2.043240 0.022809 0.198457 -2.709398
0.900000 0.019344 0.159509 1.888311 0.022873 0.199953 -2.810130
0.933333 0.020108 0.166198 1.776576 0.022930 0.201443 -2.822160
0.966667 0.020872 0.172925 1.716955 0.022975 0.202920 -2.741172
1.000000 0.021642 0.179711 1.614345 0.023004 0.204370 -2.575393
1.033333 0.022414 0.186553 1.478921 0.023013 0.205783 -2.323977
1.066667 0.023189 0.193447 1.408311 0.022997 0.207152 -2.005631
1.100000 0.023963 0.200392 1.300470 0.022957 0.208471 -1.641780
1.133333 0.024735 0.207385 1.273004 0.022888 0.209731 -1.251681
1.166667 0.025505 0.214425 1.233000 0.022790 0.210925 -0.854578
1.200000 0.026272 0.221493 1.217796 0.022662 0.212049 -0.471559
1.233333 0.027032 0.228601 1.203006 0.022508 0.213102 -0.124664
1.266667 0.027789 0.235734 1.195083 0.022329 0.214080 0.174526
1.300000 0.028536 0.242900 1.252598 0.022125 0.214987 0.412104
1.333333 0.029271 0.250096 1.326781 0.021902 0.215827 0.586155
1.366667 0.029994 0.257320 1.382031 0.021663 0.216606 0.691990
1.400000 0.030714 0.264564 1.438071 0.021414 0.217329 0.737408
1.433333 0.031430 0.271826 1.465691 0.021157 0.218000 0.724566
1.466667 0.032133 0.279112 1.467443 0.020896 0.218621 0.664819
1.500000 0.032824 0.286419 1.484333 0.020637 0.219193 0.575074
1.533333 0.033503 0.293748 1.480545 0.020381 0.219716 0.470671
1.566667 0.034178 0.301089 1.521192 0.020131 0.220189 0.362565
1.600000 0.034842 0.308448 1.507585 0.019887 0.220610 0.261921
1.633333 0.035496 0.315823 1.528998 0.019651 0.220979 0.180963
1.666667 0.036145 0.323207 1.534835 0.019424 0.221292 0.118771
1.700000 0.036785 0.330604 1.530455 0.019205 0.221547 0.073883
1.733333 0.037420 0.338007 1.526143 0.018993 0.221744 0.038884
1.766667 0.038050 0.345414 1.499822 0.018787 0.221878 0.018687
1.800000 0.038672 0.352827 1.499822 0.018585 0.221949 0.006964
1.833333 0.039288 0.360240 1.511944 0.018384 0.221955 0.003611
1.866667 0.039897 0.367653 1.526312 0.018184 0.221898 0.009299
1.900000 0.040501 0.375063 1.522283 0.017983 0.221776 0.022676
1.933333 0.041099 0.382470 1.510507 0.017779 0.221592 0.044827
1.966667 0.041690 0.389868 1.515313 0.017574 0.221347 0.064962
2.000000 0.042274 0.397259 1.512286 0.017367 0.221045 0.086962
2.033333 0.042851 0.404636 1.516928 0.017159 0.220688 0.106148
2.066667 0.043418 0.411996 1.528290 0.016949 0.220277 0.123839
2.100000 0.043977 0.419336 1.531198 0.016740 0.219815 0.139648
2.133333 0.044530 0.426663 1.519282 0.016532 0.219303 0.151699
2.166667 0.045078 0.433975 1.550882 0.016325 0.218740 0.163377
2.200000 0.045619 0.441271 1.557332 0.016118 0.218123 0.169352
2.233333 0.046152 0.448538 1.559884 0.015912 0.217451 0.171186
2.266667 0.046678 0.455786 1.574325 0.015706 0.216720 0.165159
2.300000 0.047199 0.463013 1.552778 0.015501 0.215927 0.152706
2.333333 0.047713 0.470218 1.570671 0.015294 0.215068 0.133754
2.366667 0.048221 0.477400 1.574713 0.015085 0.214141 0.111285
2.400000 0.048721 0.484540 1.594939 0.014875 0.213144 0.087215
2.433333 0.049214 0.491637 1.597343 0.014662 0.212079 0.061209
2.466667 0.049699 0.498706 1.599687 0.014447 0.210951 0.036323
2.500000 0.050178 0.505727 1.589955 0.014231 0.209763 0.011992
2.533333 0.050649 0.512719 1.586201 0.014013 0.208520 -0.009601
2.566667 0.051113 0.519659 1.586829 0.013795 0.207228 -0.029418
2.600000 0.051568 0.526547 1.582268 0.013576 0.205894 -0.045976
2.633333 0.052017 0.533401 1.570350 0.013357 0.204519 -0.055114
2.666667 0.052459 0.540198 1.589677 0.013139 0.203103 -0.059862
2.700000 0.052892 0.546938 1.573194 0.012920 0.201647 -0.059201
2.733333 0.053319 0.553639 1.575080 0.012702 0.200153 -0.055965
2.766667 0.053739 0.560302 1.570212 0.012484 0.198624 -0.048828
2.800000 0.054152 0.566925 1.562365 0.012266 0.197058 -0.037908
2.833333 0.054558 0.573484 1.565617 0.012049 0.195453 -0.030780
2.866667 0.054956 0.579976 1.576656 0.011831 0.193812 -0.022653
2.900000 0.055346 0.586402 1.566041 0.011614 0.192136 -0.015813
2.933333 0.055729 0.592783 1.552776 0.011398 0.190425 -0.007048
2.966667 0.056106 0.599119 1.578196 0.011181 0.188679 -0.002107
3.000000 0.056475 0.605385 1.559764 0.010966 0.186905 -0.000951
3.033333 0.056836 0.611580 1.571855 0.010751 0.185111 -0.006028
3.066667 0.057190 0.617726 1.567884 0.010538 0.183303 -0.040111
3.100000 0.057538 0.623824 1.576968 0.010326 0.181480 -0.139026
3.133333 0.057879 0.629847 1.568630 0.010115 0.179644 -0.321760
3.166667 0.058212 0.635796 1.562942 0.009906 0.177796 -0.616733
3.200000 0.058538 0.641693 1.566136 0.009698 0.175933 -1.050588
3.233333 0.058857 0.647514 1.572263 0.009490 0.174046 -1.625878
3.266667 0.059170 0.653281 1.571031 0.009283 0.172131 -2.313781
3.300000 0.059476 0.658995 1.566604 0.009076 0.170189 -3.041238
3.333333 0.059775 0.664655 1.556365 0.008869 0.168217 -3.773311
3.366667 0.060068 0.670260 1.483862 0.008663 0.166214 -4.438455
3.400000 0.060354 0.675786 1.228680 0.008457 0.164178 -4.954360
3.433333 0.060632 0.681233 0.812779 0.008251 0.162114 -5.251669
3.466667 0.060903 0.686601 0.606502 0.008046 0.160028 -5.300442
3.500000 0.061167 0.691891 0.186132 0.007842 0.157926 -5.093097
3.533333 0.061425 0.697123 -0.113510 0.007640 0.155817 -4.620557
3.566667 0.061676 0.702277 -0.298261 0.007439 0.153714 -3.911046
3.600000 0.061920 0.707353 -0.448214 0.007241 0.151627 -3.040029
3.633333 0.062157 0.712370 -0.442652 0.007046 0.149566 -2.113601
