t x y theta dxdt dydt dthetadt
0.000000 0.000000 0.000000 1.491288 0.065614 -0.050515 -3.430581
0.033333 0.003452 -0.002585 1.336207 0.062898 -0.050414 -3.681689
0.066667 0.007408 -0.005303 1.198156 0.054873 -0.048081 -3.865848
0.100000 0.010952 -0.007902 1.046230 0.040648 -0.043202 -3.979670
0.133333 0.014250 -0.010047 0.909141 0.019982 -0.035726 -4.027981
0.166667 0.016841 -0.011552 0.778413 -0.006859 -0.025805 -4.029997
0.200000 0.018987 -0.012926 0.677250 -0.039721 -0.013348 -4.005267
0.233333 0.019263 -0.013814 0.575303 -0.077605 0.001364 -3.962269
0.266667 0.016989 -0.013990 0.453855 -0.119415 0.018270 -3.903744
0.300000 0.011402 -0.013074 0.330190 -0.163929 0.037255 -3.835705
0.333333 0.005339 -0.012019 0.173744 -0.210186 0.058363 -3.756060
0.366667 -0.005002 -0.009026 0.008347 -0.257186 0.081646 -3.654887
0.400000 -0.015819 -0.005895 -0.146872 -0.303685 0.106863 -3.516657
0.433333 -0.027111 -0.002627 -0.274833 -0.349091 0.134039 -3.330364
0.466667 -0.038875 0.000776 -0.382226 -0.392776 0.162696 -3.090239
0.500000 -0.051109 0.004312 -0.465123 -0.434688 0.192612 -2.794463
0.533333 -0.066944 0.011470 -0.554847 -0.474623 0.223323 -2.446428
0.566667 -0.083240 0.018754 -0.645690 -0.513065 0.254651 -2.054131
0.600000 -0.102737 0.029871 -0.732655 -0.550237 0.285932 -1.628999
0.633333 -0.122680 0.041098 -0.793668 -0.586251 0.316474 -1.184986
0.666667 -0.143056 0.052426 -0.836612 -0.621228 0.345773 -0.732337
0.700000 -0.163857 0.063845 -0.850157 -0.654789 0.372949 -0.276031
0.733333 -0.186997 0.078118 -0.848857 -0.686723 0.397326 0.177512
0.766667 -0.210537 0.092459 -0.812181 -0.716318 0.417890 0.622062
0.800000 -0.234465 0.106855 -0.764253 -0.743420 0.434493 1.044202
0.833333 -0.259917 0.122495 -0.723952 -0.767778 0.446890 1.432993
0.866667 -0.286902 0.139074 -0.657093 -0.789156 0.454779 1.775303
0.900000 -0.315065 0.156042 -0.588005 -0.807516 0.457990 2.060092
0.933333 -0.343941 0.172941 -0.510510 -0.822939 0.456474 2.275902
0.966667 -0.373124 0.189821 -0.420801 -0.835619 0.450323 2.414038
1.000000 -0.402065 0.205810 -0.310525 -0.845502 0.439239 2.477011
1.033333 -0.430401 0.220576 -0.200067 -0.852803 0.423227 2.465676
1.066667 -0.458993 0.235279 -0.076148 -0.857855 0.402639 2.380216
1.100000 -0.487267 0.248408 0.053769 -0.860878 0.378023 2.219299
1.133333 -0.515764 0.261450 0.113114 -0.862015 0.349967 1.994680
1.166667 -0.544465 0.274392 0.158924 -0.861340 0.319031 1.719872
1.200000 -0.573571 0.285662 0.219353 -0.859017 0.286074 1.406219
1.233333 -0.603124 0.295187 0.280737 -0.854943 0.251797 1.068441
1.266667 -0.632739 0.302922 0.309413 -0.848881 0.216633 0.730159
1.300000 -0.661837 0.308820 0.321319 -0.840836 0.180879 0.414670
1.333333 -0.689899 0.312734 0.320118 -0.830871 0.144852 0.131118
1.366667 -0.718067 0.316514 0.301118 -0.819273 0.108937 -0.111317
1.400000 -0.746326 0.320157 0.261146 -0.806351 0.073012 -0.301876
1.433333 -0.772499 0.321630 0.235700 -0.792774 0.036805 -0.433754
1.466667 -0.798735 0.322969 0.215811 -0.779330 0.000168 -0.510649
1.500000 -0.823424 0.321881 0.174949 -0.766840 -0.036898 -0.538894
1.533333 -0.848151 0.320665 0.137140 -0.755929 -0.074701 -0.523228
1.566667 -0.872904 0.319327 0.110725 -0.747151 -0.113470 -0.471029
1.600000 -0.896874 0.315450 0.101512 -0.741123 -0.152832 -0.398766
1.633333 -0.920442 0.309034 0.089955 -0.738079 -0.192154 -0.320796
1.666667 -0.944006 0.302520 0.088829 -0.738271 -0.230879 -0.250231
1.700000 -0.967682 0.293832 0.084457 -0.741632 -0.268459 -0.194340
1.733333 -0.991759 0.283126 0.088582 -0.748250 -0.304010 -0.159675
1.766667 -1.016537 0.270580 0.098657 -0.758074 -0.336481 -0.152285
1.800000 -1.041269 0.257994 0.122520 -0.770771 -0.365283 -0.170452
1.833333 -1.066844 0.243935 0.114090 -0.785974 -0.389936 -0.209473
1.866667 -1.092348 0.229875 0.098793 -0.803162 -0.409840 -0.259354
1.900000 -1.118767 0.214878 0.099781 -0.821789 -0.424521 -0.319644
1.933333 -1.146165 0.199273 0.079353 -0.841088 -0.433814 -0.383460
1.966667 -1.174534 0.183268 0.054377 -0.860247 -0.437975 -0.438408
2.000000 -1.203785 0.167204 0.021283 -0.878524 -0.437104 -0.474665
2.033333 -1.233936 0.151478 0.018021 -0.895213 -0.431363 -0.493416
2.066667 -1.265137 0.136099 -0.011546 -0.909557 -0.421148 -0.496156
2.100000 -1.297117 0.121319 -0.033859 -0.920818 -0.406890 -0.477213
2.133333 -1.328895 0.106710 -0.055919 -0.928307 -0.388723 -0.438629
2.166667 -1.361059 0.093240 -0.070283 -0.931484 -0.366753 -0.390943
2.200000 -1.393190 0.081192 -0.073315 -0.929968 -0.341218 -0.346188
2.233333 -1.425130 0.070805 -0.097150 -0.923630 -0.312642 -0.301228
2.266667 -1.456787 0.060664 -0.124856 -0.912566 -0.281413 -0.260761
2.300000 -1.488140 0.050787 -0.093312 -0.897229 -0.248083 -0.231517
2.333333 -1.519169 0.041189 -0.089134 -0.877984 -0.213319 -0.213692
2.366667 -1.549219 0.034302 -0.105070 -0.854877 -0.177498 -0.202772
2.400000 -1.578905 0.027723 -0.096098 -0.827911 -0.140783 -0.191918
2.433333 -1.606592 0.024050 -0.101072 -0.797098 -0.103132 -0.182587
2.466667 -1.631485 0.023437 -0.128530 -0.762292 -0.064440 -0.169936
2.500000 -1.655962 0.023161 -0.123912 -0.723135 -0.024425 -0.146881
2.533333 -1.680012 0.023228 -0.150884 -0.679881 0.016853 -0.109039
2.566667 -1.703619 0.023645 -0.156501 -0.633402 0.059057 -0.058524
2.600000 -1.726770 0.024417 -0.175763 -0.584555 0.101747 0.006362
2.633333 -1.749452 0.025548 -0.165496 -0.533853 0.145075 0.084820
2.666667 -1.766824 0.030446 -0.167159 -0.482294 0.188999 0.172637
2.700000 -1.779082 0.039315 -0.147505 -0.431234 0.233435 0.262867
2.733333 -1.790850 0.048546 -0.141613 -0.381628 0.278579 0.347962
2.766667 -1.802124 0.058136 -0.114959 -0.334096 0.324729 0.423172
2.800000 -1.809762 0.071807 -0.105956 -0.289518 0.371867 0.480169
2.833333 -1.816908 0.085825 -0.076214 -0.249117 0.419422 0.512822
2.866667 -1.823565 0.100179 -0.056885 -0.213336 0.466958 0.519661
2.900000 -1.829737 0.114860 -0.035669 -0.182002 0.514348 0.502862
2.933333 -1.835427 0.129860 -0.016760 -0.155078 0.561682 0.463482
2.966667 -1.839767 0.148532 0.028942 -0.132592 0.608770 0.404946
3.000000 -1.843103 0.170593 0.041206 -0.114090 0.655784 0.333613
3.033333 -1.845657 0.196016 0.049020 -0.099113 0.702633 0.257529
3.066667 -1.847749 0.221696 0.062804 -0.087560 0.749202 0.181366
3.100000 -1.849386 0.247610 0.050508 -0.079461 0.794879 0.110145
3.133333 -1.850573 0.273739 0.039017 -0.074566 0.838625 0.048104
3.166667 -1.852142 0.302715 0.034423 -0.072625 0.879841 0.005133
3.200000 -1.853276 0.331859 0.027495 -0.073556 0.918135 -0.019516
3.233333 -1.855316 0.363856 0.026035 -0.076807 0.953314 -0.026277
3.266667 -1.858585 0.398540 0.027107 -0.081684 0.984975 -0.014941
3.300000 -1.861434 0.433306 0.009165 -0.087725 1.012907 0.011319
3.333333 -1.863865 0.468124 0.018584 -0.094695 1.037039 0.048337
3.366667 -1.868126 0.504840 0.018850 -0.101995 1.056992 0.086928
3.400000 -1.871975 0.541544 0.022248 -0.109076 1.071969 0.126031
3.433333 -1.875413 0.578201 0.036691 -0.115824 1.081526 0.161138
3.466667 -1.878444 0.614779 0.032492 -0.122361 1.085395 0.191609
3.500000 -1.883653 0.652425 0.058247 -0.128283 1.083026 0.210580
3.533333 -1.888456 0.689923 0.057136 -0.132957 1.073730 0.218598
3.566667 -1.892852 0.727240 0.069714 -0.136174 1.057260 0.217024
3.600000 -1.896839 0.764341 0.078784 -0.137722 1.033709 0.206879
3.633333 -1.901885 0.800733 0.098902 -0.137172 1.002653 0.193034
3.666667 -1.907590 0.835930 0.090776 -0.133991 0.963742 0.173431
3.700000 -1.913446 0.869344 0.105149 -0.128345 0.917136 0.153405
3.733333 -1.918941 0.900419 0.110296 -0.120661 0.863421 0.136177
3.766667 -1.924018 0.931120 0.106272 -0.111305 0.802658 0.117108
3.800000 -1.928202 0.958266 0.120761 -0.100689 0.735012 0.093635
3.833333 -1.931154 0.981833 0.113542 -0.089503 0.661516 0.062486
3.866667 -1.933044 1.001371 0.076617 -0.078583 0.583572 0.026276
3.900000 -1.934512 1.020449 0.103380 -0.068463 0.502590 -0.014736
3.933333 -1.935557 1.039052 0.122385 -0.059499 0.419894 -0.063578
3.966667 -1.936385 1.053134 0.149981 -0.051795 0.337563 -0.115303
4.000000 -1.937276 1.062834 0.146542 -0.045197 0.257414 -0.165045
4.033333 -1.938415 1.068399 0.120936 -0.039056 0.180715 -0.209407
4.066667 -1.939937 1.070194 0.110630 -0.032437 0.108488 -0.248058
4.100000 -1.941953 1.068456 0.065222 -0.024335 0.041822 -0.270685
4.133333 -1.943547 1.066225 0.067059 -0.013811 -0.018306 -0.271495
4.166667 -1.944715 1.063510 0.054009 -0.000199 -0.071673 -0.243289
4.200000 -1.945848 1.058330 0.039146 0.016798 -0.118164 -0.189847
4.233333 -1.946554 1.052685 0.022037 0.037304 -0.157939 -0.113883
4.266667 -1.946831 1.046586 0.009621 0.061587 -0.191568 -0.022951
4.300000 -1.945715 1.038981 -0.000390 0.089677 -0.220044 0.061413
4.333333 -1.942522 1.030227 0.019326 0.121463 -0.244308 0.124260
4.366667 -1.936526 1.020749 0.015364 0.156729 -0.265030 0.141026
4.400000 -1.930109 1.010870 0.048449 0.195634 -0.283045 0.092167
4.433333 -1.923278 1.000607 0.079028 0.238000 -0.299055 -0.046857
4.466667 -1.916037 0.989976 0.103011 0.282974 -0.313511 -0.291424
4.500000 -1.908394 0.978991 0.142510 0.330066 -0.326886 -0.651753
4.533333 -1.900355 0.967671 0.141242 0.379166 -0.339860 -1.132395
4.566667 -1.887116 0.956306 0.140699 0.430243 -0.353254 -1.726849
4.600000 -1.869054 0.944733 0.102333 0.482471 -0.367603 -2.415595
4.633333 -1.850633 0.932874 0.029767 0.534982 -0.383219 -3.161102
4.666667 -1.831873 0.920745 -0.054220 0.587375 -0.400420 -3.931502
4.700000 -1.812791 0.908363 -0.210236 0.638990 -0.419210 -4.684357
4.733333 -1.790222 0.894655 -0.407635 0.688629 -0.439223 -5.380075
4.766667 -1.764747 0.879550 -0.660062 0.735362 -0.459709 -5.977366
4.800000 -1.739018 0.864248 -0.915901 0.779121 -0.479883 -6.444385
4.833333 -1.711489 0.847601 -1.200131 0.819931 -0.498963 -6.771133
4.866667 -1.682478 0.829758 -1.485547 0.857694 -0.516277 -6.941870
4.900000 -1.652234 0.811009 -1.764756 0.892179 -0.531237 -6.952827
4.933333 -1.620969 0.791510 -2.043427 0.923658 -0.543698 -6.810958
4.966667 -1.589596 0.771929 -2.248209 0.952407 -0.553965 -6.538281
5.000000 -1.557042 0.752129 -2.483482 0.978319 -0.562393 -6.154186
5.033333 -1.523395 0.732610 -2.715125 1.001463 -0.569561 -5.667348
5.066667 -1.488835 0.713638 -2.902024 1.021808 -0.575836 -5.094580
5.100000 -1.453590 0.695676 -3.064250 1.039427 -0.581784 -4.456436
5.133333 -1.418412 0.677754 3.095109 1.054192 -0.587681 -3.766172
5.166667 -1.383338 0.659897 2.949445 1.065385 -0.593231 -3.027116
5.200000 -1.346412 0.639456 2.830167 1.072309 -0.597943 -2.250117
5.233333 -1.309665 0.619129 2.768644 1.074319 -0.601177 -1.457309
5.266667 -1.272159 0.597385 2.711683 1.070310 -0.601893 -0.664234
5.300000 -1.234912 0.575809 2.701766 1.059426 -0.598803 0.114560
5.333333 -1.197963 0.554428 2.738110 1.040823 -0.590697 0.854857
5.366667 -1.161352 0.533268 2.811740 1.014531 -0.577154 1.527692
5.400000 -1.125118 0.512358 2.906639 0.980826 -0.558189 2.103727
5.433333 -1.090550 0.491595 3.008773 0.940010 -0.533836 2.569392
5.466667 -1.056436 0.471136 -3.124412 0.893179 -0.504852 2.906631
5.500000 -1.027995 0.455693 -3.010456 0.841295 -0.472275 3.112853
5.533333 -1.000076 0.440603 -2.848725 0.785022 -0.436951 3.192269
5.566667 -0.972711 0.425885 -2.703862 0.724596 -0.399339 3.152812
5.600000 -0.953008 0.415341 -2.549870 0.660488 -0.359767 3.001364
5.633333 -0.933912 0.405206 -2.423337 0.592965 -0.318589 2.734564
5.666667 -0.915443 0.395499 -2.351628 0.522476 -0.275885 2.354369
5.700000 -0.897624 0.386233 -2.301206 0.449361 -0.231052 1.846687
5.733333 -0.880475 0.377424 -2.267969 0.374533 -0.183530 1.210332
5.766667 -0.864018 0.369088 -2.221175 0.298908 -0.132763 0.454627
5.800000 -0.854038 0.363914 -2.147734 0.223090 -0.078236 -0.404206
5.833333 -0.849666 0.361674 -2.056328 0.148372 -0.019572 -1.344307
5.866667 -0.849682 0.362325 -2.047177 0.076268 0.043157 -2.341115
5.900000 -0.850432 0.363489 -2.113142 0.008438 0.109063 -3.359857
5.933333 -0.854238 0.367838 -2.280894 -0.053353 0.176627 -4.365581
5.966667 -0.858780 0.372705 -2.511771 -0.107214 0.244441 -5.335430
6.000000 -0.865394 0.381410 -2.780643 -0.151717 0.311171 -6.232595
6.033333 -0.873483 0.394349 -3.080882 -0.186490 0.375570 -7.016657
6.066667 -0.882754 0.412064 2.880799 -0.212206 0.436547 -7.652547
6.100000 -0.892749 0.430274 2.641003 -0.229610 0.493324 -8.125088
6.133333 -0.903460 0.448966 2.327290 -0.240257 0.545822 -8.430481
6.166667 -0.912737 0.468829 2.021545 -0.246149 0.593682 -8.567405
6.200000 -0.920615 0.490133 1.720806 -0.249212 0.636797 -8.553248
6.233333 -0.929199 0.511874 1.393364 -0.251039 0.675333 -8.410370
6.266667 -0.936713 0.535290 1.088118 -0.253174 0.709997 -8.167414
6.300000 -0.943360 0.560463 0.769180 -0.257294 0.741389 -7.821917
6.333333 -0.950709 0.586016 0.489455 -0.264569 0.769788 -7.380687
6.366667 -0.957998 0.613190 0.237346 -0.275743 0.795602 -6.846697
6.400000 -0.965989 0.640701 0.057467 -0.291351 0.819033 -6.223865
6.433333 -0.974684 0.668528 -0.172490 -0.311802 0.840078 -5.517182
6.466667 -0.985045 0.697880 -0.360847 -0.336668 0.858393 -4.731193
6.500000 -0.996107 0.727500 -0.540308 -0.365574 0.873722 -3.889450
6.533333 -1.007869 0.757364 -0.684226 -0.398533 0.885728 -3.009702
6.566667 -1.020328 0.787447 -0.786579 -0.435607 0.894230 -2.108354
6.600000 -1.035955 0.818298 -0.842424 -0.476302 0.899118 -1.201386
6.633333 -1.052271 0.849317 -0.850624 -0.520418 0.900019 -0.315959
6.666667 -1.069268 0.880480 -0.823848 -0.568264 0.896710 0.525652
6.700000 -1.086940 0.911760 -0.771016 -0.619650 0.889148 1.295951
6.733333 -1.108404 0.941949 -0.673399 -0.673721 0.877502 1.973609
6.766667 -1.130525 0.972205 -0.561197 -0.729892 0.861596 2.529846
6.800000 -1.153292 1.002504 -0.446944 -0.788414 0.841039 2.947863
6.833333 -1.180459 1.031112 -0.297372 -0.848756 0.815929 3.222586
6.866667 -1.212044 1.057504 -0.166631 -0.910086 0.786280 3.353316
6.900000 -1.244226 1.083871 0.017749 -0.971945 0.751823 3.351707
6.933333 -1.276984 1.110194 0.168320 -1.034253 0.712307 3.229643
6.966667 -1.313870 1.133244 0.293413 -1.096181 0.668133 3.014676
7.000000 -1.351285 1.156215 0.408703 -1.156333 0.620006 2.724247
7.033333 -1.389202 1.179088 0.478913 -1.213862 0.568384 2.386757
7.066667 -1.430424 1.198753 0.563411 -1.268130 0.513967 2.023875
7.100000 -1.474589 1.215375 0.598764 -1.318176 0.457983 1.659323
7.133333 -1.521130 1.229227 0.646771 -1.362496 0.401934 1.314354
7.166667 -1.569667 1.240656 0.659879 -1.399971 0.346925 0.999322
7.200000 -1.619691 1.249873 0.656658 -1.429229 0.294192 0.732941
7.233333 -1.670735 1.257231 0.686598 -1.448882 0.245219 0.515073
7.266667 -1.722241 1.262953 0.678886 -1.457379 0.201135 0.355315
7.300000 -1.773542 1.267262 0.694173 -1.453325 0.162580 0.253589
7.333333 -1.824615 1.270321 0.679854 -1.436018 0.129853 0.218779
7.366667 -1.874538 1.272324 0.684629 -1.405202 0.103226 0.261898
7.400000 -1.924573 1.274204 0.672747 -1.361589 0.082533 0.388988
7.433333 -1.974681 1.275966 0.666489 -1.305649 0.067337 0.618154
7.466667 -2.020914 1.277172 0.666082 -1.238600 0.057301 0.950816
7.500000 -2.062807 1.277987 0.660684 -1.162480 0.052057 1.378406
7.533333 -2.099901 1.278679 0.689060 -1.079884 0.051105 1.866171
7.566667 -2.136950 1.279284 0.722931 -0.993308 0.053974 2.373424
7.600000 -2.169014 1.280152 0.771587 -0.905147 0.060514 2.850468
7.633333 -2.196611 1.281428 0.857167 -0.818631 0.070472 3.236106
7.666667 -2.219884 1.283385 1.010898 -0.736691 0.083378 3.477437
7.700000 -2.239040 1.286174 1.220625 -0.661580 0.098990 3.540809
7.733333 -2.258093 1.288909 1.474048 -0.594495 0.117417 3.413757
7.766667 -2.273868 1.292807 1.758352 -0.536854 0.138675 3.088617
7.800000 -2.286987 1.298039 1.984102 -0.489502 0.162348 2.575709
7.833333 -2.300011 1.303227 2.058084 -0.452393 0.188397 1.908347
7.866667 -2.312946 1.308372 2.053944 -0.425018 0.217232 1.135953
7.900000 -2.325048 1.315501 2.027965 -0.406515 0.248846 0.310598
7.933333 -2.336818 1.324810 1.979284 -0.396307 0.282642 -0.512097
7.966667 -2.348518 1.334074 1.907696 -0.393073 0.317997 -1.268884
8.000000 -2.360156 1.343293 1.822539 -0.395648 0.354773 -1.912545
8.033333 -2.372343 1.354970 1.716927 -0.402948 0.392186 -2.420780
8.066667 -2.385213 1.369007 1.587695 -0.413884 0.428836 -2.789501
8.100000 -2.398898 1.385359 1.455358 -0.427767 0.463636 -3.023545
8.133333 -2.412546 1.401636 1.344979 -0.444146 0.496109 -3.139815
8.166667 -2.427547 1.420187 1.213828 -0.462790 0.525682 -3.164346
8.200000 -2.444238 1.440750 1.098833 -0.483353 0.551293 -3.118554
8.233333 -2.460905 1.461196 0.987628 -0.505704 0.572499 -3.018625
8.266667 -2.477548 1.481507 0.873619 -0.530179 0.589410 -2.878289
8.300000 -2.494169 1.501667 0.787568 -0.556896 0.602296 -2.714324
8.333333 -2.513190 1.522873 0.694096 -0.585336 0.611064 -2.534774
8.366667 -2.532192 1.543893 0.603006 -0.615332 0.615919 -2.347385
8.400000 -2.551173 1.564710 0.540004 -0.646839 0.617401 -2.159043
8.433333 -2.572659 1.585738 0.494501 -0.679620 0.615675 -1.971873
8.466667 -2.596843 1.607012 0.433290 -0.712773 0.610555 -1.789033
8.500000 -2.620997 1.628027 0.377445 -0.745520 0.601474 -1.615079
8.533333 -2.647781 1.648770 0.324932 -0.777490 0.588115 -1.458718
8.566667 -2.674519 1.669217 0.253695 -0.807910 0.570087 -1.323921
8.600000 -2.703661 1.688989 0.218230 -0.835727 0.547103 -1.212312
8.633333 -2.732736 1.708429 0.189741 -0.860167 0.519219 -1.124162
8.666667 -2.761733 1.727520 0.163398 -0.880994 0.486895 -1.057584
8.700000 -2.792116 1.745021 0.144440 -0.897887 0.451142 -0.998146
8.733333 -2.823357 1.760689 0.132075 -0.910627 0.413000 -0.933340
8.766667 -2.855328 1.774364 0.126497 -0.919130 0.373706 -0.855725
8.800000 -2.887577 1.785541 0.118242 -0.923681 0.334494 -0.759719
8.833333 -2.919490 1.793654 0.036016 -0.924338 0.296639 -0.636495
8.866667 -2.951237 1.801339 -0.035894 -0.920950 0.261172 -0.479241
8.900000 -2.982336 1.807617 -0.085818 -0.913482 0.228748 -0.290754
8.933333 -3.013239 1.813456 -0.101985 -0.901774 0.199722 -0.074358
8.966667 -3.043931 1.818849 -0.093841 -0.885546 0.174058 0.166663
9.000000 -3.073745 1.823828 -0.070171 -0.864624 0.151390 0.426404
9.033333 -3.103319 1.828352 -0.026270 -0.838744 0.130868 0.686735
9.066667 -3.131890 1.832516 0.005524 -0.807921 0.111679 0.934722
9.100000 -3.160194 1.836215 0.059759 -0.772283 0.093010 1.157636
9.133333 -3.187126 1.839473 0.106430 -0.732302 0.074249 1.350299
9.166667 -3.212488 1.842156 0.163461 -0.688943 0.055009 1.508467
9.200000 -3.235975 1.844085 0.220388 -0.643074 0.035105 1.630556
9.233333 -3.257297 1.845164 0.288982 -0.596016 0.014638 1.719448
9.266667 -3.275971 1.845318 0.340656 -0.548939 -0.006340 1.771822
9.300000 -3.291606 1.844494 0.407687 -0.503109 -0.027777 1.786032
9.333333 -3.306928 1.843185 0.451072 -0.459442 -0.049748 1.750207
9.366667 -3.318636 1.840683 0.519269 -0.418688 -0.072325 1.652235
9.400000 -3.330036 1.837696 0.603533 -0.381478 -0.095721 1.477111
9.433333 -3.341134 1.834224 0.679199 -0.348299 -0.120199 1.212255
9.466667 -3.351935 1.830268 0.755247 -0.319482 -0.145943 0.846067
9.500000 -3.362445 1.825830 0.819318 -0.294936 -0.173037 0.369950
9.533333 -3.372668 1.820910 0.841728 -0.274760 -0.201410 -0.211672
9.566667 -3.380658 1.814571 0.854254 -0.258768 -0.231019 -0.889040
9.600000 -3.387301 1.806788 0.842179 -0.246802 -0.261535 -1.635299
9.633333 -3.393486 1.797454 0.813803 -0.238667 -0.292405 -2.421677
9.666667 -3.399777 1.786513 0.705633 -0.234236 -0.323025 -3.207081
9.700000 -3.405824 1.775112 0.583701 -0.233593 -0.352841 -3.951663
9.733333 -3.412771 1.762158 0.399146 -0.236415 -0.381233 -4.620446
9.766667 -3.420900 1.747718 0.187408 -0.242213 -0.407595 -5.176432
9.800000 -3.428809 1.732844 -0.055684 -0.250405 -0.431576 -5.599324
9.833333 -3.436507 1.717546 -0.307043 -0.260108 -0.453103 -5.866644
9.866667 -3.445999 1.701431 -0.564032 -0.270432 -0.472189 -5.971586
9.900000 -3.455292 1.684915 -0.821686 -0.280487 -0.488851 -5.910179
9.933333 -3.464389 1.668008 -1.014624 -0.289741 -0.503323 -5.691712
9.966667 -3.475617 1.650782 -1.216486 -0.297865 -0.515944 -5.337270
10.000000 -3.486657 1.633190 -1.406070 -0.304622 -0.526974 -4.869808
10.033333 -3.497512 1.615243 -1.585264 -0.309983 -0.536578 -4.322812
10.066667 -3.508184 1.596954 -1.757352 -0.314020 -0.545043 -3.726362
10.100000 -3.518674 1.578334 -1.875339 -0.316816 -0.552633 -3.115154
10.133333 -3.528986 1.559397 -1.967767 -0.318358 -0.559496 -2.509195
10.166667 -3.539123 1.540154 -2.008970 -0.318908 -0.565685 -1.929210
10.200000 -3.550342 1.521496 -2.027974 -0.318612 -0.571313 -1.393446
10.233333 -3.561388 1.502557 -2.037068 -0.317618 -0.576491 -0.912330
10.266667 -3.572264 1.483350 -2.037129 -0.316012 -0.581226 -0.496264
10.300000 -3.582971 1.463885 -2.034352 -0.313856 -0.585573 -0.145346
10.333333 -3.593510 1.444176 -2.017184 -0.311204 -0.589636 0.137281
10.366667 -3.603882 1.424235 -2.004426 -0.307917 -0.593526 0.359765
10.400000 -3.614088 1.404073 -1.980082 -0.304080 -0.597243 0.531865
10.433333 -3.624281 1.383996 -1.960044 -0.299760 -0.600823 0.661635
10.466667 -3.634294 1.364006 -1.919276 -0.295035 -0.604343 0.758298
10.500000 -3.644144 1.343832 -1.893641 -0.290002 -0.607883 0.828124
10.533333 -3.653718 1.323657 -1.868763 -0.284797 -0.611525 0.875933
10.566667 -3.663132 1.303323 -1.829250 -0.279569 -0.615372 0.900621
10.600000 -3.672389 1.282840 -1.799230 -0.274364 -0.619563 0.903888
10.633333 -3.681490 1.262221 -1.770167 -0.269260 -0.624174 0.887831
10.666667 -3.690296 1.241453 -1.717188 -0.264354 -0.629194 0.856808
10.700000 -3.698948 1.220573 -1.677624 -0.259723 -0.634562 0.811582
10.733333 -3.707381 1.199473 -1.655151 -0.255422 -0.640148 0.754117
10.766667 -3.715620 1.178192 -1.633203 -0.251487 -0.645777 0.689831
10.800000 -3.723768 1.156575 -1.618029 -0.247940 -0.651260 0.621157
10.833333 -3.731877 1.134612 -1.602615 -0.244781 -0.656418 0.549436
10.866667 -3.739922 1.112374 -1.581461 -0.241979 -0.661103 0.474030
10.900000 -3.747969 1.089870 -1.568429 -0.239542 -0.665175 0.398643
10.933333 -3.755876 1.067344 -1.565627 -0.237445 -0.668540 0.325480
10.966667 -3.763643 1.044807 -1.556201 -0.235672 -0.671140 0.253209
11.000000 -3.771488 1.022203 -1.532176 -0.234226 -0.672934 0.180411
11.033333 -3.779195 0.999616 -1.530197 -0.233129 -0.673931 0.109474
11.066667 -3.786970 0.977007 -1.527408 -0.232363 -0.674151 0.043731
11.100000 -3.794609 0.954440 -1.520220 -0.231855 -0.673646 -0.017780
11.133333 -3.802114 0.931931 -1.528402 -0.231584 -0.672442 -0.077067
11.166667 -3.809486 0.909492 -1.538098 -0.231560 -0.670525 -0.131895
11.200000 -3.817128 0.886982 -1.556889 -0.231740 -0.667856 -0.177875
11.233333 -3.825101 0.864523 -1.564391 -0.232035 -0.664366 -0.217014
11.266667 -3.832944 0.842174 -1.570737 -0.232419 -0.659920 -0.250787
11.300000 -3.840654 0.819948 -1.580376 -0.232888 -0.654276 -0.278407
11.333333 -3.848621 0.798078 -1.592833 -0.233349 -0.647252 -0.295231
11.366667 -3.856456 0.776355 -1.592804 -0.233626 -0.638625 -0.302706
11.400000 -3.864158 0.754794 -1.600944 -0.233596 -0.628261 -0.302097
11.433333 -3.871727 0.733407 -1.608789 -0.233215 -0.616033 -0.290316
11.466667 -3.879498 0.712450 -1.639677 -0.232384 -0.601979 -0.263746
11.500000 -3.887483 0.692074 -1.645919 -0.230927 -0.586204 -0.219759
11.533333 -3.895502 0.672408 -1.661655 -0.228748 -0.568798 -0.159498
11.566667 -3.903384 0.652962 -1.672034 -0.225830 -0.550031 -0.080120
11.600000 -3.911192 0.634615 -1.677986 -0.222133 -0.530195 0.014932
11.633333 -3.918777 0.617609 -1.687724 -0.217583 -0.509666 0.124318
11.666667 -3.926221 0.600851 -1.680707 -0.212172 -0.488713 0.240041
11.700000 -3.933230 0.585606 -1.672086 -0.206088 -0.467849 0.356244
11.733333 -3.940097 0.570621 -1.652818 -0.199463 -0.447428 0.467533
11.766667 -3.946820 0.555904 -1.627401 -0.192357 -0.427605 0.566102
11.800000 -3.953397 0.541460 -1.603175 -0.184840 -0.408388 0.651452
11.833333 -3.959101 0.529091 -1.563039 -0.177029 -0.389749 0.715748
11.866667 -3.964658 0.517004 -1.530839 -0.169014 -0.371684 0.758771
11.900000 -3.970070 0.505202 -1.493361 -0.160712 -0.353784 0.778495
11.933333 -3.975336 0.493688 -1.488896 -0.152101 -0.335822 0.776985
11.966667 -3.980457 0.482465 -1.445285 -0.143242 -0.317708 0.756207
12.000000 -3.985432 0.471536 -1.424424 -0.134190 -0.299422 0.717848
12.033333 -3.990262 0.460902 -1.393206 -0.124868 -0.280699 0.667661
12.066667 -3.994328 0.451717 -1.362285 -0.115242 -0.261348 0.609017
12.100000 -3.997641 0.443964 -1.343406 -0.105423 -0.241507 0.545725
12.133333 -4.000812 0.436510 -1.331751 -0.095524 -0.221319 0.477773
12.166667 -4.003841 0.429353 -1.312213 -0.085651 -0.200943 0.408733
12.200000 -4.006732 0.422493 -1.310040 -0.075912 -0.180534 0.340062
12.233333 -4.009072 0.416788 -1.298070 -0.066543 -0.160552 0.273745
12.266667 -4.010942 0.412025 -1.293457 -0.057732 -0.141375 0.212542
12.300000 -4.012433 0.408180 -1.287178 -0.049554 -0.123202 0.157415
12.333333 -4.013796 0.404620 -1.281637 -0.042054 -0.106192 0.110757
12.366667 -4.014827 0.401811 -1.275940 -0.035280 -0.090500 0.073246
12.400000 -4.015621 0.399548 -1.278440 -0.029286 -0.076305 0.043613
12.433333 -4.016291 0.397726 -1.287490 -0.024047 -0.063637 0.021008
12.466667 -4.016827 0.396245 -1.287313 -0.019509 -0.052464 0.004270
12.500000 -4.017294 0.394991 -1.293066 -0.015622 -0.042725 -0.005311
12.533333 -4.017651 0.393991 -1.291442 -0.012345 -0.034374 -0.010121
12.566667 -4.017901 0.393237 -1.286130 -0.009603 -0.027270 -0.011536
12.600000 -4.018156 0.392530 -1.285195 -0.007300 -0.021234 -0.010083
12.633333 -4.018312 0.392057 -1.297727 -0.005364 -0.016103 -0.005117
12.666667 -4.018371 0.391812 -1.286581 -0.003768 -0.011793 0.000777
