t x y theta dxdt dydt dthetadt
0.000000 0.000000 0.000000 -2.630675 0.072588 -0.007894 -0.003516
0.033333 0.002495 -0.000261 -2.623350 0.077631 -0.007374 -0.002963
0.066667 0.005147 -0.000505 -2.633742 0.082777 -0.006824 -0.001676
0.100000 0.007960 -0.000730 -2.626643 0.088031 -0.006247 -0.001212
0.133333 0.010938 -0.000934 -2.635228 0.093403 -0.005641 -0.001747
0.166667 0.014086 -0.001118 -2.639442 0.098898 -0.005007 -0.002533
0.200000 0.017444 -0.001280 -2.630912 0.104522 -0.004345 -0.003251
0.233333 0.021014 -0.001421 -2.633032 0.110280 -0.003657 -0.002833
0.266667 0.024770 -0.001538 -2.622820 0.116173 -0.002941 -0.003417
0.300000 0.028714 -0.001630 -2.626284 0.122206 -0.002198 -0.003067
0.333333 0.032854 -0.001696 -2.635972 0.128381 -0.001430 -0.002496
0.366667 0.037193 -0.001736 -2.632926 0.134702 -0.000637 -0.001824
0.400000 0.041763 -0.001750 -2.631916 0.141172 0.000179 -0.000685
0.433333 0.046543 -0.001736 -2.636813 0.147793 0.001019 0.000158
0.466667 0.051537 -0.001693 -2.627882 0.154571 0.001882 0.002510
0.500000 0.056752 -0.001619 -2.634890 0.161508 0.002767 0.006622
0.533333 0.062213 -0.001516 -2.634737 0.168603 0.003675 0.010164
0.566667 0.067922 -0.001384 -2.628897 0.175851 0.004606 0.012900
0.600000 0.073868 -0.001219 -2.629254 0.183252 0.005562 0.014673
0.633333 0.080069 -0.001022 -2.637178 0.190802 0.006543 0.014764
0.666667 0.086530 -0.000795 -2.626635 0.198494 0.007550 0.013597
0.700000 0.093253 -0.000535 -2.628502 0.206321 0.008585 0.009401
0.733333 0.100234 -0.000238 -2.628669 0.214279 0.009647 0.005518
0.766667 0.107479 0.000095 -2.622517 0.222370 0.010736 0.002034
0.800000 0.114996 0.000463 -2.624462 0.230592 0.011852 -0.001630
0.833333 0.122787 0.000869 -2.625397 0.238944 0.012994 -0.005177
0.866667 0.130860 0.001316 -2.630240 0.247428 0.014160 -0.007962
0.900000 0.139219 0.001804 -2.634272 0.256052 0.015352 -0.008677
0.933333 0.147870 0.002334 -2.630497 0.264815 0.016565 -0.009386
0.966667 0.156820 0.002906 -2.632902 0.273718 0.017801 -0.008723
1.000000 0.166058 0.003516 -2.628453 0.282762 0.019056 -0.007202
1.033333 0.175588 0.004162 -2.634972 0.291943 0.020330 -0.004209
1.066667 0.185434 0.004853 -2.625253 0.301261 0.021621 -0.002260
1.100000 0.195600 0.005591 -2.632907 0.310715 0.022930 -0.001381
1.133333 0.206094 0.006376 -2.632357 0.320309 0.024256 -0.000525
1.166667 0.216920 0.007209 -2.629732 0.330049 0.025602 -0.001573
1.200000 0.228049 0.008079 -2.628148 0.339932 0.026968 -0.004058
1.233333 0.239522 0.009000 -2.631879 0.349964 0.028354 -0.009924
1.266667 0.251303 0.009959 -2.628086 0.360143 0.029759 -0.017784
1.300000 0.263440 0.010968 -2.631833 0.370459 0.031181 -0.028232
1.333333 0.275938 0.012030 -2.632717 0.380896 0.032615 -0.040291
1.366667 0.288749 0.013129 -2.630258 0.391444 0.034056 -0.050433
1.400000 0.301933 0.014283 -2.631772 0.402101 0.035500 -0.054323
1.433333 0.315496 0.015490 -2.634488 0.412850 0.036938 -0.044196
1.466667 0.329444 0.016753 -2.631233 0.423673 0.038364 -0.011070
1.500000 0.343783 0.018072 -2.640042 0.434566 0.039770 0.056870
1.533333 0.358439 0.019428 -2.646032 0.445522 0.041149 0.171704
1.566667 0.373496 0.020839 -2.658683 0.456513 0.042494 0.343657
1.600000 0.388871 0.022288 -2.667149 0.467506 0.043799 0.579019
1.633333 0.404564 0.023773 -2.668431 0.478481 0.045060 0.877057
1.666667 0.420669 0.025305 -2.652228 0.489432 0.046278 1.230881
1.700000 0.437191 0.026880 -2.628939 0.500349 0.047453 1.623893
1.733333 0.454133 0.028494 -2.588251 0.511229 0.048586 2.030953
1.766667 0.471392 0.030142 -2.524595 0.522100 0.049680 2.426746
1.800000 0.488968 0.031826 -2.426866 0.532998 0.050741 2.786614
1.833333 0.506979 0.033539 -2.293899 0.543954 0.051770 3.089642
1.866667 0.525305 0.035286 -2.123440 0.554998 0.052775 3.316755
1.900000 0.543944 0.037065 -1.960305 0.566170 0.053761 3.457291
1.933333 0.562896 0.038878 -1.801308 0.577511 0.054739 3.512803
1.966667 0.582160 0.040722 -1.669745 0.589034 0.055715 3.489335
2.000000 0.601876 0.042594 -1.534985 0.600748 0.056700 3.396669
2.033333 0.622047 0.044495 -1.429805 0.612660 0.057705 3.252012
2.066667 0.642673 0.046426 -1.354978 0.624751 0.058739 3.077584
2.100000 0.663755 0.048390 -1.264361 0.636982 0.059812 2.894225
2.133333 0.685137 0.050383 -1.169805 0.649292 0.060929 2.715884
2.166667 0.706971 0.052416 -1.088502 0.661631 0.062098 2.548739
2.200000 0.729255 0.054490 -1.004291 0.673947 0.063324 2.399411
2.233333 0.751984 0.056611 -0.947116 0.686189 0.064608 2.268681
2.266667 0.775154 0.058781 -0.877644 0.698317 0.065951 2.152667
2.300000 0.798608 0.060975 -0.795402 0.710316 0.067350 2.048081
2.333333 0.822491 0.063225 -0.717088 0.722182 0.068810 1.952228
2.366667 0.846797 0.065534 -0.641591 0.733900 0.070321 1.868773
2.400000 0.871522 0.067902 -0.591181 0.745456 0.071877 1.795797
2.433333 0.896660 0.070332 -0.544277 0.756829 0.073463 1.731296
2.466667 0.922059 0.072781 -0.495534 0.768008 0.075067 1.673633
2.500000 0.947855 0.075295 -0.465708 0.778961 0.076671 1.623626
2.533333 0.974040 0.077874 -0.411739 0.789647 0.078251 1.580510
2.566667 1.000604 0.080519 -0.352916 0.800037 0.079788 1.539278
2.600000 1.027538 0.083227 -0.292611 0.810104 0.081261 1.499365
2.633333 1.054831 0.085999 -0.231282 0.819833 0.082655 1.454367
2.666667 1.082476 0.088831 -0.187425 0.829185 0.083949 1.403831
2.700000 1.110341 0.091671 -0.121562 0.838145 0.085128 1.338395
2.733333 1.138539 0.094567 -0.098220 0.846718 0.086185 1.259654
2.766667 1.166943 0.097467 -0.042392 0.854925 0.087124 1.166652
2.800000 1.195660 0.100416 -0.007219 0.862780 0.087943 1.059305
2.833333 1.224679 0.103410 0.034322 0.870298 0.088645 0.944240
2.866667 1.253882 0.106402 0.056015 0.877508 0.089239 0.819541
2.900000 1.283261 0.109388 0.086953 0.884429 0.089731 0.689325
2.933333 1.312909 0.112407 0.116581 0.891067 0.090125 0.545549
2.966667 1.342717 0.115417 0.117280 0.897413 0.090416 0.391900
3.000000 1.372774 0.118449 0.137708 0.903468 0.090606 0.228149
3.033333 1.403068 0.121499 0.135586 0.909241 0.090701 0.060766
3.066667 1.433586 0.124561 0.147957 0.914734 0.090702 -0.102278
3.100000 1.464316 0.127632 0.146184 0.919943 0.090608 -0.248397
3.133333 1.495166 0.130682 0.146069 0.924870 0.090420 -0.360767
3.166667 1.526125 0.133709 0.136942 0.929515 0.090140 -0.435219
3.200000 1.557185 0.136709 0.102350 0.933878 0.089767 -0.463164
3.233333 1.588407 0.139701 0.035022 0.937949 0.089295 -0.448265
3.266667 1.619779 0.142682 -0.021550 0.941718 0.088724 -0.391217
3.300000 1.651292 0.145650 -0.063903 0.945182 0.088051 -0.300169
3.333333 1.682932 0.148600 -0.086125 0.948325 0.087271 -0.187127
3.366667 1.714686 0.151528 -0.051333 0.951121 0.086377 -0.063864
3.400000 1.746538 0.154428 -0.032433 0.953530 0.085358 0.053806
3.433333 1.778472 0.157294 -0.011719 0.955515 0.084204 0.152230
3.466667 1.810473 0.160119 0.028610 0.957041 0.082905 0.217291
3.500000 1.842523 0.162897 0.041024 0.958082 0.081455 0.241304
3.533333 1.874609 0.165622 0.059486 0.958624 0.079852 0.220648
3.566667 1.906691 0.168291 0.072675 0.958661 0.078098 0.163002
3.600000 1.938762 0.170902 0.077142 0.958201 0.076200 0.077393
3.633333 1.970802 0.173441 0.080204 0.957262 0.074166 -0.024109
3.666667 2.002810 0.175916 0.081027 0.955862 0.072008 -0.128629
3.700000 2.034747 0.178306 0.060667 0.954024 0.069734 -0.227205
3.733333 2.066591 0.180608 0.038549 0.951761 0.067351 -0.310807
3.766667 2.098324 0.182816 0.019561 0.949091 0.064868 -0.375331
3.800000 2.129985 0.184950 0.006011 0.946037 0.062294 -0.418236
3.833333 2.161567 0.187006 -0.005414 0.942604 0.059633 -0.438635
3.866667 2.193059 0.188982 -0.024790 0.938793 0.056886 -0.436263
3.900000 2.224368 0.190851 -0.051297 0.934595 0.054054 -0.411416
3.933333 2.255477 0.192609 -0.073571 0.930020 0.051140 -0.366406
3.966667 2.286468 0.194279 -0.085609 0.925079 0.048143 -0.308480
4.000000 2.317331 0.195859 -0.099083 0.919778 0.045064 -0.243688
4.033333 2.348058 0.197345 -0.104987 0.914142 0.041906 -0.174776
4.066667 2.378525 0.198710 -0.117457 0.908198 0.038673 -0.107258
4.100000 2.408722 0.199953 -0.111458 0.901990 0.035372 -0.050765
4.133333 2.438755 0.201095 -0.106965 0.895540 0.032006 -0.013678
4.166667 2.468497 0.202109 -0.098243 0.888878 0.028579 -0.000505
4.200000 2.498057 0.203017 -0.089163 0.882021 0.025092 -0.014874
4.233333 2.527307 0.203794 -0.066478 0.874989 0.021546 -0.065940
4.266667 2.556358 0.204460 -0.059330 0.867800 0.017942 -0.158807
4.300000 2.585203 0.205012 -0.068701 0.860442 0.014272 -0.287416
4.333333 2.613833 0.205448 -0.091921 0.852909 0.010532 -0.442381
4.366667 2.642240 0.205766 -0.075398 0.845177 0.006712 -0.615633
4.400000 2.670299 0.205938 -0.082816 0.837238 0.002805 -0.798305
4.433333 2.698119 0.205986 -0.108469 0.829062 -0.001198 -0.979941
4.466667 2.725692 0.205910 -0.155342 0.820610 -0.005313 -1.148516
4.500000 2.753012 0.205706 -0.220386 0.811856 -0.009552 -1.300562
4.533333 2.779957 0.205331 -0.292361 0.802785 -0.013923 -1.435079
4.566667 2.806632 0.204825 -0.354834 0.793376 -0.018437 -1.546768
4.600000 2.833032 0.204185 -0.427285 0.783603 -0.023102 -1.630684
4.633333 2.859027 0.203351 -0.476445 0.773459 -0.027920 -1.684667
4.666667 2.884731 0.202379 -0.519190 0.762963 -0.032879 -1.715440
4.700000 2.910138 0.201266 -0.556048 0.752154 -0.037960 -1.734694
4.733333 2.935105 0.199941 -0.609407 0.741060 -0.043145 -1.757176
4.766667 2.959760 0.198472 -0.702337 0.729722 -0.048407 -1.796825
4.800000 2.983945 0.196782 -0.769155 0.718191 -0.053715 -1.871193
4.833333 3.007643 0.194867 -0.840526 0.706491 -0.059050 -1.987490
4.866667 3.031012 0.192803 -0.888176 0.694609 -0.064398 -2.148764
4.900000 3.053861 0.190507 -0.920044 0.682535 -0.069748 -2.349229
4.933333 3.076370 0.188059 -0.943995 0.670222 -0.075096 -2.579798
4.966667 3.098534 0.185457 -1.016627 0.657649 -0.080438 -2.834961
5.000000 3.120347 0.182700 -1.100343 0.644770 -0.085779 -3.104729
5.033333 3.141806 0.179786 -1.250350 0.631543 -0.091126 -3.374723
5.066667 3.162904 0.176713 -1.412509 0.617950 -0.096477 -3.622714
5.100000 3.183389 0.173416 -1.558112 0.603963 -0.101839 -3.822086
5.133333 3.203505 0.169958 -1.692624 0.589610 -0.107210 -3.948860
5.166667 3.222982 0.166287 -1.830154 0.574905 -0.112587 -3.985377
5.200000 3.241811 0.162411 -1.976397 0.559876 -0.117957 -3.916131
5.233333 3.260259 0.158370 -2.158808 0.544571 -0.123304 -3.743194
5.266667 3.278045 0.154142 -2.315622 0.529066 -0.128613 -3.481503
5.300000 3.295445 0.149746 -2.458106 0.513412 -0.133874 -3.155583
5.333333 3.312456 0.145184 -2.605821 0.497622 -0.139077 -2.787709
5.366667 3.328803 0.140452 -2.692140 0.481713 -0.144221 -2.399065
5.400000 3.344491 0.135555 -2.743753 0.465717 -0.149314 -2.014893
5.433333 3.359784 0.130488 -2.757925 0.449668 -0.154366 -1.657671
5.466667 3.374681 0.125250 -2.761590 0.433553 -0.159389 -1.345505
5.500000 3.388941 0.119849 -2.774251 0.417401 -0.164392 -1.091105
5.533333 3.402577 0.114284 -2.794722 0.401278 -0.169387 -0.907094
5.566667 3.415601 0.108558 -2.808483 0.385243 -0.174381 -0.792853
5.600000 3.428024 0.102669 -2.824839 0.369333 -0.179379 -0.740792
5.633333 3.440048 0.096607 -2.848208 0.353578 -0.184384 -0.737674
5.666667 3.451497 0.090381 -2.868687 0.338051 -0.189412 -0.766328
5.700000 3.462385 0.083993 -2.889620 0.322796 -0.194474 -0.810270
5.733333 3.472875 0.077428 -2.928578 0.307824 -0.199584 -0.851975
5.766667 3.482831 0.070699 -2.938894 0.293149 -0.204755 -0.887831
5.800000 3.492263 0.063804 -2.989450 0.278787 -0.209998 -0.911974
5.833333 3.501303 0.056732 -3.047838 0.264755 -0.215326 -0.917141
5.866667 3.509835 0.049493 -3.096154 0.251049 -0.220740 -0.896684
5.900000 3.517868 0.042086 -3.096579 0.237667 -0.226248 -0.848582
5.933333 3.525514 0.034500 -3.122329 0.224614 -0.231868 -0.774242
5.966667 3.532672 0.026743 3.135395 0.211891 -0.237610 -0.668283
6.000000 3.539409 0.018702 3.086736 0.199491 -0.243477 -0.532046
6.033333 3.545767 0.010479 3.053035 0.187398 -0.249468 -0.375103
6.066667 3.551749 0.002075 3.041456 0.175586 -0.255571 -0.209312
6.100000 3.557359 -0.006510 3.035766 0.164026 -0.261761 -0.042090
6.133333 3.562599 -0.015277 3.024139 0.152681 -0.267991 0.118825
6.166667 3.567473 -0.024226 3.044858 0.141518 -0.274218 0.264235
6.200000 3.571986 -0.033454 3.066867 0.130510 -0.280415 0.389276
6.233333 3.576148 -0.042959 3.110861 0.119633 -0.286548 0.500752
6.266667 3.579971 -0.052740 -3.132340 0.108873 -0.292581 0.614702
6.300000 3.583408 -0.062684 -3.097320 0.098230 -0.298491 0.750878
6.333333 3.586469 -0.072788 -3.074806 0.087705 -0.304269 0.932307
6.366667 3.589166 -0.083051 -3.063091 0.077308 -0.309907 1.186654
6.400000 3.591523 -0.093494 -3.048109 0.067051 -0.315401 1.529566
6.433333 3.593543 -0.104118 -3.041207 0.056944 -0.320763 1.960064
6.466667 3.595233 -0.114892 -3.041602 0.047002 -0.326029 2.453796
6.500000 3.596594 -0.125845 -3.014927 0.037231 -0.331231 2.973969
6.533333 3.597632 -0.136978 -2.947865 0.027637 -0.336396 3.476198
6.566667 3.598351 -0.148290 -2.810481 0.018218 -0.341546 3.896908
6.600000 3.598776 -0.159745 -2.595264 0.008975 -0.346699 4.178513
6.633333 3.598891 -0.171378 -2.342430 -0.000100 -0.351866 4.275572
6.666667 3.598701 -0.183188 -2.086869 -0.009013 -0.357043 4.166506
6.700000 3.598210 -0.195175 -1.791748 -0.017771 -0.362225 3.839248
6.733333 3.597423 -0.207338 -1.570055 -0.026379 -0.367410 3.299647
6.766667 3.596365 -0.219670 -1.433555 -0.034844 -0.372598 2.585913
6.800000 3.595037 -0.232175 -1.402265 -0.043166 -0.377781 1.759878
6.833333 3.593438 -0.244856 -1.394073 -0.051343 -0.382950 0.891220
6.866667 3.591571 -0.257713 -1.404751 -0.059376 -0.388098 0.042222
6.900000 3.589432 -0.270743 -1.469432 -0.067258 -0.393218 -0.720093
6.933333 3.587027 -0.283946 -1.576871 -0.074984 -0.398303 -1.343249
6.966667 3.584361 -0.297321 -1.703520 -0.082548 -0.403346 -1.796997
7.000000 3.581443 -0.310860 -1.818768 -0.089945 -0.408344 -2.082317
7.033333 3.578274 -0.324569 -1.923229 -0.097168 -0.413298 -2.214248
7.066667 3.574859 -0.338447 -2.019891 -0.104207 -0.418206 -2.212777
7.100000 3.571216 -0.352483 -2.112386 -0.111060 -0.423070 -2.107636
7.133333 3.567355 -0.366675 -2.191148 -0.117721 -0.427892 -1.930354
7.166667 3.563287 -0.381018 -2.235385 -0.124183 -0.432672 -1.713838
7.200000 3.558994 -0.395528 -2.271963 -0.130441 -0.437412 -1.477639
7.233333 3.554519 -0.410184 -2.313047 -0.136504 -0.442115 -1.235275
7.266667 3.549829 -0.425005 -2.349748 -0.142377 -0.446786 -1.002742
7.300000 3.544931 -0.439988 -2.369344 -0.148064 -0.451426 -0.791217
7.333333 3.539829 -0.455132 -2.393786 -0.153570 -0.456035 -0.604827
7.366667 3.534594 -0.470412 -2.404104 -0.158900 -0.460615 -0.438821
7.400000 3.529166 -0.485851 -2.421587 -0.164061 -0.465166 -0.287680
7.433333 3.523551 -0.501449 -2.424095 -0.169048 -0.469684 -0.157560
7.466667 3.517840 -0.517171 -2.421367 -0.173863 -0.474169 -0.045923
7.500000 3.511953 -0.533049 -2.417407 -0.178510 -0.478620 0.043409
7.533333 3.505894 -0.549082 -2.396911 -0.183006 -0.483043 0.100439
7.566667 3.499670 -0.565270 -2.359497 -0.187352 -0.487435 0.111047
7.600000 3.493285 -0.581610 -2.403919 -0.191535 -0.491793 0.064340
7.633333 3.486746 -0.598102 -2.401226 -0.195548 -0.496111 -0.034709
7.666667 3.480177 -0.614701 -2.382971 -0.199379 -0.500385 -0.177523
7.700000 3.473463 -0.631449 -2.346941 -0.203006 -0.504605 -0.357819
7.733333 3.466610 -0.648345 -2.274837 -0.206395 -0.508759 -0.565905
7.766667 3.459622 -0.665387 -2.288376 -0.209532 -0.512841 -0.782014
7.800000 3.452506 -0.682575 -2.349803 -0.212419 -0.516852 -0.998783
7.833333 3.445266 -0.699907 -2.437119 -0.215061 -0.520793 -1.202031
7.866667 3.437906 -0.717381 -2.532700 -0.217450 -0.524659 -1.377439
7.900000 3.430556 -0.734952 -2.620204 -0.219608 -0.528458 -1.498283
7.933333 3.423219 -0.752620 -2.673256 -0.221557 -0.532197 -1.532684
7.966667 3.415779 -0.770426 -2.711438 -0.223329 -0.535887 -1.458971
8.000000 3.408240 -0.788370 -2.710855 -0.224935 -0.539534 -1.254597
8.033333 3.400729 -0.806409 -2.804265 -0.226398 -0.543146 -0.917153
8.066667 3.393128 -0.824582 -2.890709 -0.227741 -0.546737 -0.447773
8.100000 3.385564 -0.842848 -2.963226 -0.228964 -0.550311 0.142635
8.133333 3.377919 -0.861244 -3.043148 -0.230073 -0.553872 0.839117
8.166667 3.370199 -0.879771 -3.031024 -0.231050 -0.557424 1.597106
8.200000 3.362407 -0.898425 -2.925933 -0.231903 -0.560974 2.373565
8.233333 3.354548 -0.917206 -2.860386 -0.232608 -0.564528 3.129985
8.266667 3.346754 -0.936080 -2.731889 -0.233170 -0.568103 3.806741
8.300000 3.338902 -0.955078 -2.503064 -0.233575 -0.571716 4.344427
8.333333 3.331117 -0.974178 -2.260267 -0.233818 -0.575399 4.678323
8.366667 3.323282 -0.993399 -2.085032 -0.233907 -0.579180 4.805431
8.400000 3.315514 -1.012740 -1.766058 -0.233846 -0.583096 4.720989
8.433333 3.307705 -1.032198 -1.533936 -0.233662 -0.587174 4.425618
8.466667 3.299857 -1.051771 -1.271639 -0.233362 -0.591431 3.944172
8.500000 3.292069 -1.071505 -1.201353 -0.232977 -0.595878 3.334302
8.533333 3.284250 -1.091351 -1.109766 -0.232526 -0.600505 2.653253
8.566667 3.276483 -1.111376 -1.068490 -0.232033 -0.605285 1.927661
8.600000 3.268756 -1.131589 -1.045329 -0.231512 -0.610177 1.201513
8.633333 3.261063 -1.151996 -1.073121 -0.230974 -0.615142 0.521329
8.666667 3.253398 -1.172598 -1.104118 -0.230442 -0.620131 -0.074551
8.700000 3.245753 -1.193399 -1.115499 -0.229921 -0.625088 -0.590599
8.733333 3.238127 -1.214398 -1.122930 -0.229428 -0.629967 -1.019325
8.766667 3.230493 -1.235493 -1.200514 -0.228956 -0.634745 -1.352620
8.800000 3.222874 -1.256782 -1.256080 -0.228503 -0.639399 -1.598106
8.833333 3.215268 -1.278262 -1.311833 -0.228054 -0.643900 -1.772190
8.866667 3.207663 -1.299830 -1.423132 -0.227588 -0.648244 -1.879804
8.900000 3.200062 -1.321481 -1.493613 -0.227086 -0.652432 -1.919827
8.933333 3.192478 -1.343310 -1.581908 -0.226524 -0.656468 -1.896721
8.966667 3.184913 -1.365312 -1.646599 -0.225892 -0.660329 -1.826698
9.000000 3.177361 -1.387388 -1.747925 -0.225177 -0.664010 -1.713255
9.033333 3.169839 -1.409617 -1.808410 -0.224371 -0.667509 -1.561066
9.066667 3.162354 -1.431990 -1.857948 -0.223468 -0.670811 -1.391246
9.100000 3.154910 -1.454502 -1.875121 -0.222457 -0.673896 -1.212179
9.133333 3.147489 -1.477073 -1.918655 -0.221333 -0.676751 -1.034952
9.166667 3.140121 -1.499764 -1.935390 -0.220092 -0.679378 -0.861401
9.200000 3.132781 -1.522508 -1.928658 -0.218724 -0.681770 -0.708426
9.233333 3.125470 -1.545299 -1.957871 -0.217226 -0.683929 -0.580274
9.266667 3.118230 -1.568190 -1.981026 -0.215602 -0.685860 -0.469512
9.300000 3.111025 -1.591121 -2.007685 -0.213860 -0.687576 -0.367007
9.333333 3.103855 -1.614088 -2.015460 -0.212005 -0.689086 -0.266327
9.366667 3.096780 -1.637116 -2.017103 -0.210036 -0.690402 -0.152060
9.400000 3.089806 -1.660198 -2.013608 -0.207963 -0.691531 -0.007456
9.433333 3.082937 -1.683324 -1.999764 -0.205794 -0.692478 0.167037
9.466667 3.076113 -1.706471 -2.003963 -0.203526 -0.693250 0.363099
9.500000 3.069334 -1.729633 -2.027056 -0.201161 -0.693854 0.561530
9.533333 3.062677 -1.752811 -2.048071 -0.198705 -0.694297 0.750001
9.566667 3.056070 -1.775996 -2.049580 -0.196169 -0.694589 0.901603
9.600000 3.049512 -1.799184 -1.995489 -0.193559 -0.694739 0.996449
9.633333 3.043085 -1.822365 -1.891803 -0.190890 -0.694761 1.026573
9.666667 3.036711 -1.845541 -1.808860 -0.188173 -0.694664 0.987915
9.700000 3.030466 -1.868708 -1.676292 -0.185427 -0.694457 0.878983
9.733333 3.024349 -1.891868 -1.620862 -0.182672 -0.694143 0.704230
9.766667 3.018353 -1.915023 -1.615825 -0.179927 -0.693724 0.481940
9.800000 3.012414 -1.938156 -1.618396 -0.177206 -0.693201 0.235201
9.833333 3.006584 -1.961283 -1.642234 -0.174516 -0.692572 -0.009674
9.866667 3.000858 -1.984401 -1.669071 -0.171869 -0.691830 -0.230069
9.900000 2.995191 -2.007484 -1.718711 -0.169267 -0.690966 -0.397779
9.933333 2.989585 -2.030526 -1.771674 -0.166702 -0.689973 -0.499537
9.966667 2.984040 -2.053525 -1.808865 -0.164159 -0.688843 -0.533632
10.000000 2.978594 -2.076496 -1.848657 -0.161635 -0.687567 -0.509466
10.033333 2.973251 -2.099434 -1.865817 -0.159123 -0.686133 -0.447052
10.066667 2.967969 -2.122315 -1.859319 -0.156616 -0.684535 -0.365444
10.100000 2.962793 -2.145148 -1.865332 -0.154110 -0.682766 -0.288035
10.133333 2.957721 -2.167925 -1.856895 -0.151620 -0.680817 -0.232585
10.166667 2.952712 -2.190632 -1.837942 -0.149161 -0.678677 -0.210329
10.200000 2.947805 -2.213265 -1.840474 -0.146745 -0.676346 -0.224741
10.233333 2.942962 -2.235819 -1.850357 -0.144386 -0.673820 -0.270855
10.266667 2.938212 -2.258280 -1.836159 -0.142105 -0.671098 -0.339703
10.300000 2.933526 -2.280654 -1.826791 -0.139922 -0.668183 -0.421524
10.333333 2.928922 -2.302924 -1.850351 -0.137842 -0.665082 -0.506201
10.366667 2.924394 -2.325083 -1.881192 -0.135879 -0.661803 -0.584132
10.400000 2.919932 -2.347125 -1.931988 -0.134040 -0.658352 -0.647409
10.433333 2.915526 -2.369040 -1.989494 -0.132334 -0.654738 -0.692292
10.466667 2.911169 -2.390821 -2.010923 -0.130752 -0.650971 -0.716603
10.500000 2.906874 -2.412489 -2.022607 -0.129284 -0.647065 -0.719672
10.533333 2.902642 -2.434039 -2.045386 -0.127920 -0.643027 -0.702710
10.566667 2.898434 -2.455439 -2.065813 -0.126636 -0.638873 -0.667704
10.600000 2.894241 -2.476687 -2.082914 -0.125410 -0.634610 -0.622375
10.633333 2.890061 -2.497778 -2.099143 -0.124209 -0.630250 -0.573479
10.666667 2.885944 -2.518737 -2.128182 -0.123013 -0.625799 -0.525821
10.700000 2.881833 -2.539531 -2.151661 -0.121798 -0.621256 -0.483736
10.733333 2.877785 -2.560185 -2.164255 -0.120549 -0.616621 -0.449198
10.766667 2.873743 -2.580663 -2.184311 -0.119255 -0.611884 -0.425249
10.800000 2.869763 -2.600994 -2.184889 -0.117908 -0.607039 -0.410280
10.833333 2.865845 -2.621174 -2.188252 -0.116514 -0.602074 -0.401223
10.866667 2.861989 -2.641200 -2.206650 -0.115075 -0.596976 -0.395769
10.900000 2.858194 -2.661069 -2.205556 -0.113599 -0.591734 -0.387717
10.933333 2.854421 -2.680736 -2.218653 -0.112089 -0.586349 -0.368988
10.966667 2.850710 -2.700238 -2.230519 -0.110551 -0.580829 -0.328820
11.000000 2.847060 -2.719573 -2.244230 -0.108989 -0.575174 -0.261886
11.033333 2.843448 -2.738690 -2.277460 -0.107404 -0.569392 -0.165171
11.066667 2.839879 -2.757583 -2.299532 -0.105794 -0.563501 -0.036972
11.100000 2.836359 -2.776249 -2.320382 -0.104154 -0.557516 0.124660
11.133333 2.832900 -2.794734 -2.331872 -0.102488 -0.551443 0.314811
11.166667 2.829502 -2.813037 -2.327124 -0.100796 -0.545286 0.522362
11.200000 2.826165 -2.831100 -2.308016 -0.099080 -0.539058 0.741408
11.233333 2.822890 -2.848974 -2.260337 -0.097347 -0.532765 0.958541
11.266667 2.819675 -2.866658 -2.199809 -0.095607 -0.526407 1.154501
11.300000 2.816520 -2.884148 -2.105652 -0.093869 -0.519986 1.296956
11.333333 2.813428 -2.901391 -2.081272 -0.092138 -0.513509 1.366761
11.366667 2.810396 -2.918435 -2.066439 -0.090422 -0.506983 1.348706
11.400000 2.807419 -2.935232 -2.008426 -0.088728 -0.500408 1.229308
11.433333 2.804493 -2.951779 -1.902937 -0.087062 -0.493791 1.008648
11.466667 2.801628 -2.968122 -1.816694 -0.085438 -0.487133 0.695465
11.500000 2.798822 -2.984257 -1.732506 -0.083867 -0.480436 0.313445
11.533333 2.796045 -3.000145 -1.697184 -0.082362 -0.473696 -0.122651
11.566667 2.793329 -3.015822 -1.722377 -0.080931 -0.466909 -0.589497
11.600000 2.790671 -3.031287 -1.770307 -0.079584 -0.460065 -1.059243
11.633333 2.788073 -3.046536 -1.858041 -0.078330 -0.453148 -1.502495
11.666667 2.785535 -3.061569 -1.941570 -0.077172 -0.446143 -1.890967
11.700000 2.783055 -3.076384 -2.056383 -0.076122 -0.439026 -2.194966
11.733333 2.780542 -3.090917 -2.165826 -0.075200 -0.431764 -2.392076
11.766667 2.778088 -3.105230 -2.253193 -0.074433 -0.424316 -2.474559
11.800000 2.775584 -3.119242 -2.359070 -0.073835 -0.416651 -2.444254
11.833333 2.773140 -3.133031 -2.480762 -0.073420 -0.408745 -2.313060
11.866667 2.770755 -3.146596 -2.581885 -0.073194 -0.400575 -2.100107
11.900000 2.768429 -3.159934 -2.665870 -0.073146 -0.392139 -1.838058
11.933333 2.766035 -3.172934 -2.730749 -0.073246 -0.383458 -1.554171
11.966667 2.763701 -3.185706 -2.778585 -0.073444 -0.374578 -1.269047
12.000000 2.761302 -3.198127 -2.798448 -0.073694 -0.365550 -1.004228
12.033333 2.758842 -3.210196 -2.786843 -0.073941 -0.356429 -0.781563
12.066667 2.756327 -3.221909 -2.792266 -0.074120 -0.347278 -0.611160
12.100000 2.753762 -3.233263 -2.774704 -0.074169 -0.338151 -0.491523
12.133333 2.751158 -3.244256 -2.769102 -0.074039 -0.329088 -0.408435
12.166667 2.748616 -3.255021 -2.760928 -0.073693 -0.320106 -0.347361
12.200000 2.746054 -3.265421 -2.772158 -0.073105 -0.311199 -0.283711
12.233333 2.743556 -3.275594 -2.789371 -0.072266 -0.302353 -0.191183
12.266667 2.741125 -3.285539 -2.836890 -0.071185 -0.293542 -0.056106
12.300000 2.738761 -3.295257 -2.863255 -0.069888 -0.284732 0.122804
12.333333 2.736466 -3.304749 -2.901734 -0.068406 -0.275867 0.324475
12.366667 2.734199 -3.313878 -2.932491 -0.066768 -0.266910 0.520739
12.400000 2.731973 -3.322646 -2.943066 -0.065000 -0.257839 0.670470
12.433333 2.729797 -3.331053 -2.900439 -0.063125 -0.248661 0.734153
12.466667 2.727694 -3.339239 -2.793525 -0.061156 -0.239382 0.680169
12.500000 2.725659 -3.347071 -2.672933 -0.059099 -0.230044 0.492439
12.533333 2.723700 -3.354554 -2.537787 -0.056950 -0.220729 0.173959
12.566667 2.721820 -3.361690 -2.453956 -0.054712 -0.211518 -0.255518
12.600000 2.720017 -3.368613 -2.437634 -0.052382 -0.202491 -0.768977
12.633333 2.718297 -3.375194 -2.465223 -0.049959 -0.193708 -1.328554
12.666667 2.716662 -3.381435 -2.571314 -0.047440 -0.185236 -1.886447
12.700000 2.715111 -3.387339 -2.736719 -0.044826 -0.177122 -2.393819
12.733333 2.713645 -3.392909 -2.929418 -0.042122 -0.169392 -2.806959
12.766667 2.712261 -3.398280 -3.116558 -0.039326 -0.162053 -3.098505
12.800000 2.710961 -3.403454 3.026978 -0.036443 -0.155112 -3.242332
12.833333 2.709744 -3.408434 2.927098 -0.033479 -0.148568 -3.229667
12.866667 2.708665 -3.413217 2.861664 -0.030445 -0.142400 -3.076394
12.900000 2.707671 -3.417813 2.800817 -0.027345 -0.136578 -2.820046
12.933333 2.706814 -3.422227 2.630688 -0.024189 -0.131062 -2.495049
12.966667 2.706085 -3.426466 2.496894 -0.020990 -0.125821 -2.130683
13.000000 2.705445 -3.430528 2.407462 -0.017760 -0.120827 -1.755938
13.033333 2.704894 -3.434417 2.388372 -0.014508 -0.116058 -1.397492
13.066667 2.704461 -3.438156 2.386664 -0.011237 -0.111505 -1.068919
13.100000 2.704148 -3.441759 2.373167 -0.007953 -0.107163 -0.767701
13.133333 2.703927 -3.445198 2.356222 -0.004658 -0.103033 -0.504626
13.166667 2.703826 -3.448521 2.378987 -0.001350 -0.099107 -0.290791
13.200000 2.703817 -3.451689 2.402824 0.001975 -0.095381 -0.132272
