t x y theta dxdt dydt dthetadt
0.000000 0.000000 0.000000 -0.810372 0.062912 0.105947 -1.075513
0.033333 0.002135 0.003622 -0.842561 0.063255 0.111035 -0.981072
0.066667 0.004232 0.007512 -0.866618 0.063527 0.116088 -0.904238
0.100000 0.006354 0.011508 -0.901017 0.063744 0.121104 -0.848146
0.133333 0.008501 0.015611 -0.923595 0.063919 0.126120 -0.813763
0.166667 0.010673 0.019821 -0.953236 0.064057 0.131214 -0.800312
0.200000 0.012777 0.024335 -0.967981 0.064176 0.136455 -0.812568
0.233333 0.014905 0.028956 -0.984171 0.064297 0.141906 -0.857864
0.266667 0.017057 0.033683 -1.002035 0.064418 0.147672 -0.939075
0.300000 0.019232 0.038516 -1.030687 0.064547 0.153828 -1.059695
0.333333 0.021360 0.043698 -1.055569 0.064700 0.160381 -1.222633
0.366667 0.023510 0.048985 -1.079086 0.064897 0.167279 -1.433473
0.400000 0.025682 0.054375 -1.116228 0.065137 0.174453 -1.693348
0.433333 0.027840 0.060150 -1.168906 0.065425 0.181816 -1.998791
0.466667 0.030000 0.066319 -1.237590 0.065771 0.189272 -2.349222
0.500000 0.032169 0.072889 -1.308244 0.066181 0.196666 -2.738274
0.533333 0.034360 0.079869 -1.393752 0.066643 0.203918 -3.162843
0.566667 0.036571 0.086944 -1.506468 0.067187 0.210956 -3.609881
0.600000 0.038802 0.094113 -1.625944 0.067849 0.217717 -4.059609
0.633333 0.041078 0.101725 -1.766947 0.068658 0.224156 -4.490737
0.666667 0.043373 0.109424 -1.926209 0.069635 0.230211 -4.873856
0.700000 0.045685 0.117208 -2.098509 0.070803 0.235898 -5.184924
0.733333 0.048015 0.125073 -2.310996 0.072194 0.241198 -5.384052
0.766667 0.050362 0.133016 -2.523799 0.073785 0.246106 -5.442866
0.800000 0.052740 0.141436 -2.775658 0.075583 0.250570 -5.338726
0.833333 0.055134 0.149927 -2.976315 0.077599 0.254571 -5.065229
0.866667 0.057522 0.158909 3.035944 0.079878 0.258046 -4.621880
0.900000 0.060407 0.167750 2.823255 0.082423 0.260923 -4.015730
0.933333 0.063304 0.176651 2.661181 0.085267 0.263118 -3.279189
0.966667 0.066212 0.185607 2.551962 0.088426 0.264564 -2.450918
1.000000 0.069131 0.194615 2.480864 0.091860 0.265295 -1.580799
1.033333 0.072059 0.203670 2.449388 0.095518 0.265344 -0.706587
1.066667 0.074994 0.212769 2.479147 0.099289 0.264853 0.120924
1.100000 0.078272 0.221710 2.555648 0.103112 0.263949 0.857683
1.133333 0.081885 0.230477 2.665620 0.106832 0.262844 1.476223
1.166667 0.085500 0.239275 2.765493 0.110321 0.261734 1.962644
1.200000 0.089447 0.247858 2.860017 0.113442 0.260801 2.317079
1.233333 0.093391 0.256465 2.974355 0.116076 0.260192 2.542578
1.266667 0.097683 0.264821 3.093283 0.118098 0.260036 2.659291
1.300000 0.101966 0.273195 -3.084481 0.119393 0.260456 2.696823
1.333333 0.106237 0.281583 -2.987898 0.119945 0.261484 2.681236
1.366667 0.110343 0.290291 -2.903162 0.119747 0.263133 2.636206
1.400000 0.114432 0.299006 -2.840190 0.118859 0.265342 2.583763
1.433333 0.118499 0.307725 -2.779063 0.117341 0.268044 2.541499
1.466667 0.122426 0.316710 -2.678966 0.115336 0.271071 2.521470
1.500000 0.126325 0.325691 -2.605880 0.112966 0.274242 2.523620
1.533333 0.130099 0.334879 -2.536264 0.110332 0.277363 2.545523
1.566667 0.133752 0.344250 -2.453404 0.107526 0.280248 2.579997
1.600000 0.137288 0.353773 -2.391709 0.104622 0.282726 2.617490
1.633333 0.140713 0.363428 -2.288810 0.101692 0.284632 2.645094
1.666667 0.144027 0.373178 -2.180223 0.098763 0.285848 2.654018
1.700000 0.147234 0.382984 -2.079597 0.095871 0.286249 2.636707
1.733333 0.150338 0.392803 -1.969771 0.093037 0.285739 2.589260
1.766667 0.153392 0.402583 -1.876682 0.090277 0.284234 2.513976
1.800000 0.156349 0.412285 -1.779610 0.087596 0.281686 2.410934
1.833333 0.159208 0.421858 -1.696874 0.084983 0.278044 2.291789
1.866667 0.161974 0.431244 -1.622475 0.082428 0.273317 2.164677
1.900000 0.164651 0.440388 -1.567229 0.079912 0.267600 2.044104
1.933333 0.167267 0.449469 -1.501544 0.077413 0.261033 1.939054
1.966667 0.169819 0.458484 -1.458158 0.074919 0.253795 1.857752
2.000000 0.172293 0.467107 -1.403855 0.072413 0.246045 1.807326
2.033333 0.174688 0.475295 -1.372072 0.069888 0.237993 1.787744
2.066667 0.176993 0.483010 -1.311507 0.067331 0.229824 1.795565
2.100000 0.179200 0.490226 -1.261938 0.064734 0.221687 1.820512
2.133333 0.181332 0.497360 -1.202800 0.062092 0.213699 1.856035
2.166667 0.183349 0.503980 -1.131183 0.059405 0.205953 1.889625
2.200000 0.185285 0.510514 -1.064691 0.056682 0.198533 1.914267
2.233333 0.187138 0.516960 -0.982724 0.053943 0.191468 1.917249
2.266667 0.188907 0.523316 -0.912538 0.051207 0.184732 1.892956
2.300000 0.190589 0.529580 -0.829852 0.048502 0.178231 1.837144
2.333333 0.192155 0.535421 -0.769898 0.045870 0.171892 1.746868
2.366667 0.193613 0.540862 -0.701214 0.043338 0.165631 1.624288
2.400000 0.194978 0.546208 -0.643473 0.040937 0.159391 1.469090
2.433333 0.196245 0.551459 -0.594931 0.038681 0.153148 1.288704
2.466667 0.197415 0.556615 -0.556154 0.036587 0.146915 1.086745
2.500000 0.198528 0.561446 -0.512500 0.034647 0.140777 0.869160
2.533333 0.199604 0.565977 -0.480957 0.032832 0.134799 0.642450
2.566667 0.200658 0.570230 -0.466628 0.031109 0.129026 0.411147
2.600000 0.201603 0.574387 -0.461553 0.029422 0.123501 0.182112
2.633333 0.202562 0.578308 -0.458572 0.027715 0.118260 -0.038549
2.666667 0.203546 0.582018 -0.479183 0.025922 0.113349 -0.240918
2.700000 0.204414 0.585633 -0.479796 0.024000 0.108763 -0.416826
