t x y theta dxdt dydt dthetadt
0.000000 0.000000 0.000000 -0.391815 0.010439 -0.004570 0.001465
0.033333 0.000385 -0.000138 -0.395499 0.015003 -0.005673 0.002073
0.066667 0.000567 -0.000235 -0.391152 0.020626 -0.007064 0.003053
0.100000 0.001343 -0.000409 -0.389908 0.027594 -0.008804 0.003155
0.133333 0.002056 -0.000612 -0.387544 0.036047 -0.010936 0.002655
0.166667 0.002760 -0.000881 -0.385576 0.046460 -0.013548 0.001732
0.200000 0.003542 -0.001257 -0.388949 0.059634 -0.016784 -0.001984
0.233333 0.004987 -0.001715 -0.381032 0.076171 -0.020763 -0.014334
0.266667 0.007114 -0.002255 -0.384572 0.096375 -0.025532 -0.037675
0.300000 0.009746 -0.002995 -0.391675 0.121061 -0.031252 -0.075367
0.333333 0.013116 -0.003971 -0.395351 0.150994 -0.038068 -0.130675
0.366667 0.017218 -0.005031 -0.383965 0.186962 -0.046166 -0.208344
0.400000 0.022782 -0.006509 -0.390125 0.229054 -0.055569 -0.306817
0.433333 0.029110 -0.008069 -0.392495 0.277421 -0.066307 -0.419278
0.466667 0.036215 -0.009713 -0.386528 0.332331 -0.078446 -0.545585
0.500000 0.046446 -0.012149 -0.398723 0.392946 -0.091780 -0.676806
0.533333 0.060733 -0.015577 -0.426772 0.458766 -0.106255 -0.808153
0.566667 0.075830 -0.019081 -0.473467 0.528448 -0.121565 -0.927233
0.600000 0.091743 -0.022660 -0.510788 0.601084 -0.137536 -1.030453
0.633333 0.113709 -0.027689 -0.570088 0.675685 -0.154018 -1.112091
0.666667 0.136497 -0.032784 -0.607594 0.751571 -0.170991 -1.164424
0.700000 0.166609 -0.039781 -0.674546 0.828365 -0.188502 -1.190346
0.733333 0.197533 -0.046832 -0.711899 0.905113 -0.206345 -1.187367
0.766667 0.229257 -0.053927 -0.756738 0.981667 -0.224566 -1.161631
0.800000 0.261772 -0.061062 -0.806155 1.058132 -0.243288 -1.114686
0.833333 0.295067 -0.068228 -0.811917 1.134767 -0.262577 -1.056174
0.866667 0.335799 -0.077779 -0.853801 1.210904 -0.282116 -0.990324
0.900000 0.377280 -0.087343 -0.894264 1.287011 -0.301890 -0.918504
0.933333 0.419491 -0.096910 -0.926209 1.363966 -0.322025 -0.844657
0.966667 0.466730 -0.108176 -0.947140 1.441764 -0.342306 -0.768948
1.000000 0.518423 -0.120960 -0.968978 1.519460 -0.362179 -0.691941
1.033333 0.570770 -0.133710 -1.005589 1.596133 -0.381087 -0.608455
1.066667 0.623740 -0.146411 -1.006908 1.671768 -0.398860 -0.522538
1.100000 0.680433 -0.160233 -1.034656 1.745132 -0.414886 -0.436134
1.133333 0.741453 -0.175243 -1.060722 1.814416 -0.428412 -0.349278
1.166667 0.802989 -0.190156 -1.062971 1.878820 -0.438961 -0.264128
1.200000 0.868136 -0.205778 -1.068892 1.938228 -0.446349 -0.181828
1.233333 0.936608 -0.221943 -1.071511 1.992053 -0.450261 -0.105643
1.266667 1.007018 -0.238197 -1.064872 2.039343 -0.450084 -0.033169
1.300000 1.077762 -0.254280 -1.059832 2.079783 -0.445617 0.038820
1.333333 1.148791 -0.270175 -1.047128 2.113828 -0.436893 0.109465
1.366667 1.221325 -0.285501 -1.052884 2.141367 -0.423862 0.183337
1.400000 1.294042 -0.300602 -1.046541 2.162507 -0.406488 0.261907
1.433333 1.367659 -0.314552 -1.052258 2.177787 -0.384961 0.349669
1.466667 1.441352 -0.328241 -1.037622 2.187727 -0.359584 0.451157
1.500000 1.515310 -0.340322 -1.030910 2.192636 -0.330601 0.566843
1.533333 1.589237 -0.352109 -1.004822 2.192231 -0.297914 0.697845
1.566667 1.662811 -0.361871 -0.988425 2.186612 -0.261796 0.842926
1.600000 1.736853 -0.369520 -0.973569 2.175267 -0.222373 1.000924
1.633333 1.810703 -0.376835 -0.923619 2.157837 -0.179865 1.165404
1.666667 1.884307 -0.383807 -0.878393 2.133830 -0.134598 1.328907
1.700000 1.956871 -0.388045 -0.837343 2.102867 -0.086882 1.487413
1.733333 2.029081 -0.391921 -0.783879 2.065134 -0.037507 1.642123
1.766667 2.099195 -0.392791 -0.728484 2.020758 0.012971 1.787965
1.800000 2.166644 -0.390501 -0.650671 1.970765 0.063592 1.922649
1.833333 2.233587 -0.387837 -0.570510 1.915537 0.113532 2.049142
1.866667 2.296602 -0.381919 -0.506669 1.855992 0.161510 2.169234
1.900000 2.359020 -0.375628 -0.420445 1.792527 0.206419 2.278496
1.933333 2.417120 -0.366170 -0.357310 1.725568 0.247164 2.368843
1.966667 2.474541 -0.356348 -0.281377 1.654948 0.282757 2.436446
2.000000 2.526144 -0.343911 -0.207511 1.579901 0.312348 2.475498
2.033333 2.576999 -0.331125 -0.112734 1.500567 0.335117 2.473770
2.066667 2.627072 -0.317998 -0.001854 1.416926 0.351059 2.419673
2.100000 2.676333 -0.304537 0.085526 1.329521 0.359878 2.311900
2.133333 2.724751 -0.290753 0.185287 1.238289 0.361747 2.148994
2.166667 2.766890 -0.276808 0.291904 1.144180 0.356731 1.934174
2.200000 2.803186 -0.263406 0.371341 1.048499 0.345579 1.674150
2.233333 2.833962 -0.251096 0.438413 0.952484 0.329150 1.385568
2.266667 2.863813 -0.238496 0.481604 0.857244 0.307998 1.085844
2.300000 2.888671 -0.227892 0.505732 0.764381 0.283431 0.786257
2.333333 2.908965 -0.219796 0.505534 0.676103 0.256756 0.501610
2.366667 2.928316 -0.211424 0.480496 0.593758 0.229649 0.244790
2.400000 2.946722 -0.202777 0.454850 0.517892 0.203281 0.026010
2.433333 2.960935 -0.197883 0.434525 0.448498 0.179027 -0.156375
2.466667 2.974208 -0.192713 0.419485 0.385559 0.158262 -0.306327
2.500000 2.983494 -0.190779 0.429154 0.328359 0.141934 -0.431581
2.533333 2.991853 -0.188559 0.419020 0.275570 0.130521 -0.539894
2.566667 2.999294 -0.186046 0.419765 0.226304 0.124228 -0.645561
2.600000 3.005825 -0.183232 0.383301 0.180331 0.123424 -0.759547
2.633333 3.011458 -0.180112 0.346508 0.137449 0.127891 -0.884290
2.666667 3.016201 -0.176678 0.314308 0.097552 0.137573 -1.018853
2.700000 3.018592 -0.172997 0.301803 0.060600 0.152154 -1.155907
2.733333 3.018993 -0.168344 0.293650 0.027058 0.171603 -1.295513
2.766667 3.017936 -0.162112 0.240730 -0.002564 0.195878 -1.427441
2.800000 3.016044 -0.155543 0.155380 -0.027877 0.224670 -1.547011
2.833333 3.013330 -0.148632 0.058076 -0.048341 0.257786 -1.649419
2.866667 3.009812 -0.141377 0.005667 -0.063620 0.294705 -1.731115
2.900000 3.005506 -0.133772 -0.043120 -0.073541 0.334830 -1.789706
2.933333 3.001218 -0.123363 -0.086610 -0.078397 0.377119 -1.818420
2.966667 2.997223 -0.110351 -0.151527 -0.078924 0.420184 -1.817718
3.000000 2.993685 -0.095026 -0.233423 -0.076118 0.462488 -1.783196
3.033333 2.990810 -0.077701 -0.311039 -0.071298 0.502251 -1.710104
3.066667 2.988598 -0.058675 -0.372450 -0.065870 0.537547 -1.595503
3.100000 2.987111 -0.038081 -0.414206 -0.061332 0.566440 -1.435527
3.133333 2.986277 -0.016036 -0.474943 -0.058990 0.587619 -1.226385
3.166667 2.986051 0.007018 -0.538258 -0.059892 0.600413 -0.968681
3.200000 2.985151 0.030380 -0.577143 -0.064782 0.604413 -0.670730
3.233333 2.984413 0.053152 -0.620463 -0.073980 0.599984 -0.347880
3.266667 2.983245 0.074760 -0.646932 -0.087384 0.588159 -0.015246
3.300000 2.981316 0.094740 -0.645527 -0.104428 0.570669 0.304019
3.333333 2.978745 0.114990 -0.618319 -0.124265 0.549140 0.582844
3.366667 2.974659 0.133350 -0.542827 -0.145739 0.525228 0.796720
3.400000 2.969088 0.149576 -0.492227 -0.167703 0.500961 0.930526
3.433333 2.962032 0.163642 -0.411556 -0.188989 0.478106 0.971262
3.466667 2.954374 0.177968 -0.339492 -0.208703 0.458055 0.914771
3.500000 2.946127 0.192553 -0.288586 -0.226051 0.441757 0.771227
3.533333 2.937191 0.205376 -0.233632 -0.240537 0.430182 0.558858
3.566667 2.927690 0.218462 -0.188931 -0.252069 0.423916 0.304976
3.600000 2.918407 0.230741 -0.186262 -0.260780 0.423063 0.035466
3.633333 2.908584 0.243290 -0.223325 -0.266978 0.427573 -0.217257
3.666667 2.899394 0.256415 -0.272355 -0.271027 0.437395 -0.426751
3.700000 2.891064 0.270717 -0.328880 -0.273628 0.452329 -0.577699
3.733333 2.882226 0.285299 -0.381155 -0.275399 0.471963 -0.657009
3.766667 2.872887 0.300164 -0.433539 -0.276930 0.495757 -0.660509
3.800000 2.863058 0.315315 -0.465107 -0.278620 0.523221 -0.593815
3.833333 2.854138 0.332964 -0.491467 -0.281026 0.553523 -0.468218
3.866667 2.844745 0.350900 -0.503050 -0.284530 0.585851 -0.299472
3.900000 2.835855 0.371378 -0.508858 -0.289292 0.619230 -0.100871
3.933333 2.826507 0.392141 -0.495174 -0.295476 0.652641 0.108909
3.966667 2.817171 0.415373 -0.497378 -0.303223 0.684978 0.317362
4.000000 2.807390 0.438881 -0.465508 -0.312717 0.715050 0.517536
4.033333 2.797188 0.464335 -0.454286 -0.323801 0.742057 0.704739
4.066667 2.786651 0.491318 -0.406301 -0.336371 0.765129 0.872570
4.100000 2.775689 0.518552 -0.377622 -0.350097 0.783727 1.018818
4.133333 2.764204 0.546432 -0.351681 -0.364633 0.797389 1.144740
4.166667 2.751882 0.574665 -0.310749 -0.379473 0.806198 1.240966
4.200000 2.738866 0.602793 -0.245943 -0.393990 0.810442 1.302624
4.233333 2.724998 0.630814 -0.198537 -0.407560 0.810488 1.322822
4.266667 2.710744 0.659038 -0.141902 -0.419567 0.806891 1.298286
4.300000 2.695853 0.686348 -0.081542 -0.429624 0.800441 1.223982
4.333333 2.680613 0.712527 -0.029090 -0.437363 0.792107 1.096146
4.366667 2.665014 0.738884 0.025556 -0.442551 0.782609 0.923280
4.400000 2.649065 0.765411 0.068595 -0.445225 0.772660 0.714905
4.433333 2.633970 0.790116 0.109438 -0.445804 0.763152 0.481274
4.466667 2.618543 0.814979 0.136087 -0.444720 0.754869 0.239199
4.500000 2.602792 0.839995 0.108659 -0.442527 0.748311 0.007662
4.533333 2.588044 0.864193 0.098647 -0.439929 0.743908 -0.197309
4.566667 2.574273 0.887831 0.082914 -0.437772 0.742207 -0.363394
4.600000 2.560197 0.911611 0.013976 -0.436765 0.743700 -0.479601
4.633333 2.546678 0.935802 -0.014961 -0.437364 0.748321 -0.537428
4.666667 2.532864 0.960128 -0.049209 -0.440106 0.756026 -0.533004
4.700000 2.518762 0.984585 -0.091825 -0.445438 0.766651 -0.472314
4.733333 2.504374 1.009169 -0.104743 -0.453565 0.779757 -0.359923
4.766667 2.489825 1.034886 -0.110592 -0.464419 0.794514 -0.204901
4.800000 2.475001 1.060721 -0.128371 -0.478034 0.810072 -0.024041
4.833333 2.459470 1.088055 -0.118781 -0.494452 0.825740 0.168104
4.866667 2.443064 1.116698 -0.110557 -0.513493 0.840672 0.354810
4.900000 2.425575 1.146331 -0.104638 -0.534866 0.854032 0.525757
4.933333 2.407831 1.176054 -0.078756 -0.558275 0.865197 0.670423
4.966667 2.389840 1.205857 -0.035904 -0.583432 0.873927 0.783091
5.000000 2.370610 1.236056 0.013004 -0.609756 0.879996 0.860038
5.033333 2.350213 1.266285 0.061911 -0.636529 0.883426 0.898086
5.066667 2.328627 1.296347 0.117373 -0.663135 0.884490 0.898016
5.100000 2.305948 1.326004 0.143258 -0.688913 0.883754 0.857646
5.133333 2.281830 1.355452 0.169558 -0.713177 0.881792 0.778809
5.166667 2.256309 1.384715 0.194784 -0.735162 0.879124 0.663604
5.200000 2.230613 1.413994 0.213056 -0.754286 0.876364 0.518976
5.233333 2.203820 1.442787 0.241176 -0.770019 0.874089 0.354371
5.266667 2.176881 1.471581 0.259300 -0.781945 0.872742 0.175974
5.300000 2.149812 1.500368 0.275376 -0.789872 0.872516 -0.006193
5.333333 2.122629 1.529141 0.272938 -0.793818 0.873564 -0.184127
5.366667 2.095346 1.557891 0.243200 -0.794037 0.875932 -0.347659
5.400000 2.067979 1.586611 0.244968 -0.790874 0.879529 -0.490701
5.433333 2.040933 1.615628 0.197548 -0.784979 0.884025 -0.602974
5.466667 2.013833 1.644600 0.161954 -0.776907 0.889128 -0.676479
5.500000 1.987493 1.674163 0.127080 -0.767174 0.894553 -0.703135
5.533333 1.962141 1.704317 0.081915 -0.756276 0.899980 -0.678670
5.566667 1.937935 1.735167 0.050471 -0.744867 0.904982 -0.607014
5.600000 1.913727 1.765938 0.025377 -0.733526 0.909109 -0.488502
5.633333 1.889528 1.796617 -0.007108 -0.722627 0.912015 -0.335144
5.666667 1.865350 1.827197 -0.029533 -0.712632 0.913241 -0.155594
5.700000 1.842459 1.858116 -0.030662 -0.703981 0.912405 0.037592
5.733333 1.819611 1.888914 -0.031358 -0.696974 0.909137 0.233125
5.766667 1.796813 1.919583 0.004063 -0.691589 0.903214 0.421761
5.800000 1.774293 1.950323 0.031734 -0.687862 0.894477 0.594052
5.833333 1.751881 1.980900 0.070015 -0.685837 0.882789 0.742646
5.866667 1.729548 2.011316 0.098021 -0.685467 0.868121 0.861066
5.900000 1.707109 2.041065 0.136749 -0.686560 0.850443 0.945920
5.933333 1.684661 2.069724 0.166140 -0.688934 0.829942 0.996988
5.966667 1.661863 2.097488 0.214768 -0.692433 0.806925 1.016365
6.000000 1.638567 2.124138 0.258257 -0.696664 0.781854 1.005145
6.033333 1.615400 2.150585 0.301327 -0.701168 0.755274 0.966299
6.066667 1.591982 2.175673 0.331497 -0.705434 0.727883 0.902733
6.100000 1.568577 2.199303 0.367698 -0.708939 0.700523 0.817795
6.133333 1.544623 2.221817 0.393464 -0.711151 0.673866 0.710228
6.166667 1.520261 2.243271 0.422881 -0.711627 0.648517 0.582378
6.200000 1.495660 2.263716 0.441723 -0.710149 0.624966 0.436252
6.233333 1.471041 2.283149 0.455010 -0.706534 0.603699 0.276996
6.266667 1.446630 2.302363 0.470326 -0.700704 0.584938 0.107828
6.300000 1.422708 2.320836 0.475453 -0.692717 0.568703 -0.066885
6.333333 1.399509 2.338701 0.473793 -0.682785 0.554970 -0.237202
6.366667 1.376553 2.356351 0.453673 -0.671005 0.543565 -0.397347
6.400000 1.353851 2.373789 0.434472 -0.657303 0.534178 -0.541108
6.433333 1.332634 2.391382 0.415764 -0.641583 0.526269 -0.662840
6.466667 1.311692 2.408768 0.367429 -0.623555 0.519324 -0.755036
6.500000 1.291033 2.425948 0.337227 -0.602999 0.512780 -0.814058
6.533333 1.270665 2.442926 0.291746 -0.579416 0.506058 -0.841078
6.566667 1.250598 2.459702 0.249276 -0.552561 0.498689 -0.837152
6.600000 1.230840 2.476280 0.213642 -0.522466 0.490363 -0.803488
6.633333 1.212771 2.493223 0.186768 -0.489375 0.480985 -0.747808
6.666667 1.195026 2.509973 0.170295 -0.453829 0.470771 -0.681880
6.700000 1.179419 2.526302 0.143741 -0.416431 0.460050 -0.614789
6.733333 1.165993 2.541866 0.115600 -0.378267 0.449279 -0.553005
6.766667 1.154799 2.556458 0.116286 -0.340430 0.438967 -0.505141
6.800000 1.145947 2.570047 0.105525 -0.304029 0.429639 -0.476788
6.833333 1.137428 2.583460 0.109875 -0.269954 0.422115 -0.466928
6.866667 1.130961 2.596387 0.094814 -0.239148 0.416821 -0.468263
6.900000 1.124821 2.609149 0.086420 -0.212251 0.414143 -0.475266
6.933333 1.119001 2.621752 0.082721 -0.189447 0.414342 -0.482787
6.966667 1.113497 2.634200 0.057744 -0.170599 0.417543 -0.479362
7.000000 1.108784 2.648590 0.026151 -0.155272 0.423559 -0.457840
7.033333 1.104374 2.662834 -0.008326 -0.143032 0.431586 -0.412822
7.066667 1.100262 2.676936 -0.038447 -0.133130 0.440924 -0.342149
7.100000 1.096441 2.690898 -0.066533 -0.124964 0.450890 -0.245271
7.133333 1.092903 2.704723 -0.071581 -0.118076 0.460726 -0.124449
7.166667 1.088810 2.721982 -0.070619 -0.112074 0.469295 0.010684
7.200000 1.084987 2.739106 -0.065899 -0.106653 0.475881 0.150556
7.233333 1.081429 2.756095 -0.058387 -0.101506 0.479853 0.284659
7.266667 1.078130 2.772948 -0.034654 -0.096435 0.480515 0.400237
7.300000 1.075084 2.789663 -0.013673 -0.091244 0.477180 0.489120
7.333333 1.072283 2.806240 0.020008 -0.085754 0.469329 0.544723
7.366667 1.069364 2.823044 0.041666 -0.079950 0.457274 0.568600
7.400000 1.066504 2.839488 0.092141 -0.073866 0.441188 0.559588
7.433333 1.063873 2.855790 0.110376 -0.067582 0.421588 0.523516
7.466667 1.061555 2.870480 0.135032 -0.061248 0.399439 0.467139
7.500000 1.059703 2.883276 0.141108 -0.055079 0.375996 0.395419
7.533333 1.058061 2.895932 0.155795 -0.049333 0.352726 0.315076
7.566667 1.056736 2.906611 0.152854 -0.044218 0.330931 0.229208
7.600000 1.055670 2.915633 0.164928 -0.039938 0.311972 0.146348
7.633333 1.054795 2.924528 0.164627 -0.036744 0.297300 0.063266
7.666667 1.054042 2.932361 0.151239 -0.034830 0.288130 -0.019004
7.700000 1.053317 2.939724 0.155828 -0.034271 0.285363 -0.100557
7.733333 1.052526 2.947128 0.147000 -0.035051 0.289685 -0.179532
7.766667 1.051900 2.954431 0.158154 -0.037149 0.301632 -0.259834
7.800000 1.050999 2.962722 0.159942 -0.040527 0.321620 -0.343733
7.833333 1.049699 2.972574 0.136688 -0.045023 0.349645 -0.424576
7.866667 1.047863 2.984509 0.108159 -0.050451 0.385269 -0.498017
7.900000 1.046171 2.996361 0.103161 -0.056720 0.427921 -0.558703
7.933333 1.044618 3.008130 0.089044 -0.063762 0.476744 -0.604736
7.966667 1.042505 3.022735 0.046279 -0.071524 0.530407 -0.624601
8.000000 1.040045 3.040173 0.011217 -0.080087 0.587250 -0.608631
8.033333 1.037325 3.060301 -0.022707 -0.089573 0.645472 -0.551472
8.066667 1.034306 3.083230 -0.048566 -0.100286 0.703229 -0.448772
8.100000 1.030996 3.108739 -0.071315 -0.112387 0.758483 -0.294451
8.133333 1.027515 3.136571 -0.089858 -0.126207 0.808975 -0.084466
8.166667 1.023684 3.166804 -0.111102 -0.142095 0.852510 0.176711
8.200000 1.019228 3.199071 -0.107980 -0.160264 0.886912 0.477920
8.233333 1.014105 3.232548 -0.096422 -0.180913 0.910440 0.805661
8.266667 1.009103 3.265812 -0.078610 -0.204043 0.921648 1.145287
8.300000 1.002624 3.299687 -0.048967 -0.229651 0.919601 1.476784
8.333333 0.994507 3.333536 0.017534 -0.257263 0.904259 1.781270
8.366667 0.986522 3.367094 0.094322 -0.286210 0.876450 2.039591
8.400000 0.976296 3.398967 0.205670 -0.315547 0.837998 2.238239
8.433333 0.966217 3.430498 0.327512 -0.344378 0.790351 2.368422
8.466667 0.954065 3.458691 0.438365 -0.371458 0.735382 2.421494
8.500000 0.940006 3.482912 0.542172 -0.395600 0.675183 2.396713
8.533333 0.924277 3.502364 0.634845 -0.415787 0.611566 2.296767
8.566667 0.908743 3.521401 0.703805 -0.431000 0.545619 2.133739
8.600000 0.891954 3.534892 0.788624 -0.440595 0.478083 1.919912
8.633333 0.875393 3.547949 0.850734 -0.443967 0.410361 1.669549
8.666667 0.859078 3.560568 0.917484 -0.441027 0.343524 1.397994
8.700000 0.843025 3.572743 0.942151 -0.431759 0.277936 1.118364
8.733333 0.827251 3.584469 0.968916 -0.416458 0.213700 0.841874
8.766667 0.812358 3.591088 0.989359 -0.395742 0.151737 0.574524
8.800000 0.798799 3.593233 0.993261 -0.370254 0.092653 0.325490
8.833333 0.785568 3.594930 1.008518 -0.340592 0.036662 0.097985
8.866667 0.774346 3.593287 1.004539 -0.307530 -0.015707 -0.103797
8.900000 0.765103 3.588623 0.989204 -0.272033 -0.063161 -0.279836
8.933333 0.756227 3.583540 0.962705 -0.235049 -0.104297 -0.431494
8.966667 0.747729 3.578050 0.935769 -0.197293 -0.138713 -0.560690
9.000000 0.741427 3.571190 0.905746 -0.159558 -0.166124 -0.673812
9.033333 0.737314 3.563503 0.878234 -0.122785 -0.186217 -0.773935
9.066667 0.735227 3.555508 0.846038 -0.087644 -0.199047 -0.863883
9.100000 0.733547 3.547161 0.822005 -0.054523 -0.205511 -0.946733
9.133333 0.733657 3.539573 0.797974 -0.023858 -0.206423 -1.021241
9.166667 0.734180 3.531662 0.775076 0.003809 -0.202057 -1.084096
9.200000 0.735118 3.523441 0.734855 0.028242 -0.192899 -1.130196
9.233333 0.737332 3.517115 0.703934 0.049352 -0.179571 -1.155048
9.266667 0.739962 3.510505 0.639820 0.067223 -0.162870 -1.151586
9.300000 0.743009 3.503621 0.585209 0.081791 -0.143135 -1.112924
9.333333 0.746619 3.499280 0.533987 0.093346 -0.121113 -1.036907
9.366667 0.750644 3.494685 0.482297 0.102249 -0.097854 -0.926383
9.400000 0.754851 3.492349 0.440509 0.108690 -0.074314 -0.788091
9.433333 0.759472 3.489773 0.400554 0.113032 -0.051288 -0.629632
9.466667 0.763691 3.489093 0.375190 0.115551 -0.029547 -0.468789
9.500000 0.767562 3.490060 0.381149 0.116769 -0.010139 -0.319922
9.533333 0.771846 3.490797 0.387689 0.117081 0.006340 -0.194148
9.566667 0.775500 3.492771 0.400468 0.117087 0.019172 -0.096939
9.600000 0.779570 3.494515 0.438227 0.117560 0.027946 -0.032389
9.633333 0.782982 3.496769 0.449965 0.119201 0.032129 0.002032
9.666667 0.786813 3.498791 0.459562 0.122572 0.031552 0.014647
9.700000 0.790294 3.500749 0.459091 0.128084 0.026410 0.015368
9.733333 0.793575 3.502354 0.451159 0.136383 0.016732 0.013712
9.766667 0.797281 3.503723 0.431558 0.147761 0.003066 0.013915
9.800000 0.801414 3.504856 0.406138 0.162267 -0.013976 0.025381
9.833333 0.805976 3.505752 0.388406 0.179768 -0.033653 0.045120
9.866667 0.811314 3.505141 0.384510 0.200166 -0.055295 0.073392
9.900000 0.817762 3.502752 0.405194 0.223239 -0.078228 0.105266
9.933333 0.825885 3.498459 0.414792 0.248352 -0.101545 0.133691
9.966667 0.834440 3.493934 0.453885 0.275260 -0.124669 0.153494
10.000000 0.843425 3.489182 0.461379 0.304060 -0.147219 0.158951
10.033333 0.852838 3.484207 0.466122 0.335187 -0.168913 0.152729
10.066667 0.865760 3.477093 0.490703 0.369172 -0.189569 0.134018
10.100000 0.879102 3.469767 0.486518 0.406723 -0.209273 0.106654
10.133333 0.892858 3.462236 0.483778 0.448809 -0.228348 0.074544
10.166667 0.907020 3.454505 0.464522 0.495898 -0.246950 0.044339
10.200000 0.921581 3.446583 0.459585 0.547973 -0.265127 0.015039
10.233333 0.936534 3.438475 0.455227 0.604505 -0.282849 -0.016266
10.266667 0.955267 3.428994 0.455671 0.664829 -0.300078 -0.051518
10.300000 0.977372 3.418358 0.455615 0.727970 -0.316569 -0.094613
10.333333 1.002688 3.406888 0.467933 0.792468 -0.331902 -0.149452
10.366667 1.031390 3.394807 0.474298 0.856860 -0.345703 -0.221310
10.400000 1.063992 3.382053 0.489155 0.919842 -0.357516 -0.310748
10.433333 1.096881 3.369171 0.475732 0.980555 -0.366798 -0.417733
10.466667 1.133869 3.356124 0.469033 1.038081 -0.372992 -0.541477
10.500000 1.171086 3.342971 0.435880 1.092005 -0.375708 -0.680229
10.533333 1.208500 3.329722 0.405924 1.142277 -0.374817 -0.831440
10.566667 1.246078 3.316387 0.371399 1.189355 -0.370269 -0.994315
10.600000 1.286970 3.303380 0.330136 1.233590 -0.362332 -1.166650
10.633333 1.327958 3.290310 0.289889 1.274958 -0.351535 -1.344028
10.666667 1.371623 3.278024 0.256642 1.313557 -0.338397 -1.523277
10.700000 1.415308 3.265695 0.211058 1.349276 -0.323085 -1.702991
10.733333 1.461654 3.254473 0.164317 1.381762 -0.305736 -1.878817
10.766667 1.510180 3.244774 0.089334 1.410157 -0.286327 -2.039761
10.800000 1.560800 3.236997 0.018404 1.433733 -0.264553 -2.173080
10.833333 1.611265 3.229202 -0.064886 1.451833 -0.239779 -2.270819
10.866667 1.661525 3.221395 -0.151422 1.463725 -0.211439 -2.320229
10.900000 1.711534 3.213577 -0.266406 1.468291 -0.179384 -2.301145
10.933333 1.761245 3.205751 -0.379400 1.464867 -0.143275 -2.195605
10.966667 1.810609 3.197922 -0.459600 1.452804 -0.103035 -1.996913
11.000000 1.860560 3.193464 -0.541532 1.431771 -0.059057 -1.704678
11.033333 1.910514 3.192301 -0.630326 1.401649 -0.012429 -1.318744
11.066667 1.959978 3.191132 -0.692420 1.362038 0.035324 -0.849449
11.100000 2.008078 3.192987 -0.744461 1.313289 0.082417 -0.321994
11.133333 2.053856 3.197683 -0.744319 1.255087 0.126348 0.227483
11.166667 2.097558 3.204838 -0.750511 1.188007 0.164548 0.771347
11.200000 2.137975 3.214185 -0.717196 1.112683 0.194907 1.278992
11.233333 2.173856 3.225151 -0.626473 1.030032 0.215942 1.718505
11.266667 2.208988 3.236034 -0.498064 0.941491 0.226498 2.061887
11.300000 2.237276 3.246738 -0.371547 0.848550 0.226089 2.291611
11.333333 2.264754 3.257320 -0.234935 0.753264 0.215151 2.405714
11.366667 2.291396 3.267764 -0.127704 0.656673 0.194270 2.402982
11.400000 2.310064 3.274771 -0.025455 0.559690 0.164178 2.291752
11.433333 2.327853 3.281604 0.074699 0.462557 0.125623 2.092564
11.466667 2.337601 3.283646 0.139361 0.366310 0.080169 1.833552
11.500000 2.346446 3.285489 0.192030 0.270943 0.029009 1.541388
11.533333 2.354382 3.287121 0.224097 0.176637 -0.026704 1.240006
11.566667 2.361400 3.288535 0.246804 0.084227 -0.085467 0.950511
11.600000 2.362022 3.284789 0.248077 -0.005558 -0.145644 0.692064
11.633333 2.361721 3.280810 0.262944 -0.091676 -0.205737 0.474498
11.666667 2.356351 3.272626 0.263631 -0.174154 -0.264839 0.301924
11.700000 2.346839 3.260921 0.267305 -0.251957 -0.321478 0.173979
11.733333 2.333990 3.246255 0.248560 -0.324093 -0.374125 0.089018
11.766667 2.320251 3.231364 0.263143 -0.389846 -0.421526 0.042006
11.800000 2.304221 3.214727 0.246780 -0.448789 -0.463007 0.028431
11.833333 2.286125 3.196534 0.244035 -0.500278 -0.497692 0.041426
11.866667 2.266554 3.177151 0.226926 -0.543841 -0.525041 0.076049
11.900000 2.246159 3.157586 0.236928 -0.579832 -0.545297 0.129625
11.933333 2.224962 3.137852 0.227393 -0.609075 -0.559250 0.197452
11.966667 2.202982 3.117962 0.257125 -0.632399 -0.567699 0.275371
12.000000 2.180239 3.097928 0.272230 -0.650512 -0.571325 0.355673
12.033333 2.157849 3.078483 0.272378 -0.664665 -0.571283 0.435594
12.066667 2.134737 3.058921 0.271459 -0.675871 -0.568569 0.508843
12.100000 2.110924 3.039254 0.303761 -0.684682 -0.563714 0.568776
12.133333 2.087900 3.020425 0.332652 -0.691571 -0.557103 0.609917
12.166667 2.065688 3.002608 0.362785 -0.697134 -0.549212 0.631762
12.200000 2.042832 2.984722 0.396249 -0.702036 -0.540556 0.633628
12.233333 2.019351 2.966777 0.422509 -0.706538 -0.531325 0.612448
12.266667 1.995265 2.948783 0.441365 -0.710789 -0.521501 0.568676
12.300000 1.970592 2.930750 0.469344 -0.715153 -0.511331 0.508246
12.333333 1.947191 2.914128 0.493249 -0.719853 -0.500923 0.436851
12.366667 1.923241 2.897487 0.511124 -0.724865 -0.490205 0.358541
12.400000 1.898758 2.880836 0.521449 -0.730007 -0.478924 0.280047
12.433333 1.875044 2.865764 0.510044 -0.735291 -0.467020 0.209897
12.466667 1.850832 2.850698 0.512201 -0.740830 -0.454650 0.154407
12.500000 1.826140 2.835645 0.515060 -0.746603 -0.441821 0.116534
12.533333 1.800984 2.820613 0.512664 -0.752505 -0.428583 0.097353
12.566667 1.775384 2.805608 0.504688 -0.758553 -0.415076 0.096454
12.600000 1.750038 2.792154 0.500933 -0.764833 -0.401686 0.111923
12.633333 1.724282 2.778739 0.496420 -0.771219 -0.388538 0.139070
12.666667 1.698719 2.766594 0.506806 -0.777542 -0.375800 0.172632
12.700000 1.672779 2.754497 0.520462 -0.783678 -0.363682 0.205795
12.733333 1.646564 2.743174 0.531066 -0.789582 -0.352477 0.234534
12.766667 1.620006 2.731906 0.535782 -0.795170 -0.342480 0.254667
12.800000 1.593309 2.721105 0.557260 -0.800228 -0.333697 0.260138
12.833333 1.566581 2.710615 0.574334 -0.804662 -0.326268 0.248450
12.866667 1.539561 2.700188 0.584537 -0.808422 -0.320074 0.219967
12.900000 1.512263 2.689823 0.590475 -0.811465 -0.314958 0.176961
12.933333 1.484706 2.679524 0.600169 -0.813806 -0.310593 0.121668
12.966667 1.456906 2.669291 0.605851 -0.815537 -0.306651 0.057136
13.000000 1.429661 2.659118 0.614333 -0.816932 -0.302848 -0.007512
13.033333 1.402206 2.649015 0.607138 -0.818247 -0.298889 -0.066573
13.066667 1.374983 2.638891 0.608186 -0.819733 -0.294592 -0.116046
13.100000 1.348020 2.628831 0.594737 -0.821619 -0.289807 -0.151171
13.133333 1.321189 2.618950 0.570169 -0.824140 -0.284514 -0.169106
13.166667 1.294353 2.609323 0.561553 -0.827517 -0.278702 -0.167991
13.200000 1.267060 2.600009 0.552989 -0.831712 -0.272467 -0.151284
13.233333 1.239286 2.590958 0.530278 -0.836652 -0.265943 -0.119435
13.266667 1.211379 2.582367 0.535095 -0.842126 -0.259358 -0.077089
13.300000 1.183386 2.573855 0.527107 -0.847879 -0.252929 -0.028819
13.333333 1.154769 2.565765 0.539518 -0.853535 -0.246926 0.019232
13.366667 1.126097 2.557754 0.539188 -0.858669 -0.241601 0.063865
13.400000 1.096981 2.550057 0.552623 -0.862986 -0.237153 0.102806
13.433333 1.067842 2.542437 0.559834 -0.866262 -0.233777 0.131697
13.466667 1.038497 2.535027 0.569185 -0.868350 -0.231579 0.153889
13.500000 1.009027 2.527742 0.573722 -0.869097 -0.230720 0.167952
13.533333 0.979584 2.520531 0.577544 -0.868481 -0.231241 0.177214
13.566667 0.950360 2.513207 0.588860 -0.866502 -0.233226 0.181719
13.600000 0.921465 2.505603 0.581477 -0.863223 -0.236704 0.184228
13.633333 0.892646 2.498071 0.588603 -0.858680 -0.241655 0.185760
13.666667 0.863888 2.489952 0.599989 -0.852960 -0.247933 0.182939
13.700000 0.835238 2.481904 0.601255 -0.846193 -0.255290 0.177877
13.733333 0.806714 2.473928 0.608233 -0.838456 -0.263451 0.168216
13.766667 0.778595 2.465335 0.624365 -0.829858 -0.272022 0.154295
13.800000 0.750918 2.456187 0.637115 -0.820363 -0.280603 0.131465
13.833333 0.723824 2.446507 0.634064 -0.809931 -0.288699 0.099669
13.866667 0.696869 2.436258 0.641859 -0.798486 -0.295936 0.061076
13.900000 0.670326 2.425533 0.643751 -0.786030 -0.301937 0.013899
13.933333 0.643996 2.414891 0.644184 -0.772444 -0.306311 -0.040223
13.966667 0.618258 2.403952 0.647348 -0.757593 -0.308783 -0.100101
14.000000 0.592761 2.393102 0.637240 -0.741499 -0.309217 -0.159812
14.033333 0.568146 2.382276 0.633550 -0.724291 -0.307681 -0.217046
14.066667 0.543795 2.371549 0.621208 -0.705918 -0.304222 -0.268621
14.100000 0.519720 2.360923 0.620961 -0.686241 -0.298986 -0.311603
14.133333 0.497019 2.350770 0.600014 -0.665266 -0.292217 -0.342217
14.166667 0.475530 2.341183 0.579425 -0.643039 -0.284204 -0.358456
14.200000 0.454348 2.331709 0.566878 -0.619541 -0.275154 -0.362258
14.233333 0.433480 2.322351 0.544972 -0.594605 -0.265201 -0.352064
14.266667 0.414436 2.313927 0.522491 -0.568563 -0.254646 -0.331146
14.300000 0.395722 2.305623 0.516580 -0.541765 -0.243745 -0.299616
14.333333 0.377344 2.297442 0.502335 -0.514500 -0.232727 -0.261753
14.366667 0.359308 2.289384 0.495240 -0.486812 -0.221673 -0.221803
14.400000 0.343866 2.282380 0.501907 -0.458838 -0.210708 -0.180929
14.433333 0.328776 2.275502 0.494218 -0.430763 -0.199952 -0.142948
14.466667 0.316388 2.269621 0.492073 -0.402492 -0.189377 -0.108894
14.500000 0.304354 2.263867 0.493799 -0.373898 -0.178954 -0.080578
14.533333 0.292674 2.258240 0.483406 -0.345037 -0.168706 -0.056012
14.566667 0.281347 2.252738 0.490948 -0.316302 -0.158790 -0.031560
14.600000 0.270372 2.247362 0.487548 -0.287907 -0.149274 -0.004341
14.633333 0.259748 2.242111 0.489234 -0.260064 -0.140225 0.027553
14.666667 0.251255 2.237509 0.484129 -0.232973 -0.131709 0.066589
14.700000 0.244558 2.233517 0.479810 -0.207048 -0.123854 0.113798
14.733333 0.239381 2.230031 0.480943 -0.182668 -0.116763 0.166147
14.766667 0.234540 2.226664 0.489774 -0.160098 -0.110477 0.219296
14.800000 0.230553 2.223488 0.494365 -0.139736 -0.105086 0.268579
14.833333 0.227232 2.220437 0.496994 -0.122006 -0.100683 0.309677
14.866667 0.224321 2.217431 0.509933 -0.107155 -0.097288 0.337665
14.900000 0.221513 2.214330 0.544346 -0.095131 -0.094787 0.345626
14.933333 0.219002 2.211336 0.562297 -0.085674 -0.093007 0.333348
14.966667 0.216780 2.208447 0.590472 -0.078519 -0.091763 0.301217
15.000000 0.214625 2.205400 0.609350 -0.073293 -0.090838 0.251602
15.033333 0.212295 2.202242 0.611631 -0.069592 -0.090003 0.189336
