t x y theta dxdt dydt dthetadt
0.000000 0.000000 0.000000 0.156939 -0.006001 -0.003830 0.000657
0.033333 -0.000131 -0.000125 0.160182 -0.006236 -0.008109 -0.002802
0.066667 -0.000115 -0.000591 0.159904 -0.006659 -0.013684 -0.008106
0.100000 0.000055 -0.001410 0.151891 -0.007471 -0.020969 -0.015953
0.133333 -0.000251 -0.001674 0.148034 -0.008860 -0.030334 -0.028090
0.166667 -0.000393 -0.002314 0.158502 -0.010993 -0.042188 -0.048065
0.200000 -0.000363 -0.003341 0.154952 -0.013938 -0.056746 -0.074798
0.233333 -0.000966 -0.004568 0.155633 -0.017756 -0.074511 -0.104732
0.266667 -0.001385 -0.006206 0.155540 -0.022369 -0.095882 -0.134214
0.300000 -0.001612 -0.008265 0.161732 -0.027535 -0.120897 -0.163298
0.333333 -0.002559 -0.011420 0.151291 -0.032965 -0.149540 -0.187167
0.366667 -0.003299 -0.015019 0.136423 -0.038369 -0.181789 -0.202798
0.400000 -0.004806 -0.021086 0.115651 -0.043452 -0.217509 -0.205266
0.433333 -0.007259 -0.029923 0.117540 -0.047795 -0.255874 -0.195784
0.466667 -0.009477 -0.039228 0.087621 -0.050636 -0.295705 -0.177393
0.500000 -0.011450 -0.049006 0.087807 -0.050985 -0.335780 -0.148917
0.533333 -0.013166 -0.059262 0.071572 -0.047744 -0.374497 -0.109074
0.566667 -0.015586 -0.072752 0.063520 -0.039741 -0.410023 -0.058181
0.600000 -0.018282 -0.089141 0.082283 -0.025928 -0.440666 -0.009041
0.633333 -0.020688 -0.106014 0.094521 -0.005326 -0.464999 0.035301
0.666667 -0.022108 -0.124582 0.094396 0.022286 -0.481682 0.067577
0.700000 -0.023215 -0.143630 0.082580 0.056410 -0.489646 0.080070
0.733333 -0.023999 -0.163153 0.112505 0.095924 -0.488484 0.054512
0.766667 -0.024449 -0.183148 0.100476 0.139413 -0.478165 -0.013625
0.800000 -0.020569 -0.202186 0.092256 0.184997 -0.458961 -0.115948
0.833333 -0.012369 -0.218920 0.108769 0.230169 -0.431916 -0.245964
0.866667 0.000031 -0.231727 0.154588 0.272468 -0.399038 -0.396064
0.900000 0.012776 -0.245002 0.159142 0.309863 -0.362509 -0.554150
0.933333 0.025861 -0.258751 0.138334 0.340841 -0.324513 -0.698517
0.966667 0.041025 -0.268563 0.094920 0.364071 -0.287753 -0.825057
1.000000 0.056720 -0.275760 0.032136 0.379172 -0.254869 -0.931135
1.033333 0.072177 -0.281086 -0.045678 0.386702 -0.228352 -1.015192
1.066667 0.086610 -0.285403 -0.121185 0.388032 -0.209739 -1.070484
1.100000 0.099906 -0.289155 -0.165395 0.384621 -0.200452 -1.101171
1.133333 0.112037 -0.292722 -0.202719 0.378003 -0.201612 -1.112031
1.166667 0.123310 -0.296695 -0.205683 0.369852 -0.213736 -1.098653
1.200000 0.134312 -0.301135 -0.215582 0.361471 -0.236879 -1.059029
1.233333 0.145624 -0.306178 -0.214165 0.353885 -0.269991 -0.993345
1.266667 0.156871 -0.313193 -0.247431 0.347493 -0.312375 -0.899286
1.300000 0.168403 -0.323146 -0.318518 0.342453 -0.363260 -0.764543
1.333333 0.180250 -0.333747 -0.368324 0.338694 -0.422196 -0.579685
1.366667 0.190948 -0.350486 -0.410735 0.336236 -0.487886 -0.336593
1.400000 0.201966 -0.367890 -0.454068 0.334982 -0.559513 -0.031388
1.433333 0.213304 -0.385967 -0.488497 0.334760 -0.636908 0.337867
1.466667 0.224964 -0.404720 -0.502638 0.335567 -0.719504 0.759283
1.500000 0.235318 -0.431418 -0.475838 0.337656 -0.805975 1.208858
1.533333 0.246003 -0.458794 -0.406560 0.341301 -0.894371 1.653663
1.566667 0.257022 -0.486843 -0.317124 0.346410 -0.983681 2.056798
1.600000 0.267633 -0.520027 -0.202519 0.352921 -1.072087 2.380767
1.633333 0.278584 -0.557600 -0.103204 0.360771 -1.157462 2.596462
1.666667 0.290464 -0.599912 0.018977 0.369815 -1.237600 2.686585
1.700000 0.303195 -0.646395 0.161207 0.379882 -1.311599 2.647887
1.733333 0.316269 -0.696466 0.309780 0.391146 -1.378857 2.497818
1.766667 0.329702 -0.747113 0.439255 0.404264 -1.438793 2.264237
1.800000 0.343497 -0.798307 0.545988 0.420168 -1.491660 1.985427
1.833333 0.357656 -0.850022 0.615811 0.440051 -1.538256 1.694105
1.866667 0.372181 -0.902228 0.610714 0.465502 -1.579975 1.424545
1.900000 0.387072 -0.954898 0.596888 0.497748 -1.617671 1.205791
1.933333 0.401375 -1.008675 0.566144 0.537494 -1.652244 1.056474
1.966667 0.416049 -1.062856 0.555985 0.584791 -1.684240 0.981500
2.000000 0.431095 -1.117413 0.564443 0.639478 -1.713978 0.971923
2.033333 0.449968 -1.175481 0.583346 0.700567 -1.741370 1.014412
2.066667 0.472770 -1.236270 0.620572 0.766110 -1.765975 1.087100
2.100000 0.499814 -1.299454 0.693194 0.834162 -1.787153 1.161686
2.133333 0.530101 -1.362201 0.776722 0.902673 -1.804390 1.210550
2.166667 0.563937 -1.424134 0.856288 0.969636 -1.817403 1.212989
2.200000 0.601727 -1.485111 0.914178 1.032341 -1.825947 1.161346
2.233333 0.639821 -1.546200 0.959175 1.088923 -1.830228 1.059295
2.266667 0.678197 -1.607363 1.003701 1.138356 -1.830811 0.908192
2.300000 0.716832 -1.668564 1.041967 1.179997 -1.828638 0.725123
2.333333 0.759248 -1.729453 1.042022 1.213474 -1.824513 0.525247
2.366667 0.801876 -1.790304 1.029892 1.238978 -1.819142 0.327800
2.400000 0.844689 -1.851081 1.044418 1.257400 -1.813040 0.142943
2.433333 0.888648 -1.911857 1.018412 1.269268 -1.806448 -0.027293
2.466667 0.932738 -1.972483 1.032372 1.274599 -1.799309 -0.173508
2.500000 0.976827 -2.032515 1.017219 1.273397 -1.791358 -0.296996
2.533333 1.020331 -2.091675 0.989611 1.266080 -1.782385 -0.396958
2.566667 1.063885 -2.150577 1.006897 1.252266 -1.772088 -0.484632
2.600000 1.106704 -2.209725 0.959306 1.231923 -1.760336 -0.558299
2.633333 1.148235 -2.268996 0.946522 1.205296 -1.746982 -0.621719
2.666667 1.189741 -2.327902 0.914087 1.173273 -1.731940 -0.673619
2.700000 1.231198 -2.386408 0.894918 1.136624 -1.715094 -0.716439
2.733333 1.268757 -2.443394 0.868788 1.095472 -1.696079 -0.756114
2.766667 1.306223 -2.499912 0.842753 1.051005 -1.674824 -0.785430
2.800000 1.339381 -2.555835 0.807990 1.003809 -1.651036 -0.810783
2.833333 1.372411 -2.611223 0.773848 0.954178 -1.624493 -0.829671
2.866667 1.405299 -2.666042 0.760398 0.902057 -1.594963 -0.849260
2.900000 1.431672 -2.718502 0.723472 0.847932 -1.562401 -0.869237
2.933333 1.457881 -2.770333 0.700693 0.792405 -1.526556 -0.888721
2.966667 1.483917 -2.821504 0.670448 0.735545 -1.487029 -0.910236
3.000000 1.509775 -2.871984 0.647967 0.677491 -1.443129 -0.934639
3.033333 1.535447 -2.921745 0.612561 0.618487 -1.394129 -0.962392
3.066667 1.554166 -2.967649 0.576048 0.559122 -1.338786 -0.989229
3.100000 1.572693 -3.012781 0.535188 0.498929 -1.275572 -1.014591
3.133333 1.584925 -3.054352 0.513942 0.438568 -1.204230 -1.037532
3.166667 1.596972 -3.095106 0.474940 0.378699 -1.124511 -1.058547
3.200000 1.608843 -3.135024 0.444129 0.320460 -1.037356 -1.075085
3.233333 1.620545 -3.174085 0.397482 0.265137 -0.943157 -1.085771
3.266667 1.626893 -3.205063 0.350332 0.213758 -0.843958 -1.090084
3.300000 1.633092 -3.235154 0.314373 0.168329 -0.741739 -1.085492
3.333333 1.635346 -3.255924 0.283834 0.129722 -0.638127 -1.066285
3.366667 1.637480 -3.275796 0.250612 0.098799 -0.534747 -1.029634
3.400000 1.636904 -3.285422 0.220631 0.076316 -0.433302 -0.973527
3.433333 1.636245 -3.294160 0.183264 0.063257 -0.336651 -0.900858
3.466667 1.635525 -3.302020 0.135009 0.060496 -0.246034 -0.814900
3.500000 1.634766 -3.309012 0.093465 0.068304 -0.163280 -0.722109
3.533333 1.633989 -3.315148 0.063633 0.087035 -0.089282 -0.631052
3.566667 1.635053 -3.313793 0.042726 0.116879 -0.025478 -0.546587
3.600000 1.636138 -3.311611 0.032228 0.157636 0.027931 -0.474521
3.633333 1.642737 -3.306101 0.043386 0.207706 0.071201 -0.414950
3.666667 1.649389 -3.299805 0.051704 0.265085 0.103863 -0.371512
3.700000 1.656108 -3.292748 0.053061 0.327586 0.126018 -0.341769
3.733333 1.662906 -3.284952 0.057252 0.392725 0.137328 -0.323433
3.766667 1.676308 -3.277046 0.034444 0.457777 0.138627 -0.312814
3.800000 1.694865 -3.269757 0.013681 0.519704 0.130749 -0.303923
3.833333 1.717323 -3.263875 -0.014589 0.576608 0.115080 -0.288692
3.866667 1.742552 -3.260316 -0.042498 0.626759 0.093855 -0.248519
3.900000 1.767873 -3.256122 -0.050006 0.668755 0.069139 -0.170680
3.933333 1.793952 -3.255283 -0.062824 0.701688 0.043567 -0.038148
3.966667 1.820110 -3.253839 -0.049439 0.725137 0.019465 0.165395
4.000000 1.846539 -3.256019 -0.066439 0.739303 -0.000673 0.454121
4.033333 1.873034 -3.257619 -0.056406 0.744419 -0.014504 0.828715
4.066667 1.897635 -3.261536 -0.059764 0.741352 -0.020299 1.276528
4.100000 1.922288 -3.264892 -0.046070 0.730979 -0.016339 1.777605
4.133333 1.946986 -3.267697 -0.033768 0.714132 -0.001816 2.302971
4.166667 1.971723 -3.269957 0.024646 0.692600 0.023625 2.810356
4.200000 1.996493 -3.271683 0.141856 0.668332 0.058998 3.257056
4.233333 2.021288 -3.272881 0.291097 0.644026 0.102620 3.610059
4.266667 2.046102 -3.273561 0.465593 0.621827 0.152573 3.841718
4.300000 2.065454 -3.269563 0.734399 0.604339 0.206580 3.932412
4.333333 2.081557 -3.260653 0.955917 0.594376 0.262327 3.873963
4.366667 2.095862 -3.246367 1.145298 0.594004 0.316786 3.673881
4.400000 2.110179 -3.231631 1.305724 0.604995 0.367647 3.346498
4.433333 2.124513 -3.216470 1.384763 0.627441 0.413098 2.915716
4.466667 2.138866 -3.200908 1.431546 0.662061 0.451093 2.412241
4.500000 2.160216 -3.182549 1.457071 0.708071 0.480086 1.877233
4.533333 2.181585 -3.163839 1.505794 0.764129 0.499280 1.342827
4.566667 2.212066 -3.145285 1.530917 0.826950 0.509440 0.836516
4.600000 2.242549 -3.126430 1.556072 0.893236 0.511339 0.380608
4.633333 2.273018 -3.107299 1.563392 0.960569 0.505312 -0.016731
4.666667 2.303459 -3.087920 1.568405 1.025597 0.492316 -0.355534
4.700000 2.342610 -3.071294 1.526719 1.085829 0.473336 -0.642343
4.733333 2.381696 -3.054466 1.483625 1.139047 0.448990 -0.881715
4.766667 2.420693 -3.037461 1.421911 1.185298 0.418991 -1.073579
4.800000 2.465313 -3.026027 1.374709 1.223989 0.383387 -1.222819
4.833333 2.509792 -3.014454 1.305811 1.254055 0.342921 -1.327540
4.866667 2.554100 -3.002758 1.272696 1.274868 0.298534 -1.389334
4.900000 2.598208 -2.990957 1.198474 1.286536 0.251011 -1.411540
4.933333 2.642084 -2.979067 1.152766 1.288925 0.201155 -1.399990
4.966667 2.687151 -2.971994 1.100700 1.281029 0.150614 -1.365867
5.000000 2.732257 -2.968915 1.066679 1.263129 0.100707 -1.314535
5.033333 2.776633 -2.969191 1.019137 1.235810 0.053037 -1.257404
5.066667 2.820658 -2.969416 0.974182 1.199353 0.009053 -1.195612
5.100000 2.862638 -2.971719 0.945707 1.153854 -0.029588 -1.136676
5.133333 2.902127 -2.975716 0.901675 1.099830 -0.060908 -1.081057
5.166667 2.938396 -2.981215 0.877515 1.038476 -0.083648 -1.031996
5.200000 2.974206 -2.986665 0.841201 0.970231 -0.096674 -0.990908
5.233333 3.006932 -2.992490 0.809628 0.896014 -0.099625 -0.955096
5.266667 3.036148 -2.998034 0.772056 0.817689 -0.092539 -0.926599
5.300000 3.061489 -3.003067 0.751606 0.736881 -0.075807 -0.903367
5.333333 3.086297 -3.008042 0.730422 0.655163 -0.050532 -0.887118
5.366667 3.106682 -3.011172 0.694817 0.574011 -0.018237 -0.874409
5.400000 3.122407 -3.012003 0.668859 0.495580 0.019165 -0.866169
5.433333 3.137575 -3.012775 0.641328 0.421472 0.059720 -0.865083
5.466667 3.148986 -3.010842 0.609890 0.352701 0.101315 -0.872703
5.500000 3.157168 -3.006139 0.576835 0.290091 0.141520 -0.886744
5.533333 3.162771 -2.998673 0.546046 0.234520 0.178025 -0.904728
5.566667 3.166773 -2.988783 0.525979 0.186311 0.208981 -0.926357
5.600000 3.170232 -2.978869 0.505117 0.144876 0.233298 -0.947991
5.633333 3.172851 -2.967892 0.468509 0.109775 0.250041 -0.964915
5.666667 3.175030 -2.956799 0.443784 0.080288 0.259019 -0.974414
5.700000 3.176690 -2.945721 0.400061 0.055777 0.260656 -0.975140
5.733333 3.178135 -2.935609 0.361176 0.035245 0.255927 -0.966996
5.766667 3.179081 -2.925534 0.312506 0.018133 0.245809 -0.946059
5.800000 3.179457 -2.917451 0.276854 0.004537 0.230930 -0.912086
5.833333 3.178886 -2.911417 0.237969 -0.005467 0.212266 -0.862931
5.866667 3.177847 -2.905449 0.217251 -0.011331 0.190287 -0.797892
5.900000 3.176353 -2.899553 0.193392 -0.012628 0.165457 -0.718600
5.933333 3.174413 -2.893737 0.184850 -0.008715 0.137877 -0.627998
5.966667 3.172040 -2.888006 0.151034 0.000442 0.108077 -0.532089
6.000000 3.169245 -2.882367 0.133751 0.014293 0.076764 -0.437097
6.033333 3.168476 -2.879532 0.110710 0.031739 0.044739 -0.350330
6.066667 3.167308 -2.876798 0.096651 0.051272 0.013092 -0.276479
6.100000 3.169281 -2.877205 0.095611 0.070742 -0.016565 -0.218361
6.133333 3.174267 -2.880704 0.100442 0.087680 -0.042325 -0.174150
6.166667 3.178874 -2.884300 0.114017 0.100116 -0.062776 -0.145730
6.200000 3.185485 -2.889770 0.120837 0.106050 -0.076243 -0.128013
6.233333 3.193004 -2.896102 0.124578 0.104398 -0.081852 -0.118490
6.266667 3.200201 -2.902338 0.120328 0.094286 -0.078951 -0.112176
6.300000 3.205795 -2.907218 0.113500 0.076313 -0.068432 -0.105998
6.333333 3.211010 -2.912166 0.090203 0.051649 -0.051918 -0.098156
6.366667 3.212403 -2.913723 0.081571 0.021658 -0.031204 -0.082515
6.400000 3.213421 -2.915343 0.058876 -0.011742 -0.009121 -0.058472
6.433333 3.210031 -2.912612 0.058532 -0.046565 0.011515 -0.024393
6.466667 3.206279 -2.909945 0.069044 -0.080832 0.028010 0.016537
6.500000 3.202174 -2.907347 0.066352 -0.113381 0.038764 0.062827
6.533333 3.196171 -2.902298 0.081708 -0.143410 0.042573 0.108856
6.566667 3.189835 -2.897325 0.091930 -0.170877 0.038757 0.149759
6.600000 3.183283 -2.892969 0.102692 -0.196063 0.027622 0.179571
6.633333 3.176302 -2.890081 0.106515 -0.220236 0.010384 0.194214
6.666667 3.168956 -2.890099 0.111899 -0.244842 -0.011557 0.194646
6.700000 3.161325 -2.890205 0.117361 -0.271234 -0.037032 0.181227
6.733333 3.152132 -2.894174 0.124999 -0.300479 -0.064132 0.156927
6.766667 3.142683 -2.898227 0.142791 -0.333140 -0.091120 0.124215
6.800000 3.132991 -2.902359 0.153766 -0.369574 -0.116564 0.087848
6.833333 3.123071 -2.906567 0.153788 -0.409491 -0.139618 0.051481
6.866667 3.110280 -2.912257 0.153352 -0.452066 -0.159799 0.013575
6.900000 3.095128 -2.918732 0.149674 -0.496414 -0.176591 -0.024689
6.933333 3.077376 -2.925943 0.140966 -0.541821 -0.190398 -0.061343
6.966667 3.056942 -2.933319 0.125657 -0.587252 -0.201679 -0.095583
7.000000 3.034108 -2.940734 0.128451 -0.631364 -0.210881 -0.128099
7.033333 3.011173 -2.948185 0.133005 -0.672833 -0.218339 -0.160183
7.066667 2.988163 -2.955665 0.116012 -0.710840 -0.224375 -0.187309
7.100000 2.963365 -2.963204 0.121544 -0.744547 -0.229379 -0.211662
7.133333 2.937178 -2.970954 0.120335 -0.773164 -0.233491 -0.234715
7.166667 2.909917 -2.978747 0.107817 -0.795460 -0.236759 -0.257250
7.200000 2.881967 -2.986636 0.083260 -0.810847 -0.239224 -0.280017
7.233333 2.852651 -2.994806 0.089231 -0.817670 -0.240801 -0.304491
7.266667 2.822634 -3.003146 0.070661 -0.814052 -0.241279 -0.335321
7.300000 2.792711 -3.011553 0.054402 -0.798354 -0.240410 -0.371701
7.333333 2.764221 -3.019997 0.043987 -0.769151 -0.237934 -0.410458
7.366667 2.735946 -3.028390 0.027127 -0.726041 -0.233487 -0.448019
7.400000 2.707919 -3.036723 0.018758 -0.668467 -0.226731 -0.476332
7.433333 2.680171 -3.044985 0.018297 -0.597681 -0.217193 -0.487336
7.466667 2.652735 -3.053167 0.004306 -0.515088 -0.204437 -0.474913
7.500000 2.636637 -3.060105 -0.007214 -0.422472 -0.187673 -0.435750
7.533333 2.620903 -3.066940 -0.055029 -0.321306 -0.166115 -0.370492
7.566667 2.618129 -3.072377 -0.097040 -0.214438 -0.139170 -0.282904
7.600000 2.615743 -3.077692 -0.130028 -0.104659 -0.106245 -0.183999
7.633333 2.613749 -3.082880 -0.158257 0.005319 -0.067421 -0.078839
7.666667 2.612152 -3.087934 -0.146276 0.112853 -0.022773 0.024069
7.700000 2.620503 -3.089219 -0.117339 0.215519 0.026587 0.117210
7.733333 2.629247 -3.090358 -0.062387 0.310828 0.079646 0.189452
7.766667 2.644884 -3.086541 -0.040651 0.398112 0.134660 0.234872
7.800000 2.660890 -3.082577 -0.018688 0.476710 0.189878 0.252753
7.833333 2.682182 -3.072891 -0.008415 0.545973 0.243380 0.238743
7.866667 2.703807 -3.063069 -0.006390 0.605088 0.293087 0.197045
7.900000 2.728956 -3.048034 -0.002971 0.654074 0.337474 0.133411
7.933333 2.754390 -3.032888 -0.018234 0.692680 0.374607 0.062557
7.966667 2.780085 -3.017644 -0.014817 0.720760 0.403440 -0.008135
8.000000 2.806015 -3.002319 -0.018597 0.737976 0.422710 -0.069925
8.033333 2.832155 -2.986928 -0.024283 0.744957 0.432084 -0.118072
8.066667 2.858834 -2.970274 -0.025635 0.742657 0.431461 -0.150163
8.100000 2.885671 -2.953586 -0.029905 0.731690 0.421119 -0.165127
8.133333 2.912640 -2.936881 -0.044438 0.713079 0.401737 -0.167732
8.166667 2.938114 -2.921449 -0.045263 0.687874 0.374181 -0.159110
8.200000 2.961604 -2.907966 -0.060302 0.657617 0.339894 -0.143720
8.233333 2.985155 -2.894513 -0.078884 0.623576 0.300197 -0.121729
8.266667 3.006114 -2.883640 -0.080019 0.586934 0.256682 -0.095506
8.300000 3.024518 -2.875680 -0.085452 0.549006 0.211110 -0.067982
8.333333 3.040495 -2.870482 -0.075061 0.511224 0.165532 -0.043180
8.366667 3.054860 -2.868029 -0.077696 0.474476 0.121847 -0.018907
8.400000 3.069203 -2.865647 -0.068480 0.439074 0.081572 0.004028
8.433333 3.082410 -2.865457 -0.069247 0.405284 0.046174 0.023765
8.466667 3.094767 -2.866966 -0.056465 0.373263 0.016751 0.037925
8.500000 3.107071 -2.868544 -0.062549 0.342590 -0.006238 0.048314
8.533333 3.118187 -2.870774 -0.066268 0.312428 -0.022876 0.058972
8.566667 3.129229 -2.873067 -0.069651 0.282197 -0.033747 0.065667
8.600000 3.137839 -2.875314 -0.061003 0.252025 -0.039475 0.069228
8.633333 3.146359 -2.877620 -0.072626 0.221852 -0.041040 0.070010
8.666667 3.154784 -2.879979 -0.069987 0.191710 -0.039566 0.072102
8.700000 3.160751 -2.881459 -0.047976 0.162153 -0.036044 0.072271
8.733333 3.164032 -2.882179 -0.040002 0.134038 -0.031403 0.068071
8.766667 3.167205 -2.882947 -0.035746 0.108178 -0.026263 0.060653
8.800000 3.169076 -2.883240 -0.042524 0.084875 -0.021203 0.051678
8.833333 3.170189 -2.883345 -0.042795 0.064576 -0.016647 0.041272
8.866667 3.170766 -2.883468 -0.040862 0.047739 -0.012827 0.027471
8.900000 3.171238 -2.883636 -0.040490 0.034365 -0.009833 0.013697
8.933333 3.171607 -2.883846 -0.035685 0.024082 -0.007584 0.002263
8.966667 3.171877 -2.884097 -0.048202 0.016482 -0.006006 -0.004838
9.000000 3.172048 -2.884388 -0.045414 0.011165 -0.004931 -0.010935
9.033333 3.172160 -2.884540 -0.044356 0.007616 -0.004171 -0.015125
9.066667 3.172206 -2.884636 -0.046702 0.005228 -0.003561 -0.015925
