t x y theta dxdt dydt dthetadt
0.000000 0.000000 0.000000 -1.884759 0.016505 0.015863 -0.004715
0.033333 0.000855 0.000901 -1.886804 0.018087 0.017540 -0.005760
0.066667 0.001601 0.001639 -1.886161 0.020581 0.020681 -0.007274
0.100000 0.002231 0.002206 -1.890510 0.024692 0.026331 -0.007709
0.133333 0.002741 0.002596 -1.896957 0.031064 0.035425 -0.005460
0.166667 0.003125 0.002800 -1.895309 0.040151 0.048675 0.001850
0.200000 0.003378 0.002812 -1.884796 0.052493 0.066938 0.015433
0.233333 0.003495 0.002623 -1.886901 0.068146 0.090509 0.037549
0.266667 0.004631 0.004103 -1.888242 0.086704 0.118986 0.069729
0.300000 0.007122 0.007334 -1.890689 0.107312 0.151297 0.113162
0.333333 0.009457 0.010338 -1.892131 0.128935 0.186041 0.168740
0.366667 0.013731 0.016156 -1.901338 0.150455 0.221665 0.238302
0.400000 0.020017 0.024924 -1.887283 0.170535 0.256209 0.327463
0.433333 0.028024 0.036431 -1.879862 0.188019 0.287751 0.440154
0.466667 0.037492 0.050542 -1.869867 0.201990 0.314710 0.581701
0.500000 0.046745 0.064339 -1.832132 0.211944 0.336090 0.752205
0.533333 0.055719 0.078339 -1.818940 0.217190 0.350310 0.951528
0.566667 0.063458 0.091771 -1.803731 0.217202 0.355687 1.173356
0.600000 0.070937 0.104817 -1.775973 0.211823 0.351125 1.411359
0.633333 0.078140 0.117454 -1.737018 0.200972 0.335642 1.656799
0.666667 0.085054 0.129658 -1.690665 0.184633 0.308302 1.897418
0.700000 0.091664 0.141406 -1.605132 0.162547 0.267780 2.123237
0.733333 0.097957 0.152676 -1.513019 0.134979 0.214223 2.321674
0.766667 0.103918 0.163447 -1.416631 0.102397 0.148783 2.483098
0.800000 0.109536 0.173695 -1.297934 0.064952 0.072258 2.592351
0.833333 0.114795 0.183400 -1.187949 0.022968 -0.014026 2.640253
0.866667 0.115650 0.183114 -1.097275 -0.022784 -0.107603 2.622166
0.900000 0.112905 0.174612 -1.004431 -0.071250 -0.204950 2.538868
0.933333 0.109775 0.165533 -0.899199 -0.121621 -0.303001 2.395258
0.966667 0.104306 0.151291 -0.804493 -0.173111 -0.398926 2.197786
1.000000 0.096977 0.132956 -0.716906 -0.224671 -0.489400 1.960376
1.033333 0.087785 0.111215 -0.648050 -0.275415 -0.571200 1.696479
1.066667 0.076439 0.086509 -0.599732 -0.325264 -0.642835 1.418536
1.100000 0.064707 0.061264 -0.558395 -0.374332 -0.704212 1.136611
1.133333 0.050922 0.034361 -0.544698 -0.422440 -0.755333 0.863364
1.166667 0.036762 0.006950 -0.522339 -0.469819 -0.797035 0.608602
1.200000 0.022234 -0.020951 -0.513564 -0.516807 -0.830872 0.382643
1.233333 0.004534 -0.050079 -0.516986 -0.563556 -0.858979 0.192299
1.266667 -0.016058 -0.080022 -0.518026 -0.609644 -0.882963 0.040472
1.300000 -0.036986 -0.110401 -0.533664 -0.654621 -0.903958 -0.068052
1.333333 -0.059935 -0.141018 -0.566470 -0.698140 -0.923255 -0.135048
1.366667 -0.084649 -0.171432 -0.567193 -0.739398 -0.941701 -0.160337
1.400000 -0.111581 -0.202948 -0.574633 -0.777455 -0.959776 -0.151376
1.433333 -0.138781 -0.234820 -0.588358 -0.811738 -0.977677 -0.116088
1.466667 -0.167696 -0.267526 -0.591519 -0.841995 -0.995480 -0.059335
1.500000 -0.197882 -0.301209 -0.617081 -0.867885 -1.013008 0.009918
1.533333 -0.228269 -0.335185 -0.620297 -0.889335 -1.030001 0.082540
1.566667 -0.259436 -0.370166 -0.593505 -0.906559 -1.046094 0.150449
1.600000 -0.290757 -0.405393 -0.589337 -0.919838 -1.061048 0.211475
1.633333 -0.322249 -0.442021 -0.561396 -0.928971 -1.074483 0.257805
1.666667 -0.353845 -0.478848 -0.542950 -0.933439 -1.085937 0.285382
1.700000 -0.385521 -0.515847 -0.527014 -0.932488 -1.094975 0.288715
1.733333 -0.417249 -0.552994 -0.527547 -0.925229 -1.101179 0.268611
1.766667 -0.449007 -0.590262 -0.506317 -0.910759 -1.104306 0.224245
1.800000 -0.480768 -0.627627 -0.501659 -0.888107 -1.103939 0.153191
1.833333 -0.512507 -0.665063 -0.492589 -0.856539 -1.099866 0.064699
1.866667 -0.544199 -0.702542 -0.486007 -0.815915 -1.092102 -0.036636
1.900000 -0.575819 -0.740040 -0.474970 -0.766539 -1.080861 -0.145358
1.933333 -0.604261 -0.777582 -0.471016 -0.708980 -1.066357 -0.259589
1.966667 -0.628966 -0.814583 -0.497156 -0.643917 -1.048638 -0.371859
2.000000 -0.649310 -0.849916 -0.516949 -0.572976 -1.027964 -0.475304
2.033333 -0.664486 -0.882943 -0.541225 -0.498747 -1.004767 -0.569590
2.066667 -0.679505 -0.915867 -0.563739 -0.423701 -0.979298 -0.653887
2.100000 -0.694360 -0.948666 -0.600566 -0.350516 -0.951864 -0.724182
2.133333 -0.703921 -0.980046 -0.632350 -0.281783 -0.922893 -0.777467
2.166667 -0.708735 -1.010261 -0.655416 -0.220477 -0.893058 -0.816126
2.200000 -0.713381 -1.040292 -0.677979 -0.168460 -0.862949 -0.844242
2.233333 -0.714094 -1.068659 -0.716520 -0.126759 -0.832928 -0.860819
2.266667 -0.714650 -1.096804 -0.743807 -0.096155 -0.803496 -0.864822
2.300000 -0.713251 -1.122942 -0.780651 -0.077423 -0.775249 -0.854814
2.333333 -0.711562 -1.147105 -0.790759 -0.070953 -0.748877 -0.832207
2.366667 -0.710783 -1.170505 -0.821206 -0.076030 -0.725104 -0.794566
2.400000 -0.712589 -1.193019 -0.853824 -0.092041 -0.704689 -0.738098
2.433333 -0.714280 -1.215242 -0.901428 -0.117734 -0.688240 -0.664313
2.466667 -0.715865 -1.237160 -0.937608 -0.151884 -0.676462 -0.575235
2.500000 -0.721082 -1.258218 -0.952661 -0.192478 -0.669776 -0.479030
2.533333 -0.726200 -1.278948 -0.968386 -0.237468 -0.668074 -0.376913
2.566667 -0.734241 -1.299653 -0.975188 -0.284958 -0.670825 -0.277181
2.600000 -0.744810 -1.320428 -0.981112 -0.333451 -0.677492 -0.186322
2.633333 -0.757280 -1.341687 -0.972705 -0.381846 -0.687612 -0.109102
2.666667 -0.772203 -1.364620 -0.977280 -0.428635 -0.700184 -0.047038
2.700000 -0.789757 -1.389239 -0.951804 -0.472758 -0.713962 0.003323
2.733333 -0.807179 -1.413453 -0.934894 -0.513451 -0.727960 0.040850
2.766667 -0.824457 -1.437246 -0.930983 -0.550598 -0.741460 0.067655
2.800000 -0.844595 -1.463320 -0.938622 -0.583707 -0.753370 0.086632
2.833333 -0.866541 -1.490232 -0.950382 -0.612470 -0.762560 0.098595
2.866667 -0.888296 -1.516667 -0.965213 -0.637086 -0.768355 0.104590
2.900000 -0.909841 -1.542605 -0.967777 -0.657931 -0.770552 0.103031
2.933333 -0.933202 -1.569634 -0.959312 -0.674952 -0.768785 0.095541
2.966667 -0.956315 -1.596125 -0.936817 -0.687672 -0.762505 0.084575
3.000000 -0.980224 -1.622751 -0.923881 -0.695987 -0.751665 0.067577
3.033333 -1.004665 -1.648983 -0.895618 -0.699867 -0.736493 0.046239
3.066667 -1.029566 -1.674023 -0.896048 -0.699097 -0.717157 0.018263
3.100000 -1.054129 -1.698440 -0.914221 -0.693308 -0.693676 -0.011814
3.133333 -1.078332 -1.722214 -0.907878 -0.682812 -0.666549 -0.042854
3.166667 -1.102287 -1.744465 -0.933227 -0.667883 -0.636403 -0.071867
3.200000 -1.125835 -1.766035 -0.929018 -0.648725 -0.603756 -0.095270
3.233333 -1.148953 -1.786903 -0.948326 -0.625532 -0.568980 -0.106833
3.266667 -1.169989 -1.805481 -0.955974 -0.598446 -0.532248 -0.100289
3.300000 -1.188458 -1.821417 -0.952404 -0.567788 -0.493895 -0.077787
3.333333 -1.206434 -1.836603 -0.956588 -0.533459 -0.453878 -0.037806
3.366667 -1.223897 -1.851026 -0.949261 -0.495924 -0.412313 0.015227
3.400000 -1.240831 -1.864674 -0.956730 -0.455532 -0.369152 0.081533
3.433333 -1.257216 -1.877534 -0.956709 -0.412557 -0.324141 0.150570
3.466667 -1.273035 -1.889593 -0.951593 -0.367580 -0.277284 0.216448
3.500000 -1.283705 -1.897622 -0.956850 -0.321214 -0.228240 0.279787
3.533333 -1.293779 -1.904831 -0.957865 -0.274308 -0.176896 0.340160
3.566667 -1.303245 -1.911213 -0.930678 -0.227414 -0.122787 0.398298
3.600000 -1.308262 -1.913948 -0.896251 -0.181459 -0.065899 0.450140
3.633333 -1.312652 -1.915846 -0.865345 -0.137387 -0.006606 0.502786
3.666667 -1.315012 -1.915553 -0.837597 -0.096074 0.054707 0.555613
3.700000 -1.316115 -1.913470 -0.824299 -0.057835 0.117488 0.605359
3.733333 -1.316218 -1.909262 -0.822445 -0.022840 0.181264 0.646190
3.766667 -1.315576 -1.901911 -0.834993 0.008825 0.244944 0.682556
3.800000 -1.314285 -1.893724 -0.809374 0.037747 0.308011 0.716484
3.833333 -1.312348 -1.881147 -0.770712 0.064632 0.369871 0.740656
3.866667 -1.309755 -1.867748 -0.711756 0.090423 0.430157 0.754138
3.900000 -1.306391 -1.849765 -0.683946 0.115737 0.488121 0.753729
3.933333 -1.302368 -1.830985 -0.674390 0.141138 0.543071 0.740474
3.966667 -1.297683 -1.811424 -0.629925 0.167192 0.594776 0.703431
4.000000 -1.292336 -1.791095 -0.610697 0.194206 0.642746 0.644308
4.033333 -1.286097 -1.768496 -0.576055 0.222248 0.686905 0.569467
4.066667 -1.278526 -1.744188 -0.556202 0.251343 0.727023 0.484184
4.100000 -1.269606 -1.717727 -0.520069 0.281442 0.763428 0.393854
4.133333 -1.260026 -1.690573 -0.529195 0.312521 0.796430 0.302153
4.166667 -1.248485 -1.662407 -0.538658 0.344324 0.826233 0.220700
4.200000 -1.236290 -1.633591 -0.528459 0.376481 0.853110 0.151876
4.233333 -1.223444 -1.604148 -0.540285 0.408809 0.877235 0.097398
4.266667 -1.209951 -1.574101 -0.542167 0.441017 0.898770 0.053513
4.300000 -1.194766 -1.543439 -0.532258 0.472891 0.917709 0.018838
4.333333 -1.178197 -1.512572 -0.537168 0.504162 0.933969 -0.008971
4.366667 -1.161000 -1.481169 -0.535974 0.534923 0.947531 -0.039228
4.400000 -1.141644 -1.448835 -0.541819 0.565182 0.958285 -0.077685
4.433333 -1.121678 -1.416012 -0.541557 0.594903 0.966109 -0.127727
4.466667 -1.101111 -1.382725 -0.547442 0.624041 0.971049 -0.187450
4.500000 -1.079954 -1.348999 -0.535276 0.652653 0.973272 -0.254637
4.533333 -1.058004 -1.314816 -0.510017 0.680977 0.973149 -0.331120
4.566667 -1.035066 -1.281261 -0.520037 0.709001 0.971109 -0.407741
4.600000 -1.011096 -1.248623 -0.569579 0.736909 0.967727 -0.477341
4.633333 -0.985868 -1.216780 -0.608384 0.764779 0.963712 -0.536961
4.666667 -0.960004 -1.185909 -0.623479 0.792724 0.959774 -0.582232
4.700000 -0.932994 -1.154718 -0.656253 0.820628 0.956493 -0.607911
4.733333 -0.905217 -1.123493 -0.676874 0.848181 0.954348 -0.604707
4.766667 -0.876484 -1.092730 -0.680154 0.875155 0.953712 -0.576739
4.800000 -0.847280 -1.061725 -0.732830 0.901290 0.954835 -0.526557
4.833333 -0.816400 -1.030006 -0.755600 0.926250 0.957747 -0.454897
4.866667 -0.783996 -0.997485 -0.775950 0.949453 0.962282 -0.361890
4.900000 -0.751174 -0.964781 -0.765623 0.970400 0.968209 -0.254379
4.933333 -0.717926 -0.932811 -0.773885 0.988575 0.975410 -0.137193
4.966667 -0.684300 -0.900699 -0.786068 1.003505 0.983729 -0.008858
5.000000 -0.650315 -0.868464 -0.794661 1.014650 0.993100 0.125966
5.033333 -0.615263 -0.835517 -0.785670 1.021807 1.003446 0.261786
5.066667 -0.579609 -0.801848 -0.775827 1.025280 1.014704 0.391046
5.100000 -0.543659 -0.768116 -0.753881 1.025390 1.026846 0.509622
5.133333 -0.507434 -0.734342 -0.739819 1.022662 1.039430 0.610300
5.166667 -0.472549 -0.699646 -0.714622 1.017719 1.051995 0.685036
5.200000 -0.439545 -0.664137 -0.676783 1.011400 1.063809 0.729548
5.233333 -0.406324 -0.628652 -0.630066 1.004364 1.074145 0.743211
5.266667 -0.373992 -0.591565 -0.589771 0.997136 1.082233 0.726215
5.300000 -0.341476 -0.554548 -0.554139 0.990232 1.087333 0.681182
5.333333 -0.309223 -0.516872 -0.526473 0.984083 1.088983 0.613569
5.366667 -0.276980 -0.479187 -0.514078 0.978688 1.086679 0.531279
5.400000 -0.244602 -0.441645 -0.485029 0.973721 1.080282 0.443252
5.433333 -0.212054 -0.404454 -0.481550 0.968973 1.069844 0.357226
5.466667 -0.179223 -0.368203 -0.487431 0.963887 1.055439 0.278760
5.500000 -0.146304 -0.332169 -0.488331 0.957910 1.037126 0.213674
5.533333 -0.113720 -0.297358 -0.496100 0.950506 1.014825 0.165122
5.566667 -0.082224 -0.264077 -0.498060 0.941729 0.988558 0.131963
5.600000 -0.050733 -0.231491 -0.475236 0.931777 0.958236 0.112238
5.633333 -0.019214 -0.199206 -0.481494 0.920761 0.923372 0.103433
5.666667 0.012319 -0.167240 -0.476758 0.909172 0.883859 0.102747
5.700000 0.041722 -0.137839 -0.469548 0.897679 0.839782 0.105419
5.733333 0.071114 -0.108793 -0.460698 0.886842 0.791587 0.108754
5.766667 0.100481 -0.080118 -0.465116 0.876746 0.739899 0.113348
5.800000 0.128227 -0.055875 -0.458443 0.867589 0.685554 0.120082
5.833333 0.155927 -0.032030 -0.454818 0.859603 0.629861 0.128047
5.866667 0.184040 -0.012092 -0.450644 0.852835 0.574150 0.136258
5.900000 0.212449 0.003550 -0.450571 0.847078 0.519596 0.146874
5.933333 0.240781 0.018774 -0.446057 0.842200 0.467166 0.159109
5.966667 0.268982 0.030377 -0.449586 0.838501 0.417947 0.169765
6.000000 0.297085 0.041562 -0.435894 0.836222 0.372491 0.175970
6.033333 0.325080 0.052331 -0.434876 0.835683 0.331246 0.177171
6.066667 0.352956 0.062687 -0.411533 0.837282 0.294074 0.173206
6.100000 0.380015 0.071884 -0.399577 0.841435 0.260642 0.161734
6.133333 0.406810 0.079902 -0.398725 0.848680 0.230721 0.141949
6.166667 0.433845 0.086632 -0.392658 0.859071 0.203646 0.117094
6.200000 0.460722 0.092966 -0.394967 0.872383 0.179116 0.090404
6.233333 0.489074 0.097645 -0.385869 0.887979 0.156814 0.060614
6.266667 0.517248 0.101942 -0.373752 0.905057 0.136867 0.029445
6.300000 0.547533 0.105296 -0.384948 0.922617 0.119541 -0.000715
6.333333 0.579768 0.108000 -0.399047 0.939226 0.104914 -0.026518
6.366667 0.613606 0.110608 -0.402519 0.953561 0.093111 -0.050026
6.400000 0.647207 0.112871 -0.403029 0.964558 0.084146 -0.071094
6.433333 0.680555 0.114796 -0.394928 0.971439 0.078075 -0.086591
6.466667 0.715007 0.116874 -0.403043 0.973557 0.074603 -0.094908
6.500000 0.749168 0.118634 -0.389760 0.970569 0.073609 -0.099556
6.533333 0.782553 0.120601 -0.403008 0.962454 0.075141 -0.102153
6.566667 0.815612 0.122270 -0.420519 0.949472 0.079361 -0.100572
6.600000 0.846867 0.125513 -0.428967 0.931600 0.086387 -0.095990
6.633333 0.877763 0.128475 -0.428242 0.908977 0.095965 -0.088671
6.666667 0.908283 0.131164 -0.427696 0.881852 0.108074 -0.081270
6.700000 0.938412 0.133586 -0.433838 0.850573 0.122313 -0.070786
6.733333 0.968135 0.135751 -0.426658 0.815645 0.138076 -0.060193
6.766667 0.995706 0.140503 -0.429744 0.777567 0.154497 -0.052126
6.800000 1.022844 0.145010 -0.435823 0.737146 0.170794 -0.047971
6.833333 1.047808 0.151820 -0.436960 0.695033 0.186132 -0.049545
6.866667 1.069876 0.160272 -0.431374 0.651830 0.199393 -0.055939
6.900000 1.091480 0.168487 -0.435922 0.607998 0.209675 -0.066862
6.933333 1.108230 0.177305 -0.432171 0.564092 0.216050 -0.079511
6.966667 1.124506 0.185888 -0.430377 0.520280 0.217996 -0.091151
7.000000 1.140306 0.194234 -0.437072 0.476850 0.215082 -0.099601
7.033333 1.155628 0.202344 -0.447935 0.434062 0.207449 -0.101266
7.066667 1.170472 0.210217 -0.453432 0.392009 0.195722 -0.094533
7.100000 1.184835 0.217854 -0.459548 0.350796 0.180517 -0.081580
7.133333 1.196520 0.224225 -0.465556 0.310212 0.162816 -0.060720
7.166667 1.205844 0.229434 -0.475143 0.270566 0.143606 -0.034441
7.200000 1.213012 0.233357 -0.475198 0.232163 0.123888 -0.004364
7.233333 1.219712 0.237050 -0.471259 0.195430 0.104411 0.024320
7.266667 1.224703 0.239695 -0.478070 0.161038 0.085778 0.049240
7.300000 1.228018 0.241229 -0.462470 0.129790 0.068713 0.070396
7.333333 1.230888 0.242547 -0.455065 0.102337 0.053628 0.084253
7.366667 1.232649 0.243529 -0.440726 0.078967 0.040711 0.090350
7.400000 1.233540 0.244185 -0.430942 0.059650 0.029989 0.087131
7.433333 1.234177 0.244486 -0.441485 0.044270 0.021459 0.078530
7.466667 1.234667 0.244593 -0.435688 0.032473 0.014966 0.064016
7.500000 1.234989 0.244658 -0.444503 0.023581 0.010136 0.046847
7.533333 1.235431 0.244672 -0.435880 0.017118 0.006687 0.029062
7.566667 1.235743 0.244694 -0.435361 0.012573 0.004345 0.013276
7.600000 1.235804 0.244679 -0.434442 0.009507 0.002853 0.003067
7.633333 1.236192 0.244742 -0.436181 0.007418 0.001912 -0.004545
