t x y theta dxdt dydt dthetadt
0.000000 0.000000 0.000000 0.645515 0.041057 0.148750 -0.001095
0.033333 0.001384 0.005017 0.662256 0.042171 0.153043 0.001371
0.066667 0.002809 0.010184 0.636724 0.043315 0.157411 0.001151
0.100000 0.004264 0.015485 0.641175 0.044487 0.161852 0.006302
0.133333 0.005762 0.020940 0.659989 0.045685 0.166361 0.012268
0.166667 0.007289 0.026530 0.645318 0.046901 0.170929 0.013261
0.200000 0.008862 0.032281 0.662871 0.048133 0.175550 0.011800
0.233333 0.010481 0.038194 0.644770 0.049371 0.180208 0.011760
0.266667 0.012147 0.044272 0.641149 0.050610 0.184897 0.010417
0.300000 0.013861 0.050517 0.669249 0.051848 0.189613 0.004635
0.333333 0.015624 0.056932 0.654980 0.053088 0.194360 -0.001466
0.366667 0.017436 0.063519 0.651329 0.054330 0.199142 -0.005616
0.400000 0.019276 0.070243 0.658270 0.055577 0.203962 -0.009490
0.433333 0.021142 0.077103 0.651548 0.056839 0.208837 -0.014423
0.466667 0.023035 0.084100 0.647939 0.058124 0.213783 -0.018652
0.500000 0.024979 0.091279 0.647083 0.059444 0.218817 -0.019356
0.533333 0.026977 0.098641 0.659410 0.060803 0.223949 -0.020012
0.566667 0.029000 0.106139 0.643949 0.062210 0.229190 -0.020445
0.600000 0.031077 0.113825 0.642488 0.063667 0.234545 -0.018415
0.633333 0.033209 0.121701 0.653290 0.065171 0.240006 -0.014807
0.666667 0.035397 0.129770 0.641804 0.066711 0.245554 -0.008020
0.700000 0.037641 0.138033 0.653778 0.068271 0.251159 -0.002670
0.733333 0.039942 0.146493 0.645195 0.069831 0.256784 0.004456
0.766667 0.042301 0.155152 0.648114 0.071369 0.262389 0.010261
0.800000 0.044719 0.164011 0.637536 0.072865 0.267936 0.014995
0.833333 0.047196 0.173072 0.647086 0.074301 0.273391 0.017007
0.866667 0.049732 0.182337 0.645685 0.075663 0.278730 0.017150
0.900000 0.052285 0.191729 0.649762 0.076950 0.283949 0.018230
0.933333 0.054900 0.201329 0.649344 0.078165 0.289053 0.017241
0.966667 0.057576 0.211138 0.666193 0.079316 0.294058 0.016351
1.000000 0.060265 0.221069 0.657796 0.080414 0.298979 0.012747
1.033333 0.062968 0.231120 0.652515 0.081469 0.303839 0.005950
1.066667 0.065681 0.241289 0.652224 0.082500 0.308668 -0.014688
1.100000 0.068404 0.251574 0.641431 0.083509 0.313472 -0.052132
1.133333 0.071192 0.262076 0.651476 0.084507 0.318268 -0.110555
1.166667 0.074044 0.272797 0.643660 0.085492 0.323051 -0.191281
1.200000 0.076901 0.283627 0.665642 0.086468 0.327833 -0.300348
1.233333 0.079824 0.294678 0.658484 0.087426 0.332593 -0.435842
1.266667 0.082751 0.305834 0.652288 0.088352 0.337308 -0.581116
1.300000 0.085743 0.317213 0.648207 0.089232 0.341951 -0.730691
1.333333 0.088736 0.328691 0.646256 0.090049 0.346493 -0.875741
1.366667 0.091795 0.340396 0.594449 0.090796 0.350924 -1.005294
1.400000 0.094851 0.352194 0.510053 0.091453 0.355213 -1.096979
1.433333 0.097903 0.364082 0.458460 0.092020 0.359364 -1.140400
1.466667 0.101014 0.376190 0.398586 0.092491 0.363380 -1.136054
1.500000 0.104117 0.388381 0.346741 0.092875 0.367288 -1.082788
1.533333 0.107270 0.400780 0.288518 0.093167 0.371092 -0.975487
1.566667 0.110411 0.413255 0.228661 0.093367 0.374795 -0.823210
1.600000 0.113538 0.425803 0.230629 0.093478 0.378418 -0.648722
1.633333 0.116649 0.438420 0.221930 0.093494 0.381956 -0.468048
1.666667 0.119780 0.451208 0.191837 0.093415 0.385406 -0.291902
1.700000 0.122923 0.464157 0.204564 0.093229 0.388740 -0.129559
1.733333 0.126045 0.477164 0.221753 0.092938 0.391957 0.002311
1.766667 0.129166 0.490315 0.236039 0.092535 0.395041 0.096215
1.800000 0.132277 0.503596 0.270657 0.092015 0.397955 0.155330
1.833333 0.135374 0.517000 0.264197 0.091369 0.400669 0.191753
1.866667 0.138442 0.530445 0.280990 0.090589 0.403155 0.198135
1.900000 0.141481 0.543990 0.285523 0.089676 0.405399 0.179034
1.933333 0.144485 0.557622 0.297678 0.088625 0.407373 0.143788
1.966667 0.147455 0.571283 0.281147 0.087438 0.409062 0.100211
2.000000 0.150378 0.585008 0.303305 0.086111 0.410463 0.052385
2.033333 0.153249 0.598789 0.300111 0.084652 0.411584 -0.011247
2.066667 0.156079 0.612584 0.295437 0.083071 0.412425 -0.074744
2.100000 0.158844 0.626410 0.284065 0.081375 0.412992 -0.134397
2.133333 0.161566 0.640241 0.275579 0.079572 0.413300 -0.188794
2.166667 0.164209 0.654078 0.332758 0.077670 0.413353 -0.240540
2.200000 0.166768 0.667911 0.271355 0.075687 0.413165 -0.278791
2.233333 0.169278 0.681736 0.253377 0.073634 0.412747 -0.296581
2.266667 0.171737 0.695545 0.258821 0.071519 0.412111 -0.297144
2.300000 0.174094 0.709316 0.220372 0.069344 0.411263 -0.281583
2.333333 0.176339 0.723029 0.195113 0.067102 0.410194 -0.253844
2.366667 0.178529 0.736713 0.188339 0.064795 0.408909 -0.205030
2.400000 0.180662 0.750365 0.166325 0.062413 0.407407 -0.147511
2.433333 0.182737 0.763980 0.170348 0.059936 0.405672 -0.080619
2.466667 0.184752 0.777552 0.187253 0.057346 0.403688 0.007893
2.500000 0.186619 0.791004 0.194989 0.054631 0.401446 0.129707
2.533333 0.188424 0.804405 0.212001 0.051790 0.398950 0.293962
2.566667 0.190166 0.817750 0.206798 0.048803 0.396184 0.500702
2.600000 0.191843 0.831036 0.216954 0.045658 0.393134 0.755840
2.633333 0.193346 0.844150 0.218571 0.042369 0.389815 1.078431
2.666667 0.194669 0.857082 0.203460 0.038951 0.386241 1.468488
2.700000 0.195925 0.869942 0.226475 0.035410 0.382419 1.923106
2.733333 0.197112 0.882726 0.260260 0.031735 0.378335 2.422884
2.766667 0.198101 0.895288 0.301445 0.027951 0.374014 2.998591
2.800000 0.199020 0.907766 0.492076 0.024069 0.369467 3.645314
2.833333 0.199733 0.920005 0.704723 0.020072 0.364680 4.312264
2.866667 0.200376 0.932152 0.826318 0.015948 0.359643 4.958094
2.900000 0.200811 0.944046 0.930652 0.011716 0.354381 5.547213
2.933333 0.201175 0.955842 1.044948 0.007409 0.348937 6.092736
2.966667 0.201467 0.967537 1.336788 0.003030 0.343315 6.491529
3.000000 0.201550 0.978965 1.664572 -0.001392 0.337549 6.712703
3.033333 0.201423 0.990127 2.022466 -0.005811 0.331686 6.762921
3.066667 0.201085 1.001021 2.022466 -0.010174 0.325774 6.673872
3.100000 0.200677 1.011802 2.622179 -0.014466 0.319820 6.413740
3.133333 0.200060 1.022319 2.906307 -0.018656 0.313855 5.962498
3.166667 0.199237 1.032574 3.052786 -0.022691 0.307923 5.392350
3.200000 0.198346 1.042710 -3.092903 -0.026544 0.302048 4.752206
3.233333 0.197388 1.052725 -2.950817 -0.030200 0.296240 4.080955
3.266667 0.196277 1.062491 -2.851290 -0.033652 0.290509 3.359644
3.300000 0.195101 1.072132 -2.789554 -0.036884 0.284876 2.693000
3.333333 0.193789 1.081538 -2.749568 -0.039900 0.279338 2.112365
3.366667 0.192351 1.090713 -2.734279 -0.042721 0.273883 1.621955
3.400000 0.190801 1.099664 -2.665113 -0.045353 0.268507 1.198581
3.433333 0.189193 1.108484 -2.706562 -0.047794 0.263224 0.839015
3.466667 0.187526 1.117174 -2.658504 -0.050047 0.258024 0.556803
3.500000 0.185776 1.125651 -2.664319 -0.052111 0.252904 0.303110
3.533333 0.183972 1.133994 -2.608999 -0.053980 0.247847 0.061645
3.566667 0.182102 1.142132 -2.619286 -0.055648 0.242838 -0.180309
3.600000 0.180182 1.150135 -2.624758 -0.057122 0.237855 -0.409746
3.633333 0.178211 1.158002 -2.626386 -0.058412 0.232869 -0.641482
3.666667 0.176193 1.165734 -2.667649 -0.059523 0.227869 -0.852784
3.700000 0.174148 1.173269 -2.676261 -0.060475 0.222842 -1.023508
3.733333 0.172084 1.180611 -2.761919 -0.061288 0.217794 -1.119730
3.766667 0.169978 1.187816 -2.804245 -0.061977 0.212728 -1.121406
3.800000 0.167867 1.194830 -2.872796 -0.062558 0.207656 -1.012017
3.833333 0.165758 1.201655 -2.950204 -0.063048 0.202591 -0.769897
3.866667 0.163657 1.208292 -3.016789 -0.063468 0.197557 -0.410534
3.900000 0.161568 1.214742 -3.075202 -0.063834 0.192572 0.048602
3.933333 0.159443 1.221056 3.131111 -0.064158 0.187648 0.574181
3.966667 0.157285 1.227232 3.102321 -0.064458 0.182802 1.147662
4.000000 0.155111 1.233225 -3.077565 -0.064746 0.178048 1.724222
4.033333 0.152907 1.239082 -2.924266 -0.065024 0.173391 2.255226
4.066667 0.150731 1.244763 -2.765395 -0.065290 0.168827 2.702630
4.100000 0.148584 1.250269 -2.639529 -0.065535 0.164349 3.038098
4.133333 0.146412 1.255641 -2.497853 -0.065755 0.159959 3.235375
4.166667 0.144215 1.260880 -2.368717 -0.065935 0.155651 3.271879
4.200000 0.141995 1.265984 -2.215393 -0.066063 0.151417 3.159066
4.233333 0.139754 1.270957 -2.088066 -0.066138 0.147256 2.926946
4.266667 0.137547 1.275780 -1.953902 -0.066155 0.143164 2.610569
4.300000 0.135321 1.280473 -1.820700 -0.066116 0.139134 2.239406
4.333333 0.133078 1.285036 -1.763422 -0.066020 0.135160 1.844885
4.366667 0.130866 1.289464 -1.753479 -0.065883 0.131236 1.459307
