t x y theta dxdt dydt dthetadt
0.000000 0.000000 0.000000 -0.932312 -0.007132 0.014130 0.972763
0.033333 -0.000324 0.000420 -0.910006 -0.004682 0.015584 0.954190
0.066667 -0.000086 0.001049 -0.876952 -0.000680 0.017907 0.929442
0.100000 0.000733 0.001894 -0.836646 0.005681 0.021489 0.893920
0.133333 0.000848 0.002557 -0.794036 0.015206 0.026727 0.842069
0.166667 0.000073 0.002916 -0.759455 0.028776 0.034009 0.778881
0.200000 -0.000072 0.003508 -0.735812 0.047210 0.043639 0.707822
0.233333 0.000432 0.004341 -0.706159 0.070946 0.055723 0.630329
0.266667 0.001601 0.005421 -0.677797 0.100457 0.070393 0.547382
0.300000 0.002894 0.006839 -0.674503 0.135136 0.087266 0.464751
0.333333 0.005090 0.008934 -0.665852 0.174234 0.105879 0.390186
0.366667 0.009505 0.012198 -0.656422 0.217531 0.125887 0.320538
0.400000 0.014654 0.015729 -0.649206 0.265468 0.147154 0.250145
0.433333 0.027581 0.022675 -0.654570 0.318015 0.169356 0.178460
0.466667 0.041265 0.029889 -0.668386 0.375142 0.192167 0.105686
0.500000 0.055713 0.037372 -0.654152 0.437302 0.215538 0.028782
0.533333 0.070930 0.045124 -0.628078 0.505288 0.239546 -0.057243
0.566667 0.086924 0.053144 -0.614247 0.579004 0.264052 -0.149876
0.600000 0.103698 0.061432 -0.608511 0.657060 0.288570 -0.244937
0.633333 0.121258 0.069989 -0.627025 0.739510 0.313288 -0.336774
0.666667 0.139609 0.078812 -0.638000 0.826647 0.338547 -0.423204
0.700000 0.169167 0.090798 -0.675630 0.917938 0.364437 -0.493871
0.733333 0.207232 0.105135 -0.709154 1.011960 0.390967 -0.535610
0.766667 0.246070 0.119720 -0.739820 1.107072 0.418163 -0.541190
0.800000 0.285664 0.134546 -0.770637 1.202426 0.446368 -0.504186
0.833333 0.325999 0.149608 -0.790833 1.296087 0.475429 -0.429534
0.866667 0.369466 0.165185 -0.807473 1.385428 0.504869 -0.319190
0.900000 0.419364 0.181870 -0.837267 1.469448 0.534753 -0.185967
0.933333 0.469939 0.198762 -0.865270 1.548617 0.565265 -0.046281
0.966667 0.524462 0.217689 -0.850756 1.623614 0.596511 0.086347
1.000000 0.582555 0.238603 -0.846899 1.694578 0.628164 0.198882
1.033333 0.641233 0.259688 -0.807317 1.761828 0.659899 0.287667
1.066667 0.702546 0.283058 -0.748667 1.826156 0.691412 0.344668
1.100000 0.764374 0.306571 -0.732736 1.887727 0.722042 0.370677
1.133333 0.828465 0.331900 -0.713193 1.945220 0.750812 0.369467
1.166667 0.893600 0.358238 -0.701286 1.998029 0.777124 0.351987
1.200000 0.959133 0.384665 -0.694701 2.046195 0.800825 0.330398
1.233333 1.029342 0.412732 -0.689418 2.089450 0.821707 0.316076
1.266667 1.103824 0.442092 -0.687348 2.127136 0.839831 0.330838
1.300000 1.178569 0.471476 -0.698258 2.157968 0.855274 0.385841
1.333333 1.253527 0.500863 -0.716367 2.181713 0.868449 0.488550
1.366667 1.328648 0.530231 -0.689490 2.197544 0.879473 0.632686
1.400000 1.403882 0.559557 -0.695635 2.203948 0.888152 0.810531
1.433333 1.479178 0.588820 -0.677258 2.200141 0.894556 1.007872
1.466667 1.551985 0.618308 -0.644450 2.186030 0.898415 1.198654
1.500000 1.627308 0.649466 -0.598627 2.162348 0.899401 1.361130
1.533333 1.702547 0.680493 -0.540387 2.129053 0.896664 1.475854
1.566667 1.777650 0.711364 -0.456108 2.085861 0.889023 1.531895
1.600000 1.849997 0.742515 -0.345037 2.033609 0.875591 1.515552
1.633333 1.915951 0.772938 -0.252279 1.972895 0.854998 1.423198
1.666667 1.981632 0.803138 -0.184318 1.904240 0.826409 1.262846
1.700000 2.046998 0.833090 -0.139556 1.828016 0.788954 1.048795
1.733333 2.106610 0.860809 -0.113031 1.745905 0.742758 0.799679
1.766667 2.165833 0.888238 -0.094503 1.660367 0.688549 0.538555
1.800000 2.219355 0.912117 -0.091583 1.573428 0.627246 0.296762
1.833333 2.272423 0.935670 -0.101800 1.486871 0.560369 0.096129
1.866667 2.319881 0.953960 -0.118072 1.402614 0.489514 -0.050249
1.900000 2.361868 0.967004 -0.163088 1.322913 0.417131 -0.134484
1.933333 2.403329 0.979693 -0.202746 1.248779 0.344910 -0.156141
1.966667 2.439400 0.987215 -0.232210 1.181305 0.274967 -0.123238
2.000000 2.474916 0.994379 -0.236879 1.120867 0.208841 -0.053986
2.033333 2.509013 0.997649 -0.236258 1.068060 0.148247 0.039073
2.066667 2.542534 1.000565 -0.221244 1.022742 0.094156 0.141772
2.100000 2.574800 1.000505 -0.202489 0.983923 0.046641 0.238080
2.133333 2.606470 1.000103 -0.157628 0.950741 0.006021 0.315408
2.166667 2.637256 0.997912 -0.150496 0.921395 -0.028226 0.368726
2.200000 2.666671 0.994902 -0.125006 0.894681 -0.056324 0.397627
2.233333 2.695469 0.991577 -0.107609 0.868996 -0.079111 0.402246
2.266667 2.724632 0.987683 -0.090543 0.843019 -0.097039 0.385883
2.300000 2.753047 0.983441 -0.086483 0.815739 -0.110587 0.358482
2.333333 2.780241 0.978978 -0.075067 0.786487 -0.120172 0.326842
2.366667 2.806795 0.974243 -0.068039 0.755165 -0.126171 0.293003
2.400000 2.832707 0.969246 -0.066877 0.721506 -0.129046 0.260729
2.433333 2.857971 0.964000 -0.071515 0.685768 -0.129175 0.230942
2.466667 2.880797 0.959056 -0.052772 0.648530 -0.127028 0.205533
2.500000 2.901617 0.954584 -0.039178 0.610516 -0.122926 0.179835
2.533333 2.921786 0.949896 -0.028334 0.572388 -0.117515 0.155015
2.566667 2.938555 0.946256 -0.013863 0.534872 -0.110983 0.130371
2.600000 2.954678 0.942421 -0.026656 0.498757 -0.103479 0.107635
2.633333 2.970157 0.938400 -0.012476 0.464602 -0.095047 0.086725
2.666667 2.983917 0.936475 -0.028417 0.432675 -0.085809 0.070133
2.700000 2.997046 0.934381 -0.017518 0.402948 -0.075700 0.059712
2.733333 3.009548 0.932126 -0.016575 0.375352 -0.064470 0.055402
2.766667 3.021431 0.929717 -0.022388 0.349419 -0.052455 0.059249
2.800000 3.032702 0.927162 -0.026833 0.324590 -0.040034 0.064434
2.833333 3.043367 0.924467 -0.025610 0.300303 -0.027587 0.071620
2.866667 3.053433 0.921641 -0.029358 0.275928 -0.015181 0.076290
2.900000 3.062038 0.923312 -0.022020 0.251225 -0.003483 0.078666
2.933333 3.070063 0.924861 0.000170 0.226018 0.006850 0.077129
2.966667 3.077516 0.926291 0.013948 0.200451 0.015498 0.067922
3.000000 3.084407 0.927605 0.011388 0.174851 0.022220 0.056709
3.033333 3.089842 0.929648 0.009664 0.149719 0.026711 0.041975
3.066667 3.094736 0.931580 0.008056 0.125719 0.028527 0.023931
3.100000 3.098109 0.933102 0.008670 0.103268 0.028119 0.005054
3.133333 3.099871 0.934030 -0.007443 0.082747 0.025962 -0.012530
3.166667 3.101128 0.934855 0.002140 0.064453 0.022507 -0.025642
3.200000 3.101456 0.935296 -0.005889 0.048737 0.018219 -0.035354
3.233333 3.101951 0.935459 -0.008751 0.035542 0.013718 -0.040182
3.266667 3.102735 0.935661 0.003504 0.024787 0.009596 -0.038748
3.300000 3.103068 0.935772 -0.007814 0.016349 0.005998 -0.034552
3.333333 3.102963 0.935794 -0.000745 0.009983 0.002994 -0.030315
3.366667 3.103626 0.935763 -0.003496 0.005407 0.000673 -0.023982
3.400000 3.103876 0.935649 -0.024552 0.002043 -0.000994 -0.016063
