t x y theta dxdt dydt dthetadt
0.000000 0.000000 0.000000 1.896491 0.023588 -0.019806 -0.348172
0.033333 0.001283 -0.001605 1.927196 0.037602 -0.030731 -0.574699
0.066667 0.002585 -0.002950 1.922220 0.055702 -0.044904 -0.869440
0.100000 0.004835 -0.004023 1.904021 0.074092 -0.059044 -1.191202
0.133333 0.007101 -0.004854 1.843494 0.091731 -0.074262 -1.516473
0.166667 0.010881 -0.006608 1.759323 0.107376 -0.090964 -1.823490
0.200000 0.016005 -0.010100 1.619652 0.119567 -0.109232 -2.091345
0.233333 0.021113 -0.013492 1.504524 0.126874 -0.128894 -2.303553
0.266667 0.026192 -0.016835 1.387691 0.127542 -0.149786 -2.448693
0.300000 0.032297 -0.021921 1.288991 0.122233 -0.173270 -2.541219
0.333333 0.038996 -0.027904 1.215402 0.110686 -0.198131 -2.590393
0.366667 0.045797 -0.034595 1.156086 0.092928 -0.223569 -2.605550
0.400000 0.051613 -0.041932 1.103647 0.069345 -0.249110 -2.603854
0.433333 0.054975 -0.050850 1.040484 0.040289 -0.274130 -2.597751
0.466667 0.054255 -0.062053 0.950479 0.007347 -0.297591 -2.597032
0.500000 0.053447 -0.073329 0.836315 -0.027987 -0.318881 -2.603354
0.533333 0.052543 -0.084705 0.727426 -0.064452 -0.337532 -2.614876
0.566667 0.051539 -0.096204 0.630080 -0.100884 -0.353100 -2.627313
0.600000 0.044582 -0.109560 0.555342 -0.135898 -0.364947 -2.631418
0.633333 0.037526 -0.123056 0.462933 -0.167950 -0.372736 -2.618531
0.666667 0.030375 -0.136701 0.375057 -0.196517 -0.376442 -2.585131
0.700000 0.023132 -0.150502 0.289286 -0.220935 -0.375694 -2.532481
0.733333 0.015803 -0.164465 0.202531 -0.240584 -0.370452 -2.459046
0.766667 0.005629 -0.177045 0.115576 -0.254629 -0.360751 -2.362864
0.800000 -0.004621 -0.189801 0.039758 -0.263139 -0.346858 -2.240791
0.833333 -0.014939 -0.202735 -0.036752 -0.266407 -0.329208 -2.096170
0.866667 -0.025425 -0.213420 -0.122662 -0.264664 -0.308661 -1.926284
0.900000 -0.035964 -0.224299 -0.191484 -0.258486 -0.286314 -1.733900
0.933333 -0.046550 -0.235371 -0.254677 -0.248409 -0.262969 -1.529088
0.966667 -0.056063 -0.244050 -0.308549 -0.235527 -0.239380 -1.325205
1.000000 -0.063933 -0.250465 -0.367861 -0.220549 -0.216307 -1.137520
1.033333 -0.069094 -0.254728 -0.399798 -0.204290 -0.194455 -0.972960
1.066667 -0.074274 -0.259183 -0.407884 -0.187409 -0.173924 -0.846109
1.100000 -0.079467 -0.263811 -0.387782 -0.170463 -0.154932 -0.762579
1.133333 -0.084664 -0.268579 -0.368480 -0.153982 -0.137888 -0.721992
1.166667 -0.089855 -0.273456 -0.384238 -0.138084 -0.122925 -0.717942
1.200000 -0.095034 -0.278433 -0.394582 -0.122680 -0.109901 -0.741939
1.233333 -0.098814 -0.281746 -0.426617 -0.107419 -0.098535 -0.788236
1.266667 -0.101956 -0.284105 -0.476289 -0.092063 -0.088856 -0.839394
1.300000 -0.105079 -0.286570 -0.504839 -0.076476 -0.080746 -0.883953
1.333333 -0.107747 -0.288406 -0.568698 -0.060776 -0.074059 -0.910170
1.366667 -0.109955 -0.289818 -0.600779 -0.045129 -0.069023 -0.919551
1.400000 -0.111719 -0.291305 -0.661321 -0.029835 -0.066001 -0.909758
1.433333 -0.112170 -0.292938 -0.688817 -0.015224 -0.065388 -0.882300
1.466667 -0.110978 -0.294721 -0.716596 -0.001622 -0.067388 -0.846929
1.500000 -0.109773 -0.296684 -0.711902 0.010757 -0.072195 -0.810609
1.533333 -0.108557 -0.298812 -0.724594 0.021911 -0.080210 -0.782389
1.566667 -0.107331 -0.301106 -0.748687 0.031750 -0.091492 -0.758437
1.600000 -0.106098 -0.303571 -0.769579 0.040252 -0.106083 -0.743127
1.633333 -0.104862 -0.306211 -0.792590 0.047358 -0.124108 -0.733738
1.666667 -0.103625 -0.309034 -0.823210 0.053230 -0.145772 -0.725560
1.700000 -0.101401 -0.313561 -0.857782 0.057949 -0.171152 -0.712989
1.733333 -0.099187 -0.318292 -0.890432 0.061548 -0.199703 -0.692987
1.766667 -0.096542 -0.325478 -0.919980 0.063974 -0.230997 -0.668668
1.800000 -0.093918 -0.332884 -0.954793 0.065136 -0.264600 -0.637648
1.833333 -0.091321 -0.340520 -0.974977 0.065011 -0.299647 -0.604299
1.866667 -0.088692 -0.352427 -0.982704 0.063380 -0.334965 -0.572781
1.900000 -0.086099 -0.364554 -0.986247 0.060193 -0.369632 -0.548849
1.933333 -0.083544 -0.376890 -1.001490 0.055387 -0.403068 -0.533951
1.966667 -0.081837 -0.393133 -1.003899 0.049246 -0.434495 -0.528519
2.000000 -0.080175 -0.409563 -1.020844 0.042056 -0.463143 -0.533997
2.033333 -0.078562 -0.426175 -1.043471 0.034032 -0.488559 -0.545557
2.066667 -0.077003 -0.442963 -1.062957 0.025514 -0.510907 -0.560448
2.100000 -0.076722 -0.461528 -1.086306 0.016858 -0.530097 -0.572611
2.133333 -0.076502 -0.480259 -1.109090 0.008455 -0.546041 -0.581006
2.166667 -0.076345 -0.499151 -1.138477 0.000430 -0.559220 -0.581070
2.200000 -0.076915 -0.518568 -1.161751 -0.007039 -0.570080 -0.570851
2.233333 -0.077555 -0.538139 -1.185591 -0.013790 -0.579061 -0.552684
2.266667 -0.078463 -0.557843 -1.196826 -0.019726 -0.586263 -0.524704
2.300000 -0.079443 -0.577682 -1.212581 -0.024976 -0.592068 -0.491682
2.333333 -0.080498 -0.597646 -1.228446 -0.029682 -0.596861 -0.454681
2.366667 -0.081629 -0.617726 -1.232151 -0.033935 -0.600706 -0.419581
2.400000 -0.082836 -0.637905 -1.263387 -0.037939 -0.603739 -0.387028
2.433333 -0.084123 -0.658182 -1.266582 -0.041882 -0.606085 -0.359149
2.466667 -0.085488 -0.678543 -1.282003 -0.045957 -0.607932 -0.338582
2.500000 -0.086852 -0.699016 -1.289550 -0.050224 -0.609292 -0.324658
2.533333 -0.088296 -0.719535 -1.299261 -0.054741 -0.610183 -0.317287
2.566667 -0.090056 -0.740071 -1.304074 -0.059541 -0.610631 -0.312527
2.600000 -0.092133 -0.760220 -1.300888 -0.064617 -0.610687 -0.314278
2.633333 -0.094541 -0.780657 -1.313284 -0.069919 -0.610449 -0.319356
2.666667 -0.097030 -0.801100 -1.331192 -0.075377 -0.610037 -0.327336
2.700000 -0.099601 -0.821543 -1.348416 -0.080927 -0.609604 -0.336216
2.733333 -0.102290 -0.842016 -1.361382 -0.086511 -0.609311 -0.345317
2.766667 -0.105317 -0.862237 -1.370947 -0.092095 -0.609330 -0.354944
2.800000 -0.108590 -0.882374 -1.377433 -0.097579 -0.609694 -0.361099
2.833333 -0.111943 -0.902473 -1.390402 -0.102977 -0.610440 -0.365762
2.866667 -0.115376 -0.922523 -1.410489 -0.108316 -0.611534 -0.368580
2.900000 -0.118888 -0.942521 -1.416843 -0.113650 -0.612972 -0.372476
2.933333 -0.122970 -0.962779 -1.437511 -0.118978 -0.614701 -0.376326
2.966667 -0.127147 -0.983295 -1.443457 -0.124286 -0.616630 -0.380389
3.000000 -0.131432 -1.004309 -1.452807 -0.129624 -0.618746 -0.384456
3.033333 -0.135791 -1.025229 -1.460219 -0.134905 -0.620960 -0.387171
3.066667 -0.140330 -1.046211 -1.483746 -0.140038 -0.623153 -0.389103
3.100000 -0.145004 -1.067078 -1.486536 -0.144878 -0.625141 -0.388076
3.133333 -0.149600 -1.087512 -1.511019 -0.149376 -0.626818 -0.384462
3.166667 -0.154943 -1.108274 -1.528470 -0.153485 -0.628035 -0.380075
3.200000 -0.160367 -1.129296 -1.536154 -0.157154 -0.628648 -0.374493
3.233333 -0.166108 -1.150559 -1.552537 -0.160450 -0.628503 -0.368324
3.266667 -0.171905 -1.171665 -1.570466 -0.163568 -0.627491 -0.362414
3.300000 -0.177456 -1.192941 -1.564413 -0.166853 -0.625494 -0.358901
3.333333 -0.182961 -1.214257 -1.583403 -0.170709 -0.622299 -0.358150
3.366667 -0.188516 -1.235380 -1.589948 -0.175580 -0.617823 -0.359761
3.400000 -0.194114 -1.256296 -1.604074 -0.181967 -0.612030 -0.363661
3.433333 -0.199755 -1.276996 -1.610620 -0.190242 -0.604981 -0.370209
3.466667 -0.205322 -1.297370 -1.623510 -0.200589 -0.596780 -0.377536
3.500000 -0.211208 -1.317207 -1.645529 -0.212955 -0.587710 -0.380638
3.533333 -0.217126 -1.336803 -1.649403 -0.227123 -0.578180 -0.381787
3.566667 -0.224095 -1.355961 -1.666891 -0.242825 -0.568574 -0.377742
3.600000 -0.232333 -1.374654 -1.688566 -0.259550 -0.559242 -0.370789
3.633333 -0.241742 -1.392925 -1.705653 -0.276758 -0.550499 -0.359083
3.666667 -0.252328 -1.410714 -1.708570 -0.293905 -0.542614 -0.344695
3.700000 -0.262918 -1.428224 -1.731458 -0.310546 -0.535623 -0.331256
3.733333 -0.274295 -1.445549 -1.727452 -0.326219 -0.529448 -0.317425
3.766667 -0.285658 -1.462579 -1.741362 -0.340503 -0.523912 -0.304790
3.800000 -0.297260 -1.479443 -1.748732 -0.353267 -0.518827 -0.293220
3.833333 -0.309254 -1.496834 -1.753225 -0.364552 -0.513945 -0.284361
3.866667 -0.321769 -1.514332 -1.763811 -0.374471 -0.508980 -0.275718
3.900000 -0.335031 -1.531805 -1.770524 -0.383081 -0.503713 -0.267548
3.933333 -0.348228 -1.548946 -1.787182 -0.390501 -0.497905 -0.257153
3.966667 -0.361348 -1.565753 -1.795741 -0.396834 -0.491393 -0.246399
4.000000 -0.375047 -1.582163 -1.808730 -0.401988 -0.484008 -0.232905
4.033333 -0.388646 -1.598230 -1.817011 -0.405819 -0.475662 -0.216477
4.066667 -0.402607 -1.613943 -1.826386 -0.408004 -0.465994 -0.198717
4.100000 -0.416452 -1.629089 -1.821479 -0.408354 -0.454716 -0.182474
4.133333 -0.430625 -1.644184 -1.835360 -0.406472 -0.441186 -0.171243
4.166667 -0.444827 -1.659348 -1.835187 -0.401678 -0.424225 -0.163636
4.200000 -0.458867 -1.674146 -1.841508 -0.393426 -0.402666 -0.158736
4.233333 -0.472733 -1.688579 -1.839595 -0.380975 -0.374874 -0.148244
4.266667 -0.485936 -1.701712 -1.843954 -0.364054 -0.339978 -0.121609
4.300000 -0.498942 -1.714475 -1.848031 -0.342320 -0.296783 -0.063998
4.333333 -0.511739 -1.726871 -1.850493 -0.315926 -0.245016 0.036719
4.366667 -0.524316 -1.738904 -1.855629 -0.285593 -0.185444 0.191994
4.400000 -0.534331 -1.746272 -1.865637 -0.252301 -0.119056 0.408251
4.433333 -0.544109 -1.753298 -1.892280 -0.217373 -0.047702 0.681316
4.466667 -0.550944 -1.754299 -1.910111 -0.182042 0.026826 1.001799
4.500000 -0.554282 -1.749108 -1.903129 -0.147819 0.101720 1.357788
4.533333 -0.557375 -1.743652 -1.870895 -0.116001 0.174654 1.734373
4.566667 -0.558129 -1.732616 -1.767775 -0.087794 0.243318 2.107735
4.600000 -0.558631 -1.721306 -1.651038 -0.063790 0.305734 2.454774
4.633333 -0.558814 -1.706538 -1.548854 -0.044399 0.360013 2.759493
4.666667 -0.558732 -1.691460 -1.425950 -0.029618 0.405126 3.006491
4.700000 -0.558379 -1.676052 -1.284521 -0.018794 0.441162 3.180860
4.733333 -0.559136 -1.658771 -1.150875 -0.010903 0.468001 3.274732
4.766667 -0.559605 -1.641113 -1.028313 -0.004527 0.486543 3.293120
4.800000 -0.559779 -1.623069 -0.916021 0.001639 0.497552 3.246796
4.833333 -0.559652 -1.604636 -0.807894 0.008888 0.502465 3.142213
4.866667 -0.559913 -1.586229 -0.699915 0.018340 0.502260 2.992668
4.900000 -0.560135 -1.568401 -0.596278 0.030658 0.497709 2.815135
4.933333 -0.560162 -1.551772 -0.508014 0.046036 0.490124 2.623607
4.966667 -0.559761 -1.535772 -0.400583 0.064530 0.480343 2.426118
5.000000 -0.559031 -1.519397 -0.323324 0.085815 0.469360 2.229699
5.033333 -0.556737 -1.503975 -0.264787 0.109464 0.457939 2.042734
5.066667 -0.552404 -1.489694 -0.199426 0.134820 0.446908 1.869300
5.100000 -0.547741 -1.475096 -0.162220 0.161281 0.436835 1.712885
5.133333 -0.540557 -1.461899 -0.121292 0.188079 0.428084 1.574695
5.166667 -0.533053 -1.448445 -0.074421 0.214279 0.420949 1.458955
5.200000 -0.525234 -1.434757 -0.028309 0.239130 0.415592 1.362986
5.233333 -0.517105 -1.420859 0.012108 0.262047 0.412008 1.285039
5.266667 -0.507424 -1.407448 0.055963 0.282574 0.410093 1.223810
5.300000 -0.496640 -1.394303 0.088582 0.300113 0.409898 1.173768
5.333333 -0.485567 -1.381020 0.135939 0.314576 0.411183 1.129715
5.366667 -0.474214 -1.367615 0.167339 0.325960 0.413797 1.087994
5.400000 -0.462273 -1.354139 0.203534 0.334133 0.417637 1.048927
5.433333 -0.450068 -1.340588 0.239042 0.338943 0.422640 1.012307
5.466667 -0.437753 -1.326460 0.273907 0.340471 0.428609 0.975830
5.500000 -0.425858 -1.312147 0.307231 0.339194 0.435207 0.940094
5.533333 -0.413724 -1.297820 0.332729 0.335296 0.442380 0.909206
5.566667 -0.401859 -1.283064 0.359157 0.329005 0.450005 0.880331
5.600000 -0.390520 -1.267774 0.390894 0.320888 0.457807 0.853319
5.633333 -0.380175 -1.252197 0.416954 0.311574 0.465519 0.826639
5.666667 -0.369622 -1.236694 0.434234 0.301503 0.473065 0.802462
5.700000 -0.359877 -1.220554 0.469469 0.290922 0.480400 0.778690
5.733333 -0.351263 -1.203918 0.498195 0.280391 0.487227 0.751826
5.766667 -0.342453 -1.187417 0.530370 0.270452 0.493249 0.723641
5.800000 -0.333451 -1.171065 0.542536 0.261384 0.498318 0.692822
5.833333 -0.324260 -1.154889 0.571594 0.253266 0.502341 0.658885
5.866667 -0.316099 -1.137717 0.592303 0.246290 0.505042 0.621297
5.900000 -0.309099 -1.119815 0.605921 0.240647 0.506178 0.583329
5.933333 -0.301917 -1.102147 0.641537 0.236205 0.505708 0.546565
5.966667 -0.294552 -1.084724 0.656537 0.232927 0.503346 0.509397
6.000000 -0.287003 -1.067565 0.666590 0.230849 0.498412 0.471368
6.033333 -0.279272 -1.050693 0.674689 0.230101 0.490204 0.430673
6.066667 -0.271360 -1.034127 0.681944 0.230606 0.478301 0.374284
6.100000 -0.264169 -1.017632 0.705919 0.232186 0.461940 0.284600
6.133333 -0.256796 -1.001473 0.717551 0.234768 0.440292 0.145005
6.166667 -0.249241 -0.985664 0.722004 0.238229 0.412702 -0.055702
6.200000 -0.241455 -0.970714 0.744583 0.242419 0.379221 -0.327893
6.233333 -0.233484 -0.956135 0.747442 0.247360 0.339634 -0.673451
6.266667 -0.225329 -0.941943 0.763910 0.253435 0.293333 -1.072104
6.300000 -0.216761 -0.931116 0.756026 0.261030 0.240731 -1.491257
6.333333 -0.207914 -0.924860 0.755640 0.270844 0.182422 -1.896306
6.366667 -0.198879 -0.919007 0.703934 0.283771 0.119299 -2.256728
6.400000 -0.189662 -0.913585 0.565825 0.301004 0.051771 -2.537623
6.433333 -0.180653 -0.913638 0.384202 0.323416 -0.018817 -2.708233
6.466667 -0.171489 -0.914289 0.179616 0.351632 -0.090700 -2.755006
6.500000 -0.161397 -0.919548 0.012082 0.386500 -0.162689 -2.679716
6.533333 -0.151184 -0.925577 -0.110140 0.428356 -0.233899 -2.490414
6.566667 -0.138714 -0.935270 -0.224879 0.476843 -0.303213 -2.199926
6.600000 -0.122958 -0.948428 -0.257749 0.530830 -0.369052 -1.840550
6.633333 -0.107113 -0.962417 -0.274920 0.589297 -0.430878 -1.453930
6.666667 -0.087259 -0.979179 -0.273373 0.650388 -0.487999 -1.080040
6.700000 -0.063631 -0.998156 -0.279871 0.711364 -0.539953 -0.749831
6.733333 -0.036521 -1.018879 -0.278341 0.769120 -0.586138 -0.485633
6.766667 -0.009370 -1.040303 -0.266262 0.820897 -0.626742 -0.306459
6.800000 0.021198 -1.063349 -0.261548 0.864341 -0.662432 -0.212948
6.833333 0.054219 -1.087412 -0.263332 0.896928 -0.693484 -0.193961
6.866667 0.088673 -1.112047 -0.262088 0.917114 -0.720838 -0.235330
6.900000 0.123517 -1.136941 -0.268324 0.924310 -0.745516 -0.322015
6.933333 0.159038 -1.162451 -0.264715 0.918876 -0.768545 -0.445708
6.966667 0.194457 -1.188447 -0.276594 0.901523 -0.790516 -0.593252
7.000000 0.227224 -1.214364 -0.286809 0.873548 -0.812027 -0.756850
7.033333 0.256579 -1.240569 -0.323909 0.836634 -0.833733 -0.933146
7.066667 0.283892 -1.268280 -0.345376 0.792639 -0.855725 -1.119372
7.100000 0.308088 -1.297518 -0.389621 0.743681 -0.877704 -1.312827
7.133333 0.332062 -1.327139 -0.459277 0.691569 -0.899400 -1.504897
7.166667 0.355794 -1.357145 -0.510493 0.637887 -0.920633 -1.691372
7.200000 0.376146 -1.388981 -0.572088 0.583807 -0.941001 -1.859680
7.233333 0.392436 -1.421806 -0.624760 0.530677 -0.960029 -1.997998
7.266667 0.408433 -1.454985 -0.690939 0.479618 -0.977861 -2.089775
7.300000 0.424126 -1.488514 -0.766084 0.431165 -0.995129 -2.123810
7.333333 0.439500 -1.522392 -0.867949 0.385797 -1.012433 -2.092234
7.366667 0.450876 -1.556363 -0.968924 0.344258 -1.030364 -1.984423
7.400000 0.459388 -1.590374 -1.071112 0.307147 -1.049648 -1.800493
7.433333 0.466165 -1.624695 -1.145198 0.274538 -1.071170 -1.543704
7.466667 0.472579 -1.659408 -1.228063 0.246419 -1.095168 -1.222928
7.500000 0.478849 -1.694501 -1.298985 0.222839 -1.121282 -0.846054
7.533333 0.485045 -1.730861 -1.318630 0.203817 -1.149052 -0.429682
7.566667 0.490864 -1.767590 -1.307746 0.188783 -1.177957 0.006134
7.600000 0.496791 -1.807880 -1.273917 0.177040 -1.207049 0.440617
7.633333 0.502653 -1.851246 -1.227910 0.167845 -1.234755 0.856955
7.666667 0.508146 -1.894816 -1.191952 0.160273 -1.259466 1.237383
7.700000 0.513272 -1.938536 -1.141603 0.153203 -1.279461 1.561154
7.733333 0.518035 -1.982345 -1.069629 0.145557 -1.293206 1.821229
7.766667 0.522755 -2.027326 -0.991844 0.136533 -1.299130 2.011374
7.800000 0.527689 -2.072815 -0.900438 0.125460 -1.296313 2.130723
7.833333 0.532278 -2.118175 -0.793890 0.111767 -1.284191 2.177206
7.866667 0.536529 -2.163320 -0.723866 0.094994 -1.262297 2.156333
7.900000 0.540447 -2.208190 -0.631286 0.074933 -1.230524 2.081114
7.933333 0.544685 -2.252198 -0.540418 0.050986 -1.188318 1.961204
7.966667 0.547978 -2.294088 -0.455944 0.022654 -1.135489 1.807095
8.000000 0.549484 -2.332784 -0.384643 -0.010324 -1.071875 1.630274
8.033333 0.547619 -2.366578 -0.349472 -0.047696 -0.997841 1.448765
8.066667 0.545452 -2.399824 -0.320449 -0.088970 -0.914422 1.271742
8.100000 0.542989 -2.432501 -0.305420 -0.133430 -0.823116 1.107088
8.133333 0.540236 -2.464599 -0.284459 -0.179621 -0.726229 0.959937
8.166667 0.534903 -2.489561 -0.277701 -0.225822 -0.625843 0.836997
8.200000 0.527134 -2.508589 -0.245159 -0.270422 -0.523973 0.739620
8.233333 0.516267 -2.522049 -0.204257 -0.312179 -0.422894 0.659877
8.266667 0.501381 -2.529508 -0.173122 -0.349492 -0.324766 0.592647
8.300000 0.486262 -2.536355 -0.169953 -0.380799 -0.231290 0.538932
8.333333 0.470928 -2.542612 -0.158715 -0.404737 -0.143800 0.503038
8.366667 0.454808 -2.541471 -0.145321 -0.420632 -0.063995 0.490262
8.400000 0.438508 -2.539774 -0.116502 -0.428052 0.007106 0.507881
8.433333 0.422046 -2.537533 -0.095075 -0.426839 0.069544 0.563813
8.466667 0.405444 -2.534766 -0.089014 -0.417915 0.124069 0.667224
8.500000 0.391117 -2.526937 -0.101600 -0.402581 0.170708 0.812237
8.533333 0.376679 -2.518651 -0.102533 -0.382226 0.209346 0.987638
8.566667 0.362144 -2.509941 -0.100535 -0.357951 0.240864 1.177989
8.600000 0.350216 -2.499555 -0.093775 -0.330774 0.265418 1.368644
8.633333 0.340631 -2.488377 -0.014117 -0.301607 0.282568 1.545685
8.666667 0.333070 -2.477469 0.078721 -0.271001 0.291585 1.690386
8.700000 0.325469 -2.466186 0.198327 -0.239329 0.293029 1.788491
8.733333 0.317845 -2.454499 0.307549 -0.207318 0.287936 1.831809
8.766667 0.310216 -2.442389 0.367978 -0.175648 0.276752 1.817659
8.800000 0.302591 -2.429864 0.435477 -0.144812 0.260418 1.743873
8.833333 0.297723 -2.420589 0.498950 -0.115260 0.240492 1.618639
8.866667 0.295994 -2.414204 0.541562 -0.087359 0.218684 1.457502
8.900000 0.294295 -2.407425 0.590051 -0.061517 0.196226 1.280565
8.933333 0.294174 -2.402529 0.615342 -0.038038 0.174202 1.105967
8.966667 0.294971 -2.399042 0.644919 -0.017295 0.153852 0.942431
9.000000 0.295804 -2.395202 0.660266 0.000219 0.136219 0.802418
9.033333 0.297090 -2.392356 0.684431 0.014273 0.121733 0.687656
9.066667 0.298409 -2.389191 0.700862 0.024975 0.110280 0.595844
9.100000 0.299761 -2.385724 0.715897 0.032473 0.101646 0.522257
9.133333 0.301164 -2.382901 0.714019 0.037228 0.095439 0.462711
9.166667 0.302823 -2.380155 0.736592 0.039797 0.090922 0.418402
9.200000 0.304509 -2.377157 0.749326 0.040789 0.087408 0.383238
9.233333 0.306219 -2.373922 0.772107 0.040679 0.084271 0.354697
9.266667 0.307636 -2.371144 0.785947 0.039734 0.081337 0.332008
