t x y theta dxdt dydt dthetadt
0.000000 0.000000 0.000000 -1.861457 0.000463 -0.012834 -0.000426
0.033333 -0.000139 -0.000090 -1.857949 0.001433 -0.016172 -0.002504
0.066667 -0.000105 -0.000602 -1.865082 0.002659 -0.020667 0.003668
0.100000 0.000093 -0.000962 -1.860929 0.004260 -0.026754 0.017805
0.133333 -0.000026 -0.001240 -1.863227 0.006404 -0.035175 0.044339
0.166667 0.000042 -0.001975 -1.856336 0.009232 -0.046571 0.086852
0.200000 0.000242 -0.002818 -1.870618 0.012928 -0.061983 0.152408
0.233333 0.000467 -0.004182 -1.864862 0.017606 -0.082003 0.237824
0.266667 0.000850 -0.006144 -1.858454 0.023486 -0.107616 0.333688
0.300000 0.001441 -0.008609 -1.863434 0.030769 -0.139707 0.437780
0.333333 0.002243 -0.011587 -1.879631 0.039499 -0.178350 0.546811
0.366667 0.003394 -0.016942 -1.847343 0.049796 -0.223842 0.654686
0.400000 0.004767 -0.022828 -1.796262 0.061617 -0.275576 0.751602
0.433333 0.006367 -0.029253 -1.751687 0.075003 -0.333516 0.836607
0.466667 0.008760 -0.040894 -1.709149 0.089777 -0.396644 0.911132
0.500000 0.011389 -0.053081 -1.667684 0.105840 -0.464264 0.973733
0.533333 0.015155 -0.070815 -1.632638 0.123109 -0.535695 1.019437
0.566667 0.019163 -0.089093 -1.609938 0.141496 -0.610186 1.053377
0.600000 0.024671 -0.113153 -1.585006 0.160887 -0.686995 1.084655
0.633333 0.030425 -0.137739 -1.554659 0.181131 -0.764933 1.118810
0.666667 0.036425 -0.162838 -1.514156 0.202183 -0.843475 1.161242
0.700000 0.043412 -0.192254 -1.480220 0.223771 -0.921216 1.211993
0.733333 0.050645 -0.222154 -1.433643 0.245939 -0.997989 1.274335
0.766667 0.059007 -0.256693 -1.395368 0.268505 -1.072918 1.343378
0.800000 0.068175 -0.294933 -1.356833 0.291448 -1.145730 1.410639
0.833333 0.078568 -0.336967 -1.302470 0.314545 -1.215705 1.466280
0.866667 0.089198 -0.379387 -1.258528 0.337665 -1.282237 1.502002
0.900000 0.101266 -0.425338 -1.205510 0.360869 -1.345588 1.517347
0.933333 0.113562 -0.471610 -1.129684 0.383870 -1.404923 1.506975
0.966667 0.127240 -0.521262 -1.062437 0.406568 -1.460203 1.469442
1.000000 0.141132 -0.571162 -0.983644 0.428853 -1.511502 1.401445
1.033333 0.155228 -0.621269 -0.958730 0.450876 -1.559715 1.311894
1.066667 0.171504 -0.676443 -0.911816 0.472440 -1.604876 1.205869
1.100000 0.187966 -0.731741 -0.873224 0.493388 -1.646892 1.087440
1.133333 0.204605 -0.787117 -0.830188 0.513620 -1.685818 0.966200
1.166667 0.221407 -0.842526 -0.813780 0.533110 -1.721639 0.851620
1.200000 0.239463 -0.900682 -0.788848 0.551661 -1.753694 0.757010
1.233333 0.258737 -0.961310 -0.772279 0.568906 -1.780831 0.680524
1.266667 0.278799 -1.023420 -0.768733 0.584696 -1.802406 0.625990
1.300000 0.299422 -1.086466 -0.748505 0.598673 -1.817462 0.591880
1.333333 0.320143 -1.149292 -0.751251 0.610482 -1.824846 0.580138
1.366667 0.340946 -1.211844 -0.732221 0.619675 -1.822976 0.584374
1.400000 0.361816 -1.274068 -0.700661 0.626223 -1.810602 0.598533
1.433333 0.383707 -1.336939 -0.677091 0.630197 -1.786818 0.621498
1.466667 0.405631 -1.399373 -0.663857 0.631917 -1.751417 0.647704
1.500000 0.427902 -1.460620 -0.628130 0.632239 -1.703970 0.678826
1.533333 0.449793 -1.519556 -0.611073 0.632157 -1.644882 0.706804
1.566667 0.471664 -1.577896 -0.590466 0.632654 -1.575281 0.734474
1.600000 0.491694 -1.630625 -0.552673 0.634855 -1.496700 0.763318
1.633333 0.511671 -1.682664 -0.544387 0.639955 -1.410640 0.796112
1.666667 0.530944 -1.729925 -0.511113 0.648993 -1.318400 0.835474
1.700000 0.550365 -1.771795 -0.483123 0.662189 -1.222586 0.880003
1.733333 0.571721 -1.807626 -0.458427 0.679612 -1.125158 0.935172
1.766667 0.592959 -1.842620 -0.434298 0.701382 -1.027330 1.000091
1.800000 0.614059 -1.876751 -0.404002 0.726581 -0.930082 1.074593
1.833333 0.639879 -1.903267 -0.357038 0.753730 -0.834557 1.153957
1.866667 0.665520 -1.928872 -0.334859 0.781094 -0.740946 1.235947
1.900000 0.690962 -1.953550 -0.281604 0.807356 -0.648166 1.316593
1.933333 0.721622 -1.971102 -0.231894 0.830845 -0.555819 1.390517
1.966667 0.752030 -1.987698 -0.193224 0.849812 -0.464243 1.452075
2.000000 0.782158 -2.003327 -0.128635 0.862880 -0.373439 1.493510
2.033333 0.811977 -2.017982 -0.083069 0.869368 -0.282710 1.515435
2.066667 0.843089 -2.026271 -0.018442 0.868550 -0.192520 1.511222
2.100000 0.874316 -2.029176 0.051323 0.859649 -0.104084 1.481175
2.133333 0.905145 -2.031099 0.110318 0.842495 -0.017500 1.423206
2.166667 0.934743 -2.028337 0.160838 0.816776 0.067283 1.339918
2.200000 0.962106 -2.021265 0.201741 0.782555 0.149650 1.238879
2.233333 0.988985 -2.013242 0.231301 0.739638 0.228382 1.120447
2.266667 1.015354 -2.004282 0.291201 0.688494 0.303077 0.992259
2.300000 1.041189 -1.994400 0.320752 0.629268 0.374076 0.857651
2.333333 1.063605 -1.980814 0.337754 0.562452 0.440830 0.720285
2.366667 1.082382 -1.963987 0.367404 0.489178 0.503039 0.578747
2.400000 1.097379 -1.944124 0.358616 0.410834 0.560862 0.432997
2.433333 1.111760 -1.923424 0.367082 0.329168 0.614587 0.283756
2.466667 1.122196 -1.901039 0.381451 0.245803 0.664166 0.132364
2.500000 1.128923 -1.876794 0.399337 0.163075 0.709033 -0.021261
2.533333 1.131900 -1.850881 0.407193 0.082488 0.749004 -0.175266
2.566667 1.130580 -1.823805 0.405650 0.005152 0.784035 -0.321615
2.600000 1.128616 -1.796041 0.391642 -0.068468 0.814251 -0.462497
2.633333 1.121070 -1.767555 0.362336 -0.137803 0.839811 -0.594168
2.666667 1.112893 -1.738447 0.323824 -0.202843 0.861025 -0.711865
2.700000 1.104093 -1.708750 0.280360 -0.263979 0.878408 -0.809554
2.733333 1.094681 -1.678495 0.252582 -0.321277 0.892489 -0.883086
2.766667 1.084667 -1.647718 0.223430 -0.375162 0.903675 -0.933904
2.800000 1.074061 -1.616450 0.179460 -0.425799 0.912197 -0.954696
2.833333 1.058870 -1.585406 0.139947 -0.473843 0.918357 -0.946486
2.866667 1.039124 -1.554967 0.103629 -0.519337 0.922389 -0.913839
2.900000 1.018833 -1.524140 0.084949 -0.562123 0.924585 -0.863776
2.933333 0.998019 -1.492957 0.039728 -0.602013 0.925236 -0.799423
2.966667 0.976703 -1.461452 0.011201 -0.638407 0.924437 -0.724276
3.000000 0.954907 -1.429657 -0.012907 -0.670683 0.922250 -0.648511
3.033333 0.930959 -1.398791 -0.039896 -0.698285 0.918673 -0.574947
3.066667 0.905892 -1.368670 -0.050744 -0.721288 0.913775 -0.508102
3.100000 0.880416 -1.338354 -0.058354 -0.739866 0.907437 -0.448558
3.133333 0.854554 -1.307876 -0.058023 -0.754238 0.899459 -0.402825
3.166667 0.828334 -1.277265 -0.070655 -0.764713 0.889879 -0.372650
3.200000 0.801882 -1.247495 -0.074579 -0.771527 0.878805 -0.353124
3.233333 0.775121 -1.217653 -0.087194 -0.774811 0.866141 -0.344602
3.266667 0.747973 -1.187754 -0.091870 -0.774237 0.851474 -0.343846
3.300000 0.721902 -1.159788 -0.102145 -0.769412 0.834529 -0.348748
3.333333 0.695895 -1.132259 -0.128540 -0.759629 0.814783 -0.354137
3.366667 0.670336 -1.105282 -0.136385 -0.744014 0.791470 -0.359029
3.400000 0.644592 -1.078372 -0.151057 -0.721930 0.763807 -0.364569
3.433333 0.619227 -1.052619 -0.169994 -0.692925 0.731445 -0.368410
3.466667 0.593725 -1.026982 -0.183631 -0.656974 0.694466 -0.370338
3.500000 0.569739 -1.002512 -0.202248 -0.614462 0.653021 -0.369577
3.533333 0.547304 -0.979219 -0.196158 -0.566253 0.607673 -0.367402
3.566667 0.526761 -0.957834 -0.201624 -0.513624 0.559442 -0.361785
3.600000 0.508920 -0.938687 -0.207470 -0.457958 0.509513 -0.353353
3.633333 0.494245 -0.922126 -0.221180 -0.400658 0.458949 -0.343207
3.666667 0.483776 -0.909292 -0.254003 -0.343239 0.408932 -0.329146
3.700000 0.477937 -0.900237 -0.280249 -0.287240 0.360508 -0.311443
3.733333 0.472074 -0.891426 -0.286366 -0.234441 0.314446 -0.289142
3.766667 0.466186 -0.882865 -0.281989 -0.186531 0.271196 -0.266141
3.800000 0.460274 -0.874560 -0.291550 -0.144733 0.230861 -0.244606
3.833333 0.454337 -0.866515 -0.296403 -0.109992 0.193011 -0.229630
3.866667 0.452263 -0.861012 -0.304522 -0.082992 0.156626 -0.226736
3.900000 0.453598 -0.857097 -0.316441 -0.064029 0.120563 -0.238204
3.933333 0.454896 -0.853447 -0.322733 -0.052839 0.083870 -0.262814
3.966667 0.456148 -0.850061 -0.310187 -0.049109 0.045439 -0.294303
4.000000 0.457346 -0.846939 -0.307246 -0.052886 0.004266 -0.327643
4.033333 0.457750 -0.846798 -0.305825 -0.064201 -0.039695 -0.353312
4.066667 0.455707 -0.849626 -0.322450 -0.082317 -0.085967 -0.366987
4.100000 0.453591 -0.852706 -0.359366 -0.106181 -0.133863 -0.366938
4.133333 0.451396 -0.856033 -0.404351 -0.134858 -0.182605 -0.355407
4.166667 0.446510 -0.862327 -0.441136 -0.167569 -0.230294 -0.334557
4.200000 0.439953 -0.871147 -0.448063 -0.203111 -0.274698 -0.307895
4.233333 0.432194 -0.882346 -0.445791 -0.240093 -0.314247 -0.285230
4.266667 0.423917 -0.895624 -0.444250 -0.278306 -0.347216 -0.272451
4.300000 0.414608 -0.911328 -0.432662 -0.317844 -0.371771 -0.274513
4.333333 0.403526 -0.928031 -0.439798 -0.358889 -0.385841 -0.291306
4.366667 0.389745 -0.943948 -0.414228 -0.400846 -0.389128 -0.326483
4.400000 0.375899 -0.959986 -0.412368 -0.443497 -0.381629 -0.373095
4.433333 0.361995 -0.976124 -0.427787 -0.486838 -0.363254 -0.416451
4.466667 0.348042 -0.992341 -0.473534 -0.529994 -0.334919 -0.440244
4.500000 0.327635 -1.002374 -0.496883 -0.571710 -0.298446 -0.431865
4.533333 0.307199 -1.012453 -0.530610 -0.610630 -0.256468 -0.382505
4.566667 0.286749 -1.022565 -0.565838 -0.645793 -0.210262 -0.281371
4.600000 0.261824 -1.027247 -0.599175 -0.675791 -0.161707 -0.130989
4.633333 0.236919 -1.031942 -0.618245 -0.699391 -0.112820 0.057799
4.666667 0.209724 -1.032657 -0.633420 -0.715505 -0.065336 0.268410
4.700000 0.182591 -1.033375 -0.623851 -0.724043 -0.019766 0.490880
4.733333 0.155876 -1.032080 -0.582130 -0.725005 0.023621 0.708823
4.766667 0.130823 -1.028894 -0.520404 -0.719028 0.063398 0.905177
4.800000 0.105898 -1.025709 -0.458724 -0.707473 0.099218 1.067529
4.833333 0.081121 -1.022525 -0.413545 -0.691578 0.130896 1.186866
4.866667 0.056512 -1.019344 -0.356907 -0.672976 0.158916 1.259257
4.900000 0.036403 -1.010637 -0.308049 -0.652533 0.182949 1.276858
4.933333 0.016497 -1.001943 -0.265183 -0.630588 0.203131 1.244177
4.966667 -0.003190 -0.993268 -0.222547 -0.606860 0.220375 1.168522
5.000000 -0.022642 -0.984622 -0.187011 -0.580418 0.235145 1.059056
5.033333 -0.041844 -0.976012 -0.129271 -0.550336 0.247903 0.929029
5.066667 -0.060782 -0.967447 -0.095434 -0.515435 0.258693 0.790613
5.100000 -0.079439 -0.958935 -0.054268 -0.474984 0.268070 0.656950
5.133333 -0.097801 -0.950485 -0.029001 -0.429302 0.276065 0.537635
5.166667 -0.115852 -0.942106 -0.045707 -0.378975 0.282407 0.439005
5.200000 -0.133580 -0.933806 -0.042258 -0.325152 0.286836 0.367168
5.233333 -0.143880 -0.923598 -0.059708 -0.269577 0.288927 0.325594
5.266667 -0.148094 -0.912004 -0.068881 -0.214599 0.288312 0.313489
5.300000 -0.151964 -0.900518 -0.063752 -0.162369 0.284495 0.328812
5.333333 -0.152154 -0.889185 -0.067287 -0.114727 0.277331 0.365443
5.366667 -0.152005 -0.877984 -0.036013 -0.073513 0.267038 0.413317
5.400000 -0.150760 -0.868021 -0.013233 -0.040344 0.253922 0.461139
5.433333 -0.148985 -0.859166 0.004875 -0.015668 0.238704 0.496522
5.466667 -0.147539 -0.851843 0.049093 0.001156 0.222378 0.512511
5.500000 -0.147406 -0.846387 0.053958 0.010927 0.206001 0.508474
5.533333 -0.146957 -0.841114 0.088980 0.014954 0.190508 0.480103
5.566667 -0.146196 -0.836031 0.122130 0.015013 0.176409 0.432934
5.600000 -0.145128 -0.831144 0.134503 0.013130 0.163844 0.373733
5.633333 -0.143756 -0.826462 0.135341 0.010777 0.152627 0.310882
5.666667 -0.142085 -0.821991 0.148279 0.008836 0.142220 0.250918
5.700000 -0.143469 -0.816856 0.139442 0.008270 0.131665 0.193486
5.733333 -0.144559 -0.811948 0.128892 0.009791 0.119999 0.147194
5.766667 -0.145356 -0.807275 0.126027 0.013752 0.106610 0.114497
5.800000 -0.145862 -0.802846 0.140927 0.020206 0.091351 0.092238
5.833333 -0.146077 -0.798668 0.152701 0.029172 0.074268 0.076032
5.866667 -0.146003 -0.794750 0.150000 0.040725 0.055523 0.062917
5.900000 -0.145187 -0.792767 0.147800 0.054400 0.035962 0.052672
5.933333 -0.142653 -0.793280 0.143128 0.069595 0.016734 0.040925
5.966667 -0.139836 -0.794069 0.152010 0.085744 -0.001151 0.024950
6.000000 -0.136739 -0.795138 0.163217 0.102353 -0.016779 0.008393
6.033333 -0.132524 -0.797249 0.168200 0.118771 -0.029299 -0.006219
6.066667 -0.127684 -0.799753 0.169058 0.134115 -0.037771 -0.017302
6.100000 -0.122578 -0.802546 0.165051 0.147797 -0.041936 -0.025921
6.133333 -0.117212 -0.805630 0.141307 0.159414 -0.042116 -0.031163
6.166667 -0.111709 -0.807662 0.137525 0.168574 -0.038748 -0.032515
6.200000 -0.105957 -0.809991 0.125131 0.174785 -0.032410 -0.029881
6.233333 -0.099155 -0.811058 0.141016 0.177837 -0.024024 -0.023985
6.266667 -0.091613 -0.811258 0.144421 0.177811 -0.014746 -0.016645
6.300000 -0.083843 -0.811771 0.153641 0.174819 -0.005463 -0.008866
6.333333 -0.076392 -0.811475 0.148373 0.168915 0.003236 -0.002623
6.366667 -0.070012 -0.810329 0.144513 0.160243 0.010887 0.001288
6.400000 -0.065812 -0.808518 0.146740 0.149400 0.017056 0.000681
6.433333 -0.061406 -0.807056 0.152287 0.136940 0.021732 -0.003450
6.466667 -0.056796 -0.805953 0.144264 0.123534 0.025089 -0.008877
6.500000 -0.051985 -0.805219 0.148436 0.109853 0.027304 -0.013427
6.533333 -0.049294 -0.804240 0.142895 0.096732 0.028472 -0.016037
6.566667 -0.046404 -0.803653 0.147950 0.084765 0.028871 -0.017578
6.600000 -0.044860 -0.802838 0.141999 0.074263 0.028705 -0.017680
6.633333 -0.043115 -0.802436 0.140159 0.065360 0.028002 -0.016777
6.666667 -0.041544 -0.801158 0.134562 0.058045 0.026640 -0.017692
6.700000 -0.039770 -0.800317 0.136711 0.052180 0.024389 -0.020518
6.733333 -0.038895 -0.798465 0.142897 0.047271 0.020938 -0.026006
6.766667 -0.037812 -0.797078 0.147563 0.042978 0.015665 -0.032565
6.800000 -0.036518 -0.796170 0.146180 0.038808 0.008091 -0.039386
6.833333 -0.035008 -0.795754 0.144757 0.034485 -0.002120 -0.047246
6.866667 -0.033281 -0.795844 0.135601 0.029669 -0.015087 -0.052059
6.900000 -0.031804 -0.795292 0.134265 0.024320 -0.030810 -0.054312
6.933333 -0.030103 -0.795275 0.133817 0.018551 -0.048932 -0.053445
6.966667 -0.029503 -0.796320 0.135831 0.012540 -0.068829 -0.054199
7.000000 -0.028670 -0.797928 0.118998 0.006604 -0.089860 -0.064018
7.033333 -0.029153 -0.801380 0.119908 0.001158 -0.111421 -0.087621
7.066667 -0.030241 -0.806397 0.110181 -0.003167 -0.133001 -0.131048
7.100000 -0.031470 -0.812242 0.115137 -0.005748 -0.154083 -0.195318
7.133333 -0.032436 -0.818695 0.130519 -0.005749 -0.174509 -0.280236
7.166667 -0.033218 -0.825151 0.128350 -0.002446 -0.194451 -0.377546
7.200000 -0.033722 -0.832235 0.139131 0.005047 -0.214397 -0.477720
7.233333 -0.033940 -0.839958 0.135054 0.017387 -0.235179 -0.571967
7.266667 -0.033865 -0.848331 0.113122 0.034979 -0.257824 -0.653346
7.300000 -0.034308 -0.856302 0.065199 0.057932 -0.283382 -0.715634
7.333333 -0.034360 -0.864146 -0.012905 0.085953 -0.312762 -0.751726
7.366667 -0.033320 -0.872647 -0.074006 0.118706 -0.346638 -0.761554
7.400000 -0.030537 -0.882643 -0.105067 0.155279 -0.385207 -0.744772
7.433333 -0.025430 -0.894536 -0.116605 0.194413 -0.428179 -0.704638
7.466667 -0.017649 -0.908991 -0.125922 0.234559 -0.474820 -0.647406
7.500000 -0.009533 -0.924157 -0.129205 0.274229 -0.524295 -0.582443
7.533333 0.001104 -0.942188 -0.143368 0.311977 -0.575460 -0.521830
7.566667 0.014096 -0.963123 -0.165254 0.346367 -0.627087 -0.472591
7.600000 0.029008 -0.986793 -0.166472 0.376528 -0.678117 -0.440575
7.633333 0.044241 -1.011173 -0.169993 0.402157 -0.727687 -0.424147
7.666667 0.059788 -1.037553 -0.190747 0.423561 -0.775245 -0.419164
7.700000 0.075642 -1.064634 -0.203308 0.441143 -0.820397 -0.421455
7.733333 0.090651 -1.092636 -0.218834 0.455826 -0.863303 -0.425004
7.766667 0.105539 -1.122444 -0.243101 0.468834 -0.904413 -0.425233
7.800000 0.120534 -1.153694 -0.264668 0.481324 -0.944375 -0.418358
7.833333 0.135813 -1.185617 -0.275084 0.494257 -0.983828 -0.406905
7.866667 0.151537 -1.218973 -0.294814 0.508274 -1.023336 -0.390457
7.900000 0.168060 -1.253648 -0.302791 0.523881 -1.063334 -0.367539
7.933333 0.185791 -1.289659 -0.318187 0.540943 -1.103833 -0.339677
7.966667 0.203780 -1.326295 -0.309722 0.558892 -1.144685 -0.312472
8.000000 0.222566 -1.364363 -0.325998 0.576986 -1.185518 -0.287323
8.033333 0.241929 -1.403805 -0.347154 0.594449 -1.225892 -0.264431
8.066667 0.262579 -1.445851 -0.358984 0.610497 -1.265290 -0.248376
8.100000 0.284396 -1.489957 -0.349032 0.624448 -1.303138 -0.243600
8.133333 0.306712 -1.535645 -0.369079 0.635999 -1.338935 -0.249084
8.166667 0.329225 -1.581852 -0.373106 0.645062 -1.372182 -0.260739
8.200000 0.351921 -1.628558 -0.366633 0.651646 -1.402563 -0.280198
8.233333 0.374380 -1.676399 -0.366973 0.655851 -1.429843 -0.307175
8.266667 0.396654 -1.725322 -0.387700 0.657972 -1.454010 -0.339214
8.300000 0.418190 -1.775038 -0.391937 0.658458 -1.475272 -0.371817
8.333333 0.439862 -1.825157 -0.407769 0.657702 -1.494044 -0.405648
8.366667 0.461661 -1.875654 -0.430568 0.656105 -1.510766 -0.439970
8.400000 0.483575 -1.926503 -0.449403 0.654090 -1.525782 -0.471352
8.433333 0.505592 -1.977678 -0.468903 0.651969 -1.539497 -0.498001
8.466667 0.527702 -2.029154 -0.491076 0.649911 -1.552253 -0.519998
8.500000 0.549338 -2.081208 -0.505663 0.647905 -1.564304 -0.538576
8.533333 0.570584 -2.133819 -0.519403 0.645926 -1.575638 -0.552719
8.566667 0.591891 -2.186651 -0.525992 0.643922 -1.586183 -0.562468
8.600000 0.613248 -2.239678 -0.557471 0.641831 -1.595847 -0.565718
8.633333 0.634646 -2.292871 -0.574268 0.639717 -1.604519 -0.563182
8.666667 0.656063 -2.346631 -0.596979 0.637751 -1.612039 -0.549217
8.700000 0.677405 -2.401020 -0.619361 0.636152 -1.618314 -0.522177
8.733333 0.698575 -2.455760 -0.637902 0.635129 -1.623483 -0.480881
8.766667 0.719618 -2.510722 -0.646721 0.634912 -1.627852 -0.427893
8.800000 0.740651 -2.565709 -0.684374 0.635720 -1.631917 -0.368879
8.833333 0.761666 -2.620692 -0.709418 0.637621 -1.636067 -0.304755
8.866667 0.782332 -2.674654 -0.722616 0.640561 -1.640881 -0.243237
8.900000 0.802961 -2.728554 -0.718287 0.644398 -1.646820 -0.188881
8.933333 0.823542 -2.782364 -0.703711 0.648971 -1.654282 -0.148470
8.966667 0.844910 -2.836801 -0.701453 0.653988 -1.663347 -0.120158
9.000000 0.867141 -2.891562 -0.676669 0.659122 -1.673855 -0.107051
9.033333 0.890010 -2.947221 -0.687623 0.664075 -1.685601 -0.108784
9.066667 0.912789 -3.002673 -0.684057 0.668541 -1.697963 -0.124726
9.100000 0.935677 -3.059561 -0.702204 0.672266 -1.710223 -0.147333
9.133333 0.958540 -3.118189 -0.716056 0.674945 -1.721267 -0.166138
9.166667 0.981280 -3.176514 -0.724630 0.676350 -1.729974 -0.176937
9.200000 1.004018 -3.235933 -0.719986 0.676292 -1.735083 -0.170260
9.233333 1.026608 -3.294981 -0.737002 0.674627 -1.735335 -0.141760
9.266667 1.049038 -3.353620 -0.760140 0.671189 -1.729455 -0.084110
9.300000 1.071296 -3.411816 -0.765318 0.665851 -1.716458 -0.002466
9.333333 1.094035 -3.471155 -0.776250 0.658558 -1.695976 0.099974
9.366667 1.116791 -3.529797 -0.768942 0.649239 -1.667711 0.218399
9.400000 1.139242 -3.587686 -0.769626 0.637830 -1.631723 0.348664
9.433333 1.161472 -3.644991 -0.751338 0.624116 -1.587939 0.482794
9.466667 1.182779 -3.699191 -0.737143 0.608085 -1.536991 0.611460
9.500000 1.202696 -3.749665 -0.700810 0.589659 -1.479301 0.731427
9.533333 1.222358 -3.799461 -0.677742 0.568685 -1.414804 0.832599
9.566667 1.241274 -3.846018 -0.622555 0.545166 -1.343828 0.907274
9.600000 1.258992 -3.888799 -0.584115 0.519122 -1.266474 0.951132
9.633333 1.276425 -3.930831 -0.556935 0.490975 -1.183294 0.963264
9.666667 1.293566 -3.972093 -0.512445 0.460956 -1.094179 0.944825
9.700000 1.308915 -4.007683 -0.465606 0.429618 -0.999439 0.898178
9.733333 1.323957 -4.042472 -0.443493 0.397709 -0.900036 0.833683
9.766667 1.336354 -4.070934 -0.394732 0.366096 -0.797280 0.760700
9.800000 1.348435 -4.098576 -0.365094 0.335576 -0.692688 0.682952
9.833333 1.358424 -4.121369 -0.339313 0.306797 -0.588175 0.605018
9.866667 1.366593 -4.138634 -0.354577 0.280533 -0.486356 0.531388
9.900000 1.373576 -4.150909 -0.357658 0.257051 -0.389730 0.465253
9.933333 1.379783 -4.158294 -0.343906 0.236460 -0.300878 0.404726
9.966667 1.386281 -4.161769 -0.338889 0.218390 -0.221754 0.350367
10.000000 1.392465 -4.164467 -0.311214 0.202506 -0.154177 0.303642
10.033333 1.399412 -4.164568 -0.289493 0.188138 -0.099181 0.263633
10.066667 1.406050 -4.163932 -0.275136 0.174540 -0.056996 0.226699
10.100000 1.412382 -4.162583 -0.270143 0.161278 -0.027342 0.189953
10.133333 1.418416 -4.160754 -0.267974 0.148035 -0.009066 0.152693
10.166667 1.424149 -4.158257 -0.262068 0.134799 -0.000586 0.113085
10.200000 1.428905 -4.156324 -0.272514 0.121612 -0.000229 0.073089
10.233333 1.432236 -4.155288 -0.276987 0.108937 -0.006215 0.035458
10.266667 1.434424 -4.155330 -0.263066 0.097244 -0.016796 0.002229
10.300000 1.436285 -4.156904 -0.280589 0.086832 -0.030138 -0.022547
10.333333 1.437872 -4.157911 -0.265576 0.077775 -0.044675 -0.040705
10.366667 1.439190 -4.158369 -0.272462 0.070063 -0.059269 -0.048771
10.400000 1.441018 -4.160661 -0.275329 0.063503 -0.072785 -0.052257
10.433333 1.443237 -4.164843 -0.282665 0.057573 -0.084295 -0.051581
10.466667 1.445842 -4.169888 -0.280820 0.051679 -0.093084 -0.045684
10.500000 1.448203 -4.174440 -0.298244 0.045360 -0.098959 -0.038772
10.533333 1.450325 -4.178509 -0.282994 0.038379 -0.101849 -0.029302
10.566667 1.452213 -4.182106 -0.291808 0.030556 -0.101708 -0.020926
10.600000 1.453836 -4.186253 -0.292681 0.021902 -0.098699 -0.011247
10.633333 1.454701 -4.190162 -0.284874 0.012676 -0.093251 -0.003491
10.666667 1.454350 -4.193494 -0.292685 0.003361 -0.086009 0.001497
10.700000 1.453424 -4.196278 -0.282018 -0.005488 -0.077533 0.003266
10.733333 1.452293 -4.198647 -0.286956 -0.013400 -0.068369 0.004206
10.766667 1.450965 -4.200611 -0.279405 -0.019915 -0.059101 0.003853
10.800000 1.450123 -4.202359 -0.277196 -0.024699 -0.050266 0.001013
10.833333 1.449098 -4.203726 -0.282119 -0.027564 -0.042237 -0.001940
10.866667 1.447897 -4.204721 -0.293667 -0.028648 -0.035135 -0.005478
10.900000 1.446527 -4.205357 -0.287870 -0.028265 -0.029008 -0.007733
10.933333 1.444995 -4.205645 -0.289809 -0.026734 -0.023901 -0.010063
10.966667 1.443308 -4.205597 -0.286627 -0.024415 -0.019775 -0.013214
