t x y theta dxdt dydt dthetadt
0.000000 0.000000 0.000000 -0.293429 -0.003095 -0.007077 -0.004503
0.033333 -0.000095 -0.000295 -0.293792 -0.004030 -0.010610 -0.003827
0.066667 -0.000027 -0.000644 -0.287792 -0.005573 -0.015681 -0.001702
0.100000 -0.000057 -0.000940 -0.284334 -0.008137 -0.023056 0.001431
0.133333 -0.000321 -0.001302 -0.292680 -0.012130 -0.033445 0.004917
0.166667 -0.000651 -0.001779 -0.288751 -0.018039 -0.047764 0.009062
0.200000 -0.001049 -0.002370 -0.288735 -0.026257 -0.066758 0.012998
0.233333 -0.001281 -0.003248 -0.287484 -0.037023 -0.090856 0.014320
0.266667 -0.001592 -0.004720 -0.290743 -0.050295 -0.120415 0.014825
0.300000 -0.001979 -0.007153 -0.294281 -0.065745 -0.155180 0.018700
0.333333 -0.003109 -0.010794 -0.296366 -0.083020 -0.194827 0.029753
0.366667 -0.005271 -0.016318 -0.283714 -0.101492 -0.238283 0.050567
0.400000 -0.009096 -0.024469 -0.275437 -0.120455 -0.284347 0.082290
0.433333 -0.014729 -0.035934 -0.276588 -0.139044 -0.331839 0.128818
0.466667 -0.020430 -0.047495 -0.287480 -0.156498 -0.379063 0.188001
0.500000 -0.027339 -0.063167 -0.287763 -0.172105 -0.424409 0.255579
0.533333 -0.034305 -0.078910 -0.291938 -0.185193 -0.466524 0.326703
0.566667 -0.041325 -0.094706 -0.292226 -0.195348 -0.504688 0.398199
0.600000 -0.048670 -0.115383 -0.268829 -0.202402 -0.538202 0.468318
0.633333 -0.056056 -0.136077 -0.237339 -0.206422 -0.566685 0.529557
0.666667 -0.063477 -0.156769 -0.201166 -0.207257 -0.590152 0.580079
0.700000 -0.070930 -0.177438 -0.166618 -0.204656 -0.609248 0.619152
0.733333 -0.078407 -0.198061 -0.148012 -0.198189 -0.624356 0.651886
0.766667 -0.085143 -0.219964 -0.118481 -0.187416 -0.635604 0.680627
0.800000 -0.091895 -0.241779 -0.104161 -0.171627 -0.643683 0.708621
0.833333 -0.098657 -0.263483 -0.080865 -0.150187 -0.649008 0.743432
0.866667 -0.104707 -0.285895 -0.064199 -0.123021 -0.651869 0.788148
0.900000 -0.110760 -0.308150 -0.054557 -0.090555 -0.651924 0.843812
0.933333 -0.116812 -0.330224 -0.027304 -0.053813 -0.648650 0.899939
0.966667 -0.120442 -0.352304 -0.022936 -0.014122 -0.641328 0.952914
1.000000 -0.121111 -0.374484 0.014942 0.026590 -0.628880 0.997271
1.033333 -0.118246 -0.396697 0.052859 0.065676 -0.609974 1.027672
1.066667 -0.112456 -0.418201 0.136202 0.100615 -0.583491 1.038628
1.100000 -0.106681 -0.439403 0.191843 0.129187 -0.548846 1.031420
1.133333 -0.098677 -0.459858 0.242496 0.149230 -0.505812 1.014302
1.166667 -0.089210 -0.478848 0.271644 0.158995 -0.454786 0.991894
1.200000 -0.079795 -0.497468 0.303553 0.157216 -0.396010 0.966146
1.233333 -0.070473 -0.512684 0.308882 0.144103 -0.330825 0.941162
1.266667 -0.063197 -0.523577 0.318933 0.120326 -0.260615 0.923049
1.300000 -0.058691 -0.529150 0.322225 0.086679 -0.186809 0.910266
1.333333 -0.054287 -0.534296 0.363313 0.044850 -0.111045 0.897991
1.366667 -0.054470 -0.533714 0.375999 -0.002878 -0.035246 0.880607
1.400000 -0.054771 -0.532700 0.422268 -0.054193 0.038359 0.855816
1.433333 -0.055191 -0.531254 0.481260 -0.107452 0.108515 0.816079
1.466667 -0.059755 -0.525777 0.531841 -0.160962 0.173983 0.754989
1.500000 -0.067498 -0.517181 0.588162 -0.213059 0.233914 0.668369
1.533333 -0.077887 -0.506021 0.613547 -0.262390 0.287543 0.560001
1.566667 -0.088388 -0.494454 0.611835 -0.308490 0.335142 0.432906
1.600000 -0.100701 -0.480690 0.605765 -0.350609 0.376997 0.292166
1.633333 -0.114433 -0.465169 0.601571 -0.387795 0.413056 0.148244
1.666667 -0.128251 -0.449281 0.601875 -0.419616 0.443692 0.010355
1.700000 -0.143574 -0.433116 0.602564 -0.445805 0.469411 -0.113237
1.733333 -0.160827 -0.416309 0.604998 -0.466287 0.491119 -0.223299
1.766667 -0.178127 -0.399182 0.584672 -0.480603 0.509340 -0.320542
1.800000 -0.195458 -0.381751 0.563216 -0.488627 0.524767 -0.407873
1.833333 -0.213517 -0.363826 0.551067 -0.490584 0.538266 -0.489912
1.866667 -0.231542 -0.345684 0.540348 -0.486642 0.550423 -0.572215
1.900000 -0.249552 -0.327287 0.523724 -0.477019 0.561605 -0.656813
1.933333 -0.266937 -0.308288 0.497498 -0.462114 0.571817 -0.739086
1.966667 -0.283193 -0.288804 0.467253 -0.442512 0.580750 -0.815533
2.000000 -0.297777 -0.269195 0.450182 -0.418981 0.587930 -0.883669
2.033333 -0.312290 -0.249399 0.420594 -0.392211 0.592823 -0.941096
2.066667 -0.325684 -0.228763 0.382407 -0.362551 0.594370 -0.984816
2.100000 -0.337351 -0.207306 0.335702 -0.330372 0.591467 -1.012444
2.133333 -0.346377 -0.186861 0.282903 -0.295926 0.582845 -1.024456
2.166667 -0.355296 -0.166300 0.242524 -0.259513 0.567697 -1.020688
2.200000 -0.364103 -0.145641 0.202412 -0.221220 0.545204 -0.998797
2.233333 -0.372793 -0.124903 0.169338 -0.181078 0.514538 -0.958945
2.266667 -0.379600 -0.105182 0.153418 -0.139677 0.475997 -0.902019
2.300000 -0.384123 -0.087557 0.127341 -0.097513 0.430182 -0.832626
2.333333 -0.386232 -0.072864 0.097546 -0.055699 0.378848 -0.758501
2.366667 -0.388216 -0.058150 0.066343 -0.015663 0.323776 -0.682703
2.400000 -0.386608 -0.048911 0.022702 0.020249 0.268068 -0.608589
2.433333 -0.384883 -0.039664 0.002020 0.049696 0.214827 -0.538629
2.466667 -0.379651 -0.036827 0.004717 0.070556 0.166995 -0.473875
2.500000 -0.374316 -0.033984 0.001026 0.080940 0.127094 -0.411622
2.533333 -0.367542 -0.036011 -0.005068 0.079678 0.097067 -0.347006
2.566667 -0.360688 -0.038020 -0.015089 0.066420 0.078412 -0.281735
2.600000 -0.353766 -0.040004 -0.023166 0.042184 0.070948 -0.218922
2.633333 -0.346788 -0.041953 -0.036038 0.007872 0.074629 -0.159365
2.666667 -0.344318 -0.042127 -0.057946 -0.034804 0.088273 -0.102764
2.700000 -0.346670 -0.039631 -0.056682 -0.083897 0.110650 -0.054853
2.733333 -0.354514 -0.033607 -0.059823 -0.136291 0.139269 -0.018479
2.766667 -0.362325 -0.027536 -0.062436 -0.189022 0.171861 0.007218
2.800000 -0.370098 -0.021418 -0.051212 -0.239359 0.206423 0.020473
2.833333 -0.377830 -0.015254 -0.022063 -0.284317 0.240658 0.015384
2.866667 -0.390200 -0.006070 -0.009510 -0.321217 0.272932 -0.011788
2.900000 -0.402519 0.003155 -0.011782 -0.347917 0.302109 -0.057943
2.933333 -0.417880 0.015268 -0.010237 -0.363709 0.328177 -0.124001
2.966667 -0.434688 0.029162 -0.019584 -0.367961 0.350992 -0.211229
3.000000 -0.451412 0.043077 -0.028708 -0.359990 0.370610 -0.314609
3.033333 -0.468038 0.057002 -0.043747 -0.338946 0.387128 -0.423781
3.066667 -0.481352 0.070462 -0.051661 -0.305038 0.400654 -0.537291
3.100000 -0.491581 0.083966 -0.060927 -0.258883 0.410964 -0.654006
3.133333 -0.501684 0.097457 -0.092132 -0.201461 0.417890 -0.769052
3.166667 -0.511655 0.110927 -0.144832 -0.133996 0.421237 -0.873874
3.200000 -0.517238 0.125395 -0.160092 -0.058728 0.420811 -0.967508
3.233333 -0.519347 0.140526 -0.190625 0.021206 0.416585 -1.048229
3.266667 -0.517992 0.156155 -0.228302 0.103307 0.408468 -1.106714
3.300000 -0.512897 0.171962 -0.273903 0.185545 0.396425 -1.137706
3.333333 -0.503788 0.187189 -0.317315 0.266237 0.380196 -1.137326
3.366667 -0.490925 0.201038 -0.375238 0.343077 0.360058 -1.110193
3.400000 -0.473948 0.212298 -0.434125 0.414337 0.336592 -1.050565
3.433333 -0.456917 0.223474 -0.470002 0.479076 0.310381 -0.960184
3.466667 -0.439858 0.234560 -0.516398 0.536208 0.282307 -0.845335
3.500000 -0.418301 0.242068 -0.532297 0.584401 0.253525 -0.712234
3.533333 -0.396771 0.249483 -0.562125 0.622713 0.225258 -0.568338
3.566667 -0.375298 0.256801 -0.575876 0.650758 0.198265 -0.420302
3.600000 -0.350140 0.261688 -0.575819 0.668064 0.173028 -0.283143
3.633333 -0.325104 0.266482 -0.583299 0.673780 0.149943 -0.167080
3.666667 -0.298589 0.270280 -0.571308 0.667169 0.129187 -0.080052
3.700000 -0.272219 0.273607 -0.574825 0.648413 0.110471 -0.024335
3.733333 -0.247602 0.276431 -0.559636 0.617806 0.093335 -0.001032
3.766667 -0.224181 0.279048 -0.539976 0.576292 0.077435 -0.005941
3.800000 -0.202857 0.281427 -0.535362 0.525851 0.062308 -0.031153
3.833333 -0.184632 0.283114 -0.522973 0.469308 0.047511 -0.068806
3.866667 -0.166768 0.284733 -0.516321 0.409844 0.032600 -0.110755
3.900000 -0.154445 0.286102 -0.537902 0.350474 0.017319 -0.151844
3.933333 -0.146786 0.286918 -0.555334 0.293989 0.001725 -0.188960
3.966667 -0.142756 0.287188 -0.591147 0.242490 -0.013795 -0.218392
4.000000 -0.140361 0.286438 -0.610130 0.197204 -0.028652 -0.238615
4.033333 -0.138421 0.285649 -0.622522 0.158322 -0.042193 -0.252215
4.066667 -0.135002 0.282794 -0.603005 0.125132 -0.053308 -0.267128
4.100000 -0.132064 0.279918 -0.602971 0.096052 -0.060891 -0.292166
4.133333 -0.129621 0.277032 -0.612534 0.068663 -0.063842 -0.332825
4.166667 -0.125893 0.272918 -0.617973 0.040680 -0.061673 -0.395028
4.200000 -0.122373 0.268800 -0.626563 0.009400 -0.053923 -0.483179
4.233333 -0.119393 0.264707 -0.632297 -0.027496 -0.040188 -0.594553
4.266667 -0.116966 0.260651 -0.640200 -0.071077 -0.020995 -0.718215
4.300000 -0.119539 0.260493 -0.662896 -0.121746 0.002854 -0.846236
4.333333 -0.122693 0.260390 -0.674462 -0.178877 0.030189 -0.975078
4.366667 -0.126436 0.260350 -0.725194 -0.241635 0.059991 -1.102614
4.400000 -0.136139 0.263869 -0.800428 -0.307912 0.090723 -1.225945
4.433333 -0.146445 0.267461 -0.865566 -0.375595 0.120845 -1.346674
4.466667 -0.162278 0.273737 -0.926341 -0.442737 0.149059 -1.468345
4.500000 -0.178713 0.280088 -0.957001 -0.507772 0.174603 -1.592356
4.533333 -0.199837 0.288067 -0.989436 -0.568903 0.196748 -1.716504
4.566667 -0.221550 0.296119 -1.021310 -0.624410 0.214792 -1.840271
4.600000 -0.243844 0.304244 -1.072267 -0.673820 0.228843 -1.962130
4.633333 -0.268427 0.312848 -1.145999 -0.716512 0.238921 -2.078785
4.666667 -0.295355 0.321888 -1.227049 -0.752570 0.245394 -2.187846
4.700000 -0.322829 0.330994 -1.315835 -0.781947 0.248357 -2.282411
4.733333 -0.350959 0.339606 -1.411385 -0.805427 0.248247 -2.356156
4.766667 -0.379607 0.348279 -1.509693 -0.823955 0.245658 -2.399746
4.800000 -0.408423 0.356939 -1.604359 -0.838043 0.240846 -2.412253
4.833333 -0.436807 0.365222 -1.688703 -0.848594 0.234298 -2.396407
4.866667 -0.465665 0.373563 -1.782437 -0.856269 0.226472 -2.352465
4.900000 -0.494036 0.381027 -1.858986 -0.861867 0.217992 -2.285996
4.933333 -0.522853 0.388547 -1.908426 -0.865868 0.209261 -2.202193
4.966667 -0.551968 0.395384 -1.982789 -0.868651 0.200686 -2.110898
5.000000 -0.581157 0.401434 -2.059880 -0.870635 0.192748 -2.013518
5.033333 -0.609970 0.406797 -2.122198 -0.872011 0.185832 -1.907832
5.066667 -0.639177 0.412219 -2.194955 -0.873113 0.180269 -1.798443
5.100000 -0.668764 0.417703 -2.232535 -0.874050 0.176171 -1.689613
5.133333 -0.698344 0.423140 -2.292737 -0.874959 0.173724 -1.585215
5.166667 -0.728279 0.428644 -2.377911 -0.876111 0.172966 -1.483945
5.200000 -0.756622 0.434112 -2.432924 -0.877955 0.173852 -1.389661
5.233333 -0.785296 0.439652 -2.469696 -0.880849 0.176293 -1.307147
5.266667 -0.814291 0.445265 -2.474555 -0.885015 0.180208 -1.238883
5.300000 -0.843193 0.451187 -2.500888 -0.890718 0.185642 -1.182646
5.333333 -0.872394 0.457187 -2.527455 -0.898151 0.192585 -1.139544
5.366667 -0.902079 0.463363 -2.564158 -0.907283 0.201057 -1.113607
5.400000 -0.931993 0.470009 -2.618670 -0.917632 0.210999 -1.102399
5.433333 -0.962173 0.476736 -2.654284 -0.928657 0.222404 -1.103231
5.466667 -0.992662 0.483759 -2.694622 -0.939760 0.235112 -1.107663
5.500000 -1.024477 0.491112 -2.728801 -0.950198 0.249045 -1.114381
5.533333 -1.057495 0.499138 -2.763521 -0.958978 0.264384 -1.117546
5.566667 -1.090624 0.508020 -2.805654 -0.965245 0.281281 -1.111957
5.600000 -1.124240 0.517979 -2.842502 -0.968352 0.299926 -1.096670
5.633333 -1.157201 0.528859 -2.877991 -0.967518 0.320993 -1.069441
5.666667 -1.190340 0.539816 -2.922713 -0.961993 0.345272 -1.031747
5.700000 -1.223645 0.550847 -2.953827 -0.951441 0.373233 -0.982414
5.733333 -1.257103 0.561948 -2.989040 -0.936311 0.404089 -0.922454
5.766667 -1.288833 0.574463 -3.028711 -0.917178 0.437057 -0.852512
5.800000 -1.320692 0.587040 -3.050006 -0.894877 0.471105 -0.775370
5.833333 -1.351090 0.602116 -3.088691 -0.871322 0.503526 -0.696777
5.866667 -1.379187 0.620646 -3.109515 -0.848868 0.531106 -0.630328
5.900000 -1.407388 0.639216 -3.129056 -0.829645 0.550815 -0.585349
5.933333 -1.435685 0.657813 -3.136267 -0.815283 0.561388 -0.575968
5.966667 -1.457880 0.685009 3.135601 -0.807617 0.561012 -0.614171
6.000000 -1.480167 0.712201 -3.139947 -0.808036 0.548569 -0.707241
6.033333 -1.502547 0.739369 3.126346 -0.816801 0.524582 -0.852351
6.066667 -1.527602 0.757075 3.124935 -0.833056 0.491359 -1.034109
6.100000 -1.552743 0.774723 3.117139 -0.855822 0.451367 -1.238761
6.133333 -1.580474 0.787717 3.102399 -0.883510 0.406887 -1.441430
6.166667 -1.610736 0.797178 3.047158 -0.913439 0.361811 -1.617320
6.200000 -1.644017 0.804032 2.948851 -0.942894 0.319863 -1.739500
6.233333 -1.677354 0.810811 2.850363 -0.969199 0.284291 -1.795899
6.266667 -1.713313 0.816917 2.727306 -0.990125 0.256362 -1.778683
6.300000 -1.749302 0.822952 2.613328 -1.003668 0.237046 -1.684303
6.333333 -1.785306 0.828915 2.517046 -1.008750 0.226349 -1.518650
6.366667 -1.821312 0.834811 2.476772 -1.005297 0.223129 -1.295726
6.400000 -1.857304 0.840642 2.452760 -0.993731 0.225815 -1.040356
6.433333 -1.891923 0.848155 2.437901 -0.975189 0.232643 -0.770892
6.466667 -1.924274 0.856938 2.456170 -0.951772 0.242399 -0.510459
6.500000 -1.956576 0.865659 2.461299 -0.925541 0.254036 -0.277424
6.533333 -1.988818 0.874316 2.471769 -0.898381 0.266839 -0.087864
6.566667 -2.017449 0.883140 2.487922 -0.872155 0.280037 0.053343
6.600000 -2.043319 0.892390 2.491153 -0.848701 0.293027 0.152495
6.633333 -2.069111 0.901576 2.484593 -0.829334 0.305518 0.215639
6.666667 -2.093755 0.911679 2.499478 -0.814481 0.317243 0.254338
6.700000 -2.119132 0.923556 2.514564 -0.804417 0.327569 0.277661
6.733333 -2.144425 0.935361 2.514151 -0.799218 0.335707 0.297762
6.766667 -2.169631 0.947089 2.531725 -0.798391 0.341098 0.321490
6.800000 -2.196093 0.959451 2.547658 -0.800858 0.342922 0.351170
6.833333 -2.223235 0.972037 2.554286 -0.805586 0.340194 0.390556
6.866667 -2.250772 0.984619 2.561168 -0.811296 0.331870 0.442248
6.900000 -2.278452 0.996887 2.569131 -0.816600 0.317313 0.509850
6.933333 -2.306024 1.009053 2.586351 -0.820051 0.296091 0.590433
6.966667 -2.333483 1.021112 2.602597 -0.820502 0.267477 0.681898
7.000000 -2.361554 1.032054 2.625256 -0.817234 0.231487 0.779307
7.033333 -2.390108 1.040896 2.644767 -0.809608 0.188362 0.871681
7.066667 -2.418261 1.046943 2.671852 -0.797776 0.139017 0.948010
7.100000 -2.446276 1.052876 2.699870 -0.782413 0.084584 0.995688
7.133333 -2.473918 1.055262 2.748094 -0.764617 0.026841 1.008370
7.166667 -2.501408 1.057541 2.812935 -0.745631 -0.031763 0.978248
7.200000 -2.526327 1.055716 2.868910 -0.726893 -0.088956 0.903576
7.233333 -2.548878 1.050378 2.927476 -0.710062 -0.142540 0.789234
7.266667 -2.569506 1.041945 2.968114 -0.696509 -0.190476 0.638003
7.300000 -2.589766 1.030238 2.988272 -0.687189 -0.230418 0.452878
7.333333 -2.609864 1.018496 3.002260 -0.682585 -0.260661 0.234447
7.366667 -2.629802 1.006741 2.983640 -0.682832 -0.279647 -0.009951
7.400000 -2.651081 0.994135 2.969024 -0.687471 -0.286346 -0.281097
7.433333 -2.673798 0.981454 2.942538 -0.695356 -0.279636 -0.578286
7.466667 -2.697842 0.969741 2.933971 -0.704860 -0.259319 -0.896653
7.500000 -2.723053 0.959683 2.902481 -0.714258 -0.226471 -1.226938
7.533333 -2.748099 0.949718 2.887892 -0.721955 -0.182174 -1.558455
7.566667 -2.772974 0.939866 2.870540 -0.726673 -0.128177 -1.890044
7.600000 -2.798917 0.933016 2.812034 -0.727512 -0.066085 -2.207833
7.633333 -2.825195 0.929825 2.708542 -0.724278 0.001590 -2.501312
7.666667 -2.850817 0.930957 2.592572 -0.717319 0.072628 -2.759394
7.700000 -2.875015 0.936970 2.465458 -0.707394 0.145166 -2.975849
7.733333 -2.899022 0.943153 2.309002 -0.695452 0.216877 -3.143370
7.766667 -2.921249 0.955485 2.177280 -0.682521 0.285139 -3.249277
7.800000 -2.943280 0.967983 2.070501 -0.669780 0.347291 -3.294841
7.833333 -2.965111 0.980644 1.957339 -0.658159 0.401520 -3.284731
7.866667 -2.985662 0.997546 1.867852 -0.648584 0.445968 -3.230744
7.900000 -3.006012 1.014596 1.743766 -0.641608 0.479590 -3.141977
7.933333 -3.026481 1.034177 1.638602 -0.637580 0.501739 -3.034368
7.966667 -3.047130 1.055399 1.526700 -0.636441 0.513044 -2.919726
8.000000 -3.067573 1.076731 1.446465 -0.637818 0.514484 -2.804576
8.033333 -3.088122 1.097298 1.354431 -0.641353 0.506738 -2.688976
8.066667 -3.108975 1.116434 1.265821 -0.646286 0.491609 -2.564445
8.100000 -3.130261 1.133317 1.181278 -0.651933 0.470639 -2.423841
8.133333 -3.152731 1.147971 1.107779 -0.657631 0.445842 -2.253384
8.166667 -3.174978 1.162679 1.026993 -0.662971 0.418813 -2.048058
8.200000 -3.198286 1.173496 0.965637 -0.667552 0.391287 -1.805663
8.233333 -3.221360 1.184356 0.884213 -0.670858 0.365337 -1.531361
8.266667 -3.244193 1.195257 0.798387 -0.672659 0.342110 -1.240672
8.300000 -3.266778 1.206194 0.745861 -0.672744 0.322442 -0.954069
8.333333 -3.289111 1.217167 0.700561 -0.671028 0.306576 -0.693747
8.366667 -3.311813 1.225554 0.680967 -0.667335 0.294812 -0.479073
8.400000 -3.334249 1.233972 0.714676 -0.661673 0.286867 -0.325601
8.433333 -3.356412 1.242423 0.766073 -0.654205 0.282280 -0.244476
8.466667 -3.378818 1.250924 0.828773 -0.645022 0.280780 -0.238331
8.500000 -3.400961 1.259654 0.879736 -0.634346 0.282175 -0.299343
8.533333 -3.422811 1.268415 0.881380 -0.622329 0.286464 -0.416522
8.566667 -3.443581 1.277732 0.850516 -0.609310 0.293200 -0.573486
8.600000 -3.464044 1.287080 0.794971 -0.595625 0.302128 -0.746908
8.633333 -3.483153 1.297337 0.725957 -0.581635 0.312842 -0.911216
8.666667 -3.501946 1.307622 0.667401 -0.567770 0.324796 -1.047024
8.700000 -3.520419 1.317933 0.619501 -0.554344 0.337444 -1.140012
8.733333 -3.538130 1.329209 0.557653 -0.541710 0.350158 -1.182173
8.766667 -3.555495 1.341208 0.503973 -0.530011 0.362515 -1.174818
8.800000 -3.572656 1.354069 0.473334 -0.519306 0.374048 -1.127562
8.833333 -3.589649 1.367581 0.449242 -0.509464 0.384422 -1.057110
8.866667 -3.606304 1.381100 0.420053 -0.500328 0.393351 -0.972750
8.900000 -3.622780 1.394889 0.397424 -0.491722 0.400549 -0.884938
8.933333 -3.639290 1.408930 0.367697 -0.483324 0.405821 -0.804095
8.966667 -3.655449 1.422961 0.344808 -0.474856 0.409032 -0.732556
9.000000 -3.671253 1.436974 0.301947 -0.466030 0.410225 -0.671959
9.033333 -3.686700 1.450964 0.292257 -0.456668 0.409483 -0.617148
9.066667 -3.701784 1.464925 0.278085 -0.446565 0.406936 -0.568032
9.100000 -3.716503 1.478851 0.253453 -0.435582 0.402783 -0.525247
9.133333 -3.731204 1.492654 0.254611 -0.423733 0.397298 -0.484138
9.166667 -3.745501 1.506133 0.227408 -0.411103 0.390723 -0.445606
9.200000 -3.759552 1.519303 0.211472 -0.397785 0.383244 -0.407528
9.233333 -3.773019 1.532270 0.214851 -0.383917 0.375029 -0.372759
9.266667 -3.785606 1.544560 0.186261 -0.369681 0.366227 -0.339587
9.300000 -3.797411 1.556355 0.185217 -0.355263 0.356988 -0.307587
9.333333 -3.808829 1.568079 0.160478 -0.340833 0.347378 -0.278035
9.366667 -3.819657 1.579234 0.160294 -0.326543 0.337564 -0.248641
9.400000 -3.830094 1.590311 0.158034 -0.312573 0.327594 -0.223834
9.433333 -3.840138 1.601308 0.139587 -0.299002 0.317496 -0.199695
9.466667 -3.849790 1.612222 0.151192 -0.285838 0.307293 -0.182211
9.500000 -3.859045 1.622193 0.127830 -0.273025 0.297010 -0.166090
9.533333 -3.867904 1.632077 0.141798 -0.260477 0.286679 -0.153200
9.566667 -3.876473 1.641426 0.133050 -0.248065 0.276237 -0.145386
9.600000 -3.884562 1.650085 0.135583 -0.235608 0.265775 -0.137987
9.633333 -3.892255 1.658652 0.125990 -0.223017 0.255421 -0.132877
9.666667 -3.899551 1.667127 0.105699 -0.210238 0.245302 -0.122123
9.700000 -3.906452 1.675510 0.118835 -0.197249 0.235441 -0.113766
9.733333 -3.913066 1.682887 0.105110 -0.184021 0.225935 -0.100419
9.766667 -3.918873 1.689805 0.099928 -0.170425 0.216794 -0.079417
9.800000 -3.924286 1.696633 0.090042 -0.156395 0.207996 -0.050761
9.833333 -3.929305 1.703372 0.106865 -0.141772 0.199450 -0.016083
9.866667 -3.933932 1.710023 0.096898 -0.126373 0.191044 0.020159
9.900000 -3.938169 1.716588 0.088804 -0.109969 0.182690 0.062584
9.933333 -3.941607 1.722225 0.094417 -0.092386 0.174215 0.102766
9.966667 -3.944659 1.727781 0.101004 -0.073757 0.165499 0.134789
10.000000 -3.947328 1.733257 0.101818 -0.054186 0.156402 0.156171
10.033333 -3.949616 1.738657 0.107361 -0.033986 0.146732 0.168479
10.066667 -3.951528 1.743982 0.129964 -0.013519 0.136343 0.170962
10.100000 -3.951049 1.748247 0.144767 0.006692 0.125074 0.160788
10.133333 -3.950203 1.752445 0.152470 0.026201 0.112696 0.142215
10.166667 -3.948266 1.756167 0.168826 0.044729 0.099150 0.121426
10.200000 -3.945671 1.759549 0.169046 0.061972 0.084397 0.099597
10.233333 -3.942184 1.762313 0.161023 0.077811 0.068659 0.077607
10.266667 -3.938357 1.765029 0.162111 0.092575 0.051869 0.060518
10.300000 -3.934753 1.766615 0.137011 0.106827 0.034236 0.056522
10.333333 -3.930824 1.768165 0.140166 0.121530 0.015908 0.064322
10.366667 -3.927579 1.768236 0.147373 0.137806 -0.003004 0.079962
10.400000 -3.924026 1.768288 0.160238 0.157105 -0.022507 0.100714
10.433333 -3.918990 1.765976 0.148791 0.180975 -0.042695 0.123837
10.466667 -3.913661 1.763664 0.162217 0.210226 -0.063131 0.139547
10.500000 -3.908048 1.761363 0.169418 0.245585 -0.083656 0.135719
10.533333 -3.902162 1.759085 0.170824 0.286907 -0.103851 0.113463
10.566667 -3.896012 1.756840 0.177156 0.333807 -0.123507 0.079483
10.600000 -3.884506 1.751502 0.209313 0.384472 -0.141661 0.040457
10.633333 -3.872761 1.746225 0.229975 0.436843 -0.157557 0.004262
10.666667 -3.855573 1.739461 0.233506 0.488625 -0.170594 -0.010397
10.700000 -3.838183 1.732790 0.206622 0.536898 -0.179754 0.022633
10.733333 -3.817240 1.725364 0.186805 0.578509 -0.183825 0.117732
10.766667 -3.793817 1.717217 0.169488 0.609895 -0.181201 0.284321
10.800000 -3.768901 1.709341 0.137396 0.629164 -0.171286 0.535956
10.833333 -3.742815 1.701783 0.116863 0.634353 -0.153164 0.871662
10.866667 -3.716664 1.694406 0.126626 0.624500 -0.126177 1.274750
10.900000 -3.690480 1.687228 0.154374 0.599813 -0.090107 1.705593
10.933333 -3.669278 1.684140 0.200118 0.562427 -0.045479 2.127793
10.966667 -3.648102 1.681279 0.289203 0.515682 0.006880 2.502561
11.000000 -3.626978 1.678655 0.395097 0.462694 0.066234 2.781553
11.033333 -3.611816 1.680530 0.580808 0.407428 0.131081 2.931317
11.066667 -3.601441 1.685794 0.749904 0.354159 0.200078 2.934034
11.100000 -3.594851 1.693762 0.922549 0.307160 0.271755 2.792007
11.133333 -3.590640 1.705041 1.112999 0.269082 0.344858 2.513677
11.166667 -3.587623 1.719142 1.223477 0.241770 0.417673 2.119467
11.200000 -3.584745 1.733489 1.283211 0.226978 0.488954 1.644954
11.233333 -3.580981 1.751286 1.288356 0.225287 0.558283 1.134613
11.266667 -3.575567 1.772374 1.266799 0.235638 0.624926 0.628307
11.300000 -3.568004 1.796761 1.248936 0.255475 0.688103 0.163423
11.333333 -3.560616 1.821347 1.206170 0.282422 0.747483 -0.225936
11.366667 -3.553414 1.846112 1.184074 0.314109 0.803418 -0.518375
11.400000 -3.542237 1.874566 1.136923 0.347226 0.855435 -0.708127
11.433333 -3.526982 1.906310 1.079405 0.378389 0.902379 -0.805372
11.466667 -3.511964 1.938172 1.047615 0.404941 0.943267 -0.823301
11.500000 -3.497203 1.970124 0.999324 0.425375 0.977574 -0.777853
11.533333 -3.480043 2.004754 0.966116 0.438154 1.004307 -0.681022
11.566667 -3.462148 2.041670 0.958333 0.441340 1.021215 -0.534289
11.600000 -3.444579 2.078593 0.932685 0.434207 1.027072 -0.338660
11.633333 -3.427933 2.116221 0.925723 0.416951 1.021171 -0.097231
11.666667 -3.411662 2.153792 0.915027 0.390099 1.003120 0.185665
11.700000 -3.395787 2.191273 0.939065 0.353848 0.972216 0.500096
11.733333 -3.382025 2.227368 0.923914 0.308974 0.928101 0.826334
11.766667 -3.371172 2.260632 0.926172 0.257457 0.872465 1.128153
11.800000 -3.364527 2.289176 0.944157 0.201107 0.806989 1.381096
11.833333 -3.358352 2.317515 0.956579 0.141609 0.733654 1.570786
11.866667 -3.352661 2.345625 1.065797 0.080644 0.654458 1.680864
11.900000 -3.352425 2.363108 1.291294 0.020571 0.572135 1.697828
11.933333 -3.352691 2.380329 1.410519 -0.036716 0.489406 1.623299
11.966667 -3.356627 2.393370 1.498879 -0.089904 0.408226 1.473790
12.000000 -3.362930 2.403798 1.539830 -0.138040 0.329956 1.260011
12.033333 -3.370931 2.412345 1.555205 -0.180099 0.255786 0.991628
12.066667 -3.379697 2.418139 1.556094 -0.214930 0.187082 0.694052
12.100000 -3.389072 2.420093 1.544091 -0.242144 0.124663 0.405537
12.133333 -3.398953 2.421769 1.526316 -0.261237 0.069241 0.148123
12.166667 -3.409340 2.423173 1.497081 -0.271873 0.021321 -0.061488
12.200000 -3.420231 2.424312 1.463529 -0.273951 -0.018543 -0.204545
12.233333 -3.430858 2.420339 1.448938 -0.267751 -0.049805 -0.275491
12.266667 -3.441984 2.416120 1.477292 -0.254126 -0.072671 -0.288192
12.300000 -3.452961 2.409448 1.501989 -0.234123 -0.087739 -0.267465
12.333333 -3.463058 2.402164 1.455080 -0.208913 -0.095586 -0.230870
12.366667 -3.471274 2.395723 1.407799 -0.180112 -0.097055 -0.199061
12.400000 -3.476848 2.391088 1.376445 -0.149336 -0.092999 -0.192466
12.433333 -3.479375 2.388899 1.351965 -0.118648 -0.085167 -0.207403
12.466667 -3.482421 2.386544 1.400907 -0.089829 -0.074940 -0.229110
12.500000 -3.482625 2.385901 1.459003 -0.064747 -0.063573 -0.244050
12.533333 -3.483370 2.385111 1.510528 -0.045035 -0.052388 -0.245813
12.566667 -3.481206 2.384667 1.478954 -0.031932 -0.042418 -0.216273
12.600000 -3.479614 2.384092 1.419200 -0.026143 -0.034362 -0.139255
12.633333 -3.478609 2.383392 1.361223 -0.027553 -0.028035 -0.017962
12.666667 -3.478209 2.382575 1.327923 -0.036034 -0.023252 0.141799
12.700000 -3.478429 2.381647 1.271080 -0.051073 -0.019434 0.338027
12.733333 -3.479285 2.380617 1.252643 -0.072264 -0.015970 0.568183
12.766667 -3.480791 2.379492 1.301005 -0.098818 -0.012253 0.809010
12.800000 -3.482963 2.378278 1.383141 -0.130197 -0.007845 1.033501
12.833333 -3.488457 2.378663 1.450796 -0.166285 -0.002608 1.226029
12.866667 -3.494644 2.378971 1.539745 -0.206960 0.003593 1.369982
12.900000 -3.501533 2.379209 1.619228 -0.251657 0.010546 1.449165
12.933333 -3.509136 2.379382 1.694341 -0.299940 0.018099 1.457758
12.966667 -3.517462 2.379494 1.760586 -0.351764 0.026169 1.411619
13.000000 -3.526521 2.379553 1.812095 -0.407153 0.034867 1.331861
13.033333 -3.543145 2.381642 1.833036 -0.465304 0.044295 1.230109
13.066667 -3.560514 2.383683 1.845378 -0.525413 0.054556 1.124063
13.100000 -3.578627 2.385678 1.846314 -0.586892 0.066140 1.029834
13.133333 -3.597486 2.387632 1.861193 -0.649116 0.079604 0.958110
13.166667 -3.621251 2.390216 1.916933 -0.711062 0.095413 0.906346
13.200000 -3.645756 2.392762 1.942950 -0.771565 0.113645 0.869948
13.233333 -3.673413 2.395465 1.974105 -0.830719 0.134740 0.848774
13.266667 -3.703339 2.398846 2.003522 -0.888494 0.159078 0.837634
13.300000 -3.735301 2.403540 2.054129 -0.945029 0.186410 0.827718
13.333333 -3.768823 2.410496 2.089646 -1.000085 0.215974 0.814027
13.366667 -3.803033 2.417412 2.102019 -1.053885 0.246854 0.799590
13.400000 -3.837918 2.424285 2.116073 -1.106721 0.278323 0.788527
13.433333 -3.874119 2.434061 2.135939 -1.158593 0.308982 0.783920
13.466667 -3.913597 2.446064 2.156863 -1.209554 0.337223 0.785051
13.500000 -3.955756 2.460255 2.198245 -1.259383 0.361792 0.796587
13.533333 -3.998518 2.474370 2.204380 -1.308343 0.381944 0.822527
13.566667 -4.044220 2.489818 2.228633 -1.356415 0.396913 0.858667
13.600000 -4.090477 2.505164 2.262108 -1.403619 0.405858 0.899557
13.633333 -4.139535 2.519985 2.293190 -1.449255 0.408667 0.940054
13.666667 -4.189091 2.534678 2.326507 -1.493082 0.405754 0.980430
13.700000 -4.239118 2.549230 2.362152 -1.535409 0.397636 1.020885
13.733333 -4.289586 2.563627 2.401857 -1.576363 0.384613 1.055656
13.766667 -4.344273 2.577281 2.453489 -1.615970 0.367357 1.085445
13.800000 -4.399536 2.589083 2.472204 -1.654269 0.346563 1.113752
13.833333 -4.455138 2.600694 2.511598 -1.691943 0.322565 1.142590
13.866667 -4.512518 2.611304 2.555272 -1.729093 0.295164 1.172701
13.900000 -4.571237 2.621216 2.589991 -1.765384 0.263671 1.200932
13.933333 -4.630635 2.629945 2.629242 -1.800299 0.227743 1.230956
13.966667 -4.690223 2.638449 2.669052 -1.833847 0.186788 1.259948
14.000000 -4.752117 2.645735 2.697154 -1.865724 0.140506 1.285410
14.033333 -4.815648 2.651199 2.750732 -1.895311 0.088770 1.304682
14.066667 -4.880844 2.654455 2.798591 -1.922069 0.032291 1.316280
14.100000 -4.946058 2.657464 2.856269 -1.945224 -0.026780 1.319534
14.133333 -5.012492 2.656839 2.902922 -1.964109 -0.086330 1.311749
14.166667 -5.078851 2.655968 2.952131 -1.977316 -0.143963 1.296880
14.200000 -5.146353 2.649550 2.996509 -1.983786 -0.197149 1.271912
14.233333 -5.214601 2.635611 3.031228 -1.982647 -0.243023 1.240190
14.266667 -5.282628 2.621453 3.093340 -1.972897 -0.279357 1.199416
14.300000 -5.350384 2.607093 3.100867 -1.954321 -0.305373 1.155372
14.333333 -5.417823 2.592547 -3.134089 -1.926387 -0.320816 1.106313
14.366667 -5.484894 2.577833 -3.101518 -1.889426 -0.325910 1.053516
14.400000 -5.551552 2.562967 -3.064870 -1.843811 -0.321690 1.001817
14.433333 -5.613013 2.553186 -3.033141 -1.789670 -0.310949 0.952577
14.466667 -5.673972 2.543283 -2.981274 -1.727776 -0.296454 0.916727
14.500000 -5.729261 2.536075 -2.955214 -1.658942 -0.280778 0.894767
14.533333 -5.783970 2.528768 -2.934703 -1.584878 -0.266154 0.897918
14.566667 -5.838064 2.521369 -2.911656 -1.506619 -0.254805 0.928760
14.600000 -5.886880 2.514699 -2.900255 -1.425483 -0.248576 0.992254
14.633333 -5.935018 2.507956 -2.875259 -1.343272 -0.247374 1.085039
14.666667 -5.976493 2.500805 -2.860379 -1.261786 -0.250925 1.199157
14.700000 -6.017237 2.493598 -2.826509 -1.181968 -0.258480 1.325505
14.733333 -6.057229 2.486344 -2.799690 -1.104079 -0.269092 1.450780
14.766667 -6.088375 2.476337 -2.753957 -1.029551 -0.281143 1.565253
14.800000 -6.118736 2.466304 -2.661146 -0.959044 -0.292877 1.651989
14.833333 -6.148301 2.456256 -2.568194 -0.892630 -0.302897 1.706404
14.866667 -6.177059 2.446205 -2.484934 -0.829308 -0.309704 1.721305
14.900000 -6.201993 2.433496 -2.405190 -0.768747 -0.311810 1.699310
14.933333 -6.226103 2.420809 -2.330047 -0.710624 -0.307852 1.645001
14.966667 -6.249384 2.408159 -2.305697 -0.652684 -0.296805 1.567609
15.000000 -6.270461 2.396572 -2.253723 -0.593170 -0.277801 1.485423
15.033333 -6.290702 2.385049 -2.212760 -0.530691 -0.250268 1.413111
15.066667 -6.307885 2.376264 -2.186735 -0.464847 -0.214106 1.366103
15.100000 -6.324231 2.367564 -2.145664 -0.394737 -0.169666 1.350413
15.133333 -6.339741 2.358961 -2.118758 -0.320005 -0.117740 1.370005
15.166667 -6.350807 2.354065 -2.096093 -0.241939 -0.059889 1.419243
15.200000 -6.357320 2.353286 -2.065934 -0.161914 0.002158 1.490523
15.233333 -6.363019 2.352621 -2.007455 -0.081628 0.066364 1.571180
15.266667 -6.363586 2.355979 -1.941679 -0.003056 0.130459 1.647103
15.300000 -6.359354 2.363564 -1.872569 0.071245 0.192051 1.709415
15.333333 -6.354359 2.371253 -1.796681 0.139085 0.249073 1.747561
15.366667 -6.345771 2.382813 -1.719642 0.198658 0.299803 1.756153
15.400000 -6.334050 2.398217 -1.651735 0.248102 0.342393 1.727095
15.433333 -6.321643 2.413688 -1.588130 0.286105 0.375257 1.659624
15.466667 -6.308578 2.429208 -1.531592 0.312489 0.397679 1.557372
15.500000 -6.294885 2.444761 -1.482376 0.327345 0.409126 1.424055
15.533333 -6.280594 2.460329 -1.429731 0.330781 0.409073 1.266401
15.566667 -6.267532 2.476263 -1.380794 0.323578 0.397513 1.090982
15.600000 -6.256223 2.491469 -1.347489 0.307356 0.375315 0.908512
15.633333 -6.244399 2.506637 -1.318581 0.283594 0.343392 0.728587
15.666667 -6.232085 2.521751 -1.300697 0.253227 0.302282 0.560523
15.700000 -6.223164 2.533294 -1.279979 0.218157 0.253522 0.414528
15.733333 -6.218240 2.539941 -1.288189 0.180659 0.199061 0.302869
15.766667 -6.212889 2.546492 -1.288868 0.143060 0.141220 0.239610
15.800000 -6.207128 2.552941 -1.295587 0.107124 0.082067 0.235692
15.833333 -6.205884 2.553072 -1.304713 0.075277 0.024320 0.298039
15.866667 -6.204259 2.553090 -1.316981 0.050149 -0.029298 0.427849
15.900000 -6.205905 2.548438 -1.328355 0.033308 -0.076796 0.620785
15.933333 -6.209560 2.540218 -1.341215 0.025767 -0.116707 0.865686
15.966667 -6.212858 2.531898 -1.316181 0.027776 -0.148281 1.141805
16.000000 -6.215804 2.523484 -1.280549 0.039302 -0.171121 1.426701
16.033333 -6.216558 2.515053 -1.213811 0.058371 -0.186206 1.693299
16.066667 -6.216974 2.506546 -1.146631 0.082580 -0.194548 1.919686
16.100000 -6.213467 2.499795 -1.042864 0.109087 -0.197776 2.083831
16.133333 -6.209645 2.492985 -0.934491 0.134343 -0.197592 2.164841
16.166667 -6.202489 2.487647 -0.803996 0.154848 -0.195676 2.152152
16.200000 -6.192508 2.482379 -0.703134 0.167429 -0.193500 2.040586
16.233333 -6.182260 2.477072 -0.616166 0.170795 -0.191729 1.835032
16.266667 -6.171764 2.471730 -0.547262 0.163384 -0.190880 1.545984
16.300000 -6.161038 2.466359 -0.501997 0.144551 -0.190785 1.195538
16.333333 -6.153301 2.459640 -0.459313 0.115486 -0.191103 0.814623
16.366667 -6.150786 2.451989 -0.434346 0.078348 -0.191161 0.433334
16.400000 -6.148085 2.444326 -0.421616 0.035460 -0.190379 0.075555
16.433333 -6.145207 2.436660 -0.431574 -0.011281 -0.188286 -0.239108
16.466667 -6.150328 2.430353 -0.485752 -0.057943 -0.184809 -0.500907
16.500000 -6.155283 2.424053 -0.546017 -0.100430 -0.179938 -0.709088
16.533333 -6.160071 2.417768 -0.608289 -0.135862 -0.173773 -0.865289
16.566667 -6.164694 2.411503 -0.685816 -0.162523 -0.166692 -0.969921
16.600000 -6.175051 2.406941 -0.713000 -0.178428 -0.159221 -1.022687
16.633333 -6.185237 2.402408 -0.728389 -0.181436 -0.151775 -1.023614
16.666667 -6.195245 2.397909 -0.721410 -0.171573 -0.144363 -0.973669
16.700000 -6.205070 2.393448 -0.737053 -0.149377 -0.137196 -0.873242
16.733333 -6.214705 2.389029 -0.771061 -0.115136 -0.130375 -0.732113
16.766667 -6.222087 2.384327 -0.832933 -0.068469 -0.124004 -0.564044
16.800000 -6.224850 2.379600 -0.907874 -0.010364 -0.117905 -0.376056
16.833333 -6.221829 2.376007 -0.966671 0.057315 -0.112349 -0.177338
16.866667 -6.218618 2.372476 -0.957475 0.132861 -0.107774 0.024130
16.900000 -6.215223 2.369013 -0.930367 0.214166 -0.104483 0.216364
16.933333 -6.211653 2.365620 -0.884344 0.299112 -0.102779 0.390466
16.966667 -6.201804 2.363024 -0.839387 0.384614 -0.102860 0.536497
17.000000 -6.186545 2.360780 -0.789459 0.468374 -0.105096 0.639182
17.033333 -6.165976 2.358364 -0.746192 0.547956 -0.109495 0.690022
17.066667 -6.145301 2.356036 -0.718895 0.620964 -0.116285 0.688655
17.100000 -6.119759 2.352471 -0.696057 0.685039 -0.125604 0.641456
17.133333 -6.094170 2.349002 -0.662094 0.737835 -0.137585 0.558667
17.166667 -6.063210 2.343051 -0.658544 0.777005 -0.151983 0.453054
17.200000 -6.032272 2.337207 -0.638440 0.799894 -0.168240 0.329294
17.233333 -6.001392 2.331478 -0.638808 0.805222 -0.185483 0.186714
17.266667 -5.970607 2.325871 -0.648415 0.792537 -0.202350 0.009539
17.300000 -5.939955 2.320393 -0.657939 0.762200 -0.217700 -0.211747
17.333333 -5.909474 2.315050 -0.646698 0.713914 -0.230027 -0.481911
17.366667 -5.882304 2.305874 -0.641090 0.649656 -0.238237 -0.805745
17.400000 -5.860208 2.293929 -0.639253 0.573059 -0.241535 -1.173892
17.433333 -5.838379 2.282149 -0.653790 0.487078 -0.239440 -1.572890
17.466667 -5.816844 2.270547 -0.669472 0.393984 -0.231593 -1.967694
17.500000 -5.805335 2.260641 -0.706417 0.296230 -0.217554 -2.338889
17.533333 -5.804191 2.254032 -0.816452 0.198364 -0.197768 -2.669100
17.566667 -5.803390 2.247629 -0.962581 0.103194 -0.172912 -2.936163
17.600000 -5.802937 2.241441 -1.223302 0.012070 -0.143758 -3.108807
17.633333 -5.802835 2.235477 -1.394307 -0.073664 -0.111083 -3.168023
17.666667 -5.811271 2.234170 -1.483915 -0.151080 -0.076207 -3.114915
17.700000 -5.820057 2.233095 -1.562316 -0.218052 -0.040398 -2.942156
17.733333 -5.829188 2.232253 -1.669805 -0.274289 -0.004327 -2.649660
17.766667 -5.838657 2.231648 -1.776638 -0.318998 0.031346 -2.250703
17.800000 -5.851944 2.232820 -1.848571 -0.351084 0.065807 -1.789266
17.833333 -5.868408 2.235438 -1.938105 -0.369142 0.098000 -1.295637
17.866667 -5.886437 2.239680 -1.991704 -0.374031 0.127233 -0.795282
17.900000 -5.904428 2.245330 -1.999377 -0.366777 0.152686 -0.320327
17.933333 -5.920434 2.252842 -1.973374 -0.348523 0.173379 0.094192
17.966667 -5.936701 2.260575 -1.955081 -0.321301 0.188557 0.419991
18.000000 -5.949323 2.269558 -1.919348 -0.287869 0.197772 0.643917
18.033333 -5.958005 2.278809 -1.853514 -0.252268 0.201179 0.747712
18.066667 -5.963055 2.287558 -1.746243 -0.217966 0.199374 0.724558
18.100000 -5.964651 2.295062 -1.651467 -0.188652 0.193461 0.576624
18.133333 -5.966480 2.302757 -1.568410 -0.167648 0.184935 0.315388
18.166667 -5.967526 2.308915 -1.550494 -0.157807 0.175801 -0.039096
18.200000 -5.969414 2.312665 -1.602775 -0.160980 0.168326 -0.453030
18.233333 -5.971544 2.316593 -1.654877 -0.177428 0.164321 -0.886871
18.266667 -5.973917 2.320699 -1.676227 -0.206695 0.165140 -1.309336
18.300000 -5.980030 2.323506 -1.732593 -0.246794 0.171559 -1.690853
18.333333 -5.986387 2.326487 -1.831416 -0.295542 0.184186 -2.005194
18.366667 -5.996343 2.330958 -1.959102 -0.349894 0.202621 -2.233460
18.400000 -6.006534 2.335598 -2.056327 -0.407223 0.225938 -2.380911
18.433333 -6.020809 2.342583 -2.168636 -0.465202 0.253133 -2.455372
18.466667 -6.039285 2.351803 -2.257311 -0.521617 0.283489 -2.465811
18.500000 -6.062143 2.364077 -2.349650 -0.575073 0.316551 -2.425635
18.533333 -6.085184 2.376492 -2.420477 -0.623922 0.351393 -2.348288
18.566667 -6.108389 2.389038 -2.492559 -0.667513 0.387688 -2.254724
18.600000 -6.131738 2.401703 -2.548800 -0.704698 0.426273 -2.151846
18.633333 -6.155208 2.414476 -2.620050 -0.734978 0.468343 -2.052164
18.666667 -6.182310 2.431218 -2.700265 -0.758030 0.513238 -1.964014
18.700000 -6.209490 2.448039 -2.747000 -0.774030 0.559993 -1.897311
18.733333 -6.236722 2.464924 -2.809873 -0.783455 0.607964 -1.861656
18.766667 -6.263982 2.481857 -2.862545 -0.786508 0.656395 -1.860496
18.800000 -6.292672 2.503693 -2.924100 -0.783810 0.701744 -1.898626
18.833333 -6.320830 2.530983 -3.000018 -0.775710 0.739836 -1.971178
18.866667 -6.348941 2.558255 -3.023218 -0.762482 0.769221 -2.084636
18.900000 -6.376979 2.585482 -3.074593 -0.744017 0.788670 -2.234027
18.933333 -6.399469 2.623998 -3.126433 -0.720664 0.796017 -2.416325
18.966667 -6.421842 2.662403 3.074659 -0.692393 0.788999 -2.619969
19.000000 -6.444533 2.687892 2.983522 -0.659340 0.769063 -2.832069
19.033333 -6.467062 2.713203 2.865544 -0.621249 0.738445 -3.044905
19.066667 -6.489409 2.738309 2.764094 -0.578131 0.698390 -3.238691
19.100000 -6.511553 2.763186 2.630545 -0.529998 0.650154 -3.401066
19.133333 -6.528942 2.781970 2.485878 -0.476342 0.597381 -3.518667
19.166667 -6.546091 2.800482 2.387064 -0.417273 0.543711 -3.590625
19.200000 -6.558470 2.815228 2.237081 -0.353473 0.490070 -3.616455
19.233333 -6.570586 2.829669 2.086486 -0.286297 0.437192 -3.601596
19.266667 -6.582429 2.843791 1.946182 -0.217274 0.385740 -3.548747
19.300000 -6.589381 2.856236 1.820342 -0.148322 0.336487 -3.464699
19.333333 -6.591954 2.867131 1.713269 -0.081397 0.288384 -3.356897
19.366667 -6.590505 2.876092 1.652979 -0.018934 0.240554 -3.230882
19.400000 -6.585903 2.882341 1.546328 0.037383 0.193073 -3.096882
19.433333 -6.581031 2.888221 1.433901 0.085948 0.145627 -2.963231
19.466667 -6.575895 2.893727 1.311242 0.125371 0.097842 -2.842361
19.500000 -6.568637 2.896056 1.216248 0.154719 0.049172 -2.739678
19.533333 -6.560278 2.895772 1.123313 0.173200 -0.000680 -2.660245
19.566667 -6.551689 2.895107 1.045718 0.181297 -0.051883 -2.601600
19.600000 -6.543734 2.891994 0.989418 0.179754 -0.104722 -2.560295
19.633333 -6.535573 2.888504 0.923557 0.169835 -0.159057 -2.527489
19.666667 -6.527219 2.884640 0.859612 0.153093 -0.214507 -2.497593
19.700000 -6.521616 2.876693 0.784226 0.131607 -0.270315 -2.469217
19.733333 -6.515840 2.868383 0.684857 0.107452 -0.325421 -2.433404
19.766667 -6.512820 2.856615 0.560748 0.082294 -0.378449 -2.383390
19.800000 -6.511726 2.842049 0.462098 0.057328 -0.427571 -2.312952
19.833333 -6.512429 2.824922 0.401086 0.033445 -0.470453 -2.222599
19.866667 -6.514272 2.804867 0.311636 0.011468 -0.504402 -2.111612
19.900000 -6.515960 2.784517 0.229564 -0.008634 -0.527396 -1.979144
19.933333 -6.517494 2.763893 0.172180 -0.027022 -0.537739 -1.838827
19.966667 -6.518551 2.741916 0.116015 -0.043865 -0.534440 -1.707836
20.000000 -6.519454 2.719708 0.083181 -0.059089 -0.517553 -1.602695
20.033333 -6.519936 2.697850 0.032438 -0.072601 -0.488456 -1.531072
20.066667 -6.520582 2.677484 0.004402 -0.084255 -0.449781 -1.506276
20.100000 -6.522299 2.659769 -0.032391 -0.093410 -0.403980 -1.536457
20.133333 -6.526997 2.646684 -0.065815 -0.099120 -0.353663 -1.612363
20.166667 -6.533605 2.638222 -0.101867 -0.100683 -0.301943 -1.724356
20.200000 -6.540036 2.633887 -0.144474 -0.097497 -0.251624 -1.857869
20.233333 -6.546309 2.629416 -0.201086 -0.088940 -0.204745 -2.003632
20.266667 -6.552418 2.624809 -0.282860 -0.074878 -0.162518 -2.139685
20.300000 -6.554701 2.622532 -0.366020 -0.055970 -0.125955 -2.248750
20.333333 -6.556813 2.620119 -0.465603 -0.033544 -0.095479 -2.322169
20.366667 -6.558755 2.617570 -0.568143 -0.008941 -0.070360 -2.348740
20.400000 -6.557583 2.615384 -0.693317 0.016405 -0.049336 -2.317563
20.433333 -6.554687 2.613925 -0.801621 0.040936 -0.031440 -2.218938
20.466667 -6.550760 2.613608 -0.844147 0.063392 -0.016010 -2.062154
20.500000 -6.546672 2.613145 -0.905836 0.083650 -0.002404 -1.854649
20.533333 -6.542485 2.613250 -0.972377 0.102124 0.009586 -1.611914
20.566667 -6.538323 2.614280 -1.046289 0.119302 0.019578 -1.352938
20.600000 -6.534595 2.615762 -1.105672 0.136037 0.026989 -1.102149
20.633333 -6.530969 2.617978 -1.149971 0.153558 0.031421 -0.882356
20.666667 -6.527206 2.620014 -1.139479 0.173257 0.032857 -0.698077
20.700000 -6.522618 2.622511 -1.131863 0.195625 0.031344 -0.557310
20.733333 -6.516202 2.624557 -1.107365 0.220605 0.027233 -0.460794
20.766667 -6.509668 2.626399 -1.082061 0.248164 0.021115 -0.404819
20.800000 -6.503021 2.628029 -1.094158 0.277836 0.013585 -0.381830
20.833333 -6.493205 2.627980 -1.095850 0.308502 0.005392 -0.382029
20.866667 -6.480908 2.626736 -1.119041 0.338643 -0.002963 -0.398674
20.900000 -6.468530 2.625262 -1.174865 0.366617 -0.010795 -0.418834
20.933333 -6.454705 2.623768 -1.204104 0.391162 -0.017621 -0.430199
20.966667 -6.439475 2.622313 -1.237607 0.410427 -0.023091 -0.425076
21.000000 -6.423434 2.621953 -1.242858 0.422669 -0.027006 -0.399882
21.033333 -6.407375 2.621341 -1.250082 0.426552 -0.029818 -0.355237
21.066667 -6.391315 2.620469 -1.257826 0.421211 -0.032031 -0.293683
21.100000 -6.375272 2.619330 -1.261993 0.406714 -0.034605 -0.225110
21.133333 -6.359263 2.617918 -1.272797 0.383228 -0.038439 -0.155207
21.166667 -6.343305 2.616226 -1.268939 0.352132 -0.044347 -0.088186
21.200000 -6.327417 2.614247 -1.273144 0.314943 -0.052915 -0.027313
21.233333 -6.317497 2.614366 -1.263467 0.273784 -0.064663 0.029082
21.266667 -6.307674 2.614182 -1.252821 0.230459 -0.080585 0.077332
21.300000 -6.303823 2.613452 -1.271033 0.186777 -0.101452 0.117460
21.333333 -6.300084 2.612402 -1.260857 0.144429 -0.128047 0.143071
21.366667 -6.299382 2.606732 -1.275214 0.104691 -0.161205 0.154936
21.400000 -6.298793 2.600728 -1.259746 0.068775 -0.202167 0.153612
21.433333 -6.298319 2.594388 -1.236745 0.036910 -0.250981 0.138081
21.466667 -6.297959 2.587710 -1.203816 0.009565 -0.306564 0.112322
21.500000 -6.297714 2.580691 -1.190437 -0.013705 -0.367983 0.081422
21.533333 -6.297584 2.573329 -1.204285 -0.033247 -0.434354 0.057205
21.566667 -6.299060 2.558746 -1.194378 -0.049663 -0.504185 0.040213
21.600000 -6.302101 2.537097 -1.200297 -0.063437 -0.574809 0.037121
21.633333 -6.305248 2.515121 -1.229400 -0.074695 -0.644331 0.054295
21.666667 -6.308497 2.492833 -1.248376 -0.083574 -0.711445 0.094800
21.700000 -6.312520 2.465777 -1.249746 -0.089683 -0.774232 0.158557
21.733333 -6.316627 2.434785 -1.262287 -0.092838 -0.830359 0.238936
21.766667 -6.320821 2.403537 -1.243928 -0.092845 -0.878589 0.333911
21.800000 -6.325097 2.372057 -1.219575 -0.089682 -0.918965 0.436914
21.833333 -6.328616 2.338938 -1.194117 -0.083396 -0.951419 0.534914
21.866667 -6.330979 2.304975 -1.168102 -0.074340 -0.975632 0.623527
21.900000 -6.333411 2.270856 -1.135246 -0.063154 -0.991938 0.700762
21.933333 -6.335912 2.236609 -1.107444 -0.050367 -1.001169 0.768242
21.966667 -6.338478 2.202259 -1.069655 -0.036600 -1.003598 0.827518
22.000000 -6.339813 2.167504 -1.052452 -0.022616 -0.999222 0.879366
22.033333 -6.339651 2.132539 -1.019714 -0.009170 -0.988272 0.931599
22.066667 -6.339552 2.097553 -1.002940 0.003263 -0.971426 0.981367
22.100000 -6.338625 2.063484 -0.975986 0.014112 -0.949514 1.024240
22.133333 -6.336828 2.031272 -0.934978 0.022711 -0.923575 1.054999
22.166667 -6.335099 1.999119 -0.927482 0.028601 -0.894861 1.072773
22.200000 -6.333236 1.968868 -0.873147 0.031458 -0.864757 1.073451
22.233333 -6.331217 1.941020 -0.808030 0.031129 -0.834746 1.052056
22.266667 -6.329154 1.915405 -0.741988 0.027370 -0.806282 1.007938
22.300000 -6.327969 1.891660 -0.691365 0.020520 -0.780520 0.943338
22.333333 -6.326865 1.868073 -0.665235 0.010959 -0.758004 0.861464
22.366667 -6.325844 1.844659 -0.641575 -0.000995 -0.739129 0.758435
22.400000 -6.324907 1.821431 -0.638540 -0.014899 -0.723657 0.641719
22.433333 -6.326109 1.797823 -0.634317 -0.030342 -0.710727 0.518383
22.466667 -6.327397 1.774431 -0.608788 -0.046890 -0.699124 0.395702
22.500000 -6.328769 1.751272 -0.594664 -0.064594 -0.687318 0.278694
22.533333 -6.332018 1.727481 -0.588452 -0.083317 -0.673918 0.172056
22.566667 -6.335347 1.703953 -0.583274 -0.102922 -0.657533 0.084029
22.600000 -6.338754 1.680703 -0.580803 -0.123396 -0.637203 0.013887
22.633333 -6.342236 1.657747 -0.581038 -0.144986 -0.612596 -0.040847
22.666667 -6.347291 1.636648 -0.585599 -0.167841 -0.583723 -0.079976
22.700000 -6.352413 1.615870 -0.608088 -0.191642 -0.551086 -0.102346
22.733333 -6.358817 1.597250 -0.620608 -0.216115 -0.515758 -0.108667
22.766667 -6.366638 1.581064 -0.642393 -0.240874 -0.478989 -0.099046
22.800000 -6.374509 1.565231 -0.642948 -0.265034 -0.442008 -0.075916
22.833333 -6.383686 1.551545 -0.647607 -0.287024 -0.405844 -0.035938
22.866667 -6.394531 1.540604 -0.630935 -0.305080 -0.371237 0.017633
22.900000 -6.405399 1.530033 -0.625778 -0.317693 -0.338514 0.080958
22.933333 -6.418218 1.521071 -0.615022 -0.323180 -0.307364 0.149577
22.966667 -6.432550 1.512613 -0.637046 -0.319807 -0.276983 0.221292
23.000000 -6.447111 1.504151 -0.627847 -0.306476 -0.246463 0.299332
23.033333 -6.459322 1.495494 -0.623198 -0.283185 -0.214717 0.383059
23.066667 -6.471489 1.487212 -0.592613 -0.250643 -0.180743 0.473156
23.100000 -6.483599 1.479308 -0.569583 -0.209822 -0.143944 0.565829
23.133333 -6.492342 1.472677 -0.567212 -0.162523 -0.104161 0.659555
23.166667 -6.497740 1.468254 -0.549379 -0.111281 -0.061844 0.741665
23.200000 -6.499855 1.466114 -0.518144 -0.058659 -0.017988 0.801084
23.233333 -6.498992 1.466400 -0.486006 -0.006596 0.025752 0.824628
23.266667 -6.495523 1.469007 -0.453028 0.043162 0.067518 0.805858
23.300000 -6.490109 1.473776 -0.411771 0.088837 0.105376 0.745211
23.333333 -6.483813 1.480356 -0.366246 0.129164 0.137522 0.642104
23.366667 -6.477590 1.488752 -0.302498 0.163723 0.162481 0.507385
23.400000 -6.471315 1.497465 -0.248343 0.192173 0.179453 0.349162
23.433333 -6.464521 1.506315 -0.244009 0.214257 0.188468 0.181513
23.466667 -6.456556 1.514396 -0.258584 0.229727 0.189932 0.014520
23.500000 -6.448565 1.522748 -0.311035 0.238780 0.184809 -0.138346
23.533333 -6.438874 1.529536 -0.342970 0.241398 0.174565 -0.265043
23.566667 -6.428186 1.534817 -0.373333 0.236847 0.160872 -0.356137
23.600000 -6.417506 1.540331 -0.385049 0.224807 0.145308 -0.404172
23.633333 -6.407354 1.544513 -0.402930 0.204927 0.129239 -0.411833
23.666667 -6.399110 1.547320 -0.420491 0.177644 0.113907 -0.381648
23.700000 -6.390908 1.550332 -0.430428 0.143203 0.100275 -0.325755
23.733333 -6.385945 1.552268 -0.441647 0.102877 0.088857 -0.252322
23.766667 -6.381041 1.554394 -0.452479 0.058809 0.079825 -0.171250
23.800000 -6.380058 1.556193 -0.459010 0.013204 0.073286 -0.091089
23.833333 -6.379143 1.558167 -0.449413 -0.031645 0.068905 -0.016083
23.866667 -6.382478 1.560285 -0.446070 -0.073582 0.066027 0.047835
23.900000 -6.390018 1.562099 -0.440287 -0.109913 0.063952 0.097929
23.933333 -6.397619 1.564067 -0.430127 -0.138973 0.061922 0.129930
23.966667 -6.405273 1.566183 -0.448051 -0.159479 0.059302 0.141647
24.000000 -6.412974 1.568442 -0.435175 -0.170757 0.055422 0.130998
24.033333 -6.420713 1.570836 -0.407539 -0.172488 0.050199 0.101904
24.066667 -6.428485 1.573361 -0.383114 -0.165317 0.043945 0.058596
24.100000 -6.436281 1.576010 -0.366780 -0.150856 0.037130 0.006554
24.133333 -6.444094 1.578778 -0.366804 -0.130460 0.030330 -0.048445
24.166667 -6.449394 1.579331 -0.393048 -0.105778 0.024408 -0.099436
24.200000 -6.451756 1.578751 -0.408054 -0.078475 0.020268 -0.128403
24.233333 -6.451790 1.577343 -0.422024 -0.050274 0.018740 -0.122986
24.266667 -6.451829 1.576042 -0.427080 -0.022427 0.020583 -0.075087
24.300000 -6.451275 1.575042 -0.453108 0.004058 0.026341 0.024882
24.333333 -6.450209 1.574773 -0.474076 0.028130 0.036501 0.184842
24.366667 -6.448718 1.575366 -0.471021 0.049132 0.050860 0.404081
24.400000 -6.446360 1.576802 -0.462972 0.066869 0.068991 0.662183
24.433333 -6.442541 1.579262 -0.457942 0.081450 0.089950 0.940647
24.466667 -6.438748 1.581818 -0.454740 0.093005 0.112539 1.228150
24.500000 -6.434727 1.585970 -0.440764 0.101797 0.135382 1.509163
24.533333 -6.430745 1.590206 -0.313769 0.108099 0.157017 1.757013
24.566667 -6.426772 1.596590 -0.192742 0.112066 0.176255 1.951815
24.600000 -6.422543 1.604906 -0.115034 0.113735 0.191980 2.085841
24.633333 -6.418371 1.613281 -0.028855 0.112933 0.203133 2.145787
24.666667 -6.414264 1.621704 0.066893 0.109515 0.208810 2.117142
24.700000 -6.410227 1.630164 0.149963 0.103175 0.208397 1.989302
24.733333 -6.406267 1.638652 0.230840 0.093420 0.201378 1.775414
24.766667 -6.402390 1.647157 0.308467 0.079728 0.187524 1.490143
24.800000 -6.398602 1.655668 0.357656 0.061559 0.166865 1.144178
24.833333 -6.395814 1.662252 0.421034 0.038864 0.140230 0.758248
24.866667 -6.394088 1.666525 0.458148 0.011464 0.108592 0.355931
24.900000 -6.392466 1.670779 0.460376 -0.020431 0.073177 -0.038677
24.933333 -6.390949 1.675011 0.448985 -0.056064 0.035498 -0.412993
24.966667 -6.392745 1.674941 0.385717 -0.094412 -0.002740 -0.751393
25.000000 -6.394650 1.674841 0.316564 -0.134474 -0.039992 -1.038084
25.033333 -6.400354 1.671408 0.258956 -0.175358 -0.075111 -1.263228
25.066667 -6.409888 1.665079 0.201122 -0.215590 -0.106985 -1.421914
25.100000 -6.419516 1.658726 0.137131 -0.253628 -0.134668 -1.516793
25.133333 -6.429230 1.652357 0.063562 -0.288111 -0.157324 -1.548495
25.166667 -6.439021 1.645978 0.004178 -0.318081 -0.174580 -1.530030
25.200000 -6.451471 1.638908 -0.051557 -0.342238 -0.185794 -1.475319
25.233333 -6.465569 1.631647 -0.090914 -0.359557 -0.190505 -1.394655
25.266667 -6.479710 1.624397 -0.138875 -0.369682 -0.188448 -1.297814
25.300000 -6.493881 1.617165 -0.179073 -0.372614 -0.179532 -1.186382
25.333333 -6.508069 1.609960 -0.215148 -0.368632 -0.163950 -1.069898
25.366667 -6.522259 1.602789 -0.250753 -0.357944 -0.142183 -0.951951
25.400000 -6.536439 1.595660 -0.270461 -0.341393 -0.115422 -0.834178
25.433333 -6.549269 1.589495 -0.308770 -0.320173 -0.085095 -0.721508
25.466667 -6.560464 1.585034 -0.324317 -0.295502 -0.052842 -0.620695
25.500000 -6.570014 1.583657 -0.352052 -0.268544 -0.020567 -0.541258
25.533333 -6.577926 1.584958 -0.385938 -0.240406 0.009711 -0.482207
25.566667 -6.584127 1.588717 -0.382035 -0.212306 0.036264 -0.439488
25.600000 -6.589085 1.594399 -0.378226 -0.185336 0.057780 -0.408480
25.633333 -6.593977 1.600137 -0.344473 -0.160102 0.073319 -0.387047
25.666667 -6.598800 1.605924 -0.342434 -0.136827 0.082351 -0.367548
25.700000 -6.602641 1.610136 -0.380865 -0.115707 0.085146 -0.341774
25.733333 -6.605584 1.612574 -0.409593 -0.096872 0.082634 -0.309306
25.766667 -6.608450 1.615050 -0.442539 -0.080171 0.076077 -0.269020
25.800000 -6.611237 1.617561 -0.473728 -0.065211 0.066923 -0.221843
25.833333 -6.613028 1.619105 -0.493460 -0.051806 0.056616 -0.163715
25.866667 -6.613984 1.620235 -0.497256 -0.040028 0.046562 -0.098797
25.900000 -6.614348 1.621042 -0.482020 -0.029864 0.037627 -0.034340
25.933333 -6.614488 1.621725 -0.462639 -0.021227 0.030140 0.026717
25.966667 -6.614608 1.622455 -0.435797 -0.014149 0.024197 0.076997
26.000000 -6.614478 1.622900 -0.425108 -0.008778 0.019758 0.111650
26.033333 -6.614431 1.623197 -0.422984 -0.005065 0.016661 0.125101
26.066667 -6.614392 1.623496 -0.424606 -0.002735 0.014618 0.120730
