t x y theta dxdt dydt dthetadt
0.000000 0.000000 0.000000 0.168744 0.016922 0.162980 -0.332522
0.033333 0.000650 0.008676 0.143490 0.017573 0.176064 -0.352580
0.066667 0.002061 0.017203 0.120862 0.018722 0.180367 -0.359992
0.100000 0.003279 0.025650 0.102019 0.020276 0.174436 -0.353268
0.133333 0.004306 0.034010 0.092245 0.022215 0.157327 -0.331760
0.166667 0.005147 0.042278 0.073486 0.024523 0.128961 -0.295480
0.200000 0.005803 0.050448 0.047319 0.027260 0.090247 -0.243807
0.233333 0.006585 0.054310 0.038189 0.030380 0.043211 -0.181456
0.266667 0.007182 0.058066 0.030323 0.034035 -0.010355 -0.112399
0.300000 0.007562 0.057502 0.039051 0.038212 -0.068329 -0.042559
0.333333 0.008026 0.053575 0.050725 0.042768 -0.127868 0.021063
0.366667 0.009629 0.046324 0.060255 0.047375 -0.185826 0.072316
0.400000 0.011040 0.038986 0.051587 0.051568 -0.238993 0.107115
0.433333 0.013453 0.028333 0.055795 0.054880 -0.284972 0.125538
0.466667 0.016480 0.013252 0.077585 0.056698 -0.321003 0.127788
0.500000 0.019303 -0.001875 0.096745 0.056510 -0.345308 0.116924
0.533333 0.021921 -0.017029 0.101411 0.053919 -0.357030 0.099085
0.566667 0.024331 -0.032191 0.104373 0.048709 -0.355930 0.079565
0.600000 0.026530 -0.047341 0.093522 0.040861 -0.342822 0.062046
0.633333 0.028517 -0.062462 0.089531 0.030531 -0.318721 0.049835
0.666667 0.030290 -0.077534 0.088685 0.018010 -0.285384 0.044154
0.700000 0.030975 -0.087944 0.095215 0.003743 -0.244411 0.042699
0.733333 0.030281 -0.092046 0.080358 -0.011583 -0.197551 0.040560
0.766667 0.029382 -0.096057 0.074876 -0.027088 -0.147304 0.031960
0.800000 0.028277 -0.099971 0.079177 -0.041795 -0.095585 0.014079
0.833333 0.026964 -0.103781 0.086560 -0.054679 -0.044074 -0.017500
0.866667 0.025443 -0.107480 0.108306 -0.064681 0.005884 -0.064898
0.900000 0.021439 -0.102715 0.130855 -0.070771 0.052546 -0.125986
0.933333 0.017238 -0.097832 0.120986 -0.072448 0.094997 -0.196213
0.966667 0.012840 -0.092836 0.125195 -0.069409 0.133025 -0.270253
1.000000 0.008246 -0.087727 0.107047 -0.061766 0.166116 -0.340879
1.033333 0.004400 -0.080154 0.075070 -0.050065 0.193415 -0.398875
1.066667 0.002345 -0.071211 0.047970 -0.035239 0.214029 -0.435640
1.100000 0.000095 -0.062175 0.015359 -0.018641 0.228214 -0.444168
1.133333 0.000040 -0.052273 -0.006045 -0.001649 0.235524 -0.426151
1.166667 0.001551 -0.042626 -0.025557 0.014211 0.235552 -0.380656
1.200000 0.004145 -0.033287 -0.046407 0.027531 0.228337 -0.314497
1.233333 0.007583 -0.024780 -0.063518 0.037230 0.214783 -0.235677
1.266667 0.010789 -0.016228 -0.060356 0.042670 0.195981 -0.153164
1.300000 0.013751 -0.007639 -0.066083 0.043625 0.172734 -0.077370
1.333333 0.016306 -0.001082 -0.049885 0.040509 0.146642 -0.009717
1.366667 0.017946 0.003025 -0.033270 0.034075 0.119532 0.044128
1.400000 0.019304 0.007155 -0.025048 0.025282 0.092997 0.082863
1.433333 0.020219 0.008748 -0.014398 0.014970 0.068255 0.098134
1.466667 0.019806 0.007606 -0.017800 0.003622 0.046590 0.083770
1.500000 0.019075 0.006490 -0.018860 -0.008850 0.028880 0.034152
1.533333 0.018020 0.005404 -0.027088 -0.022945 0.015293 -0.059303
1.566667 0.016632 0.004351 -0.016139 -0.039380 0.005470 -0.200855
1.600000 0.014901 0.003333 -0.007371 -0.059532 -0.001018 -0.395943
1.633333 0.014037 0.002925 -0.011843 -0.084625 -0.004933 -0.635562
1.666667 0.013440 0.002945 0.010247 -0.115536 -0.007419 -0.915200
1.700000 0.012255 0.003845 0.005708 -0.152308 -0.009453 -1.227826
1.733333 0.010693 0.004787 -0.010796 -0.195100 -0.011703 -1.563175
1.766667 0.006553 0.005347 -0.092875 -0.243975 -0.014444 -1.906657
1.800000 -0.001372 0.005287 -0.194424 -0.297602 -0.017698 -2.237044
1.833333 -0.013964 0.004145 -0.303673 -0.354334 -0.020912 -2.538533
1.866667 -0.026959 0.003065 -0.421106 -0.412615 -0.023299 -2.785328
1.900000 -0.040355 0.002049 -0.522046 -0.471191 -0.023601 -2.957457
1.933333 -0.060796 -0.000083 -0.640623 -0.527881 -0.020673 -3.042284
1.966667 -0.081631 -0.002136 -0.750545 -0.580608 -0.013611 -3.041156
2.000000 -0.102850 -0.004103 -0.876215 -0.628421 -0.001728 -2.966455
2.033333 -0.124444 -0.005982 -1.014001 -0.670498 0.015411 -2.834718
2.066667 -0.148632 -0.006513 -1.131661 -0.705389 0.038428 -2.674074
2.100000 -0.174731 -0.005971 -1.241251 -0.731156 0.067114 -2.506099
2.133333 -0.201170 -0.005327 -1.318036 -0.746664 0.101485 -2.346586
2.166667 -0.228904 -0.002105 -1.355837 -0.750654 0.141454 -2.204905
2.200000 -0.256948 0.001219 -1.361084 -0.741599 0.186986 -2.087131
2.233333 -0.284250 0.009768 -1.380650 -0.718842 0.237103 -1.997452
2.266667 -0.311829 0.018410 -1.440710 -0.683120 0.290369 -1.930103
2.300000 -0.339671 0.027136 -1.509932 -0.636398 0.345564 -1.882408
2.333333 -0.367765 0.035941 -1.607312 -0.581104 0.400922 -1.848098
2.366667 -0.389829 0.049648 -1.695195 -0.520603 0.454135 -1.820725
2.400000 -0.406088 0.067372 -1.778264 -0.458773 0.502569 -1.786120
2.433333 -0.416340 0.087336 -1.850777 -0.399681 0.544159 -1.733713
2.466667 -0.420795 0.111162 -1.898893 -0.347207 0.576757 -1.662773
2.500000 -0.425489 0.134948 -1.940219 -0.304945 0.597864 -1.572627
2.533333 -0.430440 0.158669 -1.986554 -0.275979 0.605319 -1.470097
2.566667 -0.435662 0.182298 -2.028004 -0.262064 0.598343 -1.358638
2.600000 -0.441172 0.205812 -2.061911 -0.263930 0.576834 -1.249760
2.633333 -0.446985 0.229184 -2.106225 -0.280620 0.541675 -1.151012
2.666667 -0.453119 0.252388 -2.129553 -0.310176 0.494277 -1.065459
2.700000 -0.462484 0.268735 -2.187826 -0.349644 0.437554 -0.992038
2.733333 -0.472207 0.284874 -2.211312 -0.396010 0.374465 -0.932676
2.766667 -0.486630 0.294642 -2.250681 -0.446064 0.308225 -0.887128
2.800000 -0.501439 0.304180 -2.272292 -0.497097 0.241717 -0.855466
2.833333 -0.521056 0.307840 -2.292795 -0.546901 0.177593 -0.834365
2.866667 -0.541076 0.311260 -2.301576 -0.593726 0.118444 -0.821378
2.900000 -0.564987 0.310237 -2.321736 -0.636467 0.065674 -0.817800
2.933333 -0.589307 0.308974 -2.333516 -0.674201 0.020695 -0.816397
2.966667 -0.614034 0.307472 -2.380231 -0.707024 -0.016465 -0.812882
3.000000 -0.639447 0.304143 -2.413492 -0.735116 -0.045588 -0.801858
3.033333 -0.665265 0.300578 -2.442269 -0.759394 -0.067402 -0.782533
3.066667 -0.690883 0.297214 -2.487823 -0.781019 -0.082727 -0.747770
3.100000 -0.716901 0.293617 -2.511281 -0.801367 -0.092523 -0.693424
3.133333 -0.743317 0.289788 -2.549079 -0.821593 -0.097747 -0.616195
3.166667 -0.770130 0.285729 -2.567642 -0.842318 -0.098693 -0.521650
3.200000 -0.797336 0.281441 -2.593425 -0.864011 -0.096059 -0.410884
3.233333 -0.825965 0.277584 -2.590951 -0.886147 -0.089987 -0.287327
3.266667 -0.855951 0.274557 -2.597618 -0.907145 -0.080665 -0.163158
3.300000 -0.886320 0.271306 -2.582353 -0.924490 -0.067997 -0.048599
3.333333 -0.918280 0.268646 -2.605356 -0.935675 -0.052160 0.045649
3.366667 -0.950612 0.265765 -2.618347 -0.938017 -0.033532 0.116950
3.400000 -0.985236 0.263695 -2.602321 -0.928341 -0.012322 0.159282
3.433333 -1.020747 0.262824 -2.560272 -0.904465 0.010928 0.168973
3.466667 -1.056468 0.263467 -2.526184 -0.865739 0.035387 0.146228
3.500000 -1.090431 0.265755 -2.503479 -0.813378 0.059763 0.095960
3.533333 -1.124723 0.267805 -2.505730 -0.748806 0.083042 0.022015
3.566667 -1.152908 0.271333 -2.514759 -0.674885 0.103989 -0.071946
3.600000 -1.174737 0.276325 -2.527418 -0.596202 0.121276 -0.177164
3.633333 -1.189204 0.282538 -2.526451 -0.517904 0.133843 -0.283824
3.666667 -1.204016 0.288444 -2.539190 -0.444435 0.141143 -0.384212
3.700000 -1.212802 0.295476 -2.563267 -0.379087 0.143295 -0.474408
3.733333 -1.216971 0.302902 -2.582683 -0.326331 0.140373 -0.554099
3.766667 -1.218881 0.309621 -2.623515 -0.289246 0.132898 -0.621858
3.800000 -1.221490 0.315027 -2.660503 -0.269790 0.121847 -0.680844
3.833333 -1.228740 0.318003 -2.672977 -0.268004 0.108476 -0.734802
3.866667 -1.236503 0.320575 -2.680400 -0.283940 0.093822 -0.784551
3.900000 -1.244806 0.322731 -2.708968 -0.317087 0.078838 -0.830251
3.933333 -1.253677 0.324459 -2.710919 -0.364719 0.064365 -0.869920
3.966667 -1.263143 0.325748 -2.746420 -0.424479 0.050993 -0.900918
4.000000 -1.273233 0.326586 -2.802777 -0.493380 0.038797 -0.921117
4.033333 -1.283972 0.326963 -2.835861 -0.569912 0.027283 -0.924260
4.066667 -1.305910 0.327756 -2.872126 -0.651683 0.015877 -0.905967
4.100000 -1.328539 0.328079 -2.923831 -0.736825 0.003884 -0.864305
4.133333 -1.359176 0.329172 -2.941875 -0.823473 -0.009436 -0.795208
4.166667 -1.390523 0.329782 -2.989333 -0.909377 -0.024767 -0.697604
4.200000 -1.422584 0.329897 -3.022743 -0.992818 -0.042636 -0.573392
4.233333 -1.455365 0.329504 -3.036068 -1.071637 -0.063287 -0.428535
4.266667 -1.493590 0.327539 -3.042766 -1.145133 -0.086835 -0.268441
4.300000 -1.536108 0.324466 -3.048795 -1.212316 -0.113343 -0.098332
4.333333 -1.579348 0.320865 -3.052419 -1.273617 -0.142647 0.076446
4.366667 -1.625176 0.315483 -3.043938 -1.329638 -0.174387 0.246728
4.400000 -1.671714 0.309560 -3.035993 -1.381098 -0.208149 0.410119
4.433333 -1.718954 0.303090 -3.025013 -1.428310 -0.243475 0.563667
4.466667 -1.768131 0.294558 -2.986905 -1.471425 -0.279883 0.703501
4.500000 -1.817855 0.284627 -2.951677 -1.511327 -0.316955 0.827491
4.533333 -1.867589 0.273860 -2.921349 -1.548493 -0.354195 0.932443
4.566667 -1.920516 0.261374 -2.888149 -1.583490 -0.391286 1.020684
4.600000 -1.975247 0.247064 -2.845302 -1.616758 -0.427866 1.089090
4.633333 -2.030618 0.232195 -2.803874 -1.649293 -0.463593 1.137934
4.666667 -2.086764 0.214995 -2.754612 -1.681525 -0.498132 1.169154
4.700000 -2.143519 0.197238 -2.720198 -1.713314 -0.531166 1.184843
4.733333 -2.200869 0.178928 -2.666255 -1.744297 -0.562552 1.185651
4.766667 -2.257083 0.159552 -2.639217 -1.774766 -0.592319 1.175621
4.800000 -2.316469 0.138817 -2.592675 -1.804939 -0.620567 1.156755
4.833333 -2.377915 0.117101 -2.550792 -1.834658 -0.647382 1.130012
4.866667 -2.440625 0.094724 -2.509149 -1.863888 -0.673037 1.094131
4.900000 -2.503840 0.071824 -2.478858 -1.892736 -0.697771 1.048859
4.933333 -2.567817 0.047975 -2.445247 -1.921399 -0.721778 0.997518
4.966667 -2.632913 0.023482 -2.414939 -1.949037 -0.744980 0.932510
5.000000 -2.698155 -0.001755 -2.375106 -1.975098 -0.767331 0.858012
5.033333 -2.763811 -0.027484 -2.349728 -1.999221 -0.788832 0.775693
5.066667 -2.829859 -0.053694 -2.318227 -2.021128 -0.809380 0.689921
5.100000 -2.899213 -0.081872 -2.274431 -2.040497 -0.828837 0.601533
5.133333 -2.968908 -0.110509 -2.268338 -2.057052 -0.847136 0.511542
5.166667 -3.038918 -0.139591 -2.253237 -2.071057 -0.864394 0.430624
5.200000 -3.109213 -0.169109 -2.254030 -2.082708 -0.880736 0.359306
5.233333 -3.179768 -0.199051 -2.251485 -2.092307 -0.896384 0.299728
5.266667 -3.250552 -0.229403 -2.234224 -2.100103 -0.911549 0.250501
5.300000 -3.321539 -0.260155 -2.258657 -2.106443 -0.926519 0.218675
5.333333 -3.391551 -0.291104 -2.240380 -2.111750 -0.941562 0.201446
5.366667 -3.460250 -0.321961 -2.237386 -2.116592 -0.956930 0.194179
5.400000 -3.529069 -0.353182 -2.228939 -2.121567 -0.972895 0.194716
5.433333 -3.600310 -0.385797 -2.221553 -2.126965 -0.989565 0.201550
5.466667 -3.671618 -0.418747 -2.213556 -2.133077 -1.007047 0.217875
5.500000 -3.743454 -0.452960 -2.196570 -2.140119 -1.025390 0.233599
5.533333 -3.815300 -0.487480 -2.193722 -2.148118 -1.044614 0.253809
5.566667 -3.887038 -0.522981 -2.183488 -2.156545 -1.064541 0.278670
5.600000 -3.958728 -0.558757 -2.186542 -2.164662 -1.084888 0.312095
5.633333 -4.030342 -0.594791 -2.171463 -2.171938 -1.105476 0.351909
5.666667 -4.101850 -0.631066 -2.166678 -2.178077 -1.126337 0.394249
5.700000 -4.175101 -0.668972 -2.160798 -2.182667 -1.147420 0.443896
5.733333 -4.249444 -0.707738 -2.149390 -2.185389 -1.168814 0.495851
5.766667 -4.323495 -0.747640 -2.122345 -2.186285 -1.190605 0.550408
5.800000 -4.397319 -0.787704 -2.093583 -2.185501 -1.212929 0.598532
5.833333 -4.471135 -0.828654 -2.082271 -2.183308 -1.235928 0.641282
5.866667 -4.544661 -0.869723 -2.047265 -2.179487 -1.259429 0.676669
5.900000 -4.617344 -0.912086 -2.031170 -2.174138 -1.283442 0.703698
5.933333 -4.689673 -0.954523 -1.984997 -2.167253 -1.307742 0.719183
5.966667 -4.759347 -0.997445 -1.964358 -2.158967 -1.332267 0.721083
6.000000 -4.831432 -1.042908 -1.944106 -2.149245 -1.356868 0.716455
6.033333 -4.903074 -1.088371 -1.931715 -2.137982 -1.381327 0.705142
6.066667 -4.975458 -1.136009 -1.902482 -2.125239 -1.405239 0.689729
6.100000 -5.047337 -1.183590 -1.863074 -2.110716 -1.428089 0.667725
6.133333 -5.118678 -1.231086 -1.847227 -2.094327 -1.449450 0.646867
6.166667 -5.189044 -1.280212 -1.831767 -2.075360 -1.468580 0.628771
6.200000 -5.258601 -1.330475 -1.810440 -2.053467 -1.484842 0.609385
6.233333 -5.327255 -1.381339 -1.787607 -2.028258 -1.497495 0.587633
6.266667 -5.393923 -1.432261 -1.776167 -1.999428 -1.506095 0.562711
6.300000 -5.459902 -1.482943 -1.761146 -1.967035 -1.510285 0.537266
6.333333 -5.525984 -1.534821 -1.731286 -1.930958 -1.509612 0.503787
6.366667 -5.591383 -1.587131 -1.718029 -1.891717 -1.504085 0.462015
6.400000 -5.656009 -1.639097 -1.700602 -1.849609 -1.493775 0.413800
6.433333 -5.717811 -1.689964 -1.684121 -1.804737 -1.478777 0.360581
6.466667 -5.778784 -1.740421 -1.662727 -1.757009 -1.459171 0.303684
6.500000 -5.835376 -1.788486 -1.651465 -1.706176 -1.434892 0.244902
6.533333 -5.891224 -1.836497 -1.646641 -1.651834 -1.405836 0.191309
6.566667 -5.946174 -1.884005 -1.639128 -1.593276 -1.371668 0.144287
6.600000 -5.997643 -1.929040 -1.647281 -1.529768 -1.331934 0.109959
6.633333 -6.048173 -1.973515 -1.653069 -1.460915 -1.286462 0.089733
6.666667 -6.097747 -2.017402 -1.667526 -1.386537 -1.235031 0.085793
6.700000 -6.145518 -2.059933 -1.660149 -1.306198 -1.177355 0.096532
6.733333 -6.192301 -2.101821 -1.663145 -1.219875 -1.113423 0.120767
6.766667 -6.234176 -2.140288 -1.660897 -1.127997 -1.043433 0.158483
6.800000 -6.271392 -2.175601 -1.650963 -1.031269 -0.967660 0.200473
6.833333 -6.304187 -2.207174 -1.636891 -0.930411 -0.886251 0.242901
6.866667 -6.332535 -2.234997 -1.641346 -0.826655 -0.799817 0.279853
6.900000 -6.357531 -2.259992 -1.624824 -0.721908 -0.709477 0.307597
6.933333 -6.378193 -2.281679 -1.583840 -0.618306 -0.616652 0.319522
6.966667 -6.397842 -2.302638 -1.585882 -0.517726 -0.522775 0.309721
7.000000 -6.412939 -2.319479 -1.577438 -0.421996 -0.429582 0.278149
7.033333 -6.423352 -2.331803 -1.562944 -0.332913 -0.339047 0.226137
7.066667 -6.431337 -2.341158 -1.554365 -0.252013 -0.253242 0.156257
7.100000 -6.436109 -2.346767 -1.528386 -0.180753 -0.174427 0.072280
7.133333 -6.437995 -2.348755 -1.510255 -0.120361 -0.104856 -0.017511
7.166667 -6.437603 -2.347465 -1.520472 -0.071885 -0.046683 -0.105292
7.200000 -6.435525 -2.343673 -1.538660 -0.036112 -0.001767 -0.184535
7.233333 -6.432511 -2.338165 -1.555481 -0.013377 0.028553 -0.250798
7.266667 -6.428686 -2.332034 -1.561398 -0.003268 0.044026 -0.302786
7.300000 -6.426613 -2.326988 -1.595874 -0.004258 0.045716 -0.337055
7.333333 -6.423797 -2.321357 -1.620728 -0.014181 0.035727 -0.354911
