t x y theta dxdt dydt dthetadt
0.000000 0.000000 0.000000 2.861680 0.094654 0.027794 -0.005950
0.033333 0.003221 0.000954 2.863937 0.099367 0.029677 -0.006925
0.066667 0.006588 0.001963 2.857761 0.104169 0.031597 -0.007235
0.100000 0.010103 0.003030 2.859176 0.109063 0.033553 -0.007488
0.133333 0.013794 0.004169 2.855669 0.114050 0.035547 -0.008672
0.166667 0.017664 0.005383 2.853233 0.119127 0.037574 -0.007657
0.200000 0.021715 0.006673 2.856520 0.124292 0.039633 -0.005616
0.233333 0.025933 0.008027 2.857859 0.129549 0.041726 -0.002917
0.266667 0.030321 0.009448 2.855393 0.134903 0.043854 0.000289
0.300000 0.034885 0.010937 2.858978 0.140353 0.046018 0.003846
0.333333 0.039628 0.012496 2.857559 0.145903 0.048219 0.006778
0.366667 0.044555 0.014128 2.854668 0.151558 0.050463 0.007040
0.400000 0.049672 0.015835 2.852808 0.157326 0.052755 0.005808
0.433333 0.054982 0.017618 2.859371 0.163209 0.055099 0.005240
0.466667 0.060491 0.019479 2.862369 0.169209 0.057498 0.004385
0.500000 0.066202 0.021422 2.863009 0.175328 0.059957 0.002374
0.533333 0.072121 0.023447 2.865566 0.181570 0.062477 -0.000104
0.566667 0.078252 0.025557 2.853039 0.187935 0.065061 -0.000412
0.600000 0.084601 0.027754 2.855687 0.194418 0.067706 -0.000616
0.633333 0.091172 0.030042 2.858752 0.201018 0.070412 -0.002587
0.666667 0.097958 0.032421 2.857100 0.207731 0.073177 -0.004813
0.700000 0.104962 0.034893 2.852298 0.214555 0.075998 -0.004307
0.733333 0.112202 0.037461 2.857098 0.221481 0.078873 -0.001613
0.766667 0.119664 0.040125 2.866968 0.228503 0.081799 -0.002443
0.800000 0.127373 0.042889 2.864470 0.235615 0.084771 -0.003336
0.833333 0.135334 0.045757 2.848488 0.242809 0.087787 -0.002562
0.866667 0.143552 0.048730 2.852337 0.250078 0.090843 -0.000880
0.900000 0.151998 0.051801 2.864581 0.257415 0.093937 -0.001792
0.933333 0.160674 0.054972 2.856458 0.264823 0.097069 -0.002993
0.966667 0.169622 0.058256 2.857565 0.272304 0.100240 -0.000132
1.000000 0.178803 0.061640 2.857941 0.279862 0.103452 0.003648
1.033333 0.188266 0.065142 2.856271 0.287494 0.106702 0.005790
1.066667 0.197964 0.068746 2.857354 0.295208 0.109994 0.005990
1.100000 0.207898 0.072452 2.850126 0.303014 0.113331 0.008938
1.133333 0.218068 0.076262 2.860982 0.310918 0.116713 0.010540
1.166667 0.228543 0.080199 2.858505 0.318923 0.120142 0.010781
1.200000 0.239255 0.084241 2.862821 0.327033 0.123620 0.010065
1.233333 0.250283 0.088414 2.855931 0.335258 0.127148 0.010624
1.266667 0.261630 0.092721 2.866719 0.343589 0.130724 0.012165
1.300000 0.273217 0.097134 2.861093 0.352021 0.134347 0.009690
1.333333 0.285043 0.101653 2.861217 0.360549 0.138014 -0.005777
1.366667 0.297110 0.106278 2.857827 0.369172 0.141725 -0.061728
1.400000 0.309518 0.111046 2.854189 0.377885 0.145477 -0.186730
1.433333 0.322272 0.115962 2.861813 0.386679 0.149269 -0.415792
1.466667 0.335378 0.121026 2.865112 0.395551 0.153098 -0.777160
1.500000 0.348723 0.126196 2.866071 0.404501 0.156964 -1.293124
1.533333 0.362307 0.131471 2.861369 0.413510 0.160859 -1.963332
1.566667 0.376128 0.136852 2.864319 0.422572 0.164780 -2.749346
1.600000 0.390321 0.142392 2.861702 0.431687 0.168726 -3.607806
1.633333 0.404892 0.148093 2.844920 0.440871 0.172705 -4.479703
1.666667 0.419845 0.153957 2.703314 0.450138 0.176723 -5.300401
1.700000 0.435031 0.159925 2.383625 0.459485 0.180779 -5.999372
1.733333 0.450449 0.165997 2.019382 0.468936 0.184885 -6.516795
1.766667 0.466096 0.172171 1.628325 0.478482 0.189038 -6.821279
1.800000 0.482151 0.178517 1.270577 0.488129 0.193245 -6.883733
1.833333 0.498620 0.185040 0.966880 0.497847 0.197496 -6.698713
1.866667 0.515312 0.191663 0.690502 0.507618 0.201786 -6.285768
1.900000 0.532428 0.198467 0.518683 0.517434 0.206116 -5.697902
1.933333 0.549762 0.205370 0.324181 0.527254 0.210472 -4.995533
1.966667 0.567523 0.212460 0.208315 0.537050 0.214847 -4.240945
2.000000 0.585708 0.219739 0.133643 0.546762 0.219215 -3.497313
2.033333 0.604101 0.227111 0.062156 0.556365 0.223568 -2.812721
2.066667 0.622907 0.234673 0.014120 0.565793 0.227875 -2.221516
2.100000 0.641914 0.242326 -0.033481 0.574995 0.232110 -1.726842
2.133333 0.661319 0.250165 -0.065290 0.583920 0.236245 -1.329657
2.166667 0.680916 0.258091 -0.103165 0.592534 0.240263 -1.018576
2.200000 0.700885 0.266198 -0.119200 0.600836 0.244156 -0.778658
2.233333 0.721216 0.274482 -0.126009 0.608794 0.247908 -0.597380
2.266667 0.741726 0.282845 -0.141449 0.616432 0.251527 -0.459300
2.300000 0.762572 0.291376 -0.143024 0.623747 0.255010 -0.357987
2.333333 0.783585 0.299982 -0.132039 0.630775 0.258373 -0.285353
2.366667 0.804760 0.308660 -0.149821 0.637532 0.261624 -0.234196
2.400000 0.826092 0.317409 -0.156249 0.644033 0.264771 -0.200571
2.433333 0.847704 0.326301 -0.159762 0.650310 0.267828 -0.179204
2.466667 0.869461 0.335257 -0.161170 0.656363 0.270795 -0.169004
2.500000 0.891473 0.344343 -0.177278 0.662212 0.273678 -0.165150
2.533333 0.913725 0.353554 -0.168658 0.667840 0.276467 -0.161625
2.566667 0.936104 0.362820 -0.183589 0.673227 0.279148 -0.159534
2.600000 0.958695 0.372196 -0.190863 0.678344 0.281701 -0.158508
2.633333 0.981481 0.381675 -0.192111 0.683157 0.284107 -0.159253
2.666667 1.004450 0.391250 -0.202304 0.687638 0.286350 -0.159114
2.700000 1.027585 0.400914 -0.204430 0.691757 0.288414 -0.159818
2.733333 1.050816 0.410617 -0.199876 0.695504 0.290293 -0.164180
2.766667 1.074134 0.420358 -0.210034 0.698872 0.291984 -0.169844
2.800000 1.097534 0.430132 -0.223637 0.701870 0.293496 -0.175020
2.833333 1.121046 0.439970 -0.225319 0.704505 0.294834 -0.177812
2.866667 1.144654 0.449864 -0.217259 0.706789 0.296004 -0.180655
2.900000 1.168323 0.459782 -0.235910 0.708739 0.297018 -0.182714
2.933333 1.192046 0.469718 -0.241421 0.710366 0.297882 -0.181336
2.966667 1.215822 0.479691 -0.256339 0.711674 0.298599 -0.174733
3.000000 1.239637 0.489693 -0.267217 0.712657 0.299167 -0.166586
3.033333 1.263476 0.499717 -0.261539 0.713309 0.299583 -0.158400
3.066667 1.287341 0.509745 -0.270713 0.713623 0.299843 -0.146487
3.100000 1.311205 0.519782 -0.275686 0.713580 0.299942 -0.134375
3.133333 1.335079 0.529816 -0.275264 0.713165 0.299873 -0.123972
3.166667 1.358929 0.539848 -0.274902 0.712368 0.299632 -0.121888
3.200000 1.382741 0.549872 -0.285237 0.711184 0.299217 -0.123780
3.233333 1.406542 0.559880 -0.292665 0.709615 0.298630 -0.128223
3.266667 1.430273 0.569866 -0.293252 0.707671 0.297870 -0.138350
3.300000 1.453923 0.579823 -0.272635 0.705371 0.296940 -0.150881
3.333333 1.477478 0.589744 -0.301369 0.702747 0.295847 -0.162590
3.366667 1.500929 0.599625 -0.296012 0.699834 0.294598 -0.170891
3.400000 1.524265 0.609459 -0.297046 0.696675 0.293201 -0.177191
3.433333 1.547474 0.619241 -0.329689 0.693306 0.291664 -0.183359
3.466667 1.570547 0.628964 -0.328594 0.689747 0.289990 -0.190130
3.500000 1.593472 0.638622 -0.341670 0.686018 0.288183 -0.193595
3.533333 1.616240 0.648209 -0.349635 0.682129 0.286246 -0.203631
3.566667 1.638932 0.657742 -0.342638 0.678080 0.284183 -0.216233
3.600000 1.661542 0.667218 -0.346136 0.673846 0.281987 -0.226849
3.633333 1.683969 0.676607 -0.352745 0.669402 0.279659 -0.230611
3.666667 1.706301 0.685932 -0.346330 0.664723 0.277196 -0.224933
3.700000 1.728439 0.695161 -0.372352 0.659791 0.274599 -0.210978
3.733333 1.750470 0.704317 -0.367686 0.654570 0.271864 -0.182465
3.766667 1.772286 0.713367 -0.393569 0.649049 0.268991 -0.137668
3.800000 1.793884 0.722309 -0.415272 0.643239 0.265988 -0.088226
3.833333 1.815254 0.731141 -0.408208 0.637166 0.262863 -0.046161
3.866667 1.836496 0.739885 -0.465087 0.630873 0.259628 -0.012954
3.900000 1.857490 0.748513 -0.459335 0.624396 0.256292 0.002239
3.933333 1.878224 0.757019 -0.399193 0.617810 0.252873 -0.004331
3.966667 1.898692 0.765401 -0.348279 0.611173 0.249382 -0.052317
4.000000 1.918885 0.773655 -0.353532 0.604549 0.245833 -0.137530
4.033333 1.938927 0.781804 -0.325984 0.597980 0.242231 -0.256244
4.066667 1.958685 0.789820 -0.378937 0.591498 0.238585 -0.402675
4.100000 1.978283 0.797725 -0.355216 0.585112 0.234897 -0.566182
4.133333 1.997588 0.805490 -0.395014 0.578807 0.231168 -0.726177
4.166667 2.016724 0.813138 -0.423915 0.572561 0.227396 -0.847236
4.200000 2.035689 0.820666 -0.499107 0.566324 0.223574 -0.912344
4.233333 2.054479 0.828070 -0.516229 0.560047 0.219696 -0.904143
4.266667 2.073090 0.835346 -0.567397 0.553672 0.215756 -0.821656
4.300000 2.091518 0.842493 -0.651864 0.547174 0.211747 -0.662384
4.333333 2.109761 0.849506 -0.706677 0.540509 0.207661 -0.443855
4.366667 2.127814 0.856383 -0.763892 0.533642 0.203493 -0.191234
4.400000 2.145531 0.863117 -0.772362 0.526561 0.199240 0.072939
4.433333 2.162912 0.869705 -0.720301 0.519279 0.194898 0.323840
4.466667 2.180094 0.876148 -0.678014 0.511827 0.190466 0.540730
4.500000 2.197075 0.882442 -0.602213 0.504219 0.185943 0.702217
4.533333 2.213851 0.888586 -0.554240 0.496493 0.181329 0.799463
4.566667 2.230295 0.894574 -0.496631 0.488696 0.176624 0.828777
4.600000 2.246412 0.900402 -0.428797 0.480851 0.171825 0.790437
4.633333 2.262316 0.906071 -0.403730 0.472964 0.166933 0.699115
4.666667 2.277899 0.911573 -0.393371 0.465033 0.161945 0.572754
4.700000 2.293265 0.916911 -0.407801 0.457073 0.156859 0.432990
4.733333 2.308414 0.922080 -0.390867 0.449087 0.151676 0.292713
4.766667 2.323246 0.927070 -0.402454 0.441083 0.146398 0.166700
4.800000 2.337856 0.931888 -0.415526 0.433070 0.141029 0.069336
4.833333 2.352153 0.936519 -0.405696 0.425074 0.135573 -0.002168
4.866667 2.366225 0.940972 -0.415516 0.417110 0.130038 -0.049377
4.900000 2.379987 0.945231 -0.421334 0.409196 0.124432 -0.079961
4.933333 2.393439 0.949293 -0.422525 0.401352 0.118761 -0.095755
4.966667 2.406663 0.953170 -0.423422 0.393580 0.113026 -0.101544
5.000000 2.419580 0.956842 -0.427465 0.385891 0.107229 -0.105020
5.033333 2.432267 0.960324 -0.423732 0.378280 0.101370 -0.105320
5.066667 2.444722 0.963615 -0.432884 0.370744 0.095447 -0.103632
5.100000 2.456946 0.966712 -0.436785 0.363259 0.089449 -0.099506
5.133333 2.468938 0.969613 -0.440682 0.355798 0.083372 -0.092475
5.166667 2.480697 0.972317 -0.452603 0.348350 0.077213 -0.085934
5.200000 2.492223 0.974821 -0.454658 0.340892 0.070969 -0.077248
5.233333 2.503514 0.977123 -0.450208 0.333408 0.064637 -0.068040
5.266667 2.514516 0.979194 -0.467808 0.325894 0.058222 -0.058833
5.300000 2.525231 0.981031 -0.447325 0.318365 0.051739 -0.052537
5.333333 2.535712 0.982662 -0.456289 0.310834 0.045196 -0.049731
5.366667 2.545957 0.984083 -0.459740 0.303313 0.038602 -0.047587
5.400000 2.555924 0.985263 -0.453217 0.295820 0.031967 -0.048841
5.433333 2.565615 0.986196 -0.449351 0.288378 0.025301 -0.052572
5.466667 2.575072 0.986917 -0.454368 0.280993 0.018603 -0.059468
5.500000 2.584295 0.987423 -0.471959 0.273662 0.011865 -0.062980
5.533333 2.593284 0.987714 -0.461419 0.266382 0.005078 -0.065691
5.566667 2.602040 0.987789 -0.469043 0.259150 -0.001762 -0.067438
5.600000 2.610563 0.987646 -0.469342 0.251957 -0.008667 -0.066185
5.633333 2.618854 0.987284 -0.478521 0.244789 -0.015646 -0.061736
5.666667 2.626887 0.986658 -0.480267 0.237644 -0.022694 -0.053740
5.700000 2.634690 0.985811 -0.482478 0.230522 -0.029808 -0.046748
5.733333 2.642262 0.984742 -0.478694 0.223423 -0.036986 -0.037584
5.766667 2.649584 0.983402 -0.480736 0.216346 -0.044226 -0.027396
5.800000 2.656658 0.981788 -0.475088 0.209298 -0.051526 -0.018510
5.833333 2.663505 0.979950 -0.481171 0.202285 -0.058886 -0.010882
5.866667 2.670110 0.977834 -0.486076 0.195309 -0.066319 -0.004967
5.900000 2.676489 0.975493 -0.483592 0.188373 -0.073827 -0.000989
5.933333 2.682644 0.972928 -0.477540 0.181480 -0.081411 -0.001833
5.966667 2.688575 0.970139 -0.484105 0.174632 -0.089071 -0.006464
6.000000 2.694284 0.967125 -0.477600 0.167827 -0.096801 -0.012703
6.033333 2.699761 0.963821 -0.481768 0.161065 -0.104600 -0.021912
6.066667 2.705009 0.960224 -0.477956 0.154347 -0.112460 -0.034134
6.100000 2.710028 0.956333 -0.474815 0.147673 -0.120373 -0.047413
6.133333 2.714823 0.952147 -0.481625 0.141044 -0.128326 -0.057166
6.166667 2.719401 0.947736 -0.476052 0.134462 -0.136314 -0.066236
6.200000 2.723758 0.943025 -0.480588 0.127929 -0.144340 -0.073640
6.233333 2.727903 0.938092 -0.496196 0.121447 -0.152406 -0.078081
6.266667 2.731829 0.932852 -0.509274 0.115018 -0.160507 -0.076564
6.300000 2.735546 0.927391 -0.503162 0.108645 -0.168649 -0.070912
6.333333 2.739055 0.921712 -0.501762 0.102326 -0.176839 -0.065897
6.366667 2.742350 0.915718 -0.501592 0.096063 -0.185068 -0.058904
6.400000 2.745433 0.909407 -0.505800 0.089857 -0.193315 -0.052487
6.433333 2.748314 0.902881 -0.513415 0.083711 -0.201542 -0.047554
6.466667 2.750988 0.896039 -0.503522 0.077626 -0.209720 -0.048494
6.500000 2.753458 0.888878 -0.511886 0.071605 -0.217804 -0.052530
6.533333 2.755727 0.881401 -0.502389 0.065651 -0.225757 -0.057297
6.566667 2.757796 0.873606 -0.505402 0.059765 -0.233546 -0.064810
6.600000 2.759673 0.865605 -0.498962 0.053945 -0.241159 -0.075524
6.633333 2.761359 0.857402 -0.518127 0.048192 -0.248592 -0.089207
6.666667 2.762858 0.848998 -0.521468 0.042504 -0.255853 -0.103669
6.700000 2.764164 0.840276 -0.530469 0.036879 -0.262957 -0.124017
6.733333 2.765286 0.831360 -0.532158 0.031314 -0.269926 -0.158913
6.766667 2.766226 0.822251 -0.529803 0.025806 -0.276795 -0.212219
6.800000 2.766987 0.812953 -0.525528 0.020352 -0.283590 -0.292192
6.833333 2.767570 0.803467 -0.540375 0.014950 -0.290335 -0.407889
6.866667 2.767968 0.793665 -0.528676 0.009595 -0.297049 -0.569542
6.900000 2.768177 0.783546 -0.560280 0.004281 -0.303762 -0.775877
6.933333 2.768216 0.773250 -0.568285 -0.000994 -0.310482 -1.018416
6.966667 2.768086 0.762780 -0.577323 -0.006232 -0.317202 -1.290952
7.000000 2.767791 0.752140 -0.585137 -0.011436 -0.323927 -1.577756
7.033333 2.767332 0.741333 -0.643115 -0.016614 -0.330672 -1.862122
7.066667 2.766687 0.730211 -0.739615 -0.021767 -0.337445 -2.119466
7.100000 2.765856 0.718777 -0.831584 -0.026896 -0.344238 -2.337265
7.133333 2.764869 0.707187 -0.957830 -0.032004 -0.351063 -2.502307
7.166667 2.763728 0.695446 -1.071059 -0.037093 -0.357929 -2.601023
7.200000 2.762403 0.683408 -1.185496 -0.042160 -0.364816 -2.627947
7.233333 2.760896 0.671081 -1.293250 -0.047195 -0.371677 -2.584419
7.266667 2.759242 0.658617 -1.391359 -0.052192 -0.378477 -2.483865
7.300000 2.757413 0.645885 -1.485971 -0.057142 -0.385181 -2.334557
7.333333 2.755413 0.632899 -1.551637 -0.062030 -0.391726 -2.153325
7.366667 2.753245 0.619672 -1.616039 -0.066838 -0.398039 -1.957393
7.400000 2.750913 0.606218 -1.665313 -0.071550 -0.404061 -1.762637
7.433333 2.748421 0.592551 -1.710341 -0.076150 -0.409748 -1.577984
7.466667 2.745774 0.578687 -1.763444 -0.080618 -0.415033 -1.406399
7.500000 2.742976 0.564642 -1.790658 -0.084935 -0.419857 -1.256474
7.533333 2.740031 0.550437 -1.824678 -0.089084 -0.424177 -1.128227
7.566667 2.736945 0.536089 -1.863000 -0.093048 -0.427964 -1.020228
7.600000 2.733723 0.521615 -1.901629 -0.096809 -0.431193 -0.916494
7.633333 2.730385 0.507062 -1.925469 -0.100348 -0.433848 -0.806499
7.666667 2.726935 0.492436 -1.956688 -0.103654 -0.435936 -0.690773
7.700000 2.723374 0.477743 -1.970201 -0.106715 -0.437472 -0.571400
7.733333 2.719706 0.463007 -1.991280 -0.109526 -0.438485 -0.454816
7.766667 2.715942 0.448250 -1.998158 -0.112084 -0.439012 -0.349883
7.800000 2.712093 0.433494 -2.015095 -0.114390 -0.439096 -0.283783
7.833333 2.708172 0.418759 -2.050824 -0.116444 -0.438783 -0.270690
7.866667 2.704192 0.404065 -2.089303 -0.118239 -0.438104 -0.299184
7.900000 2.700168 0.389425 -2.094692 -0.119773 -0.437095 -0.342271
7.933333 2.696114 0.374852 -1.965567 -0.121032 -0.435774 -0.380158
7.966667 2.692044 0.360356 -1.856235 -0.122010 -0.434161 -0.395179
8.000000 2.687888 0.345843 -1.880938 -0.122703 -0.432265 -0.357200
8.033333 2.683736 0.331426 -2.007261 -0.123119 -0.430103 -0.244035
8.066667 2.679502 0.317002 -2.148954 -0.123283 -0.427700 -0.054089
8.100000 2.675294 0.302689 -2.247195 -0.123230 -0.425085 0.201213
8.133333 2.671118 0.288491 -2.283000 -0.123008 -0.422292 0.520629
8.166667 2.666980 0.274413 -2.260614 -0.122665 -0.419352 0.901971
8.200000 2.662886 0.260461 -2.185194 -0.122265 -0.416312 1.314606
8.233333 2.658839 0.246640 -2.083773 -0.121852 -0.413198 1.718385
8.266667 2.654840 0.232954 -1.953892 -0.121474 -0.410044 2.078536
8.300000 2.650888 0.219406 -1.848214 -0.121161 -0.406862 2.369516
8.333333 2.646981 0.205997 -1.716819 -0.120937 -0.403666 2.564652
8.366667 2.643009 0.192622 -1.593833 -0.120819 -0.400456 2.644805
8.400000 2.638972 0.179284 -1.495117 -0.120804 -0.397222 2.621878
8.433333 2.634872 0.165987 -1.404040 -0.120891 -0.393960 2.516155
8.466667 2.630803 0.152835 -1.332596 -0.121067 -0.390646 2.349923
8.500000 2.626759 0.139830 -1.252426 -0.121322 -0.387272 2.132789
8.533333 2.622737 0.126973 -1.213538 -0.121647 -0.383835 1.879090
8.566667 2.618731 0.114264 -1.153394 -0.122050 -0.380347 1.596653
8.600000 2.614665 0.101612 -1.073856 -0.122539 -0.376816 1.273385
8.633333 2.610604 0.089111 -1.002882 -0.123132 -0.373258 0.893079
8.666667 2.606541 0.076762 -0.977813 -0.123849 -0.369695 0.449652
8.700000 2.602469 0.064567 -0.965284 -0.124704 -0.366139 -0.054044
8.733333 2.598338 0.052440 -0.952873 -0.125701 -0.362575 -0.618326
8.766667 2.594149 0.040384 -0.950260 -0.126830 -0.358984 -1.232635
8.800000 2.589932 0.028486 -0.952475 -0.128081 -0.355367 -1.864056
8.833333 2.585657 0.016663 -1.015744 -0.129436 -0.351710 -2.465978
8.866667 2.581324 0.004919 -1.124701 -0.130873 -0.348000 -3.009270
8.900000 2.576943 -0.006658 -1.249345 -0.132369 -0.344230 -3.456046
8.933333 2.572512 -0.018067 -1.450995 -0.133909 -0.340419 -3.763731
8.966667 2.568023 -0.029392 -1.710158 -0.135478 -0.336579 -3.893630
9.000000 2.563481 -0.040549 -1.855051 -0.137060 -0.332702 -3.835119
9.033333 2.558888 -0.051535 -2.060495 -0.138641 -0.328793 -3.586145
9.066667 2.554246 -0.062352 -2.241222 -0.140213 -0.324865 -3.156229
9.100000 2.549545 -0.073079 -2.371043 -0.141774 -0.320924 -2.576924
9.133333 2.544786 -0.083715 -2.454334 -0.143324 -0.316959 -1.900025
9.166667 2.539968 -0.094258 -2.530095 -0.144864 -0.312968 -1.192359
9.200000 2.535091 -0.104708 -2.555739 -0.146404 -0.308948 -0.498333
9.233333 2.530177 -0.114990 -2.518260 -0.147949 -0.304886 0.126241
9.266667 2.525226 -0.125103 -2.447436 -0.149510 -0.300759 0.633263
9.300000 2.520234 -0.135047 -2.322335 -0.151097 -0.296554 0.972493
9.333333 2.515198 -0.144819 -2.220712 -0.152718 -0.292281 1.109041
9.366667 2.510102 -0.154494 -2.096372 -0.154384 -0.287945 1.017307
9.400000 2.504944 -0.164071 -2.054750 -0.156099 -0.283567 0.677264
9.433333 2.499727 -0.173479 -2.020987 -0.157871 -0.279163 0.085380
9.466667 2.494446 -0.182718 -1.987745 -0.159705 -0.274755 -0.725948
9.500000 2.489101 -0.191789 -1.964468 -0.161605 -0.270358 -1.696038
9.533333 2.483690 -0.200690 -1.948867 -0.163574 -0.265973 -2.757989
9.566667 2.478216 -0.209492 -1.909102 -0.165614 -0.261601 -3.838804
9.600000 2.472672 -0.218126 -2.054067 -0.167731 -0.257238 -4.861254
9.633333 2.467058 -0.226591 -2.366819 -0.169924 -0.252887 -5.733613
9.666667 2.461380 -0.234958 -2.723289 -0.172191 -0.248549 -6.386156
9.700000 2.455634 -0.243159 -3.092303 -0.174526 -0.244223 -6.753470
9.733333 2.449824 -0.251262 2.828117 -0.176922 -0.239913 -6.777696
9.766667 2.443909 -0.259205 2.494303 -0.179367 -0.235630 -6.405642
9.800000 2.437893 -0.266991 2.262377 -0.181844 -0.231385 -5.632196
9.833333 2.431779 -0.274623 1.974557 -0.184336 -0.227194 -4.495870
9.866667 2.425573 -0.282105 1.760242 -0.186826 -0.223080 -3.061610
9.900000 2.419283 -0.289440 1.590231 -0.189296 -0.219069 -1.420343
9.933333 2.412914 -0.296634 1.521978 -0.191726 -0.215195 0.318170
9.966667 2.406468 -0.303694 1.572519 -0.194106 -0.211479 2.029403
10.000000 2.399946 -0.310626 1.738198 -0.196430 -0.207938 3.613317
10.033333 2.393348 -0.317439 1.969784 -0.198698 -0.204581 4.985598
10.066667 2.386670 -0.324139 2.299598 -0.200915 -0.201409 6.078715
10.100000 2.379926 -0.330755 2.677878 -0.203091 -0.198415 6.845811
10.133333 2.373114 -0.337286 3.065139 -0.205238 -0.195583 7.268083
10.166667 2.366235 -0.343736 -2.873880 -0.207371 -0.192894 7.356596
10.200000 2.359289 -0.350106 -2.558071 -0.209503 -0.190333 7.146401
10.233333 2.352275 -0.356397 -2.306908 -0.211646 -0.187885 6.686610
10.266667 2.345193 -0.362611 -2.077215 -0.213814 -0.185538 6.048124
10.300000 2.338044 -0.368750 -1.887020 -0.216021 -0.183291 5.301168
10.333333 2.330814 -0.374800 -1.760144 -0.218279 -0.181152 4.514758
10.366667 2.323516 -0.380779 -1.639666 -0.220595 -0.179132 3.739040
10.400000 2.316151 -0.386688 -1.582108 -0.222973 -0.177246 3.011756
10.433333 2.308693 -0.392526 -1.524369 -0.225417 -0.175517 2.364655
10.466667 2.301167 -0.398297 -1.459419 -0.227925 -0.173966 1.806536
10.500000 2.293542 -0.404018 -1.415280 -0.230491 -0.172606 1.344733
10.533333 2.285817 -0.409699 -1.375644 -0.233102 -0.171439 0.971825
10.566667 2.278024 -0.415319 -1.389334 -0.235748 -0.170463 0.686343
10.600000 2.270128 -0.420924 -1.383478 -0.238418 -0.169673 0.475977
10.633333 2.262129 -0.426530 -1.412812 -0.241102 -0.169050 0.323227
10.666667 2.254028 -0.432147 -1.400345 -0.243797 -0.168581 0.215310
10.700000 2.245860 -0.437711 -1.417801 -0.246507 -0.168256 0.137458
10.733333 2.237593 -0.443302 -1.420902 -0.249246 -0.168074 0.073545
10.766667 2.229225 -0.448925 -1.400752 -0.252031 -0.168033 0.003385
10.800000 2.220792 -0.454499 -1.405640 -0.254879 -0.168131 -0.085785
10.833333 2.212254 -0.460114 -1.392007 -0.257797 -0.168359 -0.199920
10.866667 2.203651 -0.465681 -1.347933 -0.260789 -0.168700 -0.342438
10.900000 2.194984 -0.471204 -1.355104 -0.263850 -0.169136 -0.515440
10.933333 2.186192 -0.476780 -1.342082 -0.266962 -0.169634 -0.715264
10.966667 2.177271 -0.482412 -1.391773 -0.270092 -0.170156 -0.937709
11.000000 2.168216 -0.488099 -1.448520 -0.273211 -0.170660 -1.182609
11.033333 2.159026 -0.493840 -1.484683 -0.276293 -0.171120 -1.459718
11.066667 2.149701 -0.499631 -1.558013 -0.279311 -0.171506 -1.761030
11.100000 2.140243 -0.505468 -1.629124 -0.282228 -0.171780 -2.091667
11.133333 2.130727 -0.511267 -1.712163 -0.285022 -0.171920 -2.444845
11.166667 2.121153 -0.517027 -1.773136 -0.287684 -0.171927 -2.816078
11.200000 2.111522 -0.522750 -1.838665 -0.290210 -0.171808 -3.178290
11.233333 2.101774 -0.528498 -1.877945 -0.292596 -0.171571 -3.496978
11.266667 2.091971 -0.534210 -1.965873 -0.294850 -0.171243 -3.759587
11.300000 2.082116 -0.539886 -2.154199 -0.296994 -0.170864 -3.917105
11.333333 2.072162 -0.545572 -2.372437 -0.299038 -0.170466 -3.938894
11.366667 2.062120 -0.551263 -2.654471 -0.300984 -0.170064 -3.767547
11.400000 2.052028 -0.556919 -2.781743 -0.302825 -0.169672 -3.398162
11.433333 2.041867 -0.562577 -2.959822 -0.304559 -0.169299 -2.817371
11.466667 2.031659 -0.568201 -3.093135 -0.306174 -0.168947 -2.034484
11.500000 2.021405 -0.573826 2.996918 -0.307651 -0.168607 -1.106413
11.533333 2.011107 -0.579418 3.011459 -0.308984 -0.168278 -0.090494
11.566667 2.000747 -0.585018 2.969093 -0.310172 -0.167966 0.923680
11.600000 1.990338 -0.590625 3.033519 -0.311216 -0.167669 1.891093
11.633333 1.979889 -0.596199 -3.031659 -0.312120 -0.167390 2.747754
11.666667 1.969448 -0.601784 -2.881844 -0.312896 -0.167127 3.469468
11.700000 1.958970 -0.607336 -2.600680 -0.313559 -0.166882 4.037824
11.733333 1.948501 -0.612901 -2.347478 -0.314124 -0.166651 4.445563
11.766667 1.937999 -0.618434 -2.125471 -0.314613 -0.166429 4.686428
11.800000 1.927505 -0.623983 -2.011832 -0.315052 -0.166223 4.753499
11.833333 1.916980 -0.629498 -1.968287 -0.315466 -0.166034 4.662216
11.866667 1.906463 -0.635029 -1.855385 -0.315876 -0.165868 4.402517
11.900000 1.895951 -0.640576 -1.714319 -0.316305 -0.165729 3.994921
11.933333 1.885413 -0.646088 -1.509217 -0.316767 -0.165627 3.464892
11.966667 1.874869 -0.651621 -1.255826 -0.317274 -0.165562 2.842398
12.000000 1.864301 -0.657120 -1.054805 -0.317831 -0.165530 2.145909
12.033333 1.853711 -0.662584 -0.927565 -0.318437 -0.165528 1.383804
12.066667 1.843100 -0.668074 -0.932794 -0.319094 -0.165555 0.599867
12.100000 1.832462 -0.673588 -0.982191 -0.319789 -0.165602 -0.167412
12.133333 1.821794 -0.679125 -1.050742 -0.320515 -0.165655 -0.889687
12.166667 1.811095 -0.684681 -1.151210 -0.321254 -0.165697 -1.525803
12.200000 1.800380 -0.690198 -1.303595 -0.321990 -0.165711 -2.035120
12.233333 1.789633 -0.695728 -1.460845 -0.322706 -0.165673 -2.383365
12.266667 1.778855 -0.701265 -1.565386 -0.323382 -0.165556 -2.576231
12.300000 1.768048 -0.706807 -1.678620 -0.324002 -0.165342 -2.635992
12.333333 1.757215 -0.712349 -1.761000 -0.324549 -0.165017 -2.580166
12.366667 1.746359 -0.717887 -1.856655 -0.325012 -0.164574 -2.437476
12.400000 1.735487 -0.723415 -1.918226 -0.325379 -0.164002 -2.242954
12.433333 1.724609 -0.728898 -1.948462 -0.325643 -0.163299 -2.028030
12.466667 1.713721 -0.734363 -2.037710 -0.325800 -0.162464 -1.804474
12.500000 1.702831 -0.739780 -2.106188 -0.325850 -0.161498 -1.579243
12.533333 1.691943 -0.745169 -2.155479 -0.325798 -0.160406 -1.362355
12.566667 1.681062 -0.750524 -2.203229 -0.325645 -0.159188 -1.163094
12.600000 1.670196 -0.755840 -2.223503 -0.325387 -0.157845 -0.985638
12.633333 1.659333 -0.761104 -2.267365 -0.325024 -0.156377 -0.833074
12.666667 1.648496 -0.766318 -2.291731 -0.324547 -0.154779 -0.718421
12.700000 1.637665 -0.771478 -2.301450 -0.323945 -0.153043 -0.651748
12.733333 1.626843 -0.776581 -2.293807 -0.323205 -0.151161 -0.645586
12.766667 1.616064 -0.781614 -2.259327 -0.322316 -0.149127 -0.715682
12.800000 1.605297 -0.786588 -2.264920 -0.321267 -0.146937 -0.870157
12.833333 1.594541 -0.791502 -2.297307 -0.320039 -0.144582 -1.115567
12.866667 1.583800 -0.796356 -2.330103 -0.318620 -0.142054 -1.445117
12.900000 1.573149 -0.801092 -2.349353 -0.316996 -0.139345 -1.840496
12.933333 1.562603 -0.805699 -2.384442 -0.315156 -0.136444 -2.270666
12.966667 1.552075 -0.810241 -2.445414 -0.313094 -0.133341 -2.691986
13.000000 1.541675 -0.814638 -2.542970 -0.310827 -0.130040 -3.061086
13.033333 1.531295 -0.818968 -2.670701 -0.308386 -0.126554 -3.328954
13.066667 1.520936 -0.823230 -2.838451 -0.305805 -0.122897 -3.451015
13.100000 1.510725 -0.827333 -3.021882 -0.303128 -0.119096 -3.399213
13.133333 1.500667 -0.831278 3.059423 -0.300411 -0.115185 -3.158097
13.166667 1.490721 -0.835066 2.849426 -0.297717 -0.111211 -2.724361
13.200000 1.480885 -0.838700 2.668138 -0.295087 -0.107204 -2.105702
13.233333 1.471153 -0.842179 2.596495 -0.292568 -0.103202 -1.339877
13.266667 1.461520 -0.845506 2.566592 -0.290215 -0.099252 -0.471845
13.300000 1.451977 -0.848682 2.564988 -0.288066 -0.095385 0.453535
13.333333 1.442460 -0.851787 2.610094 -0.286142 -0.091613 1.390076
13.366667 1.433009 -0.854741 2.732419 -0.284452 -0.087942 2.283800
13.400000 1.423612 -0.857547 2.875773 -0.282998 -0.084379 3.081051
13.433333 1.414240 -0.860280 3.042230 -0.281769 -0.080915 3.761086
13.466667 1.404895 -0.862941 -3.071649 -0.280737 -0.077530 4.304844
13.500000 1.395593 -0.865461 -2.905323 -0.279873 -0.074209 4.698381
13.533333 1.386318 -0.867909 -2.697384 -0.279158 -0.070946 4.927472
13.566667 1.377058 -0.870227 -2.544377 -0.278571 -0.067729 5.004479
13.600000 1.367805 -0.872419 -2.343080 -0.278091 -0.064544 4.945425
13.633333 1.358551 -0.874488 -2.130829 -0.277700 -0.061387 4.756562
13.666667 1.349291 -0.876433 -1.902791 -0.277385 -0.058262 4.448744
13.700000 1.340058 -0.878308 -1.734908 -0.277133 -0.055169 4.034455
13.733333 1.330853 -0.880112 -1.599638 -0.276931 -0.052109 3.540158
13.766667 1.321628 -0.881793 -1.482849 -0.276766 -0.049086 2.974244
13.800000 1.312431 -0.883405 -1.391001 -0.276632 -0.046103 2.353307
13.833333 1.303211 -0.884887 -1.314151 -0.276520 -0.043161 1.699995
13.866667 1.293966 -0.886235 -1.282265 -0.276424 -0.040262 1.036140
13.900000 1.284751 -0.887515 -1.266090 -0.276339 -0.037417 0.382967
13.933333 1.275566 -0.888727 -1.277931 -0.276254 -0.034639 -0.245109
13.966667 1.266353 -0.889810 -1.314645 -0.276165 -0.031946 -0.824389
14.000000 1.257170 -0.890827 -1.342450 -0.276068 -0.029360 -1.335223
14.033333 1.247960 -0.891727 -1.417600 -0.275960 -0.026905 -1.762954
14.066667 1.238723 -0.892522 -1.499793 -0.275843 -0.024606 -2.091296
14.100000 1.229520 -0.893253 -1.601539 -0.275721 -0.022486 -2.302406
14.133333 1.220349 -0.893921 -1.728750 -0.275606 -0.020573 -2.384736
14.166667 1.211154 -0.894525 -1.828390 -0.275504 -0.018887 -2.338223
14.200000 1.201994 -0.895068 -1.968753 -0.275429 -0.017455 -2.162767
14.233333 1.192808 -0.895575 -2.094460 -0.275391 -0.016291 -1.865890
14.266667 1.183659 -0.896022 -2.192190 -0.275395 -0.015397 -1.459313
14.300000 1.174482 -0.896463 -2.244761 -0.275437 -0.014758 -0.963792
14.333333 1.165345 -0.896846 -2.261754 -0.275502 -0.014344 -0.401273
14.366667 1.156183 -0.897244 -2.265012 -0.275577 -0.014120 0.208253
14.400000 1.146999 -0.897663 -2.240452 -0.275634 -0.014032 0.838853
14.433333 1.137797 -0.898109 -2.168808 -0.275642 -0.014016 1.463387
14.466667 1.128581 -0.898584 -2.111748 -0.275566 -0.014014 2.047270
14.500000 1.119352 -0.899091 -2.023806 -0.275381 -0.013974 2.552792
14.533333 1.110114 -0.899630 -1.922306 -0.275072 -0.013854 2.942345
14.566667 1.100869 -0.900198 -1.817990 -0.274626 -0.013618 3.183097
14.600000 1.091674 -0.900712 -1.670621 -0.274058 -0.013256 3.242487
14.633333 1.082529 -0.901170 -1.483591 -0.273398 -0.012787 3.103219
14.666667 1.073436 -0.901574 -1.309526 -0.272688 -0.012244 2.765858
14.700000 1.064329 -0.902010 -1.161634 -0.271967 -0.011662 2.254951
14.733333 1.055278 -0.902390 -0.975383 -0.271275 -0.011082 1.606022
14.766667 1.046284 -0.902715 -0.841233 -0.270650 -0.010549 0.857990
14.800000 1.037349 -0.902986 -0.815769 -0.270106 -0.010084 0.063059
14.833333 1.028475 -0.903201 -0.874531 -0.269643 -0.009695 -0.727726
14.866667 1.019557 -0.903460 -1.026477 -0.269251 -0.009374 -1.465648
14.900000 1.010594 -0.903761 -1.201431 -0.268918 -0.009115 -2.120110
14.933333 1.001587 -0.904100 -1.363277 -0.268611 -0.008891 -2.667270
14.966667 0.992539 -0.904477 -1.488805 -0.268281 -0.008660 -3.092639
15.000000 0.983561 -0.904796 -1.616254 -0.267887 -0.008387 -3.394499
15.033333 0.974657 -0.905058 -1.706802 -0.267386 -0.008038 -3.585744
15.066667 0.965728 -0.905339 -1.792222 -0.266734 -0.007584 -3.689979
15.100000 0.956782 -0.905634 -1.900716 -0.265889 -0.006997 -3.727136
15.133333 0.947916 -0.905869 -2.028953 -0.264839 -0.006273 -3.709440
15.166667 0.939048 -0.906103 -2.162768 -0.263577 -0.005418 -3.638866
15.200000 0.930188 -0.906327 -2.301571 -0.262086 -0.004436 -3.516428
15.233333 0.921415 -0.906490 -2.439517 -0.260347 -0.003328 -3.334360
15.266667 0.912733 -0.906589 -2.605149 -0.258350 -0.002102 -3.080725
15.300000 0.904091 -0.906664 -2.762856 -0.256092 -0.000765 -2.747395
15.333333 0.895544 -0.906674 -2.867852 -0.253547 0.000685 -2.344153
15.366667 0.887071 -0.906648 -2.950680 -0.250705 0.002249 -1.890940
15.400000 0.878685 -0.906584 -2.991567 -0.247576 0.003924 -1.413463
15.433333 0.870402 -0.906452 -3.026785 -0.244184 0.005701 -0.932759
15.466667 0.862226 -0.906251 -3.037612 -0.240548 0.007577 -0.464588
15.500000 0.854197 -0.905991 -3.016859 -0.236690 0.009550 -0.026501
15.533333 0.846333 -0.905666 -2.969211 -0.232642 0.011617 0.391374
15.566667 0.838656 -0.905265 -2.923479 -0.228424 0.013779 0.800974
15.600000 0.831096 -0.904791 -2.869940 -0.224035 0.016041 1.236739
15.633333 0.823656 -0.904243 -2.820565 -0.219465 0.018406 1.719378
15.666667 0.816458 -0.903593 -2.804352 -0.214715 0.020878 2.254941
15.700000 0.809385 -0.902866 -2.785163 -0.209766 0.023466 2.857347
15.733333 0.802437 -0.902062 -2.784084 -0.204604 0.026169 3.511011
15.766667 0.795618 -0.901179 -2.712097 -0.199232 0.028981 4.200856
15.800000 0.788929 -0.900216 -2.518249 -0.193675 0.031888 4.869865
15.833333 0.782374 -0.899174 -2.367220 -0.187964 0.034878 5.473787
15.866667 0.776120 -0.897994 -2.076088 -0.182109 0.037939 5.966587
15.900000 0.770170 -0.896674 -1.837658 -0.176155 0.041052 6.309759
15.933333 0.764522 -0.895214 -1.473352 -0.170150 0.044199 6.468019
15.966667 0.759014 -0.893670 -1.144739 -0.164137 0.047363 6.418310
16.000000 0.753648 -0.892041 -0.865746 -0.158142 0.050536 6.187783
16.033333 0.748576 -0.890270 -0.626065 -0.152205 0.053702 5.799337
16.066667 0.743648 -0.888413 -0.446250 -0.146363 0.056849 5.305310
16.100000 0.738865 -0.886469 -0.271785 -0.140629 0.059969 4.738294
16.133333 0.734228 -0.884438 -0.182598 -0.134992 0.063067 4.164369
16.166667 0.729739 -0.882319 -0.111305 -0.129431 0.066147 3.635913
16.200000 0.725520 -0.880064 -0.051691 -0.123936 0.069213 3.176099
16.233333 0.721564 -0.877673 0.035356 -0.118476 0.072274 2.801338
16.266667 0.717758 -0.875193 0.090245 -0.113037 0.075334 2.506181
16.300000 0.714103 -0.872624 0.154444 -0.107603 0.078399 2.297436
16.333333 0.710600 -0.869964 0.239159 -0.102169 0.081468 2.145413
16.366667 0.707249 -0.867214 0.314897 -0.096741 0.084540 2.024653
16.400000 0.704126 -0.864340 0.396971 -0.091320 0.087610 1.914243
16.433333 0.701157 -0.861375 0.439285 -0.085900 0.090680 1.804554
16.466667 0.698341 -0.858319 0.523844 -0.080475 0.093752 1.686052
16.500000 0.695740 -0.855145 0.592374 -0.075050 0.096820 1.547064
16.533333 0.693347 -0.851856 0.646184 -0.069639 0.099877 1.390640
16.566667 0.691110 -0.848475 0.681996 -0.064254 0.102916 1.216688
16.600000 0.689073 -0.844985 0.707536 -0.058900 0.105933 1.027889
16.633333 0.687232 -0.841388 0.740509 -0.053597 0.108918 0.820558
16.666667 0.685583 -0.837687 0.769115 -0.048366 0.111863 0.597820
16.700000 0.684089 -0.833895 0.798230 -0.043219 0.114764 0.361354
16.733333 0.682749 -0.830010 0.812020 -0.038156 0.117622 0.111521
16.766667 0.681564 -0.826034 0.800246 -0.033176 0.120440 -0.142622
16.800000 0.680553 -0.821965 0.809454 -0.028285 0.123217 -0.394632
16.833333 0.679710 -0.817807 0.807602 -0.023483 0.125957 -0.624959
16.866667 0.679020 -0.813557 0.790421 -0.018762 0.128665 -0.803214
16.900000 0.678491 -0.809223 0.734653 -0.014124 0.131343 -0.886741
16.933333 0.678114 -0.804798 0.661590 -0.009571 0.133995 -0.831205
16.966667 0.677890 -0.800282 0.593406 -0.005104 0.136622 -0.609246
17.000000 0.677818 -0.795675 0.538165 -0.000726 0.139229 -0.188254
17.033333 0.677899 -0.790978 0.477877 0.003564 0.141816 0.432803
