t x y theta dxdt dydt dthetadt
0.000000 0.000000 0.000000 2.624575 -0.151394 -0.011868 0.001423
0.033333 -0.005076 -0.000391 2.622653 -0.153438 -0.011672 0.002463
0.066667 -0.010216 -0.000775 2.621379 -0.155495 -0.011479 0.004399
0.100000 -0.015417 -0.001151 2.632424 -0.157563 -0.011288 0.004531
0.133333 -0.020681 -0.001518 2.621552 -0.159638 -0.011099 0.003091
0.166667 -0.026027 -0.001883 2.622015 -0.161712 -0.010911 0.001356
0.200000 -0.031454 -0.002243 2.615921 -0.163779 -0.010721 0.000158
0.233333 -0.036962 -0.002601 2.627852 -0.165827 -0.010528 0.004683
0.266667 -0.042552 -0.002955 2.628243 -0.167851 -0.010330 0.025330
0.300000 -0.048203 -0.003301 2.627350 -0.169843 -0.010125 0.074822
0.333333 -0.053913 -0.003638 2.628054 -0.171800 -0.009913 0.166016
0.366667 -0.059683 -0.003967 2.620177 -0.173726 -0.009694 0.312302
0.400000 -0.065512 -0.004288 2.618422 -0.175627 -0.009468 0.519698
0.433333 -0.071399 -0.004600 2.623732 -0.177512 -0.009238 0.787695
0.466667 -0.077344 -0.004904 2.622396 -0.179392 -0.009007 1.098884
0.500000 -0.083346 -0.005198 2.618642 -0.181278 -0.008778 1.433932
0.533333 -0.089406 -0.005484 2.627778 -0.183175 -0.008553 1.764134
0.566667 -0.095521 -0.005762 2.693781 -0.185084 -0.008336 2.056072
0.600000 -0.101719 -0.006035 2.824667 -0.187003 -0.008129 2.281769
0.633333 -0.107973 -0.006299 2.951527 -0.188927 -0.007933 2.417616
0.666667 -0.114309 -0.006558 3.120748 -0.190850 -0.007750 2.452904
0.700000 -0.120728 -0.006812 -3.011843 -0.192760 -0.007580 2.384911
0.733333 -0.127200 -0.007057 -2.911192 -0.194651 -0.007423 2.226417
0.766667 -0.133724 -0.007293 -2.797915 -0.196514 -0.007278 1.999637
0.800000 -0.140323 -0.007537 -2.746680 -0.198343 -0.007142 1.735328
0.833333 -0.146972 -0.007771 -2.721187 -0.200129 -0.007012 1.452986
0.866667 -0.153671 -0.007995 -2.729010 -0.201870 -0.006884 1.169545
0.900000 -0.160439 -0.008225 -2.742869 -0.203568 -0.006757 0.892435
0.933333 -0.167254 -0.008445 -2.758123 -0.205224 -0.006630 0.615782
0.966667 -0.174135 -0.008669 -2.752719 -0.206841 -0.006502 0.329831
1.000000 -0.181078 -0.008896 -2.737351 -0.208423 -0.006373 0.018094
1.033333 -0.188066 -0.009112 -2.688673 -0.209974 -0.006242 -0.323890
1.066667 -0.195099 -0.009318 -2.637115 -0.211496 -0.006106 -0.696220
1.100000 -0.202175 -0.009514 -2.575426 -0.212989 -0.005965 -1.091974
1.133333 -0.209293 -0.009698 -2.549825 -0.214452 -0.005812 -1.487209
1.166667 -0.216466 -0.009884 -2.641245 -0.215889 -0.005644 -1.845836
1.200000 -0.223690 -0.010072 -2.806127 -0.217298 -0.005457 -2.126548
1.233333 -0.230965 -0.010262 -2.963909 -0.218679 -0.005246 -2.292068
1.266667 -0.238289 -0.010453 -3.130888 -0.220030 -0.005007 -2.315070
1.300000 -0.245650 -0.010632 3.017338 -0.221348 -0.004737 -2.179554
1.333333 -0.253061 -0.010797 2.929715 -0.222629 -0.004433 -1.900579
1.366667 -0.260522 -0.010947 2.812495 -0.223867 -0.004094 -1.517636
1.400000 -0.268016 -0.011085 2.702597 -0.225057 -0.003723 -1.087019
1.433333 -0.275543 -0.011210 2.661416 -0.226197 -0.003321 -0.662382
1.466667 -0.283112 -0.011318 2.719994 -0.227288 -0.002893 -0.293859
1.500000 -0.290720 -0.011408 2.832483 -0.228328 -0.002445 -0.024772
1.533333 -0.298366 -0.011478 2.982940 -0.229320 -0.001979 0.126430
1.566667 -0.306039 -0.011535 3.057610 -0.230268 -0.001498 0.157241
1.600000 -0.313740 -0.011579 3.052683 -0.231173 -0.001003 0.083488
1.633333 -0.321466 -0.011609 3.047906 -0.232037 -0.000494 -0.073269
1.666667 -0.329217 -0.011625 2.997261 -0.232861 0.000030 -0.274348
1.700000 -0.337000 -0.011620 2.954315 -0.233644 0.000569 -0.478105
1.733333 -0.344806 -0.011601 2.902566 -0.234387 0.001126 -0.646678
1.766667 -0.352640 -0.011558 2.848350 -0.235088 0.001701 -0.753186
1.800000 -0.360502 -0.011493 2.790862 -0.235746 0.002291 -0.783774
1.833333 -0.368381 -0.011413 2.746747 -0.236358 0.002895 -0.733867
1.866667 -0.376283 -0.011308 2.716762 -0.236921 0.003511 -0.620571
1.900000 -0.384205 -0.011178 2.706028 -0.237433 0.004137 -0.463853
1.933333 -0.392141 -0.011033 2.691953 -0.237890 0.004767 -0.285744
1.966667 -0.400091 -0.010861 2.687408 -0.238292 0.005400 -0.104503
2.000000 -0.408054 -0.010675 2.706739 -0.238635 0.006037 0.061717
2.033333 -0.416026 -0.010462 2.720146 -0.238921 0.006679 0.200550
2.066667 -0.424005 -0.010220 2.724860 -0.239148 0.007325 0.308411
2.100000 -0.431992 -0.009963 2.748155 -0.239317 0.007977 0.383200
2.133333 -0.439986 -0.009692 2.780473 -0.239429 0.008636 0.420965
2.166667 -0.447985 -0.009405 2.804755 -0.239483 0.009302 0.422134
2.200000 -0.455982 -0.009089 2.825510 -0.239482 0.009974 0.397279
2.233333 -0.463975 -0.008744 2.844501 -0.239427 0.010649 0.351335
2.266667 -0.471970 -0.008383 2.859414 -0.239318 0.011325 0.288306
2.300000 -0.479957 -0.007994 2.876176 -0.239157 0.011999 0.211991
2.333333 -0.487934 -0.007574 2.866443 -0.238946 0.012665 0.132681
2.366667 -0.495909 -0.007140 2.868017 -0.238683 0.013320 0.052788
2.400000 -0.503869 -0.006679 2.861223 -0.238366 0.013960 -0.029509
2.433333 -0.511813 -0.006190 2.862401 -0.237994 0.014583 -0.113316
2.466667 -0.519751 -0.005687 2.848802 -0.237564 0.015185 -0.199985
2.500000 -0.527682 -0.005169 2.843337 -0.237073 0.015766 -0.289694
2.533333 -0.535588 -0.004629 2.843026 -0.236522 0.016327 -0.390976
2.566667 -0.543485 -0.004074 2.829158 -0.235914 0.016868 -0.500523
2.600000 -0.551353 -0.003498 2.818369 -0.235256 0.017390 -0.616440
2.633333 -0.559209 -0.002910 2.806767 -0.234556 0.017893 -0.736559
2.666667 -0.567031 -0.002302 2.799711 -0.233820 0.018378 -0.854594
2.700000 -0.574816 -0.001677 2.749397 -0.233059 0.018847 -0.967362
2.733333 -0.582564 -0.001036 2.707712 -0.232281 0.019297 -1.066381
2.766667 -0.590272 -0.000377 2.665731 -0.231493 0.019730 -1.151134
2.800000 -0.597963 0.000293 2.596001 -0.230696 0.020147 -1.218755
2.833333 -0.605636 0.000976 2.553800 -0.229894 0.020547 -1.267306
2.866667 -0.613290 0.001670 2.502348 -0.229086 0.020931 -1.296325
2.900000 -0.620924 0.002376 2.454157 -0.228265 0.021301 -1.303981
2.933333 -0.628537 0.003093 2.417394 -0.227420 0.021658 -1.292544
2.966667 -0.636104 0.003823 2.378339 -0.226544 0.022005 -1.258693
3.000000 -0.643649 0.004564 2.360174 -0.225627 0.022343 -1.205946
3.033333 -0.651170 0.005316 2.302930 -0.224662 0.022674 -1.132518
3.066667 -0.658666 0.006078 2.258071 -0.223647 0.022999 -1.040589
3.100000 -0.666115 0.006851 2.205545 -0.222586 0.023318 -0.932338
3.133333 -0.673537 0.007634 2.153149 -0.221484 0.023630 -0.805657
3.166667 -0.680912 0.008428 2.122443 -0.220349 0.023936 -0.664899
3.200000 -0.688238 0.009233 2.110473 -0.219187 0.024235 -0.505953
3.233333 -0.695516 0.010048 2.107113 -0.218008 0.024526 -0.345536
3.266667 -0.702764 0.010872 2.087891 -0.216823 0.024808 -0.206234
3.300000 -0.709964 0.011706 2.101956 -0.215634 0.025082 -0.107378
3.333333 -0.717132 0.012549 2.102179 -0.214445 0.025346 -0.059683
3.366667 -0.724251 0.013402 2.116835 -0.213261 0.025602 -0.071171
3.400000 -0.731337 0.014262 2.135852 -0.212081 0.025847 -0.157958
3.433333 -0.738391 0.015129 2.153801 -0.210899 0.026084 -0.306558
3.466667 -0.745410 0.016003 2.164938 -0.209711 0.026312 -0.484318
3.500000 -0.752378 0.016887 2.198792 -0.208514 0.026533 -0.665359
3.533333 -0.759312 0.017778 2.255580 -0.207303 0.026746 -0.843578
3.566667 -0.766210 0.018673 2.183951 -0.206076 0.026952 -0.998309
3.600000 -0.773072 0.019574 1.981934 -0.204830 0.027151 -1.089770
3.633333 -0.779881 0.020484 1.860170 -0.203566 0.027341 -1.100339
3.666667 -0.786653 0.021399 1.841321 -0.202287 0.027523 -1.031320
3.700000 -0.793373 0.022324 1.835716 -0.200991 0.027697 -0.883056
3.733333 -0.800054 0.023252 1.780478 -0.199680 0.027864 -0.642128
3.766667 -0.806684 0.024188 1.751823 -0.198354 0.028023 -0.325759
3.800000 -0.813274 0.025128 1.725315 -0.197015 0.028175 0.022472
3.833333 -0.819824 0.026069 1.727591 -0.195662 0.028319 0.370508
3.866667 -0.826324 0.027018 1.755931 -0.194299 0.028455 0.696914
3.900000 -0.832784 0.027969 1.827231 -0.192926 0.028581 0.981519
3.933333 -0.839202 0.028921 1.885322 -0.191546 0.028695 1.194091
3.966667 -0.845570 0.029880 1.950074 -0.190159 0.028796 1.322698
4.000000 -0.851887 0.030845 2.023090 -0.188763 0.028882 1.369649
4.033333 -0.858152 0.031816 2.086035 -0.187359 0.028953 1.339340
4.066667 -0.864365 0.032792 2.154015 -0.185943 0.029006 1.241188
4.100000 -0.870535 0.033767 2.224787 -0.184515 0.029040 1.085579
4.133333 -0.876663 0.034742 2.269811 -0.183073 0.029055 0.876242
4.166667 -0.882748 0.035714 2.307036 -0.181619 0.029050 0.603406
4.200000 -0.888789 0.036684 2.299532 -0.180153 0.029023 0.252584
4.233333 -0.894787 0.037652 2.297466 -0.178675 0.028976 -0.193615
4.266667 -0.900727 0.038620 2.267636 -0.177186 0.028908 -0.762317
4.300000 -0.906609 0.039588 2.245142 -0.175692 0.028821 -1.471812
4.333333 -0.912432 0.040553 2.228825 -0.174193 0.028715 -2.305157
4.366667 -0.918211 0.041514 2.227905 -0.172695 0.028590 -3.211511
4.400000 -0.923931 0.042470 2.245321 -0.171202 0.028448 -4.128989
4.433333 -0.929606 0.043420 2.225465 -0.169718 0.028287 -4.998064
4.466667 -0.935237 0.044364 2.016162 -0.168249 0.028107 -5.741388
4.500000 -0.940823 0.045303 1.662228 -0.166794 0.027908 -6.281254
4.533333 -0.946352 0.046232 1.230660 -0.165352 0.027692 -6.567308
4.566667 -0.951836 0.047154 0.857253 -0.163922 0.027458 -6.580657
4.600000 -0.957274 0.048068 0.436608 -0.162503 0.027209 -6.310800
4.633333 -0.962668 0.048975 0.086740 -0.161090 0.026944 -5.759036
4.666667 -0.968017 0.049874 -0.146975 -0.159681 0.026665 -4.969584
4.700000 -0.973320 0.050764 -0.232893 -0.158275 0.026371 -4.023119
4.733333 -0.978568 0.051638 -0.231638 -0.156870 0.026063 -3.008850
4.766667 -0.983771 0.052503 -0.216008 -0.155465 0.025738 -2.010135
4.800000 -0.988928 0.053357 -0.228188 -0.154058 0.025398 -1.113133
4.833333 -0.994041 0.054202 -0.213753 -0.152649 0.025041 -0.386755
4.866667 -0.999108 0.055036 -0.221543 -0.151238 0.024668 0.143440
4.900000 -1.004131 0.055859 -0.147088 -0.149824 0.024278 0.485739
4.933333 -1.009101 0.056665 -0.049967 -0.148409 0.023870 0.668398
4.966667 -1.014026 0.057459 0.026901 -0.146993 0.023444 0.726093
