t x y theta dxdt dydt dthetadt
0.000000 0.000000 0.000000 1.767909 -0.150914 -0.002541 -5.433363
0.033333 -0.005074 -0.000141 1.552546 -0.152911 -0.005349 -5.000460
0.066667 -0.010215 -0.000376 1.418224 -0.154865 -0.008113 -4.466139
0.100000 -0.015423 -0.000704 1.236829 -0.156773 -0.010830 -3.851758
0.133333 -0.020695 -0.001124 1.085833 -0.158636 -0.013495 -3.174118
0.166667 -0.026029 -0.001635 0.955254 -0.160454 -0.016107 -2.462845
0.200000 -0.031413 -0.002224 0.894729 -0.162229 -0.018660 -1.746354
0.233333 -0.036857 -0.002900 0.871057 -0.163963 -0.021153 -1.051175
0.266667 -0.042358 -0.003660 0.881773 -0.165656 -0.023580 -0.394529
0.300000 -0.047915 -0.004502 0.912073 -0.167307 -0.025937 0.199697
0.333333 -0.053526 -0.005424 0.954510 -0.168914 -0.028220 0.710318
0.366667 -0.059192 -0.006422 1.006780 -0.170475 -0.030428 1.116581
0.400000 -0.064910 -0.007493 1.070648 -0.171989 -0.032556 1.415830
0.433333 -0.070681 -0.008635 1.165100 -0.173450 -0.034605 1.596736
0.466667 -0.076502 -0.009843 1.242838 -0.174854 -0.036574 1.656144
0.500000 -0.082374 -0.011113 1.320570 -0.176198 -0.038463 1.600066
0.533333 -0.088283 -0.012444 1.373555 -0.177480 -0.040274 1.442568
0.566667 -0.094240 -0.013832 1.478933 -0.178698 -0.042009 1.197163
0.600000 -0.100231 -0.015276 1.540456 -0.179854 -0.043668 0.876876
0.633333 -0.106254 -0.016777 1.582573 -0.180950 -0.045252 0.508216
0.666667 -0.112323 -0.018322 1.593295 -0.181991 -0.046762 0.112525
0.700000 -0.118420 -0.019919 1.571116 -0.182980 -0.048198 -0.278874
0.733333 -0.124545 -0.021565 1.557528 -0.183922 -0.049561 -0.647603
0.766667 -0.130696 -0.023260 1.506510 -0.184821 -0.050850 -0.959872
0.800000 -0.136872 -0.025001 1.449802 -0.185678 -0.052068 -1.197143
0.833333 -0.143084 -0.026772 1.347463 -0.186492 -0.053215 -1.340362
0.866667 -0.149317 -0.028586 1.277086 -0.187263 -0.054294 -1.378424
0.900000 -0.155583 -0.030427 1.187396 -0.187988 -0.055307 -1.314010
0.933333 -0.161879 -0.032295 1.136813 -0.188664 -0.056257 -1.148773
0.966667 -0.168191 -0.034198 1.077038 -0.189287 -0.057145 -0.904430
1.000000 -0.174529 -0.036125 1.024168 -0.189851 -0.057973 -0.595645
1.033333 -0.180880 -0.038085 1.005910 -0.190354 -0.058740 -0.256666
1.066667 -0.187251 -0.040065 0.997837 -0.190792 -0.059447 0.083415
1.100000 -0.193633 -0.042073 1.036634 -0.191162 -0.060093 0.394294
1.133333 -0.200029 -0.044099 1.055601 -0.191464 -0.060673 0.653610
1.166667 -0.206430 -0.046149 1.123607 -0.191695 -0.061187 0.842341
1.200000 -0.212837 -0.048222 1.193751 -0.191859 -0.061633 0.943808
1.233333 -0.219249 -0.050304 1.259814 -0.191953 -0.062012 0.959703
1.266667 -0.225664 -0.052394 1.323762 -0.191981 -0.062323 0.895087
1.300000 -0.232080 -0.054489 1.378098 -0.191942 -0.062569 0.768689
1.333333 -0.238493 -0.056584 1.412724 -0.191836 -0.062753 0.592435
1.366667 -0.244901 -0.058692 1.426045 -0.191664 -0.062876 0.390613
1.400000 -0.251303 -0.060810 1.413532 -0.191421 -0.062938 0.188421
1.433333 -0.257694 -0.062920 1.396241 -0.191107 -0.062938 0.006085
1.466667 -0.264070 -0.065018 1.370443 -0.190716 -0.062872 -0.139183
1.500000 -0.270435 -0.067121 1.348579 -0.190247 -0.062737 -0.241639
1.533333 -0.276787 -0.069226 1.317893 -0.189694 -0.062528 -0.291798
1.566667 -0.283123 -0.071332 1.297082 -0.189059 -0.062245 -0.294243
1.600000 -0.289443 -0.073437 1.272359 -0.188340 -0.061885 -0.257079
1.633333 -0.295734 -0.075520 1.283507 -0.187540 -0.061453 -0.194842
1.666667 -0.301992 -0.077580 1.257182 -0.186662 -0.060952 -0.117381
1.700000 -0.308217 -0.079616 1.268107 -0.185711 -0.060387 -0.035460
1.733333 -0.314405 -0.081628 1.268827 -0.184694 -0.059768 0.043252
1.766667 -0.320554 -0.083614 1.288918 -0.183617 -0.059104 0.111091
1.800000 -0.326664 -0.085575 1.296746 -0.182487 -0.058403 0.165568
1.833333 -0.332732 -0.087508 1.313540 -0.181309 -0.057675 0.212535
1.866667 -0.338756 -0.089415 1.319537 -0.180088 -0.056925 0.250921
1.900000 -0.344749 -0.091304 1.328799 -0.178828 -0.056157 0.285926
1.933333 -0.350695 -0.093166 1.334105 -0.177529 -0.055373 0.312941
1.966667 -0.356606 -0.095006 1.332483 -0.176194 -0.054571 0.339233
2.000000 -0.362468 -0.096819 1.343870 -0.174822 -0.053747 0.363262
2.033333 -0.368279 -0.098602 1.346153 -0.173413 -0.052897 0.382926
2.066667 -0.374050 -0.100360 1.389142 -0.171969 -0.052018 0.391687
2.100000 -0.379768 -0.102087 1.379804 -0.170489 -0.051106 0.388314
2.133333 -0.385431 -0.103784 1.404609 -0.168975 -0.050156 0.375316
2.166667 -0.391038 -0.105448 1.428697 -0.167428 -0.049169 0.348266
2.200000 -0.396600 -0.107080 1.463633 -0.165851 -0.048140 0.306301
2.233333 -0.402103 -0.108678 1.479360 -0.164246 -0.047069 0.246563
2.266667 -0.407559 -0.110239 1.477205 -0.162614 -0.045954 0.179882
2.300000 -0.412964 -0.111762 1.473864 -0.160955 -0.044794 0.105632
2.333333 -0.418309 -0.113247 1.470695 -0.159269 -0.043588 0.026495
2.366667 -0.423592 -0.114691 1.475120 -0.157552 -0.042335 -0.054551
2.400000 -0.428821 -0.116093 1.459800 -0.155805 -0.041035 -0.129225
2.433333 -0.433995 -0.117449 1.457276 -0.154023 -0.039688 -0.191227
2.466667 -0.439104 -0.118761 1.454992 -0.152204 -0.038295 -0.242400
2.500000 -0.444155 -0.120024 1.451951 -0.150347 -0.036856 -0.279411
2.533333 -0.449147 -0.121238 1.430447 -0.148452 -0.035371 -0.301878
2.566667 -0.454079 -0.122402 1.408851 -0.146515 -0.033842 -0.306770
2.600000 -0.458942 -0.123513 1.391116 -0.144534 -0.032270 -0.296770
