t x y theta dxdt dydt dthetadt
0.000000 0.000000 0.000000 2.726010 -0.120808 -0.092751 -0.118655
0.033333 -0.004074 -0.003141 2.732944 -0.124088 -0.096619 -0.139326
0.066667 -0.008261 -0.006417 2.709021 -0.127414 -0.100569 -0.154951
0.100000 -0.012557 -0.009821 2.726172 -0.130782 -0.104597 -0.166778
0.133333 -0.016963 -0.013357 2.703586 -0.134194 -0.108702 -0.175273
0.166667 -0.021480 -0.017027 2.681807 -0.137648 -0.112884 -0.178210
0.200000 -0.026116 -0.020841 2.688349 -0.141143 -0.117141 -0.182697
0.233333 -0.030872 -0.024802 2.688606 -0.144679 -0.121473 -0.188181
0.266667 -0.035743 -0.028906 2.692147 -0.148257 -0.125881 -0.195813
0.300000 -0.040734 -0.033157 2.686011 -0.151879 -0.130368 -0.203156
0.333333 -0.045847 -0.037561 2.681573 -0.155543 -0.134933 -0.212354
0.366667 -0.051083 -0.042118 2.668857 -0.159251 -0.139576 -0.224072
0.400000 -0.056443 -0.046829 2.648613 -0.163001 -0.144296 -0.229568
0.433333 -0.061931 -0.051701 2.642678 -0.166793 -0.149094 -0.228414
0.466667 -0.067545 -0.056734 2.637480 -0.170627 -0.153967 -0.216543
0.500000 -0.073288 -0.061931 2.634344 -0.174499 -0.158914 -0.191729
0.533333 -0.079161 -0.067294 2.615692 -0.178410 -0.163933 -0.153529
0.566667 -0.085163 -0.072826 2.611695 -0.182358 -0.169025 -0.104892
0.600000 -0.091297 -0.078527 2.602442 -0.186340 -0.174186 -0.053363
0.633333 -0.097568 -0.084405 2.580464 -0.190357 -0.179418 0.000837
0.666667 -0.103977 -0.090462 2.587586 -0.194407 -0.184720 0.053787
0.700000 -0.110520 -0.096694 2.601055 -0.198492 -0.190092 0.099623
0.733333 -0.117198 -0.103105 2.622396 -0.202613 -0.195540 0.134417
0.766667 -0.124011 -0.109696 2.632737 -0.206774 -0.201066 0.160857
0.800000 -0.130961 -0.116468 2.647098 -0.210976 -0.206676 0.177005
0.833333 -0.138059 -0.123438 2.662044 -0.215222 -0.212371 0.176447
0.866667 -0.145295 -0.130593 2.654465 -0.219517 -0.218160 0.161528
0.900000 -0.152668 -0.137936 2.648792 -0.223863 -0.224045 0.137750
0.933333 -0.160181 -0.145467 2.657380 -0.228263 -0.230029 0.110770
0.966667 -0.167852 -0.153213 2.669542 -0.232716 -0.236111 0.080270
1.000000 -0.175662 -0.161150 2.681522 -0.237226 -0.242296 0.051077
1.033333 -0.183635 -0.169312 2.676635 -0.241794 -0.248588 0.032420
1.066667 -0.191774 -0.177701 2.661420 -0.246415 -0.254980 0.027288
1.100000 -0.200054 -0.186286 2.674490 -0.251091 -0.261474 0.037801
1.133333 -0.208475 -0.195068 2.659693 -0.255818 -0.268073 0.072945
1.166667 -0.217069 -0.204090 2.649670 -0.260598 -0.274777 0.138884
1.200000 -0.225838 -0.213356 2.660379 -0.265423 -0.281584 0.241915
1.233333 -0.234748 -0.222822 2.665942 -0.270286 -0.288492 0.381754
1.266667 -0.243837 -0.232541 2.658235 -0.275185 -0.295505 0.555955
1.300000 -0.253069 -0.242462 2.673712 -0.280114 -0.302615 0.759526
1.333333 -0.262482 -0.252644 2.667463 -0.285071 -0.309798 0.979024
1.366667 -0.272079 -0.263090 2.689233 -0.290053 -0.317026 1.203206
1.400000 -0.281818 -0.273742 2.741614 -0.295069 -0.324273 1.419926
1.433333 -0.291741 -0.284666 2.820953 -0.300125 -0.331489 1.609629
1.466667 -0.301843 -0.295868 2.917940 -0.305227 -0.338629 1.740139
1.500000 -0.312087 -0.307275 2.985812 -0.310377 -0.345653 1.783196
1.533333 -0.322503 -0.318967 3.064763 -0.315573 -0.352535 1.714945
1.566667 -0.333084 -0.330945 -3.137977 -0.320803 -0.359261 1.521547
1.600000 -0.343806 -0.343130 -3.058135 -0.326049 -0.365830 1.193690
1.633333 -0.354739 -0.355493 -2.981261 -0.331285 -0.372269 0.743355
1.666667 -0.365877 -0.368038 -2.908944 -0.336485 -0.378625 0.214850
1.700000 -0.377212 -0.380766 -2.869643 -0.341614 -0.384948 -0.343512
1.733333 -0.388738 -0.393679 -2.808282 -0.346643 -0.391303 -0.889875
1.766667 -0.400447 -0.406778 -2.840500 -0.351544 -0.397747 -1.387676
1.800000 -0.412290 -0.420082 -3.022129 -0.356294 -0.404326 -1.793663
1.833333 -0.424314 -0.433567 3.046329 -0.360882 -0.411067 -2.073866
1.866667 -0.436469 -0.447258 2.884389 -0.365304 -0.417982 -2.221411
1.900000 -0.448753 -0.461235 2.755910 -0.369575 -0.425077 -2.247256
1.933333 -0.461162 -0.475498 2.673750 -0.373715 -0.432338 -2.155476
1.966667 -0.473699 -0.490048 2.596372 -0.377754 -0.439747 -1.956962
2.000000 -0.486363 -0.504883 2.555625 -0.381723 -0.447297 -1.686894
2.033333 -0.499152 -0.519919 2.548086 -0.385653 -0.454969 -1.383509
2.066667 -0.512072 -0.535244 2.551361 -0.389564 -0.462729 -1.067594
2.100000 -0.525114 -0.550768 2.522529 -0.393472 -0.470554 -0.739490
2.133333 -0.538277 -0.566491 2.526931 -0.397381 -0.478423 -0.405233
2.166667 -0.551576 -0.582506 2.522897 -0.401287 -0.486308 -0.068421
2.200000 -0.565012 -0.598816 2.495941 -0.405179 -0.494164 0.276592
2.233333 -0.578585 -0.615420 2.424878 -0.409041 -0.501950 0.638309
2.266667 -0.592297 -0.632321 2.418539 -0.412859 -0.509638 1.009491
2.300000 -0.606150 -0.649520 2.426158 -0.416611 -0.517171 1.370271
2.333333 -0.620143 -0.667021 2.497338 -0.420287 -0.524488 1.701453
2.366667 -0.634244 -0.684707 2.606565 -0.423884 -0.531549 1.982375
2.400000 -0.648451 -0.702575 2.743445 -0.427417 -0.538337 2.196296
2.433333 -0.662791 -0.720754 2.872182 -0.430899 -0.544841 2.322413
2.466667 -0.677234 -0.739111 3.013894 -0.434348 -0.551058 2.354949
2.500000 -0.691776 -0.757641 3.133291 -0.437789 -0.557018 2.295420
2.533333 -0.706415 -0.776343 -3.071295 -0.441241 -0.562765 2.156975
2.566667 -0.721150 -0.795214 -3.017456 -0.444710 -0.568329 1.961062
2.600000 -0.735977 -0.814251 -2.978463 -0.448190 -0.573727 1.732008
2.633333 -0.750895 -0.833451 -2.951500 -0.451683 -0.578994 1.498091
2.666667 -0.765991 -0.852846 -2.911882 -0.455180 -0.584152 1.277229
2.700000 -0.781261 -0.872435 -2.888753 -0.458669 -0.589213 1.079615
2.733333 -0.796699 -0.892211 -2.853561 -0.462122 -0.594175 0.895718
2.766667 -0.812218 -0.912138 -2.841422 -0.465523 -0.599039 0.713962
2.800000 -0.827815 -0.932211 -2.811981 -0.468853 -0.603807 0.520924
2.833333 -0.843486 -0.952428 -2.793273 -0.472083 -0.608465 0.306717
2.866667 -0.859301 -0.972813 -2.757323 -0.475199 -0.613007 0.068025
2.900000 -0.875185 -0.993334 -2.741733 -0.478190 -0.617426 -0.187510
2.933333 -0.891199 -1.014015 -2.719748 -0.481062 -0.621726 -0.433789
2.966667 -0.907335 -1.034850 -2.711539 -0.483813 -0.625903 -0.649070
3.000000 -0.923532 -1.055809 -2.726788 -0.486444 -0.629961 -0.813257
3.033333 -0.939836 -1.076912 -2.802069 -0.488952 -0.633900 -0.910479
3.066667 -0.956194 -1.098131 -2.934974 -0.491331 -0.637721 -0.924388
3.100000 -0.972649 -1.119483 -3.052143 -0.493568 -0.641419 -0.851479
3.133333 -0.989152 -1.140945 -3.116119 -0.495652 -0.644993 -0.698786
3.166667 -1.005745 -1.162530 -3.136966 -0.497579 -0.648440 -0.476925
3.200000 -1.022422 -1.184236 -3.138263 -0.499336 -0.651750 -0.200515
3.233333 -1.039135 -1.206040 -3.127090 -0.500921 -0.654921 0.106339
3.266667 -1.055882 -1.227938 -3.085488 -0.502332 -0.657951 0.408182
3.300000 -1.072691 -1.249953 -3.036722 -0.503571 -0.660842 0.678475
3.333333 -1.089554 -1.272085 -2.980648 -0.504632 -0.663593 0.893181
3.366667 -1.106440 -1.294297 -2.925844 -0.505516 -0.666213 1.036097
3.400000 -1.123345 -1.316586 -2.882193 -0.506234 -0.668715 1.097077
3.433333 -1.140265 -1.338948 -2.867713 -0.506790 -0.671116 1.083546
3.466667 -1.157198 -1.361377 -2.808788 -0.507192 -0.673421 1.010648
3.500000 -1.174138 -1.383870 -2.746589 -0.507446 -0.675645 0.893207
3.533333 -1.191082 -1.406422 -2.687255 -0.507564 -0.677796 0.747569
3.566667 -1.208028 -1.429028 -2.665633 -0.507555 -0.679875 0.590579
3.600000 -1.224971 -1.451741 -2.659105 -0.507424 -0.681876 0.438128
3.633333 -1.241907 -1.474499 -2.661109 -0.507173 -0.683786 0.294224
3.666667 -1.258833 -1.497353 -2.667284 -0.506808 -0.685594 0.166272
3.700000 -1.275746 -1.520296 -2.681398 -0.506331 -0.687272 0.058931
3.733333 -1.292641 -1.543271 -2.709544 -0.505741 -0.688799 -0.020979
3.766667 -1.309515 -1.566319 -2.715152 -0.505036 -0.690148 -0.076907
3.800000 -1.326365 -1.589389 -2.721211 -0.504215 -0.691301 -0.115207
3.833333 -1.343184 -1.612513 -2.714306 -0.503277 -0.692242 -0.139065
3.866667 -1.359971 -1.635650 -2.706225 -0.502216 -0.692961 -0.155094
3.900000 -1.376718 -1.658821 -2.703343 -0.501030 -0.693459 -0.168480
3.933333 -1.393425 -1.681995 -2.710348 -0.499714 -0.693733 -0.189787
3.966667 -1.410090 -1.705169 -2.714880 -0.498266 -0.693789 -0.218341
4.000000 -1.426708 -1.728336 -2.727081 -0.496681 -0.693626 -0.249396
4.033333 -1.443276 -1.751492 -2.745120 -0.494958 -0.693252 -0.278069
4.066667 -1.459780 -1.774639 -2.731672 -0.493099 -0.692674 -0.302146
4.100000 -1.476215 -1.797766 -2.747240 -0.491108 -0.691895 -0.318001
4.133333 -1.492589 -1.820867 -2.784811 -0.488988 -0.690922 -0.322488
4.166667 -1.508882 -1.843930 -2.801095 -0.486743 -0.689758 -0.316576
4.200000 -1.525089 -1.866943 -2.819458 -0.484380 -0.688405 -0.303776
4.233333 -1.541225 -1.889916 -2.831354 -0.481905 -0.686866 -0.288509
4.266667 -1.557265 -1.912820 -2.830684 -0.479320 -0.685142 -0.271248
4.300000 -1.573202 -1.935645 -2.828306 -0.476630 -0.683236 -0.256445
4.333333 -1.589059 -1.958416 -2.833060 -0.473842 -0.681157 -0.245502
4.366667 -1.604832 -1.981129 -2.836330 -0.470967 -0.678924 -0.238861
4.400000 -1.620517 -2.003779 -2.843193 -0.468007 -0.676540 -0.236342
4.433333 -1.636112 -2.026361 -2.840887 -0.464958 -0.674003 -0.236770
4.466667 -1.651580 -2.048817 -2.866925 -0.461819 -0.671311 -0.239592
4.500000 -1.666914 -2.071136 -2.871075 -0.458583 -0.668451 -0.250155
4.533333 -1.682150 -2.093374 -2.885153 -0.455241 -0.665406 -0.279904
4.566667 -1.697282 -2.115526 -2.897396 -0.451773 -0.662156 -0.345098
4.600000 -1.712310 -2.137589 -2.916555 -0.448159 -0.658694 -0.453206
4.633333 -1.727229 -2.159558 -2.917081 -0.444390 -0.655034 -0.610634
4.666667 -1.742036 -2.181429 -2.923283 -0.440442 -0.651181 -0.818618
4.700000 -1.756730 -2.203197 -2.914477 -0.436289 -0.647148 -1.060655
4.733333 -1.771258 -2.224761 -2.918082 -0.431909 -0.642960 -1.305406
4.766667 -1.785615 -2.246112 -2.917114 -0.427294 -0.638650 -1.514624
4.800000 -1.799850 -2.267348 -2.955874 -0.422443 -0.634243 -1.662633
4.833333 -1.813908 -2.288352 -3.047874 -0.417353 -0.629767 -1.721393
4.866667 -1.827839 -2.309235 3.069466 -0.412043 -0.625255 -1.669669
4.900000 -1.841531 -2.329984 2.874134 -0.406547 -0.620738 -1.499838
4.933333 -1.854985 -2.350591 2.767592 -0.400902 -0.616231 -1.225807
4.966667 -1.868306 -2.371066 2.687846 -0.395143 -0.611733 -0.868099
5.000000 -1.881389 -2.391394 2.661195 -0.389321 -0.607245 -0.451995
5.033333 -1.894233 -2.411572 2.695257 -0.383487 -0.602737 -0.014822
5.066667 -1.906938 -2.431607 2.765629 -0.377679 -0.598172 0.398014
5.100000 -1.919400 -2.451488 2.847306 -0.371933 -0.593510 0.745878
5.133333 -1.931620 -2.471214 2.938631 -0.366279 -0.588708 1.003745
5.166667 -1.943696 -2.490786 3.026007 -0.360740 -0.583721 1.154422
5.200000 -1.955627 -2.510202 3.086808 -0.355310 -0.578492 1.196928
5.233333 -1.967318 -2.529456 3.121306 -0.349985 -0.572990 1.143013
5.266667 -1.978863 -2.548548 -3.135570 -0.344762 -0.567195 1.018308
5.300000 -1.990259 -2.567474 -3.117090 -0.339621 -0.561073 0.846000
5.333333 -2.001506 -2.586232 -3.099575 -0.334537 -0.554612 0.651168
5.366667 -2.012578 -2.604704 -3.075430 -0.329492 -0.547829 0.452256
5.400000 -2.023475 -2.622886 -3.076222 -0.324479 -0.540774 0.261171
5.433333 -2.034221 -2.640892 -3.047752 -0.319484 -0.533486 0.082862
5.466667 -2.044792 -2.658600 -3.064981 -0.314490 -0.526023 -0.077682
5.500000 -2.055188 -2.676005 -3.068204 -0.309485 -0.518476 -0.216779
5.533333 -2.065411 -2.693104 -3.060922 -0.304460 -0.510930 -0.337317
5.566667 -2.075480 -2.710017 -3.084623 -0.299399 -0.503443 -0.435788
5.600000 -2.085375 -2.726615 -3.119723 -0.294276 -0.496051 -0.513004
5.633333 -2.095094 -2.742892 3.123948 -0.289067 -0.488795 -0.563699
5.666667 -2.104659 -2.758979 3.092437 -0.283753 -0.481689 -0.592661
5.700000 -2.114068 -2.774875 3.058498 -0.278319 -0.474723 -0.599728
5.733333 -2.123322 -2.790578 3.049387 -0.272757 -0.467865 -0.584276
5.766667 -2.132420 -2.806087 3.030751 -0.267059 -0.461095 -0.553070
5.800000 -2.141283 -2.821368 3.021746 -0.261237 -0.454389 -0.512855
5.833333 -2.149909 -2.836417 2.999924 -0.255319 -0.447711 -0.470482
5.866667 -2.158300 -2.851232 2.983053 -0.249346 -0.441045 -0.427295
5.900000 -2.166537 -2.865849 2.975877 -0.243358 -0.434378 -0.388809
5.933333 -2.174540 -2.880227 2.967909 -0.237405 -0.427719 -0.358244
5.966667 -2.182312 -2.894363 2.955586 -0.231547 -0.421078 -0.335646
6.000000 -2.189853 -2.908255 2.944460 -0.225822 -0.414466 -0.316097
6.033333 -2.197242 -2.921946 2.933283 -0.220248 -0.407893 -0.299374
6.066667 -2.204404 -2.935389 2.932360 -0.214823 -0.401355 -0.286641
6.100000 -2.211415 -2.948630 2.923692 -0.209538 -0.394844 -0.274035
6.133333 -2.218276 -2.961670 2.896315 -0.204360 -0.388338 -0.260445
6.166667 -2.224988 -2.974508 2.893790 -0.199239 -0.381799 -0.244201
6.200000 -2.231553 -2.987143 2.893318 -0.194123 -0.375193 -0.227002
6.233333 -2.237970 -2.999577 2.884084 -0.188975 -0.368490 -0.216334
6.266667 -2.244242 -3.011808 2.878024 -0.183760 -0.361667 -0.225910
6.300000 -2.250370 -3.023837 2.868548 -0.178457 -0.354711 -0.276712
6.333333 -2.256286 -3.035606 2.852560 -0.173066 -0.347628 -0.387600
6.366667 -2.261994 -3.047114 2.855459 -0.167610 -0.340441 -0.583453
6.400000 -2.267495 -3.058361 2.852998 -0.162131 -0.333190 -0.882111
6.433333 -2.272793 -3.069346 2.863794 -0.156678 -0.325924 -1.286018
6.466667 -2.277890 -3.080069 2.845384 -0.151305 -0.318692 -1.775111
6.500000 -2.282788 -3.090529 2.858611 -0.146066 -0.311540 -2.326036
6.533333 -2.287489 -3.100728 2.846411 -0.141005 -0.304503 -2.910997
6.566667 -2.291999 -3.110663 2.756210 -0.136151 -0.297602 -3.485918
6.600000 -2.296378 -3.120401 2.566091 -0.131518 -0.290845 -4.005644
6.633333 -2.300631 -3.129944 2.345853 -0.127105 -0.284225 -4.428431
6.666667 -2.304758 -3.139291 2.119537 -0.122903 -0.277736 -4.735041
6.700000 -2.308762 -3.148444 1.852559 -0.118891 -0.271360 -4.896957
6.733333 -2.312646 -3.157405 1.617432 -0.115053 -0.265085 -4.897695
6.766667 -2.316411 -3.166175 1.422874 -0.111370 -0.258888 -4.738850
6.800000 -2.320036 -3.174682 1.278649 -0.107833 -0.252760 -4.438600
6.833333 -2.323547 -3.183000 1.131143 -0.104437 -0.246697 -4.025389
6.866667 -2.326941 -3.191065 1.022857 -0.101192 -0.240699 -3.516690
6.900000 -2.330225 -3.198945 0.906063 -0.098118 -0.234774 -2.938397
6.933333 -2.333402 -3.206641 0.804218 -0.095244 -0.228938 -2.308596
6.966667 -2.336474 -3.214154 0.755143 -0.092598 -0.223217 -1.634636
7.000000 -2.339444 -3.221488 0.692131 -0.090205 -0.217626 -0.914273
7.033333 -2.342314 -3.228642 0.656647 -0.088088 -0.212178 -0.143890
7.066667 -2.345148 -3.235594 0.637475 -0.086249 -0.206876 0.668370
7.100000 -2.347963 -3.242356 0.640484 -0.084672 -0.201725 1.501425
7.133333 -2.350684 -3.248945 0.687331 -0.083326 -0.196720 2.326926
7.166667 -2.353315 -3.255363 0.746165 -0.082169 -0.191850 3.110183
7.200000 -2.355963 -3.261628 0.880642 -0.081149 -0.187106 3.811464
7.233333 -2.358638 -3.267752 1.076840 -0.080207 -0.182481 4.386157
7.266667 -2.361344 -3.273746 1.285948 -0.079293 -0.177962 4.803170
7.300000 -2.364086 -3.279618 1.570413 -0.078349 -0.173525 5.042887
7.333333 -2.366747 -3.285329 1.828210 -0.077328 -0.169150 5.099715
7.366667 -2.369329 -3.290881 2.077631 -0.076192 -0.164816 4.970627
7.400000 -2.371834 -3.296275 2.282991 -0.074930 -0.160513 4.670448
7.433333 -2.374378 -3.301577 2.427478 -0.073539 -0.156228 4.239661
7.466667 -2.376849 -3.306726 2.540110 -0.072037 -0.151962 3.715940
7.500000 -2.379247 -3.311724 2.652162 -0.070473 -0.147731 3.144468
7.533333 -2.381574 -3.316572 2.760407 -0.068899 -0.143556 2.564863
7.566667 -2.383833 -3.321273 2.784724 -0.067374 -0.139461 2.021479
7.600000 -2.386024 -3.325829 2.827044 -0.065939 -0.135463 1.542344
7.633333 -2.388149 -3.330241 2.846070 -0.064646 -0.131589 1.134908
