t x y theta dxdt dydt dthetadt
0.000000 0.000000 0.000000 -0.193612 0.010202 0.049249 0.052844
0.033333 -0.000039 0.002122 -0.195087 0.016938 0.050629 0.047885
0.066667 0.000010 0.004186 -0.163829 0.024897 0.049995 0.041891
0.100000 0.000149 0.006191 -0.144113 0.034044 0.046748 0.039440
0.133333 0.001119 0.008855 -0.151168 0.044261 0.040349 0.046937
0.166667 0.003191 0.011295 -0.172610 0.055286 0.030565 0.063866
0.200000 0.005355 0.013671 -0.201615 0.066805 0.017445 0.092645
0.233333 0.007886 0.015074 -0.202947 0.078375 0.001611 0.130143
0.266667 0.010534 0.015677 -0.204068 0.089556 -0.016137 0.171607
0.300000 0.013915 0.014951 -0.184124 0.099792 -0.034605 0.212434
0.333333 0.017387 0.014161 -0.181961 0.108846 -0.052337 0.249867
0.366667 0.021621 0.010957 -0.172540 0.116637 -0.067842 0.279627
0.400000 0.025943 0.007694 -0.129892 0.123590 -0.079796 0.293267
0.433333 0.031279 0.002750 -0.094474 0.130620 -0.087314 0.289914
0.466667 0.036580 -0.003007 -0.087248 0.139016 -0.089920 0.270077
0.500000 0.041958 -0.008805 -0.076557 0.150126 -0.087705 0.237923
0.533333 0.046285 -0.013740 -0.080197 0.164971 -0.081166 0.194572
0.566667 0.049736 -0.017316 -0.079712 0.184672 -0.071301 0.147127
0.600000 0.053154 -0.019462 -0.087004 0.209958 -0.059697 0.105144
0.633333 0.057381 -0.020324 -0.086056 0.240928 -0.048138 0.072573
0.666667 0.063766 -0.019978 -0.083943 0.276980 -0.038624 0.050991
0.700000 0.070210 -0.019650 -0.095484 0.317519 -0.032935 0.041481
0.733333 0.080353 -0.018665 -0.092142 0.361691 -0.032826 0.043510
0.766667 0.094241 -0.017650 -0.074465 0.408116 -0.039622 0.051463
0.800000 0.112281 -0.017844 -0.084858 0.454749 -0.053387 0.061533
0.833333 0.130336 -0.018053 -0.077872 0.499896 -0.073822 0.070359
0.866667 0.148390 -0.018278 -0.082450 0.542015 -0.099543 0.078655
0.900000 0.166424 -0.018517 -0.070763 0.579308 -0.128914 0.081140
0.933333 0.188067 -0.023898 -0.067388 0.610251 -0.159488 0.080027
0.966667 0.209653 -0.029285 -0.056338 0.633517 -0.188631 0.081307
1.000000 0.233547 -0.039039 -0.064340 0.648586 -0.214092 0.088314
1.033333 0.257339 -0.048780 -0.051331 0.654153 -0.233458 0.109106
1.066667 0.281780 -0.060559 -0.056193 0.649198 -0.244979 0.150387
1.100000 0.306069 -0.072300 -0.062543 0.633221 -0.247404 0.224849
1.133333 0.330183 -0.083989 -0.057960 0.606106 -0.240577 0.336442
1.166667 0.354096 -0.095612 -0.053386 0.567779 -0.224815 0.487279
1.200000 0.375909 -0.104992 -0.051984 0.517855 -0.201166 0.676007
1.233333 0.394396 -0.111337 -0.050880 0.457194 -0.171444 0.894873
1.266667 0.412616 -0.117586 -0.036409 0.386639 -0.137636 1.132925
1.300000 0.424493 -0.120202 -0.012727 0.306923 -0.101783 1.377752
1.333333 0.436071 -0.122712 0.038562 0.218490 -0.065505 1.619754
1.366667 0.438571 -0.121801 0.133343 0.123352 -0.030654 1.843952
1.400000 0.440758 -0.120784 0.231004 0.024129 0.001510 2.031409
1.433333 0.442632 -0.119661 0.331248 -0.076825 0.030418 2.167153
1.466667 0.444191 -0.118432 0.413608 -0.177219 0.055680 2.235930
1.500000 0.437409 -0.115588 0.492856 -0.274361 0.077384 2.222549
1.533333 0.423899 -0.111548 0.581598 -0.365032 0.095531 2.112321
1.566667 0.404245 -0.106954 0.655651 -0.447660 0.110764 1.904119
1.600000 0.384324 -0.102272 0.737743 -0.520720 0.123719 1.607782
1.633333 0.359727 -0.097577 0.836279 -0.582559 0.134832 1.230440
1.666667 0.334915 -0.092805 0.916811 -0.631175 0.144678 0.787197
1.700000 0.309915 -0.087960 0.968566 -0.665417 0.153884 0.294087
1.733333 0.285185 -0.082478 0.954383 -0.685258 0.163211 -0.217370
1.766667 0.260325 -0.076933 0.939075 -0.690644 0.173255 -0.727242
1.800000 0.235361 -0.071332 0.871119 -0.682065 0.184272 -1.212345
1.833333 0.210323 -0.065680 0.811173 -0.660554 0.196357 -1.644457
1.866667 0.185239 -0.059982 0.704370 -0.627667 0.209122 -2.000386
1.900000 0.160137 -0.054244 0.604162 -0.584831 0.221607 -2.261791
1.933333 0.140005 -0.046446 0.493305 -0.533176 0.232426 -2.431481
1.966667 0.119906 -0.038621 0.373345 -0.473923 0.240094 -2.505098
2.000000 0.104230 -0.029109 0.266855 -0.408784 0.243255 -2.491539
2.033333 0.092992 -0.018452 0.157799 -0.339892 0.240844 -2.402798
2.066667 0.081840 -0.007793 0.101509 -0.269465 0.232347 -2.256768
2.100000 0.074218 0.003249 0.019896 -0.200145 0.218053 -2.062279
2.133333 0.069883 0.013678 -0.043909 -0.134281 0.199107 -1.825959
2.166667 0.068163 0.022322 -0.086624 -0.074141 0.176838 -1.561893
2.200000 0.069221 0.028481 -0.138862 -0.021574 0.153051 -1.281226
2.233333 0.072760 0.031493 -0.201398 0.022327 0.129691 -0.995358
2.266667 0.077809 0.031374 -0.234640 0.056584 0.108754 -0.711024
2.300000 0.082966 0.031211 -0.260645 0.081024 0.091411 -0.444759
2.333333 0.088228 0.031006 -0.272642 0.095715 0.078300 -0.208896
2.366667 0.093528 0.031732 -0.272691 0.101159 0.069685 -0.009902
2.400000 0.098920 0.032416 -0.247529 0.098664 0.065198 0.147503
2.433333 0.103099 0.035635 -0.198940 0.090003 0.063618 0.256108
2.466667 0.107361 0.038810 -0.144964 0.077507 0.063118 0.310794
2.500000 0.111701 0.041937 -0.102467 0.063506 0.062455 0.311345
2.533333 0.111815 0.045484 -0.103611 0.050610 0.060361 0.262601
2.566667 0.112003 0.048976 -0.102172 0.041354 0.055824 0.170397
2.600000 0.112266 0.052410 -0.107900 0.037688 0.048080 0.047010
2.633333 0.110291 0.053361 -0.109575 0.040783 0.037519 -0.090671
2.666667 0.108394 0.054250 -0.111642 0.051032 0.025058 -0.224428
2.700000 0.106578 0.055076 -0.112805 0.068508 0.011508 -0.337600
2.733333 0.104847 0.055838 -0.136604 0.092186 -0.002168 -0.418926
2.766667 0.107054 0.055308 -0.155597 0.120432 -0.014876 -0.461559
2.800000 0.113187 0.053632 -0.189473 0.151283 -0.025436 -0.465851
2.833333 0.119399 0.051897 -0.231111 0.182300 -0.033446 -0.434291
2.866667 0.127931 0.049666 -0.272108 0.211203 -0.038732 -0.372644
2.900000 0.138240 0.046737 -0.288055 0.235532 -0.041260 -0.285716
2.933333 0.148603 0.043760 -0.295514 0.253374 -0.041081 -0.183876
2.966667 0.160095 0.041428 -0.293635 0.263352 -0.038588 -0.076622
3.000000 0.171437 0.040056 -0.280314 0.264749 -0.034443 0.028144
3.033333 0.181381 0.039773 -0.274137 0.257914 -0.029269 0.122480
3.066667 0.191332 0.039452 -0.252449 0.243541 -0.023672 0.197811
3.100000 0.201280 0.039092 -0.222935 0.223102 -0.018250 0.245775
3.133333 0.211215 0.038696 -0.215541 0.198077 -0.013592 0.268456
3.166667 0.217036 0.038946 -0.212336 0.170490 -0.010089 0.268918
3.200000 0.222827 0.039158 -0.203903 0.142014 -0.007877 0.252091
3.233333 0.225248 0.039251 -0.178707 0.114084 -0.006818 0.220458
3.266667 0.227631 0.039305 -0.179768 0.087996 -0.006749 0.181882
3.300000 0.227928 0.038997 -0.177459 0.064698 -0.007471 0.144128
3.333333 0.228187 0.038651 -0.174678 0.045138 -0.008805 0.109789
3.366667 0.228073 0.038160 -0.177709 0.029350 -0.010490 0.080798
3.400000 0.227622 0.037704 -0.175410 0.017405 -0.012354 0.057321
3.433333 0.227703 0.037324 -0.171319 0.008855 -0.014352 0.042657
3.466667 0.227753 0.037014 -0.171587 0.003226 -0.016441 0.033498
3.500000 0.227719 0.036425 -0.179283 -0.000258 -0.018576 0.028423
3.533333 0.227649 0.035800 -0.174027 -0.002379 -0.020715 0.024318
3.566667 0.227544 0.035139 -0.182303 -0.003643 -0.022909 0.019199
