t x y theta dxdt dydt dthetadt
0.000000 0.000000 0.000000 0.125131 -0.015011 -0.014187 0.001844
0.033333 -0.000364 -0.000383 0.131457 -0.019069 -0.017180 0.003198
0.066667 -0.000956 -0.000894 0.134991 -0.023944 -0.020732 0.002899
0.100000 -0.001779 -0.001537 0.119263 -0.029700 -0.024873 0.003177
0.133333 -0.002662 -0.002239 0.137924 -0.036438 -0.029653 0.003560
0.166667 -0.003669 -0.003118 0.130505 -0.044363 -0.035190 0.003125
0.200000 -0.004911 -0.004179 0.132359 -0.053762 -0.041628 0.000975
0.233333 -0.006468 -0.005470 0.127827 -0.064933 -0.049116 0.000548
0.266667 -0.008565 -0.007120 0.135335 -0.078166 -0.057798 -0.000551
0.300000 -0.010917 -0.008917 0.134383 -0.093752 -0.067822 -0.005993
0.333333 -0.013973 -0.011207 0.135899 -0.111740 -0.079185 -0.017721
0.366667 -0.017288 -0.013647 0.123817 -0.131904 -0.091721 -0.038320
0.400000 -0.020867 -0.016239 0.131957 -0.154031 -0.105218 -0.070426
0.433333 -0.024710 -0.018985 0.126125 -0.177914 -0.119479 -0.120457
0.466667 -0.030144 -0.022715 0.136696 -0.203285 -0.134272 -0.188075
0.500000 -0.037462 -0.027653 0.127177 -0.229737 -0.149277 -0.273156
0.533333 -0.047249 -0.033946 0.126935 -0.257105 -0.164249 -0.370644
0.566667 -0.057293 -0.040389 0.136687 -0.285366 -0.179027 -0.477361
0.600000 -0.067590 -0.046980 0.117233 -0.314158 -0.193359 -0.586107
0.633333 -0.078132 -0.053716 0.097480 -0.343244 -0.207028 -0.687077
0.666667 -0.088913 -0.060595 0.055311 -0.372674 -0.219989 -0.766026
0.700000 -0.099928 -0.067612 0.011195 -0.402767 -0.232370 -0.807544
0.733333 -0.115119 -0.076105 -0.027761 -0.433388 -0.244278 -0.802475
0.766667 -0.130524 -0.084729 -0.063596 -0.464457 -0.255883 -0.743010
0.800000 -0.146132 -0.093478 -0.107533 -0.495952 -0.267392 -0.627226
0.833333 -0.161931 -0.102348 -0.163042 -0.527677 -0.278964 -0.459870
0.866667 -0.180634 -0.111845 -0.181891 -0.559009 -0.290558 -0.259576
0.900000 -0.199499 -0.121452 -0.195993 -0.589297 -0.302048 -0.047928
0.933333 -0.220129 -0.131597 -0.221112 -0.618584 -0.313438 0.155366
0.966667 -0.242461 -0.142331 -0.197515 -0.646675 -0.324567 0.333503
1.000000 -0.265991 -0.153754 -0.150794 -0.673551 -0.335254 0.474212
1.033333 -0.289608 -0.165258 -0.083169 -0.699148 -0.345305 0.566362
1.066667 -0.313289 -0.176835 -0.005788 -0.723920 -0.354635 0.610101
1.100000 -0.337669 -0.189244 0.036439 -0.748047 -0.363099 0.609639
1.133333 -0.362069 -0.201709 0.051311 -0.771402 -0.370506 0.572642
1.166667 -0.387543 -0.214579 0.055554 -0.794081 -0.376780 0.508379
1.200000 -0.414076 -0.227672 0.045382 -0.816007 -0.381938 0.426585
1.233333 -0.441867 -0.240789 0.041746 -0.837082 -0.386026 0.343112
1.266667 -0.471080 -0.253969 0.031417 -0.856637 -0.389041 0.272424
1.300000 -0.500180 -0.267155 0.033342 -0.874226 -0.391112 0.221667
1.333333 -0.530753 -0.280313 0.056108 -0.889260 -0.392336 0.189958
1.366667 -0.561151 -0.293457 0.066310 -0.901337 -0.392862 0.177161
1.400000 -0.593192 -0.306686 0.073929 -0.910130 -0.392809 0.179314
1.433333 -0.624993 -0.319881 0.075862 -0.915535 -0.392295 0.190071
1.466667 -0.656521 -0.333032 0.095985 -0.917853 -0.391457 0.197651
1.500000 -0.687741 -0.346127 0.090044 -0.917337 -0.390368 0.199910
1.533333 -0.718620 -0.359158 0.089962 -0.914614 -0.389122 0.199269
1.566667 -0.749123 -0.372113 0.101964 -0.909950 -0.387721 0.192363
1.600000 -0.779216 -0.384982 0.116999 -0.903918 -0.386186 0.179048
1.633333 -0.808867 -0.397755 0.113630 -0.897057 -0.384558 0.158476
1.666667 -0.838040 -0.410422 0.121492 -0.889845 -0.382881 0.136720
1.700000 -0.868350 -0.423349 0.131377 -0.882620 -0.381167 0.113087
1.733333 -0.898113 -0.436148 0.135589 -0.875403 -0.379394 0.088716
1.766667 -0.927294 -0.448809 0.150067 -0.868350 -0.377571 0.069621
1.800000 -0.955860 -0.461321 0.149319 -0.861290 -0.375661 0.059510
1.833333 -0.983774 -0.473675 0.147331 -0.853867 -0.373621 0.061272
1.866667 -1.012262 -0.486169 0.141256 -0.845431 -0.371383 0.072945
1.900000 -1.040029 -0.498483 0.122436 -0.835482 -0.368956 0.094645
1.933333 -1.068088 -0.510822 0.118823 -0.823489 -0.366329 0.122019
1.966667 -1.096277 -0.523168 0.114750 -0.808614 -0.363458 0.148739
2.000000 -1.124362 -0.535396 0.128353 -0.789779 -0.360294 0.165497
2.033333 -1.151579 -0.547401 0.143146 -0.765741 -0.356705 0.163775
2.066667 -1.178203 -0.559351 0.163938 -0.735649 -0.352565 0.134659
2.100000 -1.203885 -0.571056 0.189251 -0.698453 -0.347623 0.067802
2.133333 -1.228588 -0.582505 0.199125 -0.653019 -0.341583 -0.041017
2.166667 -1.251946 -0.593995 0.217825 -0.598588 -0.334066 -0.197420
2.200000 -1.273402 -0.605462 0.220588 -0.534886 -0.324579 -0.394414
2.233333 -1.292303 -0.616780 0.209021 -0.462107 -0.312541 -0.624419
2.266667 -1.310089 -0.627799 0.192306 -0.380326 -0.297400 -0.869021
2.300000 -1.323976 -0.638384 0.164790 -0.290363 -0.278770 -1.104293
2.333333 -1.333426 -0.648390 0.106613 -0.193820 -0.256462 -1.309040
2.366667 -1.338076 -0.657538 0.061238 -0.092789 -0.230594 -1.457423
2.400000 -1.341511 -0.666346 -0.012966 0.010805 -0.201426 -1.534684
2.433333 -1.339962 -0.673975 -0.102256 0.114981 -0.169513 -1.526836
2.466667 -1.333638 -0.680092 -0.185799 0.217491 -0.135489 -1.435530
2.500000 -1.322787 -0.684447 -0.292295 0.316583 -0.100019 -1.265031
2.533333 -1.307562 -0.686616 -0.359778 0.411231 -0.063706 -1.028186
2.566667 -1.288184 -0.686128 -0.421434 0.501118 -0.027057 -0.740312
2.600000 -1.267553 -0.685271 -0.415988 0.585779 0.009267 -0.422380
2.633333 -1.245677 -0.684047 -0.392852 0.665192 0.044654 -0.101247
2.666667 -1.222559 -0.682456 -0.370420 0.740036 0.078676 0.202188
2.700000 -1.198208 -0.680499 -0.332670 0.811385 0.111097 0.459810
2.733333 -1.170006 -0.676076 -0.298500 0.880153 0.141598 0.656147
2.766667 -1.138237 -0.669573 -0.259939 0.947037 0.169948 0.773396
2.800000 -1.105266 -0.662716 -0.223994 1.012813 0.195995 0.806849
2.833333 -1.071108 -0.655511 -0.165755 1.077973 0.219679 0.760955
2.866667 -1.034117 -0.647028 -0.132770 1.142386 0.240767 0.643947
2.900000 -0.994742 -0.637581 -0.086780 1.205392 0.258922 0.471767
2.933333 -0.953088 -0.627473 -0.045984 1.266369 0.274142 0.258340
2.966667 -0.909315 -0.617138 -0.039360 1.324886 0.286616 0.025518
3.000000 -0.863188 -0.606609 -0.050896 1.380414 0.296699 -0.205401
3.033333 -0.815085 -0.596170 -0.071702 1.432435 0.304775 -0.412442
3.066667 -0.764959 -0.585887 -0.102862 1.480687 0.311478 -0.577854
3.100000 -0.713828 -0.575326 -0.145787 1.525172 0.317537 -0.684408
3.133333 -0.661137 -0.565020 -0.204013 1.565914 0.323564 -0.717472
3.166667 -0.607502 -0.554453 -0.253235 1.602827 0.329941 -0.675280
3.200000 -0.552717 -0.543874 -0.308911 1.636053 0.336930 -0.562623
3.233333 -0.497049 -0.533051 -0.353433 1.665880 0.344694 -0.393232
3.266667 -0.440791 -0.521896 -0.376689 1.692682 0.353163 -0.181367
3.300000 -0.383460 -0.510150 -0.378449 1.716756 0.362144 0.052534
3.333333 -0.325264 -0.497702 -0.358098 1.738435 0.371275 0.285974
3.366667 -0.266319 -0.485048 -0.313623 1.758080 0.380247 0.502196
3.400000 -0.206756 -0.471907 -0.275118 1.776005 0.388738 0.686093
3.433333 -0.146769 -0.458318 -0.233774 1.792494 0.396502 0.831879
3.466667 -0.086505 -0.444451 -0.179171 1.807728 0.403363 0.935787
3.500000 -0.026157 -0.430508 -0.142494 1.821790 0.409280 1.005422
3.533333 0.034769 -0.416413 -0.097715 1.834696 0.414348 1.046047
3.566667 0.096087 -0.402578 -0.068980 1.846432 0.418688 1.068912
3.600000 0.157916 -0.388613 -0.035382 1.856840 0.422490 1.086102
3.633333 0.220221 -0.374529 -0.023339 1.865623 0.425917 1.102759
3.666667 0.282966 -0.360336 0.016763 1.872441 0.429141 1.121534
3.700000 0.346118 -0.346047 0.040331 1.877121 0.432096 1.137094
3.733333 0.409641 -0.331671 0.066574 1.879441 0.434535 1.149507
3.766667 0.473500 -0.317220 0.119722 1.879157 0.436147 1.150600
3.800000 0.537659 -0.302704 0.173170 1.876247 0.436593 1.130272
3.833333 0.600076 -0.287595 0.244427 1.871058 0.435547 1.080139
3.866667 0.662725 -0.272444 0.279051 1.864047 0.432577 1.000717
3.900000 0.725573 -0.257264 0.315058 1.855673 0.427511 0.890880
3.933333 0.787303 -0.242052 0.368714 1.846676 0.420392 0.750752
3.966667 0.848105 -0.227304 0.392800 1.837985 0.411285 0.587776
4.000000 0.909009 -0.212559 0.405556 1.830417 0.400254 0.411542
4.033333 0.969255 -0.199075 0.420486 1.824430 0.387523 0.235966
4.066667 1.029009 -0.187284 0.407482 1.820398 0.373643 0.067069
4.100000 1.088775 -0.175525 0.397994 1.818643 0.359062 -0.084344
4.133333 1.148524 -0.163807 0.382624 1.819034 0.344222 -0.207992
4.166667 1.208225 -0.152137 0.365562 1.821119 0.329602 -0.301558
4.200000 1.268790 -0.141734 0.352816 1.824366 0.315787 -0.360301
4.233333 1.329248 -0.131392 0.323462 1.828290 0.303112 -0.387246
4.266667 1.390620 -0.121866 0.310275 1.832196 0.291618 -0.385449
4.300000 1.452832 -0.113097 0.291142 1.835293 0.281407 -0.359928
4.333333 1.514843 -0.104406 0.261257 1.836945 0.272501 -0.317103
4.366667 1.576622 -0.095797 0.254525 1.836554 0.264878 -0.260767
4.400000 1.638568 -0.087424 0.246356 1.833641 0.258309 -0.200744
4.433333 1.700309 -0.079155 0.244463 1.827756 0.252664 -0.140096
4.466667 1.761548 -0.070938 0.258006 1.818661 0.247782 -0.083823
4.500000 1.822726 -0.062787 0.244968 1.806274 0.243386 -0.032969
4.533333 1.883546 -0.054652 0.272637 1.790630 0.239207 0.005637
4.566667 1.943942 -0.046623 0.251981 1.771963 0.235018 0.032569
4.600000 2.003468 -0.038673 0.259173 1.750540 0.230672 0.051573
4.633333 2.062508 -0.030836 0.260353 1.726696 0.226035 0.062032
4.666667 2.120231 -0.023195 0.278105 1.700584 0.221068 0.067699
4.700000 2.176389 -0.015913 0.277129 1.672410 0.215813 0.068511
4.733333 2.231975 -0.008756 0.274536 1.642320 0.210320 0.070237
4.766667 2.286666 -0.001819 0.274971 1.610401 0.204627 0.072096
4.800000 2.339174 0.004755 0.264423 1.576446 0.198814 0.073935
4.833333 2.391032 0.011196 0.271893 1.539793 0.192941 0.076290
4.866667 2.442214 0.017502 0.283978 1.500252 0.187083 0.081830
4.900000 2.492698 0.023670 0.277693 1.457438 0.181271 0.090974
4.933333 2.542460 0.029698 0.300575 1.410969 0.175529 0.103888
4.966667 2.591477 0.035583 0.290314 1.360419 0.169866 0.120548
5.000000 2.635419 0.041032 0.284540 1.306138 0.164267 0.140436
5.033333 2.678575 0.046334 0.303506 1.249333 0.158739 0.165311
5.066667 2.720931 0.051488 0.291341 1.190624 0.153218 0.190276
5.100000 2.762469 0.056492 0.305385 1.130487 0.147666 0.212952
5.133333 2.799324 0.061379 0.318808 1.069522 0.142010 0.230638
5.166667 2.830234 0.065986 0.307498 1.008620 0.136165 0.244097
5.200000 2.860294 0.070438 0.328643 0.947667 0.130004 0.246525
5.233333 2.889502 0.074734 0.346779 0.886052 0.123382 0.235267
5.266667 2.917851 0.078874 0.368085 0.823759 0.116263 0.210058
5.300000 2.945339 0.082856 0.370368 0.761265 0.108608 0.170803
5.333333 2.971964 0.086679 0.390651 0.698901 0.100467 0.118752
5.366667 2.997721 0.090342 0.404599 0.636462 0.091930 0.051155
5.400000 3.019048 0.093224 0.375318 0.574587 0.083197 -0.018607
5.433333 3.036764 0.095998 0.389713 0.514478 0.074489 -0.091438
5.466667 3.051205 0.098236 0.377141 0.457242 0.066004 -0.160671
5.500000 3.062907 0.099955 0.386466 0.403831 0.057959 -0.225615
5.533333 3.072633 0.101304 0.354115 0.355229 0.050513 -0.280842
5.566667 3.080651 0.102448 0.349115 0.312832 0.043898 -0.322653
5.600000 3.087856 0.103435 0.323979 0.277340 0.038228 -0.355900
5.633333 3.094723 0.104371 0.301377 0.248500 0.033576 -0.370018
5.666667 3.101895 0.105389 0.286256 0.225559 0.029933 -0.366577
5.700000 3.108299 0.106252 0.295933 0.207481 0.027240 -0.338687
5.733333 3.113948 0.106961 0.294168 0.193124 0.025418 -0.293706
5.766667 3.121119 0.107711 0.256457 0.180853 0.024185 -0.231604
5.800000 3.127562 0.108308 0.248140 0.169397 0.023354 -0.157775
5.833333 3.133290 0.108754 0.215621 0.157977 0.022764 -0.082962
5.866667 3.138316 0.109050 0.203587 0.146198 0.022329 -0.010425
5.900000 3.143587 0.110285 0.213822 0.133744 0.021899 0.049912
5.933333 3.148182 0.111369 0.238965 0.120441 0.021374 0.100494
5.966667 3.152112 0.112304 0.262076 0.106690 0.020800 0.135128
6.000000 3.155391 0.113089 0.283068 0.092795 0.020149 0.157231
6.033333 3.158030 0.113723 0.316620 0.079080 0.019390 0.165207
6.066667 3.160044 0.114206 0.302603 0.065832 0.018482 0.156019
6.100000 3.161445 0.114539 0.299987 0.053549 0.017584 0.135176
6.133333 3.163092 0.115254 0.299987 0.042621 0.016768 0.105437
6.166667 3.164152 0.115816 0.282085 0.033218 0.016075 0.074447
6.200000 3.164639 0.116227 0.298907 0.025487 0.015562 0.038440
6.233333 3.164564 0.116485 0.279626 0.019464 0.015272 0.007590
6.266667 3.164505 0.116972 0.289313 0.015021 0.015198 -0.014107
6.300000 3.164447 0.117542 0.293056 0.011871 0.015217 -0.026458
