t x y theta dxdt dydt dthetadt
0.000000 0.000000 0.000000 -0.015019 0.007281 -0.004684 -0.002981
0.033333 -0.000272 -0.000186 -0.014346 0.011770 -0.005863 -0.002215
0.066667 -0.000529 -0.000441 -0.010803 0.017744 -0.007414 -0.002168
0.100000 -0.000339 -0.000686 -0.003425 0.025256 -0.009516 -0.004747
0.133333 0.000287 -0.000918 -0.006410 0.034430 -0.012330 -0.010122
0.166667 0.001371 -0.001138 -0.003918 0.045419 -0.015988 -0.017522
0.200000 0.002914 -0.001345 -0.011126 0.058303 -0.020590 -0.029403
0.233333 0.004948 -0.001539 -0.009998 0.073205 -0.026167 -0.047463
0.266667 0.007202 -0.002213 -0.009806 0.090295 -0.032547 -0.070885
0.300000 0.009777 -0.003063 -0.009883 0.109955 -0.039483 -0.098041
0.333333 0.013026 -0.004200 -0.014696 0.132574 -0.046557 -0.126689
0.366667 0.017063 -0.005788 -0.010450 0.158502 -0.053327 -0.155086
0.400000 0.022121 -0.008228 -0.020273 0.187958 -0.059263 -0.179824
0.433333 0.027722 -0.010644 -0.023564 0.221093 -0.063759 -0.195450
0.466667 0.034756 -0.013683 -0.034799 0.257736 -0.066361 -0.201826
0.500000 0.042367 -0.016694 -0.045530 0.297510 -0.066630 -0.197757
0.533333 0.051632 -0.019900 -0.062274 0.339745 -0.064360 -0.185179
0.566667 0.062852 -0.022974 -0.080774 0.383766 -0.059393 -0.166498
0.600000 0.076333 -0.025651 -0.089716 0.429042 -0.051724 -0.145396
0.633333 0.092141 -0.027753 -0.097402 0.474932 -0.041614 -0.128025
0.666667 0.110372 -0.028920 -0.088878 0.521083 -0.029405 -0.116159
0.700000 0.129283 -0.030051 -0.083075 0.567206 -0.015553 -0.112295
0.733333 0.148851 -0.031142 -0.078977 0.613338 -0.000458 -0.116839
0.766667 0.170361 -0.030623 -0.059668 0.659543 0.015380 -0.127713
0.800000 0.192446 -0.030053 -0.074154 0.705893 0.031510 -0.139860
0.833333 0.216616 -0.028109 -0.075086 0.752451 0.047520 -0.147916
0.866667 0.241381 -0.026120 -0.080143 0.799249 0.063129 -0.146984
0.900000 0.267726 -0.023565 -0.111178 0.846062 0.078127 -0.130245
0.933333 0.296139 -0.020506 -0.126927 0.892426 0.092287 -0.095167
0.966667 0.326873 -0.016993 -0.143598 0.937734 0.105521 -0.041169
1.000000 0.359764 -0.013023 -0.153731 0.981203 0.117718 0.027493
1.033333 0.395078 -0.008482 -0.150701 1.022044 0.128949 0.105540
1.066667 0.431114 -0.003941 -0.141421 1.059344 0.139199 0.186208
1.100000 0.468767 0.001362 -0.123818 1.092434 0.148318 0.255933
1.133333 0.507060 0.006661 -0.105147 1.120910 0.156164 0.307611
1.166667 0.545944 0.011953 -0.082282 1.144651 0.162599 0.338026
1.200000 0.585356 0.017239 -0.062637 1.163824 0.167554 0.344438
1.233333 0.625249 0.023652 -0.027195 1.178912 0.170734 0.326100
1.266667 0.665524 0.030058 -0.013877 1.190609 0.171937 0.285654
1.300000 0.706145 0.036454 -0.014452 1.199687 0.171177 0.233152
1.333333 0.747111 0.042830 -0.002538 1.206752 0.168450 0.174722
1.366667 0.787459 0.049281 -0.006280 1.212360 0.163708 0.112693
1.400000 0.827194 0.055103 -0.010110 1.217029 0.156919 0.052699
1.433333 0.867488 0.060652 -0.019528 1.221149 0.148364 0.002856
1.466667 0.908202 0.065320 -0.033179 1.225001 0.138351 -0.032987
1.500000 0.949265 0.069926 -0.014980 1.228772 0.127109 -0.058310
1.533333 0.990607 0.074471 -0.017308 1.232753 0.115032 -0.071278
1.566667 1.031669 0.077810 -0.028151 1.237099 0.102630 -0.070875
1.600000 1.073015 0.081075 -0.034052 1.241780 0.090316 -0.059015
1.633333 1.114643 0.084258 -0.034537 1.246663 0.078392 -0.040176
1.666667 1.155856 0.085977 -0.042782 1.251610 0.067144 -0.018925
1.700000 1.197340 0.087605 -0.044015 1.256513 0.056888 0.007781
1.733333 1.239082 0.089139 -0.046214 1.261195 0.047821 0.036406
1.766667 1.281365 0.090024 -0.044060 1.265438 0.039990 0.063915
1.800000 1.323878 0.090810 -0.036835 1.269096 0.033479 0.088074
1.833333 1.366585 0.091499 -0.033205 1.272096 0.028303 0.107320
1.866667 1.409467 0.092087 -0.021505 1.274374 0.024271 0.120900
1.900000 1.452477 0.092578 -0.010467 1.275801 0.021110 0.124556
1.933333 1.495576 0.092973 -0.014109 1.276271 0.018538 0.119381
1.966667 1.538393 0.093514 0.001112 1.275825 0.016257 0.104539
2.000000 1.580487 0.094070 -0.000976 1.274677 0.013976 0.084318
2.033333 1.622949 0.094837 0.005074 1.272995 0.011398 0.060017
2.066667 1.665408 0.095503 0.008670 1.270975 0.008374 0.034865
2.100000 1.707837 0.096067 0.015641 1.268875 0.004815 0.012750
2.133333 1.750089 0.096413 -0.001040 1.266925 0.000619 -0.007518
2.166667 1.792306 0.096651 0.003676 1.265443 -0.004214 -0.021383
2.200000 1.834387 0.096522 -0.002236 1.264482 -0.009702 -0.030678
2.233333 1.876170 0.095903 -0.013144 1.264158 -0.015776 -0.035119
2.266667 1.917894 0.095167 -0.006131 1.264541 -0.022349 -0.037119
2.300000 1.959519 0.094317 -0.013161 1.265724 -0.029326 -0.037943
2.333333 2.001936 0.093378 -0.013884 1.267760 -0.036582 -0.035789
2.366667 2.044234 0.092320 -0.005767 1.270369 -0.044039 -0.035358
2.400000 2.086561 0.090926 -0.004817 1.273364 -0.051555 -0.038126
2.433333 2.128644 0.089067 -0.002357 1.276564 -0.059059 -0.045308
2.466667 2.170204 0.086792 -0.017803 1.279875 -0.066470 -0.053536
2.500000 2.213702 0.084562 -0.007731 1.282982 -0.073709 -0.062202
2.533333 2.257321 0.081684 -0.009016 1.285673 -0.080663 -0.073390
2.566667 2.300674 0.078692 -0.013441 1.287926 -0.087206 -0.082832
2.600000 2.343749 0.075587 -0.023101 1.289790 -0.093273 -0.086540
2.633333 2.387053 0.072147 -0.032359 1.291219 -0.098735 -0.080658
2.666667 2.430082 0.068591 -0.019658 1.292050 -0.103450 -0.069717
2.700000 2.472773 0.064925 -0.034977 1.292447 -0.107231 -0.052694
2.733333 2.515616 0.061243 -0.043856 1.292507 -0.109990 -0.028511
2.766667 2.558820 0.057301 -0.045083 1.292258 -0.111627 0.001609
2.800000 2.602098 0.053320 -0.050815 1.291529 -0.112055 0.034046
2.833333 2.645513 0.049291 -0.033372 1.290144 -0.111254 0.061440
2.866667 2.688515 0.045156 -0.034069 1.287951 -0.109325 0.086921
2.900000 2.731089 0.040914 -0.039513 1.284612 -0.106398 0.107118
2.933333 2.774261 0.036776 -0.025578 1.279764 -0.102559 0.121331
2.966667 2.817679 0.033087 -0.002439 1.273109 -0.097971 0.126088
3.000000 2.860839 0.030187 -0.007999 1.264500 -0.092839 0.121503
3.033333 2.903646 0.027756 0.005924 1.253682 -0.087403 0.112855
3.066667 2.945828 0.025233 -0.002266 1.240433 -0.081827 0.100538
3.100000 2.987393 0.022612 0.003223 1.224328 -0.076341 0.084714
3.133333 3.028307 0.019896 0.011064 1.205080 -0.071149 0.065166
3.166667 3.068721 0.017674 0.008684 1.182463 -0.066400 0.045503
3.200000 3.108431 0.015355 -0.000693 1.155978 -0.062101 0.025914
3.233333 3.147276 0.013835 0.004523 1.125243 -0.058291 0.002991
3.266667 3.185389 0.012214 0.010840 1.089738 -0.055046 -0.026333
3.300000 3.222730 0.010491 0.006783 1.049397 -0.052496 -0.058558
3.333333 3.259291 0.008665 0.006123 1.004088 -0.050831 -0.090791
3.366667 3.292929 0.007242 0.011370 0.953829 -0.050229 -0.121633
3.400000 3.325732 0.005713 0.008794 0.899256 -0.050985 -0.148519
3.433333 3.354623 0.004538 0.008308 0.841585 -0.053321 -0.164967
3.466667 3.382646 0.003253 -0.002374 0.782322 -0.057382 -0.165527
3.500000 3.409810 0.001851 -0.022570 0.722750 -0.063193 -0.152446
3.533333 3.432703 0.000340 -0.033424 0.664310 -0.070698 -0.126886
3.566667 3.451646 -0.001444 -0.066654 0.608173 -0.079775 -0.089857
3.600000 3.468030 -0.003807 -0.077224 0.555229 -0.090182 -0.045231
3.633333 3.482978 -0.006920 -0.061908 0.505455 -0.101542 -0.000330
3.666667 3.497211 -0.010674 -0.057255 0.458670 -0.113474 0.040127
3.700000 3.510671 -0.014568 -0.043666 0.414607 -0.125645 0.075228
3.733333 3.524045 -0.019086 -0.023334 0.372398 -0.137814 0.099032
3.766667 3.536916 -0.024464 -0.014223 0.331089 -0.149769 0.106558
3.800000 3.548908 -0.029971 0.001100 0.289404 -0.161512 0.099787
3.833333 3.559376 -0.035900 -0.001360 0.246591 -0.173153 0.084684
3.866667 3.567786 -0.042015 0.003018 0.202017 -0.184884 0.061032
3.900000 3.573679 -0.048116 -0.007847 0.155224 -0.196909 0.030134
3.933333 3.578703 -0.054339 -0.017595 0.106233 -0.209409 0.000286
3.966667 3.581225 -0.061091 -0.032485 0.055385 -0.222625 -0.022270
4.000000 3.582962 -0.067968 -0.015567 0.003214 -0.236618 -0.041848
4.033333 3.582230 -0.075521 0.003159 -0.049802 -0.251434 -0.063051
4.066667 3.578529 -0.084427 -0.022626 -0.103390 -0.267088 -0.084036
4.100000 3.574045 -0.093444 -0.036900 -0.157280 -0.283475 -0.102750
4.133333 3.567428 -0.103683 -0.019093 -0.210933 -0.300277 -0.124465
4.166667 3.560041 -0.114020 -0.019967 -0.264133 -0.317209 -0.149991
4.200000 3.551898 -0.124449 -0.019655 -0.316505 -0.334070 -0.169754
4.233333 3.540593 -0.135814 -0.022376 -0.367828 -0.350730 -0.178843
4.266667 3.526216 -0.148357 -0.040012 -0.417728 -0.367090 -0.175409
4.300000 3.511179 -0.160974 -0.049143 -0.465930 -0.383131 -0.162974
4.333333 3.493438 -0.174186 -0.079836 -0.512428 -0.399063 -0.133052
4.366667 3.475182 -0.187466 -0.082989 -0.557063 -0.415013 -0.089926
4.400000 3.454133 -0.202048 -0.107044 -0.599613 -0.430966 -0.037377
4.433333 3.432689 -0.216686 -0.085528 -0.640040 -0.446894 0.018250
4.466667 3.410820 -0.231363 -0.100659 -0.678419 -0.462687 0.071208
4.500000 3.388253 -0.246358 -0.076326 -0.714841 -0.478205 0.116904
4.533333 3.364257 -0.262327 -0.058843 -0.749531 -0.493199 0.142913
4.566667 3.338434 -0.279169 -0.047975 -0.782580 -0.507372 0.151114
4.600000 3.310373 -0.297566 -0.035903 -0.814168 -0.520420 0.134704
4.633333 3.281942 -0.315927 -0.023859 -0.844064 -0.531974 0.098596
4.666667 3.253150 -0.334233 -0.010708 -0.871957 -0.541722 0.045600
4.700000 3.224002 -0.352465 -0.020597 -0.897420 -0.549428 -0.013257
4.733333 3.193409 -0.371630 -0.008079 -0.919923 -0.554949 -0.071786
4.766667 3.160880 -0.391144 -0.013632 -0.939041 -0.558254 -0.126493
4.800000 3.128113 -0.410537 -0.040055 -0.954578 -0.559554 -0.167774
4.833333 3.094623 -0.429738 -0.064277 -0.966464 -0.559106 -0.194391
4.866667 3.061073 -0.448436 -0.075263 -0.974442 -0.557138 -0.203355
4.900000 3.027550 -0.466982 -0.080531 -0.978086 -0.553715 -0.199798
4.933333 2.994098 -0.485360 -0.094126 -0.977103 -0.548965 -0.179896
4.966667 2.960791 -0.503550 -0.090827 -0.971398 -0.543012 -0.148626
5.000000 2.927620 -0.521704 -0.096285 -0.960748 -0.535835 -0.113630
5.033333 2.895126 -0.539760 -0.092099 -0.944552 -0.527102 -0.081171
5.066667 2.862863 -0.557587 -0.106118 -0.922643 -0.516495 -0.053951
5.100000 2.830905 -0.575172 -0.095267 -0.895434 -0.503924 -0.035064
5.133333 2.799256 -0.592497 -0.094360 -0.862778 -0.488932 -0.029701
5.166667 2.767948 -0.609545 -0.094139 -0.823996 -0.470811 -0.033892
5.200000 2.739605 -0.625953 -0.095178 -0.778278 -0.448739 -0.041484
5.233333 2.715451 -0.640751 -0.085333 -0.725785 -0.422463 -0.048188
5.266667 2.691708 -0.655226 -0.077645 -0.666472 -0.391733 -0.054622
5.300000 2.668384 -0.669361 -0.085135 -0.599983 -0.356198 -0.054251
5.333333 2.645525 -0.683147 -0.101946 -0.526872 -0.316088 -0.045563
5.366667 2.629473 -0.693081 -0.115305 -0.448735 -0.272323 -0.027487
5.400000 2.614015 -0.702654 -0.123248 -0.367269 -0.226069 -0.004085
5.433333 2.599191 -0.711860 -0.133364 -0.283588 -0.178284 0.024500
5.466667 2.590380 -0.717209 -0.125632 -0.199096 -0.130224 0.058420
5.500000 2.586617 -0.719588 -0.115778 -0.115579 -0.083357 0.092428
5.533333 2.587513 -0.719477 -0.093012 -0.034616 -0.039095 0.121912
5.566667 2.592109 -0.717131 -0.091225 0.043027 0.001677 0.139628
5.600000 2.597328 -0.714403 -0.088738 0.116414 0.038153 0.143943
5.633333 2.603173 -0.711297 -0.074877 0.184729 0.069540 0.132163
5.666667 2.609615 -0.707814 -0.081160 0.247745 0.095641 0.106526
5.700000 2.619542 -0.703489 -0.051627 0.305984 0.116742 0.065980
5.733333 2.631873 -0.698393 -0.049338 0.360551 0.133657 0.018403
5.766667 2.644737 -0.692927 -0.059744 0.412770 0.147492 -0.027443
5.800000 2.660190 -0.687189 -0.066674 0.463947 0.159400 -0.065364
5.833333 2.676212 -0.681100 -0.056104 0.515094 0.170602 -0.091009
5.866667 2.693934 -0.675348 -0.074450 0.566823 0.182086 -0.103109
5.900000 2.713719 -0.669792 -0.083456 0.619266 0.194698 -0.094815
5.933333 2.734078 -0.663908 -0.103895 0.672116 0.209040 -0.065973
5.966667 2.756739 -0.658121 -0.114887 0.724317 0.225261 -0.021743
6.000000 2.780028 -0.652027 -0.118431 0.775121 0.243496 0.033984
6.033333 2.806616 -0.644571 -0.121440 0.823585 0.263811 0.099868
6.066667 2.836562 -0.635706 -0.117383 0.868717 0.286066 0.170385
6.100000 2.869704 -0.624794 -0.087111 0.909510 0.309772 0.237331
6.133333 2.903341 -0.613602 -0.075794 0.945076 0.334352 0.292928
6.166667 2.937434 -0.602137 -0.062431 0.975054 0.359303 0.334784
6.200000 2.971937 -0.590408 -0.045405 0.998933 0.384145 0.362407
6.233333 3.006833 -0.576915 -0.038040 1.016802 0.408342 0.372968
6.266667 3.041927 -0.561901 -0.011959 1.029074 0.431457 0.367826
6.300000 3.077273 -0.546650 0.007254 1.036540 0.453328 0.350902
6.333333 3.112807 -0.531174 0.016459 1.039978 0.473770 0.324286
6.366667 3.147430 -0.514859 0.027800 1.040083 0.492556 0.289175
6.400000 3.182164 -0.498344 0.033572 1.037559 0.509411 0.244034
6.433333 3.216784 -0.480539 0.030683 1.032942 0.524181 0.191086
6.466667 3.251623 -0.461785 0.039927 1.026611 0.536778 0.130777
6.500000 3.286491 -0.442879 0.044331 1.018727 0.547057 0.067543
6.533333 3.321151 -0.423602 0.062700 1.009264 0.554759 0.004692
6.566667 3.355115 -0.404186 0.062026 0.998169 0.559776 -0.051914
6.600000 3.387964 -0.385108 0.072464 0.985171 0.561946 -0.097542
6.633333 3.420652 -0.365938 0.056044 0.969447 0.560982 -0.131237
6.666667 3.453192 -0.346699 0.039666 0.950262 0.556721 -0.150333
6.700000 3.485005 -0.327691 0.017243 0.926900 0.549030 -0.160224
6.733333 3.516261 -0.308751 -0.005481 0.898585 0.537850 -0.164272
6.766667 3.547429 -0.289808 -0.012100 0.864473 0.523056 -0.167841
6.800000 3.577523 -0.271647 -0.030512 0.823982 0.504468 -0.172784
6.833333 3.607528 -0.253522 -0.010980 0.777445 0.482190 -0.182268
6.866667 3.634694 -0.237393 -0.002019 0.725344 0.456364 -0.195627
6.900000 3.661628 -0.221319 0.009090 0.668086 0.427086 -0.210287
6.933333 3.684106 -0.206905 0.018000 0.607142 0.394997 -0.221804
6.966667 3.700945 -0.194804 0.013596 0.544358 0.360920 -0.226914
7.000000 3.717424 -0.182782 -0.010445 0.481671 0.326128 -0.226398
7.033333 3.733580 -0.170853 -0.031701 0.420566 0.291709 -0.217237
7.066667 3.743525 -0.162670 -0.088029 0.362556 0.258730 -0.201050
7.100000 3.753309 -0.154615 -0.101643 0.309264 0.228374 -0.179152
7.133333 3.759170 -0.150365 -0.116893 0.261462 0.201567 -0.153398
7.166667 3.764913 -0.146254 -0.107581 0.219324 0.178924 -0.126748
7.200000 3.770500 -0.142278 -0.078303 0.183064 0.160736 -0.099083
7.233333 3.775844 -0.138427 -0.049092 0.152890 0.147252 -0.073962
7.266667 3.780857 -0.134691 -0.044664 0.128248 0.138273 -0.055362
7.300000 3.784127 -0.131131 -0.035667 0.108576 0.133300 -0.045330
7.333333 3.785731 -0.126996 -0.061228 0.093155 0.131293 -0.043806
7.366667 3.787029 -0.122978 -0.078722 0.081478 0.131272 -0.048736
7.400000 3.788066 -0.119082 -0.106178 0.072857 0.132029 -0.058236
7.433333 3.789775 -0.114194 -0.100519 0.066537 0.132327 -0.067050
7.466667 3.791276 -0.109436 -0.113407 0.062292 0.131079 -0.070151
7.500000 3.793381 -0.104118 -0.105813 0.059711 0.127317 -0.064462
7.533333 3.795997 -0.098539 -0.081311 0.058432 0.120333 -0.052661
7.566667 3.798390 -0.093494 -0.077058 0.058143 0.109520 -0.036606
7.600000 3.800514 -0.088579 -0.082932 0.058538 0.094675 -0.017356
7.633333 3.802489 -0.085102 -0.078053 0.059433 0.075814 -0.000198
7.666667 3.804203 -0.081756 -0.093683 0.060562 0.053235 0.012960
7.700000 3.805702 -0.078546 -0.103375 0.061793 0.027504 0.021467
7.733333 3.807433 -0.078056 -0.116248 0.063122 -0.000330 0.030281
7.766667 3.809019 -0.077706 -0.101206 0.064495 -0.029162 0.039075
7.800000 3.810962 -0.079351 -0.103228 0.065776 -0.057822 0.044618
7.833333 3.813594 -0.082658 -0.086235 0.066692 -0.084976 0.049243
7.866667 3.816478 -0.087641 -0.076358 0.066969 -0.109258 0.052465
7.900000 3.819129 -0.092729 -0.077083 0.066253 -0.129155 0.050934
7.933333 3.821966 -0.098640 -0.061736 0.064214 -0.143694 0.038972
7.966667 3.824438 -0.105258 -0.076553 0.060655 -0.152067 0.022069
8.000000 3.826719 -0.112303 -0.083052 0.055476 -0.153631 0.004634
8.033333 3.829004 -0.119490 -0.077661 0.048748 -0.148290 -0.012133
8.066667 3.831086 -0.126733 -0.070197 0.040620 -0.136243 -0.028552
8.100000 3.832348 -0.132574 -0.076833 0.031417 -0.118466 -0.039501
8.133333 3.833409 -0.138449 -0.089789 0.021494 -0.095765 -0.040401
8.166667 3.833859 -0.141386 -0.093564 0.011179 -0.069126 -0.037776
8.200000 3.834159 -0.144347 -0.082110 0.000863 -0.039813 -0.035646
8.233333 3.833599 -0.143465 -0.102270 -0.009050 -0.009352 -0.033332
8.266667 3.832920 -0.142602 -0.099752 -0.018128 0.020805 -0.029450
8.300000 3.832115 -0.141756 -0.087079 -0.026097 0.049769 -0.027823
8.333333 3.830720 -0.138735 -0.083760 -0.032649 0.076256 -0.030935
8.366667 3.828998 -0.133924 -0.085795 -0.037567 0.099149 -0.036735
8.400000 3.827121 -0.129125 -0.088152 -0.040746 0.117565 -0.040716
8.433333 3.825100 -0.124341 -0.087291 -0.042229 0.131423 -0.047475
8.466667 3.823021 -0.118611 -0.091285 -0.042166 0.140677 -0.056639
8.500000 3.821179 -0.112255 -0.096685 -0.040650 0.145122 -0.065654
8.533333 3.819709 -0.106026 -0.102900 -0.037964 0.145240 -0.071425
8.566667 3.818140 -0.099831 -0.109011 -0.034388 0.141917 -0.071996
