t x y theta dxdt dydt dthetadt
0.000000 0.000000 0.000000 0.000314 -0.002607 -0.001561 -0.000523
0.033333 -0.000082 0.000026 -0.009981 -0.002040 0.003075 0.002122
0.066667 -0.000130 0.000304 -0.004359 -0.001400 0.009193 0.005673
0.100000 -0.000145 0.000841 0.000790 -0.000674 0.017174 0.010043
0.133333 -0.000123 0.001643 0.005429 0.000161 0.027329 0.015487
0.166667 -0.000117 0.001775 0.010150 0.001131 0.040048 0.021542
0.200000 -0.000071 0.002183 0.002495 0.002255 0.055550 0.030529
0.233333 -0.000044 0.003065 -0.001292 0.003562 0.073990 0.041936
0.266667 -0.000029 0.004634 -0.000548 0.005051 0.094886 0.055572
0.300000 0.000031 0.006502 0.004884 0.006624 0.118176 0.072655
0.333333 0.000180 0.010088 -0.001857 0.008102 0.144016 0.094855
0.366667 0.000377 0.013985 0.007506 0.009300 0.172400 0.123499
0.400000 0.000861 0.022181 0.017394 0.009928 0.203390 0.155382
0.433333 0.001393 0.030690 0.016252 0.009690 0.237074 0.187708
0.466667 0.001975 0.039514 0.022714 0.008296 0.274097 0.219237
0.500000 0.002608 0.048651 0.021254 0.005635 0.314283 0.250163
0.533333 0.003294 0.058103 0.032843 0.001755 0.357159 0.277887
0.566667 0.004033 0.067867 0.054733 -0.003288 0.402318 0.300834
0.600000 0.004827 0.077940 0.066121 -0.009220 0.449389 0.319755
0.633333 0.004584 0.093224 0.080591 -0.015695 0.497651 0.335370
0.666667 0.003531 0.112464 0.096187 -0.022268 0.545785 0.348868
0.700000 0.002534 0.131992 0.105362 -0.028604 0.592860 0.355901
0.733333 0.000585 0.155196 0.119130 -0.034365 0.637697 0.355213
0.766667 -0.001304 0.178665 0.116133 -0.039237 0.679133 0.349557
0.800000 -0.003190 0.204319 0.124729 -0.043026 0.715918 0.339032
0.833333 -0.005008 0.230208 0.149971 -0.045664 0.747476 0.325202
0.866667 -0.006741 0.257264 0.173217 -0.047242 0.773772 0.305051
0.900000 -0.008338 0.284391 0.182019 -0.047814 0.794778 0.280802
0.933333 -0.009753 0.310997 0.190938 -0.047644 0.811108 0.254589
0.966667 -0.011402 0.338668 0.184648 -0.046952 0.823213 0.223256
1.000000 -0.012830 0.367221 0.208152 -0.045967 0.831748 0.184891
1.033333 -0.014422 0.395690 0.209496 -0.044871 0.837064 0.139721
1.066667 -0.015918 0.424273 0.209201 -0.043793 0.839445 0.092069
1.100000 -0.017548 0.452902 0.213222 -0.042851 0.839246 0.044872
1.133333 -0.019071 0.481610 0.214205 -0.042020 0.836297 -0.000688
1.166667 -0.020484 0.510381 0.218544 -0.041300 0.830762 -0.040967
1.200000 -0.021567 0.538849 0.219278 -0.040715 0.822452 -0.069029
1.233333 -0.022558 0.566734 0.212397 -0.040262 0.810838 -0.081393
1.266667 -0.023828 0.593889 0.207136 -0.039884 0.795423 -0.076429
1.300000 -0.025241 0.619910 0.190113 -0.039535 0.775202 -0.054566
1.333333 -0.026515 0.645918 0.177887 -0.039158 0.749678 -0.012806
1.366667 -0.028036 0.671950 0.160925 -0.038659 0.718182 0.048793
1.400000 -0.029430 0.697471 0.159578 -0.037773 0.680190 0.124289
1.433333 -0.030670 0.722940 0.175314 -0.036247 0.635806 0.208043
1.466667 -0.032046 0.745306 0.176159 -0.033875 0.585228 0.293158
1.500000 -0.033255 0.767595 0.195756 -0.030509 0.529587 0.374596
1.533333 -0.034664 0.785662 0.215882 -0.025746 0.470005 0.440385
1.566667 -0.035899 0.799424 0.235056 -0.019252 0.407970 0.481201
1.600000 -0.036943 0.813086 0.269759 -0.010560 0.345539 0.492233
1.633333 -0.037600 0.819981 0.286716 0.001110 0.285172 0.471632
1.666667 -0.038050 0.826774 0.324353 0.016515 0.228890 0.420363
1.700000 -0.038287 0.833466 0.347954 0.036695 0.178563 0.341145
1.733333 -0.037289 0.834454 0.349816 0.062195 0.136426 0.246982
1.766667 -0.036064 0.835355 0.368310 0.093667 0.104413 0.150040
1.800000 -0.034608 0.836179 0.367345 0.131140 0.084367 0.066023
1.833333 -0.032915 0.836937 0.382745 0.174007 0.076716 0.005391
1.866667 -0.028006 0.836391 0.359086 0.221432 0.082232 -0.019889
1.900000 -0.022852 0.835807 0.332212 0.271969 0.101313 -0.000484
1.933333 -0.013180 0.835483 0.296229 0.323781 0.133027 0.067772
1.966667 0.000675 0.836899 0.270453 0.374144 0.175870 0.187837
2.000000 0.014765 0.838328 0.276088 0.420674 0.227558 0.355128
2.033333 0.032057 0.843554 0.289948 0.461054 0.286177 0.565472
2.066667 0.051399 0.853332 0.310411 0.493320 0.349214 0.808998
2.100000 0.071951 0.868091 0.342241 0.515893 0.413505 1.073402
2.133333 0.092778 0.887589 0.385156 0.528322 0.476054 1.342429
2.166667 0.113761 0.907105 0.437833 0.530962 0.533797 1.601931
2.200000 0.134882 0.926624 0.495606 0.523933 0.583443 1.839348
2.233333 0.154840 0.949418 0.565428 0.507977 0.622067 2.046294
2.266667 0.172845 0.974112 0.660416 0.484073 0.647454 2.215492
2.300000 0.186267 0.999537 0.742870 0.453818 0.657971 2.344111
2.333333 0.199770 1.024888 0.851954 0.418438 0.652496 2.426742
2.366667 0.213345 1.050139 0.933027 0.380105 0.630852 2.461186
2.400000 0.226983 1.075270 1.029893 0.341678 0.593901 2.446117
2.433333 0.240676 1.100259 1.117216 0.305758 0.542607 2.379539
2.466667 0.254417 1.125082 1.208422 0.274665 0.477913 2.263559
2.500000 0.259452 1.141969 1.294425 0.250456 0.402259 2.098341
2.533333 0.261494 1.151166 1.364500 0.235167 0.319194 1.900508
2.566667 0.263595 1.160151 1.430866 0.229765 0.232626 1.679788
2.600000 0.265761 1.168919 1.509867 0.234594 0.146872 1.448710
2.633333 0.269818 1.171823 1.572657 0.249420 0.067390 1.220693
2.666667 0.275518 1.169332 1.582447 0.273600 -0.000127 1.012936
2.700000 0.283696 1.163208 1.595558 0.304998 -0.051889 0.841435
2.733333 0.294075 1.154115 1.597652 0.340664 -0.085032 0.706984
2.766667 0.306992 1.143022 1.586897 0.377485 -0.097697 0.615432
2.800000 0.322579 1.131959 1.595022 0.412197 -0.088984 0.566911
2.833333 0.340442 1.122846 1.588179 0.442087 -0.060568 0.560346
2.866667 0.358381 1.113633 1.610830 0.464834 -0.014589 0.577231
2.900000 0.377257 1.109393 1.624704 0.479360 0.046615 0.604942
2.933333 0.396116 1.111830 1.652187 0.485714 0.119214 0.634499
2.966667 0.413638 1.121879 1.683316 0.484549 0.198839 0.654088
3.000000 0.431186 1.131855 1.749312 0.477203 0.280837 0.653924
3.033333 0.448749 1.141747 1.788359 0.465034 0.362269 0.623546
3.066667 0.463297 1.158016 1.804418 0.449636 0.439465 0.570470
3.100000 0.477841 1.174185 1.826823 0.432436 0.509979 0.496696
3.133333 0.490881 1.195469 1.828282 0.414550 0.572835 0.410191
3.166667 0.503906 1.216627 1.843275 0.396663 0.628501 0.315405
3.200000 0.515831 1.242550 1.839367 0.379004 0.677427 0.228071
3.233333 0.527732 1.268313 1.846463 0.361515 0.719238 0.155643
3.266667 0.539605 1.293895 1.841546 0.343410 0.754452 0.096020
3.300000 0.551448 1.319278 1.849710 0.323797 0.782622 0.045717
3.333333 0.563258 1.344442 1.836465 0.301540 0.803618 -0.007388
3.366667 0.573978 1.372460 1.825339 0.275478 0.815934 -0.067977
3.400000 0.583785 1.402494 1.822244 0.244612 0.818086 -0.156958
3.433333 0.592115 1.433307 1.829167 0.208542 0.809059 -0.284102
3.466667 0.600406 1.463808 1.847466 0.167544 0.787160 -0.459173
3.500000 0.608658 1.493969 1.836762 0.122336 0.751541 -0.685503
3.533333 0.614415 1.523337 1.869833 0.073967 0.700971 -0.963926
3.566667 0.616770 1.550589 1.844204 0.024272 0.635884 -1.289942
3.600000 0.615745 1.574755 1.802319 -0.024595 0.558268 -1.644406
3.633333 0.611413 1.594081 1.744475 -0.070730 0.470530 -2.008186
3.666667 0.607091 1.612956 1.651859 -0.111900 0.376617 -2.351706
3.700000 0.600021 1.625594 1.556102 -0.145924 0.280595 -2.649712
3.733333 0.591226 1.629514 1.455326 -0.170894 0.187147 -2.870870
3.766667 0.582512 1.632984 1.329715 -0.186044 0.099878 -2.998428
3.800000 0.573075 1.626601 1.176055 -0.191187 0.021841 -3.029185
3.833333 0.563774 1.619803 1.008847 -0.186218 -0.044829 -2.961316
3.866667 0.554633 1.612617 0.856315 -0.171796 -0.099274 -2.808030
3.900000 0.548197 1.605313 0.741130 -0.149048 -0.141594 -2.583922
3.933333 0.541966 1.597667 0.696627 -0.119137 -0.173146 -2.315312
3.966667 0.535959 1.589691 0.636050 -0.082742 -0.195138 -2.024939
4.000000 0.535872 1.583576 0.591390 -0.040878 -0.210319 -1.734893
4.033333 0.536038 1.577158 0.551665 0.005022 -0.220651 -1.470657
4.066667 0.536468 1.570448 0.535071 0.053459 -0.227694 -1.249353
4.100000 0.537173 1.563451 0.516000 0.103195 -0.232176 -1.087482
4.133333 0.538165 1.556177 0.493215 0.153003 -0.234341 -0.987405
4.166667 0.543797 1.547756 0.474958 0.201298 -0.234353 -0.951565
4.200000 0.552981 1.537763 0.431796 0.247485 -0.230283 -0.970903
4.233333 0.565018 1.528108 0.410033 0.291048 -0.220881 -1.031587
4.266667 0.578190 1.519474 0.403653 0.331674 -0.205114 -1.115617
4.300000 0.591667 1.510616 0.372849 0.369211 -0.182150 -1.194394
4.333333 0.605447 1.501547 0.327488 0.403579 -0.151060 -1.245757
4.366667 0.619984 1.495655 0.282587 0.435387 -0.111353 -1.240676
4.400000 0.634819 1.489574 0.231317 0.464790 -0.064953 -1.161155
4.433333 0.650385 1.488206 0.145045 0.492374 -0.013830 -0.994660
4.466667 0.666241 1.486669 0.085989 0.518828 0.039720 -0.738091
4.500000 0.682385 1.484972 -0.008561 0.544418 0.092619 -0.400769
4.533333 0.701754 1.493119 -0.075317 0.569169 0.140950 0.000988
4.566667 0.721394 1.501119 -0.090376 0.592778 0.181134 0.441022
4.600000 0.741296 1.508966 -0.059500 0.614972 0.211162 0.894429
4.633333 0.764208 1.523697 0.025080 0.635147 0.229344 1.335698
4.666667 0.787354 1.538240 0.134984 0.652699 0.235332 1.744457
4.700000 0.810719 1.552567 0.256073 0.667264 0.229382 2.101928
4.733333 0.833940 1.562624 0.374269 0.678997 0.213767 2.396091
4.766667 0.857355 1.572413 0.456997 0.688078 0.191693 2.632859
4.800000 0.880540 1.575644 0.544325 0.694594 0.167088 2.822642
4.833333 0.903899 1.578575 0.635892 0.698995 0.144387 2.982861
4.866667 0.927418 1.581192 0.720121 0.701691 0.126728 3.129993
4.900000 0.950569 1.579971 0.799448 0.703139 0.117538 3.273327
4.933333 0.973796 1.577823 0.893984 0.703132 0.118203 3.421116
4.966667 0.997529 1.576953 1.003733 0.701450 0.128447 3.559192
5.000000 1.021386 1.580377 1.124696 0.697839 0.145021 3.669414
5.033333 1.045344 1.583432 1.277290 0.691774 0.163669 3.725668
5.066667 1.069389 1.586098 1.397960 0.682783 0.179964 3.707063
5.100000 1.093147 1.595696 1.574413 0.670341 0.188293 3.601212
5.133333 1.115640 1.609944 1.744514 0.654843 0.183539 3.401495
5.166667 1.138174 1.623721 1.926485 0.636725 0.161489 3.111372
5.200000 1.160740 1.636992 2.084163 0.616841 0.120596 2.742692
5.233333 1.183324 1.649725 2.151850 0.596342 0.060213 2.323567
5.266667 1.201573 1.654958 2.199388 0.576656 -0.018589 1.875283
5.300000 1.219835 1.659619 2.232176 0.559496 -0.113586 1.428280
5.333333 1.235932 1.656081 2.237353 0.546061 -0.220603 1.008575
5.366667 1.251139 1.645352 2.232210 0.537589 -0.335043 0.643822
5.400000 1.266871 1.627329 2.238013 0.535136 -0.452402 0.351895
5.433333 1.282629 1.608747 2.211061 0.539390 -0.568267 0.133722
5.466667 1.299076 1.583740 2.205236 0.550293 -0.679463 -0.012259
5.500000 1.315554 1.558214 2.181076 0.567200 -0.782662 -0.095424
5.533333 1.333545 1.527998 2.166612 0.589392 -0.876495 -0.130252
5.566667 1.353247 1.494519 2.165759 0.616012 -0.960495 -0.132334
5.600000 1.372978 1.460605 2.165547 0.645950 -1.034958 -0.111241
5.633333 1.396348 1.421633 2.168439 0.678011 -1.099978 -0.077169
5.666667 1.419738 1.382289 2.180966 0.711467 -1.156063 -0.034612
5.700000 1.443140 1.342604 2.172370 0.745983 -1.204142 0.010095
5.733333 1.470162 1.298603 2.164168 0.780885 -1.244593 0.055492
5.766667 1.497179 1.254336 2.169009 0.815582 -1.277547 0.100295
5.800000 1.524177 1.209840 2.163808 0.849453 -1.302871 0.140634
5.833333 1.551145 1.165152 2.170736 0.882295 -1.321187 0.179377
5.866667 1.581150 1.119004 2.173171 0.913468 -1.332355 0.217130
5.900000 1.613000 1.072535 2.184427 0.941992 -1.336182 0.254416
5.933333 1.646579 1.026592 2.213513 0.967194 -1.332760 0.290092
5.966667 1.680990 0.981330 2.226178 0.988204 -1.322199 0.322805
6.000000 1.715283 0.936063 2.233781 1.004281 -1.304852 0.350741
6.033333 1.750532 0.890547 2.241217 1.014278 -1.280579 0.371802
6.066667 1.786189 0.845930 2.241948 1.017778 -1.249863 0.386591
6.100000 1.822226 0.803089 2.259066 1.014513 -1.213137 0.395256
6.133333 1.858175 0.762087 2.280002 1.004387 -1.170937 0.398441
6.166667 1.893538 0.723068 2.309124 0.987410 -1.123656 0.395069
6.200000 1.927106 0.686213 2.308342 0.963514 -1.071471 0.386347
6.233333 1.960396 0.649582 2.326870 0.932859 -1.014824 0.370400
6.266667 1.991184 0.617236 2.343181 0.895153 -0.953732 0.344092
6.300000 2.021007 0.586476 2.352075 0.850536 -0.888534 0.308381
6.333333 2.050490 0.556009 2.360870 0.799323 -0.819423 0.266185
6.366667 2.077724 0.529785 2.377760 0.741928 -0.746757 0.222297
6.400000 2.104581 0.503890 2.384209 0.678963 -0.671056 0.179616
6.433333 2.128455 0.481368 2.401626 0.611315 -0.593218 0.141995
6.466667 2.149021 0.461734 2.395783 0.540404 -0.514461 0.113793
6.500000 2.166314 0.445578 2.392195 0.467527 -0.435926 0.094047
6.533333 2.180496 0.432707 2.382119 0.394069 -0.358999 0.082709
6.566667 2.191267 0.423686 2.374869 0.321938 -0.285292 0.080058
6.600000 2.197412 0.419285 2.368188 0.253424 -0.216895 0.084017
6.633333 2.203131 0.415263 2.381933 0.190525 -0.155296 0.094326
6.666667 2.208430 0.411613 2.384940 0.134582 -0.101538 0.109047
6.700000 2.209073 0.412312 2.397695 0.086960 -0.056741 0.127237
6.733333 2.209309 0.413369 2.419165 0.048331 -0.021385 0.144239
6.766667 2.206814 0.415967 2.421794 0.018689 0.004618 0.154975
6.800000 2.203937 0.418904 2.416574 -0.002947 0.022485 0.159333
6.833333 2.200729 0.422207 2.410813 -0.017548 0.033284 0.158145
6.866667 2.198565 0.424976 2.415379 -0.025910 0.037861 0.150057
6.900000 2.197104 0.427590 2.435913 -0.029594 0.037823 0.135951
6.933333 2.196890 0.428035 2.443636 -0.029910 0.034642 0.120321
6.966667 2.196356 0.428775 2.450481 -0.028155 0.029641 0.105577
