t x y theta dxdt dydt dthetadt
0.000000 0.000000 0.000000 0.470479 -0.022231 0.016778 -0.096570
0.033333 -0.000328 0.000120 0.499179 -0.027169 0.019856 -0.145377
0.066667 -0.000580 0.000071 0.487984 -0.032873 0.023762 -0.203670
0.100000 -0.001414 0.000403 0.478701 -0.039307 0.028546 -0.264920
0.133333 -0.002712 0.001151 0.475549 -0.046431 0.034233 -0.329060
0.166667 -0.004573 0.002545 0.463618 -0.054209 0.040824 -0.393033
0.200000 -0.007040 0.004589 0.448460 -0.062466 0.048082 -0.456066
0.233333 -0.009409 0.006428 0.426607 -0.070984 0.055747 -0.510311
0.266667 -0.011673 0.008053 0.402635 -0.079513 0.063487 -0.554448
0.300000 -0.013826 0.009455 0.371757 -0.087911 0.071063 -0.588288
0.333333 -0.016704 0.011881 0.359681 -0.096160 0.078345 -0.609212
0.366667 -0.020353 0.014962 0.319434 -0.104275 0.085266 -0.618011
0.400000 -0.024728 0.019001 0.299333 -0.112299 0.091862 -0.612623
0.433333 -0.028964 0.022776 0.285484 -0.120249 0.098125 -0.593626
0.466667 -0.033051 0.026274 0.262319 -0.128149 0.104097 -0.563266
0.500000 -0.036982 0.029484 0.252375 -0.135970 0.109774 -0.521011
0.533333 -0.041272 0.032668 0.236031 -0.143388 0.114979 -0.470687
0.566667 -0.045999 0.036232 0.201127 -0.150124 0.119556 -0.412493
0.600000 -0.051366 0.040528 0.196909 -0.155745 0.123247 -0.352586
0.633333 -0.056540 0.044485 0.173697 -0.159869 0.125851 -0.298661
0.666667 -0.063046 0.049818 0.169220 -0.161615 0.126629 -0.254492
0.700000 -0.069336 0.054784 0.149128 -0.159798 0.124579 -0.222270
0.733333 -0.075400 0.059368 0.155505 -0.153235 0.118563 -0.203021
0.766667 -0.081226 0.063554 0.177582 -0.140779 0.107485 -0.201609
0.800000 -0.087696 0.068804 0.175864 -0.121373 0.090255 -0.212957
0.833333 -0.093906 0.073626 0.192220 -0.093666 0.065521 -0.233981
0.866667 -0.098781 0.077747 0.165166 -0.057323 0.032849 -0.255965
0.900000 -0.103374 0.081409 0.166197 -0.012634 -0.007659 -0.279331
0.933333 -0.105093 0.082547 0.142228 0.039648 -0.055541 -0.297459
0.966667 -0.106514 0.083197 0.111598 0.098813 -0.110386 -0.305653
1.000000 -0.104113 0.080493 0.084968 0.163315 -0.170958 -0.302363
1.033333 -0.097703 0.074097 0.083516 0.230831 -0.235434 -0.286466
1.066667 -0.087133 0.063988 0.048549 0.299312 -0.302147 -0.264703
1.100000 -0.076270 0.053355 0.064001 0.367018 -0.369689 -0.237640
1.133333 -0.061079 0.038640 0.057192 0.432088 -0.436460 -0.211814
1.166667 -0.041985 0.020232 0.059823 0.492361 -0.500595 -0.189276
1.200000 -0.022633 0.001307 0.071601 0.546678 -0.561269 -0.177103
1.233333 -0.003039 -0.018129 0.078538 0.594518 -0.618024 -0.177271
1.266667 0.020069 -0.041787 0.062028 0.635647 -0.670605 -0.189412
1.300000 0.043382 -0.065936 0.038588 0.669838 -0.718762 -0.209760
1.333333 0.066881 -0.090566 0.040100 0.697469 -0.762764 -0.235817
1.366667 0.092275 -0.118260 0.032114 0.719236 -0.803176 -0.264688
1.400000 0.117812 -0.146407 0.016060 0.735555 -0.840038 -0.290267
1.433333 0.143470 -0.174989 0.017900 0.746683 -0.873346 -0.308683
1.466667 0.169344 -0.205393 -0.011101 0.753097 -0.903337 -0.317814
1.500000 0.195293 -0.236197 -0.012072 0.755069 -0.930222 -0.322246
1.533333 0.221265 -0.269126 -0.023848 0.752782 -0.953860 -0.322954
1.566667 0.247268 -0.302417 -0.039953 0.746486 -0.974255 -0.324698
1.600000 0.273278 -0.336048 -0.053064 0.736226 -0.991500 -0.330797
1.633333 0.299274 -0.369999 -0.064433 0.721851 -1.005616 -0.347206
1.666667 0.323839 -0.404439 -0.084802 0.702884 -1.016460 -0.374653
1.700000 0.346577 -0.438901 -0.072430 0.679425 -1.023968 -0.410786
1.733333 0.369238 -0.473615 -0.090463 0.651458 -1.028386 -0.451230
1.766667 0.391805 -0.508560 -0.081729 0.619120 -1.029865 -0.491802
1.800000 0.414258 -0.543714 -0.097380 0.582964 -1.028675 -0.529761
1.833333 0.434030 -0.578713 -0.115618 0.544015 -1.025248 -0.557890
1.866667 0.453655 -0.613874 -0.160662 0.503311 -1.020054 -0.575851
1.900000 0.470489 -0.648349 -0.189593 0.461599 -1.013564 -0.580969
1.933333 0.484657 -0.682234 -0.222923 0.419842 -1.006164 -0.576642
1.966667 0.496252 -0.715310 -0.268907 0.378979 -0.998247 -0.562267
2.000000 0.505353 -0.747547 -0.274732 0.339903 -0.990232 -0.538255
2.033333 0.514260 -0.779838 -0.280732 0.303169 -0.982448 -0.508437
2.066667 0.522969 -0.812165 -0.290928 0.269523 -0.975196 -0.474721
2.100000 0.531477 -0.844510 -0.277993 0.239412 -0.968658 -0.439598
2.133333 0.539780 -0.876854 -0.299217 0.212869 -0.962899 -0.400930
2.166667 0.546144 -0.908918 -0.306987 0.189665 -0.957851 -0.362452
2.200000 0.550696 -0.940565 -0.332220 0.169326 -0.953275 -0.323918
2.233333 0.555039 -0.972153 -0.348537 0.151445 -0.948936 -0.285552
2.266667 0.559175 -1.003664 -0.373704 0.135476 -0.944567 -0.245303
2.300000 0.563103 -1.035079 -0.391208 0.121091 -0.939971 -0.204154
2.333333 0.566466 -1.066463 -0.392904 0.108200 -0.935002 -0.168071
2.366667 0.569624 -1.097715 -0.389327 0.096619 -0.929544 -0.137761
2.400000 0.572578 -1.128818 -0.397333 0.086162 -0.923581 -0.115864
2.433333 0.575332 -1.159753 -0.370695 0.076641 -0.917095 -0.106215
2.466667 0.577886 -1.190502 -0.357782 0.067868 -0.910069 -0.113641
2.500000 0.580243 -1.221047 -0.357604 0.059664 -0.902436 -0.137250
2.533333 0.581787 -1.250917 -0.366055 0.051841 -0.894109 -0.172087
2.566667 0.583139 -1.280549 -0.376371 0.044362 -0.884947 -0.213978
2.600000 0.584302 -1.309925 -0.392363 0.037273 -0.874803 -0.259776
2.633333 0.585280 -1.339029 -0.406862 0.030617 -0.863530 -0.300899
2.666667 0.586075 -1.367844 -0.420047 0.024441 -0.850982 -0.330347
2.700000 0.586692 -1.396353 -0.437546 0.018742 -0.836948 -0.347281
2.733333 0.587133 -1.424540 -0.447773 0.013449 -0.821281 -0.352585
2.766667 0.587403 -1.452389 -0.464755 0.008443 -0.803788 -0.347869
2.800000 0.587505 -1.479884 -0.493590 0.003569 -0.784069 -0.335218
2.833333 0.587577 -1.506427 -0.490400 -0.001340 -0.761772 -0.320927
2.866667 0.587466 -1.531708 -0.496520 -0.006447 -0.736621 -0.308420
2.900000 0.587305 -1.555673 -0.506835 -0.011873 -0.708489 -0.299356
2.933333 0.586993 -1.579228 -0.506297 -0.017688 -0.677216 -0.295401
2.966667 0.586533 -1.602359 -0.511045 -0.023872 -0.642831 -0.295166
3.000000 0.585930 -1.625054 -0.532910 -0.030334 -0.605792 -0.295711
3.033333 0.584912 -1.645325 -0.537307 -0.036915 -0.566535 -0.292778
3.066667 0.583761 -1.665139 -0.542007 -0.043436 -0.525267 -0.280575
3.100000 0.582110 -1.682102 -0.557218 -0.049684 -0.482497 -0.256109
3.133333 0.579913 -1.696046 -0.575800 -0.055410 -0.438954 -0.213829
3.166667 0.577598 -1.709514 -0.585020 -0.060411 -0.395426 -0.156225
3.200000 0.575173 -1.722503 -0.607860 -0.064487 -0.352505 -0.086169
3.233333 0.572587 -1.732462 -0.614861 -0.067490 -0.310920 -0.006825
3.266667 0.569902 -1.741940 -0.625616 -0.069325 -0.271653 0.074256
3.300000 0.567353 -1.749321 -0.610159 -0.069988 -0.235282 0.151283
3.333333 0.564717 -1.756224 -0.592741 -0.069500 -0.202009 0.216115
3.366667 0.562270 -1.761567 -0.580628 -0.067932 -0.172003 0.269265
3.400000 0.560039 -1.765367 -0.540596 -0.065420 -0.145558 0.304823
3.433333 0.557737 -1.768703 -0.526350 -0.062154 -0.122554 0.322932
3.466667 0.555368 -1.771579 -0.506422 -0.058296 -0.102783 0.321736
3.500000 0.553223 -1.773915 -0.506911 -0.053968 -0.085965 0.306132
3.533333 0.551451 -1.775960 -0.495881 -0.049392 -0.071918 0.280620
3.566667 0.550143 -1.777900 -0.495437 -0.044765 -0.060238 0.244382
3.600000 0.548784 -1.779406 -0.490602 -0.040252 -0.050291 0.206638
3.633333 0.547376 -1.780486 -0.489040 -0.035966 -0.041682 0.169246
3.666667 0.546540 -1.781757 -0.481005 -0.032064 -0.034025 0.138048
3.700000 0.545660 -1.782615 -0.465491 -0.028668 -0.027112 0.110887
3.733333 0.545126 -1.783831 -0.467909 -0.025805 -0.020747 0.087792
3.766667 0.544552 -1.784645 -0.453554 -0.023428 -0.014941 0.070070
3.800000 0.543941 -1.785063 -0.469475 -0.021488 -0.009797 0.056735
3.833333 0.543294 -1.785092 -0.468445 -0.019939 -0.005416 0.045219
