t x y theta dxdt dydt dthetadt
0.000000 0.000000 0.000000 -2.655344 -0.054433 0.126898 0.136423
0.033333 -0.022972 0.053464 -2.653725 -0.108325 0.252612 0.296880
0.066667 -0.045819 0.106603 -2.664170 -0.179691 0.419177 0.539084
0.100000 -0.067912 0.157943 -2.662438 -0.268350 0.626233 0.870916
0.133333 -0.089881 0.208964 -2.660098 -0.374123 0.873424 1.301392
0.166667 -0.111324 0.258877 -2.590624 -0.460383 1.075428 1.745588
0.200000 -0.132648 0.308481 -2.550926 -0.527611 1.233364 2.177711
0.233333 -0.153612 0.357452 -2.443453 -0.576164 1.347997 2.565791
0.266667 -0.174461 0.406125 -2.289932 -0.606396 1.420091 2.870158
0.300000 -0.194996 0.454304 -2.162051 -0.618579 1.450166 3.068250
0.333333 -0.215271 0.502090 -2.021007 -0.612995 1.438746 3.135456
0.366667 -0.235439 0.549593 -1.863955 -0.608087 1.428701 3.110176
0.400000 -0.255503 0.596820 -1.683190 -0.603787 1.419791 3.005406
0.433333 -0.275432 0.643832 -1.586921 -0.600057 1.411902 2.852247
0.466667 -0.295261 0.690578 -1.476359 -0.596909 1.405029 2.681138
0.500000 -0.315081 0.737335 -1.423243 -0.594360 1.399237 2.519328
0.533333 -0.334807 0.783836 -1.427129 -0.592405 1.394572 2.398159
0.566667 -0.354442 0.830086 -1.392427 -0.591076 1.391167 2.340183
0.600000 -0.373987 0.876089 -1.332538 -0.590380 1.389055 2.359889
0.633333 -0.393447 0.921851 -1.286300 -0.590338 1.388306 2.441365
0.666667 -0.412821 0.967375 -1.224177 -0.590936 1.388891 2.582070
0.700000 -0.432115 1.012666 -1.140392 -0.592253 1.390968 2.764250
0.733333 -0.451834 1.059060 -1.023809 -0.594337 1.394590 2.959696
0.766667 -0.471475 1.105227 -0.855308 -0.597296 1.399927 3.132486
0.800000 -0.491606 1.152478 -0.757951 -0.601173 1.407024 3.262685
0.833333 -0.511662 1.199507 -0.635663 -0.606015 1.415919 3.350602
0.866667 -0.531643 1.246314 -0.529523 -0.611791 1.426508 3.390865
0.900000 -0.551550 1.292900 -0.354370 -0.618392 1.438503 3.382379
0.933333 -0.572085 1.340735 -0.205385 -0.625732 1.451713 3.336240
0.966667 -0.592547 1.388349 -0.132855 -0.633605 1.465705 3.280471
1.000000 -0.613670 1.437231 -0.034017 -0.641815 1.480091 3.220504
1.033333 -0.635453 1.487362 0.056730 -0.650141 1.494407 3.159722
1.066667 -0.657158 1.537262 0.133753 -0.658425 1.508318 3.093457
1.100000 -0.679509 1.588373 0.225381 -0.666405 1.521316 3.027033
1.133333 -0.702497 1.640652 0.325869 -0.673837 1.532912 2.956278
1.166667 -0.725399 1.692681 0.432236 -0.680550 1.542766 2.854089
1.200000 -0.748211 1.744450 0.560541 -0.686439 1.550703 2.708368
1.233333 -0.771539 1.796989 0.667317 -0.691401 1.556629 2.508100
1.266667 -0.794768 1.849249 0.760287 -0.695339 1.560483 2.247482
1.300000 -0.817894 1.901221 0.874896 -0.698328 1.562533 1.918312
1.333333 -0.841403 1.953642 0.956104 -0.700464 1.563102 1.521269
1.366667 -0.865226 2.006388 1.029306 -0.701772 1.562431 1.075143
1.400000 -0.888930 2.058811 1.057915 -0.702239 1.560642 0.599525
1.433333 -0.912509 2.110902 1.069731 -0.701921 1.557912 0.110927
1.466667 -0.935956 2.162647 1.047686 -0.700868 1.554356 -0.367138
1.500000 -0.959438 2.214382 0.989830 -0.699060 1.549937 -0.810114
1.533333 -0.982886 2.266092 0.934578 -0.696486 1.544602 -1.198191
1.566667 -1.006232 2.317729 0.890015 -0.693237 1.538345 -1.522942
1.600000 -1.029454 2.369346 0.794346 -0.689410 1.531160 -1.778066
1.633333 -1.052514 2.420552 0.719292 -0.685057 1.522981 -1.961229
1.666667 -1.075405 2.471335 0.619577 -0.680230 1.513775 -2.076272
1.700000 -1.098020 2.522034 0.547748 -0.675023 1.503538 -2.134447
1.733333 -1.120454 2.572281 0.461970 -0.669503 1.492262 -2.145784
1.766667 -1.142699 2.622064 0.386791 -0.663674 1.479932 -2.115403
1.800000 -1.164751 2.671367 0.318035 -0.657508 1.466555 -2.054100
1.833333 -1.186602 2.720177 0.255344 -0.650981 1.452138 -1.966377
1.866667 -1.208247 2.768480 0.198486 -0.644066 1.436689 -1.859769
1.900000 -1.229679 2.816262 0.129228 -0.636673 1.420187 -1.735747
1.933333 -1.250892 2.863511 0.063935 -0.628704 1.402581 -1.597530
1.966667 -1.271880 2.910211 -0.005753 -0.620083 1.383791 -1.444866
2.000000 -1.292637 2.956350 -0.056343 -0.610763 1.363703 -1.278148
2.033333 -1.313156 3.001915 -0.083210 -0.600697 1.342205 -1.099534
2.066667 -1.333433 3.046892 -0.111620 -0.589802 1.319084 -0.908004
2.100000 -1.353078 3.090841 -0.152609 -0.578105 1.294262 -0.707608
2.133333 -1.372069 3.133660 -0.175791 -0.565667 1.267700 -0.503659
2.166667 -1.390801 3.175853 -0.194753 -0.552547 1.239363 -0.305139
2.200000 -1.409268 3.217410 -0.197087 -0.538808 1.209220 -0.116114
2.233333 -1.427053 3.257587 -0.189243 -0.524504 1.177169 0.058495
2.266667 -1.444565 3.297105 -0.176800 -0.509721 1.143173 0.209732
2.300000 -1.461369 3.335020 -0.150412 -0.494485 1.107139 0.332364
2.333333 -1.477447 3.371193 -0.144929 -0.478748 1.068842 0.426558
2.366667 -1.493241 3.406683 -0.115618 -0.462511 1.028226 0.490090
2.400000 -1.508297 3.440279 -0.071841 -0.445817 0.985378 0.521530
2.433333 -1.523063 3.473179 -0.052201 -0.428723 0.940530 0.524342
2.466667 -1.537539 3.505377 -0.041043 -0.411338 0.894098 0.507205
2.500000 -1.551230 3.535381 -0.009807 -0.393771 0.846504 0.476117
2.533333 -1.564134 3.563129 0.005621 -0.376187 0.798344 0.434737
2.566667 -1.576241 3.588565 0.023044 -0.358751 0.750222 0.388612
2.600000 -1.587530 3.611596 0.017865 -0.341636 0.702821 0.346530
2.633333 -1.598523 3.633920 0.025628 -0.325007 0.656749 0.306771
2.666667 -1.608711 3.653868 0.024026 -0.309011 0.612572 0.267051
2.700000 -1.618606 3.673117 0.031005 -0.293750 0.570682 0.228289
2.733333 -1.627728 3.690083 0.037045 -0.279327 0.531483 0.188213
2.766667 -1.636562 3.706364 0.061251 -0.265749 0.495108 0.146851
2.800000 -1.645108 3.721968 0.069121 -0.252938 0.461375 0.097160
2.833333 -1.653369 3.736902 0.074441 -0.240804 0.430109 0.039445
2.866667 -1.660984 3.749960 0.085290 -0.229235 0.401056 -0.029337
2.900000 -1.668320 3.762367 0.074395 -0.218154 0.374108 -0.110232
2.933333 -1.675380 3.774133 0.081457 -0.207433 0.348965 -0.203768
2.966667 -1.682165 3.785269 0.068114 -0.197006 0.325481 -0.306675
3.000000 -1.688488 3.795290 0.050156 -0.186866 0.303715 -0.414731
3.033333 -1.694544 3.804702 0.034963 -0.177017 0.283717 -0.519009
3.066667 -1.700210 3.813364 0.011659 -0.167452 0.265417 -0.604965
3.100000 -1.705514 3.821433 0.001898 -0.158173 0.248702 -0.664236
3.133333 -1.710562 3.828929 -0.012526 -0.149218 0.233528 -0.681761
3.166667 -1.715296 3.836018 -0.050322 -0.140619 0.219783 -0.650885
3.200000 -1.719736 3.842776 -0.105429 -0.132381 0.207210 -0.563392
3.233333 -1.723909 3.849273 -0.147300 -0.124501 0.195488 -0.421738
3.266667 -1.727828 3.855517 -0.200663 -0.116978 0.184345 -0.234060
3.300000 -1.731514 3.861523 -0.214395 -0.109800 0.173501 -0.009536
3.333333 -1.734983 3.867288 -0.238527 -0.102947 0.162678 0.233593
3.366667 -1.738256 3.872797 -0.211710 -0.096386 0.151644 0.473714
3.400000 -1.741336 3.877966 -0.176041 -0.090100 0.140279 0.685352
3.433333 -1.744199 3.882666 -0.125233 -0.084065 0.128555 0.850009
3.466667 -1.746851 3.886910 -0.050430 -0.078283 0.116559 0.948341
3.500000 -1.749324 3.890609 0.024828 -0.072768 0.104493 0.969537
3.533333 -1.751596 3.893874 0.078261 -0.067535 0.092606 0.912162
3.566667 -1.753705 3.896563 0.134033 -0.062610 0.081175 0.785829
3.600000 -1.755621 3.898842 0.166957 -0.058017 0.070487 0.609991
3.633333 -1.757416 3.900675 0.195190 -0.053781 0.060795 0.401008
3.666667 -1.759028 3.902121 0.191046 -0.049897 0.052241 0.185451
3.700000 -1.760461 3.903193 0.184998 -0.046342 0.044844 -0.016872
3.733333 -1.761862 3.904192 0.138232 -0.043085 0.038578 -0.190282
3.766667 -1.763094 3.904841 0.120333 -0.040099 0.033383 -0.327988
3.800000 -1.764347 3.905688 0.076606 -0.037321 0.029064 -0.424919
3.833333 -1.765644 3.906852 0.045498 -0.034685 0.025365 -0.478803
3.866667 -1.766785 3.907698 0.032465 -0.032139 0.022068 -0.497902
3.900000 -1.767775 3.908237 0.024796 -0.029624 0.018945 -0.486438
3.933333 -1.768805 3.909109 0.017749 -0.027090 0.015755 -0.454557
3.966667 -1.769693 3.909693 0.007262 -0.024475 0.012240 -0.403047
4.000000 -1.770441 3.910000 -0.001404 -0.021758 0.008269 -0.343532
4.033333 -1.771166 3.910420 -0.024427 -0.018939 0.003793 -0.278201
4.066667 -1.771760 3.910582 -0.035984 -0.016017 -0.001224 -0.206747
4.100000 -1.772274 3.910632 -0.066409 -0.013002 -0.006783 -0.132210
4.133333 -1.772697 3.910520 -0.046770 -0.009931 -0.012765 -0.054853
4.166667 -1.773005 3.910153 -0.059364 -0.006860 -0.018989 0.018936
4.200000 -1.773188 3.909498 -0.062054 -0.003842 -0.025258 0.089716
4.233333 -1.773245 3.908535 -0.047968 -0.000955 -0.031310 0.146963
