t x y theta dxdt dydt dthetadt
0.000000 0.000000 0.000000 2.579421 -0.086859 -0.087500 0.010195
0.033333 -0.002941 -0.002974 2.576979 -0.090135 -0.091343 0.009130
0.066667 -0.005990 -0.006070 2.571388 -0.093454 -0.095234 0.007954
0.100000 -0.009150 -0.009301 2.577583 -0.096818 -0.099178 0.006800
0.133333 -0.012424 -0.012668 2.576550 -0.100227 -0.103173 0.006451
0.166667 -0.015811 -0.016164 2.571921 -0.103681 -0.107220 0.003975
0.200000 -0.019315 -0.019793 2.574085 -0.107181 -0.111323 0.002497
0.233333 -0.022936 -0.023555 2.569696 -0.110732 -0.115485 0.002283
0.266667 -0.026679 -0.027456 2.572081 -0.114336 -0.119711 0.003391
0.300000 -0.030539 -0.031500 2.582268 -0.117997 -0.124004 0.003314
0.333333 -0.034517 -0.035689 2.573974 -0.121717 -0.128368 0.001654
0.366667 -0.038623 -0.040024 2.573253 -0.125497 -0.132805 0.001530
0.400000 -0.042848 -0.044507 2.561922 -0.129336 -0.137314 0.002323
0.433333 -0.047205 -0.049141 2.581631 -0.133232 -0.141895 0.000885
0.466667 -0.051695 -0.053930 2.586227 -0.137182 -0.146546 -0.001400
0.500000 -0.056321 -0.058876 2.573194 -0.141180 -0.151261 -0.001272
0.533333 -0.061085 -0.063982 2.572183 -0.145222 -0.156040 -0.000695
0.566667 -0.065989 -0.069252 2.578270 -0.149300 -0.160876 -0.001041
0.600000 -0.071034 -0.074687 2.566320 -0.153411 -0.165769 -0.003053
0.633333 -0.076223 -0.080291 2.572755 -0.157550 -0.170715 -0.003212
0.666667 -0.081535 -0.086050 2.574421 -0.161711 -0.175712 -0.001594
0.700000 -0.086995 -0.091983 2.576276 -0.165894 -0.180759 -0.001977
0.733333 -0.092577 -0.098072 2.574580 -0.170096 -0.185853 -0.001667
0.766667 -0.098311 -0.104340 2.575717 -0.174319 -0.190996 -0.000428
0.800000 -0.104199 -0.110792 2.574017 -0.178561 -0.196184 0.000617
0.833333 -0.110209 -0.117401 2.579083 -0.182821 -0.201416 0.000035
0.866667 -0.116376 -0.124198 2.568771 -0.187101 -0.206693 -0.001699
0.900000 -0.122663 -0.131152 2.571984 -0.191406 -0.212019 -0.001794
0.933333 -0.129112 -0.138299 2.573531 -0.195737 -0.217395 -0.002964
0.966667 -0.135723 -0.145643 2.574601 -0.200087 -0.222813 -0.004346
1.000000 -0.142454 -0.153144 2.577077 -0.204455 -0.228274 -0.004421
1.033333 -0.149350 -0.160846 2.573559 -0.208828 -0.233764 -0.002009
1.066667 -0.156364 -0.168705 2.575626 -0.213197 -0.239274 0.000233
1.100000 -0.163547 -0.176771 2.571269 -0.217538 -0.244780 0.001404
1.133333 -0.170845 -0.184992 2.573455 -0.221840 -0.250274 0.004146
1.166667 -0.178316 -0.193425 2.569161 -0.226107 -0.255757 0.007651
1.200000 -0.185960 -0.202072 2.572461 -0.230331 -0.261223 0.009495
1.233333 -0.193780 -0.210935 2.580337 -0.234523 -0.266682 0.008605
1.266667 -0.201708 -0.219950 2.566146 -0.238690 -0.272142 0.007366
1.300000 -0.209745 -0.229117 2.569427 -0.242852 -0.277623 0.006134
1.333333 -0.217886 -0.238435 2.584438 -0.247022 -0.283137 0.002723
1.366667 -0.226132 -0.247901 2.581718 -0.251202 -0.288688 -0.001842
1.400000 -0.234559 -0.257595 2.578296 -0.255400 -0.294282 -0.005764
1.433333 -0.243085 -0.267435 2.577848 -0.259614 -0.299916 -0.008167
1.466667 -0.251795 -0.277506 2.576497 -0.263835 -0.305579 -0.010409
1.500000 -0.260689 -0.287810 2.572402 -0.268041 -0.311250 -0.012465
1.533333 -0.269675 -0.298256 2.567826 -0.272200 -0.316896 -0.011930
1.566667 -0.278847 -0.308938 2.573766 -0.276286 -0.322488 -0.011831
1.600000 -0.288206 -0.319859 2.563602 -0.280285 -0.328013 -0.009410
1.633333 -0.297649 -0.330915 2.574324 -0.284184 -0.333457 -0.006699
1.666667 -0.307279 -0.342212 2.571748 -0.287975 -0.338816 -0.002716
1.700000 -0.316988 -0.353638 2.579537 -0.291680 -0.344109 0.000064
1.733333 -0.326772 -0.365191 2.569382 -0.295340 -0.349383 0.001188
1.766667 -0.336627 -0.376866 2.574767 -0.298990 -0.354675 0.004124
1.800000 -0.346673 -0.388790 2.570675 -0.302643 -0.359996 0.004372
1.833333 -0.356782 -0.400831 2.577846 -0.306325 -0.365376 0.003501
1.866667 -0.366953 -0.412986 2.570500 -0.310059 -0.370838 0.001859
1.900000 -0.377314 -0.425393 2.560924 -0.313823 -0.376358 0.003237
1.933333 -0.387865 -0.438053 2.578278 -0.317561 -0.381875 0.004558
1.966667 -0.398464 -0.450816 2.578214 -0.321233 -0.387345 0.004871
2.000000 -0.409253 -0.463834 2.577905 -0.324826 -0.392756 0.005607
2.033333 -0.420230 -0.477107 2.571096 -0.328303 -0.398069 0.005898
2.066667 -0.431395 -0.490636 2.567550 -0.331618 -0.403234 -0.000662
2.100000 -0.442590 -0.504251 2.573004 -0.334776 -0.408260 -0.018064
2.133333 -0.453812 -0.517947 2.576685 -0.337829 -0.413210 -0.038337
2.166667 -0.465219 -0.531900 2.575294 -0.340804 -0.418119 -0.054602
2.200000 -0.476641 -0.545924 2.579369 -0.343709 -0.423004 -0.058865
2.233333 -0.488074 -0.560015 2.574836 -0.346560 -0.427885 -0.039933
2.266667 -0.499511 -0.574167 2.571272 -0.349412 -0.432831 0.019274
2.300000 -0.511130 -0.588575 2.575426 -0.352264 -0.437846 0.130316
2.333333 -0.522927 -0.603241 2.580323 -0.355055 -0.442864 0.291636
2.366667 -0.534899 -0.618165 2.556765 -0.357736 -0.447831 0.496738
2.400000 -0.546853 -0.633127 2.496910 -0.360276 -0.452709 0.739972
2.433333 -0.558968 -0.648346 2.479182 -0.362647 -0.457465 1.007483
2.466667 -0.571236 -0.663820 2.530041 -0.364766 -0.461991 1.278978
2.500000 -0.583648 -0.679545 2.619580 -0.366592 -0.466225 1.533108
2.533333 -0.596014 -0.695281 2.722220 -0.368134 -0.470161 1.750239
2.566667 -0.608328 -0.711022 2.827059 -0.369416 -0.473805 1.912925
2.600000 -0.620755 -0.726999 2.904434 -0.370433 -0.477126 2.003130
2.633333 -0.633116 -0.742965 2.995879 -0.371177 -0.480100 2.011985
2.666667 -0.645402 -0.758912 3.097374 -0.371688 -0.482762 1.943720
2.700000 -0.657769 -0.775073 -3.109663 -0.371977 -0.485121 1.810140
2.733333 -0.670235 -0.791383 -3.045419 -0.372027 -0.487153 1.629556
2.766667 -0.682786 -0.807830 -2.993895 -0.371776 -0.488796 1.424577
2.800000 -0.695232 -0.824226 -2.968375 -0.371188 -0.490027 1.215872
2.833333 -0.707737 -0.840733 -2.937255 -0.370214 -0.490803 1.021093
2.866667 -0.720120 -0.857172 -2.924209 -0.368795 -0.491071 0.852307
2.900000 -0.732530 -0.873690 -2.920241 -0.366889 -0.490803 0.715748
2.933333 -0.744953 -0.890274 -2.909661 -0.364476 -0.489992 0.613817
2.966667 -0.757229 -0.906763 -2.895510 -0.361578 -0.488676 0.542871
3.000000 -0.769351 -0.923149 -2.874879 -0.358204 -0.486871 0.498200
3.033333 -0.781309 -0.939422 -2.861182 -0.354392 -0.484619 0.473872
3.066667 -0.793095 -0.955573 -2.853015 -0.350168 -0.481954 0.461807
3.100000 -0.804702 -0.971593 -2.831629 -0.345559 -0.478902 0.454192
3.133333 -0.816206 -0.987569 -2.815753 -0.340593 -0.475490 0.442899
3.166667 -0.827513 -1.003395 -2.796659 -0.335276 -0.471719 0.426323
3.200000 -0.838680 -1.019138 -2.775197 -0.329611 -0.467595 0.402270
3.233333 -0.849686 -1.034778 -2.762916 -0.323580 -0.463097 0.372863
3.266667 -0.860470 -1.050242 -2.746063 -0.317162 -0.458203 0.336261
3.300000 -0.871050 -1.065559 -2.735043 -0.310320 -0.452876 0.291751
3.333333 -0.881390 -1.080681 -2.723425 -0.303025 -0.447086 0.241262
3.366667 -0.891482 -1.095599 -2.727676 -0.295249 -0.440802 0.183095
3.400000 -0.901319 -1.110305 -2.718765 -0.286959 -0.433995 0.120918
3.433333 -0.910864 -1.124775 -2.712057 -0.278136 -0.426646 0.050863
3.466667 -0.920101 -1.138990 -2.725097 -0.268762 -0.418736 -0.020836
3.500000 -0.929007 -1.152926 -2.701389 -0.258829 -0.410258 -0.089873
3.533333 -0.937624 -1.166615 -2.714629 -0.248316 -0.401196 -0.150971
3.566667 -0.945866 -1.179979 -2.700759 -0.237214 -0.391539 -0.207866
3.600000 -0.953709 -1.192995 -2.712907 -0.225537 -0.381300 -0.267160
3.633333 -0.961130 -1.205638 -2.748122 -0.213305 -0.370497 -0.332161
3.666667 -0.968232 -1.218000 -2.777462 -0.200552 -0.359161 -0.418154
3.700000 -0.974867 -1.229944 -2.789734 -0.187339 -0.347353 -0.531098
3.733333 -0.981012 -1.241445 -2.797207 -0.173717 -0.335122 -0.683342
3.766667 -0.986645 -1.252486 -2.815788 -0.159734 -0.322529 -0.865900
3.800000 -0.991745 -1.263042 -2.812759 -0.145398 -0.309602 -1.064851
3.833333 -0.996288 -1.273092 -2.815176 -0.130750 -0.296396 -1.264561
3.866667 -1.000474 -1.282818 -2.818089 -0.115818 -0.282957 -1.437264
3.900000 -1.004054 -1.291992 -2.869701 -0.100585 -0.269290 -1.562156
3.933333 -1.007268 -1.300829 -2.959159 -0.085062 -0.255416 -1.607223
3.966667 -1.009838 -1.309074 -3.086228 -0.069298 -0.241377 -1.555170
4.000000 -1.012032 -1.316971 3.045350 -0.053352 -0.227206 -1.394521
4.033333 -1.013845 -1.324514 2.955537 -0.037233 -0.212893 -1.117505
4.066667 -1.014941 -1.331469 2.861502 -0.020954 -0.198417 -0.724235
4.100000 -1.015309 -1.337821 2.827791 -0.004561 -0.183770 -0.224331
4.133333 -1.014940 -1.343555 2.859666 0.011884 -0.168957 0.352702
4.166667 -1.014178 -1.348917 2.886409 0.028381 -0.153933 0.975107
4.200000 -1.013019 -1.353903 2.956096 0.044888 -0.138707 1.604762
4.233333 -1.011111 -1.358236 3.025168 0.061341 -0.123299 2.209656
4.266667 -1.008803 -1.362185 3.136447 0.077699 -0.107720 2.750535
4.300000 -1.006093 -1.365750 -3.031060 0.093959 -0.091972 3.200334
4.333333 -1.002670 -1.368581 -2.909959 0.110150 -0.076041 3.551052
4.366667 -0.998843 -1.371022 -2.756338 0.126295 -0.059913 3.796695
4.400000 -0.994311 -1.372722 -2.584256 0.142434 -0.043548 3.939344
4.433333 -0.989082 -1.373681 -2.414512 0.158602 -0.026946 3.976544
4.466667 -0.983448 -1.374245 -2.248648 0.174801 -0.010126 3.927627
4.500000 -0.977411 -1.374413 -2.102373 0.191008 0.006870 3.818803
4.533333 -0.970970 -1.374184 -1.973577 0.207222 0.024039 3.673204
4.566667 -0.963873 -1.373231 -1.830921 0.223386 0.041301 3.521654
4.600000 -0.956131 -1.371564 -1.731079 0.239450 0.058580 3.397794
4.633333 -0.947757 -1.369190 -1.653926 0.255400 0.075858 3.343756
4.666667 -0.938985 -1.366420 -1.561607 0.271214 0.093098 3.377474
4.700000 -0.929607 -1.362966 -1.483613 0.286854 0.110240 3.498920
4.733333 -0.919636 -1.358836 -1.441024 0.302253 0.127191 3.699375
4.766667 -0.909275 -1.354316 -1.397016 0.317417 0.143955 3.960774
4.800000 -0.898349 -1.349138 -1.288172 0.332342 0.160520 4.257643
4.833333 -0.886871 -1.343311 -1.107861 0.347013 0.176852 4.539865
4.866667 -0.875012 -1.337101 -0.893048 0.361430 0.192940 4.772050
4.900000 -0.862778 -1.330513 -0.651285 0.375617 0.208802 4.923370
4.933333 -0.850019 -1.323302 -0.465851 0.389593 0.224449 4.974695
4.966667 -0.836741 -1.315477 -0.208168 0.403320 0.239804 4.907157
5.000000 -0.823100 -1.307285 -0.003244 0.416793 0.254845 4.715804
5.033333 -0.808950 -1.298497 0.181021 0.430001 0.269544 4.421533
5.066667 -0.794298 -1.289124 0.319775 0.442931 0.283865 4.048655
5.100000 -0.779150 -1.279178 0.420873 0.455562 0.297760 3.628452
5.133333 -0.763660 -1.268885 0.524685 0.467893 0.311216 3.180450
5.166667 -0.747691 -1.258048 0.590400 0.479960 0.324270 2.736889
5.200000 -0.731391 -1.246875 0.662767 0.491766 0.336917 2.315315
5.233333 -0.714767 -1.235374 0.713077 0.503327 0.349171 1.926337
5.266667 -0.697825 -1.223552 0.775288 0.514663 0.361062 1.567700
5.300000 -0.680572 -1.211413 0.821615 0.525806 0.372642 1.236972
5.333333 -0.662888 -1.198817 0.871465 0.536767 0.383932 0.935798
5.366667 -0.644785 -1.185784 0.896760 0.547545 0.394942 0.657471
5.400000 -0.626276 -1.172335 0.929772 0.558125 0.405673 0.400730
5.433333 -0.607376 -1.158490 0.917046 0.568470 0.416096 0.164607
5.466667 -0.588200 -1.144366 0.912587 0.578542 0.426173 -0.044625
5.500000 -0.568661 -1.129885 0.885358 0.588278 0.435840 -0.225461
5.533333 -0.548776 -1.115068 0.863188 0.597625 0.445051 -0.373312
5.566667 -0.528563 -1.099936 0.837426 0.606535 0.453760 -0.485246
5.600000 -0.508105 -1.084558 0.803575 0.614986 0.461952 -0.558405
5.633333 -0.487357 -1.068906 0.784507 0.622973 0.469632 -0.597026
5.666667 -0.466338 -1.053003 0.760764 0.630487 0.476808 -0.605839
5.700000 -0.445098 -1.036879 0.731072 0.637545 0.483512 -0.588013
5.733333 -0.423628 -1.020544 0.714933 0.644167 0.489778 -0.550939
5.766667 -0.401947 -1.004020 0.697417 0.650375 0.495639 -0.500999
5.800000 -0.380073 -0.987322 0.681867 0.656182 0.501119 -0.445444
5.833333 -0.358028 -0.970471 0.655705 0.661593 0.506232 -0.385144
5.866667 -0.335805 -0.953442 0.649718 0.666607 0.510978 -0.322682
5.900000 -0.313453 -0.936301 0.642088 0.671220 0.515356 -0.262475
5.933333 -0.290940 -0.918999 0.638770 0.675409 0.519340 -0.204624
5.966667 -0.268276 -0.901546 0.635354 0.679161 0.522917 -0.149159
6.000000 -0.245469 -0.883951 0.628746 0.682448 0.526051 -0.097436
6.033333 -0.222527 -0.866222 0.628528 0.685242 0.528705 -0.051319
6.066667 -0.199461 -0.848369 0.629684 0.687534 0.530866 -0.010849
6.100000 -0.176386 -0.830516 0.626811 0.689301 0.532505 0.026463
6.133333 -0.153203 -0.812556 0.634481 0.690546 0.533619 0.057809
6.166667 -0.130051 -0.794636 0.633969 0.691274 0.534210 0.084740
6.200000 -0.106948 -0.776775 0.642355 0.691512 0.534307 0.110029
6.233333 -0.083763 -0.758832 0.639575 0.691311 0.533961 0.137594
6.266667 -0.060667 -0.740985 0.653485 0.690705 0.533206 0.176595
6.300000 -0.037505 -0.723073 0.660844 0.689747 0.532097 0.238980
6.333333 -0.014468 -0.705294 0.653879 0.688493 0.530691 0.345223
6.366667 0.008426 -0.687666 0.666925 0.686992 0.529039 0.517045
6.400000 0.031361 -0.669997 0.679219 0.685295 0.527190 0.779748
6.433333 0.054123 -0.652509 0.686433 0.683453 0.525195 1.153743
6.466667 0.076911 -0.634997 0.677573 0.681510 0.523099 1.640373
6.500000 0.099719 -0.617467 0.702569 0.679505 0.520937 2.220673
6.533333 0.122308 -0.600166 0.720302 0.677463 0.518733 2.859752
6.566667 0.144901 -0.582863 0.765420 0.675372 0.516469 3.495785
6.600000 0.167256 -0.565813 0.897149 0.673217 0.514121 4.049342
6.633333 0.189602 -0.548775 1.063203 0.670946 0.511627 4.440317
6.666667 0.211931 -0.531755 1.251647 0.668539 0.508964 4.604155
6.700000 0.234237 -0.514760 1.565591 0.665973 0.506106 4.499254
6.733333 0.256513 -0.497797 1.900549 0.663189 0.502986 4.106494
6.766667 0.278753 -0.480872 2.235233 0.660163 0.499579 3.447027
6.800000 0.300737 -0.464245 2.466978 0.656879 0.495876 2.581016
6.833333 0.322672 -0.447669 2.571706 0.653328 0.491872 1.585128
6.866667 0.344551 -0.431151 2.578093 0.649466 0.487523 0.548793
6.900000 0.366170 -0.414940 2.457605 0.645269 0.482807 -0.428779
6.933333 0.387528 -0.399037 2.272144 0.640766 0.477762 -1.257777
6.966667 0.408812 -0.383209 2.083978 0.635999 0.472442 -1.874146
7.000000 0.430017 -0.367461 1.861146 0.630977 0.466858 -2.245468
7.033333 0.451139 -0.351798 1.676634 0.625739 0.461056 -2.367372
7.066667 0.471989 -0.336441 1.564069 0.620356 0.455119 -2.266710
7.100000 0.492565 -0.321390 1.520441 0.614879 0.449104 -2.000001
7.133333 0.513041 -0.306439 1.517105 0.609339 0.443045 -1.636830
7.166667 0.533245 -0.291792 1.505940 0.603763 0.436973 -1.237589
7.200000 0.553179 -0.277449 1.522331 0.598204 0.430944 -0.861450
7.233333 0.573000 -0.263217 1.515702 0.592697 0.424997 -0.547108
7.266667 0.592557 -0.249287 1.524270 0.587270 0.419163 -0.312946
7.300000 0.611993 -0.235476 1.513769 0.581934 0.413455 -0.156102
7.333333 0.631303 -0.221788 1.526969 0.576698 0.407882 -0.061541
7.366667 0.650484 -0.208228 1.517344 0.571542 0.402410 -0.015002
7.400000 0.669414 -0.194960 1.513828 0.566435 0.396999 0.003386
7.433333 0.688206 -0.181825 1.518165 0.561349 0.391608 0.008635
7.466667 0.706859 -0.168827 1.515390 0.556231 0.386162 0.007325
7.500000 0.725367 -0.155968 1.513139 0.551044 0.380596 -0.012326
7.533333 0.743638 -0.143393 1.526630 0.545765 0.374875 -0.062883
7.566667 0.761759 -0.130963 1.521333 0.540397 0.369004 -0.161775
7.600000 0.779726 -0.118681 1.517379 0.534936 0.362974 -0.324274
7.633333 0.797536 -0.106547 1.523314 0.529376 0.356778 -0.565475
7.666667 0.815123 -0.094691 1.524006 0.523736 0.350446 -0.887660
7.700000 0.832491 -0.083108 1.525701 0.518044 0.344037 -1.271465
7.733333 0.849642 -0.071795 1.518774 0.512311 0.337583 -1.694337
7.766667 0.866626 -0.060641 1.531057 0.506544 0.331101 -2.128811
7.800000 0.883400 -0.049752 1.473137 0.500760 0.324637 -2.543692
7.833333 0.899971 -0.039126 1.314421 0.494980 0.318241 -2.901707
7.866667 0.916365 -0.028661 1.151545 0.489209 0.311941 -3.175952
7.900000 0.932583 -0.018360 0.950821 0.483441 0.305734 -3.349058
7.933333 0.948601 -0.008308 0.759686 0.477669 0.299617 -3.409548
7.966667 0.964437 0.001579 0.599055 0.471888 0.293594 -3.350601
8.000000 0.980075 0.011229 0.474581 0.466082 0.287647 -3.180642
8.033333 0.995526 0.020711 0.379266 0.460235 0.281748 -2.924275
8.066667 1.010791 0.030027 0.302781 0.454333 0.275880 -2.608213
8.100000 1.025853 0.039119 0.242441 0.448369 0.270045 -2.265179
8.133333 1.040724 0.048044 0.187924 0.442337 0.264239 -1.925020
8.166667 1.055388 0.056755 0.135407 0.436235 0.258463 -1.611257
8.200000 1.069842 0.065257 0.100174 0.430063 0.252720 -1.337047
8.233333 1.084084 0.073555 0.070349 0.423822 0.247022 -1.104636
8.266667 1.098129 0.081684 0.054167 0.417512 0.241379 -0.912004
8.300000 1.111954 0.089617 0.025596 0.411132 0.235796 -0.750309
8.333333 1.125557 0.097358 -0.006019 0.404681 0.230283 -0.613250
8.366667 1.138959 0.104930 -0.017610 0.398155 0.224843 -0.497838
8.400000 1.152133 0.112316 -0.034185 0.391552 0.219479 -0.398217
8.433333 1.165076 0.119520 -0.048417 0.384875 0.214190 -0.312518
8.466667 1.177816 0.126557 -0.041612 0.378127 0.208973 -0.239423
8.500000 1.190353 0.133426 -0.039640 0.371312 0.203825 -0.181023
8.533333 1.202649 0.140123 -0.050460 0.364437 0.198742 -0.135813
8.566667 1.214701 0.146651 -0.045970 0.357510 0.193723 -0.103017
8.600000 1.226506 0.153011 -0.045754 0.350534 0.188768 -0.084383
8.633333 1.238060 0.159207 -0.046875 0.343515 0.183878 -0.066060
8.666667 1.249364 0.165243 -0.055221 0.336465 0.179049 -0.019982
8.700000 1.260461 0.171115 -0.054003 0.329398 0.174284 0.094646
8.733333 1.271354 0.176826 -0.044344 0.322321 0.169581 0.317490
8.766667 1.281990 0.182384 -0.051247 0.315251 0.164937 0.692439
8.800000 1.292369 0.187793 -0.055731 0.308200 0.160350 1.254306
8.833333 1.302542 0.193043 -0.070065 0.301181 0.155815 2.006159
8.866667 1.312456 0.198151 -0.077616 0.294200 0.151328 2.912904
8.900000 1.322109 0.203119 -0.092662 0.287265 0.146884 3.906726
8.933333 1.331558 0.207931 -0.085386 0.280388 0.142478 4.910941
8.966667 1.340745 0.212611 0.060047 0.273574 0.138108 5.826191
9.000000 1.349731 0.217136 0.349521 0.266829 0.133772 6.550733
9.033333 1.358515 0.221510 0.780222 0.260156 0.129471 6.997584
9.066667 1.367050 0.225752 1.249147 0.253557 0.125206 7.113530
9.100000 1.375386 0.229843 1.717010 0.247029 0.120983 6.883002
9.133333 1.383484 0.233801 2.118180 0.240569 0.116801 6.311834
9.166667 1.391385 0.237612 2.426443 0.234177 0.112663 5.452409
9.200000 1.399091 0.241277 2.604690 0.227854 0.108568 4.392915
9.233333 1.406574 0.244810 2.651142 0.221604 0.104517 3.246379
9.266667 1.413840 0.248214 2.653463 0.215432 0.100508 2.122417
9.300000 1.420891 0.251490 2.575670 0.209347 0.096536 1.115276
9.333333 1.427733 0.254643 2.448484 0.203350 0.092603 0.301742
9.366667 1.434386 0.257658 2.334018 0.197447 0.088711 -0.278881
9.400000 1.440837 0.260556 2.238161 0.191642 0.084865 -0.622697
9.433333 1.447102 0.263317 2.212705 0.185937 0.081070 -0.764247
9.466667 1.453185 0.265945 2.214713 0.180331 0.077334 -0.750345
9.500000 1.459087 0.268439 2.230337 0.174822 0.073666 -0.637421
9.533333 1.464809 0.270802 2.227889 0.169404 0.070073 -0.479231
9.566667 1.470348 0.273062 2.217716 0.164074 0.066554 -0.318146
9.600000 1.475711 0.275194 2.220074 0.158827 0.063110 -0.186626
9.633333 1.480901 0.277199 2.225107 0.153657 0.059738 -0.093136
9.666667 1.485919 0.279108 2.225983 0.148566 0.056437 -0.037880
9.700000 1.490768 0.280925 2.221121 0.143556 0.053205 -0.009765
9.733333 1.495452 0.282650 2.227280 0.138632 0.050040 -0.000749
9.766667 1.499976 0.284287 2.219239 0.133800 0.046950 -0.002012
9.800000 1.504338 0.285805 2.224358 0.129065 0.043935 -0.005265
9.833333 1.508538 0.287204 2.221765 0.124432 0.040997 -0.006740
9.866667 1.512580 0.288488 2.229560 0.119904 0.038139 -0.007171
9.900000 1.516466 0.289656 2.222751 0.115484 0.035364 -0.009838
9.933333 1.520211 0.290747 2.220352 0.111171 0.032674 -0.011674
9.966667 1.523817 0.291761 2.215224 0.106961 0.030062 -0.012291
