t x y theta dxdt dydt dthetadt
0.000000 0.000000 0.000000 -0.034535 0.024522 -0.002953 0.029862
0.033333 0.000557 -0.000142 -0.034786 0.030231 -0.002590 0.029795
0.066667 0.001522 -0.000521 -0.025193 0.036961 -0.001863 0.030782
0.100000 0.002950 -0.001114 -0.028868 0.044571 -0.000592 0.038637
0.133333 0.004358 -0.001376 -0.022033 0.052971 0.001463 0.053430
0.166667 0.005743 -0.001294 -0.022636 0.062317 0.004534 0.075196
0.200000 0.007102 -0.000861 -0.017125 0.072963 0.008965 0.107287
0.233333 0.009532 -0.000624 -0.025426 0.085213 0.015067 0.149765
0.266667 0.013365 -0.000755 -0.027302 0.099319 0.023117 0.203991
0.300000 0.017158 -0.000505 -0.018464 0.115694 0.033286 0.259989
0.333333 0.020906 0.000136 -0.023281 0.134428 0.045985 0.314679
0.366667 0.024604 0.001178 -0.012635 0.155185 0.061516 0.362547
0.400000 0.028246 0.002631 -0.000924 0.177220 0.079943 0.395926
0.433333 0.031826 0.004504 0.043248 0.199948 0.101275 0.404894
0.466667 0.038286 0.007172 0.063247 0.222656 0.125626 0.384847
0.500000 0.047190 0.011126 0.083601 0.244381 0.153081 0.338768
0.533333 0.058460 0.016936 0.112526 0.264095 0.183000 0.265762
0.566667 0.069628 0.023196 0.134376 0.280760 0.214953 0.167480
0.600000 0.080681 0.029911 0.148633 0.293320 0.248770 0.046475
0.633333 0.091603 0.037087 0.145497 0.300388 0.284477 -0.087147
0.666667 0.103026 0.048541 0.129031 0.301076 0.321468 -0.230106
0.700000 0.114291 0.060459 0.101421 0.294921 0.359278 -0.379494
0.733333 0.125383 0.072841 0.073267 0.281931 0.397995 -0.529233
0.766667 0.136288 0.085687 0.047768 0.262404 0.437551 -0.670484
0.800000 0.145955 0.101585 0.042664 0.237024 0.477546 -0.796158
0.833333 0.155408 0.117942 0.027018 0.206803 0.517437 -0.905032
0.866667 0.164635 0.134752 0.008754 0.172536 0.557505 -0.993768
0.900000 0.170974 0.153756 -0.047064 0.135029 0.597810 -1.058081
0.933333 0.174326 0.174914 -0.105310 0.095000 0.638301 -1.096835
0.966667 0.174532 0.198301 -0.156679 0.053504 0.678644 -1.111231
1.000000 0.174480 0.222110 -0.200108 0.011424 0.718869 -1.101141
1.033333 0.174170 0.246327 -0.252853 -0.030412 0.759017 -1.064434
1.066667 0.173599 0.270941 -0.290797 -0.071229 0.798808 -1.001309
1.100000 0.170851 0.297607 -0.327319 -0.110534 0.838116 -0.918195
1.133333 0.165867 0.326643 -0.352488 -0.148039 0.876811 -0.821360
1.166667 0.158716 0.357948 -0.380241 -0.184087 0.915219 -0.716905
1.200000 0.151310 0.389586 -0.387306 -0.218894 0.953359 -0.613254
1.233333 0.143655 0.421534 -0.405934 -0.252573 0.991059 -0.518897
1.266667 0.134305 0.455529 -0.422964 -0.285241 1.028151 -0.439586
1.300000 0.124719 0.489792 -0.433127 -0.317116 1.064601 -0.376408
1.333333 0.113643 0.525821 -0.442626 -0.348230 1.100239 -0.328923
1.366667 0.100787 0.564193 -0.445794 -0.378264 1.134546 -0.297120
1.400000 0.087724 0.602759 -0.436760 -0.407060 1.167242 -0.277249
1.433333 0.074465 0.641491 -0.450924 -0.434595 1.198227 -0.266423
1.466667 0.059221 0.682433 -0.459067 -0.460730 1.227262 -0.263130
1.500000 0.042001 0.725551 -0.466620 -0.485021 1.253795 -0.265015
1.533333 0.024626 0.768743 -0.486830 -0.507220 1.277540 -0.268679
1.566667 0.007112 0.811976 -0.496098 -0.527332 1.298577 -0.271693
1.600000 -0.011994 0.857039 -0.499369 -0.545131 1.316609 -0.271690
1.633333 -0.031205 0.902075 -0.515067 -0.560388 1.331344 -0.268291
1.666667 -0.050501 0.947049 -0.526454 -0.573069 1.342679 -0.259628
1.700000 -0.069864 0.991925 -0.530278 -0.583392 1.350747 -0.245234
1.733333 -0.089962 1.038037 -0.536483 -0.591413 1.355445 -0.228766
1.766667 -0.110089 1.083980 -0.546839 -0.597063 1.356496 -0.210722
1.800000 -0.130714 1.130223 -0.556323 -0.600485 1.353836 -0.194914
1.833333 -0.151328 1.176222 -0.569021 -0.601755 1.347208 -0.180681
1.866667 -0.171911 1.221941 -0.569268 -0.600907 1.336387 -0.169398
1.900000 -0.192445 1.267341 -0.570870 -0.597845 1.320972 -0.162303
1.933333 -0.212908 1.312388 -0.563098 -0.592590 1.300792 -0.157855
1.966667 -0.233280 1.357042 -0.575976 -0.585108 1.275462 -0.156245
2.000000 -0.253159 1.400308 -0.581400 -0.575384 1.244710 -0.154370
2.033333 -0.272293 1.441787 -0.584361 -0.563590 1.208768 -0.153768
2.066667 -0.291278 1.482768 -0.592633 -0.549773 1.167515 -0.151817
2.100000 -0.310094 1.523219 -0.592998 -0.534094 1.121186 -0.145838
2.133333 -0.328115 1.561105 -0.610896 -0.516605 1.069761 -0.131865
2.166667 -0.345107 1.596045 -0.613812 -0.497541 1.013864 -0.110197
2.200000 -0.361877 1.630364 -0.617313 -0.477027 0.953953 -0.082061
2.233333 -0.377406 1.661256 -0.626889 -0.454982 0.890082 -0.044465
2.266667 -0.392680 1.691477 -0.624735 -0.431391 0.822665 0.000007
2.300000 -0.407018 1.718364 -0.627563 -0.406040 0.751932 0.049184
2.333333 -0.420134 1.741647 -0.623638 -0.378903 0.678647 0.097070
2.366667 -0.432952 1.764198 -0.628325 -0.349762 0.602968 0.144690
2.400000 -0.444260 1.782616 -0.617574 -0.318519 0.525653 0.190781
2.433333 -0.455244 1.800274 -0.602613 -0.285193 0.447566 0.231532
2.466667 -0.464633 1.813411 -0.582108 -0.250034 0.370025 0.265898
2.500000 -0.473676 1.825771 -0.578475 -0.213525 0.294261 0.290724
2.533333 -0.481014 1.834005 -0.569596 -0.176053 0.221157 0.305995
2.566667 -0.486580 1.838727 -0.556515 -0.138193 0.152013 0.308474
2.600000 -0.490130 1.840197 -0.544060 -0.100670 0.087645 0.295980
2.633333 -0.491235 1.838763 -0.534310 -0.064348 0.029043 0.266994
2.666667 -0.491963 1.836558 -0.519921 -0.029969 -0.023484 0.221684
2.700000 -0.492310 1.833589 -0.509255 0.001843 -0.069592 0.164546
2.733333 -0.490321 1.828934 -0.498253 0.030340 -0.108988 0.097149
2.766667 -0.487951 1.823533 -0.481977 0.054929 -0.141668 0.019359
2.800000 -0.484547 1.817554 -0.472442 0.075222 -0.167679 -0.064671
2.833333 -0.480764 1.810850 -0.496838 0.091133 -0.187254 -0.150553
2.866667 -0.476603 1.803432 -0.505602 0.102760 -0.200557 -0.235035
2.900000 -0.472068 1.795311 -0.507212 0.110208 -0.207756 -0.318380
2.933333 -0.467158 1.786499 -0.532814 0.114095 -0.209241 -0.397142
2.966667 -0.461878 1.777007 -0.561314 0.115189 -0.205506 -0.461532
3.000000 -0.457661 1.769022 -0.577150 0.114624 -0.197333 -0.507683
3.033333 -0.453076 1.760380 -0.581164 0.113560 -0.185666 -0.532894
3.066667 -0.449458 1.753404 -0.597099 0.113221 -0.171672 -0.535311
3.100000 -0.446454 1.747914 -0.627157 0.114933 -0.156665 -0.511445
3.133333 -0.444097 1.743869 -0.644149 0.119678 -0.141963 -0.462356
3.166667 -0.441932 1.741298 -0.693713 0.128204 -0.128933 -0.393973
3.200000 -0.439485 1.739490 -0.712913 0.140590 -0.118524 -0.310949
3.233333 -0.436663 1.737056 -0.719041 0.156580 -0.111523 -0.217047
3.266667 -0.432580 1.734593 -0.739489 0.175402 -0.108294 -0.116854
3.300000 -0.426915 1.731819 -0.728518 0.195888 -0.108948 -0.019043
3.333333 -0.419632 1.728598 -0.712953 0.216579 -0.113265 0.072249
3.366667 -0.410765 1.724967 -0.696623 0.235919 -0.120667 0.150132
3.400000 -0.400810 1.720983 -0.680962 0.252605 -0.130748 0.214383
3.433333 -0.390282 1.716768 -0.663500 0.265584 -0.143314 0.270199
3.466667 -0.379393 1.711931 -0.655991 0.274291 -0.158262 0.324206
3.500000 -0.368147 1.706472 -0.651407 0.278660 -0.175555 0.388691
3.533333 -0.357538 1.700874 -0.637128 0.279188 -0.195219 0.473979
3.566667 -0.347639 1.694893 -0.622535 0.276712 -0.217439 0.592463
3.600000 -0.338413 1.688416 -0.624422 0.272382 -0.242227 0.746625
3.633333 -0.330004 1.681201 -0.617952 0.267476 -0.269233 0.928000
3.666667 -0.322353 1.672654 -0.608194 0.263265 -0.298165 1.127262
3.700000 -0.314361 1.663493 -0.605712 0.260822 -0.328766 1.331747
3.733333 -0.306786 1.652032 -0.557183 0.260962 -0.360728 1.526570
3.766667 -0.299047 1.638027 -0.456239 0.264237 -0.393558 1.692944
3.800000 -0.290966 1.623426 -0.363702 0.270789 -0.426754 1.816735
3.833333 -0.282544 1.608235 -0.268189 0.280436 -0.460032 1.890121
3.866667 -0.273780 1.592463 -0.166141 0.292691 -0.493061 1.904865
3.900000 -0.264674 1.576119 -0.084663 0.307064 -0.525508 1.854684
3.933333 -0.254550 1.558293 -0.024525 0.322875 -0.557090 1.739698
3.966667 -0.243466 1.539272 0.026640 0.339454 -0.587814 1.572167
4.000000 -0.231330 1.518708 0.075944 0.356205 -0.617835 1.363109
4.033333 -0.218859 1.497616 0.112844 0.372667 -0.647273 1.125284
4.066667 -0.205546 1.474821 0.164073 0.388485 -0.676169 0.873803
4.100000 -0.191904 1.451526 0.187221 0.403306 -0.704570 0.623831
4.133333 -0.177937 1.427744 0.201313 0.417002 -0.732786 0.385874
4.166667 -0.163561 1.402135 0.208874 0.429565 -0.761103 0.162434
4.200000 -0.148870 1.376072 0.206128 0.441113 -0.789681 -0.039082
4.233333 -0.133866 1.349575 0.190142 0.451776 -0.818504 -0.214088
4.266667 -0.118555 1.322660 0.169339 0.461771 -0.847750 -0.358355
4.300000 -0.102942 1.295347 0.145154 0.471428 -0.877796 -0.467417
4.333333 -0.087056 1.265903 0.107750 0.481012 -0.908485 -0.536690
4.366667 -0.070908 1.234354 0.077168 0.490846 -0.939552 -0.560617
4.400000 -0.054473 1.202468 0.060612 0.501303 -0.970933 -0.541000
4.433333 -0.037757 1.170269 0.036385 0.512872 -1.002826 -0.482544
4.466667 -0.020693 1.135908 0.011959 0.525993 -1.035170 -0.390861
4.500000 -0.003243 1.099573 -0.023361 0.540863 -1.067365 -0.276089
4.533333 0.014469 1.063002 -0.032167 0.557681 -1.099258 -0.151518
4.566667 0.032438 1.026223 -0.040166 0.576585 -1.130874 -0.028731
4.600000 0.050657 0.989263 -0.040980 0.597481 -1.161960 0.083038
4.633333 0.070493 0.949770 -0.008869 0.620088 -1.191955 0.176563
4.666667 0.090563 0.910157 0.012643 0.644314 -1.220731 0.246053
4.700000 0.112194 0.868618 0.038344 0.670088 -1.248492 0.286366
4.733333 0.135413 0.825354 0.074732 0.697227 -1.275158 0.301715
4.766667 0.160248 0.780694 0.077523 0.725372 -1.300307 0.292730
4.800000 0.185272 0.736052 0.093503 0.754432 -1.323740 0.262669
4.833333 0.210474 0.691465 0.096497 0.784469 -1.345591 0.219932
4.866667 0.235837 0.646970 0.084550 0.815173 -1.365598 0.170142
4.900000 0.263355 0.600636 0.093025 0.846280 -1.383501 0.120653
4.933333 0.291004 0.554471 0.093346 0.877938 -1.399483 0.073058
4.966667 0.320718 0.507068 0.084769 0.910200 -1.413817 0.029974
5.000000 0.352710 0.458465 0.097643 0.942629 -1.426493 -0.010259
5.033333 0.384777 0.410155 0.081957 0.974573 -1.437298 -0.051215
5.066667 0.416898 0.362180 0.103703 1.005558 -1.446145 -0.099864
5.100000 0.451059 0.313454 0.090724 1.035171 -1.453025 -0.156260
5.133333 0.487060 0.264178 0.095127 1.062216 -1.457210 -0.222989
5.166667 0.524640 0.214618 0.090514 1.085616 -1.457931 -0.300780
5.200000 0.562176 0.165569 0.088374 1.104811 -1.454748 -0.387508
5.233333 0.599640 0.117076 0.064008 1.119134 -1.446836 -0.486354
5.266667 0.639216 0.067192 0.057301 1.127432 -1.432676 -0.594624
5.300000 0.678664 0.017955 0.032097 1.128729 -1.410780 -0.719737
5.333333 0.717953 -0.030589 0.000798 1.122832 -1.380342 -0.865298
5.366667 0.757053 -0.078396 -0.032343 1.109918 -1.340965 -1.035942
5.400000 0.795934 -0.125419 -0.065951 1.089987 -1.292139 -1.229504
5.433333 0.834568 -0.171614 -0.103893 1.063545 -1.234264 -1.437915
5.466667 0.871193 -0.214855 -0.129927 1.031912 -1.168670 -1.654030
5.500000 0.905973 -0.254806 -0.160775 0.996374 -1.096801 -1.868375
5.533333 0.940424 -0.293804 -0.214187 0.957715 -1.019335 -2.073128
5.566667 0.971550 -0.326438 -0.304019 0.916709 -0.937143 -2.260622
5.600000 0.998661 -0.351635 -0.398925 0.874338 -0.851274 -2.435232
5.633333 1.025378 -0.375786 -0.530240 0.831312 -0.762088 -2.603575
5.666667 1.051684 -0.398869 -0.658634 0.788182 -0.670200 -2.771095
5.700000 1.077563 -0.420860 -0.783250 0.745245 -0.575831 -2.936999
5.733333 1.102998 -0.441740 -0.849238 0.703215 -0.480243 -3.098626
5.766667 1.127972 -0.461487 -0.903844 0.662312 -0.383803 -3.254228
5.800000 1.148749 -0.472288 -0.965162 0.622687 -0.287052 -3.393437
5.833333 1.169039 -0.481925 -1.069595 0.584566 -0.190938 -3.500412
5.866667 1.186303 -0.484165 -1.192894 0.548217 -0.096446 -3.557834
5.900000 1.203059 -0.485229 -1.347437 0.513951 -0.004704 -3.548405
5.933333 1.218175 -0.480780 -1.508325 0.481880 0.083392 -3.451833
5.966667 1.232407 -0.472213 -1.686918 0.452395 0.166255 -3.247812
6.000000 1.246111 -0.462480 -1.863007 0.425385 0.243176 -2.917243
6.033333 1.259283 -0.451589 -2.019149 0.400678 0.313521 -2.453413
6.066667 1.271916 -0.439550 -2.095900 0.377410 0.377807 -1.859071
6.100000 1.284006 -0.426372 -2.167472 0.354569 0.436489 -1.149912
6.133333 1.296049 -0.410541 -2.203961 0.331068 0.490485 -0.356628
6.166667 1.307738 -0.392536 -2.196197 0.305423 0.541163 0.486039
6.200000 1.318871 -0.373430 -2.171764 0.276210 0.589412 1.334350
6.233333 1.328422 -0.352558 -2.108200 0.241832 0.636194 2.144209
6.266667 1.336484 -0.329798 -1.977232 0.201251 0.681709 2.874681
6.300000 1.343982 -0.305988 -1.881357 0.153987 0.726132 3.496293
6.333333 1.350914 -0.281149 -1.712637 0.099512 0.769619 3.984774
6.366667 1.357281 -0.255300 -1.516542 0.037949 0.812198 4.325067
6.400000 1.359890 -0.227163 -1.283132 -0.029764 0.853808 4.504166
6.433333 1.358139 -0.197555 -1.075282 -0.102007 0.894522 4.520569
6.466667 1.355833 -0.167002 -0.885619 -0.176932 0.934664 4.383564
6.500000 1.349118 -0.135009 -0.728850 -0.252525 0.974630 4.099842
6.533333 1.338363 -0.101675 -0.564497 -0.325976 1.014681 3.691053
6.566667 1.323729 -0.066966 -0.437810 -0.394407 1.054944 3.176339
6.600000 1.305442 -0.030959 -0.325465 -0.455094 1.095612 2.587788
6.633333 1.286685 0.005863 -0.242541 -0.506091 1.136662 1.959429
6.666667 1.265640 0.043725 -0.204609 -0.545722 1.177856 1.320538
6.700000 1.243407 0.082622 -0.165671 -0.573220 1.218865 0.696184
6.733333 1.220270 0.123398 -0.153300 -0.588683 1.259282 0.106157
6.766667 1.196404 0.166587 -0.189456 -0.592516 1.298690 -0.427119
6.800000 1.173584 0.211410 -0.235749 -0.586205 1.336568 -0.891289
6.833333 1.152380 0.257772 -0.304017 -0.570846 1.372407 -1.284036
6.866667 1.133736 0.305557 -0.367589 -0.547972 1.405756 -1.606134
6.900000 1.114842 0.353894 -0.474512 -0.518771 1.436241 -1.849254
6.933333 1.099624 0.403277 -0.559106 -0.484764 1.463517 -2.014974
6.966667 1.084199 0.453134 -0.618977 -0.447855 1.487430 -2.115563
7.000000 1.068587 0.503428 -0.683019 -0.409129 1.507996 -2.160388
7.033333 1.052806 0.554120 -0.780376 -0.369912 1.525414 -2.149977
7.066667 1.040718 0.605881 -0.855583 -0.331224 1.539947 -2.090779
7.100000 1.032064 0.658282 -0.932725 -0.294315 1.551806 -1.996937
7.133333 1.023288 0.710958 -1.003588 -0.259809 1.561079 -1.875078
7.166667 1.017726 0.763711 -1.085650 -0.228289 1.567443 -1.720750
7.200000 1.012060 0.816658 -1.126480 -0.200449 1.570494 -1.537167
7.233333 1.006298 0.869759 -1.181018 -0.176862 1.569744 -1.338100
7.266667 1.002815 0.922492 -1.231782 -0.157888 1.564796 -1.126634
7.300000 0.999248 0.975297 -1.287245 -0.143289 1.555314 -0.901107
7.333333 0.995600 1.028134 -1.315891 -0.133025 1.541070 -0.666753
7.366667 0.991877 1.080962 -1.304372 -0.126467 1.522440 -0.438871
7.400000 0.988083 1.133742 -1.309504 -0.123033 1.499508 -0.220347
7.433333 0.984222 1.186434 -1.315320 -0.122133 1.472361 -0.011518
7.466667 0.980387 1.235881 -1.310446 -0.123148 1.440801 0.180468
7.500000 0.976331 1.281423 -1.289280 -0.125736 1.404916 0.343495
7.533333 0.972221 1.326769 -1.273333 -0.129428 1.365198 0.474552
7.566667 0.968061 1.371888 -1.261568 -0.134058 1.321487 0.580654
7.600000 0.963855 1.416749 -1.231947 -0.139365 1.274214 0.656309
7.633333 0.959607 1.461321 -1.177182 -0.145087 1.223818 0.703266
7.666667 0.954599 1.501626 -1.151027 -0.151011 1.171413 0.725709
7.700000 0.949556 1.541587 -1.121016 -0.156950 1.117178 0.730846
7.733333 0.943916 1.577629 -1.082635 -0.162728 1.060991 0.720320
7.766667 0.938251 1.613279 -1.068767 -0.168123 1.003206 0.693609
7.800000 0.932137 1.643566 -1.058963 -0.172888 0.944111 0.658665
7.833333 0.926010 1.673424 -1.034077 -0.176736 0.883831 0.617174
7.866667 0.919876 1.702840 -1.020376 -0.179491 0.821555 0.572978
7.900000 0.913555 1.727494 -0.990696 -0.180955 0.757764 0.528773
7.933333 0.907237 1.751683 -0.996717 -0.180974 0.692922 0.490561
7.966667 0.900928 1.775396 -0.947896 -0.179410 0.627664 0.453642
8.000000 0.894632 1.798626 -0.942074 -0.176271 0.562175 0.415228
8.033333 0.888378 1.817619 -0.928337 -0.171575 0.497291 0.373400
8.066667 0.882155 1.832850 -0.929548 -0.165329 0.434722 0.326668
8.100000 0.876153 1.844702 -0.904595 -0.157586 0.375384 0.270516
8.133333 0.870631 1.853807 -0.914177 -0.148437 0.320360 0.203000
8.166667 0.865625 1.860528 -0.900605 -0.138071 0.270547 0.133028
8.200000 0.861301 1.865190 -0.886428 -0.126658 0.227191 0.064115
8.233333 0.857020 1.869390 -0.860654 -0.114473 0.190709 0.000044
8.266667 0.853391 1.873435 -0.871572 -0.101892 0.160880 -0.060399
8.300000 0.850240 1.877636 -0.874906 -0.089281 0.137305 -0.108353
8.333333 0.847137 1.881409 -0.905680 -0.076986 0.119211 -0.142459
8.366667 0.844971 1.885018 -0.931643 -0.065314 0.105529 -0.162873
8.400000 0.843575 1.888322 -0.929465 -0.054533 0.095065 -0.170822
8.433333 0.842228 1.891233 -0.950217 -0.044820 0.087134 -0.164141
8.466667 0.841568 1.893857 -0.953343 -0.036286 0.081402 -0.141743
8.500000 0.840954 1.896113 -0.948264 -0.028972 0.078092 -0.112613
8.533333 0.840384 1.898011 -0.945728 -0.022890 0.077859 -0.083515
8.566667 0.839856 1.899563 -0.942628 -0.017944 0.081553 -0.062023
8.600000 0.839553 1.901868 -0.961812 -0.013944 0.090020 -0.047771
8.633333 0.839287 1.903851 -0.946332 -0.010743 0.103742 -0.047966
8.666667 0.839055 1.905524 -0.942991 -0.008080 0.123038 -0.061790
8.700000 0.838856 1.906898 -0.935636 -0.005754 0.147924 -0.083323
8.733333 0.838531 1.909801 -0.934872 -0.003555 0.177934 -0.106555
8.766667 0.838495 1.914564 -0.935313 -0.001374 0.212522 -0.123480
8.800000 0.838326 1.921651 -0.945285 0.000838 0.250755 -0.132792
8.833333 0.838336 1.931073 -0.964725 0.003127 0.291716 -0.122719
8.866667 0.838493 1.943106 -0.981560 0.005435 0.334065 -0.091054
8.900000 0.838663 1.954872 -0.994224 0.007708 0.376307 -0.036032
8.933333 0.839031 1.969275 -1.000219 0.009831 0.416932 0.045352
8.966667 0.839406 1.983405 -1.007908 0.011764 0.454543 0.149896
9.000000 0.839945 1.999570 -1.000176 0.013431 0.488140 0.276163
9.033333 0.840533 2.017673 -0.989644 0.014798 0.516865 0.413906
9.066667 0.841305 2.037380 -0.989617 0.015854 0.540379 0.559741
9.100000 0.842009 2.058221 -0.958823 0.016696 0.558488 0.706353
9.133333 0.842700 2.078739 -0.925340 0.017480 0.571491 0.844029
9.166667 0.843230 2.099575 -0.870167 0.018402 0.579691 0.969368
9.200000 0.843737 2.120062 -0.844868 0.019769 0.583614 1.075638
9.233333 0.844218 2.140184 -0.805512 0.021960 0.584041 1.159905
9.266667 0.844668 2.159928 -0.757520 0.025479 0.581872 1.215986
9.300000 0.845358 2.179249 -0.725418 0.030595 0.578105 1.243343
9.333333 0.846008 2.198164 -0.661199 0.037654 0.573490 1.243806
9.366667 0.846612 2.216659 -0.601246 0.046879 0.568651 1.216710
9.400000 0.847167 2.234719 -0.561941 0.058331 0.563928 1.166620
9.433333 0.848868 2.253194 -0.518061 0.071790 0.559308 1.098216
9.466667 0.850509 2.271206 -0.492446 0.086776 0.554413 1.020224
9.500000 0.853278 2.289984 -0.429705 0.102860 0.548708 0.937527
9.533333 0.856836 2.308816 -0.415691 0.119221 0.541415 0.858386
9.566667 0.861361 2.327719 -0.387313 0.134733 0.531542 0.787531
9.600000 0.867080 2.346488 -0.377094 0.148027 0.517878 0.725116
9.633333 0.872695 2.364716 -0.377285 0.158020 0.499407 0.667899
9.666667 0.879308 2.382261 -0.360845 0.163465 0.475252 0.602864
9.700000 0.886738 2.398940 -0.333511 0.163215 0.444777 0.522886
9.733333 0.894028 2.415031 -0.318503 0.156442 0.407673 0.417190
9.766667 0.901164 2.430516 -0.289830 0.142798 0.364026 0.280035
9.800000 0.907799 2.443687 -0.274317 0.122603 0.314612 0.113187
9.833333 0.914254 2.456226 -0.230661 0.095984 0.259896 -0.076768
9.866667 0.918956 2.465479 -0.205215 0.063792 0.200530 -0.265373
9.900000 0.921385 2.470923 -0.192861 0.027113 0.137283 -0.432106
9.933333 0.921073 2.472859 -0.218125 -0.012582 0.071303 -0.554541
9.966667 0.920545 2.474136 -0.276642 -0.053824 0.003847 -0.604140
10.000000 0.916890 2.472460 -0.398831 -0.095274 -0.064186 -0.556715
10.033333 0.913012 2.470123 -0.462870 -0.135385 -0.131410 -0.397152
10.066667 0.906700 2.464709 -0.506516 -0.172849 -0.196538 -0.128247
10.100000 0.898623 2.456129 -0.546180 -0.206659 -0.258574 0.239496
10.133333 0.890325 2.446905 -0.556125 -0.236366 -0.317390 0.686071
10.166667 0.880565 2.434120 -0.534891 -0.261553 -0.372827 1.175242
10.200000 0.869949 2.417601 -0.483117 -0.282208 -0.424711 1.661186
10.233333 0.859125 2.400473 -0.388159 -0.298426 -0.473208 2.105684
10.266667 0.848098 2.382752 -0.273048 -0.310723 -0.518591 2.478375
10.300000 0.836874 2.364454 -0.109769 -0.319717 -0.561301 2.751064
10.333333 0.825458 2.345595 0.042877 -0.325917 -0.601175 2.906353
10.366667 0.813857 2.326193 0.173674 -0.330042 -0.638540 2.936969
10.400000 0.802858 2.303923 0.287780 -0.332743 -0.673854 2.850343
10.433333 0.791685 2.281146 0.378642 -0.334753 -0.707253 2.659177
10.466667 0.780930 2.255649 0.468014 -0.336695 -0.738393 2.378563
10.500000 0.770012 2.229689 0.566364 -0.339135 -0.766484 2.033957
10.533333 0.758934 2.203288 0.643381 -0.342591 -0.790924 1.646984
10.566667 0.747751 2.175368 0.691818 -0.347605 -0.810500 1.240770
10.600000 0.736474 2.146434 0.731746 -0.354539 -0.824086 0.830107
10.633333 0.724893 2.116999 0.735159 -0.363592 -0.830929 0.429474
10.666667 0.713174 2.087224 0.737274 -0.374809 -0.830801 0.047153
10.700000 0.701322 2.057135 0.713233 -0.388047 -0.823929 -0.309749
10.733333 0.689343 2.026756 0.692172 -0.403163 -0.810549 -0.632777
10.766667 0.676389 1.997856 0.647572 -0.419675 -0.791534 -0.916541
10.800000 0.662340 1.970897 0.609930 -0.437075 -0.767852 -1.151684
10.833333 0.647006 1.946356 0.563488 -0.454851 -0.740576 -1.338763
10.866667 0.631575 1.921617 0.499630 -0.472297 -0.710787 -1.470538
10.900000 0.614536 1.900044 0.438795 -0.488675 -0.679628 -1.545930
10.933333 0.597421 1.878308 0.360644 -0.503252 -0.648244 -1.563210
10.966667 0.580241 1.856425 0.313399 -0.515388 -0.617578 -1.525686
11.000000 0.561657 1.837696 0.236063 -0.524503 -0.588432 -1.437091
11.033333 0.543031 1.818846 0.167564 -0.530017 -0.561240 -1.295190
11.066667 0.524376 1.799887 0.116776 -0.531672 -0.536506 -1.106411
11.100000 0.505741 1.783890 0.073130 -0.529330 -0.514608 -0.877577
11.133333 0.487103 1.767804 0.046781 -0.522860 -0.495921 -0.624210
11.166667 0.468474 1.751635 0.027815 -0.512426 -0.480807 -0.354825
11.200000 0.451103 1.737470 0.018923 -0.498446 -0.469433 -0.081285
11.233333 0.433764 1.723236 0.026945 -0.481597 -0.462171 0.178141
11.266667 0.416471 1.708940 0.050946 -0.462437 -0.459349 0.408835
11.300000 0.401444 1.695197 0.075186 -0.441857 -0.460752 0.598774
11.333333 0.386482 1.681402 0.093710 -0.420747 -0.466162 0.746955
11.366667 0.373832 1.666534 0.157663 -0.400003 -0.475217 0.847959
11.400000 0.361262 1.651624 0.219095 -0.380221 -0.487546 0.897809
11.433333 0.350445 1.634529 0.275772 -0.361996 -0.502393 0.898219
11.466667 0.339718 1.617405 0.297174 -0.345962 -0.518755 0.857382
11.500000 0.329086 1.600261 0.318038 -0.332245 -0.535947 0.783830
11.533333 0.318551 1.583104 0.347242 -0.320950 -0.553256 0.682470
11.566667 0.308324 1.563994 0.373441 -0.311825 -0.569976 0.564461
11.600000 0.298444 1.543275 0.391503 -0.304641 -0.585237 0.442366
11.633333 0.288673 1.522572 0.403258 -0.298853 -0.598605 0.329587
11.666667 0.279014 1.501899 0.403107 -0.293888 -0.609743 0.231253
11.700000 0.269472 1.481266 0.410193 -0.289359 -0.618384 0.150193
11.733333 0.259778 1.459910 0.404232 -0.284835 -0.624179 0.090655
11.766667 0.250079 1.438127 0.385390 -0.279988 -0.626910 0.053919
11.800000 0.240490 1.416166 0.381005 -0.274572 -0.626825 0.039739
11.833333 0.231036 1.394412 0.378961 -0.268466 -0.623992 0.041808
11.866667 0.221928 1.373094 0.381950 -0.261576 -0.618512 0.054537
11.900000 0.212955 1.351891 0.388484 -0.253804 -0.610461 0.075437
11.933333 0.204729 1.331735 0.384429 -0.245247 -0.600254 0.098776
11.966667 0.196644 1.311718 0.387793 -0.236117 -0.588366 0.116195
12.000000 0.188701 1.291852 0.403544 -0.226594 -0.575107 0.119732
12.033333 0.180902 1.272148 0.411266 -0.216917 -0.560880 0.109676
12.066667 0.173950 1.253544 0.422507 -0.207328 -0.546153 0.087387
12.100000 0.167585 1.235969 0.436569 -0.198148 -0.531478 0.053035
12.133333 0.161367 1.218584 0.452403 -0.189516 -0.517115 0.007892
12.166667 0.155625 1.202084 0.433394 -0.181582 -0.503271 -0.042013
12.200000 0.149935 1.186009 0.426907 -0.174515 -0.490143 -0.089233
12.233333 0.144448 1.170342 0.427769 -0.168473 -0.477869 -0.131841
12.266667 0.139108 1.154895 0.415527 -0.163532 -0.466401 -0.166262
12.300000 0.133916 1.139676 0.404076 -0.159620 -0.455560 -0.190973
12.333333 0.128870 1.124689 0.386833 -0.156692 -0.445152 -0.202495
12.366667 0.123971 1.109943 0.372483 -0.154576 -0.434863 -0.203859
12.400000 0.119218 1.095442 0.365174 -0.153064 -0.424354 -0.198708
12.433333 0.114229 1.081353 0.369325 -0.151840 -0.413213 -0.188248
12.466667 0.109384 1.067522 0.366819 -0.150634 -0.401183 -0.176309
12.500000 0.104280 1.053932 0.357640 -0.149179 -0.387985 -0.164219
12.533333 0.099000 1.040675 0.354316 -0.147196 -0.373453 -0.156281
12.566667 0.093683 1.028018 0.351105 -0.144425 -0.357441 -0.151852
12.600000 0.088442 1.016099 0.354158 -0.140598 -0.339796 -0.150895
12.633333 0.083348 1.004462 0.346810 -0.135581 -0.320493 -0.152949
12.666667 0.078729 0.994213 0.342836 -0.129251 -0.299535 -0.158123
12.700000 0.074257 0.984252 0.326600 -0.121612 -0.277069 -0.165035
12.733333 0.069932 0.974579 0.314867 -0.112783 -0.253294 -0.170064
12.766667 0.066177 0.966494 0.318497 -0.102997 -0.228604 -0.172818
12.800000 0.062568 0.958700 0.319169 -0.092548 -0.203430 -0.170899
12.833333 0.059483 0.952143 0.312147 -0.081735 -0.178297 -0.165578
12.866667 0.057046 0.946786 0.302097 -0.070908 -0.153701 -0.154321
12.900000 0.055055 0.942552 0.292983 -0.060382 -0.130161 -0.139080
12.933333 0.053475 0.939301 0.284463 -0.050439 -0.108213 -0.122093
12.966667 0.052285 0.936962 0.285698 -0.041271 -0.088181 -0.103589
13.000000 0.051527 0.935230 0.271459 -0.033065 -0.070398 -0.084962
13.033333 0.050928 0.933976 0.272024 -0.025952 -0.055028 -0.066415
13.066667 0.050456 0.932984 0.277018 -0.019952 -0.042091 -0.049550
13.100000 0.050109 0.932248 0.275439 -0.015035 -0.031476 -0.034569
13.133333 0.049883 0.931761 0.286153 -0.011097 -0.022899 -0.022644
13.166667 0.049774 0.931516 0.281589 -0.008038 -0.016098 -0.012629
13.200000 0.049625 0.931197 0.278219 -0.005713 -0.010751 -0.006190
13.233333 0.049586 0.931107 0.277134 -0.003957 -0.006524 -0.002295
13.266667 0.049479 0.930911 0.281936 -0.002644 -0.003178 -0.001668
