t x y theta dxdt dydt dthetadt
0.000000 0.000000 0.000000 2.408751 -0.046805 0.142920 -1.148898
0.033333 -0.001545 0.004823 2.350595 -0.045864 0.146724 -1.172718
0.066667 -0.003059 0.009772 2.311221 -0.044918 0.150550 -1.200937
0.100000 -0.004543 0.014847 2.266960 -0.043967 0.154397 -1.252930
0.133333 -0.005995 0.020053 2.221512 -0.043012 0.158264 -1.338184
0.166667 -0.007413 0.025389 2.189671 -0.042053 0.162150 -1.470163
0.200000 -0.008801 0.030853 2.142648 -0.041090 0.166054 -1.650925
0.233333 -0.010155 0.036450 2.104062 -0.040125 0.169972 -1.883393
0.266667 -0.011476 0.042180 2.069811 -0.039158 0.173902 -2.153524
0.300000 -0.012766 0.048038 2.037040 -0.038190 0.177843 -2.425187
0.333333 -0.014022 0.054031 1.970473 -0.037221 0.181794 -2.676542
0.366667 -0.015244 0.060160 1.910922 -0.036253 0.185756 -2.876741
0.400000 -0.016436 0.066418 1.772236 -0.035285 0.189730 -2.998234
0.433333 -0.017596 0.072805 1.533531 -0.034316 0.193720 -3.012067
0.466667 -0.018723 0.079329 1.395416 -0.033345 0.197729 -2.907506
0.500000 -0.019818 0.085983 1.231500 -0.032373 0.201758 -2.691250
0.533333 -0.020883 0.092765 1.075157 -0.031398 0.205810 -2.370427
0.566667 -0.021918 0.099677 0.993598 -0.030421 0.209886 -1.966771
0.600000 -0.022918 0.106730 0.941247 -0.029442 0.213984 -1.513019
0.633333 -0.023884 0.113923 0.945043 -0.028461 0.218101 -1.056914
0.666667 -0.024816 0.121259 0.948777 -0.027479 0.222230 -0.632457
0.700000 -0.025714 0.128738 0.994115 -0.026499 0.226365 -0.270710
0.733333 -0.026578 0.136361 1.020002 -0.025522 0.230497 0.007121
0.766667 -0.027412 0.144111 1.044190 -0.024548 0.234620 0.193053
0.800000 -0.028212 0.152007 1.098014 -0.023580 0.238728 0.290857
0.833333 -0.028979 0.160047 1.121267 -0.022618 0.242819 0.324305
0.866667 -0.029715 0.168215 1.112659 -0.021663 0.246894 0.312090
0.900000 -0.030419 0.176528 1.112161 -0.020712 0.250953 0.274886
0.933333 -0.031092 0.184968 1.105417 -0.019767 0.254998 0.230642
0.966667 -0.031735 0.193534 1.105061 -0.018827 0.259025 0.192918
1.000000 -0.032348 0.202224 1.102769 -0.017891 0.263030 0.170714
1.033333 -0.032930 0.211039 1.113121 -0.016959 0.267010 0.160489
1.066667 -0.033480 0.220002 1.109712 -0.016032 0.270958 0.158253
1.100000 -0.033997 0.229114 1.095330 -0.015109 0.274869 0.163893
1.133333 -0.034483 0.238375 1.121059 -0.014190 0.278737 0.172481
1.166667 -0.034938 0.247758 1.158367 -0.013276 0.282564 0.176456
1.200000 -0.035363 0.257261 1.170087 -0.012366 0.286354 0.169827
1.233333 -0.035759 0.266883 1.160540 -0.011460 0.290112 0.155376
1.266667 -0.036125 0.276624 1.162849 -0.010558 0.293844 0.133784
1.300000 -0.036462 0.286482 1.167025 -0.009659 0.297566 0.099968
1.333333 -0.036769 0.296457 1.170929 -0.008761 0.301293 0.054940
1.366667 -0.037046 0.306548 1.171048 -0.007865 0.305037 0.001599
1.400000 -0.037295 0.316752 1.166451 -0.006970 0.308810 -0.054919
1.433333 -0.037514 0.327070 1.167593 -0.006075 0.312622 -0.117440
1.466667 -0.037702 0.337537 1.181586 -0.005181 0.316481 -0.182982
1.500000 -0.037859 0.348155 1.175797 -0.004287 0.320387 -0.240853
1.533333 -0.037985 0.358922 1.156120 -0.003394 0.324336 -0.282164
1.566667 -0.038082 0.369797 1.145426 -0.002505 0.328320 -0.292087
1.600000 -0.038151 0.380778 1.133203 -0.001619 0.332335 -0.263003
1.633333 -0.038189 0.391907 1.116488 -0.000738 0.336370 -0.179621
1.666667 -0.038197 0.403185 1.100015 0.000137 0.340409 -0.034566
1.700000 -0.038176 0.414610 1.044179 0.001005 0.344435 0.163265
1.733333 -0.038126 0.426181 1.032242 0.001866 0.348429 0.393323
1.766667 -0.038047 0.437849 1.007393 0.002719 0.352366 0.620385
1.800000 -0.037940 0.449663 1.029310 0.003565 0.356215 0.794716
1.833333 -0.037805 0.461620 1.094500 0.004403 0.359949 0.857893
1.866667 -0.037642 0.473720 1.152496 0.005234 0.363548 0.768083
1.900000 -0.037453 0.485958 1.250903 0.006059 0.366994 0.480716
1.933333 -0.037236 0.498334 1.346845 0.006877 0.370278 -0.018217
1.966667 -0.036993 0.510794 1.462777 0.007690 0.373397 -0.721975
2.000000 -0.036722 0.523337 1.565176 0.008497 0.376362 -1.573160
2.033333 -0.036425 0.535959 1.565436 0.009300 0.379186 -2.492547
2.066667 -0.036100 0.548659 1.482635 0.010097 0.381893 -3.407510
2.100000 -0.035749 0.561435 1.309261 0.010889 0.384514 -4.197806
2.133333 -0.035372 0.574282 0.958039 0.011674 0.387077 -4.758558
2.166667 -0.034968 0.587242 0.613432 0.012452 0.389606 -5.000413
2.200000 -0.034539 0.600268 0.399237 0.013222 0.392116 -4.900439
2.233333 -0.034083 0.613359 0.004039 0.013984 0.394613 -4.448105
2.266667 -0.033602 0.626557 -0.287532 0.014737 0.397092 -3.669815
2.300000 -0.033094 0.639813 -0.496873 0.015482 0.399532 -2.649659
2.333333 -0.032562 0.653173 -0.560124 0.016220 0.401908 -1.503090
2.366667 -0.032007 0.666633 -0.561424 0.016951 0.404200 -0.348160
2.400000 -0.031429 0.680194 -0.435950 0.017676 0.406389 0.741979
2.433333 -0.030830 0.693852 -0.209718 0.018395 0.408450 1.663642
2.466667 -0.030205 0.707554 -0.006584 0.019110 0.410371 2.361946
2.500000 -0.029555 0.721296 0.219029 0.019819 0.412151 2.811302
2.533333 -0.028881 0.735076 0.321861 0.020522 0.413796 3.038892
2.566667 -0.028185 0.748947 0.459704 0.021217 0.415310 3.081431
2.600000 -0.027466 0.762849 0.540027 0.021905 0.416703 2.978053
2.633333 -0.026722 0.776778 0.614428 0.022582 0.417999 2.803883
2.666667 -0.025953 0.790731 0.661951 0.023246 0.419213 2.613237
2.700000 -0.025160 0.804705 0.709765 0.023897 0.420353 2.454313
2.733333 -0.024349 0.818751 0.757108 0.024534 0.421420 2.340473
2.766667 -0.023515 0.832810 0.806753 0.025155 0.422419 2.283586
2.800000 -0.022663 0.846933 0.886819 0.025761 0.423349 2.278455
2.833333 -0.021796 0.861112 0.973223 0.026354 0.424193 2.304661
2.866667 -0.020904 0.875294 1.069451 0.026936 0.424935 2.345267
2.900000 -0.019990 0.889476 1.175866 0.027510 0.425563 2.382107
2.933333 -0.019060 0.903695 1.252516 0.028079 0.426065 2.405647
2.966667 -0.018116 0.917945 1.342210 0.028647 0.426424 2.400668
3.000000 -0.017157 0.932219 1.423480 0.029218 0.426627 2.357115
3.033333 -0.016175 0.946478 1.487512 0.029794 0.426671 2.273975
3.066667 -0.015177 0.960746 1.571222 0.030379 0.426548 2.147373
3.100000 -0.014156 0.974991 1.651325 0.030975 0.426252 1.975456
3.133333 -0.013117 0.989232 1.739813 0.031586 0.425778 1.753356
3.166667 -0.012058 1.003458 1.788360 0.032214 0.425124 1.489758
3.200000 -0.010979 1.017666 1.871906 0.032858 0.424287 1.189781
3.233333 -0.009878 1.031834 1.931964 0.033520 0.423264 0.859006
3.266667 -0.008754 1.045967 1.973572 0.034203 0.422053 0.508198
3.300000 -0.007606 1.060058 1.972948 0.034904 0.420654 0.155010
3.333333 -0.006434 1.074099 1.954105 0.035625 0.419068 -0.175086
3.366667 -0.005239 1.088084 1.914955 0.036362 0.417296 -0.467888
3.400000 -0.004021 1.102009 1.893047 0.037116 0.415342 -0.704390
3.433333 -0.002776 1.115863 1.842014 0.037882 0.413210 -0.870002
3.466667 -0.001504 1.129641 1.765604 0.038659 0.410905 -0.955938
3.500000 -0.000203 1.143335 1.707289 0.039442 0.408437 -0.966362
3.533333 0.001125 1.156942 1.643609 0.040227 0.405813 -0.910889
3.566667 0.002481 1.170457 1.602153 0.041010 0.403040 -0.802541
3.600000 0.003864 1.183873 1.574352 0.041789 0.400126 -0.656635
3.633333 0.005275 1.197186 1.569688 0.042560 0.397081 -0.494731
3.666667 0.006711 1.210392 1.561716 0.043320 0.393911 -0.334698
3.700000 0.008170 1.223502 1.569608 0.044067 0.390621 -0.191304
3.733333 0.009654 1.236496 1.581424 0.044801 0.387216 -0.079514
3.766667 0.011163 1.249369 1.605638 0.045520 0.383696 -0.006028
3.800000 0.012696 1.262116 1.601443 0.046225 0.380064 0.024759
3.833333 0.014251 1.274752 1.616230 0.046917 0.376318 0.017238
3.866667 0.015830 1.287253 1.623799 0.047597 0.372458 -0.023842
3.900000 0.017430 1.299636 1.627038 0.048266 0.368490 -0.089046
3.933333 0.019052 1.311875 1.630090 0.048924 0.364415 -0.163710
3.966667 0.020695 1.323990 1.618737 0.049572 0.360234 -0.237023
4.000000 0.022360 1.335953 1.610148 0.050210 0.355948 -0.302267
4.033333 0.024047 1.347761 1.591091 0.050838 0.351564 -0.353473
4.066667 0.025754 1.359433 1.554934 0.051457 0.347078 -0.384837
4.100000 0.027481 1.370943 1.541124 0.052065 0.342488 -0.395057
4.133333 0.029229 1.382287 1.512143 0.052664 0.337793 -0.388671
4.166667 0.030997 1.393485 1.491003 0.053253 0.332996 -0.368862
4.200000 0.032784 1.404536 1.482129 0.053831 0.328096 -0.337659
4.233333 0.034591 1.415434 1.471565 0.054398 0.323086 -0.299488
4.266667 0.036417 1.426154 1.483404 0.054954 0.317967 -0.263660
4.300000 0.038260 1.436691 1.481037 0.055499 0.312743 -0.233316
4.333333 0.040121 1.447043 1.472631 0.056034 0.307410 -0.208517
4.366667 0.042001 1.457230 1.460050 0.056557 0.301969 -0.191885
4.400000 0.043897 1.467226 1.461263 0.057071 0.296423 -0.184185
4.433333 0.045809 1.477026 1.462432 0.057574 0.290784 -0.183230
4.466667 0.047740 1.486655 1.444518 0.058069 0.285054 -0.181039
4.500000 0.049686 1.496082 1.441201 0.058554 0.279239 -0.176749
4.533333 0.051648 1.505306 1.433123 0.059032 0.273346 -0.169992
4.566667 0.053623 1.514324 1.418332 0.059503 0.267384 -0.155165
4.600000 0.055617 1.523160 1.409611 0.059969 0.261360 -0.128807
4.633333 0.057625 1.531785 1.413310 0.060431 0.255279 -0.090472
4.666667 0.059646 1.540197 1.417542 0.060892 0.249150 -0.041727
4.700000 0.061686 1.548420 1.400127 0.061352 0.242978 0.019967
4.733333 0.063738 1.556424 1.393597 0.061813 0.236766 0.095364
4.766667 0.065803 1.564208 1.406062 0.062274 0.230514 0.177975
4.800000 0.067886 1.571795 1.405440 0.062738 0.224218 0.264835
4.833333 0.069982 1.579157 1.409622 0.063202 0.217874 0.352586
4.866667 0.072094 1.586318 1.420165 0.063668 0.211471 0.438471
4.900000 0.074225 1.593278 1.445147 0.064134 0.205002 0.516014
4.933333 0.076373 1.600033 1.461643 0.064599 0.198455 0.581317
4.966667 0.078538 1.606582 1.497529 0.065064 0.191818 0.634964
5.000000 0.080716 1.612893 1.538094 0.065528 0.185077 0.673348
5.033333 0.082907 1.618963 1.560095 0.065992 0.178220 0.694934
5.066667 0.085115 1.624821 1.587192 0.066455 0.171241 0.697027
5.100000 0.087336 1.630433 1.606190 0.066918 0.164136 0.683509
5.133333 0.089575 1.635831 1.628165 0.067382 0.156913 0.653957
5.166667 0.091828 1.640977 1.645117 0.067851 0.149584 0.611306
5.200000 0.094095 1.645868 1.677945 0.068324 0.142168 0.560031
5.233333 0.096379 1.650502 1.696576 0.068803 0.134687 0.503691
5.266667 0.098678 1.654878 1.714900 0.069288 0.127171 0.446449
5.300000 0.100993 1.658992 1.731095 0.069778 0.119645 0.387243
5.333333 0.103325 1.662842 1.748364 0.070275 0.112136 0.331036
5.366667 0.105675 1.666426 1.745291 0.070776 0.104669 0.277775
5.400000 0.108043 1.669742 1.748283 0.071280 0.097270 0.228896
5.433333 0.110427 1.672836 1.761744 0.071786 0.089950 0.184541
5.466667 0.112828 1.675707 1.748685 0.072295 0.082709 0.148617
5.500000 0.115247 1.678305 1.754924 0.072805 0.075542 0.124570
5.533333 0.117684 1.680679 1.772277 0.073316 0.068438 0.114664
5.566667 0.120136 1.682829 1.770682 0.073830 0.061369 0.126728
5.600000 0.122606 1.684756 1.768487 0.074348 0.054300 0.177280
5.633333 0.125092 1.686459 1.767205 0.074872 0.047201 0.285568
5.666667 0.127594 1.687938 1.772144 0.075404 0.040040 0.470287
5.700000 0.130113 1.689193 1.766680 0.075946 0.032793 0.754163
5.733333 0.132648 1.690224 1.779260 0.076500 0.025438 1.156149
5.766667 0.135205 1.690970 1.779048 0.077066 0.017966 1.679360
5.800000 0.137778 1.691493 1.795943 0.077646 0.010385 2.302385
5.833333 0.140373 1.691728 1.814115 0.078236 0.002708 3.005148
5.866667 0.142985 1.691741 1.869012 0.078837 -0.005040 3.743929
5.900000 0.145620 1.691464 1.967280 0.079444 -0.012836 4.463973
5.933333 0.148278 1.690898 2.197982 0.080057 -0.020651 5.104220
5.966667 0.150960 1.690042 2.420524 0.080672 -0.028454 5.621441
6.000000 0.153666 1.688897 2.730257 0.081285 -0.036212 5.985010
6.033333 0.156387 1.687533 3.038824 0.081894 -0.043905 6.158379
6.066667 0.159124 1.685951 -2.916909 0.082497 -0.051516 6.134667
6.100000 0.161887 1.684077 -2.677631 0.083090 -0.059020 5.937538
6.133333 0.164666 1.681988 -2.461460 0.083672 -0.066405 5.606677
6.166667 0.167470 1.679610 -2.222875 0.084242 -0.073670 5.173146
6.200000 0.170289 1.677020 -2.112989 0.084800 -0.080829 4.683574
6.233333 0.173133 1.674144 -2.055663 0.085345 -0.087884 4.196678
6.266667 0.175991 1.671060 -1.965465 0.085875 -0.094838 3.760108
6.300000 0.178865 1.667769 -1.882557 0.086392 -0.101708 3.387092
6.333333 0.181753 1.664273 -1.774683 0.086894 -0.108508 3.079072
6.366667 0.184663 1.660507 -1.687683 0.087380 -0.115245 2.844869
6.400000 0.187587 1.656540 -1.637628 0.087848 -0.121917 2.673816
6.433333 0.190526 1.652373 -1.510304 0.088297 -0.128530 2.530607
6.466667 0.193480 1.648010 -1.413777 0.088725 -0.135097 2.391037
6.500000 0.196450 1.643399 -1.321214 0.089128 -0.141609 2.241094
6.533333 0.199434 1.638546 -1.254777 0.089504 -0.148056 2.077780
6.566667 0.202431 1.633457 -1.156392 0.089854 -0.154426 1.887377
6.600000 0.205441 1.628180 -1.104164 0.090178 -0.160710 1.663929
6.633333 0.208460 1.622681 -1.045503 0.090479 -0.166888 1.425173
6.666667 0.211493 1.616999 -1.019110 0.090759 -0.172935 1.181733
6.700000 0.214531 1.611106 -0.978653 0.091021 -0.178841 0.946961
6.733333 0.217571 1.605010 -0.941654 0.091269 -0.184597 0.728356
6.766667 0.220614 1.598716 -0.934311 0.091504 -0.190201 0.540854
6.800000 0.223656 1.592231 -0.926779 0.091730 -0.195647 0.396121
6.833333 0.226712 1.585577 -0.938922 0.091946 -0.200941 0.299502
6.866667 0.229781 1.578759 -0.951752 0.092155 -0.206085 0.248654
6.900000 0.232864 1.571778 -0.965078 0.092360 -0.211083 0.240822
6.933333 0.235959 1.564638 -0.966958 0.092559 -0.215938 0.268361
6.966667 0.239054 1.557334 -0.976474 0.092752 -0.220652 0.321750
7.000000 0.242150 1.549873 -0.962644 0.092939 -0.225229 0.389115
7.033333 0.245246 1.542258 -0.947086 0.093123 -0.229671 0.456145
7.066667 0.248355 1.534497 -0.897183 0.093302 -0.233980 0.511227
7.100000 0.251466 1.526595 -0.887478 0.093481 -0.238157 0.549413
7.133333 0.254580 1.518556 -0.835121 0.093666 -0.242203 0.565199
7.166667 0.257706 1.510380 -0.799479 0.093861 -0.246118 0.557562
7.200000 0.260837 1.502078 -0.776561 0.094070 -0.249900 0.528682
7.233333 0.263971 1.493656 -0.768050 0.094297 -0.253552 0.483877
7.266667 0.267111 1.485118 -0.756591 0.094544 -0.257075 0.431844
7.300000 0.270258 1.476470 -0.763925 0.094815 -0.260473 0.370892
7.333333 0.273417 1.467703 -0.748819 0.095108 -0.263746 0.307203
7.366667 0.276586 1.458835 -0.741255 0.095425 -0.266898 0.243528
7.400000 0.279767 1.449854 -0.746638 0.095766 -0.269932 0.188964
7.433333 0.282960 1.440782 -0.727744 0.096131 -0.272851 0.151102
7.466667 0.286165 1.431604 -0.727653 0.096519 -0.275654 0.143975
7.500000 0.289385 1.422344 -0.702293 0.096928 -0.278343 0.179013
7.533333 0.292619 1.413007 -0.695481 0.097355 -0.280926 0.262314
7.566667 0.295867 1.403575 -0.686922 0.097796 -0.283409 0.397935
7.600000 0.299129 1.394051 -0.717443 0.098249 -0.285795 0.583399
7.633333 0.302409 1.384464 -0.748504 0.098709 -0.288088 0.816633
7.666667 0.305710 1.374818 -0.777101 0.099175 -0.290299 1.079428
7.700000 0.309025 1.365091 -0.759260 0.099643 -0.292430 1.358704
7.733333 0.312353 1.355285 -0.688967 0.100113 -0.294478 1.639443
7.766667 0.315702 1.345430 -0.570896 0.100584 -0.296442 1.897554
7.800000 0.319065 1.335504 -0.431078 0.101056 -0.298322 2.102669
7.833333 0.322442 1.325510 -0.325214 0.101530 -0.300114 2.226508
7.866667 0.325833 1.315452 -0.280350 0.102007 -0.301810 2.260164
7.900000 0.329238 1.305333 -0.192295 0.102491 -0.303403 2.194202
7.933333 0.332657 1.295156 -0.085054 0.102982 -0.304891 2.025253
7.966667 0.336096 1.284944 0.057308 0.103483 -0.306269 1.768216
8.000000 0.339549 1.274681 0.131625 0.103994 -0.307535 1.450426
8.033333 0.343022 1.264388 0.177242 0.104515 -0.308690 1.092801
8.066667 0.346510 1.254052 0.187140 0.105048 -0.309733 0.703293
8.100000 0.350020 1.243691 0.164837 0.105589 -0.310671 0.304861
8.133333 0.353544 1.233294 0.140063 0.106138 -0.311508 -0.075069
8.166667 0.357094 1.222882 0.154260 0.106693 -0.312248 -0.423435
8.200000 0.360657 1.212439 0.158331 0.107253 -0.312893 -0.736800
8.233333 0.364248 1.201987 0.108208 0.107816 -0.313446 -1.003808
8.266667 0.367852 1.191512 0.016197 0.108378 -0.313911 -1.209059
8.300000 0.371471 1.181017 -0.022921 0.108940 -0.314285 -1.360640
8.333333 0.375103 1.170506 -0.087505 0.109503 -0.314568 -1.471735
8.366667 0.378763 1.159995 -0.147658 0.110066 -0.314757 -1.543965
8.400000 0.382451 1.149486 -0.226802 0.110630 -0.314852 -1.574159
8.433333 0.386152 1.138971 -0.277756 0.111197 -0.314850 -1.573783
8.466667 0.389866 1.128453 -0.311525 0.111769 -0.314746 -1.559747
8.500000 0.393594 1.117935 -0.363152 0.112345 -0.314541 -1.530339
8.533333 0.397348 1.107431 -0.431069 0.112925 -0.314236 -1.487163
8.566667 0.401114 1.096934 -0.464778 0.113506 -0.313832 -1.439829
8.600000 0.404906 1.086457 -0.509280 0.114088 -0.313330 -1.397667
8.633333 0.408722 1.076002 -0.564580 0.114666 -0.312733 -1.358170
8.666667 0.412551 1.065564 -0.606093 0.115236 -0.312044 -1.313079
8.700000 0.416404 1.055155 -0.635868 0.115795 -0.311268 -1.266648
8.733333 0.420281 1.044777 -0.682051 0.116339 -0.310405 -1.221895
8.766667 0.424182 1.034433 -0.731981 0.116864 -0.309461 -1.177007
8.800000 0.428095 1.024119 -0.784616 0.117365 -0.308440 -1.132327
8.833333 0.432020 1.013836 -0.819422 0.117841 -0.307340 -1.090165
8.866667 0.435956 1.003589 -0.851431 0.118294 -0.306163 -1.053963
8.900000 0.439916 0.993389 -0.873895 0.118725 -0.304907 -1.023228
8.933333 0.443886 0.983230 -0.892441 0.119136 -0.303569 -0.997323
8.966667 0.447869 0.973115 -0.932028 0.119535 -0.302141 -0.977931
9.000000 0.451862 0.963047 -0.959655 0.119929 -0.300618 -0.965631
9.033333 0.455865 0.953030 -0.990677 0.120319 -0.298998 -0.958266
9.066667 0.459880 0.943066 -1.024328 0.120711 -0.297276 -0.955291
9.100000 0.463905 0.933158 -1.060375 0.121107 -0.295451 -0.954870
9.133333 0.467940 0.923308 -1.098191 0.121508 -0.293521 -0.955217
9.166667 0.471995 0.913532 -1.130304 0.121913 -0.291491 -0.957159
9.200000 0.476059 0.903821 -1.157000 0.122318 -0.289361 -0.961102
9.233333 0.480143 0.894189 -1.192832 0.122722 -0.287132 -0.970971
9.266667 0.484246 0.884640 -1.214596 0.123123 -0.284807 -0.988392
9.300000 0.488369 0.875178 -1.257856 0.123516 -0.282389 -1.016358
9.333333 0.492500 0.865792 -1.288755 0.123896 -0.279879 -1.058668
9.366667 0.496639 0.856484 -1.304202 0.124261 -0.277277 -1.113753
9.400000 0.500787 0.847257 -1.334596 0.124607 -0.274585 -1.178864
9.433333 0.504951 0.838129 -1.374086 0.124930 -0.271804 -1.248744
9.466667 0.509123 0.829087 -1.409427 0.125229 -0.268934 -1.323155
9.500000 0.513308 0.820149 -1.472714 0.125504 -0.265974 -1.396916
9.533333 0.517504 0.811317 -1.525638 0.125752 -0.262927 -1.464882
9.566667 0.521706 0.802580 -1.580112 0.125973 -0.259795 -1.524936
9.600000 0.525917 0.793953 -1.620183 0.126166 -0.256581 -1.579395
9.633333 0.530134 0.785438 -1.692891 0.126327 -0.253288 -1.634117
9.666667 0.534355 0.777039 -1.761198 0.126456 -0.249916 -1.686402
9.700000 0.538579 0.768758 -1.816485 0.126550 -0.246469 -1.742708
9.733333 0.542808 0.760582 -1.863093 0.126610 -0.242946 -1.806230
9.766667 0.547035 0.752530 -1.892347 0.126635 -0.239344 -1.877960
9.800000 0.551268 0.744586 -1.964707 0.126625 -0.235660 -1.948197
9.833333 0.555496 0.736771 -2.021259 0.126582 -0.231889 -2.004496
9.866667 0.559719 0.729088 -2.089759 0.126510 -0.228028 -2.036336
9.900000 0.563946 0.721521 -2.167324 0.126409 -0.224068 -2.027088
9.933333 0.568165 0.714092 -2.241388 0.126283 -0.220005 -1.964440
9.966667 0.572375 0.706806 -2.345296 0.126134 -0.215838 -1.840021
10.000000 0.576575 0.699667 -2.436930 0.125970 -0.211569 -1.662349
10.033333 0.580778 0.692650 -2.526795 0.125793 -0.207201 -1.442361
10.066667 0.584971 0.685786 -2.605476 0.125609 -0.202739 -1.199000
10.100000 0.589156 0.679079 -2.652990 0.125423 -0.198196 -0.957064
10.133333 0.593331 0.672531 -2.660694 0.125241 -0.193581 -0.740157
10.166667 0.597498 0.666146 -2.640566 0.125065 -0.188904 -0.572885
10.200000 0.601658 0.659927 -2.592430 0.124898 -0.184177 -0.467919
10.233333 0.605811 0.653876 -2.546338 0.124744 -0.179419 -0.434261
10.266667 0.609966 0.647957 -2.521236 0.124603 -0.174641 -0.499297
10.300000 0.614115 0.642210 -2.538126 0.124475 -0.169850 -0.671140
10.333333 0.618258 0.636634 -2.568658 0.124362 -0.165061 -0.967039
10.366667 0.622397 0.631229 -2.605206 0.124262 -0.160279 -1.379993
10.400000 0.626538 0.625961 -2.654618 0.124173 -0.155509 -1.920169
10.433333 0.630673 0.620863 -2.717796 0.124094 -0.150749 -2.578972
10.466667 0.634805 0.615933 -2.778365 0.124023 -0.146003 -3.284461
10.500000 0.638937 0.611142 -2.861206 0.123960 -0.141276 -4.027570
10.533333 0.643067 0.606517 -2.907563 0.123903 -0.136565 -4.765339
10.566667 0.647197 0.602033 -2.939546 0.123852 -0.131874 -5.480841
10.600000 0.651325 0.597715 2.982001 0.123807 -0.127203 -6.096049
10.633333 0.655448 0.593567 2.712775 0.123768 -0.122552 -6.581334
10.666667 0.659572 0.589562 2.270365 0.123734 -0.117918 -6.942867
10.700000 0.663693 0.585726 2.024871 0.123705 -0.113297 -7.118193
10.733333 0.667814 0.582032 1.603372 0.123680 -0.108685 -7.063896
10.766667 0.671936 0.578480 1.433843 0.123659 -0.104075 -6.762775
10.800000 0.676056 0.575097 1.433843 0.123640 -0.099463 -6.294680
10.833333 0.680176 0.571857 0.970782 0.123623 -0.094845 -5.666351
10.866667 0.684298 0.568760 0.669037 0.123607 -0.090218 -4.919583
10.900000 0.688421 0.565806 0.525273 0.123590 -0.085577 -4.112243
10.933333 0.692541 0.563019 0.450272 0.123571 -0.080922 -3.329714
