t x y theta dxdt dydt dthetadt
0.000000 0.000000 0.000000 0.437944 0.066966 -0.011102 -0.004851
0.033333 0.002253 -0.000379 0.430136 0.072166 -0.011636 -0.003969
0.066667 0.004680 -0.000773 0.430858 0.077669 -0.012185 -0.003145
0.100000 0.007284 -0.001181 0.430578 0.083466 -0.012748 -0.002498
0.133333 0.010067 -0.001604 0.429460 0.089554 -0.013322 -0.002722
0.166667 0.013083 -0.002058 0.429555 0.095951 -0.013906 -0.002826
0.200000 0.016280 -0.002527 0.428067 0.102681 -0.014497 -0.000589
0.233333 0.019762 -0.003022 0.431529 0.109761 -0.015094 0.000073
0.266667 0.023551 -0.003541 0.435580 0.117202 -0.015693 -0.000205
0.300000 0.027522 -0.004075 0.427120 0.125070 -0.016292 -0.007897
0.333333 0.031678 -0.004625 0.427935 0.133434 -0.016889 -0.036743
0.366667 0.036216 -0.005205 0.435138 0.142352 -0.017480 -0.104359
0.400000 0.040938 -0.005800 0.432392 0.151933 -0.018062 -0.226991
0.433333 0.045843 -0.006411 0.431704 0.162309 -0.018624 -0.406546
0.466667 0.051231 -0.007042 0.425770 0.173605 -0.019158 -0.641406
0.500000 0.057129 -0.007693 0.429274 0.185835 -0.019657 -0.918437
0.533333 0.063206 -0.008360 0.437010 0.199017 -0.020104 -1.208701
0.566667 0.069861 -0.009052 0.430007 0.213172 -0.020483 -1.477135
0.600000 0.076691 -0.009761 0.426998 0.228302 -0.020771 -1.693252
0.633333 0.084189 -0.010491 0.338189 0.244368 -0.020949 -1.837991
0.666667 0.092397 -0.011233 0.163027 0.261329 -0.020998 -1.895015
0.700000 0.101349 -0.011981 -0.027572 0.279279 -0.020894 -1.849052
0.733333 0.111074 -0.012715 -0.199903 0.298257 -0.020625 -1.696476
0.766667 0.121610 -0.013413 -0.259417 0.318280 -0.020194 -1.448545
0.800000 0.132291 -0.014128 -0.256591 0.339343 -0.019621 -1.118187
0.833333 0.143111 -0.014858 -0.255769 0.361483 -0.018941 -0.727014
0.866667 0.154911 -0.015530 -0.247898 0.384827 -0.018208 -0.308933
0.900000 0.167758 -0.016136 -0.233185 0.409302 -0.017493 0.091660
0.933333 0.181726 -0.016677 -0.218725 0.434831 -0.016889 0.433030
0.966667 0.196871 -0.017146 -0.186000 0.461294 -0.016504 0.691875
1.000000 0.212104 -0.017632 -0.140533 0.488471 -0.016436 0.851041
1.033333 0.228520 -0.018061 -0.072888 0.515986 -0.016794 0.902161
1.066667 0.246100 -0.018462 -0.025448 0.543284 -0.017655 0.850933
1.100000 0.264823 -0.018873 0.021180 0.569918 -0.019077 0.713024
1.133333 0.284685 -0.019328 0.073362 0.595439 -0.021089 0.508662
1.166667 0.305652 -0.019890 0.116766 0.619362 -0.023652 0.254495
1.200000 0.327695 -0.020605 0.150234 0.641248 -0.026741 -0.030137
1.233333 0.349706 -0.021340 0.151371 0.660831 -0.030288 -0.322038
1.266667 0.372705 -0.022333 0.104414 0.677967 -0.034217 -0.600034
1.300000 0.396617 -0.023618 0.048089 0.692535 -0.038431 -0.847954
1.333333 0.420429 -0.024924 -0.031056 0.704492 -0.042812 -1.049227
1.366667 0.444969 -0.026577 -0.100183 0.713904 -0.047260 -1.192066
1.400000 0.469358 -0.028249 -0.153795 0.720927 -0.051654 -1.271585
1.433333 0.493574 -0.029939 -0.204557 0.725631 -0.055866 -1.288674
1.466667 0.518272 -0.031959 -0.252265 0.728111 -0.059777 -1.250948
1.500000 0.542745 -0.033995 -0.293304 0.728525 -0.063300 -1.164531
1.533333 0.567505 -0.036302 -0.326346 0.726951 -0.066355 -1.045632
1.566667 0.592437 -0.038845 -0.362986 0.723455 -0.068869 -0.906255
1.600000 0.617064 -0.041400 -0.383544 0.718059 -0.070780 -0.758425
1.633333 0.641361 -0.043965 -0.427035 0.710765 -0.072028 -0.609018
1.666667 0.665299 -0.046539 -0.445675 0.701546 -0.072574 -0.461375
1.700000 0.688853 -0.049120 -0.453215 0.690251 -0.072351 -0.315720
1.733333 0.711996 -0.051706 -0.456583 0.676817 -0.071337 -0.159690
1.766667 0.734764 -0.054244 -0.456830 0.661158 -0.069538 0.011966
1.800000 0.757038 -0.056686 -0.442047 0.643189 -0.066967 0.211966
1.833333 0.778682 -0.058981 -0.433516 0.622947 -0.063701 0.451462
1.866667 0.799812 -0.061276 -0.440180 0.600414 -0.059832 0.739634
1.900000 0.820052 -0.063333 -0.413237 0.575740 -0.055518 1.071844
1.933333 0.839726 -0.065386 -0.411104 0.548906 -0.050902 1.424321
1.966667 0.858222 -0.067116 -0.398307 0.520062 -0.046158 1.766913
2.000000 0.875386 -0.068497 -0.358449 0.489414 -0.041472 2.056234
2.033333 0.891063 -0.069523 -0.282361 0.457038 -0.037024 2.239184
2.066667 0.906080 -0.070544 -0.145151 0.423046 -0.032999 2.262288
2.100000 0.919399 -0.071247 -0.016779 0.387378 -0.029552 2.094805
2.133333 0.932018 -0.071946 0.145749 0.350091 -0.026850 1.718875
2.166667 0.943919 -0.072639 0.350169 0.310926 -0.024998 1.135559
2.200000 0.953748 -0.073231 0.508162 0.269623 -0.024060 0.364458
2.233333 0.962822 -0.073818 0.597131 0.225926 -0.024041 -0.556382
2.266667 0.969683 -0.074459 0.568812 0.179732 -0.024915 -1.564198
2.300000 0.975758 -0.075096 0.413417 0.131055 -0.026591 -2.601148
2.333333 0.981032 -0.075730 0.205447 0.079929 -0.028966 -3.595274
2.366667 0.983937 -0.076549 -0.020170 0.026822 -0.031913 -4.473672
2.400000 0.984471 -0.077558 -0.253838 -0.027935 -0.035318 -5.175241
2.433333 0.982628 -0.078764 -0.453941 -0.083803 -0.039077 -5.656885
2.466667 0.978412 -0.080180 -0.707214 -0.140337 -0.043073 -5.909297
2.500000 0.971825 -0.081799 -0.955066 -0.197100 -0.047219 -5.941732
2.533333 0.964389 -0.083414 -1.205257 -0.253643 -0.051418 -5.784751
2.566667 0.954621 -0.085230 -1.459042 -0.309862 -0.055609 -5.485330
2.600000 0.942560 -0.087251 -1.640614 -0.365462 -0.059716 -5.096336
2.633333 0.929647 -0.089267 -1.820890 -0.420323 -0.063682 -4.659021
2.666667 0.914473 -0.091513 -1.966506 -0.474327 -0.067452 -4.206779
2.700000 0.898455 -0.093751 -2.053628 -0.527485 -0.070981 -3.767026
2.733333 0.880288 -0.096194 -2.122616 -0.579681 -0.074205 -3.359424
2.766667 0.860036 -0.098816 -2.189389 -0.630679 -0.077041 -2.998145
2.800000 0.837784 -0.101576 -2.266589 -0.680399 -0.079426 -2.682298
2.833333 0.813610 -0.104439 -2.346807 -0.728673 -0.081272 -2.415998
2.866667 0.787532 -0.107383 -2.423188 -0.775320 -0.082523 -2.197457
2.900000 0.759637 -0.110368 -2.511453 -0.819931 -0.083122 -2.013284
2.933333 0.730970 -0.113332 -2.589882 -0.862313 -0.083050 -1.853518
2.966667 0.701545 -0.116272 -2.655755 -0.902362 -0.082308 -1.704630
3.000000 0.670613 -0.119161 -2.696704 -0.939929 -0.080930 -1.566208
3.033333 0.638290 -0.121972 -2.752672 -0.974919 -0.078974 -1.432689
3.066667 0.604685 -0.124675 -2.772338 -1.007294 -0.076484 -1.303218
3.100000 0.569919 -0.127252 -2.816630 -1.037206 -0.073517 -1.180142
3.133333 0.534124 -0.129677 -2.841524 -1.064715 -0.070149 -1.065536
3.166667 0.497353 -0.131932 -2.875654 -1.089761 -0.066458 -0.962233
3.200000 0.459959 -0.134151 -2.897322 -1.112310 -0.062474 -0.863398
3.233333 0.421964 -0.136331 -2.930215 -1.132370 -0.058214 -0.769768
3.266667 0.383366 -0.138280 -2.964281 -1.149968 -0.053703 -0.676416
3.300000 0.344284 -0.139976 -2.988365 -1.165130 -0.048964 -0.583734
3.333333 0.304669 -0.141631 -3.022893 -1.177905 -0.043960 -0.486245
3.366667 0.264799 -0.143028 -3.034339 -1.188492 -0.038673 -0.383775
3.400000 0.224778 -0.144154 -3.038979 -1.197097 -0.033119 -0.283375
3.433333 0.184293 -0.145237 -3.031845 -1.203907 -0.027315 -0.188309
3.466667 0.143367 -0.146276 -3.042254 -1.209100 -0.021253 -0.104500
3.500000 0.102488 -0.147024 -3.049258 -1.212843 -0.014916 -0.037245
3.533333 0.061715 -0.147482 -3.028391 -1.215381 -0.008338 -0.000215
3.566667 0.021095 -0.147633 -3.027152 -1.216893 -0.001532 0.000339
3.600000 -0.019324 -0.147462 -3.026772 -1.217592 0.005470 -0.037854
3.633333 -0.060070 -0.147251 -3.008071 -1.217711 0.012600 -0.116365
3.666667 -0.100595 -0.146698 -2.992277 -1.217544 0.019709 -0.237098
3.700000 -0.141405 -0.146106 -2.989156 -1.217311 0.026677 -0.395525
3.733333 -0.181990 -0.145141 -2.999768 -1.217190 0.033357 -0.577291
3.766667 -0.222417 -0.143792 -3.008063 -1.217338 0.039598 -0.771055
3.800000 -0.262703 -0.142056 -3.035676 -1.217847 0.045272 -0.962751
3.833333 -0.303192 -0.140291 -3.072101 -1.218777 0.050277 -1.135446
3.866667 -0.343589 -0.138132 -3.129137 -1.220090 0.054563 -1.269244
3.900000 -0.384148 -0.135952 3.082295 -1.221799 0.058036 -1.349227
3.933333 -0.424850 -0.133752 3.000946 -1.223863 0.060645 -1.364115
3.966667 -0.465675 -0.131536 2.935786 -1.226198 0.062379 -1.305965
4.000000 -0.506602 -0.129309 2.859896 -1.228680 0.063274 -1.171975
4.033333 -0.547613 -0.127073 2.815729 -1.231191 0.063341 -0.969732
4.066667 -0.588686 -0.124832 2.771234 -1.233612 0.062593 -0.711423
4.100000 -0.629923 -0.122605 2.738484 -1.235787 0.061058 -0.412862
4.133333 -0.671329 -0.120466 2.722189 -1.237564 0.058799 -0.097400
4.166667 -0.712737 -0.118332 2.736654 -1.238836 0.055848 0.213561
4.200000 -0.754129 -0.116207 2.752213 -1.239529 0.052179 0.499171
4.233333 -0.795629 -0.114363 2.794305 -1.239540 0.047852 0.745089
4.266667 -0.837202 -0.112852 2.858485 -1.238780 0.042989 0.938043
4.300000 -0.878698 -0.111358 2.912682 -1.237198 0.037747 1.069663
4.333333 -0.920096 -0.109886 2.974821 -1.234736 0.032233 1.140881
4.366667 -0.961445 -0.108816 3.025229 -1.231278 0.026573 1.156357
4.400000 -1.002681 -0.108155 3.071357 -1.226668 0.020962 1.122151
4.433333 -1.043713 -0.107896 3.123837 -1.220785 0.015552 1.047422
4.466667 -1.084569 -0.107668 -3.130927 -1.213455 0.010405 0.944629
4.500000 -1.125229 -0.107471 -3.110102 -1.204492 0.005556 0.825754
4.533333 -1.165523 -0.107567 -3.080021 -1.193701 0.001095 0.699759
4.566667 -1.205583 -0.107697 -3.071765 -1.181016 -0.002933 0.574030
4.600000 -1.245390 -0.107863 -3.058171 -1.166484 -0.006552 0.454342
4.633333 -1.284926 -0.108065 -3.047824 -1.150032 -0.009826 0.345275
4.666667 -1.323680 -0.108466 -3.030587 -1.131775 -0.012776 0.249223
4.700000 -1.361441 -0.109023 -3.030896 -1.111777 -0.015408 0.174626
4.733333 -1.398147 -0.109702 -3.021029 -1.090283 -0.017781 0.132693
4.766667 -1.434513 -0.110422 -3.020900 -1.067366 -0.019927 0.140236
4.800000 -1.469591 -0.111200 -3.034762 -1.043114 -0.021850 0.221254
4.833333 -1.504300 -0.112021 -3.043084 -1.017828 -0.023531 0.395202
4.866667 -1.537520 -0.112871 -3.039971 -0.991739 -0.024982 0.678781
4.900000 -1.570346 -0.113764 -3.050884 -0.965103 -0.026240 1.070490
4.933333 -1.602765 -0.114701 -3.055027 -0.937898 -0.027332 1.556276
4.966667 -1.633537 -0.115642 -3.060593 -0.910355 -0.028297 2.103182
5.000000 -1.663880 -0.116629 -3.048609 -0.882484 -0.029164 2.653748
5.033333 -1.692464 -0.117602 -2.962071 -0.854240 -0.029955 3.143938
5.066667 -1.720602 -0.118621 -2.826740 -0.825382 -0.030657 3.507257
5.100000 -1.746964 -0.119616 -2.612496 -0.795889 -0.031257 3.686509
5.133333 -1.772865 -0.120660 -2.337558 -0.765909 -0.031720 3.637703
5.166667 -1.798301 -0.121752 -2.091930 -0.735414 -0.032013 3.336483
5.200000 -1.823265 -0.122895 -1.856593 -0.704544 -0.032105 2.794400
5.233333 -1.846755 -0.124060 -1.682695 -0.673382 -0.031977 2.061419
5.266667 -1.868853 -0.125248 -1.577571 -0.642294 -0.031643 1.217617
5.300000 -1.889615 -0.126426 -1.531243 -0.611410 -0.031110 0.363788
5.333333 -1.909110 -0.127546 -1.613402 -0.580949 -0.030422 -0.387162
5.366667 -1.927391 -0.128564 -1.771520 -0.551222 -0.029636 -0.925219
5.400000 -1.944513 -0.129451 -1.964413 -0.522613 -0.028839 -1.163669
5.433333 -1.961154 -0.130394 -2.153741 -0.495472 -0.028122 -1.062826
5.466667 -1.976730 -0.131204 -2.313642 -0.469955 -0.027571 -0.625443
5.500000 -1.991832 -0.132075 -2.470585 -0.446185 -0.027267 0.113633
5.533333 -2.005954 -0.132864 -2.573756 -0.424145 -0.027269 1.079189
5.566667 -2.019110 -0.133608 -2.543505 -0.403735 -0.027617 2.158769
5.600000 -2.031805 -0.134416 -2.366159 -0.384683 -0.028299 3.220071
5.633333 -2.044043 -0.135291 -2.102252 -0.366744 -0.029283 4.151690
5.666667 -2.055831 -0.136235 -1.808472 -0.349715 -0.030511 4.862673
5.700000 -2.067175 -0.137248 -1.503462 -0.333458 -0.031919 5.276094
5.733333 -2.078080 -0.138334 -1.238653 -0.317818 -0.033428 5.353272
5.766667 -2.088554 -0.139493 -0.994416 -0.302612 -0.034953 5.116381
5.800000 -2.098213 -0.140705 -0.714648 -0.287784 -0.036447 4.635684
5.833333 -2.107455 -0.141994 -0.451051 -0.273299 -0.037888 3.979450
5.866667 -2.116287 -0.143362 -0.270047 -0.259138 -0.039267 3.216587
5.900000 -2.124715 -0.144810 -0.260453 -0.245306 -0.040593 2.432544
5.933333 -2.132545 -0.146216 -0.416808 -0.231868 -0.041896 1.708593
5.966667 -2.139843 -0.147566 -0.478991 -0.218939 -0.043228 1.087609
6.000000 -2.146763 -0.149002 -0.469518 -0.206554 -0.044628 0.588113
6.033333 -2.153267 -0.150380 -0.464138 -0.194740 -0.046134 0.226873
6.066667 -2.159411 -0.151847 -0.471085 -0.183520 -0.047783 0.010577
6.100000 -2.165204 -0.153406 -0.465190 -0.172914 -0.049614 -0.086842
6.133333 -2.170653 -0.155057 -0.467385 -0.162935 -0.051647 -0.112353
6.166667 -2.175770 -0.156804 -0.470290 -0.153572 -0.053878 -0.094893
6.200000 -2.180562 -0.158648 -0.470682 -0.144879 -0.056306 -0.057480
6.233333 -2.185228 -0.160512 -0.455496 -0.136888 -0.058916 -0.022733
6.266667 -2.189589 -0.162477 -0.464288 -0.129627 -0.061690 -0.003887
6.300000 -2.193654 -0.164544 -0.467979 -0.123126 -0.064612 -0.000834
6.333333 -2.197434 -0.166715 -0.466488 -0.117410 -0.067683 -0.002086
6.366667 -2.200937 -0.168992 -0.466799 -0.112558 -0.070930 -0.003765
6.400000 -2.204173 -0.171376 -0.471995 -0.108629 -0.074382 -0.005753
