t x y theta dxdt dydt dthetadt
0.000000 0.000000 0.000000 -0.874971 0.000463 -0.005886 0.002137
0.033333 0.000054 -0.001062 -0.873769 0.000252 -0.000106 0.003438
0.066667 0.000085 -0.001553 -0.870670 -0.000044 0.006957 0.005254
0.100000 0.000091 -0.001454 -0.870630 -0.000397 0.015207 0.005468
0.133333 0.000072 -0.000746 -0.876618 -0.000780 0.024678 0.005981
0.166667 0.000027 0.000590 -0.875322 -0.001188 0.035665 0.009637
0.200000 -0.000045 0.002571 -0.866974 -0.001627 0.048532 0.015691
0.233333 -0.000127 0.004195 -0.873830 -0.002100 0.063618 0.023156
0.266667 -0.000234 0.005750 -0.874164 -0.002566 0.081660 0.031007
0.300000 -0.000275 0.007498 -0.873968 -0.002945 0.103736 0.037419
0.333333 -0.000345 0.009969 -0.873224 -0.003164 0.130741 0.039026
0.366667 -0.000449 0.013071 -0.878933 -0.003126 0.163184 0.029078
0.400000 -0.000585 0.016934 -0.871998 -0.002734 0.201567 0.006057
0.433333 -0.000745 0.022184 -0.870420 -0.001894 0.246261 -0.030046
0.466667 -0.000891 0.029423 -0.864816 -0.000606 0.296720 -0.080001
0.500000 -0.001166 0.039569 -0.828939 0.001193 0.351724 -0.144131
0.533333 -0.001476 0.050544 -0.830336 0.003569 0.410149 -0.220735
0.566667 -0.001820 0.062361 -0.862471 0.006694 0.471330 -0.303456
0.600000 -0.001664 0.079149 -0.872985 0.010694 0.534254 -0.388724
0.633333 -0.000901 0.101613 -0.898722 0.015734 0.597921 -0.470780
0.666667 -0.000176 0.124941 -0.913162 0.022130 0.662121 -0.546028
0.700000 0.000508 0.149134 -0.929137 0.029936 0.726745 -0.609135
0.733333 0.001150 0.174192 -0.957345 0.039204 0.791684 -0.658066
0.766667 0.001748 0.200117 -0.999521 0.049753 0.856222 -0.697233
0.800000 0.002299 0.226908 -1.027367 0.061492 0.920330 -0.726257
0.833333 0.004547 0.258710 -1.048743 0.074277 0.984023 -0.749776
0.866667 0.006744 0.291372 -1.071713 0.087903 1.046906 -0.768722
0.900000 0.010272 0.328571 -1.082659 0.102201 1.108449 -0.783611
0.933333 0.013739 0.366614 -1.110887 0.117003 1.168124 -0.794248
0.966667 0.018257 0.408232 -1.129731 0.132160 1.225482 -0.798086
1.000000 0.023907 0.452909 -1.157762 0.147381 1.279547 -0.795608
1.033333 0.029478 0.498386 -1.198290 0.162171 1.329664 -0.783625
1.066667 0.034963 0.544645 -1.230050 0.175848 1.375235 -0.758814
1.100000 0.040353 0.591667 -1.272524 0.187747 1.416242 -0.719191
1.133333 0.045643 0.639433 -1.296117 0.197204 1.452671 -0.665051
1.166667 0.052926 0.689027 -1.315583 0.203340 1.484925 -0.594067
1.200000 0.061812 0.740101 -1.343504 0.205336 1.513722 -0.505236
1.233333 0.070569 0.791856 -1.352468 0.202774 1.539568 -0.402650
1.266667 0.079185 0.844271 -1.363895 0.195180 1.563058 -0.290913
1.300000 0.087649 0.897322 -1.373950 0.182407 1.584568 -0.176442
1.333333 0.095950 0.950986 -1.381582 0.164175 1.604525 -0.063394
1.366667 0.101902 1.005007 -1.386896 0.140969 1.623251 0.041780
1.400000 0.107671 1.059595 -1.375106 0.113359 1.641008 0.130526
1.433333 0.110638 1.114216 -1.365233 0.081959 1.658081 0.200283
1.466667 0.113411 1.169356 -1.355231 0.047693 1.674763 0.245831
1.500000 0.113251 1.225563 -1.328887 0.011501 1.691253 0.265279
1.533333 0.112890 1.282240 -1.308228 -0.025396 1.707656 0.258137
1.566667 0.112326 1.339362 -1.297787 -0.062333 1.723953 0.227567
1.600000 0.109153 1.397173 -1.272400 -0.098427 1.740047 0.179321
1.633333 0.105778 1.455378 -1.256748 -0.133231 1.755755 0.118850
1.666667 0.100525 1.514543 -1.263880 -0.166223 1.770727 0.055098
1.700000 0.093473 1.574214 -1.263775 -0.197237 1.784629 -0.005670
1.733333 0.084945 1.634167 -1.277866 -0.226180 1.797197 -0.055290
1.766667 0.076235 1.694407 -1.295136 -0.252799 1.808196 -0.091849
1.800000 0.066256 1.755507 -1.317693 -0.277132 1.817344 -0.109472
1.833333 0.056111 1.816838 -1.314969 -0.298918 1.824335 -0.109190
1.866667 0.045810 1.878372 -1.332786 -0.318026 1.828994 -0.094039
1.900000 0.034662 1.939977 -1.319381 -0.334249 1.831268 -0.067678
1.933333 0.022743 2.001740 -1.325315 -0.347467 1.831069 -0.036214
1.966667 0.010700 2.063620 -1.317931 -0.357615 1.828342 -0.004103
2.000000 -0.002014 2.125111 -1.319677 -0.364664 1.823234 0.018996
2.033333 -0.015206 2.185874 -1.317321 -0.368678 1.816097 0.032132
2.066667 -0.028932 2.246854 -1.310913 -0.369896 1.807381 0.034572
2.100000 -0.042775 2.307607 -1.304719 -0.368652 1.797477 0.028651
2.133333 -0.056407 2.367855 -1.293525 -0.365451 1.786867 0.015015
2.166667 -0.069078 2.427248 -1.292574 -0.360889 1.776081 -0.003147
2.200000 -0.079990 2.485373 -1.303493 -0.355865 1.765619 -0.018424
2.233333 -0.090924 2.543401 -1.305874 -0.351354 1.755776 -0.029452
2.266667 -0.101869 2.601309 -1.305607 -0.348442 1.746810 -0.035319
2.300000 -0.112816 2.659072 -1.307745 -0.348008 1.738914 -0.034988
2.333333 -0.123753 2.716667 -1.326569 -0.350604 1.732141 -0.025166
2.366667 -0.134074 2.774098 -1.330899 -0.356892 1.726528 -0.006644
2.400000 -0.144450 2.831341 -1.324884 -0.366836 1.721869 0.014871
2.433333 -0.155713 2.888541 -1.324498 -0.380236 1.718009 0.036657
2.466667 -0.168278 2.945833 -1.313638 -0.396341 1.714672 0.057535
2.500000 -0.180775 3.002839 -1.316924 -0.414658 1.711641 0.073480
2.533333 -0.195249 3.060022 -1.306829 -0.434650 1.708728 0.078906
2.566667 -0.209625 3.116870 -1.304435 -0.455301 1.705563 0.075216
2.600000 -0.226300 3.173809 -1.300907 -0.475859 1.701817 0.065159
2.633333 -0.242844 3.230365 -1.286438 -0.495863 1.697184 0.051943
2.666667 -0.259238 3.286514 -1.272603 -0.515400 1.691407 0.038454
2.700000 -0.278261 3.343753 -1.285400 -0.533956 1.684058 0.029932
2.733333 -0.297093 3.400534 -1.288740 -0.551363 1.674791 0.030945
2.766667 -0.315713 3.456835 -1.304786 -0.567724 1.663247 0.041747
2.800000 -0.334100 3.512628 -1.301174 -0.583275 1.649274 0.063079
2.833333 -0.354421 3.568169 -1.313714 -0.597577 1.632468 0.091611
2.866667 -0.374463 3.623153 -1.305021 -0.609844 1.612496 0.118878
2.900000 -0.394202 3.677558 -1.298483 -0.619706 1.589010 0.132504
2.933333 -0.415206 3.730571 -1.301687 -0.626490 1.561689 0.120328
2.966667 -0.437509 3.782839 -1.286350 -0.629161 1.530215 0.068493
3.000000 -0.460837 3.833882 -1.255665 -0.626502 1.494221 -0.038391
3.033333 -0.483757 3.884255 -1.240668 -0.617843 1.453528 -0.206356
3.066667 -0.506240 3.933937 -1.224684 -0.602432 1.407602 -0.432724
3.100000 -0.528139 3.981233 -1.220908 -0.579615 1.356201 -0.706465
3.133333 -0.549544 4.027800 -1.212516 -0.548907 1.298646 -1.010648
3.166667 -0.568758 4.070836 -1.246841 -0.510734 1.234915 -1.317845
3.200000 -0.587427 4.113109 -1.298799 -0.465755 1.164703 -1.594082
3.233333 -0.602685 4.151057 -1.375925 -0.415031 1.088275 -1.811509
3.266667 -0.617351 4.188220 -1.485005 -0.359985 1.006515 -1.947386
3.300000 -0.628423 4.221119 -1.600447 -0.302354 0.920662 -1.987434
3.333333 -0.638866 4.253220 -1.738154 -0.243782 0.832752 -1.923767
3.366667 -0.645768 4.280725 -1.839997 -0.185266 0.744555 -1.765491
3.400000 -0.649535 4.303683 -1.930002 -0.127903 0.658586 -1.529321
3.433333 -0.650739 4.322035 -1.989007 -0.072244 0.576989 -1.237404
3.466667 -0.650001 4.335845 -2.008512 -0.018512 0.502228 -0.913201
3.500000 -0.648578 4.348882 -1.995077 0.033719 0.436004 -0.582242
3.533333 -0.646373 4.358846 -1.980906 0.084627 0.379685 -0.269081
3.566667 -0.643421 4.366736 -1.935755 0.134572 0.334337 0.009382
3.600000 -0.639120 4.373774 -1.923259 0.184276 0.300208 0.245411
3.633333 -0.634116 4.380111 -1.909251 0.234548 0.277081 0.435428
3.666667 -0.626350 4.386978 -1.902242 0.285623 0.263390 0.580439
3.700000 -0.615150 4.395086 -1.887068 0.337259 0.257688 0.687990
3.733333 -0.603248 4.402552 -1.877000 0.389532 0.258396 0.766881
3.766667 -0.590645 4.409394 -1.840382 0.442089 0.263692 0.827266
3.800000 -0.573361 4.419243 -1.792256 0.494282 0.271835 0.865633
3.833333 -0.555390 4.428500 -1.763523 0.545308 0.281399 0.880371
3.866667 -0.536742 4.437180 -1.726651 0.594931 0.291770 0.867942
3.900000 -0.513938 4.449064 -1.698050 0.643083 0.302340 0.824965
3.933333 -0.490480 4.460395 -1.644347 0.689430 0.312363 0.744628
3.966667 -0.466384 4.471186 -1.604316 0.733683 0.321272 0.624942
4.000000 -0.441665 4.481447 -1.571547 0.775971 0.328953 0.475631
4.033333 -0.416338 4.491189 -1.564681 0.816476 0.335306 0.308788
4.066667 -0.388868 4.502392 -1.548324 0.855084 0.339969 0.135304
4.100000 -0.358887 4.514743 -1.539965 0.891873 0.342915 -0.034973
4.133333 -0.326729 4.527783 -1.551664 0.926996 0.344219 -0.184791
4.166667 -0.294039 4.540339 -1.585809 0.960660 0.344063 -0.303940
4.200000 -0.260840 4.552418 -1.607537 0.992717 0.342364 -0.390554
4.233333 -0.227155 4.564027 -1.651398 1.022923 0.339012 -0.446381
4.266667 -0.193008 4.575172 -1.689569 1.051295 0.334243 -0.471418
4.300000 -0.157488 4.586196 -1.713384 1.077771 0.328230 -0.468125
4.333333 -0.120618 4.597162 -1.724758 1.102324 0.321239 -0.447858
4.366667 -0.082751 4.607862 -1.724587 1.124893 0.313514 -0.421875
4.400000 -0.044525 4.618124 -1.720483 1.145493 0.305333 -0.393924
4.433333 -0.005966 4.627955 -1.730546 1.164172 0.296981 -0.368873
4.466667 0.033854 4.637786 -1.725297 1.180795 0.288498 -0.352990
4.500000 0.074481 4.647499 -1.736316 1.195261 0.279807 -0.347537
4.533333 0.115354 4.656798 -1.764139 1.207435 0.270811 -0.349146
4.566667 0.156444 4.665690 -1.779482 1.217398 0.261443 -0.350495
4.600000 0.197765 4.674398 -1.783523 1.225225 0.251616 -0.350480
4.633333 0.238821 4.682724 -1.801236 1.230972 0.241274 -0.345611
4.666667 0.280004 4.690659 -1.823109 1.234787 0.230464 -0.332626
4.700000 0.321571 4.698366 -1.847951 1.236530 0.219246 -0.311483
4.733333 0.363205 4.705694 -1.856854 1.236253 0.207691 -0.284390
4.766667 0.404586 4.712552 -1.861607 1.233783 0.195875 -0.257820
4.800000 0.446384 4.718946 -1.851064 1.228924 0.183921 -0.232615
4.833333 0.488285 4.724838 -1.846595 1.221593 0.171934 -0.213866
4.866667 0.528528 4.730132 -1.871959 1.211800 0.159995 -0.202950
4.900000 0.570025 4.735067 -1.872576 1.199905 0.148219 -0.204481
4.933333 0.611411 4.739661 -1.883299 1.186137 0.136703 -0.215903
4.966667 0.651349 4.744064 -1.877021 1.170899 0.125510 -0.233451
5.000000 0.691118 4.748139 -1.883303 1.154209 0.114576 -0.255814
5.033333 0.728012 4.751631 -1.882761 1.136259 0.103842 -0.278710
5.066667 0.764685 4.754807 -1.902740 1.116974 0.093210 -0.300939
5.100000 0.801112 4.757677 -1.930706 1.095863 0.082474 -0.313765
5.133333 0.837269 4.760246 -1.930625 1.072437 0.071430 -0.316796
5.166667 0.873133 4.762521 -1.944586 1.045669 0.059853 -0.306840
5.200000 0.908678 4.764510 -1.960565 1.015398 0.047727 -0.282904
5.233333 0.943882 4.766220 -1.981281 0.980719 0.034969 -0.242384
5.266667 0.978720 4.767658 -1.985942 0.940863 0.021520 -0.185178
5.300000 1.013171 4.768831 -1.995645 0.895522 0.007440 -0.115243
5.333333 1.041828 4.768570 -2.000418 0.844843 -0.007114 -0.034824
5.366667 1.070058 4.768061 -2.009363 0.789615 -0.021873 0.053712
5.400000 1.097844 4.767311 -2.011754 0.730186 -0.036668 0.149202
5.433333 1.120473 4.765476 -2.000466 0.668003 -0.051109 0.246467
5.466667 1.142634 4.763418 -1.972488 0.604514 -0.064805 0.340016
5.500000 1.160150 4.760547 -1.956884 0.541512 -0.077266 0.424734
5.533333 1.177181 4.757472 -1.947479 0.479889 -0.088197 0.499303
5.566667 1.190220 4.753822 -1.937485 0.420812 -0.097363 0.557740
5.600000 1.202768 4.749990 -1.915133 0.365443 -0.104531 0.595501
5.633333 1.212220 4.745698 -1.873724 0.314293 -0.109681 0.610390
5.666667 1.221185 4.741244 -1.855679 0.267881 -0.112730 0.607994
5.700000 1.227691 4.736878 -1.817937 0.226076 -0.113889 0.588742
5.733333 1.233721 4.732371 -1.785023 0.189209 -0.113232 0.552732
5.766667 1.238048 4.728501 -1.764971 0.156983 -0.110897 0.503532
5.800000 1.241912 4.724511 -1.766436 0.129095 -0.107022 0.445842
5.833333 1.244721 4.721311 -1.749267 0.105179 -0.101842 0.385992
5.866667 1.247086 4.718007 -1.737914 0.084867 -0.095708 0.323602
5.900000 1.249016 4.714608 -1.735916 0.067787 -0.088786 0.265243
5.933333 1.250521 4.711121 -1.722879 0.053554 -0.081319 0.213284
5.966667 1.251647 4.708360 -1.720986 0.041811 -0.073547 0.170357
6.000000 1.252559 4.706317 -1.721816 0.032217 -0.065761 0.135299
6.033333 1.253076 4.704208 -1.726884 0.024495 -0.058061 0.107326
6.066667 1.253424 4.702564 -1.711734 0.018325 -0.050547 0.085167
6.100000 1.253693 4.701401 -1.711546 0.013497 -0.043420 0.067162
6.133333 1.253600 4.700186 -1.710528 0.009792 -0.036852 0.052841
6.166667 1.253659 4.699268 -1.705214 0.007083 -0.030927 0.040504
6.200000 1.253808 4.698505 -1.706723 0.005176 -0.025642 0.030493
6.233333 1.254000 4.697963 -1.713050 0.003906 -0.021077 0.021529
