t x y theta dxdt dydt dthetadt
0.000000 0.000000 0.000000 3.043320 0.007267 0.150700 -0.048901
0.033333 0.000231 0.005031 3.050344 0.007038 0.151861 -0.045657
0.066667 0.000456 0.010098 3.046792 0.006841 0.153068 -0.042318
0.100000 0.000675 0.015201 3.034842 0.006675 0.154324 -0.036405
0.133333 0.000890 0.020341 3.033509 0.006540 0.155627 -0.025850
0.166667 0.001101 0.025519 3.032605 0.006436 0.156982 -0.014203
0.200000 0.001307 0.030765 3.046634 0.006362 0.158392 -0.003363
0.233333 0.001508 0.036081 3.039303 0.006318 0.159859 0.007942
0.266667 0.001709 0.041438 3.032624 0.006305 0.161376 0.020293
0.300000 0.001911 0.046837 3.042655 0.006323 0.162945 0.029862
0.333333 0.002116 0.052279 3.039000 0.006372 0.164568 0.033894
0.366667 0.002324 0.057764 3.041657 0.006452 0.166243 0.033990
0.400000 0.002532 0.063328 3.041098 0.006565 0.167967 0.033471
0.433333 0.002747 0.068938 3.046288 0.006709 0.169747 0.031797
0.466667 0.002968 0.074593 3.062782 0.006883 0.171596 0.027102
0.500000 0.003193 0.080332 3.056701 0.007086 0.173520 0.022037
0.533333 0.003424 0.086158 3.054484 0.007319 0.175524 0.016943
0.566667 0.003664 0.092031 3.045255 0.007582 0.177611 0.012850
0.600000 0.003916 0.097952 3.040401 0.007873 0.179788 0.008313
0.633333 0.004177 0.103963 3.047856 0.008194 0.182048 0.002744
0.666667 0.004451 0.110024 3.050985 0.008545 0.184381 -0.000065
0.700000 0.004736 0.116178 3.050158 0.008927 0.186774 -0.001768
0.733333 0.005033 0.122427 3.053737 0.009342 0.189218 -0.000974
0.766667 0.005343 0.128772 3.053015 0.009791 0.191694 0.000785
0.800000 0.005668 0.135215 3.047788 0.010275 0.194175 0.003448
0.833333 0.006008 0.141757 3.051209 0.010796 0.196649 0.008437
0.866667 0.006369 0.148349 3.048830 0.011354 0.199101 0.011974
0.900000 0.006748 0.155042 3.050185 0.011950 0.201523 0.013993
0.933333 0.007146 0.161837 3.052494 0.012584 0.203904 0.010736
0.966667 0.007567 0.168681 3.042970 0.013257 0.206253 -0.000017
1.000000 0.008011 0.175630 3.046351 0.013966 0.208575 -0.021167
1.033333 0.008480 0.182626 3.047245 0.014711 0.210876 -0.053837
1.066667 0.008977 0.189670 3.060402 0.015491 0.213156 -0.097388
1.100000 0.009502 0.196761 3.065955 0.016304 0.215425 -0.152101
1.133333 0.010053 0.203960 3.070182 0.017148 0.217693 -0.212176
1.166667 0.010631 0.211267 3.062619 0.018022 0.219956 -0.268652
1.200000 0.011237 0.218683 3.037134 0.018924 0.222220 -0.311473
1.233333 0.011876 0.226143 3.031638 0.019852 0.224480 -0.332869
1.266667 0.012550 0.233646 3.008170 0.020803 0.226745 -0.321014
1.300000 0.013253 0.241259 2.973961 0.021777 0.228999 -0.265555
1.333333 0.013993 0.248913 2.954279 0.022772 0.231242 -0.164129
1.366667 0.014763 0.256675 2.936715 0.023785 0.233476 -0.020898
1.400000 0.015573 0.264476 2.911076 0.024813 0.235706 0.156904
1.433333 0.016412 0.272382 2.897824 0.025852 0.237943 0.360783
1.466667 0.017293 0.280325 2.910526 0.026900 0.240186 0.575204
1.500000 0.018204 0.288370 2.954849 0.027953 0.242447 0.781070
1.533333 0.019147 0.296516 2.994458 0.029014 0.244711 0.965310
1.566667 0.020134 0.304695 3.056274 0.030086 0.246969 1.115133
1.600000 0.021155 0.312972 3.120216 0.031175 0.249201 1.220039
1.633333 0.022223 0.321279 -3.103686 0.032286 0.251388 1.271697
1.666667 0.023317 0.329689 -3.052291 0.033428 0.253516 1.267575
1.700000 0.024438 0.338202 -2.991344 0.034608 0.255576 1.213206
1.733333 0.025589 0.346814 -2.950540 0.035832 0.257572 1.114429
1.766667 0.026775 0.355522 -2.912636 0.037106 0.259495 0.981074
1.800000 0.028012 0.364248 -2.872727 0.038436 0.261343 0.825088
1.833333 0.029303 0.372990 -2.851790 0.039827 0.263108 0.658744
1.866667 0.030647 0.381747 -2.835363 0.041282 0.264782 0.492943
1.900000 0.032038 0.390582 -2.821883 0.042802 0.266355 0.336530
1.933333 0.033477 0.399491 -2.816171 0.044387 0.267811 0.195931
1.966667 0.034969 0.408468 -2.821831 0.046037 0.269148 0.076472
2.000000 0.036516 0.417506 -2.833846 0.047751 0.270355 -0.017737
2.033333 0.038121 0.426600 -2.846753 0.049529 0.271420 -0.083440
2.066667 0.039787 0.435743 -2.853322 0.051375 0.272327 -0.120231
2.100000 0.041515 0.444882 -2.872640 0.053294 0.273061 -0.128364
2.133333 0.043310 0.454056 -2.872272 0.055286 0.273613 -0.111871
2.166667 0.045168 0.463221 -2.885089 0.057355 0.273969 -0.072618
2.200000 0.047091 0.472375 -2.891904 0.059501 0.274131 -0.017473
2.233333 0.049088 0.481541 -2.896583 0.061722 0.274099 0.045420
2.266667 0.051162 0.490713 -2.885330 0.064012 0.273883 0.110442
2.300000 0.053317 0.499881 -2.893192 0.066363 0.273490 0.171698
2.333333 0.055555 0.509036 -2.876733 0.068766 0.272928 0.227463
2.366667 0.057879 0.518172 -2.853127 0.071213 0.272199 0.271350
2.400000 0.060292 0.527277 -2.837919 0.073699 0.271298 0.301656
2.433333 0.062796 0.536343 -2.822721 0.076213 0.270223 0.317793
2.466667 0.065372 0.545373 -2.812303 0.078751 0.268976 0.321047
2.500000 0.068045 0.554348 -2.794692 0.081312 0.267553 0.308815
2.533333 0.070790 0.563281 -2.787423 0.083902 0.265942 0.277164
2.566667 0.073638 0.572139 -2.783060 0.086523 0.264144 0.224798
2.600000 0.076560 0.580950 -2.772434 0.089178 0.262162 0.148285
2.633333 0.079555 0.589711 -2.763848 0.091877 0.259986 0.038400
2.666667 0.082625 0.598419 -2.753521 0.094633 0.257605 -0.116346
2.700000 0.085810 0.607013 -2.743524 0.097452 0.255011 -0.319802
2.733333 0.089111 0.615483 -2.749033 0.100334 0.252210 -0.572059
2.766667 0.092488 0.623893 -2.759328 0.103287 0.249195 -0.873320
2.800000 0.095941 0.632238 -2.756508 0.106315 0.245962 -1.220487
2.833333 0.099517 0.640436 -2.771754 0.109414 0.242522 -1.596781
2.866667 0.103218 0.648478 -2.833990 0.112578 0.238886 -1.982603
2.900000 0.106996 0.656449 -2.902845 0.115806 0.235061 -2.361367
2.933333 0.110900 0.664253 -2.988891 0.119092 0.231060 -2.717255
2.966667 0.114930 0.671887 3.132122 0.122424 0.226906 -3.026056
3.000000 0.119037 0.679443 2.990034 0.125788 0.222625 -3.266025
3.033333 0.123281 0.686815 2.871670 0.129169 0.218247 -3.424814
3.066667 0.127660 0.694002 2.732199 0.132546 0.213811 -3.493122
3.100000 0.132116 0.701105 2.586637 0.135892 0.209363 -3.461641
3.133333 0.136703 0.708023 2.453996 0.139189 0.204936 -3.324504
3.166667 0.141419 0.714759 2.324091 0.142420 0.200558 -3.089730
3.200000 0.146262 0.721313 2.199800 0.145566 0.196263 -2.765923
3.233333 0.151229 0.727689 2.106121 0.148614 0.192070 -2.362169
3.266667 0.156269 0.733974 2.011456 0.151566 0.187975 -1.894367
3.300000 0.161380 0.740167 1.942520 0.154422 0.183974 -1.385757
3.333333 0.166609 0.746191 1.887107 0.157187 0.180056 -0.861600
3.366667 0.171908 0.752120 1.858378 0.159870 0.176198 -0.347391
3.400000 0.177277 0.757954 1.858799 0.162492 0.172359 0.129465
3.433333 0.182753 0.763630 1.903659 0.165066 0.168508 0.541196
3.466667 0.188297 0.769209 1.958146 0.167600 0.164623 0.868728
3.500000 0.193907 0.774690 2.053754 0.170099 0.160686 1.097829
3.533333 0.199614 0.780019 2.135011 0.172566 0.156681 1.221136
3.566667 0.205413 0.785198 2.226246 0.174995 0.152608 1.238041
3.600000 0.211302 0.790226 2.282628 0.177373 0.148480 1.158962
3.633333 0.217275 0.795106 2.340483 0.179690 0.144308 1.000271
3.666667 0.223330 0.799836 2.364802 0.181932 0.140104 0.780764
3.700000 0.229462 0.804418 2.387936 0.184088 0.135888 0.524908
3.733333 0.235667 0.808852 2.383919 0.186144 0.131681 0.257706
3.766667 0.241929 0.813185 2.375691 0.188094 0.127500 0.005179
3.800000 0.248256 0.817371 2.363501 0.189936 0.123358 -0.216692
3.833333 0.254642 0.821410 2.351490 0.191667 0.119268 -0.397067
3.866667 0.261083 0.825304 2.316721 0.193293 0.115243 -0.529687
3.900000 0.267575 0.829053 2.278886 0.194820 0.111293 -0.612759
3.933333 0.274115 0.832660 2.245839 0.196254 0.107419 -0.649737
3.966667 0.280703 0.836167 2.209080 0.197601 0.103631 -0.647862
4.000000 0.287329 0.839535 2.174543 0.198863 0.099933 -0.613620
4.033333 0.293989 0.842766 2.149267 0.200043 0.096329 -0.549913
4.066667 0.300694 0.845898 2.133480 0.201137 0.092813 -0.464845
4.100000 0.307422 0.848899 2.127523 0.202143 0.089383 -0.365852
4.133333 0.314193 0.851803 2.132675 0.203062 0.086034 -0.263538
4.166667 0.321003 0.854610 2.114594 0.203893 0.082759 -0.162718
4.200000 0.327853 0.857321 2.103908 0.204636 0.079553 -0.068645
4.233333 0.334712 0.859913 2.098388 0.205294 0.076410 0.011462
4.266667 0.341579 0.862390 2.116393 0.205875 0.073334 0.077641
4.300000 0.348480 0.864772 2.126325 0.206384 0.070327 0.127811
4.333333 0.355385 0.867049 2.138083 0.206827 0.067391 0.169128
4.366667 0.362292 0.869224 2.160470 0.207213 0.064532 0.199545
4.400000 0.369201 0.871304 2.154443 0.207554 0.061754 0.222479
4.433333 0.376111 0.873292 2.172298 0.207865 0.059060 0.239694
4.466667 0.383048 0.875191 2.164064 0.208156 0.056444 0.254091
4.500000 0.390011 0.877002 2.179344 0.208439 0.053901 0.268387
4.533333 0.396974 0.878736 2.180834 0.208726 0.051425 0.281054
4.566667 0.403936 0.880396 2.190099 0.209020 0.049008 0.294398
4.600000 0.410898 0.881988 2.204003 0.209323 0.046646 0.304731
4.633333 0.417859 0.883513 2.204254 0.209631 0.044335 0.311857
4.666667 0.424840 0.884957 2.224087 0.209941 0.042075 0.309482
4.700000 0.431839 0.886318 2.241914 0.210248 0.039872 0.294580
4.733333 0.438856 0.887599 2.254950 0.210545 0.037729 0.262924
4.766667 0.445889 0.888800 2.275907 0.210827 0.035649 0.214875
4.800000 0.452936 0.889922 2.284499 0.211089 0.033635 0.153097
4.833333 0.459997 0.890968 2.289206 0.211323 0.031687 0.078361
4.866667 0.467059 0.891963 2.301907 0.211525 0.029805 -0.006281
4.900000 0.474122 0.892910 2.296367 0.211690 0.027985 -0.095685
4.933333 0.481187 0.893810 2.291951 0.211817 0.026221 -0.183387
4.966667 0.488251 0.894662 2.281285 0.211906 0.024506 -0.268355
5.000000 0.495323 0.895442 2.263329 0.211957 0.022834 -0.348521
5.033333 0.502393 0.896179 2.233390 0.211974 0.021200 -0.422011
5.066667 0.509461 0.896872 2.210047 0.211958 0.019595 -0.485207
5.100000 0.516532 0.897497 2.210276 0.211913 0.018012 -0.546045
5.133333 0.523606 0.898054 2.195134 0.211838 0.016449 -0.611884
5.166667 0.530681 0.898545 2.184182 0.211733 0.014908 -0.687389
5.200000 0.537748 0.898999 2.141068 0.211600 0.013383 -0.780249
5.233333 0.544804 0.899417 2.112315 0.211439 0.011871 -0.895193
5.266667 0.551851 0.899800 2.101504 0.211251 0.010375 -1.024572
5.300000 0.558894 0.900121 2.076557 0.211035 0.008898 -1.138357
5.333333 0.565925 0.900409 2.054282 0.210791 0.007437 -1.209328
5.366667 0.572951 0.900637 2.026418 0.210522 0.005990 -1.204009
5.400000 0.579970 0.900806 1.972654 0.210226 0.004562 -1.083764
5.433333 0.586982 0.900917 1.879001 0.209901 0.003162 -0.812611
5.466667 0.593978 0.901000 1.799124 0.209547 0.001793 -0.381812
5.500000 0.600965 0.901027 1.724364 0.209164 0.000456 0.191217
5.533333 0.607941 0.900999 1.604071 0.208749 -0.000842 0.895387
5.566667 0.614905 0.900917 1.538401 0.208300 -0.002096 1.694077
5.600000 0.621849 0.900812 1.614335 0.207814 -0.003306 2.535637
5.633333 0.628772 0.900685 1.785183 0.207292 -0.004479 3.355694
5.666667 0.635680 0.900508 1.966474 0.206732 -0.005621 4.104470
5.700000 0.642567 0.900309 2.226990 0.206133 -0.006732 4.740024
5.733333 0.649437 0.900061 2.486819 0.205493 -0.007822 5.209231
5.766667 0.656285 0.899791 2.749043 0.204813 -0.008899 5.487023
5.800000 0.663113 0.899473 2.977930 0.204093 -0.009972 5.573742
5.833333 0.669922 0.899109 -3.103525 0.203333 -0.011040 5.491263
5.866667 0.676693 0.898728 -2.885046 0.202535 -0.012109 5.257044
5.900000 0.683442 0.898302 -2.749569 0.201700 -0.013184 4.899452
5.933333 0.690153 0.897855 -2.589090 0.200832 -0.014269 4.450199
5.966667 0.696840 0.897364 -2.442040 0.199934 -0.015367 3.928789
6.000000 0.703501 0.896832 -2.327297 0.199010 -0.016482 3.336785
6.033333 0.710122 0.896270 -2.212887 0.198062 -0.017624 2.663404
6.066667 0.716704 0.895673 -2.116587 0.197095 -0.018798 1.913072
6.100000 0.723257 0.895037 -2.041274 0.196110 -0.020009 1.083399
6.133333 0.729781 0.894363 -1.952771 0.195109 -0.021258 0.181166
6.166667 0.736276 0.893650 -1.892011 0.194094 -0.022546 -0.774880
6.200000 0.742733 0.892889 -1.905912 0.193065 -0.023869 -1.752732
6.233333 0.749154 0.892075 -1.998725 0.192026 -0.025218 -2.703300
6.266667 0.755542 0.891226 -2.123536 0.190977 -0.026580 -3.592645
6.300000 0.761894 0.890322 -2.317388 0.189918 -0.027947 -4.377843
6.333333 0.768208 0.889362 -2.549228 0.188851 -0.029304 -5.018271
6.366667 0.774485 0.888349 -2.822353 0.187777 -0.030637 -5.481546
6.400000 0.780722 0.887283 -3.071134 0.186698 -0.031937 -5.751666
6.433333 0.786924 0.886187 2.948200 0.185616 -0.033198 -5.834531
6.466667 0.793098 0.885031 2.711015 0.184530 -0.034412 -5.731445
6.500000 0.799234 0.883847 2.501860 0.183440 -0.035575 -5.462892
6.533333 0.805332 0.882635 2.319260 0.182345 -0.036682 -5.060680
6.566667 0.811390 0.881397 2.181408 0.181242 -0.037734 -4.566054
6.600000 0.817417 0.880110 2.006109 0.180127 -0.038727 -4.013010
6.633333 0.823403 0.878799 1.877291 0.178996 -0.039656 -3.432497
6.666667 0.829354 0.877449 1.766844 0.177843 -0.040518 -2.858120
6.700000 0.835270 0.876065 1.683386 0.176664 -0.041308 -2.312046
6.733333 0.841148 0.874651 1.635817 0.175454 -0.042019 -1.808376
6.766667 0.846988 0.873212 1.598630 0.174206 -0.042644 -1.352073
6.800000 0.852784 0.871753 1.589882 0.172917 -0.043178 -0.948447
6.833333 0.858538 0.870279 1.604166 0.171580 -0.043616 -0.599622
6.866667 0.864247 0.868794 1.608341 0.170193 -0.043958 -0.300302
6.900000 0.869911 0.867301 1.624802 0.168752 -0.044206 -0.050512
6.933333 0.875526 0.865804 1.612675 0.167259 -0.044368 0.155718
6.966667 0.881090 0.864306 1.610816 0.165716 -0.044456 0.325242
7.000000 0.886601 0.862808 1.604502 0.164126 -0.044481 0.465723
7.033333 0.892057 0.861313 1.636860 0.162496 -0.044459 0.587126
7.066667 0.897455 0.859824 1.672239 0.160832 -0.044403 0.690234
7.100000 0.902794 0.858342 1.694470 0.159138 -0.044326 0.784895
7.133333 0.908073 0.856869 1.747111 0.157420 -0.044235 0.868205
7.166667 0.913289 0.855405 1.763181 0.155680 -0.044137 0.937056
7.200000 0.918442 0.853952 1.810727 0.153924 -0.044037 0.984167
7.233333 0.923542 0.852492 1.835098 0.152156 -0.043939 1.007894
7.266667 0.928590 0.851025 1.873704 0.150376 -0.043843 1.008831
7.300000 0.933586 0.849553 1.918630 0.148589 -0.043750 0.979479
7.333333 0.938512 0.848093 1.963874 0.146797 -0.043660 0.921070
7.366667 0.943385 0.846629 1.992437 0.145001 -0.043571 0.833337
7.400000 0.948188 0.845178 2.019819 0.143201 -0.043478 0.724457
