t x y theta dxdt dydt dthetadt
0.000000 0.000000 0.000000 -2.165570 -0.078482 -0.128998 -3.031948
0.033333 -0.002687 -0.004348 -2.235934 -0.081783 -0.131319 -2.546459
0.066667 -0.005495 -0.008783 -2.293111 -0.085043 -0.133613 -2.081571
0.100000 -0.008388 -0.013275 -2.330806 -0.088244 -0.135863 -1.655695
0.133333 -0.011400 -0.017853 -2.347053 -0.091376 -0.138059 -1.275172
0.166667 -0.014528 -0.022516 -2.364289 -0.094429 -0.140192 -0.962808
0.200000 -0.017771 -0.027265 -2.377124 -0.097396 -0.142253 -0.716110
0.233333 -0.021095 -0.032067 -2.402995 -0.100276 -0.144240 -0.526268
0.266667 -0.024499 -0.036922 -2.401161 -0.103081 -0.146161 -0.387745
0.300000 -0.027983 -0.041828 -2.394039 -0.105823 -0.148023 -0.293502
0.333333 -0.031576 -0.046812 -2.409048 -0.108507 -0.149831 -0.236901
0.366667 -0.035246 -0.051845 -2.422170 -0.111147 -0.151593 -0.204780
0.400000 -0.038992 -0.056927 -2.407495 -0.113754 -0.153321 -0.192538
0.433333 -0.042815 -0.062058 -2.414198 -0.116335 -0.155022 -0.196302
0.466667 -0.046739 -0.067258 -2.414771 -0.118887 -0.156696 -0.220197
0.500000 -0.050737 -0.072504 -2.425229 -0.121409 -0.158341 -0.257700
0.533333 -0.054832 -0.077814 -2.433472 -0.123898 -0.159959 -0.311643
0.566667 -0.059021 -0.083186 -2.450619 -0.126349 -0.161544 -0.380713
0.600000 -0.063302 -0.088620 -2.452992 -0.128749 -0.163085 -0.459822
0.633333 -0.067652 -0.094095 -2.470249 -0.131088 -0.164575 -0.548003
0.666667 -0.072070 -0.099610 -2.474815 -0.133363 -0.166012 -0.622564
0.700000 -0.076571 -0.105183 -2.495090 -0.135570 -0.167391 -0.683807
0.733333 -0.081151 -0.110812 -2.515265 -0.137705 -0.168710 -0.721739
0.766667 -0.085796 -0.116477 -2.515265 -0.139770 -0.169972 -0.735457
0.800000 -0.090504 -0.122177 -2.645634 -0.141770 -0.171180 -0.712837
0.833333 -0.095273 -0.127912 -2.657550 -0.143708 -0.172338 -0.653484
0.866667 -0.100103 -0.133679 -2.694567 -0.145589 -0.173447 -0.568213
0.900000 -0.104993 -0.139477 -2.717032 -0.147415 -0.174510 -0.457219
0.933333 -0.109947 -0.145319 -2.732659 -0.149190 -0.175529 -0.331589
0.966667 -0.114961 -0.151199 -2.733625 -0.150917 -0.176502 -0.194596
1.000000 -0.120032 -0.157106 -2.721269 -0.152595 -0.177428 -0.074774
1.033333 -0.125157 -0.163048 -2.723703 -0.154224 -0.178304 0.022223
1.066667 -0.130339 -0.169025 -2.691971 -0.155804 -0.179128 0.087726
1.100000 -0.135571 -0.175024 -2.684595 -0.157332 -0.179897 0.114458
1.133333 -0.140852 -0.181051 -2.661141 -0.158805 -0.180607 0.103000
1.166667 -0.146181 -0.187099 -2.642436 -0.160221 -0.181258 0.052149
1.200000 -0.151557 -0.193164 -2.645605 -0.161578 -0.181849 -0.021925
1.233333 -0.156980 -0.199247 -2.633253 -0.162873 -0.182381 -0.116632
1.266667 -0.162447 -0.205345 -2.649348 -0.164103 -0.182855 -0.220382
1.300000 -0.167951 -0.211459 -2.669519 -0.165268 -0.183273 -0.324596
1.333333 -0.173497 -0.217586 -2.678656 -0.166370 -0.183638 -0.423429
1.366667 -0.179075 -0.223725 -2.704012 -0.167408 -0.183951 -0.507051
1.400000 -0.184693 -0.229874 -2.725511 -0.168382 -0.184212 -0.576705
1.433333 -0.190338 -0.236031 -2.753674 -0.169297 -0.184422 -0.626720
1.466667 -0.196009 -0.242193 -2.776108 -0.170155 -0.184580 -0.659225
1.500000 -0.201704 -0.248360 -2.817599 -0.170956 -0.184686 -0.674549
1.533333 -0.207422 -0.254529 -2.823547 -0.171706 -0.184740 -0.672977
1.566667 -0.213159 -0.260699 -2.856587 -0.172408 -0.184741 -0.660635
1.600000 -0.218928 -0.266869 -2.873897 -0.173067 -0.184690 -0.638227
1.633333 -0.224728 -0.273038 -2.897037 -0.173682 -0.184587 -0.607042
1.666667 -0.230540 -0.279201 -2.927321 -0.174253 -0.184431 -0.570528
1.700000 -0.236365 -0.285357 -2.935917 -0.174782 -0.184223 -0.533728
1.733333 -0.242201 -0.291505 -2.956391 -0.175263 -0.183962 -0.498397
1.766667 -0.248062 -0.297645 -2.984356 -0.175696 -0.183648 -0.464579
1.800000 -0.253929 -0.303771 -2.981555 -0.176078 -0.183281 -0.432557
1.833333 -0.259819 -0.309886 -2.997378 -0.176411 -0.182862 -0.406663
1.866667 -0.265732 -0.315989 -3.003160 -0.176697 -0.182391 -0.386232
1.900000 -0.271646 -0.322074 -3.015992 -0.176936 -0.181869 -0.367041
1.933333 -0.277559 -0.328139 -3.036934 -0.177130 -0.181296 -0.345780
1.966667 -0.283469 -0.334182 -3.029737 -0.177286 -0.180673 -0.322906
2.000000 -0.289376 -0.340203 -3.049709 -0.177405 -0.180001 -0.291272
2.033333 -0.295301 -0.346203 -3.064536 -0.177492 -0.179281 -0.239326
2.066667 -0.301219 -0.352176 -3.084575 -0.177550 -0.178514 -0.159580
2.100000 -0.307153 -0.358127 -3.089420 -0.177584 -0.177701 -0.047110
2.133333 -0.313077 -0.364047 -3.098300 -0.177593 -0.176843 0.096023
2.166667 -0.318992 -0.369934 -3.105631 -0.177575 -0.175939 0.275880
2.200000 -0.324918 -0.375794 -3.108041 -0.177526 -0.174989 0.484065
2.233333 -0.330832 -0.381619 -3.108336 -0.177443 -0.173994 0.702634
2.266667 -0.336758 -0.387413 -3.088840 -0.177326 -0.172953 0.918195
2.300000 -0.342693 -0.393174 -3.061111 -0.177170 -0.171866 1.116083
2.333333 -0.348613 -0.398897 -3.015038 -0.176979 -0.170734 1.287512
2.366667 -0.354517 -0.404579 -2.904612 -0.176758 -0.169557 1.410879
2.400000 -0.360403 -0.410219 -2.838335 -0.176519 -0.168338 1.479720
2.433333 -0.366296 -0.415821 -2.752805 -0.176266 -0.167077 1.493428
2.466667 -0.372170 -0.421378 -2.705976 -0.176007 -0.165776 1.454970
2.500000 -0.378025 -0.426890 -2.622630 -0.175751 -0.164436 1.366687
2.533333 -0.383859 -0.432355 -2.582012 -0.175503 -0.163058 1.234875
2.566667 -0.389698 -0.437775 -2.555625 -0.175263 -0.161642 1.081809
2.600000 -0.395517 -0.443145 -2.527575 -0.175024 -0.160189 0.919296
2.633333 -0.401340 -0.448468 -2.507616 -0.174786 -0.158697 0.760139
2.666667 -0.407167 -0.453742 -2.495995 -0.174544 -0.157168 0.610439
2.700000 -0.412999 -0.458966 -2.483982 -0.174295 -0.155600 0.483094
2.733333 -0.418834 -0.464139 -2.475251 -0.174027 -0.153994 0.382234
2.766667 -0.424646 -0.469255 -2.468910 -0.173742 -0.152348 0.302751
2.800000 -0.430437 -0.474315 -2.455663 -0.173438 -0.150664 0.241234
2.833333 -0.436205 -0.479316 -2.450166 -0.173117 -0.148941 0.195206
2.866667 -0.441976 -0.484260 -2.458597 -0.172778 -0.147181 0.163415
2.900000 -0.447724 -0.489143 -2.452421 -0.172425 -0.145383 0.136680
2.933333 -0.453450 -0.493966 -2.440785 -0.172068 -0.143551 0.112014
2.966667 -0.459178 -0.498728 -2.452281 -0.171712 -0.141683 0.089805
3.000000 -0.464908 -0.503428 -2.443143 -0.171357 -0.139782 0.072804
3.033333 -0.470616 -0.508063 -2.424280 -0.171001 -0.137847 0.070619
3.066667 -0.476302 -0.512633 -2.429651 -0.170648 -0.135878 0.100345
3.100000 -0.481990 -0.517137 -2.426610 -0.170298 -0.133877 0.177259
3.133333 -0.487657 -0.521574 -2.429582 -0.169947 -0.131841 0.309122
3.166667 -0.493326 -0.525942 -2.437517 -0.169593 -0.129771 0.503862
3.200000 -0.498974 -0.530241 -2.432358 -0.169242 -0.127665 0.765613
3.233333 -0.504602 -0.534469 -2.444814 -0.168899 -0.125522 1.083882
3.266667 -0.510232 -0.538625 -2.448166 -0.168564 -0.123341 1.430136
3.300000 -0.515842 -0.542708 -2.441409 -0.168235 -0.121119 1.792280
3.333333 -0.521435 -0.546718 -2.415275 -0.167914 -0.118854 2.169252
3.366667 -0.527009 -0.550653 -2.276520 -0.167605 -0.116544 2.531343
3.400000 -0.532588 -0.554511 -2.047089 -0.167309 -0.114189 2.838865
3.433333 -0.538170 -0.558290 -1.904857 -0.167022 -0.111786 3.058543
3.466667 -0.543735 -0.561988 -1.830539 -0.166752 -0.109336 3.173713
3.500000 -0.549282 -0.565603 -1.703559 -0.166503 -0.106841 3.145065
3.533333 -0.554834 -0.569136 -1.598560 -0.166281 -0.104304 2.925406
3.566667 -0.560371 -0.572581 -1.483735 -0.166088 -0.101727 2.526183
3.600000 -0.565894 -0.575937 -1.373461 -0.165927 -0.099113 1.979509
3.633333 -0.571404 -0.579201 -1.214835 -0.165804 -0.096466 1.318347
3.666667 -0.576901 -0.582373 -1.031871 -0.165724 -0.093788 0.570720
3.700000 -0.582407 -0.585457 -0.998037 -0.165687 -0.091084 -0.202297
3.733333 -0.587921 -0.588453 -1.062203 -0.165695 -0.088354 -0.929202
3.766667 -0.593443 -0.591360 -1.184582 -0.165751 -0.085601 -1.577839
3.800000 -0.598961 -0.594173 -1.317791 -0.165854 -0.082826 -2.116302
3.833333 -0.604488 -0.596895 -1.497973 -0.166001 -0.080029 -2.512592
3.866667 -0.610016 -0.599521 -1.722930 -0.166188 -0.077208 -2.736139
3.900000 -0.615546 -0.602051 -1.815494 -0.166414 -0.074364 -2.803506
3.933333 -0.621089 -0.604487 -2.006896 -0.166677 -0.071495 -2.736267
3.966667 -0.626640 -0.606828 -2.109230 -0.166978 -0.068601 -2.558174
4.000000 -0.632202 -0.609073 -2.118649 -0.167317 -0.065682 -2.300041
4.033333 -0.637775 -0.611220 -2.118114 -0.167694 -0.062736 -1.989373
4.066667 -0.643363 -0.613269 -2.141010 -0.168111 -0.059764 -1.654155
4.100000 -0.648965 -0.615216 -2.187370 -0.168567 -0.056764 -1.272009
4.133333 -0.654583 -0.617064 -2.247448 -0.169063 -0.053734 -0.829042
4.166667 -0.660218 -0.618811 -2.300970 -0.169595 -0.050674 -0.303460
4.200000 -0.665872 -0.620458 -2.336321 -0.170162 -0.047579 0.333588
4.233333 -0.671546 -0.621999 -2.387066 -0.170761 -0.044450 1.085823
4.266667 -0.677240 -0.623437 -2.424871 -0.171388 -0.041283 1.946202
4.300000 -0.682958 -0.624768 -2.452798 -0.172040 -0.038078 2.858037
4.333333 -0.688697 -0.625995 -2.384054 -0.172712 -0.034835 3.745531
4.366667 -0.694463 -0.627114 -2.199291 -0.173400 -0.031553 4.523288
4.400000 -0.700254 -0.628122 -1.986414 -0.174102 -0.028234 5.079648
4.433333 -0.706070 -0.629018 -1.647310 -0.174814 -0.024878 5.317870
4.466667 -0.711911 -0.629799 -1.274732 -0.175536 -0.021488 5.164936
4.500000 -0.717774 -0.630462 -0.993931 -0.176271 -0.018067 4.600396
4.533333 -0.723660 -0.631007 -0.599898 -0.177021 -0.014617 3.640241
4.566667 -0.729571 -0.631445 -0.364163 -0.177793 -0.011144 2.337810
4.600000 -0.735504 -0.631761 -0.204566 -0.178594 -0.007654 0.791632
4.633333 -0.741463 -0.631969 -0.183642 -0.179433 -0.004151 -0.862341
4.666667 -0.747446 -0.632052 -0.312732 -0.180320 -0.000641 -2.483651
4.700000 -0.753455 -0.632013 -0.558481 -0.181261 0.002871 -3.962961
4.733333 -0.759494 -0.631850 -0.904931 -0.182259 0.006378 -5.184431
4.766667 -0.765563 -0.631578 -1.337990 -0.183323 0.009877 -6.058456
4.800000 -0.771671 -0.631186 -1.682577 -0.184455 0.013365 -6.543004
4.833333 -0.777823 -0.630677 -1.934955 -0.185658 0.016839 -6.647214
4.866667 -0.784022 -0.630049 -2.177356 -0.186933 0.020298 -6.418041
4.900000 -0.790254 -0.629312 -2.496894 -0.188284 0.023743 -5.905248
4.933333 -0.796542 -0.628460 -2.702982 -0.189711 0.027176 -5.195664
4.966667 -0.802889 -0.627493 -2.881441 -0.191211 0.030601 -4.386876
5.000000 -0.809270 -0.626416 -2.956782 -0.192782 0.034019 -3.559499
5.033333 -0.815686 -0.625228 -3.005679 -0.194421 0.037438 -2.769666
5.066667 -0.822168 -0.623927 -3.037091 -0.196121 0.040860 -2.056045
5.100000 -0.828717 -0.622511 -3.074933 -0.197875 0.044288 -1.455178
5.133333 -0.835335 -0.620981 -3.087148 -0.199676 0.047725 -0.978231
5.166667 -0.842022 -0.619335 -3.075835 -0.201514 0.051171 -0.623467
5.200000 -0.848781 -0.617572 -3.057002 -0.203374 0.054625 -0.377373
5.233333 -0.855578 -0.615700 -3.046835 -0.205245 0.058086 -0.231501
5.266667 -0.862447 -0.613710 -3.028338 -0.207112 0.061556 -0.177413
5.300000 -0.869391 -0.611600 -3.032154 -0.208963 0.065033 -0.202512
5.333333 -0.876410 -0.609368 -3.044443 -0.210784 0.068518 -0.298459
5.366667 -0.883467 -0.607029 -3.040171 -0.212566 0.072008 -0.455140
5.400000 -0.890603 -0.604566 -3.066870 -0.214305 0.075509 -0.665144
5.433333 -0.897777 -0.601996 -3.080674 -0.215991 0.079023 -0.916367
5.466667 -0.905031 -0.599302 -3.092735 -0.217620 0.082552 -1.182027
5.500000 -0.912323 -0.596501 -3.106517 -0.219190 0.086101 -1.427493
5.533333 -0.919654 -0.593592 -3.131785 -0.220709 0.089679 -1.624672
5.566667 -0.927068 -0.590558 3.105576 -0.222177 0.093299 -1.751032
5.600000 -0.934516 -0.587371 2.973519 -0.223599 0.096963 -1.789517
5.633333 -0.942003 -0.584078 2.839257 -0.224982 0.100673 -1.730710
5.666667 -0.949529 -0.580680 2.702753 -0.226338 0.104430 -1.583866
5.700000 -0.957092 -0.577179 2.603549 -0.227672 0.108225 -1.378777
5.733333 -0.964699 -0.573532 2.514535 -0.228986 0.112045 -1.138554
5.766667 -0.972349 -0.569742 2.480822 -0.230288 0.115872 -0.888004
5.800000 -0.980044 -0.565812 2.484342 -0.231582 0.119694 -0.657908
5.833333 -0.987786 -0.561743 2.601184 -0.232870 0.123496 -0.483215
5.866667 -0.995574 -0.557536 2.664442 -0.234153 0.127266 -0.382410
5.900000 -1.003409 -0.553190 2.707164 -0.235431 0.130988 -0.356031
5.933333 -1.011281 -0.548746 2.699248 -0.236705 0.134656 -0.402328
5.966667 -1.019199 -0.544165 2.694144 -0.237973 0.138260 -0.512720
6.000000 -1.027153 -0.539487 2.628310 -0.239232 0.141795 -0.663038
6.033333 -1.035143 -0.534715 2.563294 -0.240484 0.145261 -0.813832
6.066667 -1.043179 -0.529811 2.498223 -0.241727 0.148656 -0.938777
6.100000 -1.051261 -0.524777 2.447376 -0.242963 0.151981 -1.019746
6.133333 -1.059377 -0.519651 2.392136 -0.244189 0.155235 -1.046396
6.166667 -1.067539 -0.514404 2.367813 -0.245408 0.158420 -1.015759
6.200000 -1.075747 -0.509037 2.335005 -0.246616 0.161529 -0.936945
6.233333 -1.083989 -0.503583 2.309035 -0.247811 0.164554 -0.829991
6.266667 -1.092277 -0.498017 2.281465 -0.248987 0.167490 -0.709304
6.300000 -1.100598 -0.492368 2.256523 -0.250143 0.170334 -0.586495
6.333333 -1.108963 -0.486617 2.239060 -0.251274 0.173081 -0.468863
6.366667 -1.117361 -0.480786 2.235958 -0.252378 0.175729 -0.350527
6.400000 -1.125802 -0.474860 2.223974 -0.253456 0.178279 -0.221261
6.433333 -1.134274 -0.468857 2.219084 -0.254506 0.180735 -0.059720
6.466667 -1.142787 -0.462769 2.224720 -0.255530 0.183099 0.140434
6.500000 -1.151330 -0.456607 2.213454 -0.256528 0.185372 0.394635
6.533333 -1.159902 -0.450371 2.226829 -0.257500 0.187561 0.711750
6.566667 -1.168504 -0.444064 2.225428 -0.258447 0.189668 1.074595
6.600000 -1.177133 -0.437687 2.227189 -0.259368 0.191699 1.457024
6.633333 -1.185797 -0.431245 2.223540 -0.260267 0.193658 1.811524
6.666667 -1.194494 -0.424741 2.259875 -0.261147 0.195549 2.114362
6.700000 -1.203221 -0.418180 2.373318 -0.262013 0.197377 2.318492
6.733333 -1.211978 -0.411564 2.528031 -0.262866 0.199147 2.381873
6.766667 -1.220759 -0.404886 2.766502 -0.263710 0.200861 2.287547
6.800000 -1.229566 -0.398156 2.853779 -0.264547 0.202522 2.040092
6.833333 -1.238396 -0.391368 3.024341 -0.265374 0.204135 1.659752
6.866667 -1.247250 -0.384524 -3.092341 -0.266186 0.205703 1.161655
6.900000 -1.256126 -0.377624 -3.079924 -0.266982 0.207228 0.605635
6.933333 -1.265023 -0.370671 -3.104690 -0.267758 0.208709 0.049334
6.966667 -1.273988 -0.363691 3.066823 -0.268509 0.210149 -0.449068
7.000000 -1.282971 -0.356659 2.952335 -0.269230 0.211547 -0.857261
7.033333 -1.291973 -0.349578 2.843570 -0.269917 0.212901 -1.142884
7.066667 -1.300995 -0.342450 2.746263 -0.270567 0.214208 -1.280358
7.100000 -1.310034 -0.335278 2.692325 -0.271178 0.215466 -1.301386
7.133333 -1.319091 -0.328063 2.614798 -0.271744 0.216674 -1.231082
7.166667 -1.328165 -0.320807 2.568852 -0.272270 0.217826 -1.110395
7.200000 -1.337255 -0.313510 2.533628 -0.272758 0.218918 -0.965034
7.233333 -1.346360 -0.306176 2.637812 -0.273210 0.219946 -0.835043
7.266667 -1.355480 -0.298812 2.647555 -0.273629 0.220907 -0.750220
7.300000 -1.364614 -0.291413 2.635429 -0.274018 0.221800 -0.708219
7.333333 -1.373762 -0.283989 2.605577 -0.274378 0.222624 -0.708468
7.366667 -1.382921 -0.276542 2.560156 -0.274710 0.223382 -0.741152
7.400000 -1.392091 -0.269065 2.517147 -0.275012 0.224080 -0.800693
7.433333 -1.401271 -0.261570 2.488527 -0.275284 0.224720 -0.856911
7.466667 -1.410458 -0.254058 2.430671 -0.275526 0.225307 -0.893724
7.500000 -1.419653 -0.246534 2.384840 -0.275737 0.225848 -0.903438
7.533333 -1.428855 -0.238986 2.375187 -0.275917 0.226346 -0.886640
7.566667 -1.438061 -0.231429 2.342023 -0.276064 0.226801 -0.844214
7.600000 -1.447273 -0.223851 2.304524 -0.276174 0.227211 -0.777354
7.633333 -1.456485 -0.216270 2.279422 -0.276244 0.227575 -0.701726
7.666667 -1.465702 -0.208670 2.261257 -0.276271 0.227891 -0.632068
7.700000 -1.474923 -0.201054 2.234311 -0.276248 0.228152 -0.582394
7.733333 -1.484147 -0.193422 2.224745 -0.276174 0.228357 -0.557271
7.766667 -1.493362 -0.185797 2.220233 -0.276048 0.228503 -0.563502
7.800000 -1.502578 -0.178159 2.206588 -0.275871 0.228594 -0.603213
7.833333 -1.511796 -0.170509 2.201804 -0.275644 0.228626 -0.673329
7.866667 -1.520997 -0.162871 2.188824 -0.275370 0.228603 -0.760068
7.900000 -1.530178 -0.155245 2.181878 -0.275054 0.228528 -0.844779
7.933333 -1.539337 -0.147633 2.171374 -0.274700 0.228401 -0.910725
7.966667 -1.548495 -0.140014 2.143834 -0.274312 0.228221 -0.940145
8.000000 -1.557624 -0.132412 2.084481 -0.273896 0.227991 -0.919015
8.033333 -1.566750 -0.124805 1.984448 -0.273461 0.227716 -0.837523
8.066667 -1.575873 -0.117196 1.901718 -0.273011 0.227396 -0.692670
8.100000 -1.584965 -0.109612 1.849543 -0.272550 0.227032 -0.487993
8.133333 -1.594052 -0.102027 1.830928 -0.272084 0.226629 -0.233563
8.166667 -1.603110 -0.094472 1.834055 -0.271617 0.226191 0.053511
8.200000 -1.612162 -0.086919 1.859885 -0.271147 0.225714 0.350697
8.233333 -1.621188 -0.079401 1.889530 -0.270670 0.225190 0.634353
8.266667 -1.630189 -0.071923 1.936864 -0.270185 0.224618 0.879335
8.300000 -1.639182 -0.064449 2.000906 -0.269685 0.223990 1.066034
8.333333 -1.648166 -0.056980 2.072912 -0.269163 0.223290 1.181388
8.366667 -1.657143 -0.049516 2.108879 -0.268605 0.222502 1.225925
8.400000 -1.666093 -0.042102 2.180959 -0.268006 0.221617 1.204793
8.433333 -1.675035 -0.034694 2.232583 -0.267359 0.220631 1.127742
8.466667 -1.683966 -0.027295 2.281987 -0.266658 0.219535 1.008869
8.500000 -1.692867 -0.019949 2.310601 -0.265899 0.218333 0.869010
8.533333 -1.701736 -0.012659 2.333762 -0.265087 0.217034 0.736989
8.566667 -1.710572 -0.005427 2.343766 -0.264227 0.215659 0.638298
8.600000 -1.719373 0.001747 2.360206 -0.263329 0.214227 0.608438
8.633333 -1.728137 0.008862 2.359940 -0.262398 0.212755 0.667173
8.666667 -1.736865 0.015915 2.353400 -0.261445 0.211257 0.838088
8.700000 -1.745553 0.022905 2.355087 -0.260479 0.209749 1.134508
8.733333 -1.754201 0.029829 2.352254 -0.259515 0.208245 1.545186
8.766667 -1.762835 0.036741 2.345605 -0.258565 0.206739 2.038065
8.800000 -1.771456 0.043643 2.347573 -0.257637 0.205227 2.565913
8.833333 -1.780032 0.050474 2.393784 -0.256748 0.203706 3.100698
8.866667 -1.788562 0.057234 2.537742 -0.255914 0.202178 3.593111
8.900000 -1.797079 0.063983 2.759596 -0.255142 0.200634 3.984260
8.933333 -1.805547 0.070664 3.054891 -0.254436 0.199074 4.225031
8.966667 -1.813965 0.077280 -3.088303 -0.253803 0.197516 4.305830
9.000000 -1.822381 0.083807 -2.875797 -0.253247 0.195980 4.219968
9.033333 -1.830784 0.090324 -2.614706 -0.252767 0.194488 3.955915
9.066667 -1.839186 0.096761 -2.432347 -0.252353 0.193061 3.532200
9.100000 -1.847587 0.103122 -2.365734 -0.252000 0.191729 2.998964
9.133333 -1.855973 0.109475 -2.297902 -0.251700 0.190511 2.424455
9.166667 -1.864361 0.115763 -2.249300 -0.251441 0.189417 1.841211
9.200000 -1.872751 0.121993 -2.211514 -0.251209 0.188449 1.288467
9.233333 -1.881125 0.128217 -2.195153 -0.250995 0.187614 0.812158
9.266667 -1.889485 0.134436 -2.239650 -0.250795 0.186908 0.442898
9.300000 -1.897829 0.140650 -2.280091 -0.250608 0.186319 0.177391
9.333333 -1.906178 0.146830 -2.294997 -0.250433 0.185844 -0.011139
9.366667 -1.914512 0.153008 -2.307736 -0.250269 0.185478 -0.148084
9.400000 -1.922850 0.159163 -2.334434 -0.250122 0.185214 -0.250610
9.433333 -1.931173 0.165317 -2.336493 -0.249993 0.185046 -0.348191
9.466667 -1.939501 0.171459 -2.314479 -0.249878 0.184971 -0.473008
9.500000 -1.947834 0.177595 -2.309535 -0.249771 0.184991 -0.636353
9.533333 -1.956150 0.183734 -2.321639 -0.249667 0.185103 -0.821681
9.566667 -1.964470 0.189879 -2.304088 -0.249564 0.185309 -0.993008
9.600000 -1.972793 0.196036 -2.293163 -0.249453 0.185606 -1.137290
9.633333 -1.981118 0.202212 -2.305014 -0.249330 0.185994 -1.233802
9.666667 -1.989426 0.208394 -2.393065 -0.249193 0.186474 -1.254663
9.700000 -1.997737 0.214606 -2.617398 -0.249046 0.187044 -1.180394
9.733333 -2.006051 0.220851 -2.722467 -0.248888 0.187708 -1.032203
9.766667 -2.014348 0.227104 -2.801978 -0.248721 0.188466 -0.844665
9.800000 -2.022625 0.233368 -2.846260 -0.248546 0.189315 -0.651563
9.833333 -2.030909 0.239672 -2.850953 -0.248365 0.190254 -0.497935
9.866667 -2.039174 0.245989 -2.764995 -0.248175 0.191272 -0.440046
9.900000 -2.047442 0.252355 -2.695163 -0.247970 0.192354 -0.528973
9.933333 -2.055713 0.258776 -2.634562 -0.247742 0.193476 -0.772262
9.966667 -2.063963 0.265212 -2.553815 -0.247484 0.194624 -1.164559
10.000000 -2.072216 0.271711 -2.495299 -0.247187 0.195791 -1.674887
10.033333 -2.080469 0.278281 -2.533749 -0.246841 0.196973 -2.248685
10.066667 -2.088724 0.284923 -2.624052 -0.246438 0.198174 -2.814463
10.100000 -2.096957 0.291583 -2.802305 -0.245973 0.199409 -3.305415
10.133333 -2.105166 0.298260 -3.074258 -0.245447 0.200705 -3.673145
10.166667 -2.113353 0.304954 2.926438 -0.244858 0.202078 -3.873005
10.200000 -2.121515 0.311667 2.696629 -0.244213 0.203534 -3.883675
10.233333 -2.129653 0.318399 2.534947 -0.243517 0.205082 -3.717364
10.266667 -2.137765 0.325150 2.436468 -0.242781 0.206725 -3.406028
10.300000 -2.145848 0.332007 2.331695 -0.242014 0.208453 -2.986457
10.333333 -2.153903 0.338969 2.256926 -0.241222 0.210237 -2.508550
10.366667 -2.161931 0.346035 2.225002 -0.240413 0.212045 -2.028830
10.400000 -2.169932 0.353201 2.214486 -0.239590 0.213847 -1.594068
10.433333 -2.177906 0.360389 2.188982 -0.238756 0.215610 -1.225822
10.466667 -2.185854 0.367673 2.164880 -0.237911 0.217298 -0.931162
10.500000 -2.193773 0.374978 2.145847 -0.237056 0.218892 -0.710978
10.533333 -2.201663 0.382304 2.132983 -0.236191 0.220392 -0.553220
10.566667 -2.209526 0.389720 2.115643 -0.235313 0.221811 -0.439665
10.600000 -2.217359 0.397155 2.109036 -0.234424 0.223169 -0.352157
10.633333 -2.225161 0.404611 2.099795 -0.233522 0.224483 -0.282706
10.666667 -2.232932 0.412086 2.081015 -0.232607 0.225773 -0.225408
10.700000 -2.240671 0.419580 2.083250 -0.231676 0.227054 -0.176846
10.733333 -2.248381 0.427151 2.078667 -0.230731 0.228326 -0.133059
10.766667 -2.256061 0.434797 2.076611 -0.229770 0.229585 -0.095147
10.800000 -2.263709 0.442514 2.071635 -0.228792 0.230813 -0.063665
10.833333 -2.271324 0.450248 2.080236 -0.227796 0.231998 -0.037814
10.866667 -2.278904 0.457999 2.076095 -0.226782 0.233126 -0.018466
10.900000 -2.286451 0.465813 2.082298 -0.225749 0.234179 -0.003380
10.933333 -2.293964 0.473687 2.088468 -0.224696 0.235147 0.005608
10.966667 -2.301441 0.481576 2.077688 -0.223622 0.236030 0.011132
11.000000 -2.308882 0.489480 2.076112 -0.222528 0.236836 0.011796
11.033333 -2.316286 0.497398 2.079098 -0.221413 0.237574 0.010388
11.066667 -2.323652 0.505328 2.083491 -0.220276 0.238253 0.007509
11.100000 -2.330980 0.513272 2.081190 -0.219120 0.238888 0.003809
11.133333 -2.338269 0.521258 2.089147 -0.217942 0.239495 0.000178
11.166667 -2.345518 0.529255 2.080827 -0.216745 0.240076 -0.003257
11.200000 -2.352729 0.537262 2.081487 -0.215528 0.240634 -0.004750
11.233333 -2.359899 0.545279 2.088476 -0.214293 0.241170 -0.006178
11.266667 -2.367026 0.553329 2.081820 -0.213038 0.241684 -0.007059
11.300000 -2.374109 0.561409 2.078617 -0.211763 0.242172 -0.008372
11.333333 -2.381148 0.569516 2.073390 -0.210471 0.242628 -0.007065
11.366667 -2.388145 0.577630 2.077529 -0.209159 0.243047 -0.005600
11.400000 -2.395100 0.585748 2.081523 -0.207828 0.243428 -0.005260
11.433333 -2.402011 0.593870 2.087844 -0.206478 0.243765 -0.005821
11.466667 -2.408876 0.602009 2.071851 -0.205109 0.244055 -0.005724
11.500000 -2.415696 0.610151 2.080467 -0.203723 0.244298 -0.005793
11.533333 -2.422469 0.618306 2.081825 -0.202318 0.244495 -0.008169
11.566667 -2.429192 0.626472 2.085531 -0.200895 0.244646 -0.010953
11.600000 -2.435866 0.634648 2.079053 -0.199454 0.244750 -0.012039
11.633333 -2.442494 0.642821 2.080567 -0.197999 0.244807 -0.010823
11.666667 -2.449076 0.650990 2.076888 -0.196530 0.244816 -0.009671
11.700000 -2.455606 0.659161 2.077770 -0.195047 0.244775 -0.007784
11.733333 -2.462084 0.667330 2.071416 -0.193554 0.244682 -0.004313
11.766667 -2.468511 0.675499 2.072722 -0.192050 0.244535 -0.000097
11.800000 -2.474889 0.683659 2.076184 -0.190535 0.244336 0.002974
11.833333 -2.481215 0.691812 2.075714 -0.189009 0.244086 0.004496
11.866667 -2.487493 0.699955 2.078432 -0.187472 0.243784 0.004622
11.900000 -2.493718 0.708087 2.081484 -0.185925 0.243432 0.005041
11.933333 -2.499893 0.716207 2.078876 -0.184367 0.243029 0.004062
11.966667 -2.506019 0.724312 2.080894 -0.182798 0.242577 0.002848
12.000000 -2.512091 0.732402 2.087551 -0.181218 0.242077 0.001730
12.033333 -2.518107 0.740473 2.075126 -0.179627 0.241528 0.000926
12.066667 -2.524067 0.748524 2.080156 -0.178028 0.240934 0.000557
12.100000 -2.529977 0.756556 2.073320 -0.176420 0.240296 0.000057
12.133333 -2.535831 0.764565 2.072193 -0.174805 0.239615 0.000229
12.166667 -2.541634 0.772552 2.072902 -0.173187 0.238895 0.000182
12.200000 -2.547381 0.780511 2.078666 -0.171567 0.238138 0.000635
12.233333 -2.553072 0.788443 2.084474 -0.169945 0.237344 0.000238
12.266667 -2.558706 0.796345 2.082974 -0.168325 0.236517 0.000112
12.300000 -2.564288 0.804221 2.083312 -0.166706 0.235660 -0.001837
12.333333 -2.569818 0.812069 2.080895 -0.165090 0.234772 -0.004882
12.366667 -2.575296 0.819889 2.072938 -0.163476 0.233855 -0.008152
12.400000 -2.580716 0.827673 2.075190 -0.161863 0.232908 -0.011315
12.433333 -2.586084 0.835425 2.080368 -0.160251 0.231929 -0.013763
12.466667 -2.591398 0.843146 2.079718 -0.158637 0.230916 -0.016646
12.500000 -2.596660 0.850834 2.074511 -0.157019 0.229867 -0.017392
12.533333 -2.601868 0.858487 2.075352 -0.155396 0.228779 -0.017530
12.566667 -2.607023 0.866105 2.072707 -0.153767 0.227649 -0.017856
12.600000 -2.612125 0.873687 2.076050 -0.152130 0.226475 -0.019388
12.633333 -2.617173 0.881231 2.072550 -0.150485 0.225254 -0.020219
12.666667 -2.622167 0.888736 2.078699 -0.148830 0.223983 -0.020154
12.700000 -2.627102 0.896191 2.071039 -0.147164 0.222660 -0.020163
12.733333 -2.631978 0.903595 2.076490 -0.145489 0.221285 -0.019747
12.766667 -2.636800 0.910957 2.067609 -0.143806 0.219859 -0.017707
12.800000 -2.641568 0.918275 2.065620 -0.142115 0.218384 -0.013305
12.833333 -2.646281 0.925550 2.071574 -0.140418 0.216864 -0.008001
12.866667 -2.650936 0.932767 2.070744 -0.138718 0.215302 -0.001034
12.900000 -2.655532 0.939927 2.065032 -0.137016 0.213703 0.007119
12.933333 -2.660070 0.947027 2.067494 -0.135313 0.212068 0.017283
12.966667 -2.664549 0.954067 2.067211 -0.133609 0.210398 0.027814
13.000000 -2.668973 0.961057 2.068181 -0.131905 0.208695 0.038043
13.033333 -2.673339 0.967985 2.075034 -0.130201 0.206960 0.046922
13.066667 -2.677650 0.974862 2.074577 -0.128498 0.205193 0.054317
13.100000 -2.681907 0.981686 2.073648 -0.126796 0.203394 0.059190
13.133333 -2.686106 0.988444 2.075542 -0.125094 0.201564 0.060440
13.166667 -2.690250 0.995148 2.084489 -0.123392 0.199701 0.058501
13.200000 -2.694335 1.001784 2.083755 -0.121691 0.197805 0.053571
13.233333 -2.698363 1.008351 2.090195 -0.119990 0.195874 0.047531
13.266667 -2.702332 1.014847 2.092404 -0.118289 0.193909 0.039002
13.300000 -2.706247 1.021287 2.091371 -0.116588 0.191911 0.029814
13.333333 -2.710103 1.027654 2.092952 -0.114890 0.189884 0.020376
13.366667 -2.713905 1.033962 2.090003 -0.113194 0.187831 0.011229
13.400000 -2.717650 1.040197 2.093312 -0.111502 0.185755 0.002319
13.433333 -2.721337 1.046357 2.089717 -0.109815 0.183658 -0.006473
13.466667 -2.724967 1.052442 2.083803 -0.108134 0.181541 -0.013111
13.500000 -2.728543 1.058465 2.088497 -0.106457 0.179403 -0.018777
13.533333 -2.732061 1.064412 2.087481 -0.104786 0.177241 -0.022202
13.566667 -2.735524 1.070282 2.093891 -0.103119 0.175055 -0.023400
13.600000 -2.738933 1.076089 2.087015 -0.101458 0.172844 -0.022138
13.633333 -2.742285 1.081817 2.090419 -0.099802 0.170608 -0.019422
13.666667 -2.745585 1.087482 2.081570 -0.098150 0.168348 -0.015431
13.700000 -2.748829 1.093067 2.077364 -0.096504 0.166063 -0.009655
13.733333 -2.752018 1.098572 2.078815 -0.094862 0.163755 -0.003467
13.766667 -2.755151 1.103997 2.083575 -0.093226 0.161427 0.002708
13.800000 -2.758230 1.109341 2.080126 -0.091595 0.159079 0.008934
13.833333 -2.761254 1.114604 2.082196 -0.089969 0.156717 0.014369
13.866667 -2.764224 1.119786 2.083335 -0.088350 0.154345 0.017776
13.900000 -2.767139 1.124885 2.091346 -0.086739 0.151970 0.019261
13.933333 -2.770003 1.129917 2.083806 -0.085137 0.149598 0.019468
13.966667 -2.772813 1.134868 2.091889 -0.083546 0.147236 0.018320
14.000000 -2.775570 1.139736 2.094903 -0.081967 0.144889 0.014757
14.033333 -2.778272 1.144521 2.087129 -0.080400 0.142559 0.011568
14.066667 -2.780922 1.149224 2.086864 -0.078847 0.140247 0.008425
14.100000 -2.783518 1.153845 2.090963 -0.077306 0.137951 0.006040
14.133333 -2.786066 1.158397 2.088813 -0.075779 0.135672 0.004278
14.166667 -2.788564 1.162882 2.081788 -0.074264 0.133405 0.003510
14.200000 -2.791010 1.167284 2.089339 -0.072762 0.131148 0.005502
