t x y theta dxdt dydt dthetadt
0.000000 0.000000 0.000000 0.051360 -0.009990 0.023686 0.002732
0.033333 -0.000064 0.000578 0.062101 -0.010931 0.026849 0.009196
0.066667 -0.000267 0.000695 0.064467 -0.012653 0.031484 0.017291
0.100000 -0.000553 0.001116 0.048333 -0.015269 0.038033 0.030559
0.133333 -0.000898 0.001725 0.044871 -0.019135 0.047275 0.056509
0.166667 -0.001218 0.002887 0.062937 -0.024530 0.059832 0.096719
0.200000 -0.001625 0.004376 0.059490 -0.031680 0.076238 0.154501
0.233333 -0.002450 0.006325 0.061431 -0.040896 0.097321 0.236318
0.266667 -0.003365 0.008613 0.054958 -0.052284 0.123509 0.339223
0.300000 -0.004876 0.012039 0.057004 -0.065931 0.155171 0.458964
0.333333 -0.006477 0.015814 0.065736 -0.081516 0.191888 0.584448
0.366667 -0.008169 0.019944 0.078294 -0.098772 0.233660 0.708391
0.400000 -0.011513 0.027794 0.108881 -0.117353 0.280523 0.819014
0.433333 -0.014947 0.036003 0.130831 -0.136744 0.331960 0.906780
0.466667 -0.020881 0.049129 0.192770 -0.156283 0.387126 0.962467
0.500000 -0.026898 0.062608 0.256939 -0.175393 0.445308 0.979537
0.533333 -0.032992 0.076436 0.318381 -0.193703 0.506175 0.956939
0.566667 -0.040644 0.094356 0.363584 -0.210660 0.568427 0.895449
0.600000 -0.048920 0.116107 0.394502 -0.225869 0.630464 0.802603
0.633333 -0.057255 0.138177 0.413254 -0.239112 0.691204 0.687260
0.666667 -0.065642 0.160550 0.431408 -0.250616 0.750127 0.561829
0.700000 -0.074466 0.187044 0.442480 -0.260568 0.806438 0.442221
0.733333 -0.083684 0.217188 0.452454 -0.269203 0.859321 0.338788
0.766667 -0.092931 0.247579 0.444650 -0.277039 0.908906 0.258963
0.800000 -0.102522 0.281780 0.442502 -0.284561 0.955613 0.205249
0.833333 -0.112124 0.316177 0.423539 -0.292092 0.999433 0.176347
0.866667 -0.121729 0.350741 0.425806 -0.299685 1.040065 0.170004
0.900000 -0.131327 0.385443 0.431258 -0.307436 1.077802 0.179081
0.933333 -0.140911 0.420256 0.446476 -0.315362 1.113074 0.197958
0.966667 -0.151439 0.457734 0.468779 -0.323288 1.145842 0.220047
1.000000 -0.162510 0.496547 0.470268 -0.330984 1.176281 0.240001
1.033333 -0.173903 0.536712 0.489304 -0.338273 1.204673 0.251584
1.066667 -0.186194 0.579922 0.495739 -0.344945 1.231153 0.250603
1.100000 -0.198417 0.623078 0.499098 -0.350724 1.255341 0.234189
1.133333 -0.210561 0.666141 0.516217 -0.355347 1.276665 0.202497
1.166667 -0.222615 0.709074 0.518517 -0.358687 1.294877 0.157222
1.200000 -0.234566 0.751839 0.524501 -0.360713 1.309618 0.100905
1.233333 -0.246885 0.796465 0.543334 -0.361415 1.320585 0.037121
1.266667 -0.259284 0.841833 0.543235 -0.360918 1.327555 -0.033342
1.300000 -0.271725 0.887594 0.548542 -0.359343 1.330354 -0.110521
1.333333 -0.283850 0.933174 0.540101 -0.356843 1.328883 -0.192759
1.366667 -0.295811 0.978384 0.523281 -0.353505 1.322889 -0.277904
1.400000 -0.307596 1.023183 0.503506 -0.349357 1.312029 -0.364993
1.433333 -0.319369 1.067942 0.491225 -0.344084 1.295217 -0.448395
1.466667 -0.330940 1.112206 0.483122 -0.337344 1.271988 -0.521636
1.500000 -0.342299 1.155936 0.460589 -0.328844 1.242029 -0.575198
1.533333 -0.353433 1.199089 0.457956 -0.317955 1.204372 -0.606605
1.566667 -0.364331 1.241627 0.426694 -0.303805 1.157473 -0.612252
1.600000 -0.374860 1.279284 0.379938 -0.285319 1.099602 -0.588198
1.633333 -0.385131 1.316251 0.340130 -0.262173 1.030833 -0.535254
1.666667 -0.395130 1.352492 0.316431 -0.234021 0.950812 -0.458237
1.700000 -0.404848 1.387973 0.292785 -0.200356 0.858689 -0.367770
1.733333 -0.414273 1.422661 0.277261 -0.161311 0.754991 -0.269252
1.766667 -0.418839 1.445172 0.268210 -0.117816 0.642027 -0.173551
1.800000 -0.423098 1.466837 0.270694 -0.071225 0.522503 -0.095094
1.833333 -0.427043 1.487636 0.287777 -0.022451 0.397981 -0.044508
1.866667 -0.426934 1.499279 0.309575 0.027368 0.270534 -0.026905
1.900000 -0.423599 1.503031 0.332762 0.076646 0.143604 -0.041032
1.933333 -0.417308 1.499339 0.350389 0.124009 0.020345 -0.086209
1.966667 -0.410708 1.494757 0.357424 0.168941 -0.097880 -0.155928
2.000000 -0.403803 1.489293 0.343750 0.211201 -0.209998 -0.236148
2.033333 -0.394763 1.477487 0.316970 0.250331 -0.314216 -0.316358
2.066667 -0.385434 1.464820 0.300778 0.286350 -0.409762 -0.386458
2.100000 -0.374940 1.447200 0.277038 0.319635 -0.496891 -0.439917
2.133333 -0.364177 1.428755 0.230919 0.350743 -0.576622 -0.469006
2.166667 -0.352510 1.407436 0.210930 0.379892 -0.649264 -0.471111
2.200000 -0.339592 1.383152 0.180848 0.407107 -0.714815 -0.446720
2.233333 -0.325182 1.356552 0.173171 0.432604 -0.774116 -0.397406
2.266667 -0.309103 1.327532 0.173218 0.456213 -0.827371 -0.327281
2.300000 -0.292816 1.297816 0.174498 0.477713 -0.875019 -0.240797
2.333333 -0.275577 1.266353 0.167742 0.496631 -0.917084 -0.146654
2.366667 -0.257676 1.233383 0.146103 0.512466 -0.953856 -0.050453
2.400000 -0.239412 1.199837 0.137318 0.524901 -0.986002 0.038176
2.433333 -0.221007 1.165725 0.133367 0.533535 -1.014027 0.112770
2.466667 -0.202720 1.131761 0.145511 0.538068 -1.038762 0.167748
2.500000 -0.184142 1.096593 0.160044 0.538248 -1.060649 0.195799
2.533333 -0.165258 1.060453 0.186560 0.533984 -1.080199 0.191498
2.566667 -0.146174 1.023538 0.207364 0.525177 -1.097562 0.150139
2.600000 -0.127037 0.986236 0.224756 0.511700 -1.112745 0.072051
2.633333 -0.108681 0.948639 0.243052 0.493722 -1.125630 -0.040909
2.666667 -0.091863 0.911166 0.266014 0.471613 -1.135578 -0.184744
2.700000 -0.075817 0.872151 0.251946 0.445674 -1.141741 -0.347556
2.733333 -0.059782 0.832898 0.233879 0.416351 -1.143074 -0.516933
2.766667 -0.045675 0.793250 0.204207 0.384421 -1.138469 -0.680605
2.800000 -0.033831 0.753630 0.176648 0.350835 -1.126841 -0.827643
2.833333 -0.022036 0.713888 0.117700 0.316248 -1.107121 -0.949322
2.866667 -0.012613 0.675112 0.080294 0.281378 -1.078973 -1.040161
2.900000 -0.005347 0.638169 0.025245 0.247167 -1.042823 -1.100694
2.933333 0.001850 0.601214 -0.028587 0.214525 -0.999642 -1.134390
2.966667 0.008972 0.564283 -0.067927 0.184048 -0.951168 -1.142650
3.000000 0.014260 0.531441 -0.093748 0.156050 -0.898704 -1.131939
3.033333 0.018312 0.501340 -0.129026 0.131003 -0.843780 -1.108287
3.066667 0.021183 0.475360 -0.155694 0.109067 -0.787789 -1.074291
3.100000 0.022846 0.455002 -0.197421 0.090095 -0.731571 -1.031745
3.133333 0.024427 0.434798 -0.226989 0.073847 -0.675444 -0.979818
3.166667 0.025929 0.414765 -0.270786 0.060181 -0.619165 -0.921396
3.200000 0.027353 0.394920 -0.300290 0.048958 -0.563328 -0.851453
3.233333 0.028700 0.375277 -0.330683 0.039892 -0.508098 -0.769444
3.266667 0.029973 0.355854 -0.379430 0.032750 -0.453069 -0.675167
3.300000 0.031172 0.336664 -0.383824 0.027313 -0.397818 -0.574104
3.333333 0.031624 0.326688 -0.420017 0.023531 -0.343066 -0.467402
3.366667 0.032008 0.316966 -0.439736 0.021418 -0.289757 -0.358518
3.400000 0.032326 0.307503 -0.432981 0.021279 -0.238462 -0.255695
3.433333 0.032385 0.302762 -0.425688 0.023435 -0.190314 -0.161570
3.466667 0.032389 0.300519 -0.426544 0.028204 -0.146943 -0.083367
3.500000 0.032793 0.299600 -0.423003 0.035943 -0.110150 -0.017369
3.533333 0.033144 0.298936 -0.410945 0.046755 -0.080046 0.031197
3.566667 0.034009 0.298373 -0.418834 0.060447 -0.056539 0.063667
3.600000 0.035366 0.297930 -0.406192 0.076370 -0.039443 0.082201
3.633333 0.036676 0.297727 -0.403003 0.093886 -0.027835 0.089019
3.666667 0.039288 0.297502 -0.400616 0.112153 -0.020469 0.087166
3.700000 0.043561 0.296935 -0.402085 0.130157 -0.015903 0.075891
3.733333 0.050227 0.296135 -0.400761 0.146583 -0.013366 0.060731
3.766667 0.056842 0.295556 -0.395648 0.160286 -0.012163 0.040531
3.800000 0.063400 0.295193 -0.393855 0.170342 -0.011641 0.019149
3.833333 0.069898 0.295043 -0.379547 0.175848 -0.011518 -0.005006
3.866667 0.077387 0.294575 -0.381784 0.176302 -0.011571 -0.028501
3.900000 0.084806 0.294309 -0.384448 0.171650 -0.011694 -0.051368
3.933333 0.092150 0.294240 -0.398345 0.162542 -0.011836 -0.072378
3.966667 0.099413 0.294364 -0.395354 0.149738 -0.011957 -0.087985
4.000000 0.104909 0.293879 -0.412522 0.134221 -0.011993 -0.097817
4.033333 0.109123 0.293162 -0.409062 0.117082 -0.011844 -0.100457
4.066667 0.112109 0.292241 -0.408458 0.099446 -0.011502 -0.097560
4.100000 0.114202 0.291449 -0.425010 0.082267 -0.010939 -0.087508
4.133333 0.115306 0.291011 -0.424574 0.066250 -0.010134 -0.074152
4.166667 0.116319 0.290740 -0.427555 0.052014 -0.009022 -0.057795
4.200000 0.116984 0.290535 -0.430360 0.039901 -0.007618 -0.043733
4.233333 0.117562 0.290489 -0.434335 0.030051 -0.006010 -0.029519
4.266667 0.118196 0.290574 -0.420613 0.022348 -0.004304 -0.017467
4.300000 0.118972 0.290471 -0.423628 0.016521 -0.002589 -0.008849
4.333333 0.119401 0.290229 -0.412502 0.012174 -0.000900 -0.003191
4.366667 0.119748 0.290130 -0.426429 0.008905 0.000715 -0.000612
