t x y theta dxdt dydt dthetadt
0.000000 0.000000 0.000000 0.002621 -0.030806 0.001601 -0.009970
0.033333 -0.000670 -0.000008 -0.005248 -0.032602 0.004764 -0.032732
0.066667 -0.001277 0.000045 -0.014002 -0.036240 0.009255 -0.046189
0.100000 -0.001979 0.000150 -0.014073 -0.042544 0.015553 -0.048570
0.133333 -0.002778 0.000315 -0.012682 -0.052277 0.024162 -0.039878
0.166667 -0.003854 0.000707 -0.015759 -0.065950 0.035445 -0.023092
0.200000 -0.005022 0.001171 -0.002312 -0.084035 0.049768 -0.002612
0.233333 -0.006562 0.001975 -0.005674 -0.106621 0.067233 0.018444
0.266667 -0.009023 0.003526 -0.017898 -0.133597 0.087845 0.037791
0.300000 -0.012953 0.005910 -0.013113 -0.164292 0.111225 0.052507
0.333333 -0.016961 0.008390 -0.013234 -0.197747 0.136756 0.060408
0.366667 -0.022963 0.012612 -0.009937 -0.233231 0.163927 0.062639
0.400000 -0.031044 0.018240 0.003727 -0.269998 0.192218 0.061993
0.433333 -0.041980 0.026018 0.012258 -0.307542 0.221276 0.057206
0.466667 -0.055382 0.035658 0.015491 -0.344994 0.250461 0.047975
0.500000 -0.068810 0.045394 0.016299 -0.381948 0.279428 0.034627
0.533333 -0.082248 0.055221 0.006685 -0.418293 0.308084 0.016978
0.566667 -0.095679 0.065135 0.011973 -0.453941 0.336458 -0.008227
0.600000 -0.111964 0.077261 0.008526 -0.488830 0.364627 -0.040899
0.633333 -0.128206 0.089462 0.010682 -0.522857 0.392652 -0.083262
0.666667 -0.144384 0.101732 0.002729 -0.556497 0.421014 -0.135896
0.700000 -0.163395 0.115925 0.007750 -0.590331 0.450389 -0.199323
0.733333 -0.183936 0.131400 0.003059 -0.624615 0.481143 -0.273466
0.766667 -0.207242 0.148914 0.002548 -0.659043 0.513147 -0.352145
0.800000 -0.230386 0.166456 -0.002707 -0.693352 0.546197 -0.433321
0.833333 -0.253340 0.184012 -0.011855 -0.727355 0.580113 -0.506513
0.866667 -0.277191 0.202839 -0.041174 -0.760702 0.614514 -0.562908
0.900000 -0.303217 0.223691 -0.075382 -0.792571 0.648397 -0.594206
0.933333 -0.331407 0.247060 -0.091412 -0.822151 0.680701 -0.593726
0.966667 -0.359280 0.270378 -0.142674 -0.849179 0.710736 -0.558868
1.000000 -0.386803 0.293625 -0.183349 -0.873032 0.737574 -0.489771
1.033333 -0.419518 0.321782 -0.201866 -0.892487 0.759814 -0.392874
1.066667 -0.451806 0.349822 -0.237226 -0.906245 0.776163 -0.272171
1.100000 -0.483627 0.377720 -0.244277 -0.912697 0.785377 -0.134143
1.133333 -0.514940 0.405451 -0.231867 -0.910820 0.786859 0.015534
1.166667 -0.546552 0.433335 -0.213056 -0.898954 0.779730 0.170877
1.200000 -0.579157 0.461639 -0.193572 -0.875395 0.763308 0.330195
1.233333 -0.613199 0.490583 -0.165289 -0.839277 0.737713 0.493348
1.266667 -0.644733 0.517328 -0.142799 -0.789367 0.702917 0.652305
1.300000 -0.673883 0.542222 -0.136421 -0.725749 0.659767 0.804080
1.333333 -0.698380 0.563444 -0.130865 -0.648492 0.609025 0.944751
1.366667 -0.722083 0.584326 -0.117308 -0.558381 0.551974 1.067283
1.400000 -0.744959 0.604849 -0.070276 -0.457308 0.490360 1.159141
1.433333 -0.759804 0.620019 -0.006569 -0.347652 0.426077 1.206487
1.466667 -0.773762 0.634797 0.045430 -0.232280 0.361082 1.203395
1.500000 -0.779518 0.644870 0.114263 -0.113794 0.297019 1.136610
1.533333 -0.777434 0.650775 0.188255 0.005375 0.235167 1.000510
1.566667 -0.774412 0.656264 0.251049 0.122597 0.176551 0.796715
1.600000 -0.763561 0.658180 0.293153 0.235602 0.121964 0.539073
1.633333 -0.751765 0.659677 0.342707 0.343527 0.071248 0.246666
1.666667 -0.739026 0.660757 0.341868 0.445325 0.024385 -0.059688
1.700000 -0.719171 0.659853 0.313408 0.540624 -0.019104 -0.349724
1.733333 -0.698383 0.658536 0.272809 0.629775 -0.059785 -0.598247
1.766667 -0.676673 0.656810 0.207414 0.713417 -0.098054 -0.783081
1.800000 -0.649660 0.652936 0.145123 0.792537 -0.134440 -0.894733
1.833333 -0.621751 0.648661 0.070489 0.867451 -0.168973 -0.927697
1.866667 -0.591708 0.642587 0.024648 0.938679 -0.201573 -0.886866
1.900000 -0.558975 0.634617 -0.027173 1.006794 -0.231934 -0.785757
1.933333 -0.522746 0.624758 -0.048671 1.071441 -0.259420 -0.643591
1.966667 -0.485245 0.614030 -0.062846 1.132129 -0.283532 -0.481827
2.000000 -0.445531 0.602425 -0.062062 1.188932 -0.303906 -0.319947
2.033333 -0.403729 0.590468 -0.057452 1.241878 -0.320245 -0.176196
2.066667 -0.360068 0.578543 -0.028971 1.291106 -0.332748 -0.065573
2.100000 -0.314810 0.566927 -0.015486 1.336585 -0.341790 0.004060
2.133333 -0.268879 0.555011 -0.003434 1.378897 -0.348159 0.030547
2.166667 -0.222309 0.542806 -0.010338 1.418995 -0.352782 0.017092
2.200000 -0.173053 0.530992 0.002637 1.456929 -0.356540 -0.029872
2.233333 -0.123226 0.518915 -0.001791 1.492801 -0.360262 -0.102424
2.266667 -0.073448 0.507462 0.004070 1.526580 -0.364469 -0.184933
2.300000 -0.024466 0.496398 0.004738 1.558244 -0.369463 -0.267926
2.333333 0.028595 0.484856 -0.015944 1.587244 -0.375243 -0.337621
2.366667 0.082353 0.472823 -0.031116 1.612634 -0.381568 -0.388078
2.400000 0.139131 0.459721 -0.066591 1.633783 -0.387991 -0.408502
2.433333 0.196254 0.446429 -0.085743 1.650222 -0.394114 -0.394313
2.466667 0.253406 0.432492 -0.113926 1.661287 -0.399336 -0.347093
2.500000 0.310818 0.418391 -0.131581 1.666227 -0.403094 -0.267715
2.533333 0.368445 0.404139 -0.158657 1.664801 -0.404853 -0.165478
2.566667 0.424751 0.389922 -0.175366 1.657347 -0.404347 -0.046608
2.600000 0.481189 0.375582 -0.168630 1.644207 -0.401452 0.073095
2.633333 0.536521 0.361676 -0.166975 1.625701 -0.396079 0.180712
2.666667 0.591904 0.347672 -0.130089 1.602671 -0.388532 0.262763
2.700000 0.644514 0.335079 -0.110331 1.576026 -0.379304 0.310975
2.733333 0.697098 0.322414 -0.074896 1.546531 -0.368976 0.316246
2.766667 0.749619 0.309688 -0.043880 1.514573 -0.358040 0.276563
2.800000 0.798987 0.298370 -0.025334 1.480966 -0.347170 0.196298
2.833333 0.848224 0.287011 -0.018849 1.446364 -0.337000 0.084806
2.866667 0.896389 0.276282 -0.002148 1.411263 -0.328054 -0.043858
2.900000 0.943612 0.266024 -0.012951 1.376041 -0.320497 -0.178387
2.933333 0.987382 0.256482 -0.013963 1.341264 -0.314497 -0.301265
2.966667 1.030897 0.246934 -0.054701 1.307563 -0.310192 -0.399023
3.000000 1.074128 0.237389 -0.087001 1.275084 -0.307385 -0.463969
3.033333 1.114968 0.227221 -0.119217 1.244169 -0.305778 -0.493979
3.066667 1.155473 0.217071 -0.163022 1.215007 -0.304959 -0.488685
3.100000 1.195621 0.206947 -0.179288 1.187856 -0.304706 -0.453075
3.133333 1.233624 0.196674 -0.194680 1.162187 -0.304551 -0.393413
3.166667 1.271664 0.185881 -0.210883 1.137001 -0.303844 -0.322627
3.200000 1.309280 0.175138 -0.210639 1.111407 -0.302068 -0.249279
3.233333 1.345644 0.165024 -0.213826 1.084271 -0.298909 -0.178497
3.266667 1.381542 0.154977 -0.206908 1.054534 -0.294109 -0.119308
3.300000 1.416954 0.145004 -0.186504 1.021137 -0.287405 -0.074100
3.333333 1.451861 0.135114 -0.186604 0.983062 -0.278635 -0.046004
3.366667 1.486242 0.125314 -0.196341 0.939720 -0.267857 -0.031067
3.400000 1.520080 0.115611 -0.199426 0.890528 -0.255128 -0.025070
3.433333 1.553355 0.106012 -0.208379 0.834947 -0.240361 -0.026975
3.466667 1.581347 0.097818 -0.203810 0.772798 -0.223544 -0.031256
3.500000 1.603580 0.091400 -0.205587 0.704339 -0.204805 -0.034010
3.533333 1.625214 0.085105 -0.209763 0.631070 -0.184569 -0.032237
3.566667 1.646244 0.078934 -0.206830 0.555049 -0.163384 -0.027563
3.600000 1.666662 0.072892 -0.210340 0.478387 -0.141803 -0.021804
3.633333 1.686465 0.066982 -0.211581 0.403338 -0.120447 -0.014765
3.666667 1.697010 0.063693 -0.217266 0.332273 -0.100023 -0.007369
3.700000 1.700812 0.062392 -0.211855 0.267208 -0.081115 -0.001779
3.733333 1.704010 0.061226 -0.205345 0.209353 -0.064093 0.000417
3.766667 1.706618 0.060191 -0.212090 0.159399 -0.049170 0.001496
3.800000 1.708165 0.059710 -0.202792 0.117970 -0.036589 0.001032
3.833333 1.709147 0.059356 -0.208311 0.085530 -0.026546 -0.000222
3.866667 1.710066 0.059092 -0.207644 0.061339 -0.018883 -0.003853
3.900000 1.710449 0.058950 -0.208335 0.044059 -0.013269 -0.008312
3.933333 1.710890 0.058911 -0.210044 0.032337 -0.009370 -0.012058
3.966667 1.711744 0.058731 -0.210622 0.024736 -0.006830 -0.015894
4.000000 1.713335 0.058374 -0.207533 0.019681 -0.005199 -0.018023
4.033333 1.714444 0.058129 -0.213887 0.015793 -0.004063 -0.019591
4.066667 1.715083 0.057992 -0.211178 0.012314 -0.003170 -0.018648
4.100000 1.715263 0.057961 -0.212976 0.008994 -0.002420 -0.015611
4.133333 1.714998 0.058034 -0.214818 0.005680 -0.001714 -0.012025
