t x y theta dxdt dydt dthetadt
0.000000 0.000000 0.000000 0.334975 -0.062563 -0.085917 0.451292
0.033333 -0.002080 -0.003030 0.349089 -0.066729 -0.082830 0.474624
0.066667 -0.004229 -0.006184 0.369215 -0.071579 -0.078181 0.490246
0.100000 -0.006471 -0.009337 0.395349 -0.077111 -0.071786 0.494944
0.133333 -0.008826 -0.012390 0.409834 -0.083391 -0.063390 0.490861
0.166667 -0.011481 -0.014988 0.430128 -0.090493 -0.052836 0.477249
0.200000 -0.014445 -0.017118 0.455031 -0.098475 -0.039996 0.457471
0.233333 -0.017729 -0.018765 0.475999 -0.107385 -0.024841 0.432320
0.266667 -0.021262 -0.019841 0.484565 -0.117265 -0.007439 0.402221
0.300000 -0.025107 -0.020237 0.496516 -0.128178 0.012033 0.373264
0.333333 -0.029301 -0.020110 0.500675 -0.140114 0.033260 0.345122
0.366667 -0.033881 -0.019110 0.513077 -0.153100 0.055959 0.326328
0.400000 -0.038888 -0.017157 0.522686 -0.167158 0.079808 0.316827
0.433333 -0.044399 -0.014172 0.515368 -0.182317 0.104529 0.317294
0.466667 -0.050531 -0.010115 0.545821 -0.198594 0.129889 0.327613
0.500000 -0.057427 -0.004953 0.526556 -0.215919 0.155673 0.346539
0.533333 -0.064726 0.000805 0.554916 -0.234256 0.181732 0.369165
0.566667 -0.072435 0.007167 0.579404 -0.253437 0.207892 0.386343
0.600000 -0.080562 0.014145 0.571033 -0.273303 0.234043 0.395410
0.633333 -0.090023 0.022422 0.580392 -0.293707 0.260163 0.389324
0.666667 -0.099917 0.031332 0.609265 -0.314617 0.286366 0.363742
0.700000 -0.111240 0.041646 0.640918 -0.335970 0.312752 0.310151
0.733333 -0.123007 0.052608 0.668280 -0.357704 0.339421 0.230635
0.766667 -0.135222 0.064226 0.677792 -0.379901 0.366559 0.128042
0.800000 -0.147890 0.076506 0.683524 -0.402640 0.394319 0.001537
0.833333 -0.161909 0.090277 0.677567 -0.425987 0.422772 -0.139677
0.866667 -0.176389 0.104722 0.680507 -0.449858 0.451829 -0.285609
0.900000 -0.191332 0.119846 0.673277 -0.474244 0.481435 -0.422166
0.933333 -0.206741 0.135655 0.665005 -0.499187 0.511570 -0.540290
0.966667 -0.223434 0.152911 0.620002 -0.524531 0.542048 -0.631611
1.000000 -0.241389 0.171582 0.564258 -0.550052 0.572626 -0.684193
1.033333 -0.260606 0.191644 0.522945 -0.575529 0.603087 -0.696516
1.066667 -0.280292 0.212401 0.499783 -0.600849 0.633303 -0.669398
1.100000 -0.301223 0.234459 0.460756 -0.625852 0.663115 -0.609466
1.133333 -0.322622 0.257215 0.438941 -0.650282 0.692296 -0.526384
1.166667 -0.345209 0.281181 0.417856 -0.674021 0.720754 -0.430602
1.200000 -0.368259 0.305843 0.396175 -0.697109 0.748537 -0.337946
1.233333 -0.391767 0.331200 0.398825 -0.719612 0.775727 -0.260004
1.266667 -0.416331 0.357669 0.423608 -0.741462 0.802316 -0.207121
1.300000 -0.441345 0.384828 0.413693 -0.762647 0.828347 -0.181758
1.333333 -0.466805 0.412676 0.445989 -0.783229 0.853919 -0.186478
1.366667 -0.493272 0.441559 0.447028 -0.803273 0.879126 -0.219467
1.400000 -0.520664 0.471453 0.449412 -0.822704 0.903950 -0.277611
1.433333 -0.548936 0.502330 0.423591 -0.841405 0.928335 -0.350046
1.466667 -0.577630 0.533879 0.402445 -0.859399 0.952326 -0.426878
1.500000 -0.606737 0.566097 0.374677 -0.876683 0.975942 -0.505010
1.533333 -0.636554 0.599224 0.366703 -0.893202 0.999159 -0.575226
1.566667 -0.666769 0.633008 0.330128 -0.908935 1.021970 -0.632918
1.600000 -0.697374 0.667443 0.306506 -0.923949 1.044425 -0.672376
1.633333 -0.728362 0.702522 0.283566 -0.938375 1.066609 -0.697008
1.666667 -0.759981 0.738488 0.253390 -0.952278 1.088564 -0.708627
1.700000 -0.791965 0.775085 0.227763 -0.965726 1.110335 -0.707106
1.733333 -0.824490 0.812517 0.206869 -0.978817 1.131985 -0.694458
1.766667 -0.857508 0.850777 0.190634 -0.991590 1.153527 -0.672337
1.800000 -0.890863 0.889644 0.165835 -1.004034 1.174940 -0.641240
1.833333 -0.924543 0.929110 0.135995 -1.016092 1.196161 -0.597697
1.866667 -0.958715 0.969398 0.112991 -1.027721 1.217132 -0.543087
1.900000 -0.993193 1.010267 0.085065 -1.038884 1.237809 -0.476477
1.933333 -1.028110 1.051928 0.069701 -1.049547 1.258151 -0.398688
1.966667 -1.063432 1.094345 0.064271 -1.059691 1.278138 -0.312846
2.000000 -1.099135 1.137506 0.053412 -1.069303 1.297748 -0.220543
2.033333 -1.135100 1.181207 0.038216 -1.078380 1.316974 -0.129606
2.066667 -1.171356 1.225589 0.025555 -1.086920 1.335816 -0.040255
2.100000 -1.207850 1.270486 0.033459 -1.094914 1.354246 0.040331
2.133333 -1.244555 1.315999 0.042486 -1.102362 1.372254 0.106958
2.166667 -1.281475 1.362004 0.079703 -1.109272 1.389869 0.156991
2.200000 -1.318647 1.408666 0.082450 -1.115667 1.407119 0.183897
2.233333 -1.356066 1.455969 0.088652 -1.121559 1.424044 0.187036
2.266667 -1.393682 1.503886 0.094935 -1.126963 1.440663 0.162940
2.300000 -1.431464 1.552243 0.091621 -1.131894 1.457038 0.118253
2.333333 -1.469397 1.601201 0.121055 -1.136353 1.473184 0.055520
2.366667 -1.507472 1.650571 0.128536 -1.140331 1.489080 -0.019592
2.400000 -1.545628 1.700503 0.145420 -1.143816 1.504744 -0.099377
2.433333 -1.583901 1.750817 0.124990 -1.146827 1.520209 -0.176263
2.466667 -1.622282 1.801778 0.106768 -1.149377 1.535514 -0.245593
2.500000 -1.660750 1.853380 0.092445 -1.151496 1.550652 -0.309985
2.533333 -1.699298 1.905318 0.063570 -1.153216 1.565663 -0.364132
2.566667 -1.737838 1.957897 0.040370 -1.154578 1.580525 -0.403944
2.600000 -1.776433 2.010779 0.038396 -1.155625 1.595176 -0.431391
2.633333 -1.815013 2.064281 0.023995 -1.156375 1.609460 -0.450852
2.666667 -1.853624 2.118053 0.007827 -1.156848 1.623258 -0.463949
2.700000 -1.892217 2.172411 -0.021871 -1.157043 1.636455 -0.464946
2.733333 -1.930754 2.227335 -0.016054 -1.156966 1.648898 -0.459358
2.766667 -1.969379 2.282928 -0.027121 -1.156595 1.660518 -0.456327
2.800000 -2.007986 2.338718 -0.035483 -1.155911 1.671261 -0.455637
2.833333 -2.046627 2.395133 -0.075099 -1.154884 1.681129 -0.455119
2.866667 -2.085226 2.451707 -0.104217 -1.153467 1.690138 -0.454270
2.900000 -2.123769 2.508420 -0.101168 -1.151603 1.698340 -0.461708
2.933333 -2.162246 2.565251 -0.117288 -1.149225 1.705839 -0.473046
2.966667 -2.200644 2.622182 -0.136119 -1.146258 1.712734 -0.482476
3.000000 -2.238950 2.679192 -0.143768 -1.142629 1.719122 -0.488347
3.033333 -2.277088 2.736683 -0.144129 -1.138285 1.725113 -0.494262
3.066667 -2.315111 2.794212 -0.159385 -1.133211 1.730740 -0.500272
3.100000 -2.352982 2.852258 -0.190461 -1.127391 1.735951 -0.500298
3.133333 -2.390714 2.910302 -0.213479 -1.120763 1.740680 -0.497359
3.166667 -2.428297 2.968321 -0.245284 -1.113266 1.744814 -0.492366
3.200000 -2.465500 3.026750 -0.261176 -1.104797 1.748204 -0.487341
3.233333 -2.502271 3.085514 -0.277593 -1.095259 1.750699 -0.475703
3.266667 -2.538859 3.144190 -0.282964 -1.084538 1.752186 -0.459758
3.300000 -2.574853 3.203064 -0.298363 -1.072617 1.752614 -0.440181
3.333333 -2.610644 3.261804 -0.301364 -1.059584 1.751907 -0.416511
3.366667 -2.646222 3.320388 -0.324918 -1.045607 1.750008 -0.390260
3.400000 -2.681577 3.378794 -0.322834 -1.030879 1.746910 -0.360325
3.433333 -2.716159 3.437191 -0.349262 -1.015600 1.742624 -0.331153
3.466667 -2.749886 3.495507 -0.365907 -1.000021 1.737150 -0.299411
3.500000 -2.782689 3.553626 -0.381790 -0.984343 1.730509 -0.266738
3.533333 -2.814496 3.611457 -0.397988 -0.968717 1.722689 -0.232154
3.566667 -2.846040 3.668997 -0.389635 -0.953238 1.713684 -0.197100
3.600000 -2.877314 3.726225 -0.401221 -0.938082 1.703509 -0.162713
3.633333 -2.908314 3.783118 -0.395938 -0.923311 1.692125 -0.130931
3.666667 -2.939033 3.839655 -0.391439 -0.908843 1.679468 -0.106126
3.700000 -2.969466 3.895813 -0.404723 -0.894471 1.665400 -0.088258
3.733333 -2.998856 3.951213 -0.394648 -0.880006 1.649849 -0.081140
3.766667 -3.027951 4.006192 -0.401708 -0.865221 1.632685 -0.081533
3.800000 -3.056745 4.060729 -0.408142 -0.849790 1.613682 -0.088024
3.833333 -3.085235 4.114804 -0.406956 -0.833524 1.592705 -0.097683
3.866667 -3.112722 4.167813 -0.402785 -0.816430 1.569761 -0.106170
3.900000 -3.139898 4.220319 -0.407098 -0.798656 1.544968 -0.113977
3.933333 -3.166759 4.272304 -0.416028 -0.780309 1.518454 -0.114881
3.966667 -3.192757 4.323142 -0.420062 -0.761615 1.490525 -0.109553
4.000000 -3.217917 4.372782 -0.441373 -0.742916 1.461667 -0.097253
4.033333 -3.242258 4.421181 -0.440722 -0.724531 1.432308 -0.077491
4.066667 -3.265802 4.468285 -0.443164 -0.706660 1.402782 -0.048617
4.100000 -3.288577 4.514043 -0.446961 -0.689479 1.373370 -0.009048
4.133333 -3.310603 4.558415 -0.439124 -0.673205 1.344320 0.035462
4.166667 -3.332310 4.602154 -0.440768 -0.657916 1.315665 0.084560
4.200000 -3.353701 4.645247 -0.446359 -0.643554 1.287209 0.136164
4.233333 -3.374777 4.687683 -0.445772 -0.630016 1.258774 0.189271
4.266667 -3.395539 4.729449 -0.425418 -0.617166 1.230059 0.238095
4.300000 -3.415991 4.770534 -0.418332 -0.604826 1.200765 0.280019
4.333333 -3.436133 4.810927 -0.404860 -0.592780 1.170594 0.315595
4.366667 -3.455737 4.849840 -0.394677 -0.580900 1.139472 0.343191
4.400000 -3.475038 4.888040 -0.371034 -0.569105 1.107441 0.358568
4.433333 -3.493819 4.924754 -0.359973 -0.557344 1.074545 0.359064
4.466667 -3.512109 4.959991 -0.350093 -0.545642 1.041062 0.346781
4.500000 -3.529966 4.993819 -0.337006 -0.534056 1.007322 0.321819
4.533333 -3.547403 5.026236 -0.312274 -0.522663 0.973670 0.284054
4.566667 -3.564552 5.057906 -0.301827 -0.511470 0.940218 0.233716
4.600000 -3.581277 5.088159 -0.288985 -0.500505 0.907136 0.175683
4.633333 -3.597723 5.117657 -0.288490 -0.489768 0.874523 0.114313
4.666667 -3.613894 5.146396 -0.293580 -0.479202 0.842252 0.050070
4.700000 -3.629795 5.174375 -0.284638 -0.468718 0.810039 -0.016792
4.733333 -3.645257 5.200962 -0.285999 -0.458241 0.777582 -0.081575
4.766667 -3.660289 5.226166 -0.296708 -0.447769 0.744749 -0.141525
4.800000 -3.675064 5.250605 -0.302705 -0.437305 0.711292 -0.195440
4.833333 -3.689588 5.274280 -0.316472 -0.426922 0.677031 -0.241585
4.866667 -3.703720 5.296649 -0.332370 -0.416746 0.641981 -0.273432
4.900000 -3.717428 5.317707 -0.336386 -0.407002 0.606307 -0.280089
4.933333 -3.730737 5.337451 -0.345343 -0.397962 0.570159 -0.259335
4.966667 -3.743622 5.355890 -0.345944 -0.389926 0.533611 -0.207284
5.000000 -3.756127 5.373029 -0.369721 -0.383243 0.496817 -0.116943
5.033333 -3.768290 5.388852 -0.404830 -0.378275 0.459954 0.014405
5.066667 -3.780216 5.403402 -0.412519 -0.375352 0.423113 0.183931
5.100000 -3.792035 5.416708 -0.417875 -0.374747 0.386329 0.381930
5.133333 -3.803867 5.428797 -0.428040 -0.376579 0.349707 0.602167
5.166667 -3.815885 5.439671 -0.401398 -0.380782 0.313429 0.832702
5.200000 -3.827715 5.449838 -0.360470 -0.387228 0.277626 1.057199
5.233333 -3.839977 5.458714 -0.295024 -0.395674 0.242435 1.254689
5.266667 -3.852796 5.466233 -0.249345 -0.405906 0.207992 1.412084
5.300000 -3.866275 5.472373 -0.178166 -0.417593 0.174505 1.519795
5.333333 -3.880503 5.477156 -0.104546 -0.430505 0.142154 1.568260
5.366667 -3.895583 5.480593 -0.025155 -0.444530 0.111093 1.555414
5.400000 -3.910497 5.483399 0.065561 -0.459492 0.081556 1.482316
5.433333 -3.926464 5.484932 0.126721 -0.475117 0.053766 1.361709
5.466667 -3.942264 5.485866 0.157332 -0.491105 0.027952 1.200991
5.500000 -3.957898 5.486217 0.178900 -0.507240 0.004275 1.010535
5.533333 -3.974589 5.485605 0.222757 -0.523209 -0.017160 0.804648
5.566667 -3.992259 5.484154 0.225182 -0.538599 -0.036260 0.600086
5.600000 -4.010792 5.482006 0.253763 -0.552877 -0.052937 0.407530
5.633333 -4.030055 5.479288 0.273447 -0.565628 -0.067102 0.235851
5.666667 -4.049927 5.476144 0.259261 -0.576296 -0.078656 0.093095
5.700000 -4.070320 5.472692 0.231929 -0.584188 -0.087492 -0.012547
5.733333 -4.091111 5.469083 0.243825 -0.588756 -0.093534 -0.078881
5.766667 -4.111696 5.465035 0.217339 -0.589669 -0.096819 -0.107197
5.800000 -4.132324 5.461126 0.204138 -0.586878 -0.097579 -0.094324
5.833333 -4.152795 5.457467 0.180672 -0.580381 -0.096148 -0.041280
5.866667 -4.173037 5.453423 0.179829 -0.570455 -0.092956 0.045622
5.900000 -4.192782 5.449808 0.174957 -0.557562 -0.088520 0.153835
5.933333 -4.211800 5.446705 0.171129 -0.542204 -0.083345 0.277231
5.966667 -4.229923 5.444180 0.185000 -0.524824 -0.077925 0.402970
6.000000 -4.247047 5.442233 0.196836 -0.505747 -0.072611 0.521466
6.033333 -4.263014 5.440893 0.229240 -0.485405 -0.067726 0.619900
6.066667 -4.278711 5.439256 0.265847 -0.464036 -0.063491 0.694531
6.100000 -4.294134 5.437333 0.316021 -0.441933 -0.060031 0.743726
6.133333 -4.309278 5.435138 0.354882 -0.419214 -0.057322 0.764422
6.166667 -4.322820 5.433433 0.395212 -0.395958 -0.055224 0.758555
6.200000 -4.336077 5.431478 0.414465 -0.372254 -0.053542 0.724428
6.233333 -4.347672 5.429896 0.423545 -0.348194 -0.052046 0.670532
6.266667 -4.358978 5.428087 0.440293 -0.323996 -0.050573 0.602396
6.300000 -4.369992 5.426062 0.460699 -0.299768 -0.048950 0.528517
6.333333 -4.379605 5.424297 0.494054 -0.275831 -0.047154 0.451516
6.366667 -4.388001 5.422781 0.506018 -0.252497 -0.045201 0.377289
6.400000 -4.395352 5.421481 0.511911 -0.230171 -0.043208 0.312332
6.433333 -4.402415 5.420004 0.510649 -0.209020 -0.041211 0.256109
6.466667 -4.408634 5.418714 0.529202 -0.189195 -0.039222 0.207125
6.500000 -4.414089 5.417576 0.529168 -0.170921 -0.037312 0.163952
6.533333 -4.418853 5.416597 0.519038 -0.154251 -0.035515 0.130827
6.566667 -4.423345 5.415473 0.525337 -0.139153 -0.033825 0.106433
6.600000 -4.427567 5.414211 0.526902 -0.125445 -0.032187 0.088593
6.633333 -4.431309 5.413106 0.532454 -0.113085 -0.030658 0.074905
6.666667 -4.434632 5.412147 0.536059 -0.101963 -0.029277 0.065912
6.700000 -4.437700 5.411070 0.531525 -0.091880 -0.028026 0.060119
6.733333 -4.440439 5.410134 0.535083 -0.082665 -0.026860 0.053607
6.766667 -4.442885 5.409325 0.542258 -0.074228 -0.025789 0.045471
6.800000 -4.445078 5.408632 0.543226 -0.066532 -0.024852 0.035061
6.833333 -4.447054 5.408045 0.547786 -0.059503 -0.024040 0.024693
6.866667 -4.448803 5.407371 0.549292 -0.053059 -0.023338 0.015785
6.900000 -4.450332 5.406614 0.547174 -0.047150 -0.022762 0.006397
6.933333 -4.451646 5.405779 0.547311 -0.041726 -0.022336 -0.003744
6.966667 -4.452751 5.404872 0.543709 -0.036724 -0.022045 -0.012788
7.000000 -4.453792 5.404076 0.533845 -0.032088 -0.021849 -0.018194
