t x y theta dxdt dydt dthetadt
0.000000 0.000000 0.000000 0.329135 -0.150877 0.014053 -0.000902
0.033333 -0.005045 0.000368 0.329894 -0.153817 0.013684 -0.001251
0.066667 -0.009799 0.001079 0.330669 -0.156737 0.013436 -0.003103
0.100000 -0.014652 0.001758 0.321919 -0.159644 0.013258 -0.004313
0.133333 -0.020538 0.002041 0.331609 -0.162486 0.013148 -0.002683
0.166667 -0.026523 0.002289 0.329804 -0.165182 0.013099 -0.001862
0.200000 -0.032606 0.002501 0.334373 -0.167732 0.013073 -0.001281
0.233333 -0.037959 0.003049 0.331921 -0.170128 0.013076 -0.000920
0.266667 -0.043411 0.003557 0.328588 -0.172272 0.013165 -0.001107
0.300000 -0.049122 0.004043 0.330730 -0.174241 0.013327 -0.001837
0.333333 -0.054932 0.004486 0.330816 -0.176106 0.013554 -0.003324
0.366667 -0.060841 0.004882 0.327462 -0.177951 0.013840 -0.004631
0.400000 -0.067169 0.005221 0.335236 -0.179834 0.014179 -0.006232
0.433333 -0.072686 0.005893 0.325698 -0.181877 0.014506 -0.006727
0.466667 -0.078918 0.006339 0.326444 -0.184199 0.014757 -0.005148
0.500000 -0.085248 0.006730 0.331385 -0.186637 0.015002 -0.003796
0.533333 -0.091676 0.007065 0.333304 -0.189123 0.015253 -0.002971
0.566667 -0.097446 0.007882 0.326228 -0.191636 0.015489 -0.001913
0.600000 -0.103313 0.008638 0.320534 -0.194211 0.015690 0.000778
0.633333 -0.110589 0.008869 0.332750 -0.196654 0.015953 0.001747
0.666667 -0.117241 0.009482 0.329875 -0.198949 0.016273 0.001735
0.700000 -0.123989 0.010027 0.329521 -0.201209 0.016563 0.002335
0.733333 -0.130833 0.010501 0.327895 -0.203470 0.016789 0.003400
0.766667 -0.137771 0.010903 0.330020 -0.205699 0.016977 0.004016
0.800000 -0.144708 0.011447 0.330644 -0.207798 0.017163 0.002845
0.833333 -0.151546 0.012175 0.328942 -0.209953 0.017256 0.003159
0.866667 -0.158477 0.012822 0.330245 -0.212173 0.017287 0.003174
0.900000 -0.165350 0.013558 0.331574 -0.214451 0.017320 0.002384
0.933333 -0.172315 0.014209 0.326518 -0.216807 0.017381 0.001821
0.966667 -0.179684 0.014804 0.326414 -0.219232 0.017471 0.002161
1.000000 -0.187143 0.015308 0.334550 -0.221781 0.017571 0.003346
1.033333 -0.194691 0.015716 0.329977 -0.224314 0.017763 0.004371
1.066667 -0.202152 0.016270 0.328284 -0.226747 0.018045 0.005683
1.100000 -0.210038 0.016647 0.333258 -0.228985 0.018419 0.007969
1.133333 -0.217499 0.017275 0.328521 -0.230959 0.018876 0.009397
1.166667 -0.225305 0.017928 0.329767 -0.232660 0.019398 0.009320
1.200000 -0.233282 0.018622 0.331797 -0.233989 0.020008 0.008313
1.233333 -0.241150 0.019524 0.325284 -0.235076 0.020589 0.006742
1.266667 -0.249098 0.020309 0.333066 -0.236008 0.021125 0.005111
1.300000 -0.257124 0.020973 0.338388 -0.236909 0.021554 0.002792
1.333333 -0.265225 0.021513 0.334463 -0.237819 0.021872 -0.000087
1.366667 -0.272910 0.022386 0.336037 -0.238834 0.022059 -0.002807
1.400000 -0.280668 0.023127 0.330152 -0.240154 0.022065 -0.003829
1.433333 -0.288592 0.023990 0.331923 -0.241680 0.021996 -0.005176
1.466667 -0.296585 0.024714 0.330925 -0.243375 0.021853 -0.006775
1.500000 -0.304645 0.025294 0.332419 -0.245184 0.021661 -0.008230
1.533333 -0.312178 0.026252 0.322591 -0.247139 0.021376 -0.007451
1.566667 -0.320929 0.026783 0.329807 -0.249075 0.021042 -0.005512
1.600000 -0.329467 0.027672 0.334528 -0.250784 0.020663 -0.005350
1.633333 -0.338063 0.028402 0.333762 -0.252254 0.020170 -0.004648
1.666667 -0.346716 0.028969 0.325992 -0.253451 0.019538 -0.003558
1.700000 -0.355422 0.029370 0.331279 -0.254341 0.018742 -0.002045
1.733333 -0.364021 0.030019 0.332203 -0.254789 0.017817 -0.002855
1.766667 -0.372410 0.030938 0.331013 -0.254913 0.016653 -0.004142
1.800000 -0.380844 0.031678 0.328957 -0.254844 0.015178 -0.003892
1.833333 -0.389320 0.032236 0.326217 -0.254630 0.013318 -0.003467
1.866667 -0.397836 0.032607 0.330059 -0.254320 0.011001 -0.002966
1.900000 -0.406389 0.032789 0.331562 -0.253961 0.008157 -0.003362
1.933333 -0.414542 0.033288 0.326503 -0.253693 0.004679 -0.001982
1.966667 -0.423054 0.033678 0.333910 -0.253379 0.000501 -0.000940
2.000000 -0.431593 0.033866 0.325239 -0.252866 -0.004448 -0.000378
2.033333 -0.440155 0.033850 0.328587 -0.251867 -0.010421 0.000875
2.066667 -0.448533 0.033727 0.327731 -0.255396 -0.022936 0.001841
2.100000 -0.456927 0.033108 0.333552 -0.270796 -0.050016 0.002746
2.133333 -0.465334 0.032275 0.329300 -0.305325 -0.099607 0.002656
2.166667 -0.473749 0.031225 0.329528 -0.376435 -0.188688 -0.003070
2.200000 -0.482169 0.029957 0.331434 -0.492551 -0.325781 -0.015628
2.233333 -0.490591 0.028469 0.321617 -0.657749 -0.514327 -0.036291
2.266667 -0.499008 0.026758 0.331404 -0.862774 -0.744265 -0.061850
2.300000 -0.506066 0.023592 0.333180 -1.093786 -1.000380 -0.091689
2.333333 -0.513112 0.020204 0.328179 -1.336966 -1.267470 -0.127712
2.366667 -0.518200 0.014265 0.343364 -1.558697 -1.511820 -0.158934
2.400000 -0.586650 -0.054984 0.327782 -1.738092 -1.711314 -0.183477
2.433333 -0.683051 -0.154775 0.315623 -1.860676 -1.850303 -0.199892
2.466667 -0.779302 -0.254641 0.331641 -1.922433 -1.923946 -0.212531
2.500000 -0.994221 -0.464992 0.257889 -1.911595 -1.920964 -0.214313
2.533333 -1.100806 -0.574112 0.254992 -1.825416 -1.838482 -0.203122
2.566667 -1.151226 -0.627114 0.250594 -1.675432 -1.687944 -0.182489
2.600000 -1.168831 -0.644733 0.271378 -1.477484 -1.485874 -0.156636
2.633333 -1.185960 -0.661965 0.255912 -1.248297 -1.250333 -0.126405
2.666667 -1.202600 -0.678795 0.253748 -1.002433 -0.997231 -0.088085
2.700000 -1.218742 -0.695208 0.258429 -0.774393 -0.760811 -0.054518
2.733333 -1.234372 -0.711191 0.252107 -0.580721 -0.558650 -0.026827
2.766667 -1.244540 -0.720296 0.256336 -0.429128 -0.399351 -0.009053
2.800000 -1.250909 -0.724746 0.256846 -0.316899 -0.280735 0.004125
2.833333 -1.256746 -0.728741 0.251567 -0.238558 -0.197596 0.010816
2.866667 -1.261727 -0.731186 0.259474 -0.188422 -0.144363 0.010476
2.900000 -1.266170 -0.733172 0.265670 -0.150882 -0.106231 0.008279
2.933333 -1.270071 -0.734699 0.259098 -0.119289 -0.076703 0.004790
2.966667 -1.273428 -0.735767 0.260911 -0.090991 -0.052819 0.003545
3.000000 -1.275879 -0.736783 0.261242 -0.065514 -0.033794 0.002249
3.033333 -1.277782 -0.737341 0.266019 -0.042341 -0.018684 0.002705
3.066667 -1.279133 -0.737440 0.264990 -0.020873 -0.006391 0.002875
3.100000 -1.278853 -0.737286 0.252409 -0.000596 0.004203 0.004847
3.133333 -1.278020 -0.736673 0.252825 0.019002 0.014217 0.007933
3.166667 -1.276856 -0.736535 0.242993 0.038129 0.024294 0.011854
3.200000 -1.275140 -0.735940 0.264889 0.056781 0.034660 0.014832
3.233333 -1.272872 -0.734890 0.264889 0.074934 0.045462 0.017283
3.266667 -1.270043 -0.733380 0.264889 0.092534 0.056754 0.020203
3.300000 -1.266652 -0.731410 0.264889 0.109708 0.068554 0.020978
3.333333 -1.262702 -0.728984 0.264889 0.126582 0.080879 0.020125
3.366667 -1.258194 -0.726102 0.264889 0.145099 0.095323 0.016192
3.400000 -1.253131 -0.722766 0.264889 0.167167 0.113509 0.011378
3.433333 -1.247515 -0.718980 0.264889 0.198560 0.140605 0.005414
3.466667 -1.241348 -0.714746 0.264889 0.245044 0.181770 0.001576
3.500000 -1.234635 -0.710068 0.264889 0.303696 0.234112 -0.000512
3.533333 -1.227378 -0.704948 0.264889 0.366262 0.289821 -0.001759
3.566667 -1.219582 -0.699391 0.264889 0.425754 0.342325 -0.002245
3.600000 -1.211249 -0.693401 0.264889 0.478639 0.388536 -0.001101
3.633333 -1.202385 -0.686982 0.264889 0.517391 0.422119 0.001147
3.666667 -1.192993 -0.680138 0.263700 0.534498 0.436746 -0.001588
3.700000 -1.160821 -0.652106 0.267726 0.546020 0.448342 -0.005947
3.733333 -1.128164 -0.623681 0.250678 0.578666 0.482644 -0.003089
3.766667 -1.048618 -0.552308 0.252222 0.640686 0.548118 0.007554
3.800000 -0.968672 -0.480626 0.290503 0.730032 0.642793 0.021487
3.833333 -0.991427 -0.505392 0.273406 0.847630 0.766426 0.041020
3.866667 -1.077667 -0.588771 0.260544 0.999707 0.923656 0.069957
3.900000 -1.103948 -0.616341 0.257797 1.166155 1.094179 0.106363
3.933333 -1.088357 -0.601728 0.256022 1.318087 1.249284 0.135298
3.966667 -1.027473 -0.540682 0.252818 1.448167 1.379957 0.157510
4.000000 -0.966185 -0.479330 0.255118 1.559273 1.487572 0.179058
4.033333 -0.805687 -0.323571 0.265273 1.636432 1.557506 0.196116
4.066667 -0.644956 -0.167693 0.329788 1.654054 1.565256 0.201002
4.100000 -0.562245 -0.086132 0.328607 1.609408 1.507889 0.192786
4.133333 -0.519929 -0.045969 0.326473 1.510015 1.392882 0.179258
4.166667 -0.501483 -0.031959 0.329129 1.363414 1.229028 0.158931
4.200000 -0.482981 -0.018112 0.330620 1.173798 1.021728 0.129335
4.233333 -0.464433 -0.004438 0.333989 0.968803 0.798470 0.092317
4.266667 -0.445849 0.009053 0.328947 0.781398 0.591873 0.060621
4.300000 -0.432579 0.015435 0.331994 0.626962 0.418191 0.035478
4.333333 -0.419288 0.021619 0.327973 0.510787 0.283403 0.016226
4.366667 -0.408060 0.024823 0.334895 0.430168 0.184960 0.002904
4.400000 -0.396849 0.026615 0.332458 0.382375 0.120378 -0.004187
4.433333 -0.385562 0.027726 0.326220 0.356250 0.079099 -0.004141
4.466667 -0.375074 0.027929 0.329476 0.340719 0.050538 -0.003853
4.500000 -0.364586 0.027940 0.329505 0.330360 0.029112 -0.003543
4.533333 -0.354098 0.027763 0.329132 0.323049 0.012623 -0.003848
4.566667 -0.343669 0.027439 0.328446 0.318240 0.000534 -0.002382
4.600000 -0.333247 0.026935 0.328074 0.315381 -0.007902 -0.000749
4.633333 -0.323094 0.026233 0.329668 0.313947 -0.013508 -0.000574
4.666667 -0.312953 0.025362 0.331744 0.313207 -0.017298 -0.000694
4.700000 -0.302498 0.024637 0.327624 0.312830 -0.019748 -0.000472
4.733333 -0.292061 0.023752 0.331402 0.312519 -0.021345 -0.000310
4.766667 -0.281643 0.022710 0.331164 0.312204 -0.022338 -0.001869
4.800000 -0.270848 0.022017 0.327952 0.311809 -0.022890 -0.003264
4.833333 -0.260238 0.021283 0.327502 0.311227 -0.023135 -0.004052
4.866667 -0.249710 0.020605 0.326307 0.310428 -0.023151 -0.004096
4.900000 -0.239415 0.019960 0.334764 0.309484 -0.022988 -0.005273
4.933333 -0.229151 0.019182 0.329463 0.308412 -0.022730 -0.005060
4.966667 -0.218919 0.018275 0.327609 0.307206 -0.022423 -0.003848
5.000000 -0.208778 0.017449 0.326019 0.305875 -0.022111 -0.002694
5.033333 -0.198933 0.016603 0.330055 0.304521 -0.021758 -0.001307
5.066667 -0.188825 0.015943 0.321247 0.303307 -0.021266 0.000752
5.100000 -0.178757 0.015171 0.330432 0.302313 -0.020526 0.004684
5.133333 -0.168385 0.014673 0.333755 0.301614 -0.019435 0.007710
5.166667 -0.158056 0.014072 0.325723 0.301307 -0.017942 0.010816
5.200000 -0.148194 0.013431 0.325305 0.301771 -0.015728 0.013290
5.233333 -0.138376 0.012695 0.328034 0.303201 -0.012603 0.015738
5.266667 -0.128603 0.011868 0.328654 0.306286 -0.007937 0.016330
5.300000 -0.119004 0.011262 0.331824 0.312703 -0.000294 0.016521
5.333333 -0.109451 0.010573 0.335532 0.320537 0.008416 0.016655
5.366667 -0.099017 0.010627 0.331358 0.328748 0.017091 0.015040
5.400000 -0.088288 0.011178 0.333026 0.336115 0.024499 0.012879
5.433333 -0.077609 0.011656 0.337021 0.341769 0.029750 0.009342
5.466667 -0.066983 0.012064 0.331418 0.343911 0.031120 0.006480
5.500000 -0.056409 0.012404 0.335854 0.338803 0.025244 0.000977
5.533333 -0.042746 0.015677 0.330924 0.329716 0.015297 -0.004529
5.566667 -0.029142 0.018885 0.332122 0.318158 0.002942 -0.009013
5.600000 -0.009177 0.028002 0.330943 0.304594 -0.011123 -0.012073
5.633333 0.022236 0.047226 0.346907 0.288021 -0.027605 -0.013124
5.666667 0.009805 0.025480 0.330992 0.271353 -0.043580 -0.014511
5.700000 0.008890 0.013876 0.326419 0.257506 -0.056106 -0.012996
5.733333 0.013146 0.007342 0.328196 0.245871 -0.065520 -0.011075
5.766667 0.020396 0.004127 0.327392 0.236442 -0.071763 -0.008075
5.800000 0.029189 0.002527 0.332305 0.230583 -0.073536 -0.005804
5.833333 0.037923 0.000898 0.327743 0.231832 -0.067571 -0.004057
5.866667 0.046599 -0.000756 0.324154 0.236559 -0.057283 -0.000481
5.900000 0.055386 -0.001847 0.324367 0.243053 -0.044535 0.002448
5.933333 0.064174 -0.002432 0.332748 0.250139 -0.030739 0.005859
5.966667 0.072903 -0.003031 0.347673 0.257454 -0.016327 0.006767
6.000000 0.081573 -0.003642 0.326450 0.264294 -0.002086 0.008017
6.033333 0.090178 -0.003700 0.329928 0.269497 0.011000 0.007952
6.066667 0.099123 -0.003105 0.324075 0.275514 0.025296 0.006302
6.100000 0.108009 -0.002515 0.329754 0.285335 0.044075 0.004216
6.133333 0.117303 -0.000872 0.332008 0.304237 0.072954 0.000694
6.166667 0.126538 0.000768 0.332621 0.341860 0.121438 0.002549
6.200000 0.135713 0.002405 0.336116 0.407735 0.198968 0.010169
6.233333 0.144828 0.004040 0.331746 0.510370 0.313660 0.024083
6.266667 0.153882 0.005673 0.337056 0.651353 0.466779 0.042989
6.300000 0.166351 0.011812 0.330126 0.823975 0.650555 0.068130
6.333333 0.178755 0.017945 0.328145 1.016138 0.851881 0.100972
6.366667 0.197092 0.032419 0.323136 1.205108 1.047451 0.134917
6.400000 0.215353 0.046870 0.333531 1.368161 1.213960 0.162276
6.433333 0.251255 0.080638 0.335766 1.481617 1.327165 0.185071
6.466667 0.319713 0.146970 0.327517 1.523273 1.364529 0.203730
6.500000 0.450476 0.272365 0.359684 1.477856 1.311716 0.206956
6.533333 0.580986 0.397531 0.408986 1.338989 1.162841 0.190028
6.566667 0.711158 0.522353 0.388816 1.109958 0.921760 0.156637
6.600000 0.757405 0.563591 0.403898 0.801067 0.599340 0.112493
6.633333 0.743078 0.540108 0.409595 0.431951 0.216547 0.055560
6.666667 0.728342 0.516133 0.407273 0.040222 -0.188244 -0.014619
6.700000 0.713213 0.491691 0.408041 -0.330866 -0.571816 -0.079388
6.733333 0.697708 0.466805 0.398537 -0.650385 -0.902436 -0.130106
6.766667 0.681844 0.441500 0.401936 -0.894720 -1.155772 -0.170752
6.800000 0.548929 0.302732 0.402122 -1.044506 -1.311992 -0.199922
6.833333 0.415795 0.163687 0.327402 -1.094426 -1.366318 -0.210642
6.866667 0.356367 0.093313 0.329888 -1.057833 -1.331940 -0.202661
6.900000 0.337481 0.062817 0.334013 -0.957772 -1.231649 -0.184230
6.933333 0.318525 0.032287 0.331992 -0.811058 -1.082425 -0.160462
6.966667 0.315232 0.019025 0.331408 -0.632462 -0.899408 -0.129293
7.000000 0.311894 0.005775 0.330676 -0.449268 -0.709688 -0.091692
7.033333 0.314818 0.000670 0.328943 -0.282918 -0.534394 -0.060262
7.066667 0.317709 -0.004401 0.329815 -0.142530 -0.383172 -0.034306
7.100000 0.320571 -0.009433 0.328282 -0.029236 -0.257865 -0.014628
7.133333 0.323408 -0.014419 0.331023 0.056835 -0.159478 -0.000961
7.166667 0.327911 -0.016602 0.326257 0.118052 -0.086340 0.007640
7.200000 0.332395 -0.018731 0.326511 0.166529 -0.027334 0.010851
7.233333 0.337004 -0.019583 0.333484 0.210292 0.025105 0.013621
7.266667 0.342979 -0.018713 0.337703 0.251100 0.072676 0.014817
7.300000 0.348943 -0.017784 0.327708 0.285952 0.112552 0.015362
7.333333 0.354897 -0.016796 0.337570 0.310699 0.140920 0.014449
7.366667 0.364784 -0.011929 0.330783 0.320504 0.153291 0.012013
7.400000 0.374661 -0.007006 0.333976 0.310896 0.145549 0.008040
7.433333 0.392880 0.005805 0.330993 0.285779 0.121611 0.004096
7.466667 0.425644 0.031754 0.339036 0.248082 0.084592 0.002261
7.500000 0.458368 0.057725 0.331708 0.201441 0.038277 0.000512
7.533333 0.491036 0.083692 0.346721 0.148383 -0.014561 -0.001012
7.566667 0.468243 0.056705 0.333027 0.095297 -0.067479 -0.001395
7.600000 0.445408 0.029712 0.330502 0.047863 -0.114751 -0.002446
7.633333 0.422553 0.002736 0.325844 0.008522 -0.153862 -0.002478
7.666667 0.413657 -0.011534 0.330395 -0.019097 -0.181294 -0.004400
7.700000 0.412696 -0.018430 0.327103 -0.032039 -0.194148 -0.005246
7.733333 0.415976 -0.020944 0.349065 -0.026543 -0.188842 -0.004590
7.766667 0.419276 -0.023384 0.328590 -0.007834 -0.170483 -0.004268
7.800000 0.422599 -0.025748 0.345766 0.019210 -0.143829 -0.004412
7.833333 0.425949 -0.028032 0.326313 0.049010 -0.114300 -0.005400
7.866667 0.429328 -0.030234 0.327055 0.077006 -0.086362 -0.005186
7.900000 0.433259 -0.031579 0.333910 0.099863 -0.063364 -0.005459
7.933333 0.437225 -0.032836 0.332453 0.115038 -0.047923 -0.005699
7.966667 0.441229 -0.034002 0.333724 0.124617 -0.038151 -0.006420
8.000000 0.445788 -0.034813 0.328369 0.130642 -0.032176 -0.004231
8.033333 0.450390 -0.035528 0.331095 0.135163 -0.028123 -0.002680
8.066667 0.455038 -0.036146 0.334944 0.139081 -0.025161 -0.002011
8.100000 0.459963 -0.036806 0.330010 0.142821 -0.022846 -0.002206
8.133333 0.464938 -0.037365 0.328993 0.146286 -0.021116 -0.001794
8.166667 0.469964 -0.037821 0.334348 0.149397 -0.019916 -0.000854
8.200000 0.474998 -0.038376 0.330704 0.152165 -0.019133 -0.001223
8.233333 0.479397 -0.039302 0.341435 0.154606 -0.018672 -0.001209
8.266667 0.484879 -0.040002 0.324275 0.156772 -0.018390 0.000061
8.300000 0.490419 -0.040590 0.329909 0.158625 -0.018335 0.002065
8.333333 0.496019 -0.041066 0.327800 0.160209 -0.018547 0.002514
8.366667 0.501682 -0.041426 0.331625 0.161570 -0.019064 0.002629
8.400000 0.507015 -0.042238 0.333675 0.162544 -0.020135 0.003717
8.433333 0.512413 -0.042931 0.330710 0.162959 -0.021968 0.005159
8.466667 0.517878 -0.043500 0.334036 0.162311 -0.025137 0.005532
8.500000 0.523409 -0.043944 0.331637 0.159692 -0.030596 0.006477
8.533333 0.529010 -0.044261 0.330624 0.154194 -0.039295 0.007792
8.566667 0.534034 -0.045185 0.339058 0.143278 -0.053642 0.009304
8.600000 0.539877 -0.046184 0.333167 0.124669 -0.075691 0.006049
8.633333 0.545412 -0.047846 0.332589 0.100880 -0.102922 0.002478
8.666667 0.551021 -0.049368 0.327412 0.075102 -0.132081 -0.001112
8.700000 0.556705 -0.050746 0.326002 0.051388 -0.158932 -0.006613
8.733333 0.560162 -0.054413 0.345762 0.032639 -0.180273 -0.012702
8.766667 0.563697 -0.057926 0.329668 0.024268 -0.190801 -0.018076
8.800000 0.563136 -0.065816 0.340264 0.031996 -0.185038 -0.018023
8.833333 0.557285 -0.079810 0.343160 0.052420 -0.166176 -0.018843
8.866667 0.551533 -0.093620 0.329253 0.080854 -0.138680 -0.019749
8.900000 0.525621 -0.125462 0.332880 0.113847 -0.106029 -0.019806
8.933333 0.499843 -0.157075 0.300222 0.150256 -0.069644 -0.017450
8.966667 0.531187 -0.134139 0.329076 0.187250 -0.032326 -0.016422
9.000000 0.562660 -0.110952 0.330761 0.219986 0.001258 -0.015624
9.033333 0.594245 -0.087532 0.323433 0.246997 0.029465 -0.011522
9.066667 0.609773 -0.078702 0.336346 0.269755 0.053339 -0.007436
9.100000 0.616392 -0.079415 0.331526 0.286925 0.071485 -0.002388
9.133333 0.623103 -0.079920 0.327406 0.296022 0.081483 0.000328
9.166667 0.629906 -0.080211 0.326689 0.296811 0.083040 0.004686
9.200000 0.625673 -0.090871 0.328704 0.292750 0.079227 0.007392
9.233333 0.621540 -0.101303 0.326406 0.288547 0.074475 0.006928
9.266667 0.617516 -0.111495 0.311719 0.285363 0.070086 0.009132
9.300000 0.652031 -0.085638 0.323032 0.280981 0.064035 0.010732
9.333333 0.671511 -0.073070 0.335234 0.272755 0.054023 0.011014
9.366667 0.685025 -0.066572 0.333648 0.253724 0.034270 0.009609
9.400000 0.695373 -0.063618 0.331700 0.214312 -0.003266 0.002259
9.433333 0.703634 -0.063045 0.332696 0.162852 -0.049309 -0.004903
9.466667 0.711969 -0.062245 0.331836 0.109703 -0.092844 -0.016522
9.500000 0.719201 -0.063023 0.332443 0.075226 -0.112949 -0.027880
9.533333 0.725201 -0.065430 0.330682 0.080732 -0.088027 -0.032864
9.566667 0.728783 -0.070262 0.325269 0.153544 0.008048 -0.029167
9.600000 0.726810 -0.079704 0.334997 0.315265 0.195555 -0.007207
9.633333 0.716209 -0.097019 0.324593 0.548642 0.456919 0.023149
9.666667 0.685441 -0.130821 0.316780 0.835723 0.773396 0.063299
9.700000 0.613123 -0.197597 0.330962 1.154901 1.121312 0.109093
9.733333 0.540988 -0.264007 0.259837 1.483123 1.475406 0.159777
9.766667 0.682782 -0.123998 0.322477 1.776140 1.790549 0.202338
9.800000 0.824677 0.016339 0.329543 2.001899 2.033722 0.231353
9.833333 0.984385 0.179005 0.337521 2.150121 2.193076 0.251493
9.866667 1.143983 0.341722 0.365835 2.210946 2.258223 0.261306
9.900000 1.303360 0.504339 0.418324 2.169188 2.215181 0.258813
9.933333 1.385426 0.591260 0.408432 2.017793 2.058386 0.235348
9.966667 1.427132 0.636312 0.406056 1.788907 1.820360 0.204352
10.000000 1.446005 0.655914 0.406446 1.510654 1.529916 0.169963
10.033333 1.464483 0.675110 0.407277 1.211544 1.216820 0.132467
10.066667 1.473140 0.682180 0.407277 0.920787 0.911207 0.093963
10.100000 1.481379 0.688816 0.413802 0.671209 0.646336 0.060885
10.133333 1.489210 0.695021 0.385723 0.481952 0.442036 0.040810
10.166667 1.496629 0.700790 0.404164 0.347704 0.294062 0.028281
10.200000 1.503636 0.706119 0.423544 0.259311 0.193981 0.020098
10.233333 1.509910 0.709457 0.418199 0.206130 0.131596 0.014344
10.266667 1.515294 0.711440 0.416491 0.175800 0.094689 0.012741
10.300000 1.519871 0.712581 0.405287 0.155745 0.070724 0.012946
10.333333 1.524034 0.713280 0.404640 0.139923 0.053386 0.010572
10.366667 1.527783 0.713537 0.421832 0.125649 0.039865 0.008634
10.400000 1.532112 0.714031 0.420922 0.112338 0.029445 0.007277
10.433333 1.537262 0.715250 0.402352 0.099251 0.021055 0.010051
10.466667 1.540647 0.716055 0.410440 0.086548 0.014498 0.009580
10.500000 1.543621 0.716423 0.401849 0.074318 0.009634 0.008112
10.533333 1.545419 0.716876 0.415913 0.062725 0.006218 0.006017
10.566667 1.546810 0.716894 0.409810 0.051816 0.003912 0.004101
10.600000 1.547798 0.716476 0.435878 0.041365 0.002219 0.000366
10.633333 1.548387 0.715625 0.404209 0.031450 0.001076 -0.006809
10.666667 1.547837 0.714707 0.415071 0.022028 0.000473 -0.010199
10.700000 1.547602 0.714320 0.423202 0.013243 0.000295 -0.015099
10.733333 1.549213 0.715402 0.414448 0.004830 0.000430 -0.016818
10.766667 1.550440 0.716053 0.420575 -0.003417 0.000707 -0.021467
10.800000 1.551287 0.716274 0.396643 -0.011602 0.001057 -0.020857
10.833333 1.550451 0.716390 0.399162 -0.019842 0.001152 -0.019698
10.866667 1.549243 0.716075 0.404553 -0.028400 0.000663 -0.019755
10.900000 1.547655 0.716154 0.416995 -0.037587 -0.000644 -0.017691
10.933333 1.545708 0.715800 0.408745 -0.047336 -0.002916 -0.016667
10.966667 1.544286 0.716408 0.407753 -0.057654 -0.006348 -0.011421
11.000000 1.542516 0.716582 0.413515 -0.068818 -0.011419 -0.009649
11.033333 1.540403 0.716322 0.400799 -0.081679 -0.019027 -0.007087
11.066667 1.537514 0.716125 0.419446 -0.096720 -0.030013 -0.004349
11.100000 1.534297 0.715492 0.398430 -0.115567 -0.046415 0.000130
11.133333 1.530759 0.714422 0.411965 -0.139805 -0.070170 0.002677
11.166667 1.528406 0.714100 0.394599 -0.170988 -0.103076 0.005330
11.200000 1.524142 0.712595 0.400656 -0.209992 -0.146286 0.006287
11.233333 1.518883 0.710377 0.400327 -0.257035 -0.200064 0.007762
11.266667 1.511744 0.706459 0.417612 -0.318890 -0.270687 0.038470
11.300000 1.504327 0.702106 0.406952 -0.401455 -0.363701 0.093380
11.333333 1.493392 0.693887 0.429590 -0.510477 -0.484448 0.142977
11.366667 1.480055 0.680523 0.397620 -0.644565 -0.631271 0.181375
11.400000 1.466483 0.666743 0.415320 -0.802854 -0.802894 0.215153
11.433333 1.438262 0.636950 0.408391 -0.983550 -0.997160 0.241636
11.466667 1.409853 0.606777 0.401519 -1.172104 -1.199840 0.203778
11.500000 1.381282 0.576252 0.416407 -1.352236 -1.394115 0.104200
11.533333 1.352576 0.545402 0.397140 -1.504214 -1.559839 0.013907
11.566667 1.323763 0.514255 0.404744 -1.622332 -1.690780 -0.065466
11.600000 1.217047 0.409034 0.764052 -1.695028 -1.775145 -0.167639
11.633333 1.092496 0.282114 0.733965 -1.712283 -1.802624 -0.290731
11.666667 0.968069 0.155131 0.336085 -1.670474 -1.769007 -0.372744
11.700000 0.924956 0.106232 0.307641 -1.575476 -1.680334 -0.409437
11.733333 0.882080 0.057438 0.336771 -1.443199 -1.552415 -0.444787
11.766667 0.839479 0.008797 0.332862 -1.282639 -1.394202 -0.477537
11.800000 0.797192 -0.039649 0.326439 -1.114306 -1.225737 -0.448213
11.833333 0.754728 -0.084344 0.319822 -0.953800 -1.063409 -0.356538
11.866667 0.760675 -0.081852 0.332009 -0.828682 -0.934736 -0.271901
11.900000 0.767007 -0.079076 0.334002 -0.750413 -0.851281 -0.206335
11.933333 0.764878 -0.083471 0.336881 -0.708289 -0.803538 -0.143295
11.966667 0.755337 -0.095451 0.327466 -0.702561 -0.791649 -0.088797
12.000000 0.746216 -0.107137 0.332427 -0.714284 -0.797602 -0.066493
12.033333 0.721949 -0.134297 0.331299 -0.733135 -0.810189 -0.079247
12.066667 0.670949 -0.187360 0.316128 -0.728488 -0.799265 -0.089757
12.100000 0.620463 -0.240053 0.312561 -0.677184 -0.742072 -0.084873
12.133333 0.570536 -0.292327 0.295535 -0.585553 -0.643572 -0.077435
12.166667 0.585264 -0.284961 0.330563 -0.445280 -0.496344 -0.059601
12.200000 0.504975 -0.363822 0.315318 -0.268484 -0.312586 -0.039284
12.233333 0.425362 -0.442154 0.249051 -0.066325 -0.104345 -0.012459
12.266667 0.500765 -0.374363 0.330410 0.132475 0.099712 0.011195
12.300000 0.437323 -0.430065 0.255104 0.314459 0.284797 0.035800
12.333333 0.535651 -0.334086 0.311462 0.463310 0.433441 0.053661
12.366667 0.634643 -0.237586 0.338584 0.566312 0.532406 0.063305
12.400000 0.663377 -0.206892 0.313335 0.619047 0.577012 0.069237
12.433333 0.700072 -0.170443 0.303720 0.618275 0.564239 0.064083
12.466667 0.737358 -0.133637 0.333890 0.582870 0.512039 0.060338
12.500000 0.751963 -0.120610 0.330893 0.505454 0.415157 0.043216
12.533333 0.748766 -0.126666 0.334083 0.413150 0.300884 0.029148
12.566667 0.724576 -0.154330 0.330976 0.325059 0.188933 0.019673
12.600000 0.701018 -0.181659 0.303467 0.248559 0.087717 0.004967
12.633333 0.736398 -0.155436 0.333789 0.191873 0.006103 -0.009127
12.666667 0.735804 -0.163106 0.313717 0.156828 -0.053144 -0.021414
12.700000 0.735867 -0.170428 0.312994 0.149560 -0.084205 -0.031955
12.733333 0.758317 -0.157928 0.327284 0.154842 -0.101581 -0.048923
12.766667 0.743732 -0.180056 0.327258 0.162085 -0.115560 -0.069077
12.800000 0.729842 -0.201816 0.299704 0.174734 -0.123330 -0.076691
12.833333 0.766364 -0.177146 0.336569 0.193959 -0.124203 -0.080018
12.866667 0.803583 -0.152098 0.336904 0.207995 -0.129506 -0.083379
12.900000 0.810893 -0.156496 0.334568 0.213712 -0.142235 -0.081571
12.933333 0.786207 -0.192069 0.249839 0.221736 -0.152365 -0.059766
12.966667 0.762257 -0.227249 0.306275 0.235659 -0.156363 -0.037663
13.000000 0.780209 -0.223784 0.293982 0.251171 -0.157923 -0.022394
13.033333 0.798925 -0.219885 0.266617 0.272465 -0.152800 0.000647
13.066667 0.818408 -0.215551 0.253534 0.307356 -0.133484 0.027103
13.100000 0.838659 -0.210781 0.321810 0.363617 -0.092778 0.056765
13.133333 0.870154 -0.197096 0.328964 0.426327 -0.044703 0.062257
13.166667 0.853342 -0.228397 0.309469 0.487792 0.003413 0.069226
13.200000 0.837642 -0.258434 0.331188 0.548024 0.051246 0.072362
13.233333 0.822771 -0.287981 0.298188 0.607411 0.098927 0.064100
13.266667 0.879266 -0.250708 0.339462 0.666095 0.146399 0.046531
13.300000 0.936582 -0.212933 0.295377 0.715813 0.186115 0.026905
13.333333 0.994697 -0.174686 0.324116 0.764164 0.225337 0.021791
13.366667 1.016412 -0.170380 0.333199 0.813667 0.266622 0.016229
13.400000 1.005291 -0.197235 0.302807 0.866265 0.312108 0.019191
13.433333 1.055794 -0.167607 0.333905 0.913282 0.354133 0.025374
13.466667 1.073562 -0.168312 0.291924 0.962259 0.400288 0.039944
13.500000 1.092133 -0.168561 0.310835 1.027444 0.464095 0.054864
13.533333 1.111512 -0.168350 0.316212 1.118452 0.554575 0.072231
13.566667 1.160626 -0.139534 0.321663 1.240359 0.676434 0.095787
13.600000 1.210534 -0.110266 0.332052 1.392589 0.829017 0.118324
13.633333 1.251381 -0.088155 0.331259 1.579498 1.015340 0.146271
13.666667 1.292053 -0.064414 0.334556 1.783092 1.216900 0.173480
13.700000 1.333491 -0.040273 0.341458 1.983261 1.413049 0.193065
13.733333 1.375686 -0.015749 0.344996 2.162043 1.585264 0.198074
13.766667 1.447036 0.038246 0.352948 2.307048 1.720170 0.194121
13.800000 1.572747 0.143821 0.328456 2.404240 1.802791 0.186722
13.833333 1.699097 0.249640 0.374714 2.442642 1.822211 0.169932
13.866667 1.812680 0.343484 0.403498 2.423530 1.780004 0.145123
13.900000 1.926780 0.437399 0.411078 2.350801 1.680797 0.125988
13.933333 2.041339 0.531304 0.419167 2.227278 1.528257 0.115019
13.966667 2.112154 0.579994 0.410801 2.061693 1.332157 0.100608
14.000000 2.159377 0.602252 0.406176 1.873745 1.113048 0.078143
14.033333 2.191511 0.606414 0.341845 1.681530 0.889781 0.063069
14.066667 2.224028 0.610431 0.334202 1.499061 0.676901 0.056628
14.100000 2.256931 0.614308 0.415984 1.338880 0.487360 0.048802
14.133333 2.290222 0.618053 0.419154 1.213515 0.334089 0.039235
14.166667 2.323905 0.621672 0.402054 1.125861 0.220408 0.036047
14.200000 2.357981 0.625171 0.413974 1.070321 0.140941 0.039428
14.233333 2.392455 0.628557 0.416062 1.038734 0.087447 0.033137
14.266667 2.427328 0.631837 0.408296 1.023868 0.052679 0.019787
14.300000 2.461043 0.632474 0.406146 1.019111 0.029850 0.009693
14.333333 2.495165 0.633023 0.403812 1.017843 0.012156 0.004176
14.366667 2.529164 0.632446 0.405667 1.017317 -0.003455 -0.001902
14.400000 2.564244 0.631774 0.387135 1.016788 -0.017730 -0.003776
14.433333 2.597730 0.630005 0.408956 1.017065 -0.029734 0.003382
14.466667 2.631642 0.628193 0.387299 1.019426 -0.038285 0.013243
14.500000 2.664323 0.625631 0.406268 1.024529 -0.042834 0.018728
14.533333 2.697444 0.623055 0.397375 1.033481 -0.042210 0.021498
14.566667 2.730388 0.620262 0.400289 1.047210 -0.035467 0.022986
14.600000 2.763110 0.617563 0.418992 1.059762 -0.023232 0.017882
14.633333 2.798268 0.615959 0.426173 1.067549 -0.006502 0.006810
14.666667 2.833898 0.614396 0.405895 1.066280 0.013192 -0.004468
14.700000 2.870006 0.612888 0.412016 1.051639 0.034486 -0.014580
14.733333 2.907347 0.612796 0.406750 1.018310 0.054648 -0.026105
14.766667 2.945612 0.614641 0.421979 0.963742 0.070986 -0.036964
14.800000 2.987998 0.619737 0.388194 0.899122 0.083599 -0.043321
14.833333 3.030885 0.624931 0.400825 0.830174 0.092544 -0.044638
14.866667 3.079682 0.637725 0.400825 0.763003 0.098162 -0.044998
14.900000 3.128982 0.650624 0.393391 0.703931 0.100870 -0.044002
