t x y theta dxdt dydt dthetadt
0.000000 0.000000 0.000000 2.269578 0.081378 -0.080894 -0.019722
0.033333 0.002734 -0.002572 2.302523 0.084795 -0.076948 0.316190
0.066667 0.005588 -0.005114 2.331451 0.088346 -0.072805 0.648279
0.100000 0.008563 -0.007625 2.366313 0.092039 -0.068465 0.986454
0.133333 0.011658 -0.009883 2.376452 0.095892 -0.063945 1.337843
0.166667 0.014883 -0.011883 2.415448 0.099924 -0.059293 1.709679
0.200000 0.018236 -0.013855 2.477746 0.104148 -0.054565 2.099898
0.233333 0.021737 -0.015565 2.524339 0.108585 -0.049791 2.516771
0.266667 0.025370 -0.017248 2.602722 0.113247 -0.045042 2.960172
0.300000 0.029166 -0.018660 2.693586 0.118131 -0.040406 3.428540
0.333333 0.033133 -0.019799 2.819494 0.123214 -0.035970 3.912717
0.366667 0.037237 -0.020916 2.984297 0.128463 -0.031793 4.397913
0.400000 0.041525 -0.021761 -3.127539 0.133850 -0.027939 4.871812
0.433333 0.046043 -0.022492 -2.953902 0.139335 -0.024469 5.304104
0.466667 0.050796 -0.023111 -2.794867 0.144880 -0.021422 5.677841
0.500000 0.055784 -0.023620 -2.594474 0.150450 -0.018800 5.968921
0.533333 0.060918 -0.024118 -2.370508 0.156031 -0.016570 6.164739
0.566667 0.066284 -0.024512 -2.092419 0.161611 -0.014715 6.255141
0.600000 0.071797 -0.024900 -1.839215 0.167171 -0.013192 6.231914
0.633333 0.077459 -0.025285 -1.568856 0.172712 -0.011961 6.100008
0.666667 0.083271 -0.025668 -1.353527 0.178243 -0.010979 5.856348
0.700000 0.089233 -0.026053 -1.146071 0.183797 -0.010209 5.508276
0.733333 0.095412 -0.026373 -0.943151 0.189392 -0.009650 5.062320
0.766667 0.101809 -0.026638 -0.802097 0.195054 -0.009291 4.539585
0.800000 0.108426 -0.026861 -0.639238 0.200806 -0.009139 3.956107
0.833333 0.115196 -0.027097 -0.507841 0.206661 -0.009210 3.332360
0.866667 0.122195 -0.027322 -0.405182 0.212608 -0.009523 2.688841
0.900000 0.129348 -0.027566 -0.325042 0.218616 -0.010097 2.045508
0.933333 0.136657 -0.027834 -0.268917 0.224659 -0.010938 1.421661
0.966667 0.144207 -0.028139 -0.235830 0.230715 -0.012060 0.822203
1.000000 0.151999 -0.028499 -0.224560 0.236770 -0.013478 0.254745
1.033333 0.160035 -0.028928 -0.246490 0.242802 -0.015198 -0.279526
1.066667 0.168314 -0.029446 -0.297273 0.248805 -0.017231 -0.781204
1.100000 0.176749 -0.030003 -0.341505 0.254788 -0.019604 -1.255915
1.133333 0.185338 -0.030601 -0.411955 0.260746 -0.022329 -1.708919
1.166667 0.194159 -0.031342 -0.476813 0.266675 -0.025412 -2.146953
1.200000 0.203134 -0.032130 -0.540144 0.272570 -0.028851 -2.568135
1.233333 0.212263 -0.032968 -0.610281 0.278440 -0.032640 -2.971601
1.266667 0.221611 -0.033987 -0.708659 0.284286 -0.036745 -3.351934
1.300000 0.231175 -0.035192 -0.789352 0.290096 -0.041101 -3.700720
1.333333 0.240950 -0.036591 -0.956303 0.295862 -0.045651 -4.005124
1.366667 0.250935 -0.038189 -1.119199 0.301574 -0.050328 -4.247307
1.400000 0.261126 -0.039991 -1.305061 0.307206 -0.055040 -4.415649
1.433333 0.271519 -0.042000 -1.487951 0.312732 -0.059701 -4.495996
1.466667 0.282060 -0.044076 -1.676839 0.318134 -0.064254 -4.480262
1.500000 0.292796 -0.046363 -1.864804 0.323402 -0.068662 -4.359762
1.533333 0.303725 -0.048861 -2.028687 0.328527 -0.072880 -4.141450
1.566667 0.314798 -0.051430 -2.174147 0.333506 -0.076888 -3.837423
1.600000 0.326012 -0.054073 -2.311664 0.338356 -0.080711 -3.462100
1.633333 0.337366 -0.056790 -2.418440 0.343090 -0.084377 -3.037927
1.666667 0.348910 -0.059710 -2.513749 0.347718 -0.087900 -2.583122
1.700000 0.360591 -0.062707 -2.595001 0.352259 -0.091315 -2.123430
1.733333 0.372407 -0.065782 -2.664318 0.356735 -0.094676 -1.672750
1.766667 0.384412 -0.069051 -2.687039 0.361162 -0.098020 -1.243851
1.800000 0.396549 -0.072399 -2.722082 0.365543 -0.101360 -0.847952
1.833333 0.408814 -0.075829 -2.719348 0.369883 -0.104709 -0.488794
1.866667 0.421207 -0.079340 -2.704949 0.374187 -0.108087 -0.173776
1.900000 0.433724 -0.082934 -2.709183 0.378450 -0.111492 0.100530
1.933333 0.446420 -0.086699 -2.686079 0.382659 -0.114912 0.330292
1.966667 0.459236 -0.090548 -2.666545 0.386816 -0.118354 0.519302
2.000000 0.472223 -0.094560 -2.633656 0.390915 -0.121816 0.668426
2.033333 0.485374 -0.098731 -2.616356 0.394947 -0.125291 0.781700
2.066667 0.498639 -0.102987 -2.567538 0.398900 -0.128768 0.864845
2.100000 0.512015 -0.107329 -2.542679 0.402763 -0.132232 0.918070
2.133333 0.525540 -0.111819 -2.507652 0.406528 -0.135674 0.945060
2.166667 0.539170 -0.116395 -2.457355 0.410176 -0.139068 0.945557
2.200000 0.552904 -0.121058 -2.429217 0.413699 -0.142404 0.925154
2.233333 0.566772 -0.125859 -2.385883 0.417098 -0.145682 0.881451
2.266667 0.580769 -0.130795 -2.350789 0.420368 -0.148898 0.818140
2.300000 0.594888 -0.135865 -2.331813 0.423508 -0.152051 0.736250
2.333333 0.609099 -0.141020 -2.309005 0.426516 -0.155140 0.643961
2.366667 0.623400 -0.146262 -2.274469 0.429397 -0.158171 0.547039
2.400000 0.637786 -0.151591 -2.257729 0.432149 -0.161146 0.447414
2.433333 0.652255 -0.157005 -2.233745 0.434774 -0.164070 0.351340
2.466667 0.666821 -0.162542 -2.248679 0.437275 -0.166954 0.262204
2.500000 0.681463 -0.168164 -2.250167 0.439662 -0.169816 0.186319
2.533333 0.696180 -0.173871 -2.245154 0.441940 -0.172671 0.119955
2.566667 0.710968 -0.179662 -2.243690 0.444116 -0.175532 0.064309
2.600000 0.725823 -0.185538 -2.242201 0.446193 -0.178404 0.016734
2.633333 0.740753 -0.191529 -2.260193 0.448174 -0.181287 -0.018994
2.666667 0.755744 -0.197603 -2.251134 0.450058 -0.184180 -0.048347
2.700000 0.770801 -0.203790 -2.250426 0.451843 -0.187076 -0.075761
2.733333 0.785917 -0.210087 -2.246692 0.453526 -0.189963 -0.100125
2.766667 0.801086 -0.216466 -2.248643 0.455104 -0.192829 -0.124822
2.800000 0.816305 -0.222950 -2.258046 0.456575 -0.195667 -0.146231
2.833333 0.831575 -0.229541 -2.256851 0.457936 -0.198469 -0.172504
2.866667 0.846890 -0.236237 -2.274132 0.459185 -0.201225 -0.198862
2.900000 0.862243 -0.243009 -2.274165 0.460321 -0.203929 -0.224394
2.933333 0.877632 -0.249858 -2.307354 0.461343 -0.206580 -0.244912
2.966667 0.893054 -0.256782 -2.290001 0.462253 -0.209176 -0.260845
3.000000 0.908502 -0.263801 -2.301973 0.463049 -0.211720 -0.271392
3.033333 0.923974 -0.270914 -2.312142 0.463733 -0.214214 -0.272274
3.066667 0.939466 -0.278119 -2.325913 0.464305 -0.216663 -0.265289
3.100000 0.954976 -0.285395 -2.337636 0.464767 -0.219070 -0.246573
3.133333 0.970502 -0.292740 -2.359933 0.465118 -0.221434 -0.222112
3.166667 0.986035 -0.300171 -2.359933 0.465360 -0.223752 -0.189031
3.200000 1.001576 -0.307669 -2.367460 0.465493 -0.226022 -0.150823
3.233333 1.017119 -0.315250 -2.381010 0.465518 -0.228239 -0.109330
3.266667 1.032660 -0.322914 -2.376656 0.465436 -0.230399 -0.066682
3.300000 1.048200 -0.330639 -2.382480 0.465248 -0.232497 -0.027694
3.333333 1.063729 -0.338441 -2.375960 0.464954 -0.234531 0.006782
3.366667 1.079242 -0.346316 -2.372526 0.464553 -0.236498 0.033674
3.400000 1.094744 -0.354249 -2.367328 0.464044 -0.238395 0.053305
3.433333 1.110224 -0.362249 -2.348836 0.463427 -0.240222 0.064067
3.466667 1.125685 -0.370303 -2.350360 0.462699 -0.241979 0.066303
3.500000 1.141124 -0.378409 -2.352470 0.461858 -0.243666 0.060171
3.533333 1.156528 -0.386577 -2.352028 0.460905 -0.245284 0.048118
3.566667 1.171904 -0.394792 -2.359268 0.459839 -0.246834 0.032906
3.600000 1.187247 -0.403054 -2.352301 0.458660 -0.248320 0.016313
3.633333 1.202544 -0.411368 -2.341959 0.457373 -0.249742 0.002012
3.666667 1.217788 -0.419733 -2.341655 0.455981 -0.251098 -0.008367
3.700000 1.232991 -0.428139 -2.356121 0.454490 -0.252386 -0.011654
3.733333 1.248137 -0.436589 -2.349617 0.452903 -0.253607 -0.008880
3.766667 1.263220 -0.445082 -2.351397 0.451223 -0.254758 0.000200
3.800000 1.278252 -0.453610 -2.362546 0.449449 -0.255839 0.014010
3.833333 1.293212 -0.462175 -2.360641 0.447577 -0.256847 0.031657
3.866667 1.308114 -0.470771 -2.364044 0.445598 -0.257785 0.054319
3.900000 1.322956 -0.479396 -2.371821 0.443510 -0.258651 0.078289
3.933333 1.337734 -0.488046 -2.348894 0.441303 -0.259447 0.103082
3.966667 1.352445 -0.496720 -2.341322 0.438967 -0.260174 0.124454
4.000000 1.367086 -0.505417 -2.343312 0.436494 -0.260831 0.141286
4.033333 1.381630 -0.514137 -2.327881 0.433879 -0.261419 0.151164
4.066667 1.396097 -0.522875 -2.335210 0.431112 -0.261937 0.150242
4.100000 1.410456 -0.531631 -2.317260 0.428180 -0.262383 0.136675
4.133333 1.424703 -0.540402 -2.316673 0.425080 -0.262756 0.111961
4.166667 1.438833 -0.549185 -2.310749 0.421813 -0.263054 0.078078
4.200000 1.452874 -0.557977 -2.295008 0.418384 -0.263274 0.035302
4.233333 1.466826 -0.566775 -2.291469 0.414800 -0.263413 -0.012539
4.266667 1.480644 -0.575576 -2.298191 0.411076 -0.263471 -0.060376
4.300000 1.494323 -0.584378 -2.301539 0.407238 -0.263447 -0.100488
4.333333 1.507861 -0.593178 -2.309460 0.403306 -0.263341 -0.128686
4.366667 1.521255 -0.601974 -2.312171 0.399299 -0.263153 -0.143335
4.400000 1.534499 -0.610761 -2.325098 0.395238 -0.262884 -0.139950
4.433333 1.547592 -0.619537 -2.336522 0.391140 -0.262534 -0.119355
4.466667 1.560531 -0.628298 -2.363442 0.387013 -0.262100 -0.084431
4.500000 1.573359 -0.637046 -2.375349 0.382856 -0.261580 -0.037451
4.533333 1.586028 -0.645770 -2.379888 0.378670 -0.260974 0.013525
4.566667 1.598583 -0.654477 -2.370728 0.374450 -0.260279 0.068008
4.600000 1.611022 -0.663165 -2.346954 0.370184 -0.259494 0.119806
4.633333 1.623342 -0.671830 -2.327714 0.365864 -0.258619 0.164727
4.666667 1.635494 -0.680457 -2.310726 0.361492 -0.257658 0.198615
4.700000 1.647522 -0.689057 -2.318579 0.357069 -0.256614 0.216218
4.733333 1.659375 -0.697614 -2.312297 0.352597 -0.255490 0.222677
4.766667 1.671047 -0.706125 -2.304230 0.348093 -0.254293 0.215405
4.800000 1.682537 -0.714586 -2.299125 0.343571 -0.253029 0.196206
4.833333 1.693898 -0.723010 -2.263772 0.339043 -0.251698 0.166028
4.866667 1.705128 -0.731396 -2.287707 0.334508 -0.250298 0.132082
4.900000 1.716170 -0.739717 -2.276844 0.329972 -0.248829 0.094728
4.933333 1.727078 -0.747994 -2.268708 0.325434 -0.247290 0.051762
4.966667 1.737851 -0.756226 -2.266382 0.320883 -0.245675 0.006467
5.000000 1.748487 -0.764409 -2.265723 0.316307 -0.243980 -0.037755
5.033333 1.758986 -0.772542 -2.264673 0.311699 -0.242207 -0.076292
5.066667 1.769344 -0.780623 -2.260402 0.307058 -0.240354 -0.114383
5.100000 1.779562 -0.788648 -2.274821 0.302367 -0.238417 -0.144904
5.133333 1.789573 -0.796580 -2.298569 0.297619 -0.236391 -0.163530
5.166667 1.799374 -0.804416 -2.305139 0.292815 -0.234276 -0.170277
5.200000 1.809031 -0.812190 -2.307226 0.287950 -0.232068 -0.167128
5.233333 1.818542 -0.819899 -2.321521 0.283030 -0.229769 -0.154158
5.266667 1.827908 -0.827542 -2.324437 0.278053 -0.227375 -0.128484
5.300000 1.837127 -0.835115 -2.329398 0.273033 -0.224895 -0.096883
5.333333 1.846197 -0.842618 -2.329977 0.267976 -0.222331 -0.065217
5.366667 1.855052 -0.850004 -2.340520 0.262887 -0.219685 -0.033885
5.400000 1.863757 -0.857314 -2.339090 0.257770 -0.216962 -0.003786
5.433333 1.872249 -0.864503 -2.327243 0.252628 -0.214164 0.020460
5.466667 1.880589 -0.871612 -2.319185 0.247473 -0.211301 0.036488
5.500000 1.888720 -0.878598 -2.318024 0.242313 -0.208378 0.046612
5.533333 1.896698 -0.885499 -2.317541 0.237161 -0.205405 0.052852
5.566667 1.904524 -0.892314 -2.313997 0.232026 -0.202389 0.053818
5.600000 1.912151 -0.899006 -2.309837 0.226918 -0.199337 0.050039
5.633333 1.919624 -0.905607 -2.318454 0.221841 -0.196253 0.045260
5.666667 1.926944 -0.912116 -2.314698 0.216797 -0.193138 0.042321
5.700000 1.934077 -0.918506 -2.307279 0.211780 -0.189989 0.040909
5.733333 1.941056 -0.924800 -2.310260 0.206789 -0.186805 0.041700
5.766667 1.947853 -0.930977 -2.306588 0.201826 -0.183588 0.043210
5.800000 1.954496 -0.937054 -2.309914 0.196890 -0.180336 0.045520
5.833333 1.960964 -0.943015 -2.314560 0.191982 -0.177052 0.046716
5.866667 1.967279 -0.948871 -2.312979 0.187107 -0.173736 0.044783
5.900000 1.973426 -0.954612 -2.297916 0.182267 -0.170390 0.040604
5.933333 1.979409 -0.960240 -2.298802 0.177463 -0.167014 0.033547
5.966667 1.985230 -0.965755 -2.296660 0.172695 -0.163607 0.025181
6.000000 1.990897 -0.971157 -2.288681 0.167966 -0.160171 0.016868
6.033333 1.996410 -0.976446 -2.292974 0.163275 -0.156706 0.008862
6.066667 2.001767 -0.981619 -2.289984 0.158623 -0.153211 0.002213
6.100000 2.006974 -0.986680 -2.299024 0.154011 -0.149690 -0.002819
6.133333 2.012026 -0.991621 -2.307079 0.149441 -0.146142 -0.005483
6.166667 2.016924 -0.996441 -2.305009 0.144911 -0.142567 -0.004355
6.200000 2.021668 -1.001138 -2.307743 0.140419 -0.138964 -0.000539
6.233333 2.026258 -1.005708 -2.299736 0.135965 -0.135333 0.004554
6.266667 2.030695 -1.010152 -2.297349 0.131553 -0.131675 0.009991
6.300000 2.034997 -1.014486 -2.313307 0.127179 -0.127989 0.016884
6.333333 2.039168 -1.018710 -2.293427 0.122840 -0.124272 0.022247
6.366667 2.043186 -1.022802 -2.291964 0.118536 -0.120522 0.026089
6.400000 2.047052 -1.026759 -2.289259 0.114261 -0.116734 0.026298
6.433333 2.050793 -1.030605 -2.297555 0.110008 -0.112901 0.025880
6.466667 2.054383 -1.034313 -2.296038 0.105762 -0.109012 0.026402
6.500000 2.057820 -1.037881 -2.300368 0.101519 -0.105060 0.025809
6.533333 2.061141 -1.041337 -2.287809 0.097276 -0.101044 0.025882
6.566667 2.064309 -1.044649 -2.291946 0.093027 -0.096959 0.025560
6.600000 2.067364 -1.047849 -2.297006 0.088774 -0.092806 0.028526
6.633333 2.070268 -1.050902 -2.291074 0.084526 -0.088594 0.031257
6.666667 2.073021 -1.053805 -2.291160 0.080294 -0.084334 0.033127
6.700000 2.075623 -1.056556 -2.284293 0.076085 -0.080032 0.032994
6.733333 2.078076 -1.059153 -2.288233 0.071912 -0.075698 0.033211
6.766667 2.080378 -1.061595 -2.290511 0.067784 -0.071342 0.033917
6.800000 2.082530 -1.063880 -2.284793 0.063716 -0.066977 0.030590
6.833333 2.084579 -1.066048 -2.270752 0.059706 -0.062601 0.026183
6.866667 2.086479 -1.068055 -2.286331 0.055752 -0.058213 0.020557
6.900000 2.088231 -1.069899 -2.285978 0.051852 -0.053812 0.015168
6.933333 2.089883 -1.071623 -2.275440 0.048003 -0.049392 0.008395
6.966667 2.091438 -1.073227 -2.287590 0.044195 -0.044948 0.001189
7.000000 2.092845 -1.074662 -2.279341 0.040413 -0.040463 -0.003202
7.033333 2.094156 -1.075974 -2.271334 0.036647 -0.035930 -0.005502
7.066667 2.095318 -1.077114 -2.283352 0.032893 -0.031344 -0.007189
7.100000 2.096333 -1.078080 -2.280374 0.029146 -0.026701 -0.008139
7.133333 2.097255 -1.078918 -2.291085 0.025401 -0.021996 -0.007369
7.166667 2.098029 -1.079578 -2.283779 0.021660 -0.017233 -0.007889
7.200000 2.098656 -1.080058 -2.288573 0.017932 -0.012417 -0.008662
7.233333 2.099191 -1.080405 -2.286827 0.014229 -0.007561 -0.009778
7.266667 2.099634 -1.080617 -2.283773 0.010549 -0.002663 -0.010446
7.300000 2.099930 -1.080643 -2.278473 0.006886 0.002282 -0.010761
7.333333 2.100078 -1.080480 -2.279701 0.003238 0.007276 -0.012018
7.366667 2.100080 -1.080127 -2.275795 -0.000395 0.012318 -0.012743
7.400000 2.099990 -1.079632 -2.292292 -0.004016 0.017412 -0.013327
7.433333 2.099808 -1.078991 -2.286189 -0.007636 0.022565 -0.014474
7.466667 2.099535 -1.078204 -2.291988 -0.011250 0.027775 -0.014158
7.500000 2.099114 -1.077218 -2.291168 -0.014848 0.033033 -0.011555
7.533333 2.098547 -1.076032 -2.286027 -0.018427 0.038336 -0.007338
7.566667 2.097886 -1.074691 -2.286856 -0.021993 0.043689 0.000681
7.600000 2.097079 -1.073146 -2.294025 -0.025553 0.049098 0.007821
7.633333 2.096123 -1.071394 -2.285005 -0.029098 0.054557 0.015019
7.666667 2.095073 -1.069480 -2.284503 -0.032626 0.060063 0.020074
7.700000 2.093928 -1.067401 -2.293290 -0.036147 0.065626 0.022247
7.733333 2.092686 -1.065154 -2.285148 -0.039669 0.071251 0.022050
7.766667 2.091297 -1.062692 -2.288551 -0.043191 0.076939 0.018030
7.800000 2.089809 -1.060056 -2.285993 -0.046719 0.082695 0.014873
7.833333 2.088223 -1.057243 -2.270975 -0.050276 0.088536 0.011441
7.866667 2.086488 -1.054208 -2.275349 -0.053879 0.094477 0.008986
7.900000 2.084651 -1.050990 -2.268848 -0.057538 0.100524 0.004696
7.933333 2.082665 -1.047546 -2.292818 -0.061259 0.106683 0.001782
7.966667 2.080574 -1.043912 -2.289006 -0.065056 0.112962 -0.001019
8.000000 2.078379 -1.040083 -2.287988 -0.068934 0.119363 -0.002102
8.033333 2.076032 -1.036022 -2.280946 -0.072888 0.125881 -0.001449
8.066667 2.073577 -1.031760 -2.287425 -0.076924 0.132516 -0.000658
8.100000 2.070969 -1.027262 -2.280917 -0.081041 0.139267 0.002863
8.133333 2.068209 -1.022527 -2.280373 -0.085236 0.146131 0.005493
8.166667 2.065296 -1.017553 -2.279922 -0.089498 0.153101 0.008122
8.200000 2.062268 -1.012360 -2.276580 -0.093813 0.160169 0.005063
8.233333 2.059085 -1.006926 -2.286380 -0.098171 0.167331 0.000534
8.266667 2.055749 -1.001246 -2.291537 -0.102550 0.174577 -0.005037
8.300000 2.052257 -0.995321 -2.290386 -0.106937 0.181902 -0.010187
8.333333 2.048611 -0.989148 -2.257337 -0.111320 0.189303 -0.017081
8.366667 2.044809 -0.982725 -2.274011 -0.115694 0.196781 -0.024128
8.400000 2.040852 -0.976052 -2.284747 -0.120057 0.204335 -0.027503
8.433333 2.036764 -0.969131 -2.295560 -0.124407 0.211966 -0.031003
8.466667 2.032544 -0.961959 -2.286225 -0.128750 0.219675 -0.034746
8.500000 2.028190 -0.954530 -2.290335 -0.133097 0.227459 -0.039139
8.533333 2.023699 -0.946840 -2.289155 -0.137456 0.235312 -0.039164
8.566667 2.019052 -0.938892 -2.281191 -0.141837 0.243225 -0.037653
8.600000 2.014261 -0.930673 -2.297461 -0.146252 0.251190 -0.035358
8.633333 2.009327 -0.922179 -2.297091 -0.150709 0.259195 -0.032540
8.666667 2.004245 -0.913405 -2.291255 -0.155216 0.267234 -0.027318
8.700000 1.999012 -0.904346 -2.295287 -0.159774 0.275300 -0.020272
8.733333 1.993622 -0.895025 -2.296478 -0.164379 0.283388 -0.013612
8.766667 1.988074 -0.885439 -2.293621 -0.169029 0.291496 -0.005568
8.800000 1.982368 -0.875588 -2.303672 -0.173721 0.299630 0.003044
8.833333 1.976503 -0.865472 -2.296897 -0.178452 0.307797 0.012643
8.866667 1.970480 -0.855090 -2.298722 -0.183218 0.316008 0.020932
8.900000 1.964300 -0.844441 -2.294898 -0.188017 0.324275 0.025961
8.933333 1.957961 -0.833524 -2.298942 -0.192854 0.332621 0.029301
8.966667 1.951465 -0.822341 -2.292125 -0.197730 0.341065 0.030278
9.000000 1.944792 -0.810828 -2.291387 -0.202644 0.349611 0.029841
9.033333 1.937962 -0.799047 -2.279807 -0.207599 0.358267 0.027516
9.066667 1.930974 -0.786999 -2.286324 -0.212594 0.367033 0.026212
9.100000 1.923830 -0.774682 -2.283154 -0.217633 0.375915 0.025971
9.133333 1.916497 -0.762015 -2.288086 -0.222719 0.384909 0.025010
9.166667 1.909008 -0.749080 -2.277061 -0.227851 0.394009 0.021913
9.200000 1.901323 -0.735784 -2.297260 -0.233032 0.403219 0.016762
9.233333 1.893483 -0.722221 -2.296501 -0.238263 0.412535 0.009358
9.266667 1.885442 -0.708286 -2.289331 -0.243542 0.421953 -0.002369
9.300000 1.877248 -0.694086 -2.285842 -0.248866 0.431458 -0.016134
9.333333 1.868902 -0.679621 -2.275694 -0.254225 0.441034 -0.033699
9.366667 1.860343 -0.664770 -2.267769 -0.259617 0.450670 -0.051944
9.400000 1.851634 -0.649656 -2.271010 -0.265051 0.460379 -0.071799
9.433333 1.842706 -0.634143 -2.289080 -0.270520 0.470146 -0.089084
9.466667 1.833557 -0.618227 -2.287659 -0.276031 0.479976 -0.103356
9.500000 1.824262 -0.602053 -2.300606 -0.281578 0.489858 -0.112362
9.533333 1.814820 -0.585624 -2.306092 -0.287168 0.499801 -0.109996
9.566667 1.805150 -0.568782 -2.319308 -0.292805 0.509806 -0.093724
9.600000 1.795336 -0.551689 -2.312030 -0.298482 0.519854 -0.061789
9.633333 1.785289 -0.534180 -2.320556 -0.304202 0.529945 -0.016201
9.666667 1.775103 -0.516425 -2.330045 -0.309967 0.540082 0.045284
9.700000 1.764680 -0.498254 -2.329304 -0.315790 0.550283 0.119546
9.733333 1.754019 -0.479669 -2.323685 -0.321666 0.560532 0.201208
9.766667 1.743226 -0.460847 -2.315891 -0.327589 0.570819 0.284987
9.800000 1.732194 -0.441616 -2.312220 -0.333541 0.581115 0.367144
9.833333 1.721035 -0.422155 -2.300908 -0.339526 0.591424 0.442261
9.866667 1.709638 -0.402291 -2.278771 -0.345532 0.601719 0.505502
9.900000 1.698004 -0.382028 -2.251947 -0.351534 0.611960 0.554888
9.933333 1.686136 -0.361371 -2.220608 -0.357512 0.622120 0.587956
9.966667 1.674151 -0.340501 -2.187522 -0.363462 0.632184 0.600346
10.000000 1.661934 -0.319246 -2.165713 -0.369376 0.642140 0.592798
10.033333 1.649489 -0.297612 -2.141860 -0.375216 0.651929 0.567117
10.066667 1.636818 -0.275606 -2.125897 -0.380946 0.661496 0.523555
10.100000 1.624045 -0.253408 -2.094238 -0.386548 0.670815 0.462068
10.133333 1.611051 -0.230852 -2.096154 -0.391995 0.679849 0.393092
10.166667 1.597840 -0.207946 -2.092510 -0.397238 0.688533 0.330375
10.200000 1.584415 -0.184702 -2.068061 -0.402241 0.696815 0.280326
10.233333 1.570905 -0.161290 -2.043006 -0.406986 0.704673 0.251469
10.266667 1.557191 -0.137560 -2.048189 -0.411478 0.712109 0.252124
10.300000 1.543275 -0.113522 -2.059694 -0.415708 0.719106 0.290076
10.333333 1.529288 -0.089337 -2.064272 -0.419693 0.725674 0.354607
10.366667 1.515110 -0.064871 -2.075696 -0.423445 0.731833 0.435927
10.400000 1.500871 -0.040273 -2.083371 -0.427000 0.737622 0.527970
10.433333 1.486574 -0.015549 -2.078905 -0.430379 0.743068 0.621347
10.466667 1.472226 0.009292 -2.038983 -0.433595 0.748190 0.703310
10.500000 1.457708 0.034360 -1.983388 -0.436661 0.753014 0.760898
10.533333 1.443148 0.059529 -1.929229 -0.439584 0.757553 0.795469
10.566667 1.428432 0.084899 -1.864772 -0.442390 0.761836 0.801210
10.600000 1.413568 0.110456 -1.819700 -0.445067 0.765855 0.775130
10.633333 1.398563 0.136188 -1.790409 -0.447593 0.769593 0.718653
10.666667 1.383540 0.161990 -1.803396 -0.449945 0.773028 0.642204
10.700000 1.368505 0.187854 -1.783815 -0.452104 0.776145 0.555856
10.733333 1.353359 0.213850 -1.778469 -0.454036 0.778914 0.465965
10.766667 1.338115 0.239961 -1.772590 -0.455693 0.781300 0.385691
10.800000 1.322877 0.266109 -1.761498 -0.457057 0.783289 0.324055
10.833333 1.307563 0.292337 -1.752664 -0.458119 0.784880 0.282182
10.866667 1.292186 0.318627 -1.740847 -0.458868 0.786070 0.255142
10.900000 1.276755 0.344963 -1.736091 -0.459282 0.786839 0.241666
10.933333 1.261357 0.371303 -1.730580 -0.459355 0.787187 0.240383
10.966667 1.245933 0.397648 -1.720780 -0.459091 0.787122 0.246669
11.000000 1.230556 0.423978 -1.716570 -0.458481 0.786640 0.255115
11.033333 1.215231 0.450285 -1.710446 -0.457525 0.785740 0.270236
11.066667 1.199916 0.476541 -1.705099 -0.456230 0.784422 0.292383
11.100000 1.184667 0.502758 -1.691709 -0.454612 0.782689 0.320070
11.133333 1.169492 0.528926 -1.664495 -0.452683 0.780541 0.353916
11.166667 1.154370 0.554977 -1.682570 -0.450450 0.777961 0.387034
11.200000 1.139334 0.580963 -1.666676 -0.447920 0.774923 0.422389
11.233333 1.124376 0.606796 -1.657314 -0.445093 0.771416 0.451428
11.266667 1.109519 0.632546 -1.625903 -0.441971 0.767445 0.477920
11.300000 1.094770 0.658206 -1.596872 -0.438559 0.763027 0.499129
11.333333 1.080134 0.683766 -1.585764 -0.434853 0.758165 0.509467
11.366667 1.065629 0.709100 -1.559793 -0.430849 0.752871 0.518268
11.400000 1.051265 0.734193 -1.559269 -0.426545 0.747180 0.522113
11.433333 1.037061 0.759024 -1.541051 -0.421944 0.741113 0.531295
11.466667 1.022997 0.783725 -1.454596 -0.417033 0.734668 0.533443
11.500000 1.009121 0.808129 -1.524369 -0.411804 0.727844 0.541728
11.533333 0.995449 0.832220 -1.475218 -0.406262 0.720684 0.553729
11.566667 0.981938 0.856158 -1.501913 -0.400423 0.713239 0.569942
11.600000 0.968594 0.879937 -1.438958 -0.394300 0.705541 0.586205
11.633333 0.955424 0.903550 -1.437747 -0.387901 0.697604 0.596145
11.666667 0.942512 0.926797 -1.401090 -0.381248 0.689478 0.613176
11.700000 0.929871 0.949665 -1.385736 -0.374351 0.681182 0.615557
11.733333 0.917514 0.972145 -1.366629 -0.367202 0.672694 0.610774
11.766667 0.905356 0.994433 -1.316859 -0.359786 0.663982 0.587526
11.800000 0.893507 1.016314 -1.310950 -0.352102 0.655046 0.555777
11.833333 0.881867 1.037992 -1.283125 -0.344135 0.645878 0.512043
11.866667 0.870442 1.059462 -1.271172 -0.335873 0.636455 0.454040
11.900000 0.859238 1.080718 -1.261471 -0.327305 0.626755 0.395767
11.933333 0.848385 1.101542 -1.244530 -0.318440 0.616786 0.335219
11.966667 0.837762 1.122143 -1.220633 -0.309276 0.606542 0.284364
12.000000 0.827510 1.142303 -1.215665 -0.299820 0.596014 0.238096
12.033333 0.817635 1.162020 -1.238156 -0.290114 0.585249 0.206610
12.066667 0.808147 1.181285 -1.229192 -0.280193 0.574293 0.188594
12.100000 0.798909 1.200310 -1.231605 -0.270116 0.563224 0.182214
12.133333 0.790071 1.218876 -1.216746 -0.259916 0.552090 0.188406
12.166667 0.781636 1.236983 -1.216922 -0.249663 0.540987 0.203021
12.200000 0.773464 1.254839 -1.215185 -0.239391 0.529962 0.225794
12.233333 0.765705 1.272229 -1.210791 -0.229110 0.519028 0.247021
12.266667 0.758216 1.289361 -1.201014 -0.218820 0.508180 0.265354
12.300000 0.751149 1.306024 -1.174248 -0.208520 0.497414 0.278186
12.333333 0.744357 1.322425 -1.166633 -0.198220 0.486738 0.282252
12.366667 0.737845 1.338563 -1.145483 -0.187890 0.476111 0.275208
12.400000 0.731757 1.354233 -1.141003 -0.177548 0.465555 0.257705
12.433333 0.725955 1.369636 -1.138199 -0.167198 0.455072 0.234085
12.466667 0.720577 1.384577 -1.116291 -0.156879 0.444712 0.205710
12.500000 0.715489 1.399247 -1.108317 -0.146603 0.434489 0.176632
12.533333 0.710827 1.413464 -1.113436 -0.136396 0.424433 0.151520
12.566667 0.706459 1.427409 -1.110205 -0.126283 0.414584 0.136148
12.600000 0.702525 1.440913 -1.115347 -0.116265 0.404945 0.133896
12.633333 0.698889 1.454144 -1.104118 -0.106342 0.395528 0.144384
12.666667 0.695551 1.467102 -1.114442 -0.096470 0.386292 0.172046
12.700000 0.692515 1.479788 -1.107975 -0.086603 0.377205 0.214935
12.733333 0.689780 1.492201 -1.112034 -0.076660 0.368197 0.271923
12.766667 0.687348 1.504342 -1.103115 -0.066575 0.359210 0.338853
12.800000 0.685221 1.516210 -1.090203 -0.056255 0.350168 0.410605
12.833333 0.683399 1.527805 -1.069899 -0.045637 0.341013 0.481657
12.866667 0.681883 1.539128 -1.061918 -0.034688 0.331717 0.535246
12.900000 0.680822 1.550071 -1.026915 -0.023406 0.322271 0.555473
12.933333 0.680069 1.560742 -1.001709 -0.011810 0.312690 0.526265
12.966667 0.679770 1.571045 -0.981665 0.000054 0.303004 0.433086
13.000000 0.679926 1.580985 -0.941846 0.012105 0.293268 0.265764
13.033333 0.680537 1.590569 -0.918550 0.024268 0.283536 0.023423
13.066667 0.681602 1.599803 -0.891995 0.036482 0.273855 -0.287415
13.100000 0.683120 1.608693 -0.854733 0.048694 0.264263 -0.649554
13.133333 0.685089 1.617246 -0.834046 0.060837 0.254800 -1.045715
13.166667 0.687365 1.625537 -0.868465 0.072884 0.245487 -1.452576
13.200000 0.689944 1.633567 -0.952382 0.084829 0.236327 -1.846819
13.233333 0.692964 1.641277 -1.086812 0.096659 0.227324 -2.203278
13.266667 0.696419 1.648669 -1.206377 0.108363 0.218478 -2.497820
13.300000 0.700174 1.655808 -1.335841 0.119943 0.209786 -2.711479
13.333333 0.704351 1.662641 -1.432891 0.131406 0.201238 -2.833826
13.366667 0.708946 1.669176 -1.538360 0.142739 0.192835 -2.863791
13.400000 0.713948 1.675420 -1.667483 0.153905 0.184593 -2.804231
13.433333 0.719353 1.681378 -1.779571 0.164886 0.176520 -2.673750
13.466667 0.725153 1.687060 -1.871677 0.175665 0.168625 -2.488596
13.500000 0.731237 1.692503 -1.953596 0.186209 0.160924 -2.271285
13.533333 0.737700 1.697687 -2.039212 0.196496 0.153425 -2.028623
13.566667 0.744441 1.702638 -2.074471 0.206530 0.146134 -1.771189
13.600000 0.751545 1.707346 -2.123868 0.216318 0.139042 -1.510916
13.633333 0.759004 1.711819 -2.155030 0.225863 0.132146 -1.254021
13.666667 0.766730 1.716069 -2.207750 0.235171 0.125434 -1.005790
13.700000 0.774718 1.720099 -2.245855 0.244255 0.118899 -0.767398
13.733333 0.783038 1.723917 -2.275789 0.253125 0.112534 -0.549743
13.766667 0.791679 1.727529 -2.284033 0.261775 0.106338 -0.357143
13.800000 0.800634 1.730942 -2.275106 0.270206 0.100317 -0.186851
13.833333 0.809834 1.734149 -2.281245 0.278422 0.094471 -0.038183
13.866667 0.819329 1.737173 -2.247079 0.286421 0.088809 0.085506
13.900000 0.829062 1.739997 -2.227080 0.294197 0.083336 0.181118
13.933333 0.839028 1.742625 -2.219575 0.301746 0.078055 0.248953
13.966667 0.849258 1.745093 -2.216830 0.309071 0.072966 0.294745
14.000000 0.859711 1.747372 -2.201091 0.316174 0.068066 0.315940
14.033333 0.870409 1.749505 -2.200020 0.323052 0.063353 0.321121
14.066667 0.881345 1.751498 -2.165519 0.329707 0.058818 0.314941
14.100000 0.892504 1.753359 -2.182415 0.336141 0.054445 0.308747
14.133333 0.903876 1.755092 -2.125896 0.342350 0.050223 0.302205
14.166667 0.915446 1.756654 -2.159893 0.348330 0.046145 0.299147
14.200000 0.927211 1.758100 -2.130061 0.354069 0.042200 0.300025
14.233333 0.939162 1.759436 -2.144689 0.359563 0.038377 0.303202
14.266667 0.951295 1.760611 -2.124499 0.364808 0.034676 0.311643
14.300000 0.963595 1.761686 -2.125505 0.369807 0.031092 0.320026
14.333333 0.976050 1.762666 -2.102121 0.374571 0.027613 0.337199
14.366667 0.988673 1.763494 -2.087678 0.379111 0.024225 0.354305
14.400000 1.001457 1.764174 -2.074489 0.383435 0.020920 0.377447
14.433333 1.014369 1.764773 -2.063625 0.387555 0.017693 0.400873
14.466667 1.027397 1.765296 -2.050185 0.391475 0.014534 0.423273
14.500000 1.040534 1.765746 -2.037064 0.395197 0.011440 0.440499
14.533333 1.053769 1.766127 -2.034099 0.398714 0.008420 0.449210
14.566667 1.067140 1.766376 -2.013757 0.402026 0.005476 0.452372
14.600000 1.080642 1.766494 -1.996298 0.405135 0.002606 0.444182
14.633333 1.094268 1.766485 -1.971011 0.408029 -0.000181 0.428679
14.666667 1.108016 1.766351 -1.940299 0.410703 -0.002876 0.403958
14.700000 1.121815 1.766168 -1.934141 0.413152 -0.005470 0.375443
14.733333 1.135656 1.765939 -1.909111 0.415385 -0.007968 0.338262
14.766667 1.149603 1.765593 -1.910693 0.417406 -0.010365 0.296773
14.800000 1.163576 1.765207 -1.897123 0.419232 -0.012674 0.255250
14.833333 1.177644 1.764711 -1.908946 0.420893 -0.014914 0.214788
14.866667 1.191721 1.764180 -1.888356 0.422408 -0.017109 0.178024
14.900000 1.205883 1.763544 -1.896099 0.423792 -0.019273 0.145243
14.933333 1.220038 1.762878 -1.897733 0.425053 -0.021415 0.124861
14.966667 1.234177 1.762186 -1.883819 0.426205 -0.023550 0.112889
15.000000 1.248387 1.761395 -1.873009 0.427233 -0.025667 0.106323
15.033333 1.262663 1.760507 -1.877909 0.428123 -0.027758 0.105924
15.066667 1.277001 1.759524 -1.883453 0.428864 -0.029811 0.112698
15.100000 1.291396 1.758450 -1.880610 0.429454 -0.031823 0.124737
15.133333 1.305843 1.757284 -1.865771 0.429867 -0.033776 0.136417
15.166667 1.320228 1.756103 -1.874763 0.430073 -0.035647 0.150648
15.200000 1.334545 1.754906 -1.862467 0.430068 -0.037431 0.170808
15.233333 1.348901 1.753626 -1.863962 0.429845 -0.039124 0.193747
15.266667 1.363292 1.752263 -1.843368 0.429396 -0.040720 0.214421
15.300000 1.377715 1.750819 -1.840385 0.428714 -0.042214 0.235092
15.333333 1.392039 1.749369 -1.844005 0.427819 -0.043622 0.258710
15.366667 1.406260 1.747913 -1.822727 0.426729 -0.044958 0.281766
15.400000 1.420501 1.746382 -1.812899 0.425460 -0.046230 0.301476
15.433333 1.434757 1.744776 -1.809377 0.424027 -0.047447 0.317465
15.466667 1.448891 1.743170 -1.787009 0.422454 -0.048625 0.332594
15.500000 1.463033 1.741494 -1.787371 0.420770 -0.049779 0.344395
15.533333 1.477038 1.739820 -1.764655 0.418990 -0.050918 0.348926
15.566667 1.490900 1.738148 -1.754433 0.417119 -0.052046 0.350364
15.600000 1.504762 1.736409 -1.755327 0.415142 -0.053164 0.351534
15.633333 1.518620 1.734603 -1.730103 0.413046 -0.054268 0.354052
15.666667 1.532317 1.732799 -1.705470 0.410807 -0.055354 0.361787
15.700000 1.546005 1.730931 -1.698134 0.408389 -0.056408 0.376444
15.733333 1.559682 1.728998 -1.686417 0.405756 -0.057418 0.402649
15.766667 1.573183 1.727069 -1.690164 0.402891 -0.058373 0.438145
15.800000 1.586667 1.725077 -1.691801 0.399802 -0.059277 0.480566
15.833333 1.600134 1.723025 -1.677969 0.396518 -0.060134 0.530024
15.866667 1.613407 1.720972 -1.653586 0.393062 -0.060949 0.578441
15.900000 1.626483 1.718920 -1.629763 0.389494 -0.061739 0.619562
15.933333 1.639361 1.716867 -1.603386 0.385872 -0.062520 0.647201
15.966667 1.652039 1.714812 -1.585034 0.382256 -0.063310 0.658881
16.000000 1.664690 1.712699 -1.540480 0.378693 -0.064121 0.648526
16.033333 1.677145 1.710585 -1.506564 0.375219 -0.064962 0.613705
16.066667 1.689571 1.708412 -1.464228 0.371844 -0.065833 0.558361
16.100000 1.701808 1.706237 -1.453926 0.368574 -0.066733 0.490349
16.133333 1.714014 1.704003 -1.431302 0.365396 -0.067653 0.412949
16.166667 1.726189 1.701712 -1.422601 0.362291 -0.068588 0.328724
16.200000 1.738332 1.699362 -1.431305 0.359238 -0.069530 0.248315
16.233333 1.750309 1.697006 -1.443571 0.356212 -0.070470 0.178923
16.266667 1.762124 1.694642 -1.431869 0.353225 -0.071415 0.122267
16.300000 1.773785 1.692269 -1.428739 0.350269 -0.072362 0.076020
16.333333 1.785414 1.689837 -1.435840 0.347358 -0.073317 0.043030
16.366667 1.796900 1.687393 -1.434485 0.344516 -0.074290 0.024753
16.400000 1.808249 1.684935 -1.430937 0.341775 -0.075293 0.016072
16.433333 1.819567 1.682417 -1.425116 0.339156 -0.076333 0.009506
16.466667 1.830761 1.679883 -1.423122 0.336666 -0.077414 0.004882
16.500000 1.841924 1.677287 -1.428155 0.334315 -0.078538 0.002973
16.533333 1.853059 1.674629 -1.436724 0.332103 -0.079705 0.001258
16.566667 1.864088 1.671949 -1.422576 0.330019 -0.080910 -0.003707
16.600000 1.875020 1.669246 -1.434744 0.328046 -0.082149 -0.008980
16.633333 1.885860 1.666519 -1.432391 0.326187 -0.083427 -0.010973
16.666667 1.896674 1.663725 -1.431915 0.324437 -0.084747 -0.010777
16.700000 1.907463 1.660865 -1.425344 0.322802 -0.086117 -0.011424
16.733333 1.918181 1.657974 -1.431253 0.321293 -0.087550 -0.012562
16.766667 1.928835 1.655048 -1.429821 0.319919 -0.089059 -0.011649
16.800000 1.939430 1.652085 -1.438870 0.318686 -0.090649 -0.010375
16.833333 1.949975 1.649084 -1.431683 0.317593 -0.092326 -0.010889
16.866667 1.960501 1.646011 -1.434731 0.316641 -0.094095 -0.012829
16.900000 1.971010 1.642864 -1.437737 0.315827 -0.095960 -0.012839
16.933333 1.981504 1.639643 -1.433659 0.315147 -0.097915 -0.011968
16.966667 1.991973 1.636373 -1.423421 0.314598 -0.099956 -0.010994
17.000000 2.002429 1.633026 -1.434285 0.314177 -0.102077 -0.010751
17.033333 2.012874 1.629600 -1.438861 0.313883 -0.104269 -0.009448
17.066667 2.023309 1.626094 -1.437082 0.313718 -0.106522 -0.007475
17.100000 2.033736 1.622508 -1.444663 0.313685 -0.108824 -0.005122
17.133333 2.044172 1.618857 -1.432058 0.313788 -0.111173 -0.002777
17.166667 2.054603 1.615122 -1.430495 0.314032 -0.113564 0.000265
17.200000 2.065029 1.611302 -1.440841 0.314417 -0.115997 0.004227
17.233333 2.075453 1.607395 -1.438073 0.314948 -0.118473 0.007560
17.266667 2.085914 1.603412 -1.436743 0.315621 -0.120997 0.011880
17.300000 2.096420 1.599351 -1.436702 0.316431 -0.123574 0.012912
17.333333 2.106977 1.595208 -1.430522 0.317361 -0.126206 0.013528
17.366667 2.117537 1.590973 -1.432740 0.318394 -0.128898 0.013931
17.400000 2.128161 1.586650 -1.438881 0.319515 -0.131654 0.013101
17.433333 2.138789 1.582231 -1.427265 0.320705 -0.134478 0.011760
17.466667 2.149496 1.577718 -1.432485 0.321950 -0.137373 0.008270
17.500000 2.160286 1.573107 -1.433865 0.323244 -0.140340 0.007767
17.533333 2.171084 1.568396 -1.429070 0.324607 -0.143385 0.008969
17.566667 2.181891 1.563583 -1.434576 0.326060 -0.146510 0.012593
17.600000 2.192801 1.558660 -1.422396 0.327625 -0.149718 0.019625
17.633333 2.203721 1.553634 -1.441016 0.329336 -0.153014 0.034277
17.666667 2.214652 1.548500 -1.433281 0.331222 -0.156400 0.055526
17.700000 2.225704 1.543248 -1.428762 0.333292 -0.159874 0.082649
17.733333 2.236769 1.537886 -1.433896 0.335537 -0.163435 0.117142
17.766667 2.247846 1.532414 -1.432527 0.337948 -0.167080 0.156393
17.800000 2.259063 1.526811 -1.427780 0.340514 -0.170806 0.201426
17.833333 2.270428 1.521073 -1.424046 0.343202 -0.174607 0.245688
17.866667 2.281944 1.515197 -1.413697 0.345983 -0.178479 0.292180
17.900000 2.293617 1.509179 -1.394183 0.348851 -0.182421 0.338422
17.933333 2.305302 1.503044 -1.383311 0.351784 -0.186431 0.380429
17.966667 2.317150 1.496761 -1.363583 0.354737 -0.190499 0.418181
18.000000 2.329010 1.490359 -1.359069 0.357676 -0.194620 0.450288
18.033333 2.340882 1.483835 -1.334312 0.360589 -0.198789 0.478095
18.066667 2.352918 1.477158 -1.311958 0.363460 -0.203002 0.496848
18.100000 2.365117 1.470324 -1.298621 0.366249 -0.207250 0.506127
18.133333 2.377325 1.463365 -1.285206 0.368942 -0.211527 0.507951
18.166667 2.389690 1.456249 -1.273181 0.371548 -0.215834 0.499104
18.200000 2.402206 1.448973 -1.243214 0.374064 -0.220169 0.472862
18.233333 2.414869 1.441538 -1.218089 0.376454 -0.224525 0.425087
18.266667 2.427535 1.433974 -1.205648 0.378697 -0.228897 0.354608
18.300000 2.440202 1.426281 -1.187209 0.380797 -0.233286 0.259882
18.333333 2.452869 1.418459 -1.180747 0.382738 -0.237690 0.137533
18.366667 2.465660 1.410474 -1.161627 0.384516 -0.242108 -0.008094
18.400000 2.478571 1.402325 -1.153841 0.386129 -0.246541 -0.164677
18.433333 2.491474 1.394045 -1.154574 0.387609 -0.250997 -0.323392
18.466667 2.504485 1.385600 -1.141281 0.388960 -0.255476 -0.478528
18.500000 2.517484 1.377022 -1.182388 0.390179 -0.259978 -0.620098
18.533333 2.530577 1.368275 -1.237875 0.391272 -0.264506 -0.735850
18.566667 2.543653 1.359394 -1.281991 0.392241 -0.269062 -0.817802
18.600000 2.556811 1.350341 -1.332350 0.393091 -0.273647 -0.862282
18.633333 2.569947 1.341152 -1.366162 0.393815 -0.278259 -0.866960
18.666667 2.583057 1.331828 -1.402040 0.394431 -0.282904 -0.824512
18.700000 2.596234 1.322328 -1.435755 0.394946 -0.287581 -0.740309
18.733333 2.609470 1.312652 -1.452948 0.395365 -0.292288 -0.625443
18.766667 2.622671 1.302839 -1.480655 0.395682 -0.297018 -0.487754
18.800000 2.635834 1.292891 -1.509857 0.395895 -0.301765 -0.337084
18.833333 2.649036 1.282766 -1.521543 0.396001 -0.306525 -0.180325
18.866667 2.662271 1.272466 -1.514573 0.395981 -0.311286 -0.031373
18.900000 2.675530 1.261993 -1.515435 0.395821 -0.316039 0.105965
18.933333 2.688811 1.251346 -1.486241 0.395507 -0.320773 0.229081
18.966667 2.702035 1.240563 -1.476795 0.395033 -0.325485 0.335156
19.000000 2.715200 1.229645 -1.446976 0.394381 -0.330164 0.418649
19.033333 2.728367 1.218558 -1.434061 0.393535 -0.334801 0.477846
19.066667 2.741528 1.207304 -1.417082 0.392488 -0.339392 0.513845
19.100000 2.754618 1.195914 -1.399554 0.391247 -0.343942 0.526049
19.133333 2.767689 1.184360 -1.362743 0.389816 -0.348455 0.516928
19.166667 2.780733 1.172644 -1.343680 0.388198 -0.352937 0.484851
19.200000 2.793693 1.160794 -1.329542 0.386394 -0.357391 0.435143
19.233333 2.806566 1.148812 -1.312266 0.384415 -0.361828 0.369064
19.266667 2.819390 1.136670 -1.308460 0.382270 -0.366255 0.291480
19.300000 2.832119 1.124397 -1.285652 0.379955 -0.370677 0.202835
19.333333 2.844784 1.111967 -1.269845 0.377469 -0.375093 0.107416
19.366667 2.857344 1.099407 -1.259250 0.374814 -0.379504 0.010724
19.400000 2.869824 1.086692 -1.280465 0.371994 -0.383910 -0.083917
19.433333 2.882216 1.073822 -1.280443 0.369004 -0.388300 -0.173103
19.466667 2.894514 1.060794 -1.298944 0.365839 -0.392665 -0.255854
19.500000 2.906709 1.047612 -1.317980 0.362490 -0.396992 -0.323910
19.533333 2.918778 1.034305 -1.333958 0.358953 -0.401270 -0.375704
19.566667 2.930729 1.020844 -1.336953 0.355220 -0.405493 -0.410543
19.600000 2.942554 1.007229 -1.358326 0.351282 -0.409657 -0.428251
19.633333 2.954245 0.993462 -1.383332 0.347133 -0.413768 -0.429936
19.666667 2.965792 0.979575 -1.401311 0.342772 -0.417830 -0.415649
19.700000 2.977190 0.965571 -1.414272 0.338201 -0.421852 -0.392602
19.733333 2.988436 0.951451 -1.441818 0.333414 -0.425845 -0.362532
19.766667 2.999524 0.937217 -1.439161 0.328413 -0.429818 -0.328326
19.800000 3.010435 0.922833 -1.458079 0.323205 -0.433775 -0.292441
19.833333 3.021163 0.908301 -1.456119 0.317801 -0.437712 -0.258685
19.866667 3.031722 0.893659 -1.465526 0.312208 -0.441630 -0.230864
19.900000 3.042082 0.878872 -1.469246 0.306428 -0.445522 -0.209223
19.933333 3.052236 0.863939 -1.471042 0.300479 -0.449372 -0.200075
19.966667 3.062174 0.848862 -1.483814 0.294374 -0.453163 -0.201456
20.000000 3.071925 0.833683 -1.478030 0.288122 -0.456882 -0.216077
20.033333 3.081446 0.818362 -1.487766 0.281724 -0.460523 -0.239309
20.066667 3.090729 0.802900 -1.489198 0.275194 -0.464070 -0.270585
20.100000 3.099813 0.787342 -1.499099 0.268541 -0.467514 -0.306324
20.133333 3.108696 0.771690 -1.502010 0.261767 -0.470853 -0.338134
20.166667 3.117373 0.755948 -1.523921 0.254868 -0.474096 -0.366394
20.200000 3.125781 0.740072 -1.531040 0.247838 -0.477246 -0.387661
20.233333 3.133916 0.724067 -1.552268 0.240676 -0.480302 -0.402542
20.266667 3.141834 0.707977 -1.584140 0.233362 -0.483278 -0.407011
20.300000 3.149532 0.691805 -1.597749 0.225883 -0.486182 -0.403352
20.333333 3.157008 0.675555 -1.612057 0.218232 -0.489018 -0.397063
20.366667 3.164181 0.659186 -1.626219 0.210402 -0.491785 -0.388806
20.400000 3.171125 0.642742 -1.640035 0.202382 -0.494489 -0.379482
20.433333 3.177752 0.626186 -1.645211 0.194171 -0.497129 -0.371265
20.466667 3.184145 0.609562 -1.633666 0.185790 -0.499699 -0.369586
20.500000 3.190300 0.592872 -1.649270 0.177242 -0.502195 -0.374636
20.533333 3.196118 0.576079 -1.671236 0.168540 -0.504612 -0.384537
20.566667 3.201596 0.559190 -1.684745 0.159699 -0.506943 -0.400602
20.600000 3.206728 0.542206 -1.695342 0.150750 -0.509176 -0.421877
20.633333 3.211611 0.525168 -1.709421 0.141704 -0.511305 -0.446409
20.666667 3.216244 0.508079 -1.730720 0.132567 -0.513325 -0.471331
20.700000 3.220520 0.490906 -1.739361 0.123370 -0.515227 -0.496368
20.733333 3.224434 0.473655 -1.773589 0.114138 -0.517003 -0.520964
20.766667 3.228092 0.456362 -1.784998 0.104897 -0.518647 -0.544580
20.800000 3.231492 0.439030 -1.783694 0.095656 -0.520162 -0.568701
20.833333 3.234522 0.421636 -1.807238 0.086442 -0.521543 -0.596010
20.866667 3.237291 0.404208 -1.835131 0.077270 -0.522786 -0.624380
20.900000 3.239684 0.386729 -1.859642 0.068134 -0.523897 -0.650603
20.933333 3.241702 0.369202 -1.884772 0.059015 -0.524880 -0.673180
20.966667 3.243456 0.351652 -1.895613 0.049887 -0.525741 -0.687662
21.000000 3.244945 0.334083 -1.924249 0.040741 -0.526480 -0.689311
21.033333 3.246169 0.316498 -1.945003 0.031542 -0.527104 -0.671775
21.066667 3.247127 0.298901 -1.977420 0.022265 -0.527618 -0.635938
21.100000 3.247819 0.281294 -2.009894 0.012891 -0.528025 -0.583230
21.133333 3.248135 0.263666 -2.035066 0.003410 -0.528326 -0.515714
21.166667 3.248184 0.246036 -2.078084 -0.006178 -0.528523 -0.434202
21.200000 3.247863 0.228395 -2.084900 -0.015880 -0.528615 -0.342866
21.233333 3.247177 0.210746 -2.087185 -0.025677 -0.528598 -0.250432
21.266667 3.246127 0.193096 -2.084788 -0.035535 -0.528468 -0.161075
21.300000 3.244717 0.175448 -2.073378 -0.045411 -0.528221 -0.080064
21.333333 3.243041 0.157815 -2.083561 -0.055275 -0.527851 -0.008892
21.366667 3.241011 0.140195 -2.070275 -0.065087 -0.527353 0.044657
21.400000 3.238633 0.122594 -2.063827 -0.074816 -0.526726 0.078375
21.433333 3.235990 0.105018 -2.056895 -0.084444 -0.525966 0.096998
21.466667 3.233009 0.087471 -2.053550 -0.093975 -0.525074 0.103082
21.500000 3.229692 0.069956 -2.040787 -0.103418 -0.524051 0.099346
21.533333 3.226044 0.052480 -2.034245 -0.112772 -0.522898 0.085644
21.566667 3.222066 0.035042 -2.053711 -0.122041 -0.521614 0.069867
21.600000 3.217830 0.017647 -2.044763 -0.131230 -0.520203 0.056420
21.633333 3.213340 0.000297 -2.039993 -0.140330 -0.518665 0.042786
21.666667 3.208523 -0.016999 -2.038570 -0.149328 -0.517004 0.029024
21.700000 3.203379 -0.034234 -2.029397 -0.158212 -0.515223 0.016050
21.733333 3.197912 -0.051403 -2.041175 -0.166965 -0.513326 0.008372
21.766667 3.192121 -0.068499 -2.045813 -0.175566 -0.511322 -0.000486
21.800000 3.186086 -0.085534 -2.037555 -0.183989 -0.509220 -0.013456
21.833333 3.179811 -0.102504 -2.044863 -0.192224 -0.507024 -0.023750
21.866667 3.173216 -0.119386 -2.045376 -0.200258 -0.504738 -0.031541
21.900000 3.166305 -0.136175 -2.034145 -0.208087 -0.502363 -0.035779
21.933333 3.159162 -0.152889 -2.022164 -0.215726 -0.499894 -0.043781
21.966667 3.151790 -0.169526 -2.053536 -0.223203 -0.497324 -0.048491
22.000000 3.144192 -0.186081 -2.048146 -0.230548 -0.494641 -0.049907
22.033333 3.136370 -0.202552 -2.061476 -0.237781 -0.491841 -0.054781
22.066667 3.128329 -0.218936 -2.044883 -0.244937 -0.488909 -0.065842
22.100000 3.120072 -0.235229 -2.061721 -0.252053 -0.485834 -0.079088
22.133333 3.111602 -0.251429 -2.064349 -0.259147 -0.482604 -0.089974
22.166667 3.102843 -0.267497 -2.050911 -0.266228 -0.479217 -0.105211
22.200000 3.093878 -0.283464 -2.050493 -0.273304 -0.475666 -0.122211
22.233333 3.084632 -0.299290 -2.051585 -0.280369 -0.471955 -0.138521
22.266667 3.075109 -0.314968 -2.063624 -0.287398 -0.468096 -0.147043
22.300000 3.065392 -0.330538 -2.065408 -0.294355 -0.464109 -0.156142
22.333333 3.055485 -0.345998 -2.084812 -0.301202 -0.460011 -0.163714
22.366667 3.045319 -0.361299 -2.101514 -0.307914 -0.455817 -0.163832
22.400000 3.034899 -0.376436 -2.119790 -0.314459 -0.451541 -0.157638
22.433333 3.024234 -0.391408 -2.090747 -0.320819 -0.447194 -0.148067
22.466667 3.013328 -0.406211 -2.115237 -0.326980 -0.442789 -0.139413
22.500000 3.002254 -0.420891 -2.110970 -0.332938 -0.438326 -0.128301
22.533333 2.991017 -0.435445 -2.118177 -0.338687 -0.433811 -0.115911
22.566667 2.979622 -0.449872 -2.117334 -0.344220 -0.429251 -0.107530
22.600000 2.968015 -0.464119 -2.114869 -0.349540 -0.424644 -0.102509
22.633333 2.956259 -0.478234 -2.112951 -0.354656 -0.419980 -0.096135
22.666667 2.944307 -0.492163 -2.126794 -0.359586 -0.415242 -0.089036
22.700000 2.932164 -0.505906 -2.120304 -0.364338 -0.410419 -0.083429
22.733333 2.919888 -0.519511 -2.142759 -0.368919 -0.405505 -0.079527
22.766667 2.907483 -0.532976 -2.141677 -0.373337 -0.400489 -0.075034
22.800000 2.894955 -0.546299 -2.153826 -0.377596 -0.395366 -0.070855
22.833333 2.882270 -0.559427 -2.147527 -0.381690 -0.390141 -0.071088
22.866667 2.869434 -0.572359 -2.135931 -0.385606 -0.384830 -0.074569
22.900000 2.856492 -0.585144 -2.142953 -0.389342 -0.379439 -0.077575
22.933333 2.843416 -0.597728 -2.133439 -0.392893 -0.373976 -0.084564
22.966667 2.830213 -0.610111 -2.132838 -0.396253 -0.368458 -0.092733
23.000000 2.816892 -0.622290 -2.144023 -0.399408 -0.362912 -0.101320
23.033333 2.803460 -0.634264 -2.163770 -0.402350 -0.357357 -0.105109
23.066667 2.789948 -0.646084 -2.156753 -0.405075 -0.351800 -0.106988
23.100000 2.776342 -0.657696 -2.167038 -0.407572 -0.346259 -0.107161
23.133333 2.762668 -0.669153 -2.171766 -0.409838 -0.340747 -0.101349
23.166667 2.748917 -0.680399 -2.189305 -0.411873 -0.335265 -0.092723
23.200000 2.735109 -0.691488 -2.170772 -0.413683 -0.329803 -0.085020
23.233333 2.721238 -0.702365 -2.187643 -0.415272 -0.324353 -0.081807
23.266667 2.707322 -0.713083 -2.191455 -0.416644 -0.318924 -0.078805
23.300000 2.693365 -0.723641 -2.172108 -0.417809 -0.313509 -0.079885
23.333333 2.679374 -0.734040 -2.166348 -0.418771 -0.308106 -0.085769
23.366667 2.665356 -0.744222 -2.169858 -0.419533 -0.302710 -0.095450
23.400000 2.651320 -0.754185 -2.186293 -0.420096 -0.297328 -0.103857
23.433333 2.637266 -0.763986 -2.192480 -0.420459 -0.291957 -0.112241
23.466667 2.623200 -0.773627 -2.201980 -0.420623 -0.286591 -0.122262
23.500000 2.609127 -0.783106 -2.208724 -0.420580 -0.281223 -0.128177
23.533333 2.595074 -0.792366 -2.208554 -0.420321 -0.275847 -0.128877
23.566667 2.581025 -0.801463 -2.211921 -0.419835 -0.270457 -0.126560
23.600000 2.566986 -0.810399 -2.218224 -0.419110 -0.265037 -0.124076
23.633333 2.552963 -0.819173 -2.227293 -0.418134 -0.259576 -0.119402
23.666667 2.538961 -0.827785 -2.226404 -0.416888 -0.254059 -0.111542
23.700000 2.525024 -0.836178 -2.214990 -0.415367 -0.248486 -0.106604
23.733333 2.511161 -0.844353 -2.224231 -0.413575 -0.242859 -0.105752
23.766667 2.497335 -0.852366 -2.234687 -0.411517 -0.237186 -0.106067
23.800000 2.483552 -0.860219 -2.245622 -0.409207 -0.231483 -0.105948
23.833333 2.469876 -0.867857 -2.244366 -0.406665 -0.225771 -0.105122
23.866667 2.456314 -0.875282 -2.235891 -0.403927 -0.220084 -0.106844
23.900000 2.442875 -0.882496 -2.246555 -0.401016 -0.214441 -0.105653
23.933333 2.429568 -0.889500 -2.254315 -0.397949 -0.208859 -0.101680
23.966667 2.416328 -0.896346 -2.261144 -0.394743 -0.203352 -0.096002
24.000000 2.403241 -0.902985 -2.248686 -0.391407 -0.197934 -0.091498
24.033333 2.390231 -0.909468 -2.266168 -0.387927 -0.192604 -0.087989
24.066667 2.377302 -0.915795 -2.267867 -0.384272 -0.187351 -0.081624
24.100000 2.364554 -0.921922 -2.272822 -0.380418 -0.182165 -0.073435
24.133333 2.351897 -0.927895 -2.274670 -0.376323 -0.177031 -0.064199
24.166667 2.339333 -0.933716 -2.261374 -0.371956 -0.171937 -0.055228
24.200000 2.326868 -0.939385 -2.267388 -0.367284 -0.166866 -0.043478
24.233333 2.314620 -0.944863 -2.278310 -0.362297 -0.161810 -0.031252
24.266667 2.302479 -0.950192 -2.280864 -0.356990 -0.156768 -0.021321
24.300000 2.290575 -0.955334 -2.282326 -0.351375 -0.151739 -0.015525
24.333333 2.278917 -0.960295 -2.284775 -0.345491 -0.146731 -0.012153
24.366667 2.267513 -0.965076 -2.278277 -0.339378 -0.141753 -0.010041
24.400000 2.256230 -0.969713 -2.274308 -0.333098 -0.136819 -0.011078
24.433333 2.245215 -0.974176 -2.263259 -0.326722 -0.131942 -0.015078
24.466667 2.234476 -0.978466 -2.271568 -0.320320 -0.127135 -0.021246
24.500000 2.223865 -0.982617 -2.268780 -0.313935 -0.122404 -0.028384
24.533333 2.213542 -0.986597 -2.277175 -0.307617 -0.117755 -0.034743
24.566667 2.203509 -0.990409 -2.279817 -0.301394 -0.113190 -0.035917
24.600000 2.193612 -0.994085 -2.289773 -0.295282 -0.108708 -0.026123
24.633333 2.183854 -0.997629 -2.281080 -0.289259 -0.104299 -0.003708
24.666667 2.174393 -1.001001 -2.281099 -0.283315 -0.099961 0.032369
24.700000 2.165075 -1.004244 -2.287041 -0.277444 -0.095692 0.081224
24.733333 2.155899 -1.007359 -2.295570 -0.271610 -0.091488 0.137221
24.766667 2.146869 -1.010349 -2.289723 -0.265777 -0.087345 0.190535
24.800000 2.138135 -1.013166 -2.308961 -0.259921 -0.083265 0.231488
24.833333 2.129549 -1.015861 -2.287499 -0.254044 -0.079260 0.255738
24.866667 2.121112 -1.018436 -2.263567 -0.248113 -0.075333 0.258028
24.900000 2.112955 -1.020852 -2.227718 -0.242125 -0.071496 0.233340
24.933333 2.104949 -1.023152 -2.190888 -0.236089 -0.067761 0.181980
24.966667 2.097211 -1.025310 -2.181057 -0.230041 -0.064143 0.111897
25.000000 2.089625 -1.027357 -2.183027 -0.223992 -0.060649 0.029240
25.033333 2.082295 -1.029279 -2.172395 -0.217967 -0.057278 -0.059618
25.066667 2.075118 -1.031094 -2.186329 -0.212012 -0.054037 -0.141508
25.100000 2.068187 -1.032806 -2.208951 -0.206150 -0.050923 -0.204335
25.133333 2.061409 -1.034413 -2.238262 -0.200405 -0.047933 -0.239373
25.166667 2.054868 -1.035939 -2.261425 -0.194780 -0.045058 -0.248601
25.200000 2.048557 -1.037394 -2.293553 -0.189294 -0.042295 -0.232231
25.233333 2.042399 -1.038752 -2.303446 -0.183939 -0.039649 -0.192190
25.266667 2.036394 -1.040014 -2.306066 -0.178710 -0.037113 -0.141164
25.300000 2.030542 -1.041182 -2.296297 -0.173594 -0.034686 -0.091249
25.333333 2.024841 -1.042259 -2.291401 -0.168579 -0.032370 -0.052535
25.366667 2.019292 -1.043246 -2.294680 -0.163645 -0.030180 -0.025560
25.400000 2.013939 -1.044212 -2.260766 -0.158768 -0.028117 -0.016672
25.433333 2.008735 -1.045093 -2.246292 -0.153939 -0.026174 -0.027997
25.466667 2.003680 -1.045889 -2.244391 -0.149142 -0.024352 -0.055039
25.500000 1.998774 -1.046604 -2.262951 -0.144370 -0.022654 -0.089008
25.533333 1.994047 -1.047307 -2.273822 -0.139621 -0.021064 -0.123889
