t x y theta dxdt dydt dthetadt
0.000000 0.000000 0.000000 -0.292281 -0.010924 -0.006781 -0.016527
0.033333 0.000025 -0.000367 -0.293889 -0.015792 -0.006017 -0.008649
0.066667 -0.000198 -0.000742 -0.290233 -0.021596 -0.005174 -0.000911
0.100000 -0.000673 -0.001125 -0.289189 -0.028344 -0.004362 0.004653
0.133333 -0.001486 -0.001204 -0.292198 -0.036055 -0.003701 0.007494
0.166667 -0.002564 -0.001292 -0.294325 -0.045108 -0.003240 0.010377
0.200000 -0.003989 -0.000988 -0.296454 -0.056296 -0.003171 0.012139
0.233333 -0.005688 -0.000694 -0.290629 -0.070327 -0.003671 0.016017
0.266667 -0.007666 -0.000408 -0.283465 -0.087953 -0.004901 0.021434
0.300000 -0.010636 -0.000663 -0.288642 -0.110402 -0.007078 0.027478
0.333333 -0.013893 -0.000927 -0.283773 -0.138913 -0.010367 0.033354
0.366667 -0.017441 -0.001200 -0.295925 -0.174363 -0.014979 0.036108
0.400000 -0.021283 -0.001481 -0.293742 -0.216734 -0.020843 0.033704
0.433333 -0.025422 -0.001771 -0.289661 -0.266393 -0.027908 0.024503
0.466667 -0.029859 -0.002070 -0.289388 -0.323703 -0.036125 0.010510
0.500000 -0.039881 -0.002809 -0.275279 -0.388038 -0.045269 -0.008199
0.533333 -0.055797 -0.004744 -0.272255 -0.458289 -0.055038 -0.032176
0.566667 -0.072001 -0.006680 -0.258925 -0.533129 -0.064900 -0.063103
0.600000 -0.088483 -0.008616 -0.270130 -0.611684 -0.074457 -0.097272
0.633333 -0.111688 -0.011776 -0.288003 -0.691826 -0.083170 -0.134618
0.666667 -0.135144 -0.014928 -0.292969 -0.771489 -0.090384 -0.173790
0.700000 -0.164491 -0.019013 -0.299212 -0.848705 -0.095404 -0.209905
0.733333 -0.194046 -0.023079 -0.315745 -0.922440 -0.097740 -0.237267
0.766667 -0.228053 -0.027336 -0.305784 -0.991203 -0.097185 -0.251450
0.800000 -0.262213 -0.031565 -0.316707 -1.053507 -0.093540 -0.252939
0.833333 -0.301527 -0.035499 -0.330132 -1.108883 -0.086851 -0.239814
0.866667 -0.340928 -0.039394 -0.356661 -1.156587 -0.077332 -0.212251
0.900000 -0.383847 -0.041911 -0.367957 -1.196420 -0.065677 -0.173620
0.933333 -0.426779 -0.044382 -0.377234 -1.227724 -0.052485 -0.127968
0.966667 -0.469683 -0.046805 -0.390070 -1.250851 -0.038280 -0.075588
1.000000 -0.513289 -0.047711 -0.382861 -1.265710 -0.023775 -0.018395
1.033333 -0.557364 -0.046959 -0.372876 -1.272474 -0.009672 0.040192
1.066667 -0.601290 -0.046158 -0.370321 -1.271215 0.003119 0.097296
1.100000 -0.645025 -0.045308 -0.362408 -1.262174 0.014127 0.153091
1.133333 -0.688528 -0.044411 -0.356590 -1.245594 0.022882 0.209173
1.166667 -0.731758 -0.043468 -0.342783 -1.220943 0.028719 0.265810
1.200000 -0.772801 -0.041499 -0.335856 -1.188301 0.031081 0.327047
1.233333 -0.813491 -0.039489 -0.327626 -1.147437 0.029660 0.397016
1.266667 -0.853789 -0.037441 -0.317713 -1.098932 0.024566 0.477786
1.300000 -0.893659 -0.035357 -0.313561 -1.042689 0.015894 0.567697
1.333333 -0.928416 -0.034043 -0.297771 -0.978659 0.004045 0.660318
1.366667 -0.962674 -0.032701 -0.279383 -0.907665 -0.010143 0.748475
1.400000 -0.990633 -0.033320 -0.256607 -0.831155 -0.025309 0.823163
1.433333 -1.018034 -0.033914 -0.223790 -0.750348 -0.039919 0.876263
1.466667 -1.044853 -0.034482 -0.179528 -0.665951 -0.052349 0.897564
1.500000 -1.065877 -0.037617 -0.126483 -0.580026 -0.060689 0.880573
1.533333 -1.080860 -0.043023 -0.070602 -0.495012 -0.063447 0.825637
1.566667 -1.095207 -0.048399 -0.023195 -0.412915 -0.059349 0.735257
1.600000 -1.108905 -0.053739 0.018523 -0.335015 -0.047601 0.612736
1.633333 -1.117188 -0.057922 0.033031 -0.263361 -0.028118 0.464238
1.666667 -1.120609 -0.059245 0.029354 -0.200905 -0.001439 0.304236
1.700000 -1.123359 -0.060526 0.023142 -0.149072 0.031033 0.146552
1.733333 -1.125437 -0.061763 0.027181 -0.108412 0.067813 0.002056
1.766667 -1.124599 -0.059322 0.032525 -0.079875 0.107249 -0.122118
1.800000 -1.122657 -0.053756 -0.002356 -0.063839 0.147333 -0.215746
1.833333 -1.121592 -0.045069 -0.031422 -0.059565 0.186287 -0.271112
1.866667 -1.119857 -0.036357 -0.048765 -0.064357 0.222709 -0.285066
1.900000 -1.117452 -0.027629 -0.059756 -0.076076 0.255672 -0.255818
1.933333 -1.120831 -0.017313 -0.064856 -0.092130 0.284200 -0.180840
1.966667 -1.123538 -0.007000 -0.070486 -0.108650 0.307456 -0.056194
2.000000 -1.131483 0.004847 -0.090600 -0.121224 0.324954 0.116463
2.033333 -1.138743 0.016669 -0.105509 -0.126097 0.336634 0.332273
2.066667 -1.145306 0.028455 -0.098004 -0.120806 0.342520 0.583398
2.100000 -1.153876 0.041915 -0.099278 -0.102157 0.342396 0.861373
2.133333 -1.161730 0.055311 -0.086338 -0.068274 0.336481 1.153825
2.166667 -1.168856 0.068628 -0.035623 -0.018613 0.325206 1.445738
2.200000 -1.172607 0.080719 0.031091 0.045081 0.309446 1.720490
2.233333 -1.175614 0.092702 0.106315 0.121179 0.289822 1.964280
2.266667 -1.173607 0.103233 0.211689 0.208121 0.266956 2.163591
2.300000 -1.165434 0.111447 0.298490 0.302716 0.242150 2.310551
2.333333 -1.150341 0.117460 0.400943 0.401189 0.216736 2.398222
2.366667 -1.134517 0.123314 0.507451 0.500374 0.191814 2.427662
2.400000 -1.117974 0.129003 0.605433 0.598642 0.167912 2.404909
2.433333 -1.094510 0.133246 0.683718 0.693900 0.145570 2.338589
2.466667 -1.064603 0.136702 0.765659 0.783855 0.125201 2.243472
2.500000 -1.034040 0.139971 0.827666 0.867221 0.106615 2.127259
2.533333 -1.002847 0.143048 0.892226 0.944225 0.089228 2.002006
2.566667 -0.971053 0.145929 0.964885 1.014850 0.072264 1.874525
2.600000 -0.936079 0.148353 1.004965 1.078466 0.055224 1.752264
2.633333 -0.896684 0.150489 1.070210 1.135058 0.037594 1.634457
2.666667 -0.856784 0.152414 1.116908 1.185438 0.018846 1.520016
2.700000 -0.814452 0.153441 1.166289 1.230086 -0.001723 1.405837
2.733333 -0.770598 0.153295 1.209838 1.268877 -0.024564 1.289537
2.766667 -0.725727 0.151786 1.265102 1.301656 -0.049481 1.167124
2.800000 -0.680508 0.150060 1.303209 1.328692 -0.076643 1.033884
2.833333 -0.634985 0.148115 1.334954 1.350501 -0.106488 0.892309
2.866667 -0.589199 0.145953 1.363681 1.367122 -0.139399 0.741636
2.900000 -0.542285 0.139929 1.392532 1.378955 -0.174747 0.589434
2.933333 -0.495195 0.133693 1.415284 1.386581 -0.212057 0.437343
2.966667 -0.447972 0.127250 1.427844 1.390771 -0.251350 0.294361
3.000000 -0.400658 0.120605 1.439129 1.392216 -0.292177 0.163298
3.033333 -0.353894 0.108836 1.412303 1.391120 -0.333127 0.051527
3.066667 -0.307128 0.096881 1.411322 1.387566 -0.372715 -0.038334
3.100000 -0.260403 0.084753 1.388202 1.381381 -0.410296 -0.105853
3.133333 -0.215035 0.069500 1.389520 1.372408 -0.444898 -0.149072
3.166667 -0.169074 0.050905 1.368826 1.360269 -0.475096 -0.171924
3.200000 -0.123282 0.032179 1.361388 1.344634 -0.499614 -0.174559
3.233333 -0.077700 0.013340 1.358931 1.325329 -0.518299 -0.167467
3.266667 -0.032368 -0.005594 1.348113 1.302219 -0.530994 -0.152010
3.300000 0.012670 -0.024604 1.355720 1.275232 -0.537346 -0.135953
3.333333 0.056462 -0.044273 1.344449 1.243744 -0.537221 -0.121703
3.366667 0.098729 -0.063809 1.353930 1.207176 -0.530980 -0.113319
3.400000 0.139082 -0.082523 1.347416 1.165000 -0.519110 -0.110467
3.433333 0.176631 -0.099729 1.343106 1.116845 -0.501807 -0.108223
3.466667 0.213699 -0.116919 1.345285 1.062657 -0.479501 -0.107544
3.500000 0.248889 -0.132915 1.345883 1.002815 -0.452895 -0.104353
3.533333 0.283535 -0.148861 1.328329 0.938495 -0.423017 -0.101086
3.566667 0.317607 -0.164745 1.325026 0.870884 -0.390798 -0.096030
3.600000 0.348466 -0.178737 1.322985 0.800794 -0.356993 -0.091759
3.633333 0.375617 -0.190875 1.306323 0.728907 -0.322255 -0.090376
3.666667 0.397105 -0.200093 1.301475 0.656106 -0.287320 -0.091366
3.700000 0.413044 -0.206201 1.309761 0.583008 -0.252879 -0.092461
3.733333 0.428306 -0.212187 1.309605 0.509895 -0.219336 -0.091229
3.766667 0.442877 -0.218047 1.326368 0.437406 -0.187456 -0.091182
3.800000 0.456749 -0.223776 1.340152 0.366553 -0.158146 -0.096324
3.833333 0.469911 -0.229370 1.322341 0.297760 -0.132420 -0.113800
3.866667 0.482354 -0.234825 1.287519 0.230611 -0.110820 -0.147764
3.900000 0.488766 -0.237612 1.281100 0.164517 -0.093774 -0.206715
3.933333 0.490364 -0.237991 1.271000 0.098927 -0.082030 -0.293708
3.966667 0.491237 -0.238222 1.272090 0.032959 -0.075884 -0.406503
4.000000 0.491388 -0.238307 1.287872 -0.034388 -0.075587 -0.539149
4.033333 0.488601 -0.238764 1.310806 -0.103512 -0.081008 -0.684299
4.066667 0.485102 -0.239077 1.298884 -0.174738 -0.092298 -0.840106
4.100000 0.478378 -0.241341 1.268475 -0.248272 -0.108962 -0.997104
4.133333 0.470958 -0.243460 1.211724 -0.324395 -0.129849 -1.148845
4.166667 0.459617 -0.248759 1.122601 -0.402914 -0.153495 -1.284283
4.200000 0.447606 -0.253905 1.067583 -0.483735 -0.178448 -1.399264
4.233333 0.431512 -0.260932 1.006896 -0.566368 -0.203224 -1.486394
4.266667 0.411174 -0.269437 0.953861 -0.649231 -0.225955 -1.541867
4.300000 0.386558 -0.279118 0.890607 -0.730698 -0.245390 -1.566174
4.333333 0.361355 -0.288612 0.844792 -0.809106 -0.260608 -1.565472
4.366667 0.331073 -0.298797 0.795509 -0.882671 -0.270975 -1.555096
4.400000 0.296090 -0.309462 0.744725 -0.949058 -0.275788 -1.539543
4.433333 0.260622 -0.319907 0.704734 -1.006689 -0.274861 -1.529014
4.466667 0.224706 -0.330121 0.651253 -1.055132 -0.268623 -1.523790
4.500000 0.186011 -0.340384 0.613156 -1.093863 -0.257154 -1.529548
4.533333 0.145710 -0.350493 0.555349 -1.122264 -0.240531 -1.539198
4.566667 0.105007 -0.359505 0.510246 -1.140565 -0.219016 -1.545428
4.600000 0.065142 -0.366581 0.445357 -1.149893 -0.193138 -1.546514
4.633333 0.025043 -0.373376 0.411327 -1.150822 -0.162957 -1.539406
4.666667 -0.015247 -0.379884 0.341108 -1.143200 -0.128140 -1.526141
4.700000 -0.053339 -0.382935 0.274173 -1.127423 -0.089248 -1.506528
4.733333 -0.091536 -0.385690 0.225469 -1.103733 -0.046826 -1.492367
4.766667 -0.129797 -0.388143 0.166450 -1.071924 -0.001531 -1.487353
4.800000 -0.168083 -0.390293 0.124737 -1.030908 0.046412 -1.500538
4.833333 -0.202717 -0.387560 0.086558 -0.980138 0.096021 -1.535894
4.866667 -0.237295 -0.384524 0.061733 -0.919385 0.146145 -1.596020
4.900000 -0.268990 -0.377453 0.018074 -0.848484 0.196110 -1.675116
4.933333 -0.300557 -0.370089 -0.019197 -0.767572 0.245310 -1.760495
4.966667 -0.328493 -0.359648 -0.070263 -0.677577 0.293081 -1.844831
5.000000 -0.352185 -0.347449 -0.129544 -0.580582 0.338290 -1.910576
5.033333 -0.371406 -0.334133 -0.223564 -0.478810 0.380591 -1.939956
5.066667 -0.385999 -0.320106 -0.323498 -0.375249 0.419568 -1.917876
5.100000 -0.395951 -0.305439 -0.406320 -0.272634 0.455206 -1.840810
5.133333 -0.401365 -0.289305 -0.503513 -0.174358 0.487157 -1.707293
5.166667 -0.402318 -0.271873 -0.604382 -0.083217 0.515484 -1.515557
5.200000 -0.398599 -0.253304 -0.650301 -0.001481 0.540345 -1.276760
5.233333 -0.394616 -0.234576 -0.678437 0.069295 0.561668 -1.008994
5.266667 -0.386341 -0.214069 -0.698912 0.128330 0.579406 -0.731684
5.300000 -0.377815 -0.193442 -0.711116 0.175243 0.592976 -0.455537
5.333333 -0.369050 -0.172714 -0.698401 0.210711 0.602145 -0.194563
5.366667 -0.359741 -0.151381 -0.687474 0.235644 0.606232 0.035887
5.400000 -0.350214 -0.129988 -0.659391 0.251648 0.604966 0.231429
5.433333 -0.340478 -0.108554 -0.641766 0.260012 0.598049 0.393313
5.466667 -0.330546 -0.087100 -0.636576 0.262201 0.585139 0.528719
5.500000 -0.320429 -0.065646 -0.614679 0.259384 0.566227 0.636669
5.533333 -0.311898 -0.046413 -0.595034 0.252398 0.541229 0.719974
5.566667 -0.303204 -0.027217 -0.567695 0.242120 0.510779 0.783038
5.600000 -0.294359 -0.008077 -0.544125 0.228849 0.475187 0.828231
5.633333 -0.286719 0.007438 -0.499464 0.212998 0.435062 0.852881
5.666667 -0.278949 0.022866 -0.466880 0.194925 0.391453 0.849447
5.700000 -0.273075 0.033891 -0.433518 0.175338 0.345926 0.819705
5.733333 -0.267089 0.044808 -0.398881 0.154915 0.300000 0.767286
5.766667 -0.260998 0.055608 -0.360284 0.134129 0.254793 0.695092
5.800000 -0.256473 0.062854 -0.308830 0.113708 0.211853 0.602783
5.833333 -0.253771 0.067201 -0.285413 0.094317 0.172366 0.498476
5.866667 -0.252556 0.069507 -0.294657 0.076594 0.137395 0.394305
5.900000 -0.251259 0.071684 -0.292385 0.060740 0.107075 0.295311
5.933333 -0.250732 0.072910 -0.292822 0.047037 0.081628 0.204629
5.966667 -0.250127 0.074008 -0.293752 0.035792 0.061279 0.126694
6.000000 -0.249444 0.074979 -0.303186 0.027005 0.045591 0.069643
6.033333 -0.249028 0.075690 -0.302345 0.020511 0.033981 0.031959
6.066667 -0.248536 0.076276 -0.301764 0.015908 0.025533 0.007425
6.100000 -0.248138 0.076767 -0.300912 0.012947 0.019673 -0.005257
6.133333 -0.247960 0.077244 -0.308125 0.011260 0.015680 -0.007925
6.166667 -0.247708 0.077602 -0.299450 0.010514 0.012793 -0.004955
6.200000 -0.247592 0.077981 -0.293373 0.010558 0.010483 -0.002311
