t x y theta dxdt dydt dthetadt
0.000000 0.000000 0.000000 -0.502228 0.015197 -0.152625 0.333989
0.033333 0.003450 -0.004551 -0.467944 -0.001985 -0.169111 0.573732
0.066667 0.006560 -0.009009 -0.427196 -0.033386 -0.188078 0.774385
0.100000 0.009307 -0.013367 -0.394700 -0.078394 -0.207979 0.928184
0.133333 0.008008 -0.021581 -0.329772 -0.135303 -0.227608 1.025451
0.166667 0.006309 -0.029676 -0.266979 -0.201974 -0.245892 1.065227
0.200000 -0.000594 -0.039877 -0.206220 -0.276476 -0.262080 1.056727
0.233333 -0.007925 -0.049935 -0.156912 -0.357483 -0.275457 1.011409
0.266667 -0.021182 -0.060796 -0.127616 -0.443224 -0.285350 0.945812
0.300000 -0.040929 -0.072010 -0.116504 -0.531611 -0.290957 0.871253
0.333333 -0.061113 -0.083041 -0.102999 -0.621351 -0.291936 0.804760
0.366667 -0.081733 -0.093876 -0.085238 -0.711178 -0.287952 0.756553
0.400000 -0.108369 -0.104265 -0.077383 -0.800236 -0.278891 0.734162
0.433333 -0.135427 -0.114431 -0.061194 -0.887091 -0.264765 0.737963
0.466667 -0.166986 -0.123795 -0.045070 -0.970887 -0.245908 0.763599
0.500000 -0.202509 -0.132260 -0.022986 -1.051245 -0.222705 0.807702
0.533333 -0.238407 -0.140464 0.002083 -1.127582 -0.195076 0.859732
0.566667 -0.278140 -0.147668 0.040571 -1.199090 -0.163253 0.913361
0.600000 -0.320984 -0.153825 0.090432 -1.265107 -0.127663 0.957219
0.633333 -0.366396 -0.158629 0.116402 -1.325080 -0.088764 0.990536
0.666667 -0.413991 -0.161793 0.167147 -1.378755 -0.046891 1.010004
0.700000 -0.463247 -0.162832 0.203347 -1.425739 -0.002514 1.016704
0.733333 -0.513660 -0.161470 0.249783 -1.465328 0.043444 1.013675
0.766667 -0.564240 -0.159801 0.265362 -1.497522 0.090334 1.004289
0.800000 -0.614950 -0.157823 0.303237 -1.522410 0.137785 0.994621
0.833333 -0.667450 -0.152282 0.330924 -1.540324 0.185333 0.986239
0.866667 -0.720919 -0.142630 0.352796 -1.551503 0.232376 0.981393
0.900000 -0.774404 -0.132681 0.392941 -1.556336 0.278184 0.976228
0.933333 -0.827866 -0.122443 0.419203 -1.555939 0.322204 0.969416
0.966667 -0.881264 -0.111923 0.445530 -1.551145 0.363823 0.954817
1.000000 -0.934558 -0.101132 0.479533 -1.542129 0.402456 0.931609
1.033333 -0.987364 -0.086210 0.525051 -1.528812 0.437705 0.894839
1.066667 -1.037055 -0.068073 0.564313 -1.511351 0.469454 0.845230
1.100000 -1.086528 -0.049702 0.605233 -1.489497 0.497779 0.787288
1.133333 -1.135747 -0.031114 0.630237 -1.462426 0.522823 0.724586
1.166667 -1.184678 -0.012327 0.678047 -1.429075 0.544667 0.661824
1.200000 -1.233285 0.006643 0.671703 -1.389247 0.563220 0.602653
1.233333 -1.281532 0.025778 0.678599 -1.343098 0.578539 0.553470
1.266667 -1.329385 0.045061 0.677795 -1.290024 0.590706 0.519799
1.300000 -1.376809 0.064473 0.679455 -1.229701 0.599505 0.502812
1.333333 -1.418622 0.085062 0.701453 -1.162454 0.604350 0.500644
1.366667 -1.455321 0.106398 0.727428 -1.089487 0.604726 0.514459
1.400000 -1.491506 0.127808 0.735656 -1.011582 0.600213 0.538455
1.433333 -1.523950 0.149515 0.754861 -0.929883 0.590346 0.567873
1.466667 -1.552780 0.171110 0.775771 -0.846185 0.574326 0.590124
1.500000 -1.578125 0.191972 0.805304 -0.762779 0.551956 0.598826
1.533333 -1.602891 0.212830 0.831639 -0.681334 0.523560 0.588467
1.566667 -1.624373 0.232241 0.856082 -0.602665 0.489471 0.555806
1.600000 -1.642812 0.249710 0.887723 -0.527770 0.450139 0.499365
1.633333 -1.657535 0.264044 0.893248 -0.457148 0.406196 0.421648
1.666667 -1.668082 0.274549 0.911772 -0.391483 0.359375 0.333767
1.700000 -1.678031 0.284978 0.939800 -0.330711 0.311031 0.242478
1.733333 -1.687387 0.295324 0.955792 -0.275105 0.262676 0.158487
1.766667 -1.696156 0.305579 0.972510 -0.224990 0.215851 0.084627
1.800000 -1.701197 0.310691 0.938282 -0.180756 0.172618 0.030209
1.833333 -1.705665 0.315702 0.920668 -0.142536 0.134502 -0.004756
1.866667 -1.708306 0.317257 0.878016 -0.109782 0.102018 -0.019750
1.900000 -1.709651 0.316794 0.885941 -0.082248 0.075898 -0.016512
1.933333 -1.710271 0.315633 0.882712 -0.059592 0.056637 0.000482
1.966667 -1.710365 0.314380 0.895738 -0.041627 0.044681 0.028952
2.000000 -1.710983 0.314525 0.904902 -0.027375 0.038975 0.059523
2.033333 -1.711104 0.314585 0.915837 -0.016109 0.038713 0.088975
2.066667 -1.710739 0.314566 0.925806 -0.007276 0.042962 0.108587
2.100000 -1.709902 0.314469 0.941428 -0.000193 0.050462 0.116954
2.133333 -1.710809 0.318126 0.941428 0.006037 0.059533 0.113036
2.166667 -1.711269 0.321708 0.941428 0.012316 0.068492 0.098914
2.200000 -1.711294 0.325215 0.941428 0.018923 0.076644 0.078965
2.233333 -1.710897 0.328645 0.941428 0.026140 0.083294 0.056482
2.266667 -1.710090 0.331998 0.941428 0.034142 0.088027 0.036679
2.300000 -1.708884 0.335273 0.941428 0.043042 0.090594 0.021500
2.333333 -1.707292 0.338470 0.941428 0.052567 0.091431 0.000107
2.366667 -1.705326 0.341588 0.941428 0.062205 0.090965 -0.028320
2.400000 -1.703001 0.344627 0.941428 0.071531 0.089500 -0.064800
2.433333 -1.700327 0.347586 0.941428 0.080117 0.087338 -0.109155
2.466667 -1.697319 0.350465 0.941428 0.087385 0.084843 -0.161189
