t x y theta dxdt dydt dthetadt
0.000000 0.000000 0.000000 1.729507 0.053773 -0.069068 -0.830423
0.033333 0.001851 -0.002364 1.712039 0.055945 -0.073699 -0.711360
0.066667 0.003758 -0.004867 1.681966 0.058098 -0.078459 -0.601358
0.100000 0.005719 -0.007512 1.675616 0.060240 -0.083349 -0.521318
0.133333 0.007736 -0.010300 1.682181 0.062378 -0.088368 -0.486792
0.166667 0.009838 -0.013286 1.648804 0.064516 -0.093506 -0.513020
0.200000 0.012026 -0.016477 1.649073 0.066662 -0.098752 -0.607370
0.233333 0.014269 -0.019818 1.649475 0.068819 -0.104091 -0.763096
0.266667 0.016598 -0.023369 1.671685 0.070993 -0.109510 -0.975631
0.300000 0.019014 -0.027129 1.690089 0.073182 -0.114983 -1.230613
0.333333 0.021483 -0.031048 1.671599 0.075377 -0.120484 -1.512541
0.366667 0.024039 -0.035171 1.576628 0.077570 -0.125992 -1.798974
0.400000 0.026648 -0.039457 1.488184 0.079761 -0.131495 -2.063698
0.433333 0.029350 -0.043942 1.374147 0.081953 -0.136983 -2.289452
0.466667 0.032148 -0.048625 1.293723 0.084142 -0.142446 -2.456922
0.500000 0.034997 -0.053474 1.168147 0.086321 -0.147889 -2.550559
0.533333 0.037896 -0.058492 1.041204 0.088494 -0.153315 -2.559695
0.566667 0.040846 -0.063681 0.936783 0.090665 -0.158735 -2.489334
0.600000 0.043902 -0.069058 0.841428 0.092823 -0.164149 -2.351032
0.633333 0.047063 -0.074623 0.762207 0.094952 -0.169563 -2.160516
0.666667 0.050272 -0.080363 0.699940 0.097044 -0.174986 -1.931701
0.700000 0.053528 -0.086280 0.632112 0.099093 -0.180423 -1.682960
0.733333 0.056881 -0.092382 0.590854 0.101084 -0.185877 -1.437431
0.766667 0.060330 -0.098666 0.551811 0.102997 -0.191348 -1.202921
0.800000 0.063822 -0.105131 0.526403 0.104822 -0.196840 -0.987071
0.833333 0.067357 -0.111779 0.499855 0.106563 -0.202355 -0.792389
0.866667 0.070980 -0.118609 0.500344 0.108215 -0.207893 -0.624787
0.900000 0.074644 -0.125624 0.482385 0.109774 -0.213454 -0.487489
0.933333 0.078348 -0.132825 0.469921 0.111246 -0.219039 -0.372462
0.966667 0.082091 -0.140214 0.456795 0.112647 -0.224648 -0.279959
1.000000 0.085871 -0.147791 0.455138 0.113985 -0.230281 -0.207459
1.033333 0.089687 -0.155558 0.462529 0.115268 -0.235936 -0.155225
1.066667 0.093570 -0.163509 0.442248 0.116508 -0.241612 -0.115945
1.100000 0.097488 -0.171651 0.455307 0.117713 -0.247307 -0.085772
1.133333 0.101438 -0.179986 0.456795 0.118894 -0.253021 -0.062777
1.166667 0.105420 -0.188515 0.457353 0.120050 -0.258757 -0.045151
1.200000 0.109431 -0.197238 0.453091 0.121186 -0.264516 -0.028741
1.233333 0.113492 -0.206149 0.447874 0.122304 -0.270304 -0.009659
1.266667 0.117597 -0.215247 0.446312 0.123403 -0.276127 0.008696
1.300000 0.121745 -0.224535 0.447903 0.124480 -0.281992 0.024966
1.333333 0.125918 -0.234020 0.447388 0.125528 -0.287908 0.027996
1.366667 0.130115 -0.243703 0.439754 0.126539 -0.293886 0.007256
1.400000 0.134350 -0.253582 0.437090 0.127498 -0.299936 -0.041836
1.433333 0.138625 -0.263658 0.446592 0.128389 -0.306067 -0.107420
1.466667 0.142938 -0.273938 0.472045 0.129195 -0.312285 -0.164990
1.500000 0.147287 -0.284424 0.471641 0.129903 -0.318593 -0.177947
1.533333 0.151665 -0.295124 0.492596 0.130501 -0.324990 -0.097436
1.566667 0.156065 -0.306043 0.476908 0.130978 -0.331474 0.131242
1.600000 0.160480 -0.317187 0.474518 0.131330 -0.338040 0.540325
1.633333 0.164907 -0.328533 0.439952 0.131551 -0.344696 1.129260
1.666667 0.169330 -0.340115 0.342629 0.131640 -0.351450 1.879856
1.700000 0.173742 -0.351936 0.191981 0.131600 -0.358319 2.754072
1.733333 0.178137 -0.364000 0.183623 0.131432 -0.365320 3.691293
1.766667 0.182538 -0.376265 0.329524 0.131145 -0.372472 4.611599
1.800000 0.186911 -0.388785 0.629793 0.130752 -0.379784 5.433905
1.833333 0.191288 -0.401505 0.999809 0.130269 -0.387244 6.102830
1.866667 0.195666 -0.414426 1.389432 0.129711 -0.394845 6.565936
1.900000 0.200009 -0.427632 1.745093 0.129098 -0.402559 6.775065
1.933333 0.204316 -0.441132 2.092935 0.128445 -0.410357 6.717188
1.966667 0.208586 -0.454935 2.335000 0.127772 -0.418189 6.416685
2.000000 0.212820 -0.469046 2.569862 0.127091 -0.426016 5.929407
2.033333 0.217016 -0.483472 2.739696 0.126417 -0.433796 5.315030
2.066667 0.221208 -0.498093 2.838117 0.125761 -0.441475 4.645725
2.100000 0.225366 -0.513033 2.910693 0.125131 -0.449009 4.010894
2.133333 0.229516 -0.528166 2.944102 0.124533 -0.456365 3.482088
2.166667 0.233658 -0.543488 3.066385 0.123964 -0.463533 3.093133
2.200000 0.237779 -0.559135 -3.066848 0.123418 -0.470502 2.861029
2.233333 0.241888 -0.574968 -3.018569 0.122882 -0.477291 2.783790
2.266667 0.245980 -0.591024 -2.982158 0.122338 -0.483923 2.841824
2.300000 0.250052 -0.607300 -2.965545 0.121768 -0.490435 2.994726
2.333333 0.254107 -0.623797 -2.944430 0.121155 -0.496852 3.202237
2.366667 0.258146 -0.640471 -2.830570 0.120482 -0.503195 3.440269
2.400000 0.262168 -0.657365 -2.677635 0.119732 -0.509494 3.679826
2.433333 0.266172 -0.674431 -2.467462 0.118890 -0.515762 3.888498
2.466667 0.270150 -0.691724 -2.305105 0.117945 -0.522006 4.042417
2.500000 0.274108 -0.709185 -2.154469 0.116885 -0.528234 4.128144
2.533333 0.278025 -0.726879 -1.961156 0.115698 -0.534453 4.129325
2.566667 0.281892 -0.744811 -1.800929 0.114374 -0.540669 4.037102
2.600000 0.285698 -0.762986 -1.650920 0.112911 -0.546868 3.848825
2.633333 0.289481 -0.781315 -1.536594 0.111316 -0.553035 3.578920
2.666667 0.293185 -0.799888 -1.429248 0.109591 -0.559162 3.240848
2.700000 0.296864 -0.818608 -1.322309 0.107743 -0.565231 2.842932
2.733333 0.300450 -0.837566 -1.216842 0.105786 -0.571222 2.401874
2.766667 0.303939 -0.856755 -1.115709 0.103746 -0.577105 1.927192
2.800000 0.307402 -0.876082 -1.067116 0.101636 -0.582870 1.431291
2.833333 0.310767 -0.895629 -1.019893 0.099477 -0.588496 0.920669
2.866667 0.314037 -0.915390 -0.979317 0.097293 -0.593957 0.406113
2.900000 0.317215 -0.935358 -0.967594 0.095118 -0.599219 -0.091759
2.933333 0.320364 -0.955447 -0.987676 0.092980 -0.604257 -0.554998
2.966667 0.323424 -0.975721 -1.030254 0.090895 -0.609055 -0.966666
3.000000 0.326397 -0.996172 -1.102518 0.088888 -0.613583 -1.311725
3.033333 0.329285 -1.016788 -1.200229 0.086979 -0.617824 -1.574504
3.066667 0.332090 -1.037554 -1.286051 0.085184 -0.621761 -1.743456
3.100000 0.334868 -1.058419 -1.360797 0.083508 -0.625393 -1.820068
3.133333 0.337617 -1.079378 -1.456042 0.081954 -0.628715 -1.809921
3.166667 0.340297 -1.100452 -1.535621 0.080527 -0.631722 -1.719310
3.200000 0.342914 -1.121628 -1.611057 0.079227 -0.634415 -1.563190
3.233333 0.345504 -1.142885 -1.657793 0.078051 -0.636799 -1.361483
3.266667 0.348066 -1.164218 -1.692350 0.076991 -0.638878 -1.132966
3.300000 0.350602 -1.185621 -1.734904 0.076046 -0.640653 -0.887412
3.333333 0.353100 -1.207077 -1.744320 0.075215 -0.642125 -0.638993
3.366667 0.355570 -1.228572 -1.750653 0.074498 -0.643296 -0.400565
3.400000 0.358016 -1.250094 -1.750341 0.073885 -0.644176 -0.180095
3.433333 0.360444 -1.271635 -1.755185 0.073368 -0.644784 0.020718
3.466667 0.362846 -1.293223 -1.755088 0.072943 -0.645132 0.199256
3.500000 0.365242 -1.314805 -1.734249 0.072600 -0.645242 0.347753
3.533333 0.367635 -1.336371 -1.719629 0.072331 -0.645129 0.466066
3.566667 0.370030 -1.357912 -1.695878 0.072126 -0.644808 0.551921
3.600000 0.372432 -1.379416 -1.667468 0.071981 -0.644289 0.605680
3.633333 0.374844 -1.400875 -1.629029 0.071891 -0.643572 0.622840
3.666667 0.377231 -1.422352 -1.603364 0.071854 -0.642655 0.601693
3.700000 0.379634 -1.443768 -1.563156 0.071861 -0.641545 0.547323
3.733333 0.382013 -1.465194 -1.541170 0.071901 -0.640255 0.479566
3.766667 0.384368 -1.486625 -1.516814 0.071966 -0.638795 0.427122
3.800000 0.386744 -1.507973 -1.508342 0.072052 -0.637170 0.422601
3.833333 0.389139 -1.529232 -1.488602 0.072149 -0.635398 0.497445
3.866667 0.391555 -1.550396 -1.500878 0.072245 -0.633508 0.681007
3.900000 0.393992 -1.571458 -1.511753 0.072334 -0.631519 0.990269
3.933333 0.396407 -1.592505 -1.525703 0.072414 -0.629445 1.404131
3.966667 0.398839 -1.613439 -1.553386 0.072472 -0.627321 1.888699
4.000000 0.401289 -1.634260 -1.594440 0.072500 -0.625177 2.398345
4.033333 0.403717 -1.655053 -1.576414 0.072492 -0.623040 2.890316
4.066667 0.406121 -1.675816 -1.405268 0.072447 -0.620917 3.302293
4.100000 0.408539 -1.696469 -1.152316 0.072358 -0.618820 3.574466
4.133333 0.410934 -1.717084 -0.858889 0.072220 -0.616758 3.672479
4.166667 0.413341 -1.737606 -0.623312 0.072035 -0.614727 3.572008
4.200000 0.415758 -1.758043 -0.425163 0.071801 -0.612715 3.259248
4.233333 0.418184 -1.778405 -0.275521 0.071514 -0.610716 2.732802
4.266667 0.420585 -1.798715 -0.217447 0.071170 -0.608731 2.041643
4.300000 0.422963 -1.818969 -0.160040 0.070769 -0.606751 1.247201
4.333333 0.425338 -1.839168 -0.136365 0.070309 -0.604767 0.416004
4.366667 0.427689 -1.859306 -0.133579 0.069791 -0.602766 -0.393476
4.400000 0.430016 -1.879377 -0.222693 0.069221 -0.600740 -1.120291
4.433333 0.432317 -1.899380 -0.344238 0.068606 -0.598669 -1.717657
4.466667 0.434593 -1.919311 -0.468197 0.067959 -0.596536 -2.176755
4.500000 0.436851 -1.939184 -0.582932 0.067288 -0.594324 -2.492693
4.533333 0.439084 -1.958979 -0.705939 0.066603 -0.592016 -2.674305
4.566667 0.441295 -1.978705 -0.819361 0.065915 -0.589598 -2.728820
4.600000 0.443480 -1.998347 -0.904567 0.065233 -0.587055 -2.681667
4.633333 0.445639 -2.017901 -1.019518 0.064564 -0.584372 -2.554617
4.666667 0.447777 -2.037369 -1.104291 0.063917 -0.581532 -2.366335
4.700000 0.449894 -2.056744 -1.185560 0.063295 -0.578525 -2.139707
4.733333 0.451984 -2.076022 -1.250343 0.062705 -0.575340 -1.894084
4.766667 0.454046 -2.095199 -1.321365 0.062147 -0.571972 -1.645366
4.800000 0.456094 -2.114261 -1.365792 0.061619 -0.568422 -1.396008
4.833333 0.458127 -2.133199 -1.392054 0.061116 -0.564700 -1.151616
4.866667 0.460148 -2.152006 -1.420561 0.060628 -0.560825 -0.908387
4.900000 0.462157 -2.170674 -1.438556 0.060147 -0.556809 -0.657314
4.933333 0.464157 -2.189195 -1.459062 0.059661 -0.552677 -0.383878
4.966667 0.466149 -2.207560 -1.471167 0.059157 -0.548450 -0.075625
5.000000 0.468133 -2.225760 -1.477583 0.058626 -0.544152 0.279131
5.033333 0.470088 -2.243837 -1.484171 0.058062 -0.539793 0.689015
5.066667 0.472038 -2.261732 -1.483733 0.057462 -0.535382 1.150909
5.100000 0.473959 -2.279498 -1.470621 0.056827 -0.530929 1.642642
5.133333 0.475848 -2.297134 -1.439455 0.056158 -0.526436 2.129267
5.166667 0.477707 -2.314636 -1.377814 0.055462 -0.521900 2.567171
5.200000 0.479535 -2.332003 -1.283507 0.054750 -0.517308 2.905980
5.233333 0.481356 -2.349163 -1.132530 0.054024 -0.512664 3.099676
5.266667 0.483146 -2.366182 -0.942861 0.053287 -0.507969 3.105049
5.300000 0.484903 -2.383059 -0.732683 0.052538 -0.503225 2.901842
5.333333 0.486628 -2.399792 -0.512379 0.051771 -0.498438 2.482392
5.366667 0.488341 -2.416336 -0.342496 0.050977 -0.493620 1.856256
5.400000 0.490041 -2.432698 -0.212220 0.050138 -0.488791 1.053775
5.433333 0.491723 -2.448887 -0.201885 0.049242 -0.483957 0.118077
5.466667 0.493372 -2.464923 -0.234959 0.048276 -0.479127 -0.889674
5.500000 0.494987 -2.480805 -0.336257 0.047226 -0.474306 -1.907333
5.533333 0.496570 -2.496530 -0.468565 0.046084 -0.469496 -2.875912
5.566667 0.498118 -2.512097 -0.604772 0.044838 -0.464692 -3.741103
5.600000 0.499631 -2.527504 -0.796781 0.043489 -0.459881 -4.470650
5.633333 0.501086 -2.542760 -1.004187 0.042034 -0.455049 -5.049818
5.666667 0.502471 -2.557865 -1.214501 0.040469 -0.450179 -5.483286
5.700000 0.503821 -2.572805 -1.478108 0.038794 -0.445261 -5.780783
5.733333 0.505083 -2.587587 -1.663678 0.037003 -0.440289 -5.959886
5.766667 0.506309 -2.602202 -1.886647 0.035102 -0.435270 -6.038489
5.800000 0.507499 -2.616648 -2.078939 0.033086 -0.430219 -6.027572
5.833333 0.508579 -2.630921 -2.266897 0.030962 -0.425157 -5.926002
5.866667 0.509623 -2.645021 -2.488352 0.028744 -0.420116 -5.717871
5.900000 0.510553 -2.658935 -2.676901 0.026459 -0.415114 -5.399173
5.933333 0.511447 -2.672673 -2.886902 0.024134 -0.410167 -4.947864
5.966667 0.512231 -2.686209 -3.096918 0.021805 -0.405277 -4.345989
6.000000 0.512912 -2.699536 2.983035 0.019521 -0.400439 -3.581783
6.033333 0.513490 -2.712753 2.846956 0.017318 -0.395641 -2.660168
6.066667 0.513972 -2.725857 2.702792 0.015238 -0.390855 -1.612162
6.100000 0.514371 -2.738842 2.593876 0.013306 -0.386055 -0.468879
6.133333 0.514699 -2.751705 2.549712 0.011551 -0.381198 0.711973
6.166667 0.514994 -2.764385 2.603431 0.009983 -0.376251 1.856624
6.200000 0.515258 -2.776880 2.746236 0.008597 -0.371176 2.892174
6.233333 0.515489 -2.789189 2.947482 0.007383 -0.365950 3.753894
6.266667 0.515691 -2.801377 -3.109206 0.006319 -0.360553 4.396252
6.300000 0.515876 -2.813340 -2.823314 0.005379 -0.354987 4.781644
6.333333 0.516031 -2.825113 -2.571137 0.004531 -0.349268 4.899160
6.366667 0.516157 -2.836696 -2.280310 0.003748 -0.343414 4.760052
6.400000 0.516267 -2.848062 -2.075234 0.003008 -0.337447 4.398025
6.433333 0.516357 -2.859216 -1.905481 0.002294 -0.331386 3.856785
6.466667 0.516421 -2.870176 -1.810534 0.001591 -0.325252 3.189530
6.500000 0.516462 -2.880922 -1.764286 0.000890 -0.319047 2.458088
6.533333 0.516481 -2.891451 -1.733616 0.000180 -0.312763 1.708808
6.566667 0.516475 -2.901784 -1.696952 -0.000551 -0.306392 0.988531
6.600000 0.516448 -2.911889 -1.682643 -0.001312 -0.299923 0.323185
6.633333 0.516398 -2.921797 -1.680442 -0.002117 -0.293333 -0.274579
6.666667 0.516327 -2.931508 -1.717478 -0.002978 -0.286606 -0.807592
6.700000 0.516235 -2.941021 -1.802459 -0.003898 -0.279738 -1.281635
6.733333 0.516111 -2.950276 -1.872603 -0.004874 -0.272741 -1.692389
6.766667 0.515967 -2.959332 -1.934456 -0.005906 -0.265617 -2.041207
6.800000 0.515779 -2.968113 -1.974749 -0.006988 -0.258377 -2.329580
6.833333 0.515539 -2.976613 -2.032617 -0.008106 -0.251046 -2.549908
6.866667 0.515241 -2.984829 -2.163281 -0.009248 -0.243641 -2.690239
6.900000 0.514927 -2.992846 -2.308696 -0.010405 -0.236167 -2.750833
6.933333 0.514545 -3.000568 -2.421529 -0.011571 -0.228620 -2.741318
6.966667 0.514093 -3.007994 -2.566171 -0.012725 -0.221015 -2.667865
7.000000 0.513628 -3.015222 -2.695449 -0.013848 -0.213365 -2.535429
7.033333 0.513153 -3.022253 -2.774371 -0.014925 -0.205680 -2.365055
7.066667 0.512668 -3.029086 -2.826107 -0.015941 -0.197973 -2.182748
7.100000 0.512122 -3.035621 -2.892567 -0.016875 -0.190282 -2.004377
7.133333 0.511523 -3.041856 -2.929813 -0.017705 -0.182645 -1.838840
7.166667 0.510880 -3.047794 -2.958569 -0.018421 -0.175100 -1.700751
7.200000 0.510202 -3.053436 -2.995031 -0.019012 -0.167690 -1.598530
7.233333 0.509501 -3.058785 -3.027349 -0.019463 -0.160468 -1.519717
7.266667 0.508798 -3.063943 -3.057575 -0.019762 -0.153480 -1.448864
7.300000 0.508094 -3.068811 -3.103379 -0.019908 -0.146757 -1.377652
7.333333 0.507391 -3.073493 3.124291 -0.019903 -0.140321 -1.301033
7.366667 0.506698 -3.077997 2.997887 -0.019755 -0.134172 -1.204607
7.400000 0.506010 -3.082316 2.914744 -0.019477 -0.128296 -1.082871
7.433333 0.505347 -3.086463 2.878006 -0.019086 -0.122660 -0.940853
7.466667 0.504715 -3.090440 2.880759 -0.018598 -0.117231 -0.786639
7.500000 0.504090 -3.094238 2.878946 -0.018030 -0.111969 -0.624600
7.533333 0.503498 -3.097871 2.885913 -0.017393 -0.106840 -0.461636
7.566667 0.502917 -3.101329 2.879036 -0.016694 -0.101821 -0.316590
7.600000 0.502347 -3.104614 2.877175 -0.015939 -0.096898 -0.198795
7.633333 0.501815 -3.107742 2.877532 -0.015134 -0.092059 -0.112051
