t x y theta dxdt dydt dthetadt
0.000000 0.000000 0.000000 -0.481456 0.012424 0.000219 0.005481
0.033333 0.000792 -0.000027 -0.492794 0.017108 0.000560 0.006771
0.066667 0.002102 -0.000056 -0.478092 0.021682 0.000987 0.009646
0.100000 0.003200 -0.000014 -0.492627 0.026356 0.001486 0.013600
0.133333 0.004022 0.000052 -0.479940 0.031466 0.002043 0.017787
0.166667 0.004681 0.000115 -0.482704 0.037455 0.002659 0.020177
0.200000 0.005307 0.000235 -0.476192 0.044731 0.003331 0.021335
0.233333 0.005966 0.000369 -0.484704 0.053688 0.004052 0.022261
0.266667 0.007255 0.000505 -0.474865 0.064811 0.004807 0.023335
0.300000 0.009195 0.000642 -0.474265 0.078569 0.005602 0.025728
0.333333 0.011412 0.000826 -0.473025 0.095325 0.006442 0.034682
0.366667 0.014319 0.001012 -0.481200 0.115226 0.007313 0.054818
0.400000 0.017821 0.001288 -0.467097 0.138363 0.008204 0.089014
0.433333 0.022053 0.001567 -0.481185 0.164726 0.009109 0.135879
0.466667 0.027033 0.001849 -0.480958 0.194262 0.010016 0.195745
0.500000 0.033309 0.002251 -0.479518 0.226827 0.010876 0.265193
0.533333 0.040371 0.002656 -0.481784 0.262279 0.011646 0.339554
0.566667 0.048236 0.003064 -0.461759 0.300778 0.012279 0.408917
0.600000 0.058426 0.003492 -0.451045 0.342390 0.012735 0.469793
0.633333 0.071375 0.004001 -0.432329 0.387062 0.012968 0.517054
0.666667 0.085173 0.004514 -0.400397 0.434432 0.012951 0.548352
0.700000 0.099833 0.005032 -0.350665 0.484106 0.012692 0.561805
0.733333 0.115367 0.005554 -0.318004 0.535727 0.012194 0.553695
0.766667 0.131787 0.006080 -0.294864 0.588651 0.011477 0.528570
0.800000 0.151724 0.006497 -0.288291 0.642378 0.010544 0.485398
0.833333 0.175170 0.006827 -0.292104 0.696594 0.009398 0.430827
0.866667 0.199526 0.007162 -0.276558 0.751265 0.008020 0.367095
0.900000 0.227204 0.007319 -0.263854 0.806049 0.006397 0.301086
0.933333 0.255799 0.007482 -0.249105 0.860604 0.004520 0.239247
0.966667 0.285310 0.007653 -0.246014 0.914545 0.002389 0.183466
1.000000 0.315739 0.007831 -0.230444 0.967642 0.000024 0.135159
1.033333 0.349043 0.007914 -0.231913 1.019612 -0.002525 0.090469
1.066667 0.383261 0.008006 -0.238940 1.070076 -0.005176 0.051669
1.100000 0.419857 0.007948 -0.233756 1.119007 -0.007863 0.017407
1.133333 0.458559 0.007623 -0.250075 1.166282 -0.010493 -0.011256
1.166667 0.499167 0.007063 -0.242587 1.211888 -0.012969 -0.035369
1.200000 0.541427 0.006351 -0.239243 1.255602 -0.015176 -0.051229
1.233333 0.585120 0.005578 -0.241096 1.297371 -0.017026 -0.058436
1.266667 0.629684 0.004824 -0.246162 1.337139 -0.018444 -0.060287
1.300000 0.675106 0.004088 -0.248999 1.374983 -0.019378 -0.059279
1.333333 0.721922 0.003293 -0.266273 1.411132 -0.019817 -0.058176
1.366667 0.769572 0.002521 -0.275782 1.445826 -0.019793 -0.053889
1.400000 0.818425 0.001833 -0.263588 1.479315 -0.019382 -0.049559
1.433333 0.868085 0.001171 -0.252531 1.511747 -0.018664 -0.042053
1.466667 0.918566 0.000527 -0.256066 1.543308 -0.017752 -0.030752
1.500000 0.970649 -0.000087 -0.255072 1.573912 -0.016734 -0.014685
1.533333 1.024266 -0.000629 -0.250075 1.603402 -0.015692 0.005400
1.566667 1.078839 -0.001151 -0.274514 1.631621 -0.014705 0.026984
1.600000 1.134095 -0.001521 -0.268504 1.658483 -0.013835 0.049030
1.633333 1.190562 -0.001930 -0.274995 1.683807 -0.013145 0.071048
1.666667 1.247720 -0.002299 -0.280059 1.707411 -0.012650 0.093098
1.700000 1.305267 -0.002647 -0.259553 1.729284 -0.012384 0.113624
1.733333 1.363468 -0.002951 -0.248924 1.749500 -0.012367 0.132374
1.766667 1.422302 -0.003212 -0.237378 1.768175 -0.012579 0.145324
1.800000 1.481777 -0.003665 -0.230561 1.785386 -0.012965 0.156226
1.833333 1.541845 -0.004070 -0.231097 1.801339 -0.013457 0.161445
1.866667 1.602486 -0.004426 -0.223433 1.816241 -0.014003 0.159557
1.900000 1.663502 -0.004996 -0.211593 1.830256 -0.014500 0.154623
1.933333 1.725049 -0.005513 -0.222805 1.843486 -0.014847 0.148400
1.966667 1.786826 -0.006127 -0.211601 1.856012 -0.014945 0.145647
2.000000 1.849092 -0.006682 -0.206320 1.867924 -0.014745 0.143342
2.033333 1.911434 -0.007345 -0.203893 1.879307 -0.014179 0.143461
2.066667 1.974223 -0.007945 -0.203159 1.890256 -0.013182 0.149485
2.100000 2.037441 -0.008481 -0.197380 1.900834 -0.011758 0.156973
2.133333 2.101065 -0.008950 -0.178394 1.911107 -0.009913 0.165180
2.166667 2.165075 -0.009349 -0.187666 1.921132 -0.007676 0.173606
2.200000 2.229394 -0.009655 -0.186734 1.930970 -0.005042 0.182654
2.233333 2.293999 -0.009817 -0.160812 1.940565 -0.002065 0.192660
2.266667 2.358925 -0.009903 -0.173374 1.949857 0.001202 0.201853
2.300000 2.423995 -0.009833 -0.152892 1.958797 0.004755 0.213239
2.333333 2.489342 -0.009682 -0.142313 1.967327 0.008610 0.224497
2.366667 2.555280 -0.009308 -0.151334 1.975342 0.012758 0.234742
2.400000 2.621451 -0.008851 -0.132631 1.982759 0.017194 0.242552
2.433333 2.687831 -0.008309 -0.133918 1.989571 0.021981 0.248355
2.466667 2.754398 -0.007681 -0.116668 1.995795 0.027232 0.248976
2.500000 2.821294 -0.006780 -0.107627 2.001429 0.033002 0.241418
2.533333 2.888363 -0.005612 -0.103417 2.006518 0.039345 0.230355
2.566667 2.955550 -0.004353 -0.087618 2.011182 0.046357 0.211636
2.600000 3.022833 -0.003004 -0.078789 2.015475 0.054092 0.184388
2.633333 3.090056 -0.001240 -0.050425 2.019462 0.062585 0.145463
2.666667 3.157204 0.000868 -0.069827 2.023177 0.071757 0.099493
2.700000 3.224377 0.003069 -0.062118 2.026679 0.081580 0.049396
2.733333 3.291962 0.005672 -0.059233 2.029931 0.091933 -0.007968
2.766667 3.359832 0.008811 -0.064162 2.032838 0.102645 -0.066018
2.800000 3.427921 0.012587 -0.060218 2.035319 0.113525 -0.120548
2.833333 3.495941 0.016453 -0.064294 2.037207 0.124300 -0.165327
2.866667 3.564233 0.021110 -0.062244 2.038304 0.134723 -0.203398
2.900000 3.632406 0.025852 -0.081080 2.038399 0.144533 -0.233809
2.933333 3.700437 0.030676 -0.117669 2.037379 0.153567 -0.251170
2.966667 3.768847 0.036628 -0.124239 2.035136 0.161646 -0.255118
3.000000 3.837065 0.042655 -0.136044 2.031701 0.168777 -0.244901
3.033333 3.905066 0.048755 -0.127442 2.027252 0.175097 -0.224328
3.066667 3.972824 0.054923 -0.136579 2.022105 0.180899 -0.190224
3.100000 4.040315 0.061155 -0.148526 2.016641 0.186517 -0.144788
3.133333 4.107515 0.067447 -0.169148 2.011207 0.192260 -0.095237
3.166667 4.174398 0.073795 -0.164658 2.006259 0.198595 -0.045919
3.200000 4.240941 0.080195 -0.170634 2.002038 0.205761 0.000282
3.233333 4.307118 0.086643 -0.163148 1.998611 0.213854 0.043299
3.266667 4.372905 0.093133 -0.156932 1.995875 0.222795 0.078813
3.300000 4.438279 0.099663 -0.138543 1.993599 0.232421 0.103286
3.333333 4.504355 0.107308 -0.145051 1.991453 0.242478 0.119798
3.366667 4.571016 0.115843 -0.130084 1.988891 0.252512 0.127014
3.400000 4.637998 0.125086 -0.124762 1.985378 0.262077 0.127545
3.433333 4.705249 0.134847 -0.111352 1.980419 0.270728 0.119434
3.466667 4.771957 0.144616 -0.120954 1.973571 0.278055 0.108608
3.500000 4.838604 0.154620 -0.111699 1.964313 0.283639 0.100238
3.533333 4.904653 0.164617 -0.117112 1.952187 0.287206 0.093665
3.566667 4.970078 0.174597 -0.106284 1.936951 0.288642 0.094783
3.600000 5.034851 0.184552 -0.114941 1.918533 0.288008 0.098587
3.633333 5.098945 0.194475 -0.114627 1.896961 0.285504 0.110345
3.666667 5.162335 0.204357 -0.104920 1.872082 0.281336 0.123478
3.700000 5.224994 0.214191 -0.121425 1.844030 0.275815 0.138313
3.733333 5.286732 0.223640 -0.088926 1.813128 0.269271 0.151453
3.766667 5.347866 0.232697 -0.098692 1.779599 0.261991 0.160920
3.800000 5.407998 0.241406 -0.081370 1.743267 0.254159 0.169653
3.833333 5.466093 0.249647 -0.071565 1.704010 0.245921 0.172749
3.866667 5.521745 0.257322 -0.063474 1.661926 0.237490 0.173563
3.900000 5.576523 0.264907 -0.049638 1.616602 0.228976 0.166707
3.933333 5.630408 0.272397 -0.064563 1.567469 0.220399 0.158929
3.966667 5.683380 0.279785 -0.050713 1.513990 0.211720 0.146094
4.000000 5.732783 0.286546 -0.051251 1.456494 0.202984 0.128249
4.033333 5.781239 0.293195 -0.044636 1.395111 0.194174 0.106072
4.066667 5.828732 0.299728 -0.042133 1.329764 0.185159 0.077546
4.100000 5.875249 0.306140 -0.038135 1.261125 0.175906 0.043467
4.133333 5.916747 0.311911 -0.025252 1.190215 0.166452 -0.005899
4.166667 5.957246 0.317552 -0.024041 1.117732 0.156796 -0.068699
4.200000 5.992673 0.322587 -0.023107 1.043955 0.146868 -0.143970
4.233333 6.022644 0.326910 -0.028233 0.969636 0.136680 -0.223548
4.266667 6.051605 0.331095 -0.035675 0.896124 0.126377 -0.298100
4.300000 6.079559 0.335138 -0.046947 0.824316 0.116017 -0.357863
4.333333 6.106510 0.339038 -0.049495 0.754399 0.105547 -0.388105
4.366667 6.132461 0.342794 -0.065498 0.687182 0.095032 -0.381343
4.400000 6.152588 0.345614 -0.091243 0.623439 0.084556 -0.335987
4.433333 6.171729 0.348286 -0.138763 0.563200 0.074107 -0.260466
4.466667 6.189894 0.350810 -0.197714 0.506089 0.063608 -0.163839
4.500000 6.203347 0.352382 -0.238257 0.452288 0.053100 -0.054625
4.533333 6.215851 0.353807 -0.225380 0.402382 0.042719 0.055840
4.566667 6.227423 0.355084 -0.169164 0.356643 0.032566 0.154811
4.600000 6.238078 0.356215 -0.113947 0.314824 0.022672 0.230937
4.633333 6.246846 0.356749 -0.092130 0.277124 0.013155 0.281307
4.666667 6.254305 0.356816 -0.069063 0.243775 0.004158 0.301873
4.700000 6.260874 0.356563 -0.053656 0.214130 -0.004286 0.295139
4.733333 6.266906 0.356030 -0.034404 0.187569 -0.012260 0.266728
4.766667 6.272115 0.355362 -0.037790 0.163464 -0.019863 0.230659
4.800000 6.276523 0.354560 -0.051879 0.141613 -0.027142 0.204383
4.833333 6.281158 0.353341 -0.076949 0.121565 -0.034193 0.197384
4.866667 6.285031 0.351996 -0.077037 0.102890 -0.041272 0.218123
4.900000 6.288161 0.350529 -0.069198 0.085548 -0.048623 0.265195
4.933333 6.290568 0.348943 -0.072125 0.069457 -0.056394 0.338338
4.966667 6.292274 0.347243 -0.058339 0.054619 -0.064816 0.428737
5.000000 6.293298 0.345432 -0.056767 0.041035 -0.074119 0.526281
5.033333 6.293661 0.343516 -0.013451 0.028956 -0.084542 0.620167
5.066667 6.294468 0.340270 0.021723 0.018451 -0.096045 0.705980
5.100000 6.294656 0.336928 0.058410 0.009590 -0.108571 0.779328
5.133333 6.294244 0.333497 0.092434 0.002404 -0.122007 0.830327
5.166667 6.293252 0.329983 0.120980 -0.003248 -0.136075 0.853793
5.200000 6.292859 0.325134 0.134586 -0.007536 -0.150378 0.844259
5.233333 6.291927 0.320217 0.165899 -0.010714 -0.164495 0.802066
5.266667 6.291520 0.314196 0.204631 -0.012982 -0.178106 0.725035
5.300000 6.291654 0.307121 0.241175 -0.014550 -0.190749 0.613483
5.333333 6.291302 0.300005 0.275775 -0.015688 -0.201986 0.473317
5.366667 6.290482 0.292858 0.304725 -0.016580 -0.211464 0.312911
5.400000 6.290021 0.284975 0.335788 -0.017345 -0.218918 0.139345
5.433333 6.289126 0.277084 0.338825 -0.018101 -0.224083 -0.036583
5.466667 6.288696 0.268831 0.321633 -0.018817 -0.226689 -0.208104
5.500000 6.287865 0.260592 0.293412 -0.019385 -0.226645 -0.362134
5.533333 6.287517 0.252526 0.259349 -0.019692 -0.223903 -0.490197
5.566667 6.286797 0.244499 0.212412 -0.019591 -0.218309 -0.588475
5.600000 6.285719 0.236524 0.203093 -0.018993 -0.209896 -0.653711
5.633333 6.285230 0.229369 0.152653 -0.017887 -0.198763 -0.686372
5.666667 6.284411 0.222290 0.114039 -0.016339 -0.185158 -0.686608
5.700000 6.283276 0.215296 0.107195 -0.014546 -0.169409 -0.665461
5.733333 6.282861 0.209483 0.094864 -0.012642 -0.151916 -0.630165
5.766667 6.282156 0.203778 0.085324 -0.010837 -0.133323 -0.590185
5.800000 6.282010 0.199476 0.057370 -0.009404 -0.114263 -0.549949
5.833333 6.282336 0.196744 0.045855 -0.008521 -0.095364 -0.521093
5.866667 6.282404 0.194145 0.018286 -0.008375 -0.077202 -0.506699
5.900000 6.282673 0.192986 0.002336 -0.009132 -0.060374 -0.503141
5.933333 6.282706 0.191973 -0.007020 -0.010824 -0.045348 -0.507027
5.966667 6.282511 0.191112 -0.009954 -0.013440 -0.032442 -0.508355
6.000000 6.282143 0.190919 -0.023857 -0.016740 -0.021796 -0.499131
6.033333 6.281589 0.191087 -0.042795 -0.020438 -0.013389 -0.468265
6.066667 6.280858 0.191350 -0.055733 -0.024247 -0.007149 -0.415813
6.100000 6.279917 0.191524 -0.081104 -0.027801 -0.002746 -0.339809
6.133333 6.278682 0.191469 -0.118840 -0.030835 0.000148 -0.242570
