t x y theta dxdt dydt dthetadt
0.000000 0.000000 0.000000 -0.058755 -0.001100 0.001353 -0.001778
0.033333 -0.000204 0.000078 -0.046215 0.002865 0.001876 -0.004052
0.066667 -0.001116 -0.000105 -0.049230 0.008558 0.002249 -0.012254
0.100000 -0.001467 -0.000124 -0.056898 0.016690 0.002349 -0.028500
0.133333 -0.001240 0.000027 -0.054542 0.028036 0.002123 -0.059317
0.166667 -0.000418 0.000353 -0.064512 0.043364 0.001520 -0.111132
0.200000 -0.000002 0.000453 -0.059412 0.063859 0.000557 -0.184607
0.233333 0.001042 0.000737 -0.057109 0.090363 -0.000788 -0.283251
0.266667 0.002330 0.000690 -0.045199 0.123812 -0.002523 -0.408491
0.300000 0.004280 0.000838 -0.044910 0.164689 -0.004404 -0.554324
0.333333 0.008000 0.000752 -0.074370 0.213342 -0.006191 -0.709603
0.366667 0.014491 0.000380 -0.084862 0.270081 -0.007590 -0.863983
0.400000 0.021688 0.000228 -0.106465 0.334335 -0.008192 -1.008086
0.433333 0.034006 -0.000599 -0.166620 0.405201 -0.007355 -1.127766
0.466667 0.047052 -0.001186 -0.221331 0.481324 -0.004595 -1.208547
0.500000 0.060831 -0.001524 -0.291325 0.561275 0.000367 -1.243391
0.533333 0.080469 -0.002428 -0.355860 0.643475 0.007854 -1.232790
0.566667 0.103984 -0.003763 -0.422339 0.726195 0.018206 -1.174355
0.600000 0.131143 -0.004175 -0.476936 0.807856 0.031512 -1.070338
0.633333 0.162469 -0.003118 -0.507944 0.887049 0.047446 -0.932741
0.666667 0.194512 -0.001751 -0.526846 0.962884 0.065778 -0.775301
0.700000 0.228952 0.000117 -0.543320 1.034521 0.086278 -0.612930
0.733333 0.264794 0.003277 -0.560415 1.101630 0.108429 -0.454030
0.766667 0.304549 0.007378 -0.565369 1.164005 0.131445 -0.311623
0.800000 0.344962 0.011819 -0.560765 1.222145 0.154745 -0.195023
0.833333 0.387667 0.017462 -0.556442 1.276889 0.178001 -0.106572
0.866667 0.432187 0.024072 -0.548680 1.328541 0.200856 -0.044864
0.900000 0.477899 0.031980 -0.538428 1.377424 0.222866 -0.006539
0.933333 0.524178 0.040246 -0.541412 1.423624 0.243838 0.010701
0.966667 0.571000 0.048871 -0.537247 1.467795 0.263891 0.011173
1.000000 0.621213 0.057896 -0.535856 1.509929 0.283126 0.002335
1.033333 0.674066 0.068064 -0.551358 1.549827 0.301624 -0.010679
1.066667 0.727378 0.078600 -0.535230 1.587656 0.319512 -0.027445
1.100000 0.781120 0.089503 -0.537005 1.623714 0.337094 -0.043624
1.133333 0.837096 0.101029 -0.545451 1.658096 0.354755 -0.059255
1.166667 0.893436 0.112924 -0.554082 1.690022 0.372859 -0.070281
1.200000 0.950572 0.125555 -0.548175 1.718813 0.391747 -0.078565
1.233333 1.008054 0.138748 -0.569999 1.744009 0.411804 -0.081921
1.266667 1.065441 0.151934 -0.551229 1.765120 0.433422 -0.077461
1.300000 1.125885 0.166346 -0.565645 1.781379 0.456856 -0.062878
1.333333 1.187991 0.182074 -0.552489 1.792155 0.482301 -0.039211
1.366667 1.250249 0.198162 -0.567429 1.797324 0.509687 -0.007699
1.400000 1.312620 0.214607 -0.570244 1.797230 0.538786 0.030267
1.433333 1.375066 0.231403 -0.585058 1.791792 0.569599 0.070846
1.466667 1.436924 0.250047 -0.583704 1.780928 0.601939 0.113269
1.500000 1.497165 0.271046 -0.583973 1.764853 0.635770 0.152882
1.533333 1.554374 0.294121 -0.563853 1.744329 0.670647 0.189717
1.566667 1.611505 0.317507 -0.545367 1.719769 0.706612 0.218699
1.600000 1.668525 0.341195 -0.527973 1.691306 0.743820 0.240607
1.633333 1.725401 0.365172 -0.508697 1.659580 0.781884 0.251722
1.666667 1.780581 0.392564 -0.510178 1.625140 0.820976 0.250349
1.700000 1.835549 0.420216 -0.504679 1.588664 0.861179 0.234000
1.733333 1.890274 0.448112 -0.507500 1.550084 0.903050 0.206724
1.766667 1.941663 0.479398 -0.488379 1.509654 0.946549 0.176631
1.800000 1.992747 0.510889 -0.480048 1.467302 0.991813 0.143773
1.833333 2.039715 0.544683 -0.455748 1.423020 1.039066 0.110880
1.866667 2.086326 0.578636 -0.474314 1.376895 1.087841 0.081002
1.900000 2.129958 0.616547 -0.484203 1.329051 1.137362 0.060992
1.933333 2.173186 0.654566 -0.471695 1.279665 1.186998 0.048868
1.966667 2.215990 0.692664 -0.469490 1.228719 1.236529 0.037432
2.000000 2.256579 0.737323 -0.475979 1.176808 1.285055 0.031743
2.033333 2.296700 0.782000 -0.484884 1.123653 1.332184 0.037033
2.066667 2.336336 0.826663 -0.501862 1.068860 1.377822 0.048989
2.100000 2.371060 0.874955 -0.462593 1.011903 1.422215 0.059791
2.133333 2.401362 0.925315 -0.463431 0.952844 1.464294 0.070350
2.166667 2.431137 0.975538 -0.474434 0.892092 1.503156 0.084263
2.200000 2.460380 1.025585 -0.473388 0.829883 1.538535 0.092911
2.233333 2.489085 1.075415 -0.454418 0.767410 1.569356 0.091202
2.266667 2.514856 1.128548 -0.455338 0.706400 1.593671 0.080355
2.300000 2.537616 1.183472 -0.470816 0.648489 1.608926 0.066643
2.333333 2.557557 1.240736 -0.430072 0.594925 1.614098 0.044642
2.366667 2.574034 1.299467 -0.429706 0.546956 1.606232 0.011808
2.400000 2.588786 1.357899 -0.454215 0.505819 1.581080 -0.030062
2.433333 2.602192 1.415970 -0.436673 0.472262 1.535200 -0.082539
2.466667 2.613417 1.466957 -0.439270 0.446391 1.467435 -0.145457
2.500000 2.624680 1.523006 -0.462614 0.427978 1.377659 -0.222166
2.533333 2.636234 1.576180 -0.461369 0.416530 1.265680 -0.306425
2.566667 2.649161 1.624788 -0.449665 0.410832 1.134471 -0.397586
2.600000 2.663264 1.666008 -0.470633 0.409260 0.990123 -0.492464
2.633333 2.677936 1.697915 -0.483128 0.410256 0.837610 -0.585155
2.666667 2.692153 1.729044 -0.497581 0.412315 0.679977 -0.670711
2.700000 2.706646 1.747143 -0.534731 0.414252 0.521346 -0.742424
2.733333 2.721504 1.748230 -0.584512 0.415134 0.366592 -0.796023
2.766667 2.735960 1.748519 -0.609637 0.414636 0.218765 -0.822395
2.800000 2.750018 1.748022 -0.642798 0.413179 0.077645 -0.818179
2.833333 2.763682 1.746749 -0.678664 0.411138 -0.055355 -0.782242
2.866667 2.776956 1.744712 -0.711129 0.409222 -0.178808 -0.717662
2.900000 2.789845 1.741922 -0.754376 0.408216 -0.293803 -0.629428
2.933333 2.802353 1.738394 -0.787832 0.409137 -0.404281 -0.522563
2.966667 2.816206 1.715675 -0.807585 0.412705 -0.512327 -0.406217
3.000000 2.829710 1.692266 -0.803710 0.419017 -0.618040 -0.286665
3.033333 2.842869 1.668202 -0.788413 0.428238 -0.722305 -0.170251
3.066667 2.855685 1.643516 -0.799144 0.440261 -0.825267 -0.059224
3.100000 2.868162 1.618243 -0.787314 0.454985 -0.926212 0.040875
3.133333 2.883965 1.582945 -0.779836 0.471590 -1.021642 0.124381
3.166667 2.899444 1.547147 -0.773976 0.489441 -1.111049 0.190927
3.200000 2.916984 1.504667 -0.776135 0.507755 -1.193902 0.246156
3.233333 2.934203 1.461791 -0.761830 0.525722 -1.269765 0.294410
3.266667 2.953108 1.414626 -0.743780 0.542310 -1.337802 0.336082
3.300000 2.971690 1.367179 -0.744448 0.555994 -1.396459 0.377260
3.333333 2.991450 1.317727 -0.722113 0.565926 -1.445929 0.422152
3.366667 3.011032 1.268617 -0.692248 0.571295 -1.485108 0.474152
3.400000 3.031798 1.215839 -0.687660 0.571528 -1.513191 0.526651
3.433333 3.053070 1.161125 -0.679678 0.565848 -1.528608 0.574678
3.466667 3.073876 1.106296 -0.676223 0.553852 -1.530114 0.619357
3.500000 3.093156 1.052717 -0.673535 0.535888 -1.516777 0.660939
3.533333 3.112068 0.999302 -0.611712 0.512247 -1.487197 0.695786
3.566667 3.130604 0.946116 -0.557889 0.483152 -1.439812 0.714621
3.600000 3.148756 0.893222 -0.534796 0.449219 -1.374360 0.713394
3.633333 3.162315 0.845631 -0.527647 0.411759 -1.291861 0.693613
3.666667 3.175474 0.798449 -0.514362 0.371989 -1.193881 0.660115
3.700000 3.188231 0.751737 -0.469207 0.330717 -1.082645 0.610720
3.733333 3.198582 0.712799 -0.434431 0.288794 -0.960552 0.556452
3.766667 3.206766 0.681368 -0.421617 0.247262 -0.830350 0.510337
3.800000 3.213260 0.658079 -0.409917 0.206978 -0.694521 0.479709
3.833333 3.217887 0.644863 -0.384746 0.168394 -0.555856 0.461195
3.866667 3.222078 0.632313 -0.380629 0.132309 -0.417183 0.441040
3.900000 3.225839 0.620451 -0.404393 0.099715 -0.281290 0.415838
3.933333 3.229177 0.609297 -0.433503 0.071417 -0.150109 0.373568
3.966667 3.230994 0.606372 -0.438128 0.047980 -0.025413 0.305961
4.000000 3.230866 0.609177 -0.355329 0.029880 0.091873 0.206988
4.033333 3.229049 0.616653 -0.299186 0.017138 0.202220 0.080050
4.066667 3.226760 0.628383 -0.238497 0.009262 0.305910 -0.068199
4.100000 3.224732 0.644221 -0.239837 0.005477 0.403541 -0.231036
4.133333 3.222303 0.660794 -0.274715 0.004888 0.494941 -0.399781
4.166667 3.221937 0.680134 -0.318398 0.006237 0.580605 -0.564802
4.200000 3.223475 0.702095 -0.348564 0.007926 0.661080 -0.710468
4.233333 3.224633 0.724765 -0.413706 0.008786 0.736876 -0.822905
4.266667 3.227081 0.750905 -0.477531 0.007693 0.809019 -0.890975
4.300000 3.230016 0.779931 -0.532102 0.003795 0.878394 -0.913559
4.333333 3.232577 0.809620 -0.562619 -0.003616 0.946120 -0.894004
4.366667 3.232756 0.843176 -0.591578 -0.014456 1.012451 -0.839582
4.400000 3.232565 0.877345 -0.589141 -0.028127 1.077545 -0.762210
4.433333 3.230599 0.915219 -0.603531 -0.043941 1.140322 -0.679501
4.466667 3.228272 0.953650 -0.629612 -0.061056 1.200024 -0.602260
4.500000 3.225275 0.995574 -0.643432 -0.078630 1.255997 -0.531706
4.533333 3.221930 1.037992 -0.666079 -0.095820 1.307591 -0.465857
4.566667 3.218058 1.086390 -0.666094 -0.112334 1.354319 -0.404419
4.600000 3.213847 1.135207 -0.678493 -0.128050 1.395715 -0.341836
4.633333 3.209307 1.184403 -0.704331 -0.143078 1.432361 -0.273048
4.666667 3.204445 1.233935 -0.722723 -0.157319 1.464383 -0.198132
4.700000 3.199271 1.283763 -0.729269 -0.170640 1.492206 -0.124608
4.733333 3.193793 1.333845 -0.741472 -0.182915 1.516257 -0.057323
4.766667 3.188021 1.384140 -0.751884 -0.193761 1.537521 0.002012
4.800000 3.180389 1.436394 -0.746506 -0.202552 1.556632 0.045226
4.833333 3.172479 1.488772 -0.704435 -0.208593 1.573844 0.067352
4.866667 3.164303 1.541230 -0.687845 -0.211340 1.589375 0.066583
4.900000 3.155870 1.593721 -0.669381 -0.210543 1.603233 0.044882
4.933333 3.147410 1.648329 -0.651898 -0.205973 1.615251 -0.000249
4.966667 3.138989 1.703616 -0.674181 -0.197481 1.624571 -0.067724
5.000000 3.131367 1.759638 -0.682026 -0.185355 1.629997 -0.153065
5.033333 3.125411 1.815292 -0.695742 -0.170022 1.630414 -0.248724
5.066667 3.119242 1.870747 -0.699769 -0.152126 1.624878 -0.351728
5.100000 3.114270 1.924776 -0.716174 -0.132276 1.612530 -0.456258
5.133333 3.110948 1.980301 -0.734429 -0.111198 1.592721 -0.554893
5.166667 3.107428 2.035487 -0.748842 -0.089591 1.564997 -0.646525
5.200000 3.105546 2.089714 -0.764300 -0.068138 1.529343 -0.731257
5.233333 3.103474 2.143507 -0.792507 -0.047207 1.485712 -0.806808
5.266667 3.101215 2.196819 -0.827882 -0.027016 1.434022 -0.866444
5.300000 3.100742 2.245186 -0.867613 -0.007709 1.374366 -0.904378
5.333333 3.102520 2.287597 -0.898849 0.010658 1.307416 -0.916253
5.366667 3.104123 2.329405 -0.938522 0.027780 1.234013 -0.893786
5.400000 3.105548 2.370574 -0.981520 0.043544 1.155699 -0.828351
5.433333 3.106791 2.411068 -1.014267 0.057587 1.073614 -0.720368
5.466667 3.107850 2.450852 -1.057350 0.069386 0.988639 -0.571503
5.500000 3.111035 2.483011 -1.087385 0.078435 0.901593 -0.391287
5.533333 3.115444 2.506555 -1.127226 0.084003 0.812821 -0.185853
5.566667 3.119674 2.529311 -1.123492 0.085138 0.723169 0.030415
5.600000 3.123719 2.551263 -1.123944 0.080859 0.632875 0.243258
5.633333 3.127571 2.572393 -1.080249 0.070371 0.543026 0.438330
5.666667 3.131225 2.592684 -1.055994 0.052914 0.455049 0.604927
5.700000 3.134658 2.605454 -1.010075 0.027961 0.370145 0.738845
5.733333 3.137888 2.617359 -0.974939 -0.004248 0.288816 0.838664
5.766667 3.139830 2.623309 -0.922873 -0.042546 0.211504 0.915524
5.800000 3.139612 2.625238 -0.877135 -0.085894 0.138828 0.979191
5.833333 3.139188 2.626287 -0.838352 -0.133623 0.070938 1.041877
5.866667 3.134168 2.625459 -0.815989 -0.184617 0.008217 1.108336
5.900000 3.123950 2.623323 -0.798042 -0.237538 -0.049456 1.184378
5.933333 3.113534 2.620304 -0.788958 -0.291527 -0.101635 1.266522
5.966667 3.102927 2.616405 -0.779721 -0.346319 -0.148761 1.340130
6.000000 3.088635 2.609471 -0.741212 -0.401585 -0.191428 1.391027
6.033333 3.074174 2.601667 -0.691512 -0.456425 -0.230140 1.413845
6.066667 3.059555 2.592998 -0.604521 -0.510272 -0.265872 1.401130
6.100000 3.044789 2.583475 -0.475910 -0.563390 -0.299119 1.340603
6.133333 3.026300 2.572178 -0.372076 -0.615998 -0.330229 1.227597
6.166667 3.004286 2.559483 -0.340451 -0.668089 -0.359087 1.071099
6.200000 2.978037 2.546683 -0.321367 -0.718994 -0.385970 0.884682
6.233333 2.951712 2.533053 -0.294948 -0.768332 -0.411202 0.673019
6.266667 2.925333 2.518606 -0.286146 -0.815627 -0.435163 0.455339
6.300000 2.898926 2.503352 -0.313671 -0.859868 -0.458358 0.259562
6.333333 2.866515 2.487826 -0.338621 -0.899420 -0.481816 0.110983
6.366667 2.834127 2.471508 -0.333170 -0.932921 -0.506656 0.015770
6.400000 2.801793 2.454412 -0.356468 -0.959984 -0.533507 -0.021899
6.433333 2.769543 2.436551 -0.362026 -0.979720 -0.563047 0.004000
6.466667 2.734359 2.418778 -0.366620 -0.990726 -0.595875 0.088911
6.500000 2.697532 2.400240 -0.377216 -0.991700 -0.632264 0.217139
6.533333 2.661326 2.380154 -0.380283 -0.982774 -0.671804 0.371928
6.566667 2.625336 2.359348 -0.379097 -0.963958 -0.714038 0.550236
6.600000 2.590458 2.335471 -0.356885 -0.934482 -0.758437 0.741503
6.633333 2.557314 2.308961 -0.326146 -0.894337 -0.804418 0.936603
6.666667 2.527099 2.279557 -0.264149 -0.845000 -0.850755 1.120049
6.700000 2.497234 2.249511 -0.232353 -0.787828 -0.896307 1.286599
6.733333 2.467749 2.218848 -0.186377 -0.723079 -0.940210 1.429238
6.766667 2.444761 2.187048 -0.125831 -0.651186 -0.981470 1.535345
6.800000 2.427130 2.151620 -0.048026 -0.573815 -1.019237 1.600734
6.833333 2.409946 2.115662 0.003771 -0.492663 -1.052632 1.619916
6.866667 2.393225 2.079203 0.081927 -0.408055 -1.081273 1.600774
6.900000 2.376982 2.042269 0.141527 -0.320793 -1.104953 1.540532
6.933333 2.367007 2.004891 0.197738 -0.232824 -1.123578 1.445021
6.966667 2.362155 1.964678 0.276373 -0.145913 -1.137080 1.322596
7.000000 2.357810 1.924091 0.303935 -0.060495 -1.145611 1.180495
7.033333 2.357710 1.884177 0.339344 0.023055 -1.149322 1.025540
7.066667 2.361870 1.845011 0.376638 0.103282 -1.148681 0.858207
7.100000 2.370691 1.806594 0.376218 0.178616 -1.143909 0.693056
7.133333 2.379997 1.767940 0.402505 0.248812 -1.135158 0.531045
7.166667 2.389777 1.729075 0.418144 0.313741 -1.122939 0.378223
7.200000 2.403355 1.692468 0.439602 0.372385 -1.107897 0.234975
7.233333 2.417376 1.655709 0.410740 0.424144 -1.090769 0.103638
7.266667 2.431827 1.618825 0.438330 0.469208 -1.071889 -0.008450
7.300000 2.449671 1.582326 0.436871 0.508207 -1.051955 -0.107562
7.333333 2.469077 1.546971 0.414272 0.541121 -1.031736 -0.191383
7.366667 2.490129 1.513113 0.411315 0.567694 -1.011889 -0.261245
7.400000 2.511527 1.479233 0.375369 0.588131 -0.992642 -0.312485
7.433333 2.532300 1.448386 0.369139 0.602518 -0.974433 -0.345307
7.466667 2.553852 1.417392 0.358341 0.610725 -0.957927 -0.365174
7.500000 2.575680 1.386436 0.347364 0.612939 -0.943627 -0.372754
7.533333 2.597604 1.355784 0.324630 0.609523 -0.931926 -0.366329
7.566667 2.619758 1.325207 0.283251 0.601058 -0.922956 -0.344708
7.600000 2.640663 1.295024 0.309091 0.588348 -0.916996 -0.316387
7.633333 2.659722 1.265128 0.309220 0.572207 -0.913775 -0.282815
7.666667 2.678948 1.235354 0.268844 0.553637 -0.912802 -0.239485
7.700000 2.698320 1.205721 0.276774 0.533421 -0.913496 -0.186922
7.733333 2.715130 1.175778 0.258542 0.512577 -0.915115 -0.128631
7.766667 2.732052 1.146006 0.263208 0.491966 -0.916928 -0.075000
7.800000 2.747699 1.115120 0.256602 0.472122 -0.917771 -0.020121
7.833333 2.762264 1.083774 0.246571 0.453302 -0.916447 0.036079
7.866667 2.775927 1.051916 0.246006 0.435687 -0.911797 0.084062
7.900000 2.789648 1.020298 0.267297 0.419357 -0.902720 0.124357
7.933333 2.802682 0.988665 0.270806 0.403987 -0.888371 0.156848
7.966667 2.815665 0.958005 0.287863 0.388744 -0.867364 0.188543
8.000000 2.828668 0.927640 0.311695 0.372813 -0.839119 0.216506
8.033333 2.841680 0.897588 0.313633 0.355600 -0.803761 0.241471
8.066667 2.854375 0.868563 0.315466 0.336378 -0.761603 0.270910
8.100000 2.866425 0.841249 0.309920 0.314474 -0.713079 0.309599
8.133333 2.877345 0.817507 0.311847 0.288888 -0.658178 0.360110
8.166667 2.886688 0.797901 0.325619 0.259916 -0.598646 0.421372
8.200000 2.895977 0.778670 0.334864 0.227882 -0.535861 0.493030
8.233333 2.905203 0.759821 0.349532 0.193143 -0.470614 0.569615
8.266667 2.914361 0.741360 0.369644 0.156158 -0.403488 0.640700
8.300000 2.916064 0.733304 0.387690 0.118012 -0.335788 0.695564
8.333333 2.917677 0.725627 0.415670 0.080718 -0.269658 0.726187
8.366667 2.919203 0.718322 0.457128 0.045424 -0.205835 0.728759
8.400000 2.920640 0.711386 0.504003 0.013183 -0.145027 0.702688
8.433333 2.921992 0.704810 0.548545 -0.015193 -0.088410 0.652418
8.466667 2.917281 0.706649 0.594454 -0.038660 -0.038010 0.589177
8.500000 2.912481 0.708819 0.607566 -0.057584 0.005942 0.521031
8.533333 2.907601 0.711305 0.612337 -0.072844 0.043732 0.454704
8.566667 2.903368 0.716695 0.616582 -0.085253 0.075125 0.391046
8.600000 2.899885 0.722803 0.591871 -0.095464 0.099489 0.328879
8.633333 2.897712 0.727791 0.588046 -0.103692 0.116385 0.266428
8.666667 2.896086 0.732372 0.591161 -0.110818 0.126923 0.199638
8.700000 2.894408 0.737184 0.584582 -0.116995 0.131265 0.126096
8.733333 2.891498 0.742485 0.611252 -0.121701 0.129284 0.039097
8.766667 2.887190 0.747525 0.648775 -0.124182 0.121331 -0.060168
8.800000 2.880967 0.752112 0.694707 -0.123560 0.108545 -0.174022
8.833333 2.874721 0.756851 0.710793 -0.119386 0.092247 -0.306879
8.866667 2.868461 0.761726 0.702550 -0.110773 0.072932 -0.465508
8.900000 2.862196 0.766719 0.621557 -0.096962 0.050641 -0.654669
8.933333 2.856344 0.768025 0.546804 -0.078490 0.026226 -0.865184
8.966667 2.853741 0.766744 0.518034 -0.056453 0.000467 -1.091943
9.000000 2.851166 0.765543 0.517381 -0.032218 -0.026512 -1.325153
9.033333 2.848624 0.764414 0.509649 -0.006822 -0.054822 -1.554176
9.066667 2.852462 0.760702 0.454713 0.018291 -0.084362 -1.763015
9.100000 2.856340 0.757052 0.384070 0.041931 -0.114146 -1.938247
9.133333 2.860257 0.753455 0.322265 0.063459 -0.144069 -2.078274
9.166667 2.864213 0.749904 0.242494 0.082889 -0.174439 -2.178035
9.200000 2.868205 0.746390 0.145477 0.099989 -0.205127 -2.235640
9.233333 2.870757 0.737451 0.002081 0.114081 -0.235319 -2.242886
9.266667 2.873351 0.728538 -0.112730 0.125017 -0.264584 -2.200700
9.300000 2.875988 0.719650 -0.211291 0.132510 -0.292901 -2.112185
9.333333 2.879664 0.708372 -0.259846 0.136449 -0.319719 -1.979752
9.366667 2.885515 0.695595 -0.306688 0.136281 -0.344142 -1.808561
9.400000 2.893466 0.682097 -0.343452 0.131849 -0.365365 -1.602067
9.433333 2.901569 0.668361 -0.376651 0.123653 -0.383721 -1.377181
9.466667 2.907966 0.654582 -0.417819 0.112624 -0.399423 -1.146464
9.500000 2.914392 0.640845 -0.468253 0.099707 -0.412713 -0.917501
9.533333 2.917936 0.626873 -0.530660 0.086110 -0.424215 -0.688219
9.566667 2.918951 0.612718 -0.557990 0.073616 -0.434791 -0.462841
9.600000 2.917746 0.597790 -0.558805 0.064457 -0.445054 -0.247142
9.633333 2.916571 0.582912 -0.557302 0.060145 -0.454559 -0.035141
9.666667 2.915433 0.568088 -0.553474 0.061052 -0.462211 0.182343
9.700000 2.914333 0.553325 -0.533756 0.067390 -0.466635 0.411369
9.733333 2.913277 0.538626 -0.494863 0.078671 -0.466122 0.644569
9.766667 2.915891 0.522126 -0.459756 0.093492 -0.458724 0.885555
9.800000 2.921754 0.503526 -0.441823 0.109396 -0.443128 1.135260
9.833333 2.927666 0.485022 -0.420607 0.124508 -0.419209 1.386022
9.866667 2.933624 0.466625 -0.374010 0.137612 -0.387770 1.618712
9.900000 2.939624 0.448344 -0.348220 0.147801 -0.350181 1.816568
9.933333 2.947670 0.434135 -0.301636 0.154498 -0.308492 1.972912
9.966667 2.955181 0.424253 -0.207816 0.157998 -0.265402 2.069993
10.000000 2.961238 0.418974 -0.089614 0.159420 -0.223797 2.096414
10.033333 2.965471 0.417150 0.046060 0.159730 -0.185973 2.044580
10.066667 2.968190 0.417656 0.162137 0.160033 -0.154031 1.922472
10.100000 2.970909 0.418267 0.280291 0.161283 -0.129789 1.737027
10.133333 2.974781 0.418055 0.328556 0.164548 -0.114133 1.493773
10.166667 2.981066 0.413827 0.374157 0.170299 -0.106744 1.208867
10.200000 2.987352 0.409685 0.360840 0.178587 -0.106443 0.901798
10.233333 2.993636 0.405623 0.345764 0.188861 -0.110689 0.595247
10.266667 2.999913 0.401638 0.357571 0.200050 -0.116574 0.302656
10.300000 3.006180 0.397724 0.351348 0.211076 -0.121189 0.032960
10.333333 3.012434 0.393876 0.346062 0.220884 -0.122111 -0.207408
10.366667 3.020314 0.388039 0.347035 0.228730 -0.117784 -0.416762
10.400000 3.029752 0.382297 0.324690 0.233858 -0.107035 -0.598620
10.433333 3.039163 0.376616 0.328407 0.236243 -0.090744 -0.761227
10.466667 3.048540 0.370992 0.296246 0.236484 -0.070224 -0.908325
10.500000 3.057874 0.365423 0.252630 0.235182 -0.046791 -1.037068
10.533333 3.067159 0.359907 0.195846 0.233196 -0.022089 -1.149793
10.566667 3.073757 0.364034 0.159173 0.231678 0.001441 -1.244183
10.600000 3.080282 0.368194 0.115352 0.232265 0.021113 -1.317712
10.633333 3.086729 0.372375 0.028320 0.236373 0.035048 -1.359327
10.666667 3.093094 0.376564 -0.025813 0.244619 0.041659 -1.360710
10.700000 3.099373 0.380747 -0.083022 0.257322 0.039136 -1.321411
10.733333 3.105563 0.384912 -0.111021 0.273555 0.026204 -1.237937
10.766667 3.111658 0.389046 -0.114746 0.291813 0.003365 -1.117081
10.800000 3.121979 0.390210 -0.164636 0.309667 -0.028121 -0.963808
10.833333 3.132197 0.391327 -0.221282 0.324682 -0.066994 -0.802430
10.866667 3.146505 0.387584 -0.323372 0.334598 -0.111421 -0.647334
10.900000 3.160695 0.383786 -0.359395 0.337745 -0.159109 -0.505610
10.933333 3.177350 0.376910 -0.340748 0.333676 -0.207354 -0.378887
10.966667 3.193862 0.369978 -0.288425 0.321340 -0.254616 -0.264576
11.000000 3.209248 0.360549 -0.222574 0.300711 -0.299891 -0.173581
11.033333 3.220951 0.348299 -0.219628 0.272062 -0.341948 -0.091168
11.066667 3.225957 0.332664 -0.247489 0.236539 -0.380480 -0.017703
11.100000 3.230787 0.316976 -0.273236 0.194851 -0.415436 0.049519
11.133333 3.235439 0.301242 -0.252120 0.147601 -0.447549 0.109049
11.166667 3.239910 0.285473 -0.314364 0.097057 -0.476834 0.169260
11.200000 3.244195 0.269677 -0.331399 0.044964 -0.503466 0.249013
11.233333 3.248291 0.253864 -0.319154 -0.007461 -0.527941 0.345836
11.266667 3.252196 0.238043 -0.274468 -0.059801 -0.550335 0.458730
11.300000 3.245980 0.217891 -0.235793 -0.110446 -0.570180 0.578998
11.333333 3.239582 0.197741 -0.221234 -0.157944 -0.586637 0.704555
11.366667 3.233011 0.177607 -0.192030 -0.201617 -0.599098 0.817931
11.400000 3.222690 0.155165 -0.174152 -0.240314 -0.606391 0.905707
11.433333 3.210416 0.132487 -0.131064 -0.272551 -0.607385 0.962353
11.466667 3.198006 0.109866 -0.075404 -0.296581 -0.601093 0.988689
11.500000 3.185473 0.087318 -0.042438 -0.312594 -0.587559 0.990085
11.533333 3.172831 0.064859 -0.006720 -0.320818 -0.566958 0.964166
11.566667 3.160702 0.044225 0.033947 -0.321578 -0.539802 0.916836
11.600000 3.149002 0.025914 0.073097 -0.315921 -0.507420 0.849657
11.633333 3.137975 0.009432 0.096802 -0.305082 -0.471100 0.769977
11.666667 3.127632 -0.005496 0.129372 -0.290537 -0.432359 0.682350
11.700000 3.117927 -0.018655 0.153023 -0.272938 -0.392347 0.589512
11.733333 3.109334 -0.029665 0.166676 -0.253053 -0.352375 0.495792
11.766667 3.100701 -0.040502 0.173972 -0.231654 -0.313501 0.405561
11.800000 3.093377 -0.049450 0.182660 -0.209304 -0.276350 0.323846
11.833333 3.086028 -0.058215 0.181313 -0.186559 -0.241420 0.250609
11.866667 3.079828 -0.065443 0.189995 -0.163837 -0.208941 0.185923
11.900000 3.074555 -0.071480 0.195184 -0.141517 -0.178958 0.129675
11.933333 3.070641 -0.076204 0.191891 -0.119995 -0.151407 0.083131
11.966667 3.068332 -0.079666 0.203769 -0.099768 -0.126371 0.043802
12.000000 3.066021 -0.082935 0.202559 -0.081169 -0.103805 0.011522
12.033333 3.063711 -0.086016 0.205409 -0.064455 -0.083753 -0.015363
12.066667 3.062689 -0.087513 0.198912 -0.049855 -0.066263 -0.035863
12.100000 3.061671 -0.088824 0.193257 -0.037522 -0.051384 -0.050139
12.133333 3.061429 -0.089535 0.181615 -0.027479 -0.039034 -0.059712
12.166667 3.061191 -0.090068 0.191951 -0.019481 -0.028952 -0.062962
12.200000 3.060959 -0.090427 0.180928 -0.013316 -0.020994 -0.061402
12.233333 3.060733 -0.090618 0.177442 -0.008779 -0.014939 -0.055629
12.266667 3.060798 -0.090781 0.176111 -0.005569 -0.010432 -0.047615
12.300000 3.060869 -0.090783 0.167667 -0.003429 -0.007162 -0.037542
12.333333 3.060947 -0.090631 0.166272 -0.002074 -0.004841 -0.025752
