t x y theta dxdt dydt dthetadt
0.000000 0.000000 0.000000 -0.912095 -0.009591 0.007558 -0.003206
0.033333 -0.000027 -0.000598 -0.921326 -0.012861 0.009537 -0.002911
0.066667 -0.000258 -0.000676 -0.918761 -0.017071 0.012331 -0.002530
0.100000 -0.000698 -0.000215 -0.913635 -0.022526 0.016220 -0.001886
0.133333 -0.001355 0.000800 -0.919420 -0.029499 0.021584 0.000719
0.166667 -0.002032 0.001567 -0.918714 -0.038228 0.028719 0.005298
0.200000 -0.003044 0.002370 -0.914979 -0.048763 0.037858 0.013557
0.233333 -0.004309 0.003117 -0.915001 -0.061118 0.049159 0.025765
0.266667 -0.005994 0.003885 -0.927190 -0.075300 0.062778 0.043349
0.300000 -0.007925 0.005297 -0.918763 -0.090933 0.078672 0.063136
0.333333 -0.010965 0.007262 -0.911645 -0.107849 0.097031 0.081755
0.366667 -0.014261 0.009909 -0.912479 -0.126078 0.118250 0.096255
0.400000 -0.017815 0.013255 -0.921706 -0.145941 0.142929 0.102682
0.433333 -0.024139 0.018642 -0.912677 -0.167700 0.171748 0.099592
0.466667 -0.030728 0.024762 -0.910455 -0.191647 0.205279 0.088058
0.500000 -0.037581 0.031631 -0.892433 -0.218278 0.244202 0.070234
0.533333 -0.044700 0.039264 -0.863754 -0.247743 0.288758 0.047548
0.566667 -0.052086 0.047676 -0.849887 -0.279783 0.338909 0.021647
0.600000 -0.059740 0.056882 -0.871721 -0.313706 0.394347 -0.008886
0.633333 -0.067661 0.066896 -0.884558 -0.348854 0.454782 -0.045212
0.666667 -0.079025 0.081060 -0.897636 -0.384289 0.519696 -0.090522
0.700000 -0.093157 0.099267 -0.915947 -0.418863 0.588294 -0.142084
0.733333 -0.109763 0.121311 -0.916580 -0.451205 0.659715 -0.196587
0.766667 -0.128217 0.146925 -0.905495 -0.479848 0.732902 -0.250658
0.800000 -0.146911 0.173377 -0.897910 -0.503454 0.806792 -0.300529
0.833333 -0.165833 0.200663 -0.900461 -0.520666 0.880161 -0.343136
0.866667 -0.185445 0.230504 -0.903043 -0.530622 0.952191 -0.376153
0.900000 -0.205233 0.263463 -0.921675 -0.532708 1.022622 -0.403117
0.933333 -0.224570 0.299538 -0.968291 -0.527088 1.091276 -0.424541
0.966667 -0.242742 0.338884 -1.004812 -0.514666 1.158118 -0.440916
1.000000 -0.261088 0.379025 -1.035824 -0.496533 1.223217 -0.450480
1.033333 -0.279598 0.419948 -1.041244 -0.473882 1.286707 -0.454524
1.066667 -0.296407 0.463872 -1.044448 -0.447780 1.348650 -0.451872
1.100000 -0.311238 0.510327 -1.040413 -0.419628 1.408657 -0.444781
1.133333 -0.324170 0.559085 -1.045794 -0.390552 1.466528 -0.437357
1.166667 -0.335179 0.610083 -1.060975 -0.361244 1.522453 -0.432217
1.200000 -0.346326 0.661765 -1.076874 -0.332440 1.576406 -0.433367
1.233333 -0.355417 0.716610 -1.091614 -0.305158 1.628060 -0.438945
1.266667 -0.364646 0.772085 -1.118258 -0.280265 1.677180 -0.448209
1.300000 -0.374015 0.828162 -1.142270 -0.258113 1.723846 -0.454494
1.333333 -0.382242 0.886868 -1.153296 -0.238870 1.768039 -0.455059
1.366667 -0.388987 0.947488 -1.175771 -0.222749 1.809319 -0.445151
1.400000 -0.394699 1.009861 -1.173573 -0.210037 1.847155 -0.426503
1.433333 -0.400565 1.072710 -1.201720 -0.200619 1.881343 -0.395632
1.466667 -0.406590 1.135999 -1.213870 -0.194423 1.911453 -0.355853
1.500000 -0.411921 1.201865 -1.228384 -0.191714 1.936557 -0.309505
1.533333 -0.417424 1.268099 -1.239405 -0.192837 1.955694 -0.255163
1.566667 -0.423106 1.334664 -1.253300 -0.197962 1.968188 -0.197253
1.600000 -0.429025 1.402400 -1.246898 -0.207007 1.973501 -0.129677
1.633333 -0.435372 1.470333 -1.259214 -0.219846 1.971315 -0.058213
1.666667 -0.441915 1.538481 -1.270834 -0.236456 1.961013 0.018403
1.700000 -0.448661 1.606806 -1.247451 -0.256571 1.942426 0.097653
1.733333 -0.456652 1.673368 -1.276282 -0.279683 1.915888 0.180004
1.766667 -0.466081 1.737499 -1.243898 -0.305454 1.881497 0.262337
1.800000 -0.475725 1.801696 -1.235117 -0.333482 1.839891 0.342242
1.833333 -0.487146 1.863763 -1.222152 -0.363371 1.791675 0.414581
1.866667 -0.500334 1.922801 -1.210458 -0.394547 1.738263 0.477437
1.900000 -0.513736 1.981813 -1.186450 -0.426497 1.681119 0.527880
1.933333 -0.528881 2.036889 -1.173778 -0.458886 1.621460 0.559202
1.966667 -0.544236 2.091887 -1.135243 -0.491301 1.560768 0.573423
2.000000 -0.561056 2.142154 -1.122847 -0.523530 1.500484 0.569163
2.033333 -0.579814 2.189018 -1.086452 -0.555597 1.441955 0.550732
2.066667 -0.598764 2.235746 -1.063631 -0.587573 1.386074 0.517533
2.100000 -0.619574 2.278246 -1.038733 -0.619224 1.334086 0.474400
2.133333 -0.640559 2.320586 -1.015309 -0.650658 1.286816 0.424398
2.166667 -0.661709 2.362757 -1.022817 -0.682021 1.244950 0.371848
2.200000 -0.684910 2.402109 -1.007041 -0.713288 1.208749 0.314597
2.233333 -0.710119 2.439539 -1.019643 -0.744267 1.178362 0.258149
2.266667 -0.735456 2.476779 -1.006871 -0.774794 1.153965 0.206704
2.300000 -0.760906 2.513826 -0.996965 -0.805224 1.134957 0.160914
2.333333 -0.788634 2.550347 -0.978135 -0.835349 1.120997 0.121648
2.366667 -0.818131 2.586507 -0.981795 -0.864825 1.111754 0.084682
2.400000 -0.847688 2.622463 -0.982012 -0.893414 1.106658 0.054755
2.433333 -0.877286 2.658211 -0.985313 -0.921087 1.105019 0.027721
2.466667 -0.908994 2.694588 -0.976584 -0.947747 1.106149 0.000311
2.500000 -0.940701 2.730750 -0.981992 -0.973097 1.109663 -0.028436
2.533333 -0.974080 2.767577 -0.993840 -0.997047 1.115001 -0.056288
2.566667 -1.008730 2.805294 -1.000032 -1.019745 1.121550 -0.079929
2.600000 -1.043307 2.842784 -0.987020 -1.041327 1.128989 -0.102656
2.633333 -1.078774 2.880699 -0.989054 -1.061562 1.136991 -0.125382
2.666667 -1.115286 2.919044 -0.989315 -1.080263 1.145149 -0.146699
2.700000 -1.151642 2.957142 -1.010833 -1.097152 1.153092 -0.165204
2.733333 -1.187815 2.994987 -1.015847 -1.112164 1.160804 -0.183758
2.766667 -1.225202 3.033698 -1.016023 -1.125060 1.168236 -0.203371
2.800000 -1.263606 3.073125 -1.023017 -1.135451 1.175309 -0.219674
2.833333 -1.303020 3.113134 -1.035644 -1.143042 1.182105 -0.230193
2.866667 -1.342128 3.152856 -1.044170 -1.147669 1.188828 -0.232918
2.900000 -1.381746 3.193105 -1.048407 -1.149029 1.195514 -0.232361
2.933333 -1.420994 3.233048 -1.056927 -1.146516 1.201976 -0.227189
2.966667 -1.459840 3.272674 -1.070073 -1.139729 1.208190 -0.217308
3.000000 -1.498250 3.311974 -1.085115 -1.128566 1.214193 -0.205746
3.033333 -1.536656 3.352469 -1.092310 -1.113013 1.220070 -0.193317
3.066667 -1.574753 3.394075 -1.105925 -1.092945 1.225732 -0.181668
3.100000 -1.612317 3.435319 -1.096424 -1.068624 1.231187 -0.167252
3.133333 -1.648796 3.476828 -1.089293 -1.040636 1.236321 -0.149970
3.166667 -1.683646 3.518266 -1.097553 -1.009540 1.240900 -0.130256
3.200000 -1.717870 3.559302 -1.095812 -0.975437 1.244697 -0.107974
3.233333 -1.750246 3.600926 -1.118321 -0.938413 1.247233 -0.082177
3.266667 -1.780357 3.643257 -1.131384 -0.898716 1.248179 -0.054344
3.300000 -1.809760 3.685142 -1.125982 -0.856432 1.247225 -0.025270
3.333333 -1.838430 3.726566 -1.127592 -0.811427 1.244260 0.001511
3.366667 -1.864158 3.769259 -1.124697 -0.763063 1.238720 0.017576
3.400000 -1.889107 3.811458 -1.122777 -0.710848 1.229532 0.010935
3.433333 -1.913255 3.853146 -1.121570 -0.654615 1.215986 -0.033060
3.466667 -1.936582 3.894307 -1.113740 -0.593477 1.196916 -0.125220
3.500000 -1.959069 3.934923 -1.099784 -0.526555 1.171164 -0.280925
3.533333 -1.976968 3.975394 -1.083668 -0.453329 1.137489 -0.509306
3.566667 -1.989558 4.014247 -1.079013 -0.374074 1.095407 -0.807255
3.600000 -2.001264 4.052507 -1.089016 -0.289719 1.045360 -1.160280
3.633333 -2.012078 4.090159 -1.091457 -0.200683 0.987513 -1.547330
3.666667 -2.021992 4.127190 -1.129549 -0.108213 0.922945 -1.943317
3.700000 -2.024775 4.159209 -1.201851 -0.013899 0.853131 -2.309473
3.733333 -2.020914 4.185275 -1.328476 0.081062 0.780140 -2.604992
3.766667 -2.016153 4.210692 -1.458812 0.176116 0.706152 -2.798081
3.800000 -2.005193 4.229140 -1.590137 0.270977 0.633623 -2.867367
3.833333 -1.993355 4.246939 -1.768134 0.364868 0.565239 -2.797800
3.866667 -1.980656 4.264095 -1.935235 0.457070 0.503259 -2.585946
3.900000 -1.963029 4.276599 -2.065920 0.547401 0.449715 -2.246532
3.933333 -1.944576 4.288472 -2.173450 0.635817 0.405557 -1.807544
3.966667 -1.922385 4.298332 -2.213561 0.721507 0.371347 -1.304563
4.000000 -1.897095 4.306951 -2.231965 0.804011 0.346383 -0.772940
4.033333 -1.868912 4.315282 -2.215088 0.882941 0.329814 -0.254112
4.066667 -1.836962 4.323919 -2.182020 0.957864 0.320721 0.215832
4.100000 -1.801357 4.333487 -2.126298 1.028150 0.317419 0.608650
4.133333 -1.762331 4.344761 -2.067685 1.092717 0.318546 0.906630
4.166667 -1.722703 4.355477 -2.008859 1.151226 0.322625 1.107832
4.200000 -1.682516 4.365643 -1.956232 1.203276 0.328530 1.215315
4.233333 -1.639476 4.377943 -1.893312 1.248524 0.335001 1.242112
4.266667 -1.595967 4.389705 -1.834090 1.287111 0.340781 1.206629
4.300000 -1.552037 4.400935 -1.793706 1.319345 0.345246 1.127862
4.333333 -1.506281 4.413187 -1.758922 1.345887 0.348017 1.023396
4.366667 -1.460200 4.424915 -1.727981 1.367155 0.348836 0.906318
4.400000 -1.413653 4.436972 -1.708206 1.383486 0.347559 0.788259
4.433333 -1.365761 4.449601 -1.693350 1.395568 0.344295 0.679228
4.466667 -1.317695 4.461716 -1.673482 1.403632 0.339180 0.581403
4.500000 -1.269507 4.473318 -1.662992 1.407521 0.332317 0.499652
4.533333 -1.221246 4.484410 -1.657233 1.406839 0.323897 0.436838
4.566667 -1.174324 4.495452 -1.646609 1.401039 0.314050 0.393465
4.600000 -1.127432 4.505988 -1.612823 1.389606 0.303050 0.366901
4.633333 -1.080620 4.516019 -1.619820 1.371671 0.291169 0.353975
4.666667 -1.033938 4.525549 -1.618266 1.346538 0.278607 0.357941
4.700000 -0.987437 4.534578 -1.607443 1.314002 0.265568 0.375379
4.733333 -0.941165 4.543109 -1.595024 1.273928 0.252059 0.404103
4.766667 -0.895172 4.551146 -1.578726 1.226510 0.238213 0.443094
4.800000 -0.852135 4.559017 -1.570279 1.171828 0.224040 0.495297
4.833333 -0.812385 4.566395 -1.555272 1.110274 0.209446 0.560701
4.866667 -0.776033 4.573488 -1.542892 1.042817 0.194377 0.634974
4.900000 -0.743424 4.579819 -1.518107 0.970134 0.178796 0.718818
4.933333 -0.711309 4.585668 -1.483750 0.893291 0.162748 0.809165
4.966667 -0.682622 4.591015 -1.473615 0.813439 0.146220 0.901939
5.000000 -0.657737 4.595702 -1.430429 0.732208 0.129313 0.987141
5.033333 -0.633438 4.599916 -1.404217 0.651166 0.112168 1.058888
5.066667 -0.613537 4.603273 -1.371577 0.571427 0.094974 1.110026
5.100000 -0.594271 4.606165 -1.319040 0.494124 0.077937 1.132040
5.133333 -0.579534 4.608317 -1.266786 0.420282 0.061257 1.122245
5.166667 -0.569440 4.609784 -1.219071 0.350768 0.045151 1.076610
5.200000 -0.560034 4.610800 -1.163983 0.285802 0.029752 0.998930
5.233333 -0.555259 4.611278 -1.104536 0.225836 0.015181 0.890111
5.266667 -0.551189 4.611315 -1.073159 0.170745 0.001435 0.756078
5.300000 -0.547833 4.610916 -1.053609 0.120349 -0.011632 0.605496
5.333333 -0.545195 4.610086 -1.043395 0.074034 -0.024217 0.448741
5.366667 -0.543282 4.608832 -1.039471 0.030636 -0.036647 0.297854
5.400000 -0.542099 4.607159 -1.048908 -0.010848 -0.049327 0.163913
5.433333 -0.542712 4.605631 -1.044617 -0.052043 -0.062772 0.056021
5.466667 -0.545397 4.603739 -1.050745 -0.093772 -0.077380 -0.019769
5.500000 -0.548820 4.601443 -1.068837 -0.136595 -0.093380 -0.060502
5.533333 -0.552984 4.598751 -1.077940 -0.180891 -0.110977 -0.071766
5.566667 -0.557887 4.595666 -1.084924 -0.226462 -0.130163 -0.059559
5.600000 -0.565798 4.591661 -1.109288 -0.272700 -0.150656 -0.033892
5.633333 -0.576559 4.586549 -1.116922 -0.318554 -0.171909 0.001133
5.666667 -0.588052 4.581065 -1.095984 -0.363394 -0.193369 0.037490
5.700000 -0.601844 4.574104 -1.088589 -0.406633 -0.214449 0.067274
5.733333 -0.617555 4.565685 -1.060506 -0.447526 -0.234457 0.085544
5.766667 -0.634664 4.556306 -1.057548 -0.485378 -0.252782 0.091744
5.800000 -0.652468 4.546590 -1.060455 -0.519959 -0.269059 0.086286
5.833333 -0.670957 4.536547 -1.049202 -0.551360 -0.283145 0.064695
5.866667 -0.690504 4.526107 -1.045531 -0.579433 -0.294959 0.031723
5.900000 -0.710933 4.515494 -1.051747 -0.604279 -0.304619 -0.008990
5.933333 -0.731766 4.505081 -1.057003 -0.626253 -0.312477 -0.046876
5.966667 -0.753232 4.494382 -1.050090 -0.645815 -0.318946 -0.081855
6.000000 -0.775410 4.483943 -1.063298 -0.663227 -0.324403 -0.111944
6.033333 -0.798194 4.473238 -1.064882 -0.678578 -0.329164 -0.132350
6.066667 -0.821568 4.462278 -1.081269 -0.692201 -0.333564 -0.143032
6.100000 -0.845716 4.450893 -1.086905 -0.704320 -0.337811 -0.143052
6.133333 -0.869682 4.439475 -1.084191 -0.715082 -0.341954 -0.139953
6.166667 -0.894194 4.427831 -1.096205 -0.724551 -0.345975 -0.130472
6.200000 -0.918219 4.416272 -1.107018 -0.733010 -0.349811 -0.115698
6.233333 -0.942763 4.404506 -1.116850 -0.740697 -0.353366 -0.095760
6.266667 -0.967810 4.392541 -1.097029 -0.747696 -0.356477 -0.073430
6.300000 -0.993347 4.380386 -1.107098 -0.754070 -0.358991 -0.049091
6.333333 -1.018074 4.368444 -1.104365 -0.759847 -0.360787 -0.020740
6.366667 -1.043264 4.356330 -1.109532 -0.765084 -0.361782 0.009501
6.400000 -1.068903 4.344053 -1.120242 -0.769625 -0.361909 0.041049
6.433333 -1.094977 4.331622 -1.112863 -0.773402 -0.361206 0.071224
6.466667 -1.121475 4.319046 -1.106056 -0.776430 -0.359779 0.101560
6.500000 -1.147858 4.306727 -1.104283 -0.778819 -0.357815 0.129249
6.533333 -1.174203 4.294602 -1.101900 -0.780645 -0.355501 0.154505
6.566667 -1.200419 4.282781 -1.097184 -0.782059 -0.353074 0.174751
6.600000 -1.226496 4.271251 -1.084781 -0.783305 -0.350800 0.189319
6.633333 -1.252543 4.259991 -1.069797 -0.784587 -0.348862 0.198391
6.666667 -1.278448 4.248751 -1.059938 -0.786048 -0.347384 0.201261
6.700000 -1.303992 4.237731 -1.045990 -0.787729 -0.346373 0.199401
6.733333 -1.329862 4.226621 -1.053264 -0.789674 -0.345781 0.192855
6.766667 -1.356046 4.215040 -1.045350 -0.791850 -0.345425 0.182877
6.800000 -1.382535 4.203381 -1.040650 -0.794138 -0.345052 0.173219
6.833333 -1.409320 4.191648 -1.035489 -0.796417 -0.344415 0.166512
6.866667 -1.436389 4.179848 -1.020385 -0.798571 -0.343298 0.164883
6.900000 -1.463275 4.168055 -1.022131 -0.800535 -0.341558 0.168961
6.933333 -1.490425 4.156205 -1.024085 -0.802258 -0.339129 0.179537
6.966667 -1.517444 4.144526 -1.020377 -0.803706 -0.336056 0.199692
7.000000 -1.544036 4.133195 -1.015811 -0.804882 -0.332441 0.227575
7.033333 -1.570353 4.122366 -1.002467 -0.805831 -0.328445 0.263456
7.066667 -1.597035 4.111770 -0.990885 -0.806622 -0.324260 0.304993
7.100000 -1.623798 4.101362 -0.999965 -0.807264 -0.320069 0.355060
7.133333 -1.650771 4.090925 -0.982403 -0.807760 -0.316063 0.409860
7.166667 -1.677946 4.080460 -0.968755 -0.808123 -0.312417 0.466219
7.200000 -1.705010 4.070173 -0.936588 -0.808403 -0.309282 0.519804
7.233333 -1.732259 4.059864 -0.935414 -0.808566 -0.306718 0.564632
7.266667 -1.759686 4.049537 -0.902847 -0.808561 -0.304724 0.595939
7.300000 -1.786797 4.039614 -0.889719 -0.808393 -0.303295 0.605777
7.333333 -1.813311 4.029832 -0.867282 -0.808159 -0.302372 0.591991
7.366667 -1.839981 4.020037 -0.822431 -0.807978 -0.301874 0.549854
7.400000 -1.866802 4.010231 -0.799560 -0.807909 -0.301697 0.483906
7.433333 -1.893602 4.000431 -0.767679 -0.808055 -0.301786 0.397734
7.466667 -1.920382 3.990216 -0.745524 -0.808540 -0.302065 0.299007
7.500000 -1.947294 3.979994 -0.734107 -0.809415 -0.302415 0.192816
7.533333 -1.974332 3.969768 -0.731071 -0.810594 -0.302725 0.087304
7.566667 -2.001490 3.959540 -0.747166 -0.811879 -0.302863 -0.005523
7.600000 -2.028570 3.949302 -0.766239 -0.813109 -0.302733 -0.084355
7.633333 -2.055475 3.939156 -0.769499 -0.814164 -0.302237 -0.148044
7.666667 -2.082485 3.929012 -0.798245 -0.814913 -0.301350 -0.196167
7.700000 -2.109947 3.918914 -0.824003 -0.815285 -0.300086 -0.227734
7.733333 -2.137531 3.908933 -0.822781 -0.815242 -0.298473 -0.246366
7.766667 -2.165008 3.898925 -0.813913 -0.814864 -0.296564 -0.259933
7.800000 -2.192441 3.889005 -0.814294 -0.814174 -0.294416 -0.270958
7.833333 -2.219540 3.879157 -0.815513 -0.813151 -0.292082 -0.277997
7.866667 -2.246712 3.869317 -0.821740 -0.811748 -0.289635 -0.284666
7.900000 -2.273345 3.859821 -0.832732 -0.809988 -0.287203 -0.291785
7.933333 -2.300043 3.850333 -0.850248 -0.807946 -0.284909 -0.294688
7.966667 -2.326958 3.840847 -0.868512 -0.805643 -0.282931 -0.289055
8.000000 -2.354060 3.831529 -0.885590 -0.803171 -0.281431 -0.270707
8.033333 -2.381216 3.822220 -0.908374 -0.800571 -0.280598 -0.238894
8.066667 -2.408141 3.813038 -0.917936 -0.797913 -0.280549 -0.192457
8.100000 -2.434747 3.804161 -0.922696 -0.795179 -0.281302 -0.131210
8.133333 -2.460901 3.795224 -0.928575 -0.792391 -0.282893 -0.063794
8.166667 -2.487099 3.786294 -0.919474 -0.789632 -0.285280 0.003986
8.200000 -2.513253 3.776902 -0.923227 -0.786994 -0.288367 0.065285
8.233333 -2.539352 3.767107 -0.925463 -0.784641 -0.291960 0.113110
8.266667 -2.565487 3.757320 -0.899304 -0.782716 -0.295836 0.144078
8.300000 -2.591463 3.747256 -0.898076 -0.781357 -0.299759 0.154750
8.333333 -2.617473 3.737199 -0.877561 -0.780575 -0.303464 0.147547
8.366667 -2.643326 3.726798 -0.855699 -0.780331 -0.306679 0.123632
8.400000 -2.668941 3.716291 -0.858084 -0.780561 -0.309220 0.085326
8.433333 -2.694587 3.705793 -0.846073 -0.781136 -0.310993 0.036663
8.466667 -2.720530 3.695044 -0.857501 -0.781939 -0.311962 -0.016145
8.500000 -2.746716 3.684318 -0.865451 -0.782839 -0.312155 -0.067263
8.533333 -2.773066 3.673626 -0.870655 -0.783762 -0.311620 -0.110338
8.566667 -2.799444 3.663054 -0.877845 -0.784636 -0.310462 -0.138617
8.600000 -2.825675 3.652849 -0.880393 -0.785382 -0.308778 -0.147348
8.633333 -2.851931 3.642657 -0.895640 -0.785990 -0.306675 -0.133114
8.666667 -2.878209 3.632478 -0.900870 -0.786479 -0.304272 -0.099605
8.700000 -2.904510 3.622314 -0.918628 -0.786896 -0.301666 -0.050855
8.733333 -2.930833 3.612162 -0.933662 -0.787301 -0.298907 0.007939
8.766667 -2.956817 3.602322 -0.927798 -0.787813 -0.296025 0.068611
8.800000 -2.982822 3.592495 -0.929269 -0.788535 -0.293010 0.125080
8.833333 -3.008991 3.582794 -0.916931 -0.789551 -0.289833 0.170793
8.866667 -3.035179 3.573106 -0.891825 -0.790920 -0.286450 0.202975
8.900000 -3.061609 3.563547 -0.880165 -0.792681 -0.282852 0.222064
8.933333 -3.088115 3.554169 -0.849554 -0.794831 -0.279158 0.222882
8.966667 -3.114640 3.544802 -0.831126 -0.797228 -0.275467 0.209000
9.000000 -3.141183 3.535443 -0.832020 -0.799679 -0.271901 0.182321
9.033333 -3.167715 3.526299 -0.841131 -0.801968 -0.268585 0.146399
9.066667 -3.194187 3.517682 -0.832166 -0.803887 -0.265682 0.107814
9.100000 -3.221250 3.509273 -0.846975 -0.805222 -0.263326 0.068835
9.133333 -3.248328 3.500867 -0.842439 -0.805820 -0.261548 0.038648
9.166667 -3.275704 3.492480 -0.835251 -0.805587 -0.260382 0.018014
9.200000 -3.303082 3.484077 -0.844742 -0.804566 -0.259842 0.008265
9.233333 -3.330442 3.475605 -0.830789 -0.802806 -0.259910 0.008010
9.266667 -3.357372 3.466893 -0.844655 -0.800352 -0.260434 0.013206
9.300000 -3.384312 3.458171 -0.843559 -0.797324 -0.261243 0.020323
9.333333 -3.410394 3.449360 -0.842759 -0.793905 -0.262172 0.025796
9.366667 -3.436486 3.440536 -0.853213 -0.790316 -0.263066 0.030321
9.400000 -3.462588 3.431698 -0.838803 -0.786732 -0.263789 0.032472
9.433333 -3.488702 3.422842 -0.830442 -0.783300 -0.264235 0.035597
9.466667 -3.514637 3.413852 -0.828627 -0.780170 -0.264440 0.043253
9.500000 -3.540653 3.404925 -0.826316 -0.777423 -0.264473 0.058413
9.533333 -3.566525 3.396025 -0.822430 -0.774981 -0.264441 0.080420
9.566667 -3.592412 3.387100 -0.822699 -0.772745 -0.264450 0.104384
9.600000 -3.617945 3.378484 -0.839610 -0.770632 -0.264625 0.131457
9.633333 -3.643494 3.369838 -0.836808 -0.768609 -0.265081 0.156482
9.666667 -3.669060 3.361161 -0.839769 -0.766681 -0.265856 0.174540
9.700000 -3.694678 3.352468 -0.834275 -0.764940 -0.266967 0.183314
9.733333 -3.720316 3.343738 -0.811928 -0.763542 -0.268395 0.182060
9.766667 -3.745702 3.334918 -0.790503 -0.762695 -0.270127 0.174567
9.800000 -3.771012 3.325909 -0.757515 -0.762554 -0.272087 0.156159
9.833333 -3.796155 3.316758 -0.739301 -0.763291 -0.274184 0.130417
9.866667 -3.821213 3.307415 -0.748106 -0.765013 -0.276348 0.099330
9.900000 -3.846311 3.298037 -0.770263 -0.767721 -0.278504 0.065235
9.933333 -3.871440 3.288609 -0.770878 -0.771404 -0.280596 0.032600
9.966667 -3.896600 3.279130 -0.789584 -0.775987 -0.282572 0.004330
10.000000 -3.922378 3.269861 -0.786199 -0.781361 -0.284458 -0.010810
10.033333 -3.948743 3.260424 -0.778400 -0.787284 -0.286298 -0.012116
10.066667 -3.975145 3.250929 -0.786612 -0.793525 -0.288159 0.001403
10.100000 -4.001923 3.241194 -0.779429 -0.799858 -0.290119 0.028409
10.133333 -4.028738 3.231397 -0.777908 -0.806078 -0.292249 0.066020
10.166667 -4.055898 3.221617 -0.772806 -0.811929 -0.294581 0.109995
10.200000 -4.083311 3.211951 -0.776214 -0.817245 -0.297106 0.154445
10.233333 -4.110760 3.202217 -0.781628 -0.821995 -0.299818 0.199896
10.266667 -4.138110 3.192372 -0.777054 -0.826164 -0.302730 0.245065
10.300000 -4.165945 3.182123 -0.767481 -0.829778 -0.305854 0.289911
10.333333 -4.193816 3.171802 -0.738160 -0.832851 -0.309223 0.332698
10.366667 -4.221720 3.161406 -0.726625 -0.835485 -0.312887 0.372703
10.400000 -4.249846 3.151043 -0.718513 -0.837746 -0.316884 0.410061
10.433333 -4.277851 3.140408 -0.696178 -0.839632 -0.321230 0.439286
10.466667 -4.305886 3.129696 -0.688313 -0.841113 -0.325873 0.459673
10.500000 -4.333951 3.118904 -0.663310 -0.842204 -0.330764 0.467755
10.533333 -4.362044 3.108031 -0.654043 -0.842965 -0.335832 0.465287
10.566667 -4.390164 3.097077 -0.632550 -0.843460 -0.341023 0.452343
10.600000 -4.418454 3.085661 -0.616145 -0.843782 -0.346273 0.428197
10.633333 -4.446696 3.073829 -0.593492 -0.844071 -0.351520 0.396639
10.666667 -4.474944 3.061685 -0.577487 -0.844505 -0.356704 0.358044
10.700000 -4.503213 3.049459 -0.563138 -0.845195 -0.361781 0.317774
10.733333 -4.531393 3.037263 -0.553961 -0.846178 -0.366698 0.277113
10.766667 -4.559193 3.024967 -0.547408 -0.847425 -0.371388 0.237727
10.800000 -4.587010 3.012587 -0.540635 -0.848941 -0.375875 0.201849
10.833333 -4.614845 3.000125 -0.546251 -0.850711 -0.380248 0.172427
10.866667 -4.643192 2.987368 -0.548894 -0.852653 -0.384632 0.152403
10.900000 -4.671900 2.974426 -0.540773 -0.854687 -0.389143 0.141250
10.933333 -4.700739 2.961315 -0.543639 -0.856734 -0.393903 0.137827
10.966667 -4.729587 2.948124 -0.533983 -0.858758 -0.399029 0.142185
11.000000 -4.758582 2.934929 -0.527469 -0.860601 -0.404510 0.155072
11.033333 -4.787325 2.921488 -0.523122 -0.862101 -0.410235 0.169341
11.066667 -4.816071 2.907969 -0.509017 -0.863173 -0.416055 0.179553
11.100000 -4.844344 2.894331 -0.512049 -0.863873 -0.421780 0.184102
11.133333 -4.873260 2.880124 -0.518075 -0.864304 -0.427184 0.182046
11.166667 -4.902334 2.865515 -0.498537 -0.864541 -0.432028 0.171638
11.200000 -4.931402 2.850834 -0.483763 -0.864744 -0.436164 0.150640
11.233333 -4.960339 2.835738 -0.471344 -0.865053 -0.439472 0.125147
11.266667 -4.989105 2.820407 -0.466139 -0.865656 -0.441880 0.101144
11.300000 -5.017886 2.805103 -0.461678 -0.866532 -0.443354 0.079952
11.333333 -5.046608 2.790101 -0.452500 -0.867666 -0.443965 0.061831
11.366667 -5.075308 2.775041 -0.470612 -0.869073 -0.443832 0.052216
11.400000 -5.103707 2.760511 -0.477459 -0.870777 -0.443101 0.054443
11.433333 -5.132659 2.746061 -0.481165 -0.872788 -0.441968 0.067769
11.466667 -5.162073 2.731466 -0.487289 -0.874975 -0.440635 0.087846
11.500000 -5.191453 2.716823 -0.489492 -0.877275 -0.439317 0.113056
11.533333 -5.220796 2.702132 -0.483473 -0.879604 -0.438134 0.142817
11.566667 -5.250098 2.687397 -0.467978 -0.881867 -0.437176 0.168665
11.600000 -5.279685 2.672828 -0.450281 -0.883892 -0.436456 0.184867
11.633333 -5.309355 2.658457 -0.435595 -0.885532 -0.435963 0.186037
11.666667 -5.338970 2.644047 -0.431586 -0.886758 -0.435669 0.172608
11.700000 -5.368527 2.629600 -0.422744 -0.887597 -0.435536 0.144037
11.733333 -5.398020 2.615119 -0.409759 -0.888096 -0.435570 0.102820
11.766667 -5.427896 2.600652 -0.393747 -0.888274 -0.435817 0.054016
11.800000 -5.457699 2.586154 -0.406122 -0.888229 -0.436336 0.004985
11.833333 -5.487424 2.571627 -0.406604 -0.888069 -0.437153 -0.037963
11.866667 -5.517065 2.557073 -0.417832 -0.887865 -0.438288 -0.070612
11.900000 -5.546617 2.542493 -0.428237 -0.887584 -0.439755 -0.089018
11.933333 -5.576074 2.527889 -0.430918 -0.887163 -0.441549 -0.093984
11.966667 -5.605432 2.513264 -0.444511 -0.886576 -0.443574 -0.083176
12.000000 -5.634684 2.498621 -0.460303 -0.885817 -0.445812 -0.061249
12.033333 -5.664357 2.483910 -0.464745 -0.884829 -0.448261 -0.029002
12.066667 -5.694111 2.469053 -0.451152 -0.883536 -0.450905 0.008733
12.100000 -5.723863 2.453733 -0.453172 -0.881917 -0.453685 0.048546
12.133333 -5.753487 2.438403 -0.437827 -0.879969 -0.456550 0.086537
12.166667 -5.782974 2.423066 -0.438854 -0.877699 -0.459501 0.118593
12.200000 -5.812319 2.407727 -0.432842 -0.875095 -0.462448 0.142491
12.233333 -5.841394 2.392315 -0.424225 -0.872301 -0.465341 0.154637
12.266667 -5.870314 2.376907 -0.418050 -0.869493 -0.468150 0.157225
12.300000 -5.898840 2.361547 -0.413828 -0.866914 -0.470962 0.148470
12.333333 -5.927818 2.345497 -0.409641 -0.864751 -0.473805 0.134007
12.366667 -5.956622 2.329460 -0.396483 -0.863183 -0.476758 0.115036
12.400000 -5.985246 2.313441 -0.386609 -0.862271 -0.479962 0.095744
12.433333 -6.013682 2.297443 -0.378195 -0.861892 -0.483495 0.079773
12.466667 -6.041924 2.281471 -0.392570 -0.861910 -0.487424 0.069257
12.500000 -6.069965 2.265529 -0.389287 -0.862067 -0.491707 0.068623
12.533333 -6.098790 2.249272 -0.397717 -0.862127 -0.496391 0.076662
12.566667 -6.128093 2.232630 -0.396459 -0.861768 -0.501416 0.093275
12.600000 -6.157173 2.216032 -0.388660 -0.860794 -0.506717 0.116377
12.633333 -6.186431 2.199111 -0.403993 -0.859056 -0.512290 0.145925
12.666667 -6.215449 2.182243 -0.400495 -0.856411 -0.518129 0.177409
12.700000 -6.244342 2.164784 -0.382137 -0.852777 -0.524301 0.207629
12.733333 -6.272916 2.146643 -0.370854 -0.848194 -0.530812 0.233189
12.766667 -6.301224 2.128575 -0.351088 -0.842843 -0.537714 0.251933
12.800000 -6.329254 2.110588 -0.332875 -0.836838 -0.544938 0.265117
12.833333 -6.357000 2.092689 -0.325997 -0.830328 -0.552353 0.269053
12.866667 -6.384452 2.074883 -0.320617 -0.823462 -0.559828 0.264343
12.900000 -6.411520 2.056728 -0.314440 -0.816396 -0.567215 0.254151
12.933333 -6.438648 2.037580 -0.314407 -0.809161 -0.574371 0.243449
12.966667 -6.465664 2.017803 -0.300184 -0.801710 -0.581093 0.234643
13.000000 -6.492351 1.998154 -0.287274 -0.794011 -0.587283 0.227408
13.033333 -6.518963 1.977535 -0.280566 -0.785961 -0.592764 0.222131
13.066667 -6.545228 1.957064 -0.281715 -0.777388 -0.597306 0.219654
13.100000 -6.571138 1.936752 -0.283186 -0.767966 -0.600475 0.218008
13.133333 -6.596685 1.916610 -0.266853 -0.757440 -0.601960 0.211747
13.166667 -6.621860 1.896647 -0.256452 -0.745489 -0.601431 0.201566
13.200000 -6.646654 1.876874 -0.257626 -0.731820 -0.598538 0.186299
13.233333 -6.671323 1.856123 -0.240370 -0.716128 -0.592796 0.167055
13.266667 -6.695594 1.835584 -0.219342 -0.698241 -0.583834 0.143907
13.300000 -6.719460 1.815269 -0.223652 -0.678237 -0.571587 0.114537
13.333333 -6.742776 1.795036 -0.210641 -0.656045 -0.555591 0.081179
13.366667 -6.765230 1.775261 -0.221782 -0.631652 -0.535370 0.045200
13.400000 -6.786451 1.756406 -0.235352 -0.605104 -0.510521 0.009124
13.433333 -6.805947 1.739269 -0.226647 -0.576758 -0.481366 -0.024669
13.466667 -6.825004 1.722409 -0.221237 -0.546747 -0.448069 -0.054308
13.500000 -6.842452 1.707557 -0.218337 -0.515078 -0.410773 -0.074977
13.533333 -6.859453 1.692998 -0.231410 -0.481890 -0.370291 -0.082793
13.566667 -6.874708 1.681805 -0.240070 -0.447496 -0.328133 -0.081691
13.600000 -6.889513 1.670912 -0.236460 -0.412076 -0.285698 -0.073637
13.633333 -6.903866 1.660323 -0.259311 -0.375466 -0.243791 -0.057332
13.666667 -6.916206 1.653626 -0.262323 -0.337996 -0.203789 -0.032959
13.700000 -6.926209 1.650314 -0.253539 -0.300196 -0.167133 -0.004593
13.733333 -6.935764 1.647300 -0.260707 -0.262688 -0.134862 0.021693
13.766667 -6.944877 1.644580 -0.257450 -0.225919 -0.107057 0.047696
13.800000 -6.951638 1.643428 -0.251972 -0.190563 -0.083958 0.072990
13.833333 -6.956547 1.643141 -0.238562 -0.157520 -0.065968 0.090647
13.866667 -6.959776 1.642602 -0.226158 -0.127283 -0.052615 0.096875
13.900000 -6.961604 1.641120 -0.234673 -0.100167 -0.042942 0.095476
13.933333 -6.963029 1.639898 -0.229973 -0.076380 -0.036028 0.089107
13.966667 -6.964061 1.638928 -0.222204 -0.056201 -0.031383 0.076606
14.000000 -6.965233 1.637481 -0.209854 -0.039577 -0.028305 0.058778
14.033333 -6.966034 1.636274 -0.210415 -0.026269 -0.026051 0.042434
14.066667 -6.966476 1.635302 -0.223488 -0.015998 -0.024318 0.032510
14.100000 -6.966568 1.634559 -0.218288 -0.008361 -0.023166 0.024873
14.133333 -6.966323 1.634038 -0.222157 -0.002951 -0.022652 0.019971
14.166667 -6.965751 1.633733 -0.225179 0.000707 -0.022588 0.019597
14.200000 -6.964864 1.633639 -0.227636 0.002906 -0.022874 0.024863
