t x y theta dxdt dydt dthetadt
0.000000 0.000000 0.000000 -0.780983 0.003062 0.017876 -0.004691
0.033333 0.000546 0.000139 -0.776151 0.001163 0.021588 -0.009106
0.066667 0.000805 0.000861 -0.773147 -0.001815 0.026210 -0.011411
0.100000 0.000772 0.002172 -0.767279 -0.006274 0.032178 -0.009366
0.133333 0.000444 0.004079 -0.777729 -0.012680 0.040027 -0.001969
0.166667 0.000495 0.005180 -0.781265 -0.021376 0.050290 0.012542
0.200000 0.000507 0.005372 -0.779402 -0.032871 0.063855 0.030851
0.233333 0.000214 0.006181 -0.782914 -0.047412 0.081161 0.048170
0.266667 -0.000387 0.007617 -0.789978 -0.065422 0.102971 0.056489
0.300000 -0.001811 0.009792 -0.790102 -0.086903 0.130038 0.050189
0.333333 -0.004097 0.013124 -0.789070 -0.111805 0.163064 0.025018
0.366667 -0.007453 0.018163 -0.781156 -0.139988 0.202511 -0.024756
0.400000 -0.011127 0.023858 -0.742430 -0.170837 0.247991 -0.101540
0.433333 -0.017935 0.032431 -0.734595 -0.203679 0.299465 -0.200347
0.466667 -0.025058 0.041669 -0.734214 -0.237597 0.356402 -0.316241
0.500000 -0.032494 0.051576 -0.735459 -0.271840 0.417894 -0.442313
0.533333 -0.043078 0.065938 -0.752992 -0.305524 0.482915 -0.572847
0.566667 -0.053964 0.080969 -0.796294 -0.337974 0.550808 -0.695207
0.600000 -0.066980 0.100751 -0.838310 -0.368727 0.621185 -0.795642
0.633333 -0.081378 0.125668 -0.889867 -0.397648 0.693093 -0.870582
0.666667 -0.096053 0.151234 -0.920061 -0.424637 0.765521 -0.914959
0.700000 -0.110994 0.177438 -0.972754 -0.449571 0.837438 -0.926452
0.733333 -0.126191 0.204269 -1.005640 -0.472771 0.908222 -0.905884
0.766667 -0.142215 0.235903 -1.020635 -0.494392 0.976661 -0.863375
0.800000 -0.159215 0.270501 -1.066624 -0.514649 1.041651 -0.809041
0.833333 -0.176820 0.307729 -1.089828 -0.533623 1.102553 -0.750115
0.866667 -0.194785 0.346917 -1.112027 -0.551497 1.158731 -0.690571
0.900000 -0.213255 0.387587 -1.127206 -0.568476 1.209580 -0.638742
0.933333 -0.233150 0.430819 -1.128036 -0.584370 1.253806 -0.595901
0.966667 -0.253789 0.476190 -1.142634 -0.599094 1.290477 -0.556025
1.000000 -0.274574 0.522010 -1.169791 -0.612603 1.318958 -0.518112
1.033333 -0.295431 0.567728 -1.187122 -0.624881 1.338773 -0.477703
1.066667 -0.316829 0.614539 -1.207983 -0.635790 1.349393 -0.433305
1.100000 -0.338322 0.661709 -1.227572 -0.645226 1.350709 -0.380769
1.133333 -0.360115 0.708834 -1.240955 -0.653252 1.343117 -0.322782
1.166667 -0.381968 0.756260 -1.254223 -0.659857 1.327208 -0.262689
1.200000 -0.404465 0.802932 -1.271669 -0.664941 1.303148 -0.200422
1.233333 -0.427075 0.848078 -1.294144 -0.668355 1.271000 -0.134902
1.266667 -0.449686 0.890897 -1.281549 -0.670082 1.231783 -0.067087
1.300000 -0.472674 0.930524 -1.261171 -0.670108 1.186222 0.003617
1.333333 -0.495630 0.970324 -1.252281 -0.668478 1.135325 0.083485
1.366667 -0.518535 1.010279 -1.233210 -0.665333 1.080298 0.170667
1.400000 -0.541242 1.045455 -1.229647 -0.661056 1.023066 0.262032
1.433333 -0.563860 1.080752 -1.249439 -0.656154 0.965299 0.349934
1.466667 -0.585618 1.111828 -1.280220 -0.651152 0.908135 0.432980
1.500000 -0.606585 1.139312 -1.259093 -0.646667 0.853222 0.507276
1.533333 -0.627421 1.163412 -1.236236 -0.643298 0.802175 0.563067
1.566667 -0.648095 1.187603 -1.182878 -0.641643 0.756286 0.597729
1.600000 -0.668590 1.211886 -1.137691 -0.641984 0.715959 0.610919
1.633333 -0.689517 1.231993 -1.103303 -0.644419 0.682113 0.602725
1.666667 -0.710229 1.252194 -1.067333 -0.648952 0.655110 0.568470
1.700000 -0.730708 1.272495 -1.036643 -0.655337 0.634503 0.509166
1.733333 -0.752510 1.291643 -1.026088 -0.663018 0.619198 0.432809
1.766667 -0.775303 1.310826 -1.022386 -0.671158 0.607960 0.346368
1.800000 -0.797804 1.330126 -1.029102 -0.679031 0.599987 0.256128
1.833333 -0.820941 1.350223 -1.026497 -0.685856 0.593695 0.166656
1.866667 -0.844506 1.370545 -1.049140 -0.690790 0.587927 0.086292
1.900000 -0.868400 1.390875 -1.038413 -0.692887 0.581880 0.018039
1.933333 -0.892102 1.410540 -1.023676 -0.691527 0.575318 -0.041502
1.966667 -0.916522 1.430375 -1.017072 -0.686301 0.568440 -0.096106
2.000000 -0.940881 1.449912 -1.021676 -0.676719 0.561568 -0.152290
2.033333 -0.964789 1.469609 -1.029911 -0.662429 0.555637 -0.209824
2.066667 -0.987629 1.487668 -1.041490 -0.643213 0.551838 -0.272989
2.100000 -1.009255 1.503951 -1.051019 -0.619397 0.551535 -0.341641
2.133333 -1.030362 1.520422 -1.050223 -0.591193 0.555673 -0.412216
2.166667 -1.050928 1.537091 -1.071871 -0.558819 0.564700 -0.479652
2.200000 -1.070933 1.553970 -1.099653 -0.522704 0.578677 -0.536111
2.233333 -1.088166 1.570847 -1.112211 -0.483511 0.597335 -0.580313
2.266667 -1.103762 1.589287 -1.137035 -0.441986 0.619729 -0.608371
2.300000 -1.117741 1.609549 -1.159559 -0.398602 0.644444 -0.621884
2.333333 -1.130206 1.631924 -1.196886 -0.353676 0.670180 -0.618405
2.366667 -1.141258 1.656257 -1.223089 -0.307794 0.695772 -0.602025
2.400000 -1.150720 1.682371 -1.255758 -0.261192 0.720304 -0.575344
2.433333 -1.159507 1.708748 -1.271184 -0.213407 0.743138 -0.538816
2.466667 -1.165910 1.735172 -1.284611 -0.163917 0.764155 -0.493906
2.500000 -1.169370 1.760994 -1.290544 -0.112235 0.783804 -0.438282
2.533333 -1.172131 1.787087 -1.297233 -0.058304 0.802889 -0.377520
2.566667 -1.174187 1.813453 -1.306106 -0.001755 0.822428 -0.311177
2.600000 -1.175532 1.840096 -1.321325 0.057352 0.843420 -0.242052
2.633333 -1.176162 1.867017 -1.351561 0.118352 0.866717 -0.169737
2.666667 -1.171156 1.894943 -1.348387 0.180486 0.893128 -0.097411
2.700000 -1.165432 1.923152 -1.363141 0.243210 0.922996 -0.026779
2.733333 -1.155164 1.953876 -1.352102 0.305817 0.955926 0.039419
2.766667 -1.140883 1.986939 -1.347625 0.367346 0.991270 0.098897
2.800000 -1.125901 2.020281 -1.338334 0.427045 1.028270 0.148944
2.833333 -1.109647 2.054704 -1.325821 0.484138 1.065909 0.184045
2.866667 -1.091497 2.091618 -1.304201 0.538172 1.102788 0.205279
2.900000 -1.072683 2.128794 -1.300552 0.588529 1.137751 0.210310
2.933333 -1.052514 2.167418 -1.283057 0.635125 1.170254 0.202243
2.966667 -1.030195 2.208452 -1.272265 0.678130 1.199787 0.183689
3.000000 -1.005747 2.251717 -1.271410 0.717490 1.225715 0.159868
3.033333 -0.980487 2.294602 -1.262028 0.753360 1.247769 0.134453
3.066667 -0.954359 2.336655 -1.267744 0.785792 1.266249 0.108673
3.100000 -0.926626 2.379701 -1.277100 0.814775 1.281341 0.082849
3.133333 -0.897382 2.423288 -1.278624 0.840139 1.293565 0.060220
3.166667 -0.867623 2.467041 -1.270148 0.861784 1.303697 0.041710
3.200000 -0.837372 2.510946 -1.262920 0.879945 1.312879 0.026154
3.233333 -0.806654 2.554988 -1.257478 0.894850 1.322088 0.015620
3.266667 -0.776672 2.598935 -1.264555 0.906648 1.332235 0.013069
3.300000 -0.746269 2.642989 -1.262619 0.915670 1.344361 0.024167
3.333333 -0.715468 2.687137 -1.253451 0.922447 1.358657 0.046751
3.366667 -0.684292 2.731362 -1.249124 0.927331 1.375423 0.078945
3.400000 -0.652765 2.775651 -1.266525 0.930551 1.394789 0.122409
3.433333 -0.620909 2.819988 -1.292596 0.932271 1.417092 0.173303
3.466667 -0.589926 2.869115 -1.287641 0.932752 1.441905 0.224678
3.500000 -0.558660 2.918255 -1.271941 0.932186 1.468822 0.269196
3.533333 -0.527136 2.967386 -1.251277 0.930583 1.497799 0.303777
3.566667 -0.495375 3.016489 -1.227076 0.928073 1.528206 0.327254
3.600000 -0.464878 3.068845 -1.207608 0.924987 1.559316 0.334108
3.633333 -0.434188 3.121128 -1.172886 0.921798 1.590171 0.325494
3.666667 -0.403328 3.173312 -1.152171 0.918843 1.620671 0.305422
3.700000 -0.373004 3.228888 -1.147026 0.916486 1.650206 0.277911
3.733333 -0.342551 3.284314 -1.125955 0.915117 1.678081 0.246177
3.766667 -0.312541 3.341485 -1.155541 0.915113 1.703730 0.214796
3.800000 -0.282796 3.400052 -1.169191 0.916470 1.726355 0.187488
3.833333 -0.252791 3.459484 -1.159263 0.918952 1.744683 0.164012
3.866667 -0.222739 3.518641 -1.158940 0.922333 1.757108 0.142508
3.900000 -0.192657 3.577489 -1.154335 0.926288 1.762774 0.118192
3.933333 -0.161588 3.638155 -1.137596 0.930352 1.760825 0.089149
3.966667 -0.129980 3.699569 -1.114778 0.933921 1.750643 0.045633
4.000000 -0.098045 3.761014 -1.109724 0.936512 1.732346 -0.015179
4.033333 -0.066175 3.821640 -1.100682 0.937837 1.706719 -0.092912
4.066667 -0.034041 3.880710 -1.093227 0.937450 1.674284 -0.185513
4.100000 -0.002007 3.939259 -1.107920 0.934753 1.634750 -0.286648
4.133333 0.029889 3.993710 -1.120858 0.929343 1.588401 -0.393330
4.166667 0.060768 4.043304 -1.134125 0.921032 1.535910 -0.492734
4.200000 0.091483 4.092287 -1.168827 0.909720 1.477602 -0.580581
4.233333 0.122014 4.140636 -1.208079 0.895280 1.414015 -0.651562
4.266667 0.152340 4.188324 -1.221193 0.877964 1.346313 -0.702757
4.300000 0.182440 4.235328 -1.265952 0.857839 1.275883 -0.730590
4.333333 0.212296 4.281625 -1.290623 0.834890 1.203343 -0.734666
4.366667 0.241538 4.322885 -1.311558 0.808943 1.128867 -0.719067
4.400000 0.268577 4.358601 -1.333875 0.779955 1.052993 -0.683663
4.433333 0.292789 4.387619 -1.364159 0.747477 0.975760 -0.635089
4.466667 0.316685 4.415869 -1.387339 0.710874 0.896898 -0.574881
4.500000 0.340252 4.443346 -1.396771 0.670524 0.817186 -0.514118
4.533333 0.363476 4.470044 -1.440255 0.626811 0.737702 -0.451911
4.566667 0.386345 4.495958 -1.452594 0.580044 0.659035 -0.389122
4.600000 0.408845 4.521084 -1.455163 0.530221 0.580941 -0.326352
4.633333 0.423651 4.536163 -1.444332 0.478767 0.504356 -0.260372
4.666667 0.438071 4.550458 -1.454916 0.427144 0.430251 -0.193664
4.700000 0.452101 4.563976 -1.449572 0.376201 0.358909 -0.121630
4.733333 0.465738 4.576724 -1.458171 0.326785 0.290607 -0.048946
4.766667 0.471855 4.580710 -1.484275 0.280573 0.226966 0.021184
4.800000 0.477579 4.583951 -1.475026 0.239399 0.170174 0.085434
4.833333 0.482914 4.586466 -1.490630 0.203390 0.120568 0.141871
4.866667 0.487866 4.588272 -1.485027 0.172582 0.078496 0.186257
4.900000 0.491347 4.587908 -1.458994 0.147101 0.044263 0.218752
4.933333 0.494497 4.586455 -1.432563 0.127080 0.018282 0.236601
4.966667 0.497888 4.585114 -1.401518 0.111299 -0.000636 0.241692
5.000000 0.501320 4.583641 -1.387586 0.098472 -0.013925 0.233948
5.033333 0.504372 4.582528 -1.395006 0.088005 -0.022202 0.213764
5.066667 0.507078 4.580825 -1.375616 0.079374 -0.026251 0.185687
5.100000 0.509735 4.579460 -1.389706 0.071841 -0.027103 0.152367
5.133333 0.512180 4.578749 -1.376090 0.064634 -0.026133 0.119451
5.166667 0.514299 4.577505 -1.378640 0.057646 -0.023945 0.086412
5.200000 0.515882 4.576976 -1.407298 0.050901 -0.021066 0.059276
5.233333 0.517154 4.575948 -1.398705 0.044402 -0.017939 0.037277
5.266667 0.518309 4.575469 -1.398421 0.038121 -0.014962 0.024520
5.300000 0.519522 4.575410 -1.359083 0.032189 -0.012279 0.014730
5.333333 0.520319 4.575407 -1.366321 0.026779 -0.009753 0.007543
5.366667 0.521237 4.575808 -1.363137 0.022000 -0.007416 0.005742
