t x y theta dxdt dydt dthetadt
0.000000 0.000000 0.000000 -1.240698 0.035988 -0.055982 -0.027023
0.033333 0.017123 -0.021322 -1.229283 0.071427 -0.111753 -0.064996
0.066667 0.032024 -0.043761 -1.252532 0.118203 -0.185635 -0.119952
0.100000 0.044878 -0.067152 -1.220802 0.176346 -0.277192 -0.195113
0.133333 0.057993 -0.090309 -1.220802 0.245678 -0.385728 -0.290335
0.166667 0.071377 -0.113226 -1.220802 0.301920 -0.473229 -0.394986
0.200000 0.085038 -0.135897 -1.220802 0.345247 -0.538979 -0.495891
0.233333 0.098982 -0.158315 -1.343404 0.376171 -0.582563 -0.573764
0.266667 0.113218 -0.180472 -1.323663 0.394737 -0.603654 -0.632830
0.300000 0.127753 -0.202364 -1.323663 0.400600 -0.602133 -0.662667
0.333333 0.142595 -0.223982 -1.399047 0.393938 -0.578233 -0.653271
0.366667 0.155167 -0.242685 -1.443648 0.387190 -0.551073 -0.594332
0.400000 0.168062 -0.261105 -1.456316 0.380567 -0.521131 -0.484669
0.433333 0.181292 -0.279239 -1.463276 0.374426 -0.488902 -0.336539
0.466667 0.192250 -0.294066 -1.461526 0.369650 -0.455309 -0.134328
0.500000 0.203565 -0.308604 -1.499876 0.367310 -0.421176 0.121942
0.533333 0.215250 -0.322853 -1.492559 0.368084 -0.387392 0.414424
0.566667 0.226230 -0.335045 -1.495738 0.372528 -0.354629 0.720903
0.600000 0.236991 -0.345256 -1.505561 0.381509 -0.323800 1.026604
0.633333 0.248161 -0.355185 -1.457858 0.395441 -0.295789 1.312316
0.666667 0.260800 -0.362941 -1.409696 0.414160 -0.270988 1.551687
0.700000 0.273876 -0.370426 -1.324324 0.437496 -0.249789 1.720626
0.733333 0.287400 -0.377646 -1.232778 0.465359 -0.232419 1.814622
0.766667 0.303529 -0.383904 -1.091995 0.497292 -0.219097 1.829691
0.800000 0.320128 -0.389912 -0.972548 0.532452 -0.209705 1.760689
0.833333 0.337207 -0.395679 -0.877094 0.570177 -0.204060 1.622941
0.866667 0.354775 -0.401211 -0.838585 0.610188 -0.201912 1.431676
0.900000 0.375490 -0.407390 -0.810048 0.651988 -0.202933 1.212592
0.933333 0.399897 -0.414599 -0.796074 0.694967 -0.206781 0.993129
0.966667 0.424808 -0.421595 -0.802826 0.738868 -0.212958 0.802066
1.000000 0.450225 -0.428381 -0.805929 0.783235 -0.220895 0.668749
1.033333 0.476149 -0.434965 -0.789749 0.827659 -0.230028 0.604485
1.066667 0.502580 -0.441351 -0.813498 0.871642 -0.239948 0.616726
1.100000 0.532162 -0.449437 -0.787064 0.914971 -0.250224 0.697904
1.133333 0.565345 -0.459212 -0.785961 0.957429 -0.260256 0.831840
1.166667 0.599026 -0.468800 -0.763273 0.998616 -0.269493 0.996107
1.200000 0.633198 -0.478203 -0.762222 1.038544 -0.277516 1.168353
1.233333 0.667854 -0.487420 -0.697513 1.077134 -0.283893 1.335655
1.266667 0.704873 -0.497584 -0.616032 1.114184 -0.288039 1.487032
1.300000 0.743884 -0.508264 -0.537863 1.149470 -0.289498 1.616963
1.333333 0.783349 -0.518759 -0.449278 1.183097 -0.288186 1.720904
1.366667 0.823820 -0.529144 -0.388512 1.215242 -0.284126 1.801744
1.400000 0.864718 -0.539343 -0.346477 1.245837 -0.277391 1.861357
1.433333 0.906752 -0.549228 -0.269337 1.274958 -0.268093 1.897512
1.466667 0.949677 -0.558538 -0.212044 1.302887 -0.256685 1.905525
1.500000 0.993287 -0.567085 -0.174316 1.330163 -0.243858 1.888594
1.533333 1.039128 -0.575083 -0.139751 1.356948 -0.230146 1.850110
1.566667 1.085319 -0.582896 -0.068194 1.383441 -0.216137 1.789023
1.600000 1.132243 -0.589809 0.050547 1.409838 -0.202471 1.700935
1.633333 1.179536 -0.595580 0.127706 1.436302 -0.189850 1.589621
1.666667 1.227120 -0.601172 0.206640 1.462954 -0.178756 1.461619
1.700000 1.275495 -0.606060 0.247223 1.489411 -0.169320 1.316101
1.733333 1.324847 -0.610636 0.287085 1.515735 -0.161584 1.154191
1.766667 1.376316 -0.615237 0.306574 1.541826 -0.155520 0.982786
1.800000 1.427988 -0.619672 0.316391 1.567852 -0.150928 0.815511
1.833333 1.482149 -0.624900 0.339760 1.593566 -0.147323 0.657541
1.866667 1.536460 -0.629967 0.339535 1.618788 -0.144234 0.514753
1.900000 1.590896 -0.634877 0.343091 1.643592 -0.141227 0.391579
1.933333 1.645427 -0.639631 0.371179 1.667710 -0.137984 0.290777
1.966667 1.702003 -0.644662 0.371502 1.691092 -0.134205 0.212868
2.000000 1.758616 -0.649542 0.396668 1.713370 -0.129730 0.151600
2.033333 1.815239 -0.654273 0.399613 1.734724 -0.124678 0.105280
2.066667 1.874144 -0.658383 0.393036 1.755018 -0.119239 0.068736
2.100000 1.932994 -0.662350 0.379471 1.774114 -0.113629 0.042142
2.133333 1.993448 -0.665694 0.373644 1.791706 -0.108021 0.025666
2.166667 2.053779 -0.668899 0.363120 1.807450 -0.102500 0.017307
2.200000 2.115235 -0.671756 0.373324 1.821038 -0.097126 0.015788
2.233333 2.176497 -0.674482 0.369168 1.831971 -0.091882 0.021152
2.266667 2.238468 -0.677400 0.372266 1.839752 -0.086439 0.031924
2.300000 2.300941 -0.680472 0.380727 1.843750 -0.080488 0.043707
2.333333 2.363110 -0.683423 0.390223 1.843697 -0.073665 0.055368
2.366667 2.424937 -0.686254 0.381925 1.839398 -0.065794 0.065811
2.400000 2.487488 -0.688955 0.387893 1.830783 -0.056665 0.081460
2.433333 2.550068 -0.691289 0.398631 1.817432 -0.045989 0.101782
2.466667 2.612191 -0.693511 0.391287 1.799095 -0.033894 0.132151
2.500000 2.672805 -0.694444 0.406079 1.775407 -0.020628 0.174960
2.533333 2.732887 -0.695273 0.385261 1.745445 -0.006508 0.230850
2.566667 2.792399 -0.696003 0.393027 1.708203 0.008247 0.296045
2.600000 2.848564 -0.694366 0.393086 1.662551 0.023148 0.361022
2.633333 2.904089 -0.692641 0.405097 1.608079 0.037547 0.416020
2.666667 2.958943 -0.690834 0.422961 1.544772 0.050901 0.445908
2.700000 3.013094 -0.688954 0.444006 1.472740 0.062775 0.441514
2.733333 3.066508 -0.687005 0.480673 1.392958 0.072790 0.393154
2.766667 3.115333 -0.683791 0.520125 1.306438 0.080379 0.298950
2.800000 3.159211 -0.679846 0.558633 1.214656 0.085352 0.160677
2.833333 3.197829 -0.675789 0.584933 1.118922 0.087549 -0.011160
2.866667 3.230505 -0.672028 0.590071 1.020505 0.086842 -0.199725
2.900000 3.262340 -0.668240 0.585888 0.921092 0.083154 -0.388577
2.933333 3.288034 -0.665196 0.564092 0.822362 0.076385 -0.560120
2.966667 3.312875 -0.662142 0.504479 0.725913 0.066745 -0.693810
3.000000 3.336859 -0.659085 0.435520 0.632888 0.054396 -0.774814
3.033333 3.355306 -0.657240 0.365944 0.544446 0.039705 -0.795145
3.066667 3.372899 -0.655405 0.329975 0.461152 0.023047 -0.756406
3.100000 3.386213 -0.654676 0.293641 0.383624 0.004860 -0.664610
3.133333 3.395976 -0.654857 0.279032 0.311885 -0.014405 -0.531169
3.166667 3.402723 -0.655588 0.259421 0.246192 -0.034293 -0.378293
3.200000 3.407106 -0.657058 0.247120 0.187035 -0.054305 -0.224619
3.233333 3.409805 -0.659229 0.247463 0.134381 -0.074134 -0.089183
3.266667 3.411384 -0.662213 0.265604 0.088491 -0.093331 0.016011
3.300000 3.412054 -0.666134 0.312869 0.048965 -0.111523 0.080502
3.333333 3.412028 -0.670777 0.337564 0.015423 -0.128399 0.101731
3.366667 3.411283 -0.675448 0.343595 -0.012728 -0.143889 0.084157
3.400000 3.409972 -0.680816 0.340371 -0.036354 -0.158043 0.033206
3.433333 3.408128 -0.686713 0.331530 -0.056094 -0.170884 -0.037186
3.466667 3.405753 -0.693431 0.332495 -0.072650 -0.182554 -0.112146
3.500000 3.402743 -0.700164 0.335897 -0.086452 -0.193300 -0.176477
3.533333 3.399117 -0.706909 0.340396 -0.097498 -0.203207 -0.220930
3.566667 3.394899 -0.713660 0.309414 -0.105944 -0.212169 -0.238634
3.600000 3.390109 -0.720413 0.266442 -0.111399 -0.219984 -0.224826
3.633333 3.384770 -0.727163 0.238641 -0.113381 -0.226483 -0.183092
3.666667 3.380051 -0.735119 0.223831 -0.111454 -0.231463 -0.121056
3.700000 3.376835 -0.743970 0.222521 -0.105345 -0.234574 -0.045854
3.733333 3.373132 -0.752801 0.224350 -0.095457 -0.235643 0.035875
3.766667 3.368962 -0.761603 0.244505 -0.081932 -0.234421 0.113539
3.800000 3.364346 -0.770370 0.268942 -0.065716 -0.230895 0.177392
3.833333 3.359301 -0.779094 0.277113 -0.047766 -0.225012 0.223251
3.866667 3.358446 -0.786962 0.298003 -0.029254 -0.216832 0.247444
3.900000 3.357199 -0.794774 0.311771 -0.011012 -0.206506 0.250514
3.933333 3.360300 -0.800778 0.319271 0.006128 -0.194218 0.233464
3.966667 3.363032 -0.806714 0.337748 0.021151 -0.180438 0.203027
4.000000 3.365405 -0.812578 0.339513 0.033438 -0.165494 0.167429
4.033333 3.367428 -0.818365 0.337178 0.042393 -0.149706 0.128173
4.066667 3.369110 -0.824072 0.331616 0.048126 -0.133348 0.093055
4.100000 3.371653 -0.827811 0.321510 0.050477 -0.116900 0.063226
4.133333 3.373875 -0.831462 0.324893 0.050059 -0.100648 0.040339
4.166667 3.375782 -0.835023 0.346425 0.047555 -0.084778 0.024052
4.200000 3.377311 -0.837378 0.332920 0.043691 -0.069588 0.011385
4.233333 3.378589 -0.838885 0.346400 0.039156 -0.055451 0.004107
4.266667 3.379701 -0.839722 0.334755 0.034216 -0.042769 -0.000098
4.300000 3.380711 -0.840117 0.328744 0.029346 -0.031604 -0.003234
4.333333 3.381448 -0.840419 0.336663 0.024662 -0.022127 -0.006418
4.366667 3.382136 -0.840552 0.332802 0.020304 -0.014496 -0.007759
4.400000 3.382821 -0.840600 0.335427 0.016314 -0.008644 -0.006202
4.433333 3.383260 -0.840557 0.339571 0.012760 -0.004368 -0.002687
4.466667 3.383458 -0.840427 0.331905 0.009736 -0.001351 -0.000009
