t x y theta dxdt dydt dthetadt
0.000000 0.000000 0.000000 -0.744226 0.142642 -0.047332 0.021258
0.033333 0.004857 -0.001612 -0.785930 0.147273 -0.048529 0.018652
0.066667 0.009852 -0.003258 -0.742182 0.151898 -0.049701 0.021064
0.100000 0.014986 -0.004937 -0.756308 0.156530 -0.050851 0.020543
0.133333 0.020306 -0.006664 -0.750896 0.161177 -0.051981 0.020569
0.166667 0.025766 -0.008424 -0.738484 0.165860 -0.053098 0.019156
0.200000 0.031368 -0.010216 -0.771809 0.170616 -0.054210 0.023233
0.233333 0.037112 -0.012040 -0.736646 0.175481 -0.055329 0.022720
0.266667 0.042999 -0.013896 -0.742549 0.180485 -0.056463 0.018639
0.300000 0.049029 -0.015783 -0.750844 0.185643 -0.057615 0.016884
0.333333 0.055203 -0.017700 -0.755751 0.190988 -0.058795 0.015510
0.366667 0.061592 -0.019666 -0.754046 0.196537 -0.060006 0.014162
0.400000 0.068197 -0.021682 -0.737999 0.202285 -0.061246 0.000036
0.433333 0.075025 -0.023747 -0.761816 0.208214 -0.062509 -0.020520
0.466667 0.081998 -0.025841 -0.735671 0.214307 -0.063789 -0.063965
0.500000 0.089203 -0.027984 -0.745423 0.220544 -0.065078 -0.146955
0.533333 0.096641 -0.030177 -0.734528 0.226882 -0.066362 -0.276240
0.566667 0.104319 -0.032420 -0.754369 0.233278 -0.067623 -0.463125
0.600000 0.112241 -0.034713 -0.752659 0.239707 -0.068848 -0.708977
0.633333 0.120309 -0.037031 -0.747807 0.246147 -0.070020 -1.027256
0.666667 0.128629 -0.039399 -0.738149 0.252564 -0.071123 -1.397287
0.700000 0.137203 -0.041816 -0.772980 0.258926 -0.072141 -1.795392
0.733333 0.145923 -0.044254 -0.805259 0.265212 -0.073058 -2.205465
0.766667 0.154890 -0.046734 -0.906309 0.271398 -0.073857 -2.592536
0.800000 0.164096 -0.049248 -1.034733 0.277452 -0.074519 -2.923215
0.833333 0.173447 -0.051781 -1.208383 0.283333 -0.075030 -3.146242
0.866667 0.183019 -0.054332 -1.270089 0.289014 -0.075376 -3.260773
0.900000 0.192808 -0.056894 -1.476499 0.294476 -0.075545 -3.257971
0.933333 0.202799 -0.059454 -1.632063 0.299682 -0.075531 -3.135571
0.966667 0.212978 -0.062001 -1.888204 0.304611 -0.075344 -2.899171
1.000000 0.223296 -0.064562 -1.947182 0.309260 -0.075005 -2.582976
1.033333 0.233752 -0.067137 -2.038819 0.313629 -0.074534 -2.228493
1.066667 0.244346 -0.069658 -2.037604 0.317718 -0.073965 -1.844856
1.100000 0.255063 -0.072119 -2.055607 0.321532 -0.073337 -1.453946
1.133333 0.265888 -0.074515 -2.049575 0.325105 -0.072695 -1.076138
1.166667 0.276846 -0.076921 -2.052871 0.328469 -0.072074 -0.736576
1.200000 0.287868 -0.079263 -2.087127 0.331632 -0.071513 -0.405512
1.233333 0.299020 -0.081615 -2.137236 0.334576 -0.071058 -0.057919
1.266667 0.310203 -0.083914 -2.126002 0.337292 -0.070756 0.328842
1.300000 0.321515 -0.086221 -2.096670 0.339737 -0.070652 0.771425
1.333333 0.332955 -0.088535 -2.139925 0.341851 -0.070773 1.302345
1.366667 0.344523 -0.090856 -2.127950 0.343571 -0.071150 1.934886
1.400000 0.356017 -0.093189 -2.112785 0.344883 -0.071787 2.644758
1.433333 0.367636 -0.095527 -2.023978 0.345796 -0.072681 3.387898
1.466667 0.379380 -0.097871 -1.962323 0.346335 -0.073806 4.125481
1.500000 0.391248 -0.100218 -1.779466 0.346574 -0.075119 4.814400
1.533333 0.402973 -0.102656 -1.559750 0.346610 -0.076575 5.384612
1.566667 0.414544 -0.105202 -1.272655 0.346565 -0.078120 5.788871
1.600000 0.425953 -0.107873 -0.989313 0.346514 -0.079715 5.989083
1.633333 0.437197 -0.110684 -0.702807 0.346579 -0.081292 5.983527
1.666667 0.448565 -0.113495 -0.411437 0.346849 -0.082805 5.759575
1.700000 0.460057 -0.116304 -0.153230 0.347385 -0.084221 5.336182
1.733333 0.471674 -0.119109 0.062689 0.348208 -0.085522 4.762653
1.766667 0.483132 -0.122075 0.193522 0.349297 -0.086698 4.094780
1.800000 0.494717 -0.125036 0.319564 0.350643 -0.087738 3.393120
1.833333 0.506429 -0.127989 0.392655 0.352149 -0.088670 2.705007
1.866667 0.518270 -0.130934 0.385491 0.353761 -0.089505 2.088797
1.900000 0.530241 -0.133870 0.411948 0.355407 -0.090254 1.579198
1.933333 0.542086 -0.136926 0.385701 0.357051 -0.090907 1.194021
1.966667 0.554063 -0.139969 0.398393 0.358652 -0.091460 0.925910
2.000000 0.565938 -0.143103 0.394890 0.360191 -0.091902 0.765299
2.033333 0.577948 -0.146221 0.403861 0.361695 -0.092196 0.692487
2.066667 0.590094 -0.149322 0.423056 0.363161 -0.092311 0.670846
2.100000 0.602180 -0.152465 0.455877 0.364631 -0.092206 0.670214
2.133333 0.614406 -0.155587 0.488660 0.366125 -0.091870 0.659366
2.166667 0.626599 -0.158716 0.540132 0.367707 -0.091272 0.620159
2.200000 0.638936 -0.161821 0.579088 0.369399 -0.090400 0.533038
2.233333 0.651264 -0.164896 0.633351 0.371240 -0.089258 0.384727
2.266667 0.663596 -0.167923 0.654241 0.373297 -0.087866 0.174585
2.300000 0.675945 -0.170883 0.643301 0.375601 -0.086261 -0.096799
2.333333 0.688446 -0.173811 0.648073 0.378193 -0.084463 -0.418795
2.366667 0.700993 -0.176630 0.651199 0.381090 -0.082529 -0.772560
2.400000 0.713604 -0.179320 0.617965 0.384334 -0.080514 -1.134033
2.433333 0.726374 -0.181974 0.593713 0.387934 -0.078467 -1.471752
2.466667 0.739306 -0.184590 0.542776 0.391866 -0.076424 -1.752830
2.500000 0.752362 -0.187015 0.427284 0.396108 -0.074412 -1.941342
2.533333 0.765584 -0.189400 0.341397 0.400636 -0.072458 -2.013598
2.566667 0.778976 -0.191744 0.246270 0.405426 -0.070550 -1.955624
2.600000 0.792540 -0.194045 0.108490 0.410446 -0.068653 -1.765752
2.633333 0.806278 -0.196302 -0.037335 0.415686 -0.066723 -1.457738
2.666667 0.820193 -0.198514 -0.119586 0.421144 -0.064719 -1.062593
2.700000 0.834288 -0.200680 -0.200618 0.426819 -0.062600 -0.624064
2.733333 0.848563 -0.202799 -0.203117 0.432707 -0.060328 -0.181138
2.766667 0.863023 -0.204869 -0.142727 0.438814 -0.057883 0.225477
2.800000 0.877668 -0.206890 -0.063949 0.445153 -0.055268 0.557470
2.833333 0.892548 -0.208717 0.038974 0.451714 -0.052514 0.788165
2.866667 0.907617 -0.210493 0.147038 0.458487 -0.049650 0.911114
2.900000 0.922952 -0.212100 0.218236 0.465479 -0.046717 0.935443
2.933333 0.938569 -0.213549 0.286789 0.472691 -0.043763 0.869528
2.966667 0.954490 -0.214852 0.294581 0.480092 -0.040845 0.739663
3.000000 0.970607 -0.216101 0.258285 0.487653 -0.038020 0.582548
3.033333 0.986923 -0.217296 0.224007 0.495359 -0.035315 0.430538
3.066667 1.003439 -0.218436 0.228587 0.503213 -0.032757 0.306719
3.100000 1.020309 -0.219460 0.217283 0.511188 -0.030361 0.217662
3.133333 1.037546 -0.220381 0.218270 0.519256 -0.028129 0.173916
3.166667 1.054986 -0.221246 0.223670 0.527420 -0.026040 0.161253
3.200000 1.072630 -0.222055 0.216557 0.535686 -0.024069 0.159158
3.233333 1.090671 -0.222796 0.272348 0.544062 -0.022199 0.146843
3.266667 1.108917 -0.223482 0.261640 0.552550 -0.020411 0.116372
3.300000 1.127368 -0.224111 0.275221 0.561183 -0.018683 0.068312
3.333333 1.146242 -0.224702 0.317428 0.569997 -0.016993 0.002409
3.366667 1.165321 -0.225237 0.322755 0.579020 -0.015324 -0.059282
3.400000 1.184837 -0.225738 0.328035 0.588256 -0.013657 -0.102394
3.433333 1.204558 -0.226182 0.318040 0.597692 -0.011973 -0.100348
3.466667 1.224483 -0.226569 0.279986 0.607277 -0.010257 -0.042670
3.500000 1.244610 -0.226898 0.197942 0.616949 -0.008500 0.085337
3.533333 1.265234 -0.227170 0.179442 0.626642 -0.006699 0.293855
3.566667 1.286369 -0.227376 0.162495 0.636265 -0.004853 0.568531
3.600000 1.308032 -0.227504 0.173153 0.645731 -0.002972 0.898317
3.633333 1.329891 -0.227575 0.211554 0.654961 -0.001068 1.249145
3.666667 1.351945 -0.227590 0.251896 0.663928 0.000853 1.587566
3.700000 1.374190 -0.227547 0.341201 0.672606 0.002782 1.863550
3.733333 1.396977 -0.227397 0.417607 0.680968 0.004709 2.037654
3.766667 1.419950 -0.227190 0.541483 0.689061 0.006625 2.084774
3.800000 1.443107 -0.226927 0.671155 0.696947 0.008524 1.981181
3.833333 1.466445 -0.226609 0.813795 0.704700 0.010399 1.720873
3.866667 1.489959 -0.226234 0.952793 0.712371 0.012243 1.309933
3.900000 1.513648 -0.225805 1.019009 0.720006 0.014045 0.776637
3.933333 1.537815 -0.225291 1.050730 0.727675 0.015802 0.147290
3.966667 1.562148 -0.224723 1.020804 0.735398 0.017512 -0.543263
4.000000 1.586923 -0.224090 0.973830 0.743180 0.019170 -1.241206
4.033333 1.611857 -0.223402 0.887345 0.751006 0.020778 -1.891197
4.066667 1.636945 -0.222662 0.807262 0.758847 0.022341 -2.448755
4.100000 1.662415 -0.221879 0.712274 0.766658 0.023862 -2.879057
4.133333 1.688030 -0.221044 0.528171 0.774383 0.025349 -3.152263
4.166667 1.713994 -0.220171 0.328276 0.781946 0.026810 -3.249555
4.200000 1.740291 -0.219261 0.197904 0.789271 0.028255 -3.181304
4.233333 1.766717 -0.218301 0.027165 0.796293 0.029694 -2.969360
4.266667 1.793440 -0.217298 -0.095919 0.802959 0.031142 -2.642265
4.300000 1.820442 -0.216248 -0.228592 0.809261 0.032614 -2.230631
4.333333 1.847705 -0.215145 -0.278396 0.815177 0.034128 -1.780783
4.366667 1.875213 -0.213980 -0.317534 0.820727 0.035698 -1.338890
4.400000 1.902818 -0.212767 -0.315245 0.825965 0.037341 -0.939127
4.433333 1.930516 -0.211507 -0.290484 0.830948 0.039070 -0.610080
4.466667 1.958297 -0.210200 -0.269622 0.835737 0.040892 -0.361907
4.500000 1.986156 -0.208847 -0.230352 0.840368 0.042804 -0.207574
4.533333 2.014086 -0.207449 -0.177041 0.844875 0.044796 -0.134617
4.566667 2.042232 -0.205962 -0.172756 0.849298 0.046861 -0.125542
4.600000 2.070599 -0.204385 -0.204232 0.853629 0.048989 -0.152590
4.633333 2.099189 -0.202714 -0.227791 0.857840 0.051163 -0.188752
4.666667 2.127997 -0.200945 -0.268774 0.861886 0.053365 -0.214080
4.700000 2.156838 -0.199135 -0.280854 0.865735 0.055589 -0.204747
4.733333 2.185889 -0.197224 -0.318458 0.869341 0.057826 -0.144354
4.766667 2.215140 -0.195209 -0.334049 0.872629 0.060056 -0.030220
4.800000 2.244400 -0.193156 -0.334226 0.875546 0.062264 0.128329
4.833333 2.273660 -0.191067 -0.352087 0.878062 0.064436 0.320972
4.866667 2.302913 -0.188942 -0.336505 0.880176 0.066566 0.527685
4.900000 2.332314 -0.186706 -0.307354 0.881855 0.068633 0.734632
4.933333 2.361843 -0.184361 -0.269184 0.883081 0.070621 0.917991
4.966667 2.391479 -0.181909 -0.224375 0.883855 0.072524 1.067316
5.000000 2.421072 -0.179428 -0.159649 0.884163 0.074327 1.171967
5.033333 2.450731 -0.176851 -0.109205 0.883976 0.076015 1.224558
5.066667 2.480330 -0.174247 -0.034282 0.883245 0.077566 1.228974
5.100000 2.509858 -0.171618 0.004973 0.881956 0.078971 1.183071
5.133333 2.539375 -0.168918 0.072052 0.880103 0.080225 1.092035
5.166667 2.568803 -0.166197 0.107448 0.877679 0.081326 0.960762
5.200000 2.598133 -0.163454 0.115182 0.874681 0.082272 0.798898
5.233333 2.627366 -0.160670 0.160483 0.871122 0.083073 0.614382
5.266667 2.656470 -0.157855 0.175586 0.867034 0.083739 0.419497
5.300000 2.685415 -0.155017 0.179846 0.862440 0.084274 0.225898
5.333333 2.714177 -0.152166 0.181783 0.857347 0.084683 0.048832
5.366667 2.742795 -0.149302 0.181724 0.851757 0.084967 -0.097347
5.400000 2.771165 -0.146442 0.181866 0.845686 0.085128 -0.202654
5.433333 2.799373 -0.143573 0.165173 0.839120 0.085163 -0.258186
5.466667 2.827413 -0.140698 0.135817 0.832015 0.085067 -0.267050
5.500000 2.855118 -0.137845 0.094028 0.824312 0.084833 -0.231393
5.533333 2.882467 -0.135016 0.024672 0.815964 0.084454 -0.154235
5.566667 2.909623 -0.132186 0.010981 0.806923 0.083923 -0.047643
5.600000 2.936576 -0.129357 0.031782 0.797151 0.083238 0.079658
5.633333 2.963318 -0.126529 0.047827 0.786622 0.082394 0.219073
5.666667 2.989641 -0.123740 0.062935 0.775351 0.081395 0.364871
5.700000 3.015525 -0.120996 0.121320 0.763390 0.080250 0.508197
5.733333 3.040948 -0.118302 0.149866 0.750793 0.078970 0.636945
5.766667 3.065887 -0.115663 0.172546 0.737663 0.077574 0.748871
5.800000 3.090322 -0.113084 0.192073 0.724089 0.076080 0.842928
5.833333 3.114236 -0.110570 0.204052 0.710212 0.074517 0.915728
5.866667 3.137618 -0.108121 0.221207 0.696170 0.072911 0.965901
5.900000 3.160453 -0.105743 0.256812 0.682056 0.071283 0.996453
5.933333 3.183020 -0.103379 0.306803 0.667968 0.069654 1.008141
5.966667 3.205020 -0.101090 0.357435 0.653964 0.068037 0.999051
6.000000 3.226445 -0.098877 0.395848 0.640130 0.066449 0.964475
6.033333 3.247589 -0.096682 0.443725 0.626468 0.064894 0.905463
6.066667 3.268146 -0.094565 0.486857 0.612992 0.063373 0.823948
6.100000 3.288415 -0.092466 0.522738 0.599714 0.061890 0.721830
6.133333 3.308104 -0.090444 0.559687 0.586666 0.060450 0.605508
6.166667 3.327499 -0.088443 0.560814 0.573834 0.059049 0.484301
6.200000 3.346329 -0.086512 0.559250 0.561173 0.057678 0.367677
6.233333 3.364603 -0.084652 0.556141 0.548707 0.056339 0.262805
6.266667 3.382577 -0.082815 0.557888 0.536394 0.055025 0.174434
6.300000 3.400248 -0.081002 0.562656 0.524229 0.053732 0.105202
6.333333 3.417615 -0.079212 0.550210 0.512158 0.052448 0.058773
6.366667 3.434461 -0.077488 0.554419 0.500188 0.051176 0.029196
6.400000 3.451001 -0.075788 0.559994 0.488306 0.049910 0.013193
6.433333 3.467039 -0.074151 0.551754 0.476471 0.048644 0.007227
6.466667 3.482768 -0.072540 0.554416 0.464692 0.047378 0.006991
6.500000 3.498012 -0.070989 0.562447 0.452971 0.046113 0.010677
6.533333 3.512947 -0.069465 0.555355 0.441331 0.044854 0.012040
6.566667 3.527415 -0.067997 0.561779 0.429780 0.043600 0.013331
6.600000 3.541422 -0.066587 0.564149 0.418359 0.042361 0.014544
6.633333 3.555121 -0.065204 0.551013 0.407099 0.041143 0.013152
6.666667 3.568513 -0.063848 0.562236 0.396019 0.039948 0.009732
6.700000 3.581471 -0.062546 0.554677 0.385128 0.038778 0.006446
6.733333 3.594122 -0.061271 0.560739 0.374430 0.037635 0.003945
6.766667 3.606357 -0.060046 0.572772 0.363922 0.036517 0.000629
6.800000 3.618289 -0.058850 0.562566 0.353570 0.035417 -0.003208
6.833333 3.629820 -0.057701 0.557201 0.343362 0.034334 -0.006533
6.866667 3.641050 -0.056580 0.556808 0.333289 0.033264 -0.005954
6.900000 3.651982 -0.055489 0.559799 0.323336 0.032205 -0.006243
6.933333 3.662616 -0.054425 0.568593 0.313496 0.031156 -0.007692
6.966667 3.672883 -0.053405 0.556163 0.303763 0.030115 -0.006846
7.000000 3.682856 -0.052413 0.547931 0.294151 0.029086 -0.005108
7.033333 3.692479 -0.051462 0.557428 0.284659 0.028067 -0.002089
7.066667 3.701759 -0.050551 0.561048 0.275291 0.027061 -0.001661
7.100000 3.710753 -0.049668 0.558763 0.266058 0.026069 -0.000765
7.133333 3.719419 -0.048823 0.564467 0.256967 0.025093 0.001836
7.166667 3.727766 -0.048015 0.552627 0.248027 0.024134 0.003381
7.200000 3.735834 -0.047234 0.566897 0.239247 0.023193 0.002791
7.233333 3.743627 -0.046480 0.560125 0.230631 0.022272 0.001802
7.266667 3.751146 -0.045755 0.553842 0.222176 0.021369 0.001133
7.300000 3.758396 -0.045056 0.557659 0.213881 0.020485 -0.000335
7.333333 3.765364 -0.044388 0.558000 0.205737 0.019619 -0.001016
7.366667 3.772056 -0.043752 0.558495 0.197740 0.018769 -0.002307
7.400000 3.778479 -0.043145 0.564450 0.189884 0.017935 -0.002365
7.433333 3.784642 -0.042567 0.562272 0.182166 0.017117 -0.003552
7.466667 3.790552 -0.042015 0.555114 0.174590 0.016315 -0.004947
7.500000 3.796215 -0.041489 0.556951 0.167158 0.015529 -0.005830
7.533333 3.801631 -0.040989 0.559526 0.159874 0.014761 -0.008813
7.566667 3.806804 -0.040513 0.562043 0.152744 0.014011 -0.011136
7.600000 3.811738 -0.040063 0.554391 0.145771 0.013279 -0.011097
7.633333 3.816437 -0.039636 0.554778 0.138957 0.012567 -0.008374
7.666667 3.820922 -0.039232 0.563479 0.132306 0.011872 -0.005173
7.700000 3.825200 -0.038851 0.558324 0.125816 0.011196 -0.001699
7.733333 3.829255 -0.038492 0.554440 0.119486 0.010537 0.003595
7.766667 3.833089 -0.038157 0.551498 0.113315 0.009895 0.008848
7.800000 3.836706 -0.037844 0.550304 0.107306 0.009270 0.011227
7.833333 3.840140 -0.037550 0.553828 0.101465 0.008665 0.011371
7.866667 3.843398 -0.037275 0.554639 0.095790 0.008078 0.012475
7.900000 3.846486 -0.037016 0.565292 0.090287 0.007510 0.012828
7.933333 3.849372 -0.036779 0.570093 0.084961 0.006963 0.010359
7.966667 3.852061 -0.036562 0.563517 0.079817 0.006437 0.005878
8.000000 3.854597 -0.036361 0.559046 0.074849 0.005931 0.001492
