t x y theta dxdt dydt dthetadt
0.000000 0.000000 0.000000 -0.801147 -0.049465 -0.019784 -0.001977
0.033333 -0.001695 -0.000692 -0.811265 -0.053783 -0.022690 -0.005679
0.066667 -0.003503 -0.001449 -0.791262 -0.058240 -0.025697 -0.011075
0.100000 -0.005488 -0.002334 -0.811418 -0.062848 -0.028813 -0.016502
0.133333 -0.007601 -0.003297 -0.809112 -0.067609 -0.032037 -0.013916
0.166667 -0.009898 -0.004394 -0.818697 -0.072533 -0.035375 -0.011726
0.200000 -0.012341 -0.005581 -0.797288 -0.077632 -0.038839 -0.008790
0.233333 -0.014976 -0.006909 -0.805578 -0.082919 -0.042435 -0.007812
0.266667 -0.017807 -0.008381 -0.824008 -0.088393 -0.046161 -0.001357
0.300000 -0.020810 -0.009959 -0.808111 -0.094062 -0.050022 0.005510
0.333333 -0.023989 -0.011651 -0.809473 -0.099928 -0.054025 0.009174
0.366667 -0.027376 -0.013497 -0.798053 -0.105998 -0.058177 0.011929
0.400000 -0.030961 -0.015471 -0.804884 -0.112270 -0.062478 0.015020
0.433333 -0.034754 -0.017583 -0.810212 -0.118748 -0.066935 0.020114
0.466667 -0.038767 -0.019843 -0.804758 -0.125437 -0.071562 0.019168
0.500000 -0.043010 -0.022256 -0.815595 -0.132336 -0.076363 0.019429
0.533333 -0.047480 -0.024840 -0.804350 -0.139442 -0.081340 0.019308
0.566667 -0.052203 -0.027592 -0.801293 -0.146741 -0.086489 0.018589
0.600000 -0.057189 -0.030524 -0.794421 -0.154229 -0.091811 0.007653
0.633333 -0.062414 -0.033634 -0.802026 -0.161892 -0.097299 -0.030604
0.666667 -0.067879 -0.036925 -0.804598 -0.169728 -0.102949 -0.106457
0.700000 -0.073647 -0.040426 -0.802829 -0.177755 -0.108763 -0.240309
0.733333 -0.079663 -0.044113 -0.806656 -0.186008 -0.114757 -0.440656
0.766667 -0.086009 -0.048031 -0.790821 -0.194522 -0.120942 -0.717470
0.800000 -0.092609 -0.052140 -0.804444 -0.203340 -0.127330 -1.062163
0.833333 -0.099464 -0.056446 -0.790139 -0.212505 -0.133938 -1.451646
0.866667 -0.106578 -0.060948 -0.803541 -0.222058 -0.140782 -1.861697
0.900000 -0.113953 -0.065651 -0.821122 -0.232012 -0.147865 -2.262876
0.933333 -0.121734 -0.070639 -0.913506 -0.242358 -0.155182 -2.628509
0.966667 -0.129781 -0.075831 -1.095381 -0.253095 -0.162733 -2.922308
1.000000 -0.138273 -0.081317 -1.284702 -0.264178 -0.170497 -3.122306
1.033333 -0.147231 -0.087106 -1.454005 -0.275567 -0.178462 -3.215458
1.066667 -0.156674 -0.093206 -1.607846 -0.287198 -0.186603 -3.196498
1.100000 -0.166389 -0.099519 -1.743310 -0.299021 -0.194902 -3.067837
1.133333 -0.176620 -0.106167 -1.855402 -0.310957 -0.203325 -2.842578
1.166667 -0.187126 -0.113031 -1.933711 -0.322949 -0.211854 -2.554954
1.200000 -0.198169 -0.120256 -2.010880 -0.334989 -0.220500 -2.238392
1.233333 -0.209487 -0.127699 -2.042460 -0.347083 -0.229278 -1.926084
1.266667 -0.221350 -0.135520 -2.090156 -0.359250 -0.238208 -1.642438
1.300000 -0.233489 -0.143560 -2.118517 -0.371507 -0.247308 -1.408284
1.333333 -0.245901 -0.151820 -2.141909 -0.383951 -0.256647 -1.232630
1.366667 -0.258862 -0.160479 -2.165654 -0.396609 -0.266239 -1.108897
1.400000 -0.272375 -0.169544 -2.197069 -0.409492 -0.276090 -1.026402
1.433333 -0.286160 -0.178829 -2.218397 -0.422593 -0.286195 -0.967395
1.466667 -0.300215 -0.188334 -2.248341 -0.435908 -0.296544 -0.919934
1.500000 -0.314827 -0.198268 -2.279107 -0.449407 -0.307111 -0.868720
1.533333 -0.329996 -0.208637 -2.327083 -0.462986 -0.317819 -0.803341
1.566667 -0.345728 -0.219447 -2.373232 -0.476611 -0.328641 -0.715995
1.600000 -0.362029 -0.230707 -2.405211 -0.490237 -0.339544 -0.603102
1.633333 -0.378588 -0.242183 -2.441258 -0.503808 -0.350484 -0.467833
1.666667 -0.395726 -0.254123 -2.453131 -0.517267 -0.361426 -0.314443
1.700000 -0.413114 -0.266274 -2.456362 -0.530606 -0.372367 -0.151879
1.733333 -0.431090 -0.278902 -2.467130 -0.543810 -0.383296 0.012248
1.766667 -0.449645 -0.292002 -2.450144 -0.556817 -0.394162 0.163773
1.800000 -0.468436 -0.305306 -2.427783 -0.569574 -0.404919 0.295461
1.833333 -0.487458 -0.318812 -2.404468 -0.582027 -0.415518 0.399442
1.866667 -0.507014 -0.332771 -2.386606 -0.594122 -0.425908 0.472624
1.900000 -0.527081 -0.347170 -2.345647 -0.605757 -0.435996 0.516285
1.933333 -0.547639 -0.361999 -2.322561 -0.616865 -0.445719 0.528513
1.966667 -0.568665 -0.377243 -2.305469 -0.627423 -0.455052 0.517235
2.000000 -0.590149 -0.392895 -2.279512 -0.637385 -0.463949 0.484444
2.033333 -0.611826 -0.408724 -2.274259 -0.646704 -0.472366 0.437687
2.066667 -0.633688 -0.424726 -2.256192 -0.655352 -0.480274 0.380233
2.100000 -0.655728 -0.440895 -2.255491 -0.663353 -0.487688 0.315246
2.133333 -0.677938 -0.457226 -2.230467 -0.670747 -0.494637 0.248042
2.166667 -0.700486 -0.473875 -2.233622 -0.677558 -0.501139 0.180639
2.200000 -0.723345 -0.490819 -2.229520 -0.683838 -0.507237 0.116810
2.233333 -0.746351 -0.507909 -2.210337 -0.689642 -0.512976 0.055302
2.266667 -0.769495 -0.525140 -2.218346 -0.695006 -0.518388 -0.000699
2.300000 -0.792881 -0.542616 -2.225823 -0.699930 -0.523478 -0.049981
2.333333 -0.816388 -0.560220 -2.225698 -0.704389 -0.528226 -0.091621
2.366667 -0.840085 -0.578025 -2.235937 -0.708360 -0.532622 -0.124816
2.400000 -0.863886 -0.595947 -2.243999 -0.711818 -0.536649 -0.150482
2.433333 -0.887784 -0.613981 -2.257381 -0.714736 -0.540293 -0.164944
2.466667 -0.911769 -0.632119 -2.259578 -0.717080 -0.543533 -0.170743
2.500000 -0.935832 -0.650357 -2.271365 -0.718833 -0.546360 -0.170198
2.533333 -0.959959 -0.668702 -2.276324 -0.719966 -0.548757 -0.162610
2.566667 -0.984120 -0.687132 -2.276690 -0.720465 -0.550715 -0.150614
2.600000 -1.008287 -0.705627 -2.284952 -0.720312 -0.552218 -0.133762
2.633333 -1.032433 -0.724166 -2.284288 -0.719516 -0.553265 -0.117281
2.666667 -1.056615 -0.742774 -2.296442 -0.718093 -0.553861 -0.099214
2.700000 -1.080719 -0.761383 -2.289713 -0.716076 -0.554019 -0.080833
2.733333 -1.104714 -0.779974 -2.301080 -0.713521 -0.553770 -0.064486
2.766667 -1.128574 -0.798523 -2.293967 -0.710476 -0.553138 -0.051281
2.800000 -1.152272 -0.817011 -2.301017 -0.706999 -0.552157 -0.042724
2.833333 -1.175798 -0.835429 -2.310287 -0.703137 -0.550859 -0.036259
2.866667 -1.199129 -0.853753 -2.304173 -0.698983 -0.549305 -0.034659
2.900000 -1.222439 -0.872105 -2.293604 -0.694571 -0.547519 -0.035967
2.933333 -1.245505 -0.890328 -2.294048 -0.689941 -0.545529 -0.038842
2.966667 -1.268536 -0.908568 -2.295548 -0.685109 -0.543346 -0.040108
3.000000 -1.291285 -0.926647 -2.293684 -0.680114 -0.541002 -0.039204
3.033333 -1.313986 -0.944731 -2.305336 -0.674949 -0.538493 -0.037070
3.066667 -1.336372 -0.962627 -2.310426 -0.669580 -0.535796 -0.030681
3.100000 -1.358697 -0.980518 -2.311733 -0.664024 -0.532931 -0.018963
3.133333 -1.380689 -0.998204 -2.317907 -0.658326 -0.529931 -0.004157
3.166667 -1.402607 -1.015877 -2.321321 -0.652515 -0.526825 0.012530
3.200000 -1.424447 -1.033532 -2.315593 -0.646554 -0.523583 0.030183
3.233333 -1.445924 -1.050952 -2.320825 -0.640487 -0.520242 0.049014
3.266667 -1.467028 -1.068131 -2.303703 -0.634355 -0.516834 0.064857
3.300000 -1.488037 -1.085278 -2.294850 -0.628154 -0.513357 0.075171
3.333333 -1.508945 -1.102391 -2.292338 -0.621831 -0.509772 0.080598
3.366667 -1.529466 -1.119248 -2.301373 -0.615381 -0.506075 0.079909
3.400000 -1.549877 -1.136064 -2.284963 -0.608845 -0.502298 0.073152
3.433333 -1.570175 -1.152834 -2.286615 -0.602176 -0.498406 0.060711
3.466667 -1.590355 -1.169554 -2.290813 -0.595302 -0.494342 0.046739
3.500000 -1.610144 -1.186013 -2.279581 -0.588196 -0.490089 0.031325
3.533333 -1.629540 -1.202209 -2.284429 -0.580863 -0.485649 0.015540
3.566667 -1.648806 -1.218346 -2.287720 -0.573275 -0.481001 0.001788
3.600000 -1.667940 -1.234422 -2.277212 -0.565408 -0.476128 -0.009401
3.633333 -1.686685 -1.250236 -2.283735 -0.557300 -0.471061 -0.018217
3.666667 -1.705290 -1.265983 -2.287147 -0.549017 -0.465852 -0.026762
3.700000 -1.723515 -1.281472 -2.291984 -0.540612 -0.460540 -0.030483
3.733333 -1.741370 -1.296716 -2.296794 -0.532132 -0.455167 -0.030437
3.766667 -1.758862 -1.311719 -2.292574 -0.523636 -0.449779 -0.029925
3.800000 -1.776206 -1.326647 -2.281673 -0.515182 -0.444428 -0.026950
3.833333 -1.793191 -1.341336 -2.299770 -0.506806 -0.439147 -0.021521
3.866667 -1.809831 -1.355796 -2.305593 -0.498557 -0.433983 -0.014393
3.900000 -1.826318 -1.370177 -2.286282 -0.490442 -0.428950 -0.010912
3.933333 -1.842469 -1.384338 -2.301288 -0.482468 -0.424064 -0.008858
3.966667 -1.858299 -1.398290 -2.300284 -0.474636 -0.419334 -0.006319
4.000000 -1.873974 -1.412158 -2.292105 -0.466952 -0.414772 -0.003729
4.033333 -1.889493 -1.425944 -2.285581 -0.459415 -0.410376 -0.001652
4.066667 -1.904712 -1.439548 -2.299114 -0.451999 -0.406127 0.002769
4.100000 -1.919640 -1.452986 -2.293501 -0.444728 -0.402040 0.010646
4.133333 -1.934286 -1.466267 -2.288431 -0.437622 -0.398123 0.018964
4.166667 -1.948657 -1.479402 -2.297464 -0.430710 -0.394384 0.026973
4.200000 -1.962875 -1.492451 -2.304253 -0.424004 -0.390824 0.033981
4.233333 -1.976836 -1.505373 -2.297064 -0.417539 -0.387461 0.039557
4.266667 -1.990555 -1.518179 -2.301874 -0.411356 -0.384318 0.040987
4.300000 -2.004045 -1.530876 -2.297765 -0.405480 -0.381404 0.039816
4.333333 -2.017383 -1.543487 -2.280932 -0.399923 -0.378722 0.037313
4.366667 -2.030572 -1.556011 -2.270569 -0.394681 -0.376267 0.032163
4.400000 -2.043579 -1.568458 -2.263361 -0.389754 -0.374031 0.023176
4.433333 -2.056421 -1.580840 -2.279990 -0.385126 -0.372001 0.012248
4.466667 -2.069115 -1.593163 -2.281978 -0.380770 -0.370150 0.000619
4.500000 -2.081678 -1.605443 -2.295228 -0.376654 -0.368454 -0.011490
4.533333 -2.094098 -1.617637 -2.287149 -0.372755 -0.366893 -0.023375
4.566667 -2.106413 -1.629809 -2.286533 -0.369072 -0.365472 -0.028384
4.600000 -2.118633 -1.641973 -2.281458 -0.365604 -0.364205 -0.021440
4.633333 -2.130775 -1.654143 -2.291180 -0.362340 -0.363086 0.000499
4.666667 -2.142780 -1.666226 -2.283410 -0.359278 -0.362124 0.037690
4.700000 -2.154651 -1.678224 -2.300397 -0.356419 -0.361329 0.091284
4.733333 -2.166388 -1.690136 -2.286363 -0.353779 -0.360726 0.159058
4.766667 -2.178093 -1.702109 -2.297237 -0.351344 -0.360302 0.233905
4.800000 -2.189667 -1.713996 -2.285300 -0.349096 -0.360032 0.305234
4.833333 -2.201234 -1.725970 -2.301334 -0.347033 -0.359911 0.360205
4.866667 -2.212674 -1.737858 -2.295883 -0.345155 -0.359931 0.392062
4.900000 -2.224133 -1.749862 -2.265891 -0.343434 -0.360049 0.388682
4.933333 -2.235619 -1.761989 -2.201141 -0.341813 -0.360179 0.342657
4.966667 -2.246981 -1.774028 -2.156269 -0.340262 -0.360275 0.248414
5.000000 -2.258222 -1.785979 -2.127438 -0.338748 -0.360281 0.106370
5.033333 -2.269484 -1.798020 -2.122354 -0.337232 -0.360136 -0.075173
5.066667 -2.280761 -1.810133 -2.131196 -0.335670 -0.359765 -0.286816
5.100000 -2.291919 -1.822153 -2.141253 -0.334056 -0.359144 -0.510429
5.133333 -2.303069 -1.834200 -2.143875 -0.332396 -0.358278 -0.725728
5.166667 -2.314202 -1.846260 -2.210559 -0.330687 -0.357153 -0.909664
5.200000 -2.325220 -1.858225 -2.257989 -0.328925 -0.355758 -1.045063
5.233333 -2.336123 -1.870093 -2.326553 -0.327118 -0.354105 -1.116510
5.266667 -2.346995 -1.881917 -2.393802 -0.325284 -0.352221 -1.117686
5.300000 -2.357754 -1.893642 -2.443561 -0.323428 -0.350120 -1.052899
5.333333 -2.368483 -1.905304 -2.498522 -0.321568 -0.347816 -0.926069
5.366667 -2.379186 -1.916896 -2.549692 -0.319715 -0.345335 -0.753818
5.400000 -2.389866 -1.928409 -2.572596 -0.317876 -0.342705 -0.549623
5.433333 -2.400436 -1.939817 -2.584243 -0.316042 -0.339942 -0.338089
5.466667 -2.410895 -1.951118 -2.584606 -0.314194 -0.337055 -0.134468
5.500000 -2.421348 -1.962334 -2.564775 -0.312311 -0.334052 0.050885
5.533333 -2.431691 -1.973441 -2.559130 -0.310364 -0.330934 0.201930
5.566667 -2.442022 -1.984446 -2.504582 -0.308331 -0.327699 0.311009
5.600000 -2.452335 -1.995341 -2.471246 -0.306199 -0.324346 0.375711
5.633333 -2.462540 -2.006123 -2.477316 -0.303962 -0.320873 0.406814
5.666667 -2.472712 -2.016776 -2.442817 -0.301607 -0.317269 0.403231
5.700000 -2.482775 -2.027313 -2.425766 -0.299135 -0.313528 0.373408
5.733333 -2.492729 -2.037733 -2.420475 -0.296539 -0.309648 0.325943
5.766667 -2.502575 -2.048034 -2.424900 -0.293821 -0.305625 0.276712
5.800000 -2.512313 -2.058216 -2.393050 -0.290994 -0.301465 0.228298
5.833333 -2.521976 -2.068234 -2.408504 -0.288064 -0.297177 0.179343
5.866667 -2.531556 -2.078084 -2.418678 -0.285049 -0.292775 0.139872
5.900000 -2.541028 -2.087810 -2.406120 -0.281959 -0.288273 0.107546
5.933333 -2.550397 -2.097349 -2.398386 -0.278806 -0.283688 0.084577
5.966667 -2.559658 -2.106763 -2.383784 -0.275596 -0.279035 0.061144
6.000000 -2.568805 -2.115980 -2.398504 -0.272325 -0.274329 0.043382
6.033333 -2.577828 -2.124993 -2.394333 -0.268995 -0.269577 0.030322
6.066667 -2.586744 -2.133877 -2.406989 -0.265610 -0.264789 0.020433
6.100000 -2.595551 -2.142633 -2.373092 -0.262174 -0.259975 0.013418
6.133333 -2.604252 -2.151260 -2.389642 -0.258694 -0.255134 0.002869
6.166667 -2.612844 -2.159757 -2.387277 -0.255171 -0.250258 -0.003430
6.200000 -2.621298 -2.168030 -2.407805 -0.251609 -0.245334 -0.007120
6.233333 -2.629608 -2.176077 -2.413779 -0.248015 -0.240362 -0.007890
6.266667 -2.637811 -2.183993 -2.399589 -0.244395 -0.235344 -0.009737
6.300000 -2.645907 -2.191777 -2.384185 -0.240751 -0.230276 -0.011754
6.333333 -2.653896 -2.199429 -2.396505 -0.237087 -0.225163 -0.005069
6.366667 -2.661736 -2.206845 -2.388994 -0.233415 -0.220028 -0.000526
6.400000 -2.669470 -2.214128 -2.391490 -0.229741 -0.214883 -0.004133
6.433333 -2.677052 -2.221175 -2.385359 -0.226068 -0.209730 -0.013327
6.466667 -2.684529 -2.228090 -2.447956 -0.222396 -0.204574 -0.019322
6.500000 -2.691853 -2.234759 -2.388870 -0.218738 -0.199436 -0.024150
6.533333 -2.699071 -2.241296 -2.375916 -0.215102 -0.194340 -0.034670
6.566667 -2.706185 -2.247702 -2.389281 -0.211497 -0.189300 -0.043299
6.600000 -2.713194 -2.253977 -2.392395 -0.207932 -0.184340 -0.044922
6.633333 -2.720050 -2.260007 -2.403100 -0.204413 -0.179470 -0.041077
6.666667 -2.726802 -2.265907 -2.407497 -0.200941 -0.174695 -0.043310
6.700000 -2.733404 -2.271563 -2.417494 -0.197509 -0.169986 -0.044043
6.733333 -2.739904 -2.277090 -2.427503 -0.194105 -0.165318 -0.037735
6.766667 -2.746301 -2.282489 -2.408745 -0.190718 -0.160653 -0.027519
6.800000 -2.752596 -2.287760 -2.410684 -0.187335 -0.155952 -0.012479
6.833333 -2.758790 -2.292904 -2.400431 -0.183942 -0.151180 -0.000004
6.866667 -2.764883 -2.297921 -2.407889 -0.180531 -0.146308 0.017152
6.900000 -2.770875 -2.302814 -2.421989 -0.177094 -0.141308 0.033123
6.933333 -2.776767 -2.307581 -2.412244 -0.173622 -0.136155 0.049078
6.966667 -2.782518 -2.312106 -2.408749 -0.170116 -0.130840 0.093804
7.000000 -2.788128 -2.316387 -2.413096 -0.166577 -0.125361 0.204395
7.033333 -2.793600 -2.320427 -2.403686 -0.163014 -0.119737 0.418972
7.066667 -2.798974 -2.324347 -2.395972 -0.159434 -0.113994 0.773880
7.100000 -2.804212 -2.328027 -2.398768 -0.155851 -0.108188 1.312866
7.133333 -2.809353 -2.331589 -2.356481 -0.152279 -0.102376 2.051407
7.166667 -2.814364 -2.334920 -2.419119 -0.148725 -0.096615 2.971767
7.200000 -2.819250 -2.338014 -2.400188 -0.145191 -0.090969 3.993739
7.233333 -2.824013 -2.340872 -2.397025 -0.141680 -0.085493 5.061282
7.266667 -2.828682 -2.343619 -2.317416 -0.138200 -0.080240 6.087881
7.300000 -2.833238 -2.346142 -2.010820 -0.134744 -0.075245 6.960034
7.333333 -2.837679 -2.348467 -1.494468 -0.131305 -0.070560 7.589657
7.366667 -2.841990 -2.350618 -1.187585 -0.127883 -0.066219 7.904058
7.400000 -2.846170 -2.352622 -0.690988 -0.124472 -0.062251 7.889120
7.433333 -2.850259 -2.354526 -0.153721 -0.121061 -0.058673 7.517375
