t x y theta dxdt dydt dthetadt
0.000000 0.000000 0.000000 -0.014339 -0.005303 0.005361 -0.002272
0.033333 -0.000027 0.000032 -0.007418 -0.008163 0.008207 -0.003256
0.066667 0.000011 0.000058 -0.012108 -0.012864 0.012697 -0.004080
0.100000 -0.000205 0.000288 -0.015461 -0.019954 0.019247 -0.001760
0.133333 -0.000511 0.000616 -0.005331 -0.029954 0.028288 0.002474
0.166667 -0.000909 0.001045 -0.013090 -0.043115 0.039996 0.012930
0.200000 -0.001401 0.001575 -0.013406 -0.059366 0.054247 0.032326
0.233333 -0.001987 0.002208 -0.018246 -0.078393 0.070859 0.063741
0.266667 -0.002670 0.002944 -0.010110 -0.100149 0.089944 0.104536
0.300000 -0.005121 0.005260 -0.018566 -0.124488 0.111533 0.151367
0.333333 -0.009571 0.009453 -0.018039 -0.151109 0.135506 0.202995
0.366667 -0.017198 0.016048 -0.016766 -0.179654 0.161898 0.249163
0.400000 -0.024923 0.022725 -0.002277 -0.209948 0.190996 0.283808
0.433333 -0.032741 0.029480 0.005638 -0.241644 0.222815 0.300457
0.466667 -0.040646 0.036306 0.023292 -0.273943 0.256940 0.298740
0.500000 -0.048631 0.043200 0.062362 -0.306454 0.293387 0.278737
0.533333 -0.056690 0.050154 0.085416 -0.339104 0.332465 0.241792
0.566667 -0.068362 0.061343 0.109298 -0.372153 0.374289 0.194718
0.600000 -0.083647 0.076311 0.120514 -0.405515 0.418450 0.144480
0.633333 -0.098993 0.091297 0.101948 -0.439314 0.464719 0.098056
0.666667 -0.114386 0.106286 0.093405 -0.473721 0.512810 0.059672
0.700000 -0.130483 0.123976 0.070256 -0.508413 0.561695 0.036286
0.733333 -0.146907 0.142892 0.060792 -0.542885 0.610089 0.030324
0.766667 -0.165157 0.164400 0.054117 -0.576412 0.656778 0.041326
0.800000 -0.184893 0.188043 0.054326 -0.608760 0.701089 0.064893
0.833333 -0.206386 0.213938 0.062849 -0.639152 0.742049 0.092142
0.866667 -0.227852 0.239706 0.076383 -0.666934 0.778872 0.115665
0.900000 -0.252002 0.267997 0.086348 -0.691177 0.811168 0.122551
0.933333 -0.276088 0.296100 0.109856 -0.710701 0.838526 0.104783
0.966667 -0.302690 0.327307 0.117128 -0.724108 0.860335 0.059241
1.000000 -0.329187 0.358261 0.121334 -0.729956 0.876051 -0.015264
1.033333 -0.355555 0.388932 0.130692 -0.727549 0.885359 -0.113376
1.066667 -0.381770 0.419289 0.140366 -0.715777 0.887181 -0.227517
1.100000 -0.407808 0.449299 0.124769 -0.694075 0.879900 -0.342715
1.133333 -0.433643 0.478932 0.120724 -0.662471 0.862277 -0.447077
1.166667 -0.457890 0.510822 0.088910 -0.621873 0.833684 -0.528420
1.200000 -0.481893 0.542273 0.056491 -0.573069 0.793316 -0.572506
1.233333 -0.501926 0.572849 0.007098 -0.516641 0.740042 -0.570260
1.266667 -0.518019 0.600084 -0.017820 -0.454070 0.674188 -0.518148
1.300000 -0.530943 0.623872 -0.051911 -0.387350 0.597544 -0.423475
1.333333 -0.543544 0.647120 -0.082766 -0.318089 0.511492 -0.292465
1.366667 -0.555809 0.669801 -0.115647 -0.247217 0.417344 -0.140016
1.400000 -0.562664 0.682619 -0.119687 -0.176099 0.316988 0.012712
1.433333 -0.563435 0.684808 -0.106856 -0.106487 0.213879 0.148767
1.466667 -0.563815 0.686404 -0.084178 -0.039619 0.110900 0.254421
1.500000 -0.563803 0.687404 -0.043572 0.023866 0.009769 0.322733
1.533333 -0.563400 0.687803 0.028966 0.083148 -0.087444 0.346142
1.566667 -0.559443 0.682836 0.044334 0.137028 -0.178496 0.329059
1.600000 -0.552035 0.673213 0.080373 0.184919 -0.261953 0.279621
1.633333 -0.542495 0.660561 0.074817 0.227209 -0.338480 0.211887
1.666667 -0.531466 0.645184 0.071151 0.264303 -0.408888 0.138293
1.700000 -0.520049 0.629249 0.045694 0.296647 -0.473449 0.073951
1.733333 -0.508361 0.610325 0.032700 0.324871 -0.532582 0.033458
1.766667 -0.496300 0.590870 0.013886 0.350142 -0.587501 0.020931
1.800000 -0.483876 0.570899 0.007459 0.373708 -0.639530 0.040394
1.833333 -0.471870 0.547436 -0.006613 0.396202 -0.688830 0.085408
1.866667 -0.459515 0.523490 0.002878 0.418089 -0.735689 0.146027
1.900000 -0.446823 0.499081 0.013584 0.439771 -0.780649 0.209006
1.933333 -0.433803 0.474229 0.024427 0.461465 -0.824333 0.262942
1.966667 -0.417913 0.445851 0.059506 0.482795 -0.866846 0.297957
2.000000 -0.399927 0.414493 0.085904 0.502979 -0.907742 0.307847
2.033333 -0.381643 0.382772 0.103919 0.521192 -0.947174 0.287948
2.066667 -0.362089 0.348779 0.112783 0.536701 -0.984778 0.245494
2.100000 -0.342264 0.314479 0.126653 0.548774 -1.020189 0.185313
2.133333 -0.322184 0.279903 0.127052 0.556592 -1.052924 0.114749
2.166667 -0.302691 0.244704 0.148631 0.559983 -1.082752 0.042427
2.200000 -0.283661 0.206896 0.128011 0.558972 -1.109604 -0.022523
2.233333 -0.264418 0.168901 0.121389 0.553587 -1.132710 -0.072811
2.266667 -0.244980 0.130750 0.102164 0.543967 -1.151825 -0.109915
2.300000 -0.226838 0.090870 0.088746 0.530375 -1.166573 -0.130981
2.333333 -0.208527 0.050900 0.079541 0.513444 -1.176747 -0.139507
2.366667 -0.191521 0.009576 0.072242 0.493590 -1.181211 -0.135579
2.400000 -0.174370 -0.031769 0.077631 0.471285 -1.179164 -0.128874
2.433333 -0.157086 -0.073100 0.071333 0.447363 -1.170455 -0.121963
2.466667 -0.141870 -0.113392 0.077833 0.422761 -1.154862 -0.116925
2.500000 -0.127715 -0.153988 0.073254 0.398266 -1.132401 -0.118506
2.533333 -0.115366 -0.193579 0.084148 0.374640 -1.103086 -0.127767
2.566667 -0.105835 -0.229804 0.078747 0.352738 -1.068817 -0.145260
2.600000 -0.096226 -0.265857 0.064927 0.333315 -1.031226 -0.164423
2.633333 -0.086544 -0.301707 0.062756 0.316882 -0.991676 -0.184104
2.666667 -0.076795 -0.337323 0.053837 0.303927 -0.950900 -0.199846
2.700000 -0.067717 -0.364302 0.041712 0.295090 -0.909921 -0.207267
2.733333 -0.058596 -0.390996 0.029586 0.290710 -0.869312 -0.202157
2.766667 -0.049438 -0.417382 0.020190 0.290780 -0.828091 -0.186486
2.800000 -0.040246 -0.443440 0.016038 0.295285 -0.785278 -0.163935
2.833333 -0.031026 -0.469147 -0.002819 0.304265 -0.739734 -0.134515
2.866667 -0.021780 -0.494484 -0.010211 0.317387 -0.691190 -0.101164
2.900000 -0.012515 -0.519429 -0.005725 0.334037 -0.638476 -0.066749
2.933333 -0.003233 -0.543962 -0.007338 0.353800 -0.580918 -0.035278
2.966667 0.006060 -0.568062 -0.003099 0.376483 -0.518302 -0.006348
3.000000 0.019427 -0.586097 0.014747 0.401548 -0.450883 0.020091
3.033333 0.034785 -0.599603 0.015421 0.428169 -0.379575 0.041588
3.066667 0.050330 -0.609026 0.016933 0.455581 -0.305444 0.054803
3.100000 0.066791 -0.615414 0.008502 0.482999 -0.230423 0.059666
3.133333 0.083186 -0.621307 0.002131 0.509498 -0.156520 0.058018
3.166667 0.100241 -0.624819 -0.000975 0.533956 -0.085976 0.050390
3.200000 0.118740 -0.625969 0.020588 0.555808 -0.020250 0.036811
3.233333 0.138139 -0.624837 0.030527 0.574710 0.039958 0.019592
3.266667 0.158388 -0.621000 0.026388 0.590188 0.094487 0.004408
3.300000 0.180231 -0.613789 0.027511 0.601875 0.143511 -0.007415
3.333333 0.201899 -0.606098 0.029299 0.609133 0.187393 -0.015848
3.366667 0.223375 -0.597938 0.025669 0.611454 0.226673 -0.020822
3.400000 0.244640 -0.589322 0.018221 0.608250 0.261735 -0.018065
3.433333 0.265677 -0.580262 0.007080 0.598725 0.292722 -0.008449
3.466667 0.286469 -0.570770 0.004109 0.582346 0.319877 0.004037
3.500000 0.307865 -0.558548 0.000161 0.558460 0.343453 0.018856
3.533333 0.328976 -0.545921 -0.007800 0.526876 0.363684 0.033853
3.566667 0.348646 -0.532040 0.005484 0.487518 0.380768 0.047122
3.600000 0.365414 -0.518264 0.022595 0.440200 0.394772 0.054429
3.633333 0.381849 -0.504139 0.028744 0.385194 0.405841 0.055395
3.666667 0.393703 -0.489675 0.040210 0.323233 0.413956 0.049923
3.700000 0.405202 -0.474904 0.038847 0.255589 0.419375 0.038164
3.733333 0.416336 -0.459842 0.039662 0.183274 0.422424 0.023994
3.766667 0.422251 -0.445227 0.029052 0.107516 0.423637 0.011559
3.800000 0.423962 -0.430996 0.029666 0.029842 0.423559 0.003075
3.833333 0.422123 -0.417332 0.032052 -0.047998 0.422686 -0.000067
3.866667 0.416933 -0.403765 0.014189 -0.124560 0.421589 0.006108
3.900000 0.411385 -0.390015 0.009962 -0.199062 0.420604 0.019802
3.933333 0.403063 -0.376304 0.022311 -0.269955 0.420037 0.036433
3.966667 0.392217 -0.362077 0.021651 -0.336225 0.419975 0.051707
4.000000 0.378215 -0.348327 0.017851 -0.397213 0.420412 0.063249
4.033333 0.363901 -0.334466 0.025965 -0.452773 0.421118 0.069284
4.066667 0.344388 -0.320392 0.043793 -0.502328 0.421604 0.066946
4.100000 0.324601 -0.306246 0.045645 -0.544162 0.421145 0.061235
4.133333 0.304561 -0.292041 0.055063 -0.576841 0.418723 0.059258
4.166667 0.284290 -0.277793 0.060016 -0.598901 0.413445 0.064506
4.200000 0.263809 -0.263515 0.055708 -0.608782 0.404319 0.079257
4.233333 0.239244 -0.249024 0.042535 -0.604612 0.390555 0.104500
4.266667 0.214517 -0.234540 0.043823 -0.585917 0.371639 0.137682
4.300000 0.189652 -0.220077 0.034086 -0.553555 0.347493 0.171990
4.333333 0.165149 -0.206397 0.024134 -0.509301 0.318661 0.198414
4.366667 0.143006 -0.194220 0.022910 -0.454963 0.285778 0.214127
4.400000 0.125676 -0.183870 0.048707 -0.393161 0.249980 0.215474
4.433333 0.114290 -0.176053 0.083204 -0.327747 0.212710 0.199987
4.466667 0.109266 -0.171522 0.138761 -0.262328 0.175669 0.168431
4.500000 0.104234 -0.167037 0.154990 -0.200016 0.140343 0.123524
4.533333 0.103240 -0.164787 0.156920 -0.143650 0.107998 0.069317
4.566667 0.103887 -0.163732 0.134356 -0.095794 0.079747 0.009622
4.600000 0.104521 -0.163565 0.107413 -0.057903 0.056304 -0.049805
4.633333 0.105165 -0.163441 0.090124 -0.029968 0.037851 -0.101332
4.666667 0.105817 -0.163359 0.075430 -0.010811 0.023968 -0.138438
4.700000 0.106478 -0.163321 0.071882 0.000753 0.014234 -0.158727
4.733333 0.107149 -0.163324 0.072453 0.006552 0.007924 -0.161824
4.766667 0.107828 -0.163369 0.067904 0.008492 0.004240 -0.151984
4.800000 0.108050 -0.163355 0.068185 0.008206 0.002333 -0.133526
4.833333 0.108281 -0.163382 0.069302 0.006835 0.001552 -0.113957
