t x y theta dxdt dydt dthetadt
0.000000 0.000000 0.000000 -0.252455 0.006379 -0.005964 0.007402
0.033333 0.000267 -0.000163 -0.263258 0.007850 -0.006644 0.005006
0.066667 -0.000162 -0.000228 -0.253313 0.011252 -0.007832 0.001802
0.100000 -0.001392 -0.000130 -0.259584 0.017455 -0.009753 0.008933
0.133333 -0.001927 -0.000217 -0.246503 0.027500 -0.012685 0.035472
0.166667 -0.001744 -0.000495 -0.265217 0.042112 -0.016836 0.089993
0.200000 -0.000821 -0.000971 -0.251532 0.061774 -0.022348 0.180364
0.233333 0.000863 -0.001653 -0.264964 0.087268 -0.029451 0.309815
0.266667 0.002569 -0.002262 -0.268659 0.118891 -0.038268 0.485635
0.300000 0.005080 -0.003089 -0.256453 0.156511 -0.048726 0.697576
0.333333 0.008416 -0.004141 -0.269054 0.200288 -0.060714 0.943983
0.366667 0.013369 -0.005589 -0.256660 0.250697 -0.074074 1.213871
0.400000 0.021092 -0.007778 -0.215044 0.308163 -0.088637 1.502134
0.433333 0.033247 -0.011426 -0.136891 0.372216 -0.103834 1.799250
0.466667 0.046297 -0.015327 -0.054661 0.442649 -0.119049 2.091301
0.500000 0.060254 -0.019485 0.049563 0.519068 -0.133738 2.375933
0.533333 0.075130 -0.023904 0.134354 0.600382 -0.147424 2.639776
0.566667 0.096096 -0.029954 0.218186 0.684614 -0.159647 2.876635
0.600000 0.117998 -0.036275 0.342769 0.770059 -0.170137 3.074385
0.633333 0.144441 -0.043206 0.428075 0.855326 -0.179081 3.231246
0.666667 0.176124 -0.050249 0.543312 0.938508 -0.187055 3.344810
0.700000 0.212230 -0.056949 0.662224 1.017710 -0.194713 3.410183
0.733333 0.249263 -0.063935 0.793827 1.091346 -0.202623 3.425750
0.766667 0.289651 -0.070213 0.929043 1.158718 -0.211594 3.390368
0.800000 0.332463 -0.076018 1.069143 1.218932 -0.222240 3.307512
0.833333 0.376168 -0.082119 1.206900 1.271547 -0.235253 3.172289
0.866667 0.421069 -0.088970 1.317774 1.316838 -0.250895 2.989256
0.900000 0.466832 -0.096123 1.417367 1.355602 -0.269388 2.765248
0.933333 0.512940 -0.104871 1.505322 1.388810 -0.290989 2.512996
0.966667 0.559877 -0.113925 1.586117 1.417417 -0.315674 2.245602
1.000000 0.608011 -0.125971 1.659930 1.442609 -0.343203 1.977156
1.033333 0.656938 -0.138320 1.714093 1.465442 -0.372892 1.727206
1.066667 0.706638 -0.150971 1.750615 1.486792 -0.404065 1.507379
1.100000 0.757094 -0.163919 1.797138 1.507375 -0.435968 1.324230
1.133333 0.808285 -0.177162 1.815688 1.527578 -0.467749 1.182224
1.166667 0.859450 -0.193174 1.828644 1.547757 -0.498386 1.081732
1.200000 0.910788 -0.211267 1.853484 1.568253 -0.527064 1.019734
1.233333 0.962001 -0.230437 1.872074 1.589323 -0.553114 0.990492
1.266667 1.015088 -0.251179 1.896547 1.611141 -0.575741 0.988148
1.300000 1.068812 -0.272179 1.941429 1.633816 -0.594221 1.009943
1.333333 1.123730 -0.293793 1.977829 1.657649 -0.607991 1.049748
1.366667 1.179767 -0.315618 2.021502 1.682582 -0.616899 1.100398
1.400000 1.236378 -0.337667 2.066886 1.708334 -0.621040 1.156916
1.433333 1.293539 -0.359928 2.094828 1.734560 -0.620582 1.212986
1.466667 1.350628 -0.381277 2.135066 1.760983 -0.616269 1.262198
1.500000 1.409603 -0.402254 2.169339 1.787170 -0.608862 1.299121
1.533333 1.470201 -0.422259 2.204664 1.812820 -0.599227 1.317624
1.566667 1.531259 -0.442436 2.258214 1.837827 -0.588178 1.316696
1.600000 1.593833 -0.461201 2.316166 1.862214 -0.576586 1.291717
1.633333 1.656814 -0.480120 2.371764 1.886178 -0.565412 1.240382
1.666667 1.720175 -0.499187 2.441469 1.909803 -0.555190 1.161822
1.700000 1.784324 -0.517185 2.477730 1.933456 -0.546530 1.056124
1.733333 1.849322 -0.534628 2.521763 1.957227 -0.539797 0.926619
1.766667 1.914906 -0.551437 2.554328 1.981173 -0.535319 0.779316
1.800000 1.980756 -0.568367 2.575724 2.005299 -0.533047 0.620711
1.833333 2.046312 -0.584994 2.584856 2.029369 -0.532844 0.457584
1.866667 2.114317 -0.602201 2.591536 2.053007 -0.534628 0.300889
1.900000 2.182498 -0.619515 2.596788 2.075933 -0.538160 0.157675
1.933333 2.252868 -0.637623 2.586135 2.097875 -0.543166 0.033302
1.966667 2.325210 -0.656151 2.588351 2.118561 -0.549261 -0.074619
2.000000 2.397624 -0.674769 2.576475 2.137734 -0.556125 -0.162541
2.033333 2.470074 -0.693470 2.552763 2.155205 -0.563393 -0.227955
2.066667 2.542521 -0.712245 2.546185 2.171190 -0.570762 -0.275253
2.100000 2.614931 -0.731089 2.561670 2.185518 -0.577911 -0.309439
2.133333 2.688050 -0.750712 2.525175 2.198247 -0.584629 -0.328668
2.166667 2.761056 -0.770388 2.504253 2.209672 -0.590754 -0.330948
2.200000 2.833911 -0.790108 2.498075 2.220024 -0.596193 -0.318148
2.233333 2.908739 -0.810335 2.493108 2.229402 -0.600850 -0.297275
2.266667 2.983338 -0.830590 2.474205 2.237637 -0.604643 -0.268860
2.300000 3.058953 -0.851450 2.461883 2.244828 -0.607632 -0.229934
2.333333 3.135021 -0.872261 2.445389 2.250970 -0.609945 -0.188953
2.366667 3.210738 -0.893073 2.445079 2.255555 -0.611679 -0.149445
2.400000 3.286441 -0.913700 2.441639 2.258104 -0.612943 -0.115689
2.433333 3.361765 -0.933793 2.436618 2.258482 -0.614045 -0.086172
2.466667 3.436612 -0.953858 2.456381 2.256614 -0.615238 -0.065316
2.500000 3.512859 -0.974212 2.447374 2.251994 -0.616611 -0.056977
2.533333 3.588545 -0.994520 2.467391 2.244177 -0.618189 -0.060229
2.566667 3.663627 -1.014772 2.455233 2.233158 -0.620013 -0.071977
2.600000 3.737876 -1.035217 2.449082 2.218801 -0.622077 -0.089832
2.633333 3.813850 -1.056387 2.441579 2.200411 -0.624093 -0.111736
2.666667 3.889090 -1.077472 2.444392 2.177281 -0.625795 -0.137450
2.700000 3.961903 -1.098484 2.440126 2.149447 -0.627093 -0.172152
2.733333 4.033896 -1.119387 2.442320 2.116613 -0.628030 -0.223952
2.766667 4.104812 -1.141128 2.417687 2.078075 -0.628693 -0.306216
2.800000 4.174826 -1.162735 2.406749 2.033133 -0.629278 -0.431885
2.833333 4.242785 -1.183563 2.381607 1.981612 -0.630132 -0.606697
2.866667 4.309766 -1.204234 2.395107 1.923345 -0.631601 -0.829532
2.900000 4.375729 -1.224734 2.400256 1.857187 -0.633881 -1.094707
2.933333 4.438092 -1.245056 2.407848 1.782326 -0.636784 -1.390623
2.966667 4.496659 -1.266048 2.392998 1.698378 -0.639890 -1.702274
3.000000 4.554108 -1.286831 2.324524 1.605166 -0.642564 -2.007107
3.033333 4.610410 -1.307391 2.221048 1.502407 -0.644060 -2.293762
3.066667 4.662261 -1.329289 2.093579 1.389801 -0.643500 -2.549599
3.100000 4.709407 -1.352340 1.947105 1.268076 -0.640080 -2.758103
3.133333 4.750952 -1.375795 1.802746 1.138162 -0.633451 -2.904710
3.166667 4.786412 -1.398777 1.713660 1.001389 -0.623637 -2.986051
3.200000 4.820627 -1.421450 1.628728 0.859398 -0.610876 -3.012026
3.233333 4.848130 -1.442932 1.519791 0.714604 -0.595607 -2.986849
3.266667 4.869168 -1.462627 1.413742 0.569585 -0.578884 -2.919564
3.300000 4.884701 -1.480936 1.318002 0.426624 -0.562115 -2.828288
3.333333 4.894977 -1.497930 1.239572 0.288071 -0.546510 -2.734027
3.366667 4.900298 -1.514026 1.151864 0.155644 -0.533131 -2.640731
3.400000 4.900792 -1.529691 1.050511 0.031022 -0.522965 -2.543164
3.433333 4.896268 -1.545506 0.973247 -0.085029 -0.516760 -2.444520
3.466667 4.886483 -1.562529 0.906036 -0.191614 -0.514350 -2.347267
3.500000 4.875590 -1.579110 0.817449 -0.288085 -0.514920 -2.247210
3.533333 4.863627 -1.595237 0.727216 -0.374165 -0.517564 -2.134584
3.566667 4.850631 -1.610899 0.663190 -0.449807 -0.521306 -2.013416
3.600000 4.832675 -1.628749 0.599286 -0.514824 -0.524940 -1.890585
3.633333 4.810722 -1.648526 0.538648 -0.568421 -0.527219 -1.763830
3.666667 4.787857 -1.667790 0.476067 -0.609773 -0.527397 -1.631449
3.700000 4.764125 -1.686525 0.422865 -0.637967 -0.525021 -1.497897
3.733333 4.739575 -1.704714 0.383682 -0.652337 -0.519740 -1.374057
3.766667 4.714252 -1.722341 0.342159 -0.651919 -0.511248 -1.258102
3.800000 4.688539 -1.739910 0.303497 -0.637004 -0.499644 -1.152635
3.833333 4.662148 -1.756886 0.266252 -0.608741 -0.485149 -1.059618
3.866667 4.638548 -1.773117 0.247737 -0.569566 -0.467958 -0.981650
3.900000 4.614362 -1.788726 0.203911 -0.521709 -0.448003 -0.913516
3.933333 4.594743 -1.803723 0.187095 -0.467499 -0.424925 -0.848833
3.966667 4.581224 -1.817963 0.180159 -0.409864 -0.398091 -0.787609
4.000000 4.575397 -1.831230 0.152958 -0.351604 -0.366763 -0.719345
4.033333 4.569124 -1.843830 0.113878 -0.295669 -0.330314 -0.641054
4.066667 4.562427 -1.855748 0.071690 -0.243798 -0.287928 -0.545130
4.100000 4.555331 -1.866971 0.057977 -0.198183 -0.239172 -0.434158
4.133333 4.547859 -1.877485 0.020084 -0.160181 -0.184078 -0.303494
4.166667 4.545351 -1.884238 0.030972 -0.130398 -0.123485 -0.158299
4.200000 4.542511 -1.890264 0.023467 -0.108100 -0.058147 -0.013292
4.233333 4.541991 -1.892385 0.019112 -0.091997 0.010918 0.118568
4.266667 4.541761 -1.890435 0.001196 -0.080883 0.082212 0.220939
4.300000 4.540749 -1.884330 0.029550 -0.073090 0.153988 0.282780
4.333333 4.539474 -1.877485 0.082818 -0.067335 0.224717 0.284331
4.366667 4.537129 -1.867637 0.122117 -0.061971 0.293465 0.223997
4.400000 4.534047 -1.855359 0.157867 -0.055916 0.359294 0.105472
4.433333 4.530516 -1.840544 0.177935 -0.048017 0.421718 -0.062314
4.466667 4.527690 -1.823811 0.196579 -0.037456 0.480653 -0.269554
4.500000 4.524687 -1.806374 0.188318 -0.023879 0.536700 -0.496295
4.533333 4.521523 -1.788245 0.164339 -0.007198 0.590390 -0.716778
4.566667 4.520464 -1.767924 0.113109 0.011803 0.642364 -0.912718
4.600000 4.521167 -1.745765 0.043947 0.031820 0.693172 -1.068908
4.633333 4.523635 -1.722034 -0.032103 0.051201 0.743187 -1.172193
4.666667 4.527662 -1.695983 -0.101766 0.068419 0.792663 -1.210812
4.700000 4.531587 -1.669323 -0.155198 0.082232 0.841420 -1.189260
4.733333 4.536279 -1.640085 -0.188539 0.091589 0.889031 -1.117105
4.766667 4.541592 -1.608678 -0.233448 0.095798 0.934808 -1.006817
4.800000 4.546824 -1.576726 -0.277538 0.094865 0.978177 -0.871057
4.833333 4.551465 -1.542871 -0.288953 0.088985 1.018506 -0.727793
4.866667 4.555320 -1.507186 -0.306238 0.078619 1.055238 -0.591671
4.900000 4.557877 -1.469763 -0.304356 0.064076 1.087643 -0.470585
4.933333 4.558809 -1.431228 -0.312722 0.045884 1.115384 -0.366209
4.966667 4.559699 -1.392278 -0.314013 0.024679 1.138073 -0.281341
5.000000 4.560557 -1.352942 -0.316761 0.000621 1.154983 -0.215866
5.033333 4.561392 -1.313249 -0.326030 -0.025865 1.165705 -0.161178
5.066667 4.562214 -1.273227 -0.337880 -0.054610 1.169920 -0.114618
5.100000 4.560190 -1.232664 -0.333471 -0.085026 1.167480 -0.073041
5.133333 4.558174 -1.191830 -0.338789 -0.116859 1.158191 -0.036592
5.166667 4.553145 -1.151703 -0.351354 -0.149373 1.141909 -0.002959
5.200000 4.548150 -1.111360 -0.347821 -0.181249 1.118664 0.023738
5.233333 4.540588 -1.073033 -0.349172 -0.210955 1.088079 0.032566
5.266667 4.533092 -1.034541 -0.341344 -0.236691 1.049298 0.017784
5.300000 4.523325 -0.999045 -0.330686 -0.256763 1.001910 -0.023939
5.333333 4.511379 -0.967030 -0.315317 -0.269162 0.945757 -0.095794
5.366667 4.499555 -0.934914 -0.298373 -0.272726 0.880824 -0.201835
5.400000 4.487876 -0.902714 -0.303574 -0.266894 0.807673 -0.332852
5.433333 4.475745 -0.875135 -0.312076 -0.251870 0.727601 -0.474777
5.466667 4.463800 -0.847502 -0.308232 -0.228249 0.642745 -0.615200
5.500000 4.453633 -0.825160 -0.318470 -0.197356 0.555474 -0.742534
5.533333 4.446091 -0.807997 -0.366902 -0.161140 0.468228 -0.841434
5.566667 4.441283 -0.795612 -0.445900 -0.121641 0.384330 -0.892949
5.600000 4.439216 -0.787686 -0.514456 -0.080843 0.307178 -0.889559
5.633333 4.439692 -0.783996 -0.566370 -0.040595 0.239789 -0.827275
5.666667 4.440432 -0.780249 -0.587182 -0.002600 0.184627 -0.706769
5.700000 4.442921 -0.780423 -0.626151 0.031971 0.143489 -0.535405
5.733333 4.445686 -0.780508 -0.642891 0.062628 0.117127 -0.336977
5.766667 4.449285 -0.781688 -0.664091 0.089453 0.104803 -0.137584
5.800000 4.453539 -0.781705 -0.670724 0.112765 0.104718 0.042028
5.833333 4.458088 -0.781570 -0.654181 0.133114 0.114595 0.182675
5.866667 4.462432 -0.778465 -0.599974 0.151123 0.131997 0.272781
5.900000 4.466936 -0.772995 -0.565714 0.167428 0.154327 0.308791
5.933333 4.472485 -0.765695 -0.515162 0.182240 0.179767 0.306631
5.966667 4.479461 -0.757359 -0.466932 0.195448 0.206952 0.281645
6.000000 4.486760 -0.748795 -0.440392 0.206899 0.235272 0.245031
6.033333 4.494384 -0.739990 -0.451601 0.216476 0.264350 0.210418
6.066667 4.502336 -0.730931 -0.512403 0.224135 0.294327 0.193831
6.100000 4.511238 -0.722477 -0.564349 0.230091 0.325575 0.202121
6.133333 4.520118 -0.713058 -0.570204 0.234955 0.358172 0.227456
6.166667 4.528528 -0.702206 -0.570862 0.239846 0.392212 0.263102
6.200000 4.537273 -0.691049 -0.550393 0.245852 0.427383 0.300499
6.233333 4.544958 -0.676587 -0.530062 0.254386 0.463223 0.327734
6.266667 4.551534 -0.658760 -0.479153 0.266720 0.498677 0.319671
6.300000 4.558460 -0.640602 -0.421541 0.283667 0.532688 0.259177
6.333333 4.565559 -0.619873 -0.378176 0.305807 0.564244 0.145318
6.366667 4.573017 -0.598805 -0.360401 0.333154 0.592556 -0.021022
6.400000 4.582665 -0.576767 -0.343704 0.365545 0.616975 -0.230812
6.433333 4.595386 -0.554839 -0.369075 0.401799 0.637377 -0.469383
6.466667 4.608469 -0.532571 -0.424146 0.440784 0.654308 -0.708451
6.500000 4.624890 -0.510597 -0.456087 0.481524 0.668596 -0.922426
6.533333 4.641666 -0.488282 -0.505462 0.523039 0.681388 -1.093439
6.566667 4.662135 -0.465552 -0.552935 0.564069 0.693693 -1.210603
6.600000 4.682943 -0.442477 -0.614913 0.603598 0.706679 -1.267420
6.633333 4.704082 -0.419057 -0.695806 0.641459 0.721193 -1.266228
6.666667 4.725540 -0.395289 -0.762468 0.677316 0.737619 -1.216921
6.700000 4.749217 -0.371262 -0.805993 0.710651 0.755884 -1.128465
6.733333 4.773190 -0.346885 -0.837466 0.740923 0.775631 -1.017250
6.766667 4.797449 -0.322157 -0.851397 0.768287 0.796395 -0.895287
6.800000 4.823739 -0.295815 -0.870330 0.792720 0.817448 -0.773993
6.833333 4.853040 -0.266859 -0.898762 0.813763 0.837818 -0.661472
6.866667 4.882583 -0.237557 -0.904575 0.831058 0.856553 -0.565762
6.900000 4.912349 -0.207911 -0.912696 0.844672 0.872886 -0.493657
6.933333 4.941590 -0.177317 -0.923201 0.854659 0.886063 -0.439605
6.966667 4.971018 -0.146386 -0.941468 0.860849 0.895552 -0.398131
7.000000 5.000615 -0.115121 -0.941702 0.863310 0.901088 -0.367339
7.033333 5.029630 -0.083266 -0.947292 0.862602 0.902954 -0.344628
7.066667 5.058303 -0.052226 -0.978283 0.859422 0.901702 -0.322148
7.100000 5.086770 -0.022225 -0.996353 0.853981 0.897843 -0.294113
7.133333 5.115334 0.008096 -1.001182 0.846644 0.892157 -0.264255
7.166667 5.144171 0.037609 -1.013037 0.837392 0.885243 -0.234428
7.200000 5.172492 0.066404 -1.018588 0.826110 0.877683 -0.200739
7.233333 5.200859 0.095517 -1.035883 0.812347 0.869819 -0.160895
7.266667 5.227366 0.123394 -1.022358 0.795392 0.861879 -0.120303
7.300000 5.253887 0.151591 -1.022545 0.774807 0.854364 -0.080859
7.333333 5.280408 0.180109 -1.023314 0.750062 0.847595 -0.041586
7.366667 5.306915 0.208949 -1.027152 0.721184 0.842227 -0.002676
7.400000 5.333394 0.238111 -1.029837 0.688009 0.839050 0.032311
7.433333 5.356239 0.265358 -1.034777 0.650714 0.839331 0.060779
7.466667 5.379028 0.292933 -1.036800 0.609796 0.844108 0.087707
7.500000 5.397606 0.318896 -1.030600 0.566378 0.854247 0.112621
7.533333 5.416111 0.345195 -1.004624 0.521636 0.870848 0.135673
7.566667 5.434538 0.371836 -1.007463 0.476804 0.894724 0.154987
7.600000 5.449328 0.399199 -1.002478 0.433777 0.926291 0.168989
7.633333 5.460759 0.428430 -0.989993 0.394177 0.964821 0.178310
7.666667 5.472106 0.458015 -0.997434 0.359482 1.009742 0.178292
7.700000 5.481312 0.490364 -0.985562 0.330374 1.060073 0.166935
7.733333 5.489284 0.526752 -0.967360 0.307694 1.114244 0.143018
7.766667 5.496868 0.567281 -0.976326 0.291992 1.170181 0.107708
7.800000 5.504394 0.608148 -0.963957 0.283037 1.225996 0.060317
7.833333 5.511869 0.649342 -0.951235 0.280316 1.280557 0.002635
7.866667 5.519936 0.693712 -0.939598 0.283256 1.332494 -0.063325
7.900000 5.528813 0.740683 -0.951569 0.291209 1.380812 -0.132508
7.933333 5.539148 0.789974 -0.955235 0.303023 1.425011 -0.200599
7.966667 5.549456 0.839527 -0.957683 0.317681 1.465570 -0.266249
8.000000 5.559739 0.889322 -0.983692 0.334348 1.502941 -0.320738
8.033333 5.570001 0.939339 -0.995457 0.352588 1.537605 -0.363935
8.066667 5.582384 0.991960 -1.013901 0.371888 1.570318 -0.391197
8.100000 5.594750 1.044757 -1.042851 0.392050 1.602024 -0.402924
8.133333 5.609107 1.099595 -1.076915 0.413103 1.633407 -0.399339
8.166667 5.623447 1.154558 -1.068561 0.434994 1.664626 -0.381022
8.200000 5.637770 1.209623 -1.084295 0.457636 1.695711 -0.354088
8.233333 5.652072 1.264762 -1.089390 0.480691 1.726390 -0.319777
8.266667 5.667863 1.322437 -1.100255 0.503996 1.756347 -0.282810
8.300000 5.685075 1.381954 -1.117318 0.527320 1.785110 -0.247985
8.333333 5.703459 1.443194 -1.122932 0.550420 1.812253 -0.216987
8.366667 5.723322 1.506175 -1.126909 0.572783 1.837164 -0.188607
8.400000 5.743146 1.569072 -1.125811 0.594055 1.859421 -0.163527
8.433333 5.762922 1.631852 -1.122191 0.614041 1.878740 -0.143717
8.466667 5.784128 1.695437 -1.136664 0.632500 1.894928 -0.125407
8.500000 5.806860 1.759981 -1.144523 0.649010 1.907480 -0.106609
8.533333 5.829516 1.824297 -1.146419 0.663336 1.916114 -0.089356
8.566667 5.852084 1.888348 -1.146438 0.675625 1.920881 -0.073860
8.600000 5.874553 1.952096 -1.147509 0.685937 1.921791 -0.059202
8.633333 5.898389 2.017727 -1.163883 0.694150 1.918706 -0.041568
8.666667 5.922102 2.082977 -1.143322 0.700215 1.911330 -0.029580
8.700000 5.945679 2.147809 -1.150629 0.704391 1.899696 -0.021794
8.733333 5.969831 2.212711 -1.150407 0.706630 1.883379 -0.019077
8.766667 5.994187 2.276926 -1.168080 0.706657 1.861706 -0.022771
8.800000 6.018427 2.340067 -1.137262 0.704059 1.833683 -0.035067
8.833333 6.041929 2.400797 -1.152451 0.698666 1.798583 -0.055991
8.866667 6.065571 2.461019 -1.145996 0.690124 1.755607 -0.079111
8.900000 6.088946 2.519783 -1.138994 0.677849 1.703783 -0.104661
8.933333 6.112452 2.578419 -1.144634 0.661546 1.642708 -0.129814
8.966667 6.135707 2.636341 -1.162902 0.641153 1.572408 -0.151145
9.000000 6.158253 2.691085 -1.165018 0.616951 1.493715 -0.162716
9.033333 6.179816 2.742575 -1.170347 0.588988 1.407171 -0.166898
9.066667 6.200072 2.790182 -1.189996 0.557462 1.313663 -0.158315
9.100000 6.219000 2.833876 -1.206403 0.522763 1.214448 -0.135444
9.133333 6.236031 2.872875 -1.210149 0.485335 1.110902 -0.095383
9.166667 6.251770 2.908031 -1.208126 0.445587 1.004411 -0.041956
9.200000 6.265787 2.938099 -1.215140 0.403840 0.896034 0.023415
9.233333 6.277350 2.962312 -1.199671 0.360891 0.787666 0.100269
9.266667 6.288550 2.985644 -1.219471 0.317614 0.681203 0.179394
9.300000 6.299385 3.008094 -1.201121 0.274927 0.578566 0.254956
9.333333 6.309850 3.029661 -1.196555 0.233485 0.481141 0.319787
9.366667 6.317059 3.044218 -1.194006 0.194080 0.390505 0.373657
9.400000 6.321591 3.052669 -1.153405 0.157502 0.308161 0.408139
9.433333 6.323599 3.055692 -1.136594 0.124240 0.235036 0.423781
9.466667 6.325229 3.057878 -1.113948 0.094672 0.171870 0.420688
9.500000 6.326486 3.059244 -1.085837 0.069067 0.119123 0.401531
9.533333 6.327376 3.059810 -1.062011 0.047764 0.077253 0.368068
9.566667 6.327582 3.058478 -1.053511 0.030717 0.045764 0.320401
9.600000 6.327430 3.056387 -1.049899 0.017609 0.023629 0.269047
9.633333 6.327260 3.055116 -1.043584 0.007928 0.009335 0.214265
9.666667 6.327086 3.054995 -1.058074 0.001174 0.001302 0.161559
9.700000 6.327257 3.056346 -1.042753 -0.003275 -0.002338 0.112439
9.733333 6.327098 3.057016 -1.048262 -0.006015 -0.003304 0.073510
9.766667 6.326611 3.057021 -1.046696 -0.007544 -0.002906 0.046057
9.800000 6.325803 3.056377 -1.036219 -0.008172 -0.002020 0.025097
