t x y theta dxdt dydt dthetadt
0.000000 0.000000 0.000000 0.058565 0.120609 -0.073293 0.003785
0.033333 0.004489 -0.003169 0.053222 0.123033 -0.070781 0.010826
0.066667 0.009210 -0.006553 0.063849 0.125685 -0.066249 0.020429
0.100000 0.013690 -0.009518 0.070670 0.128930 -0.058938 0.030894
0.133333 0.017929 -0.012066 0.066900 0.133169 -0.048142 0.037734
0.166667 0.021931 -0.014203 0.079341 0.138959 -0.033252 0.042914
0.200000 0.026233 -0.015889 0.061866 0.146905 -0.013795 0.044267
0.233333 0.030301 -0.017173 0.078699 0.157877 0.010689 0.038257
0.266667 0.034138 -0.018059 0.063651 0.172492 0.040119 0.022881
0.300000 0.038964 -0.017824 0.060535 0.191007 0.074080 -0.004821
0.333333 0.044681 -0.015924 0.072343 0.213581 0.112042 -0.045439
0.366667 0.050167 -0.013643 0.074935 0.240174 0.153311 -0.101209
0.400000 0.057637 -0.008412 0.087494 0.270478 0.196927 -0.176870
0.433333 0.067238 -0.000343 0.095845 0.303575 0.241560 -0.268469
0.466667 0.076598 0.008076 0.076929 0.338693 0.286145 -0.373996
0.500000 0.088249 0.019236 0.068939 0.374849 0.329608 -0.485064
0.533333 0.102139 0.032553 0.055665 0.410446 0.371039 -0.591204
0.566667 0.117954 0.047516 0.033821 0.443511 0.409435 -0.679688
0.600000 0.133488 0.062764 0.002868 0.472209 0.444230 -0.733519
0.633333 0.151105 0.079105 -0.045046 0.494143 0.475463 -0.742794
0.666667 0.168415 0.095690 -0.085471 0.506923 0.503176 -0.699533
0.700000 0.187823 0.113587 -0.135101 0.507748 0.527928 -0.601355
0.733333 0.209287 0.132559 -0.177387 0.494554 0.550388 -0.452258
0.766667 0.230393 0.151710 -0.206892 0.465412 0.571699 -0.261470
0.800000 0.251120 0.171015 -0.235405 0.418425 0.592860 -0.042416
0.833333 0.271449 0.190451 -0.233883 0.353591 0.614564 0.191086
0.866667 0.284222 0.211249 -0.210871 0.271480 0.637348 0.422935
0.900000 0.296568 0.232124 -0.163970 0.174348 0.661334 0.634840
0.933333 0.308475 0.253050 -0.104854 0.065383 0.686052 0.808863
0.966667 0.308594 0.275779 -0.070964 -0.050564 0.710455 0.932419
1.000000 0.308266 0.298501 -0.018943 -0.168601 0.733057 0.994124
1.033333 0.298615 0.323562 0.023853 -0.283814 0.752143 0.991414
1.066667 0.281487 0.350829 0.058384 -0.391862 0.765670 0.926750
1.100000 0.258593 0.379898 0.107853 -0.489007 0.771117 0.810629
1.133333 0.235305 0.408825 0.153214 -0.572587 0.766708 0.660382
1.166667 0.209106 0.438258 0.190405 -0.642079 0.751078 0.489027
1.200000 0.182068 0.466894 0.214681 -0.697231 0.723480 0.313169
1.233333 0.154717 0.495286 0.217418 -0.739497 0.683635 0.142258
1.266667 0.128786 0.519679 0.178656 -0.770999 0.632713 -0.009566
1.300000 0.102602 0.543766 0.150707 -0.794917 0.572914 -0.135234
1.333333 0.076566 0.562220 0.123800 -0.814581 0.506444 -0.229320
1.366667 0.050336 0.580317 0.125378 -0.832807 0.435481 -0.289184
1.400000 0.023298 0.592608 0.099508 -0.852075 0.362667 -0.314325
1.433333 -0.005051 0.599278 0.094194 -0.874137 0.290808 -0.306749
1.466667 -0.033500 0.605540 0.074945 -0.899921 0.221382 -0.277080
1.500000 -0.062020 0.611384 0.065719 -0.929173 0.155542 -0.233395
1.533333 -0.093442 0.612919 0.057498 -0.960828 0.094131 -0.185197
1.566667 -0.124869 0.614018 0.055548 -0.993192 0.037829 -0.135003
1.600000 -0.156267 0.614674 0.064408 -1.024598 -0.013668 -0.085570
1.633333 -0.191822 0.612825 0.055851 -1.052168 -0.061196 -0.033810
1.666667 -0.230319 0.608978 0.062752 -1.072935 -0.105031 0.022437
1.700000 -0.268673 0.604676 0.064983 -1.083576 -0.145352 0.089865
1.733333 -0.308514 0.598714 0.059091 -1.080374 -0.182436 0.173502
1.766667 -0.349480 0.591439 0.061518 -1.060344 -0.216280 0.272079
1.800000 -0.390075 0.582968 0.070449 -1.020610 -0.246473 0.382352
1.833333 -0.428836 0.573140 0.057854 -0.960818 -0.272561 0.500990
1.866667 -0.467241 0.562868 0.067840 -0.881133 -0.294413 0.626275
1.900000 -0.500274 0.550915 0.083382 -0.783318 -0.312235 0.750399
1.933333 -0.532873 0.538532 0.131635 -0.671247 -0.326390 0.856348
1.966667 -0.555075 0.526044 0.180288 -0.549039 -0.337767 0.937571
2.000000 -0.576783 0.513145 0.221853 -0.420546 -0.347664 0.987249
2.033333 -0.586362 0.501296 0.278276 -0.289139 -0.357631 0.991196
2.066667 -0.583112 0.490710 0.335335 -0.158930 -0.369455 0.940371
2.100000 -0.579336 0.479743 0.356862 -0.033354 -0.385113 0.833392
2.133333 -0.575037 0.468399 0.385675 0.085323 -0.406344 0.687371
2.166667 -0.570215 0.456680 0.439777 0.195799 -0.434258 0.506905
2.200000 -0.564875 0.444592 0.470309 0.296258 -0.469345 0.303970
2.233333 -0.551287 0.430766 0.503897 0.386008 -0.511304 0.095816
2.266667 -0.537194 0.416586 0.455686 0.466124 -0.559170 -0.097315
2.300000 -0.517726 0.399076 0.446431 0.536919 -0.611028 -0.269601
2.333333 -0.494692 0.377917 0.406529 0.598456 -0.664683 -0.420862
2.366667 -0.470897 0.354318 0.368922 0.650361 -0.718033 -0.541383
2.400000 -0.446295 0.327708 0.323910 0.692092 -0.768845 -0.631339
2.433333 -0.419276 0.296809 0.310744 0.722879 -0.814787 -0.694173
2.466667 -0.391861 0.265646 0.289029 0.741435 -0.853755 -0.742970
2.500000 -0.364074 0.234244 0.263372 0.747637 -0.884138 -0.779671
2.533333 -0.335939 0.202624 0.254826 0.741595 -0.904437 -0.810447
2.566667 -0.307482 0.170811 0.240618 0.723150 -0.913020 -0.844619
2.600000 -0.281528 0.137967 0.210659 0.693261 -0.909020 -0.883008
2.633333 -0.258450 0.105450 0.183803 0.653507 -0.892293 -0.922377
2.666667 -0.235116 0.072805 0.141501 0.605139 -0.862402 -0.958790
2.700000 -0.211544 0.040057 0.118836 0.549451 -0.819486 -0.990854
2.733333 -0.192601 0.009472 0.075056 0.488481 -0.764498 -1.014352
2.766667 -0.178459 -0.017692 0.019004 0.425321 -0.699514 -1.026580
2.800000 -0.164127 -0.044902 -0.021157 0.362219 -0.626412 -1.031642
2.833333 -0.153820 -0.067043 -0.070609 0.300999 -0.547858 -1.032496
2.866667 -0.146901 -0.083849 -0.107493 0.243991 -0.467720 -1.029159
2.900000 -0.143741 -0.094685 -0.123898 0.193500 -0.389942 -1.022826
2.933333 -0.140413 -0.105536 -0.122170 0.150719 -0.317644 -1.017849
2.966667 -0.139001 -0.110870 -0.148158 0.115852 -0.253322 -1.017007
3.000000 -0.138669 -0.111711 -0.198367 0.089322 -0.199644 -1.017596
3.033333 -0.138164 -0.112585 -0.234313 0.070980 -0.157777 -1.019600
3.066667 -0.137480 -0.113502 -0.281767 0.060069 -0.127673 -1.022625
3.100000 -0.136611 -0.114473 -0.324701 0.055392 -0.108412 -1.022487
3.133333 -0.134898 -0.116253 -0.351965 0.056531 -0.099447 -1.013544
3.166667 -0.133149 -0.119752 -0.392293 0.063147 -0.099454 -0.990983
3.200000 -0.131198 -0.123333 -0.426755 0.074740 -0.106410 -0.953887
3.233333 -0.129041 -0.127003 -0.460274 0.091096 -0.118730 -0.900010
3.266667 -0.126674 -0.130771 -0.489753 0.112103 -0.135147 -0.829669
3.300000 -0.124090 -0.134645 -0.520680 0.137525 -0.154611 -0.746257
3.333333 -0.121287 -0.138634 -0.544322 0.166703 -0.175926 -0.651883
3.366667 -0.118008 -0.143424 -0.562702 0.199098 -0.198571 -0.552246
3.400000 -0.113348 -0.149108 -0.592675 0.234176 -0.222338 -0.452156
3.433333 -0.105790 -0.156574 -0.606341 0.271200 -0.246937 -0.359554
3.466667 -0.092737 -0.167312 -0.624653 0.309088 -0.271881 -0.278397
3.500000 -0.079456 -0.178187 -0.630216 0.346993 -0.296948 -0.213887
3.533333 -0.065952 -0.189201 -0.613433 0.383757 -0.321607 -0.174052
3.566667 -0.052231 -0.200356 -0.593997 0.418125 -0.345342 -0.160835
3.600000 -0.038300 -0.211654 -0.594747 0.449037 -0.367767 -0.175639
3.633333 -0.024164 -0.223094 -0.590719 0.475880 -0.388771 -0.215968
3.666667 -0.005640 -0.237719 -0.590578 0.498572 -0.408514 -0.275055
3.700000 0.013073 -0.252485 -0.602867 0.516613 -0.426648 -0.337960
3.733333 0.031964 -0.267389 -0.614642 0.529854 -0.443077 -0.387900
3.766667 0.051022 -0.282431 -0.635258 0.538432 -0.457580 -0.413067
3.800000 0.070236 -0.297609 -0.661069 0.542395 -0.469871 -0.402307
3.833333 0.089794 -0.314450 -0.688421 0.541445 -0.479209 -0.346905
3.866667 0.109486 -0.331420 -0.729356 0.535463 -0.484949 -0.252318
3.900000 0.127488 -0.348961 -0.755818 0.525291 -0.487047 -0.139855
3.933333 0.145602 -0.366624 -0.788258 0.511703 -0.485418 -0.029187
3.966667 0.163820 -0.384406 -0.821133 0.495240 -0.480022 0.062405
4.000000 0.182131 -0.402302 -0.783507 0.476444 -0.470821 0.107957
4.033333 0.195824 -0.417243 -0.695061 0.456431 -0.458771 0.082312
4.066667 0.209593 -0.432295 -0.644646 0.436141 -0.444881 -0.026603
4.100000 0.223433 -0.447458 -0.621467 0.415817 -0.429985 -0.211971
4.133333 0.237341 -0.462730 -0.594984 0.395837 -0.415009 -0.466818
4.166667 0.249986 -0.475781 -0.584641 0.376955 -0.401128 -0.778988
4.200000 0.261687 -0.487097 -0.608573 0.360009 -0.389666 -1.114752
4.233333 0.273441 -0.498526 -0.667488 0.345157 -0.380920 -1.436855
4.266667 0.284445 -0.509495 -0.753876 0.332537 -0.375077 -1.718587
4.300000 0.294417 -0.520643 -0.860656 0.322550 -0.372287 -1.949743
4.333333 0.304435 -0.531915 -1.010292 0.315550 -0.372751 -2.119670
4.366667 0.313639 -0.544395 -1.111463 0.311479 -0.376073 -2.226817
4.400000 0.322888 -0.557004 -1.209391 0.310185 -0.381717 -2.279298
4.433333 0.332183 -0.569744 -1.270042 0.311835 -0.389805 -2.295760
4.466667 0.341523 -0.582617 -1.329955 0.316659 -0.400645 -2.288212
4.500000 0.351949 -0.596361 -1.365367 0.324576 -0.414478 -2.259621
4.533333 0.362419 -0.610239 -1.411358 0.335767 -0.431503 -2.217412
4.566667 0.374005 -0.624086 -1.440134 0.350375 -0.452365 -2.162181
4.600000 0.385632 -0.638069 -1.519711 0.368826 -0.477562 -2.095440
4.633333 0.397541 -0.652280 -1.639214 0.391251 -0.507001 -2.004848
4.666667 0.409810 -0.667875 -1.779860 0.417714 -0.539897 -1.877438
4.700000 0.422110 -0.683606 -1.880048 0.448560 -0.575590 -1.706736
4.733333 0.435376 -0.701555 -1.932180 0.483434 -0.613005 -1.487078
4.766667 0.450825 -0.723023 -1.966701 0.522301 -0.650642 -1.219253
4.800000 0.468687 -0.748089 -2.008756 0.564396 -0.686746 -0.908196
4.833333 0.486562 -0.773267 -2.021395 0.609173 -0.719867 -0.577981
4.866667 0.508278 -0.800576 -2.052108 0.655465 -0.748924 -0.252182
4.900000 0.529986 -0.827971 -2.040307 0.701997 -0.772748 0.048703
4.933333 0.555990 -0.856046 -2.024386 0.747571 -0.790622 0.312783
4.966667 0.581954 -0.884178 -1.973680 0.790756 -0.802471 0.529270
5.000000 0.611413 -0.911741 -1.929817 0.830404 -0.809055 0.690788
5.033333 0.640791 -0.939333 -1.894027 0.865351 -0.811133 0.805881
5.066667 0.670066 -0.966940 -1.856647 0.895241 -0.809822 0.878132
5.100000 0.702226 -0.994235 -1.820456 0.919477 -0.806342 0.917420
5.133333 0.735662 -1.021114 -1.776530 0.938072 -0.801907 0.926830
5.166667 0.768921 -1.047968 -1.763775 0.951115 -0.797421 0.917539
5.200000 0.802505 -1.074086 -1.726212 0.959062 -0.793257 0.899127
5.233333 0.835619 -1.099712 -1.711214 0.962199 -0.789784 0.878190
5.266667 0.868007 -1.125094 -1.674218 0.960403 -0.786983 0.861044
5.300000 0.900112 -1.150406 -1.652140 0.953745 -0.784593 0.850269
5.333333 0.932565 -1.176633 -1.620312 0.942084 -0.782138 0.849056
5.366667 0.964683 -1.202767 -1.601427 0.924763 -0.778993 0.854935
5.400000 0.996219 -1.229430 -1.569002 0.900993 -0.774499 0.865744
5.433333 1.026971 -1.255958 -1.543845 0.870367 -0.768003 0.874976
5.466667 1.057313 -1.282356 -1.510258 0.832182 -0.758919 0.881067
5.500000 1.087220 -1.308610 -1.491357 0.785588 -0.746894 0.879948
5.533333 1.116666 -1.334709 -1.448877 0.729734 -0.731775 0.868854
5.566667 1.143337 -1.360167 -1.413931 0.665016 -0.713751 0.843386
5.600000 1.166883 -1.384622 -1.379335 0.591385 -0.693292 0.804590
5.633333 1.185622 -1.407053 -1.351558 0.508923 -0.671019 0.756795
5.666667 1.203822 -1.429290 -1.323193 0.418826 -0.647692 0.704162
5.700000 1.215194 -1.449542 -1.293035 0.323633 -0.624275 0.651821
5.733333 1.226004 -1.469588 -1.264675 0.225833 -0.601642 0.605296
5.766667 1.236248 -1.489421 -1.260795 0.127013 -0.580442 0.573929
5.800000 1.238204 -1.507869 -1.245844 0.029841 -0.561244 0.559833
5.833333 1.232589 -1.524875 -1.253321 -0.063114 -0.544413 0.565895
5.866667 1.226413 -1.541660 -1.240604 -0.149931 -0.530210 0.589419
5.900000 1.219686 -1.558219 -1.242058 -0.230337 -0.518492 0.630449
5.933333 1.205342 -1.575096 -1.207946 -0.303475 -0.509067 0.684388
5.966667 1.190478 -1.591743 -1.190728 -0.368267 -0.501721 0.745589
6.000000 1.175112 -1.608155 -1.147315 -0.424648 -0.495938 0.808618
6.033333 1.159265 -1.624327 -1.114024 -0.473223 -0.491074 0.866271
6.066667 1.142955 -1.640256 -1.075467 -0.514608 -0.486481 0.914478
6.100000 1.126204 -1.655937 -1.043536 -0.548645 -0.481551 0.946362
6.133333 1.105110 -1.672689 -1.000153 -0.576036 -0.475652 0.959225
6.166667 1.083619 -1.689186 -0.972803 -0.597569 -0.468272 0.948666
6.200000 1.061757 -1.705423 -0.943724 -0.613441 -0.458991 0.915244
6.233333 1.039397 -1.721342 -0.912003 -0.623229 -0.447526 0.861964
6.266667 1.016716 -1.736990 -0.882891 -0.626136 -0.433447 0.793267
6.300000 0.994193 -1.751676 -0.840933 -0.621890 -0.416619 0.712694
6.333333 0.971399 -1.766082 -0.805396 -0.610289 -0.397088 0.625944
6.366667 0.950132 -1.779278 -0.778330 -0.590916 -0.374792 0.537763
6.400000 0.928642 -1.792186 -0.770926 -0.563923 -0.349905 0.453433
6.433333 0.909734 -1.803337 -0.758327 -0.530127 -0.322835 0.373659
6.466667 0.890646 -1.814195 -0.767488 -0.491105 -0.294300 0.300103
6.500000 0.871396 -1.824760 -0.771551 -0.448238 -0.264803 0.236499
6.533333 0.855358 -1.833636 -0.779928 -0.402860 -0.234859 0.183919
6.566667 0.843117 -1.840742 -0.759422 -0.356998 -0.205206 0.142887
6.600000 0.835303 -1.845702 -0.755707 -0.312889 -0.176667 0.110662
6.633333 0.827384 -1.850372 -0.743072 -0.272172 -0.149810 0.087996
6.666667 0.819368 -1.854754 -0.739245 -0.236078 -0.125115 0.071779
6.700000 0.815224 -1.857317 -0.742796 -0.205994 -0.103201 0.058960
6.733333 0.810993 -1.859603 -0.739044 -0.182748 -0.084515 0.046599
6.766667 0.807953 -1.860983 -0.734192 -0.166389 -0.069318 0.035869
6.800000 0.804832 -1.862101 -0.743029 -0.155984 -0.057470 0.028072
6.833333 0.800400 -1.863223 -0.741618 -0.150618 -0.048907 0.021546
6.866667 0.795893 -1.864100 -0.748005 -0.149425 -0.043425 0.018915
6.900000 0.791316 -1.864739 -0.751040 -0.150981 -0.040581 0.021035
6.933333 0.785382 -1.865701 -0.750037 -0.154025 -0.039888 0.027421
6.966667 0.779386 -1.866442 -0.732690 -0.157479 -0.040786 0.033947
7.000000 0.773681 -1.867789 -0.740113 -0.160781 -0.042846 0.038328
7.033333 0.767923 -1.868929 -0.740020 -0.163586 -0.045613 0.041698
7.066667 0.762036 -1.870586 -0.735853 -0.165500 -0.048643 0.041148
7.100000 0.756626 -1.872819 -0.733389 -0.166505 -0.051560 0.034874
7.133333 0.751179 -1.874863 -0.728374 -0.166778 -0.054157 0.024243
7.166667 0.745726 -1.877138 -0.729729 -0.166589 -0.056250 0.014317
7.200000 0.740244 -1.879235 -0.727475 -0.166155 -0.057838 0.005489
7.233333 0.734736 -1.881159 -0.718400 -0.165573 -0.058924 -0.003565
7.266667 0.729074 -1.883013 -0.724394 -0.164978 -0.059613 -0.010581
7.300000 0.723608 -1.885215 -0.737770 -0.164407 -0.060114 -0.012514
7.333333 0.718128 -1.887259 -0.742225 -0.163811 -0.060536 -0.009656
7.366667 0.712533 -1.889157 -0.738765 -0.163166 -0.061044 -0.004888
7.400000 0.707111 -1.890993 -0.740954 -0.162488 -0.061648 0.002640
7.433333 0.701687 -1.892685 -0.739578 -0.161790 -0.062350 0.012896
7.466667 0.696295 -1.894657 -0.732559 -0.161090 -0.063082 0.024210
7.500000 0.691041 -1.896813 -0.732232 -0.160449 -0.063727 0.033172
7.533333 0.685743 -1.899337 -0.733186 -0.159931 -0.064157 0.039285
7.566667 0.680386 -1.901691 -0.730480 -0.159520 -0.064255 0.043388
7.600000 0.675044 -1.903918 -0.730669 -0.159188 -0.064001 0.044765
7.633333 0.670016 -1.906282 -0.721796 -0.158958 -0.063369 0.043842
7.666667 0.664976 -1.908570 -0.718746 -0.158832 -0.062391 0.040812
7.700000 0.659513 -1.910781 -0.715761 -0.158798 -0.061127 0.036712
7.733333 0.654076 -1.912878 -0.717154 -0.158824 -0.059720 0.031914
7.766667 0.648611 -1.914699 -0.732255 -0.158928 -0.058280 0.026705
7.800000 0.643179 -1.916412 -0.727322 -0.159114 -0.056832 0.022054
7.833333 0.638079 -1.918037 -0.722308 -0.159345 -0.055442 0.019754
7.866667 0.632861 -1.919578 -0.716229 -0.159577 -0.054151 0.020018
7.900000 0.627747 -1.921289 -0.706099 -0.159806 -0.052948 0.021906
7.933333 0.622521 -1.923359 -0.710064 -0.160022 -0.051748 0.023418
7.966667 0.616993 -1.925240 -0.722680 -0.160183 -0.050470 0.023261
8.000000 0.611517 -1.927028 -0.727265 -0.160269 -0.049057 0.021648
8.033333 0.606094 -1.928728 -0.724737 -0.160194 -0.047428 0.017863
8.066667 0.600730 -1.930340 -0.715091 -0.159891 -0.045504 0.012056
8.100000 0.595425 -1.931867 -0.711432 -0.159308 -0.043256 0.005907
8.133333 0.590185 -1.933311 -0.703217 -0.158419 -0.040735 0.001014
8.166667 0.584573 -1.934651 -0.703187 -0.157215 -0.037989 -0.002264
8.200000 0.579031 -1.935912 -0.707724 -0.155573 -0.035106 -0.005619
8.233333 0.573915 -1.937029 -0.714507 -0.153345 -0.032188 -0.009942
8.266667 0.568875 -1.938071 -0.727386 -0.150284 -0.029313 -0.013226
8.300000 0.563914 -1.939041 -0.725460 -0.146116 -0.026531 -0.014622
8.333333 0.558942 -1.939761 -0.717116 -0.140550 -0.023868 -0.014364
8.366667 0.554053 -1.940413 -0.711681 -0.133341 -0.021346 -0.014390
8.400000 0.549252 -1.941000 -0.713832 -0.124443 -0.018941 -0.013702
8.433333 0.544539 -1.941523 -0.723376 -0.114004 -0.016614 -0.011169
8.466667 0.539918 -1.941986 -0.724848 -0.102360 -0.014388 -0.009377
8.500000 0.535392 -1.942390 -0.710190 -0.089852 -0.012285 -0.011247
8.533333 0.532119 -1.942829 -0.712453 -0.076929 -0.010303 -0.015049
8.566667 0.530366 -1.943370 -0.719142 -0.064116 -0.008444 -0.016784
8.600000 0.529760 -1.943574 -0.720897 -0.051940 -0.006769 -0.017419
8.633333 0.529250 -1.943726 -0.718276 -0.040810 -0.005319 -0.019120
8.666667 0.528834 -1.943826 -0.723223 -0.031016 -0.004079 -0.021157
8.700000 0.528475 -1.943780 -0.726313 -0.022844 -0.003039 -0.019436
8.733333 0.528278 -1.943521 -0.724866 -0.016392 -0.002213 -0.015909
8.766667 0.527985 -1.943445 -0.723556 -0.011527 -0.001619 -0.013691
8.800000 0.527609 -1.943539 -0.722038 -0.007940 -0.001192 -0.011990
