t x y theta dxdt dydt dthetadt
0.000000 0.000000 0.000000 2.324829 0.034346 0.147171 -0.005401
0.033333 0.001164 0.004959 2.334202 0.036000 0.150917 -0.008214
0.066667 0.002382 0.010050 2.331474 0.037688 0.154695 -0.011059
0.100000 0.003661 0.015257 2.321482 0.039408 0.158506 -0.012971
0.133333 0.004995 0.020600 2.329443 0.041161 0.162347 -0.014067
0.166667 0.006387 0.026080 2.323825 0.042946 0.166214 -0.013419
0.200000 0.007841 0.031677 2.322167 0.044765 0.170103 -0.013033
0.233333 0.009355 0.037416 2.323269 0.046616 0.174018 -0.011282
0.266667 0.010934 0.043272 2.329912 0.048500 0.177964 -0.008202
0.300000 0.012574 0.049273 2.314844 0.050417 0.181938 -0.003541
0.333333 0.014280 0.055393 2.326602 0.052365 0.185943 0.001251
0.366667 0.016053 0.061631 2.321769 0.054343 0.189983 0.006734
0.400000 0.017891 0.068019 2.326273 0.056352 0.194062 0.011840
0.433333 0.019796 0.074558 2.321674 0.058391 0.198181 0.016415
0.466667 0.021770 0.081217 2.330021 0.060459 0.202336 0.019844
0.500000 0.023813 0.088031 2.319581 0.062557 0.206532 0.019777
0.533333 0.025926 0.094963 2.326480 0.064684 0.210768 0.020182
0.566667 0.028111 0.102053 2.321243 0.066841 0.215041 0.018062
0.600000 0.030369 0.109304 2.335335 0.069028 0.219349 0.015224
0.633333 0.032699 0.116672 2.337566 0.071245 0.223686 0.010043
0.666667 0.035105 0.124203 2.326950 0.073490 0.228047 0.004965
0.700000 0.037584 0.131851 2.337449 0.075763 0.232425 0.001248
0.733333 0.040141 0.139664 2.328596 0.078062 0.236806 -0.002804
0.766667 0.042777 0.147646 2.323681 0.080384 0.241176 -0.003065
0.800000 0.045488 0.155742 2.332323 0.082727 0.245521 0.001846
0.833333 0.048281 0.164009 2.322888 0.085087 0.249821 0.011580
0.866667 0.051156 0.172447 2.332256 0.087462 0.254068 0.019155
0.900000 0.054108 0.180998 2.326539 0.089852 0.258243 0.021253
0.933333 0.057145 0.189723 2.327065 0.092253 0.262334 0.012311
0.966667 0.060258 0.198558 2.315492 0.094667 0.266342 -0.014921
1.000000 0.063449 0.207502 2.327368 0.097096 0.270269 -0.068295
1.033333 0.066728 0.216624 2.337659 0.099547 0.274127 -0.149698
1.066667 0.070085 0.225853 2.335799 0.102025 0.277925 -0.254530
1.100000 0.073520 0.235187 2.364070 0.104542 0.281685 -0.383612
1.133333 0.077033 0.244625 2.375530 0.107112 0.285433 -0.531836
1.166667 0.080624 0.254165 2.334609 0.109739 0.289179 -0.694704
1.200000 0.084318 0.263882 2.304885 0.112429 0.292929 -0.860026
1.233333 0.088091 0.273699 2.257911 0.115186 0.296685 -1.020481
1.266667 0.091942 0.283613 2.203227 0.118013 0.300443 -1.178374
1.300000 0.095906 0.293698 2.171485 0.120909 0.304187 -1.326460
1.333333 0.099948 0.303877 2.108354 0.123877 0.307895 -1.466790
1.366667 0.104110 0.314216 2.046826 0.126918 0.311548 -1.607354
1.400000 0.108397 0.324710 1.999503 0.130036 0.315133 -1.765909
1.433333 0.112812 0.335351 1.935587 0.133219 0.318626 -1.955524
1.466667 0.117305 0.346079 1.890954 0.136457 0.322005 -2.184975
1.500000 0.121876 0.356891 1.830484 0.139734 0.325260 -2.466000
1.533333 0.126524 0.367785 1.794202 0.143027 0.328377 -2.798720
1.566667 0.131314 0.378797 1.722916 0.146315 0.331354 -3.166483
1.600000 0.136249 0.389921 1.588769 0.149586 0.334191 -3.536828
1.633333 0.141328 0.401147 1.500814 0.152840 0.336904 -3.884185
1.666667 0.146552 0.412471 1.356120 0.156064 0.339507 -4.166036
1.700000 0.151851 0.423865 1.179766 0.159250 0.342008 -4.343468
1.733333 0.157223 0.435327 0.981266 0.162395 0.344419 -4.387433
1.766667 0.162669 0.446855 0.783708 0.165496 0.346751 -4.286416
1.800000 0.168254 0.458466 0.520300 0.168545 0.349012 -4.042588
1.833333 0.173911 0.470137 0.298733 0.171532 0.351203 -3.654882
1.866667 0.179637 0.481865 0.153982 0.174467 0.353334 -3.146730
1.900000 0.185497 0.493680 0.072398 0.177351 0.355415 -2.551139
1.933333 0.191488 0.505582 0.031995 0.180188 0.357454 -1.901371
1.966667 0.197608 0.517573 0.007910 0.182965 0.359449 -1.227648
2.000000 0.203792 0.529610 0.015352 0.185674 0.361392 -0.566555
2.033333 0.210040 0.541691 0.039954 0.188310 0.363280 0.050879
2.066667 0.216351 0.553812 0.054664 0.190854 0.365098 0.605828
2.100000 0.222769 0.566022 0.089511 0.193296 0.366835 1.092735
2.133333 0.229288 0.578316 0.138720 0.195631 0.368473 1.511043
2.166667 0.235864 0.590642 0.191344 0.197865 0.370007 1.864034
2.200000 0.242531 0.603046 0.288454 0.200003 0.371430 2.159200
2.233333 0.249252 0.615476 0.373795 0.202048 0.372731 2.396518
2.266667 0.256054 0.627974 0.469122 0.204002 0.373899 2.573272
2.300000 0.262907 0.640492 0.557495 0.205871 0.374927 2.686670
2.333333 0.269810 0.653026 0.657409 0.207659 0.375816 2.731908
2.366667 0.276783 0.665610 0.794182 0.209367 0.376558 2.702473
2.400000 0.283801 0.678203 0.914545 0.211006 0.377154 2.602125
2.433333 0.290864 0.690803 1.015616 0.212584 0.377603 2.438038
2.466667 0.297996 0.703436 1.116386 0.214113 0.377910 2.217933
2.500000 0.305167 0.716068 1.200915 0.215599 0.378076 1.950637
2.533333 0.312377 0.728697 1.260244 0.217051 0.378101 1.647864
2.566667 0.319657 0.741341 1.295461 0.218468 0.377987 1.329616
2.600000 0.326971 0.753973 1.327649 0.219845 0.377733 1.009543
2.633333 0.334318 0.766593 1.348035 0.221175 0.377338 0.701463
2.666667 0.341694 0.779196 1.357699 0.222454 0.376798 0.423314
2.700000 0.349135 0.791780 1.367662 0.223675 0.376111 0.186178
2.733333 0.356640 0.804335 1.365103 0.224831 0.375272 -0.001278
2.766667 0.364203 0.816854 1.339855 0.225918 0.374273 -0.139754
2.800000 0.371788 0.829342 1.301349 0.226929 0.373108 -0.226765
2.833333 0.379392 0.841797 1.289587 0.227860 0.371775 -0.264540
2.866667 0.387013 0.854216 1.257449 0.228701 0.370273 -0.260697
2.900000 0.394649 0.866595 1.247132 0.229445 0.368601 -0.222154
2.933333 0.402321 0.878902 1.235084 0.230091 0.366761 -0.157111
2.966667 0.410024 0.891131 1.218771 0.230634 0.364766 -0.070725
3.000000 0.417754 0.903279 1.228251 0.231072 0.362628 0.023577
3.033333 0.425488 0.915374 1.246634 0.231398 0.360352 0.117164
3.066667 0.433237 0.927375 1.255385 0.231607 0.357938 0.202527
3.100000 0.440994 0.939276 1.257466 0.231688 0.355392 0.275117
3.133333 0.448752 0.951071 1.283256 0.231630 0.352711 0.331624
3.166667 0.456505 0.962801 1.297636 0.231418 0.349877 0.366650
3.200000 0.464251 0.974464 1.313016 0.231042 0.346866 0.383267
3.233333 0.471977 0.986000 1.332806 0.230496 0.343672 0.383320
3.266667 0.479691 0.997462 1.336447 0.229777 0.340286 0.370172
3.300000 0.487391 1.008850 1.358430 0.228884 0.336696 0.346584
3.333333 0.495055 1.020094 1.379622 0.227821 0.332899 0.316812
3.366667 0.502676 1.031189 1.383411 0.226598 0.328912 0.288275
3.400000 0.510248 1.042130 1.397296 0.225227 0.324765 0.263333
3.433333 0.517764 1.052911 1.396556 0.223720 0.320481 0.247351
3.466667 0.525218 1.063527 1.402694 0.222100 0.316099 0.241625
3.500000 0.532605 1.073974 1.401581 0.220390 0.311672 0.247452
3.533333 0.539919 1.084247 1.412949 0.218612 0.307245 0.263990
3.566667 0.547200 1.094427 1.399535 0.216791 0.302856 0.288464
3.600000 0.554400 1.104430 1.406294 0.214941 0.298530 0.319482
3.633333 0.561514 1.114254 1.425652 0.213075 0.294283 0.350244
3.666667 0.568588 1.123978 1.442920 0.211192 0.290108 0.379271
3.700000 0.575571 1.133523 1.466474 0.209293 0.285994 0.403432
3.733333 0.582510 1.142966 1.488925 0.207373 0.281924 0.420738
3.766667 0.589405 1.152306 1.500759 0.205421 0.277875 0.429444
3.800000 0.596253 1.161540 1.523547 0.203429 0.273826 0.427862
3.833333 0.603007 1.170600 1.535579 0.201390 0.269761 0.419225
3.866667 0.609710 1.179551 1.548625 0.199307 0.265681 0.402971
3.900000 0.616361 1.188395 1.556954 0.197169 0.261571 0.381294
3.933333 0.622918 1.197065 1.568151 0.194976 0.257426 0.355793
3.966667 0.629380 1.205565 1.564256 0.192733 0.253257 0.328317
4.000000 0.635748 1.213895 1.593959 0.190451 0.249080 0.299587
4.033333 0.642056 1.222112 1.608849 0.188136 0.244906 0.269110
4.066667 0.648303 1.230216 1.614735 0.185791 0.240740 0.238575
4.100000 0.654455 1.238154 1.629319 0.183428 0.236603 0.206414
4.133333 0.660543 1.245978 1.632182 0.181053 0.232505 0.174169
4.166667 0.666534 1.253641 1.623928 0.178668 0.228448 0.141649
4.200000 0.672458 1.261188 1.638431 0.176264 0.224420 0.111288
4.233333 0.678285 1.268577 1.642644 0.173841 0.220421 0.085977
4.266667 0.684042 1.275849 1.638198 0.171402 0.216456 0.065114
4.300000 0.689727 1.283003 1.640265 0.168941 0.212515 0.051460
4.333333 0.695339 1.290039 1.634317 0.166455 0.208597 0.043540
4.366667 0.700853 1.296924 1.625981 0.163941 0.204695 0.042198
4.400000 0.706268 1.303661 1.642623 0.161404 0.200819 0.046783
4.433333 0.711606 1.310278 1.638795 0.158840 0.196962 0.054512
4.466667 0.716865 1.316775 1.645470 0.156242 0.193120 0.064183
4.500000 0.722045 1.323153 1.644084 0.153610 0.189292 0.074580
4.533333 0.727124 1.329391 1.636419 0.150945 0.185478 0.086037
4.566667 0.732120 1.335508 1.649163 0.148249 0.181681 0.094609
4.600000 0.737033 1.341505 1.657549 0.145516 0.177896 0.101574
4.633333 0.741843 1.347368 1.660019 0.142751 0.174122 0.106330
4.666667 0.746567 1.353110 1.659669 0.139956 0.170361 0.110724
4.700000 0.751189 1.358721 1.669209 0.137136 0.166617 0.112540
4.733333 0.755723 1.364212 1.669358 0.134293 0.162886 0.110875
4.766667 0.760154 1.369574 1.672445 0.131430 0.159171 0.110214
4.800000 0.764483 1.374810 1.679577 0.128553 0.155477 0.107922
4.833333 0.768722 1.379925 1.682827 0.125664 0.151807 0.104908
4.866667 0.772857 1.384916 1.686562 0.122765 0.148162 0.098903
4.900000 0.776900 1.389787 1.680840 0.119855 0.144543 0.093652
4.933333 0.780850 1.394539 1.693743 0.116934 0.140955 0.087633
4.966667 0.784705 1.399172 1.694305 0.114002 0.137398 0.080296
5.000000 0.788465 1.403686 1.704178 0.111056 0.133871 0.073078
5.033333 0.792122 1.408084 1.696001 0.108094 0.130375 0.065603
5.066667 0.795682 1.412363 1.702528 0.105115 0.126910 0.059649
5.100000 0.799139 1.416529 1.704619 0.102118 0.123476 0.052969
5.133333 0.802498 1.420577 1.705652 0.099104 0.120072 0.048220
5.166667 0.805755 1.424514 1.709087 0.096074 0.116697 0.043370
5.200000 0.808909 1.428342 1.705581 0.093031 0.113353 0.038729
