t x y theta dxdt dydt dthetadt
0.000000 0.000000 0.000000 -2.798498 0.140922 -0.051839 -0.064120
0.033333 0.004725 -0.001760 -2.742857 0.142222 -0.053324 0.172327
0.066667 0.009502 -0.003568 -2.680995 0.143492 -0.054776 0.357946
0.100000 0.014314 -0.005424 -2.620982 0.144730 -0.056198 0.483666
0.133333 0.019161 -0.007328 -2.585733 0.145939 -0.057588 0.546236
0.166667 0.024057 -0.009277 -2.569463 0.147118 -0.058947 0.553501
0.200000 0.028987 -0.011272 -2.582256 0.148269 -0.060274 0.521786
0.233333 0.033950 -0.013311 -2.565809 0.149391 -0.061568 0.463223
0.266667 0.038944 -0.015393 -2.558406 0.150487 -0.062829 0.388683
0.300000 0.043982 -0.017517 -2.566751 0.151556 -0.064055 0.313178
0.333333 0.049061 -0.019680 -2.570188 0.152594 -0.065246 0.244280
0.366667 0.054179 -0.021882 -2.544153 0.153601 -0.066401 0.185599
0.400000 0.059326 -0.024123 -2.527509 0.154573 -0.067520 0.131103
0.433333 0.064501 -0.026402 -2.520413 0.155509 -0.068600 0.083782
0.466667 0.069710 -0.028715 -2.493287 0.156405 -0.069642 0.045089
0.500000 0.074950 -0.031060 -2.509147 0.157260 -0.070648 0.024284
0.533333 0.080216 -0.033441 -2.509546 0.158071 -0.071616 0.028088
0.566667 0.085507 -0.035855 -2.518513 0.158840 -0.072548 0.069725
0.600000 0.090824 -0.038299 -2.545640 0.159564 -0.073443 0.161958
0.633333 0.096165 -0.040769 -2.557432 0.160242 -0.074302 0.309558
0.666667 0.101527 -0.043266 -2.561075 0.160871 -0.075123 0.516350
0.700000 0.106907 -0.045787 -2.565703 0.161452 -0.075906 0.758996
0.733333 0.112309 -0.048337 -2.560169 0.161984 -0.076653 1.031891
0.766667 0.117731 -0.050915 -2.538421 0.162467 -0.077365 1.318314
0.800000 0.123173 -0.053519 -2.517721 0.162903 -0.078042 1.612542
0.833333 0.128625 -0.056142 -2.376413 0.163294 -0.078687 1.906144
0.866667 0.134086 -0.058784 -2.288457 0.163648 -0.079302 2.206741
0.900000 0.139554 -0.061443 -2.167942 0.163968 -0.079891 2.540796
0.933333 0.145028 -0.064119 -2.076511 0.164260 -0.080455 2.923144
0.966667 0.150508 -0.066811 -1.976343 0.164532 -0.080996 3.373872
1.000000 0.155993 -0.069521 -1.912406 0.164790 -0.081519 3.901299
1.033333 0.161492 -0.072250 -1.879308 0.165039 -0.082024 4.528581
1.066667 0.166997 -0.074995 -1.764112 0.165281 -0.082513 4.721581
1.100000 0.172506 -0.077757 -1.653393 0.165519 -0.082985 4.477868
1.133333 0.178026 -0.080535 -1.453135 0.165754 -0.083440 3.783851
1.166667 0.183558 -0.083329 -1.203753 0.165984 -0.083878 2.619968
1.200000 0.189099 -0.086138 -0.882729 0.166205 -0.084295 0.960266
1.233333 0.194650 -0.088961 -0.526403 0.166413 -0.084690 -1.239680
1.266667 0.200202 -0.091796 -0.125965 0.166606 -0.085062 -2.942707
1.300000 0.205762 -0.094643 0.263702 0.166778 -0.085410 -4.199380
1.333333 0.211330 -0.097501 0.668030 0.166927 -0.085732 -5.028801
1.366667 0.216903 -0.100370 1.083170 0.167050 -0.086028 -5.436292
1.400000 0.222481 -0.103248 1.470482 0.167148 -0.086297 -5.413265
1.433333 0.228063 -0.106135 1.985916 0.167222 -0.086540 -4.948558
1.466667 0.233649 -0.109030 2.531450 0.167271 -0.086758 -4.578070
1.500000 0.239231 -0.111931 3.036088 0.167297 -0.086950 -4.264088
1.533333 0.244808 -0.114841 -2.736261 0.167302 -0.087118 -4.009379
1.566667 0.250386 -0.117752 -2.257039 0.167288 -0.087265 -3.823560
1.600000 0.255964 -0.120668 -1.665843 0.167256 -0.087393 -3.728600
1.633333 0.261542 -0.123587 -1.309340 0.167207 -0.087503 -3.719449
1.666667 0.267118 -0.126509 -0.752700 0.167144 -0.087597 -3.805009
1.700000 0.272692 -0.129432 -0.180406 0.167070 -0.087677 -4.013251
1.733333 0.278263 -0.132355 0.349211 0.166985 -0.087742 -4.357218
1.766667 0.283831 -0.135282 0.862314 0.166890 -0.087792 -4.328949
1.800000 0.289395 -0.138211 1.369654 0.166787 -0.087824 -3.924676
1.833333 0.294955 -0.141143 1.855820 0.166675 -0.087836 -3.169488
1.866667 0.300510 -0.144077 2.292782 0.166554 -0.087823 -2.045551
1.900000 0.306060 -0.147012 2.715650 0.166420 -0.087782 -0.536886
1.933333 0.311604 -0.149947 3.138040 0.166272 -0.087710 1.387771
1.966667 0.317141 -0.152882 -2.855622 0.166107 -0.087605 2.724486
2.000000 0.322679 -0.155811 -2.672957 0.165922 -0.087463 3.515251
2.033333 0.328216 -0.158734 -2.440072 0.165716 -0.087284 3.800440
2.066667 0.333752 -0.161648 -2.367047 0.165486 -0.087068 3.618133
2.100000 0.339276 -0.164553 -2.311449 0.165231 -0.086816 3.007035
2.133333 0.344788 -0.167449 -2.238826 0.164951 -0.086529 1.990036
2.166667 0.350286 -0.170335 -2.185339 0.164647 -0.086210 1.097507
2.200000 0.355770 -0.173210 -2.244134 0.164320 -0.085859 0.321845
2.233333 0.361239 -0.176074 -2.289862 0.163974 -0.085480 -0.325134
2.266667 0.366706 -0.178921 -2.331608 0.163612 -0.085072 -0.860775
2.300000 0.372156 -0.181756 -2.381602 0.163239 -0.084637 -1.306905
2.333333 0.377588 -0.184576 -2.395641 0.162857 -0.084176 -1.678683
2.366667 0.383017 -0.187379 -2.476646 0.162465 -0.083689 -1.984781
2.400000 0.388427 -0.190166 -2.564205 0.162061 -0.083176 -2.236777
2.433333 0.393816 -0.192937 -2.641926 0.161641 -0.082641 -2.454020
2.466667 0.399200 -0.195689 -2.766310 0.161200 -0.082082 -2.646497
2.500000 0.404576 -0.198420 -2.853085 0.160733 -0.081503 -2.818979
2.533333 0.409929 -0.201133 -2.961802 0.160235 -0.080903 -2.971933
2.566667 0.415274 -0.203823 -3.060835 0.159704 -0.080282 -3.112526
2.600000 0.420610 -0.206489 -3.136138 0.159138 -0.079641 -3.237032
2.633333 0.425920 -0.209135 3.037083 0.158535 -0.078978 -3.337876
2.666667 0.431204 -0.211761 2.911269 0.157893 -0.078292 -3.400867
2.700000 0.436461 -0.214365 2.785188 0.157214 -0.077580 -3.410205
2.733333 0.441690 -0.216949 2.655559 0.156497 -0.076839 -3.353818
2.766667 0.446898 -0.219506 2.552917 0.155745 -0.076066 -3.216177
2.800000 0.452084 -0.222037 2.402162 0.154959 -0.075255 -2.985940
2.833333 0.457246 -0.224539 2.271523 0.154141 -0.074402 -2.661158
2.866667 0.462377 -0.227017 2.130649 0.153291 -0.073503 -2.247891
2.900000 0.467482 -0.229463 1.995724 0.152407 -0.072558 -1.753554
2.933333 0.472553 -0.231883 1.930919 0.151488 -0.071565 -1.196399
2.966667 0.477596 -0.234266 1.915321 0.150532 -0.070525 -0.593213
3.000000 0.482608 -0.236609 1.940604 0.149534 -0.069442 0.033123
3.033333 0.487587 -0.238910 1.976362 0.148494 -0.068321 0.658590
3.066667 0.492530 -0.241184 2.039074 0.147406 -0.067165 1.258633
3.100000 0.497436 -0.243413 2.096056 0.146272 -0.065980 1.805998
3.133333 0.502304 -0.245595 2.144489 0.145087 -0.064769 2.284837
3.166667 0.507131 -0.247729 2.250866 0.143851 -0.063537 2.683511
3.200000 0.511916 -0.249814 2.365862 0.142565 -0.062290 2.998277
3.233333 0.516660 -0.251872 2.509483 0.141228 -0.061030 3.225693
3.266667 0.521362 -0.253902 2.642506 0.139843 -0.059762 3.369008
3.300000 0.526014 -0.255882 2.780594 0.138412 -0.058490 3.430507
3.333333 0.530614 -0.257812 2.919195 0.136938 -0.057218 3.412375
