t x y theta dxdt dydt dthetadt
0.000000 0.000000 0.000000 0.293519 -0.003996 0.001868 -0.097125
0.033333 -0.000044 0.000153 0.282548 -0.001019 -0.000245 -0.092425
0.066667 -0.000193 0.000101 0.285194 0.002852 -0.002764 -0.083810
0.100000 -0.000122 -0.000038 0.281533 0.008000 -0.005920 -0.071102
0.133333 -0.000014 -0.000216 0.283512 0.014939 -0.010040 -0.049706
0.166667 0.000133 -0.000433 0.284037 0.024515 -0.015380 -0.014468
0.200000 0.000317 -0.000688 0.277898 0.037537 -0.022133 0.037278
0.233333 0.000539 -0.000981 0.272072 0.054579 -0.030360 0.106057
0.266667 0.001375 -0.001218 0.267881 0.076132 -0.040167 0.184989
0.300000 0.002493 -0.002192 0.265877 0.102344 -0.051278 0.271457
0.333333 0.004981 -0.003602 0.252060 0.132881 -0.063060 0.359076
0.366667 0.008846 -0.005772 0.263902 0.166716 -0.074590 0.438210
0.400000 0.012737 -0.007975 0.314788 0.202552 -0.084971 0.499600
0.433333 0.019099 -0.011534 0.333481 0.239001 -0.093261 0.535422
0.466667 0.028080 -0.015975 0.377374 0.274297 -0.098361 0.543273
0.500000 0.039928 -0.021020 0.414222 0.306202 -0.099603 0.519495
0.533333 0.054053 -0.026129 0.434841 0.332633 -0.096795 0.464634
0.566667 0.068150 -0.031250 0.469418 0.351664 -0.090360 0.382129
0.600000 0.082201 -0.036376 0.473895 0.361178 -0.080822 0.285040
0.633333 0.096740 -0.040344 0.479332 0.359131 -0.069073 0.183297
0.666667 0.111781 -0.042279 0.473687 0.344362 -0.056448 0.088948
0.700000 0.125565 -0.041877 0.463604 0.316868 -0.044287 0.009221
0.733333 0.139235 -0.041471 0.457218 0.276817 -0.033614 -0.053177
0.766667 0.152775 -0.041062 0.439999 0.225188 -0.024859 -0.095998
0.800000 0.162976 -0.039931 0.424143 0.164115 -0.018034 -0.128402
0.833333 0.168508 -0.039528 0.409646 0.096601 -0.012691 -0.158207
0.866667 0.173871 -0.039125 0.411243 0.025268 -0.007910 -0.198376
0.900000 0.172996 -0.039345 0.406901 -0.047144 -0.002363 -0.251965
0.933333 0.167245 -0.040690 0.426803 -0.116990 0.005303 -0.323557
0.966667 0.157753 -0.042606 0.439166 -0.180822 0.015965 -0.415938
1.000000 0.148090 -0.044522 0.449953 -0.235982 0.030070 -0.528568
1.033333 0.135778 -0.046304 0.416451 -0.280391 0.047792 -0.652043
1.066667 0.121390 -0.046642 0.396351 -0.311523 0.068978 -0.775487
1.100000 0.106803 -0.044159 0.350176 -0.327623 0.092814 -0.892129
1.133333 0.093245 -0.038228 0.312538 -0.328766 0.117792 -0.990413
1.166667 0.079565 -0.032304 0.253995 -0.315643 0.142538 -1.059181
1.200000 0.065773 -0.026395 0.192620 -0.288990 0.165454 -1.084010
1.233333 0.051879 -0.020509 0.156154 -0.250230 0.185001 -1.068161
1.266667 0.042543 -0.012608 0.112614 -0.201999 0.199696 -1.010381
1.300000 0.033119 -0.004746 0.072570 -0.147041 0.208763 -0.916218
1.333333 0.027650 0.004500 0.030859 -0.087331 0.212101 -0.792720
1.366667 0.025895 0.013827 0.015172 -0.024785 0.209651 -0.654172
1.400000 0.028205 0.022615 -0.016800 0.038229 0.201974 -0.518684
1.433333 0.034740 0.029749 -0.022527 0.099550 0.189765 -0.390875
1.466667 0.041166 0.036796 -0.034688 0.157927 0.174104 -0.278584
1.500000 0.047469 0.043747 -0.035172 0.212227 0.155873 -0.183892
1.533333 0.056979 0.047979 -0.006706 0.261188 0.136205 -0.114311
1.566667 0.066335 0.052101 -0.002603 0.304017 0.116256 -0.066051
1.600000 0.077923 0.054956 0.008088 0.340469 0.096946 -0.035576
1.633333 0.090838 0.056692 0.014516 0.370804 0.079019 -0.022731
1.666667 0.105214 0.057716 0.002620 0.394850 0.062985 -0.025302
1.700000 0.120383 0.058623 -0.015975 0.412394 0.049235 -0.041620
1.733333 0.136662 0.059613 -0.033079 0.423710 0.037529 -0.059123
1.766667 0.153218 0.060455 -0.030899 0.428803 0.027620 -0.073438
1.800000 0.169796 0.061236 -0.016818 0.427824 0.019113 -0.079504
1.833333 0.186034 0.061881 0.010244 0.420782 0.011517 -0.067536
1.866667 0.200124 0.062144 -0.017295 0.408173 0.004308 -0.032342
1.900000 0.213823 0.062267 -0.031578 0.390843 -0.002969 0.027673
1.933333 0.227104 0.062248 -0.038564 0.369488 -0.010376 0.109932
1.966667 0.239943 0.062084 -0.055026 0.344772 -0.017948 0.213443
2.000000 0.251621 0.061753 -0.042112 0.317275 -0.025609 0.332793
2.033333 0.261764 0.060857 -0.032054 0.287715 -0.033042 0.455069
2.066667 0.270661 0.059272 -0.040236 0.256439 -0.040050 0.566892
2.100000 0.279024 0.057538 -0.019447 0.223621 -0.046471 0.662381
2.133333 0.286831 0.055656 0.005150 0.189098 -0.052569 0.731647
2.166667 0.293019 0.052885 0.095945 0.152616 -0.059020 0.763521
2.200000 0.297500 0.050416 0.154072 0.113875 -0.066545 0.756283
2.233333 0.301366 0.047799 0.188694 0.072313 -0.075996 0.712839
2.266667 0.303659 0.045829 0.224654 0.027635 -0.088129 0.638370
2.300000 0.303735 0.044105 0.251873 -0.020320 -0.103729 0.533556
2.333333 0.303144 0.042232 0.238532 -0.071147 -0.123053 0.409452
2.366667 0.301872 0.040211 0.244017 -0.124339 -0.146079 0.281144
2.400000 0.298405 0.036883 0.221790 -0.179392 -0.172608 0.162875
2.433333 0.294231 0.033408 0.241159 -0.235845 -0.202501 0.060047
2.466667 0.285477 0.027034 0.224079 -0.293263 -0.235354 -0.017198
2.500000 0.271299 0.015614 0.249578 -0.351291 -0.270429 -0.064677
2.533333 0.256392 0.004062 0.224060 -0.410062 -0.307301 -0.085808
2.566667 0.240753 -0.007613 0.220656 -0.469249 -0.344985 -0.088319
2.600000 0.224380 -0.019401 0.205034 -0.528682 -0.382725 -0.084026
2.633333 0.207272 -0.031291 0.188678 -0.587920 -0.419568 -0.072593
2.666667 0.189428 -0.043273 0.181691 -0.646613 -0.454850 -0.064808
2.700000 0.166250 -0.060777 0.193934 -0.703968 -0.487815 -0.059803
2.733333 0.142340 -0.078347 0.201589 -0.758859 -0.517538 -0.059742
2.766667 0.116098 -0.097140 0.214305 -0.810231 -0.543256 -0.063578
2.800000 0.087594 -0.116547 0.229813 -0.856777 -0.564065 -0.070097
2.833333 0.055853 -0.137712 0.219774 -0.897122 -0.579016 -0.084753
2.866667 0.021387 -0.159900 0.207626 -0.929700 -0.586921 -0.103032
2.900000 -0.013764 -0.182061 0.190296 -0.954115 -0.587635 -0.123558
2.933333 -0.049584 -0.204175 0.176292 -0.969907 -0.580878 -0.144301
2.966667 -0.086059 -0.226220 0.188677 -0.977257 -0.566965 -0.164493
3.000000 -0.120503 -0.246465 0.169018 -0.976948 -0.546357 -0.182237
3.033333 -0.152134 -0.264230 0.164152 -0.970638 -0.519881 -0.194430
3.066667 -0.184382 -0.281869 0.166247 -0.960938 -0.488820 -0.203059
3.100000 -0.215076 -0.296986 0.156890 -0.950296 -0.453951 -0.211772
3.133333 -0.246370 -0.311945 0.160336 -0.941637 -0.416519 -0.221250
3.166667 -0.278255 -0.326734 0.148979 -0.937572 -0.377474 -0.228726
3.200000 -0.307397 -0.338146 0.133073 -0.940171 -0.337913 -0.232738
3.233333 -0.337117 -0.349361 0.133569 -0.950403 -0.298643 -0.233465
3.266667 -0.364558 -0.357589 0.119442 -0.968761 -0.260634 -0.226811
3.300000 -0.392570 -0.365604 0.110819 -0.994721 -0.224578 -0.211883
3.333333 -0.422572 -0.372139 0.088185 -1.027392 -0.191035 -0.185995
3.366667 -0.455005 -0.376928 0.089168 -1.065998 -0.160767 -0.152812
3.400000 -0.491334 -0.380154 0.072584 -1.109517 -0.134244 -0.114489
3.433333 -0.532100 -0.382440 0.072217 -1.157036 -0.112061 -0.071479
3.466667 -0.573400 -0.384492 0.072796 -1.206968 -0.094211 -0.025609
3.500000 -0.615219 -0.386309 0.074692 -1.258302 -0.080885 0.024093
3.533333 -0.657542 -0.387889 0.082464 -1.310282 -0.072165 0.073204
3.566667 -0.700355 -0.389232 0.093811 -1.361914 -0.067724 0.124328
3.600000 -0.747189 -0.391054 0.095251 -1.412441 -0.067144 0.176077
3.633333 -0.794477 -0.392636 0.097473 -1.461754 -0.069887 0.229781
3.666667 -0.842199 -0.393976 0.101493 -1.510115 -0.075622 0.282695
3.700000 -0.893642 -0.396001 0.105971 -1.557309 -0.083915 0.333593
3.733333 -0.948498 -0.398903 0.113899 -1.602709 -0.094121 0.382640
3.766667 -1.003717 -0.401557 0.123911 -1.645811 -0.105800 0.426952
3.800000 -1.060665 -0.405137 0.152404 -1.685980 -0.118607 0.470467
3.833333 -1.118829 -0.409198 0.178663 -1.721803 -0.132166 0.514175
3.866667 -1.177530 -0.414304 0.189527 -1.751742 -0.145830 0.566601
3.900000 -1.236478 -0.419140 0.225851 -1.774985 -0.158969 0.634331
3.933333 -1.298106 -0.425148 0.235994 -1.790561 -0.170935 0.727268
3.966667 -1.359917 -0.430874 0.264083 -1.797006 -0.180865 0.850504
4.000000 -1.422664 -0.437710 0.275414 -1.793286 -0.187806 1.006112
4.033333 -1.484954 -0.445438 0.303072 -1.779337 -0.190896 1.195114
4.066667 -1.547326 -0.452859 0.292504 -1.754904 -0.189362 1.413314
4.100000 -1.609747 -0.459962 0.314366 -1.719422 -0.182461 1.653108
4.133333 -1.670140 -0.468130 0.383013 -1.673644 -0.169874 1.903661
4.166667 -1.725938 -0.475572 0.462502 -1.619709 -0.151754 2.156190
4.200000 -1.780580 -0.482380 0.562371 -1.559703 -0.128536 2.398052
4.233333 -1.835155 -0.488829 0.699740 -1.495030 -0.100241 2.615155
4.266667 -1.883759 -0.492575 0.788618 -1.428467 -0.067549 2.795170
4.300000 -1.926293 -0.493341 0.876555 -1.363291 -0.031361 2.931224
4.333333 -1.968706 -0.493729 0.984338 -1.301739 0.007500 3.016341
4.366667 -2.010987 -0.493734 1.104871 -1.244785 0.048491 3.043950
4.400000 -2.047162 -0.489804 1.214648 -1.193645 0.090933 3.009689
4.433333 -2.083189 -0.485489 1.324172 -1.149787 0.133740 2.914431
4.466667 -2.119064 -0.480791 1.438755 -1.113074 0.176979 2.754989
4.500000 -2.154781 -0.475711 1.520709 -1.082428 0.221704 2.528280
4.533333 -2.190337 -0.470250 1.621613 -1.056938 0.269082 2.235692
4.566667 -2.224105 -0.458120 1.722378 -1.036201 0.319721 1.887992
4.600000 -2.257705 -0.445621 1.815021 -1.018875 0.375325 1.496750
4.633333 -2.291136 -0.432760 1.894741 -1.003593 0.437036 1.074083
4.666667 -2.324395 -0.419547 1.931950 -0.989721 0.504851 0.638198
4.700000 -2.357480 -0.405992 1.918718 -0.976992 0.577445 0.208071
4.733333 -2.390390 -0.392104 1.881775 -0.965140 0.653484 -0.194316
4.766667 -2.422452 -0.371398 1.835687 -0.953682 0.732139 -0.557001
4.800000 -2.452850 -0.344747 1.799201 -0.942821 0.810751 -0.867803
4.833333 -2.483839 -0.311195 1.740073 -0.932641 0.886646 -1.116505
4.866667 -2.514652 -0.277390 1.670546 -0.923395 0.957359 -1.297942
4.900000 -2.545289 -0.243364 1.630525 -0.915655 1.020698 -1.415405
4.933333 -2.575346 -0.202767 1.567524 -0.910242 1.073548 -1.478266
4.966667 -2.605229 -0.162017 1.518034 -0.908185 1.112906 -1.494769
5.000000 -2.634940 -0.121150 1.467815 -0.910225 1.137255 -1.473711
5.033333 -2.664478 -0.080205 1.408362 -0.917231 1.146197 -1.427626
5.066667 -2.693847 -0.039218 1.364916 -0.929478 1.139885 -1.367092
5.100000 -2.723046 0.001771 1.314541 -0.946716 1.119052 -1.293290
5.133333 -2.752078 0.042727 1.259693 -0.968196 1.086306 -1.208712
5.166667 -2.780943 0.083611 1.220339 -0.992900 1.044201 -1.117312
5.200000 -2.813146 0.121173 1.189010 -1.019646 0.994666 -1.023042
5.233333 -2.848314 0.155201 1.158136 -1.046927 0.939374 -0.927632
5.266667 -2.885864 0.184274 1.140106 -1.073310 0.880131 -0.834191
5.300000 -2.925496 0.207666 1.123884 -1.097395 0.818462 -0.750744
5.333333 -2.964935 0.230840 1.087020 -1.117979 0.754522 -0.682732
5.366667 -3.004171 0.253776 1.045935 -1.133937 0.688897 -0.630363
5.400000 -3.043193 0.276457 1.039361 -1.144784 0.622108 -0.592717
5.433333 -3.081990 0.298864 1.039343 -1.150588 0.553806 -0.569114
5.466667 -3.120553 0.320979 1.051019 -1.151845 0.482843 -0.556641
5.500000 -3.159572 0.337483 1.035063 -1.149467 0.408524 -0.550805
5.533333 -3.198421 0.348537 1.001356 -1.144456 0.331470 -0.548338
5.566667 -3.237001 0.359262 0.966692 -1.137704 0.251764 -0.548205
5.600000 -3.275302 0.369652 0.946919 -1.129481 0.170041 -0.548895
5.633333 -3.312773 0.374172 0.925940 -1.119601 0.088332 -0.547573
5.666667 -3.349360 0.373058 0.911863 -1.107507 0.009569 -0.544327
5.700000 -3.385636 0.371609 0.881828 -1.092533 -0.064205 -0.534782
5.733333 -3.422430 0.365239 0.868167 -1.073908 -0.131865 -0.519848
5.766667 -3.459149 0.354835 0.850374 -1.051195 -0.191601 -0.499266
5.800000 -3.495526 0.344130 0.856632 -1.024423 -0.241868 -0.475900
5.833333 -3.531551 0.333140 0.834730 -0.994349 -0.282129 -0.446955
5.866667 -3.567212 0.321881 0.819285 -0.962646 -0.312404 -0.397187
5.900000 -3.600399 0.309251 0.795755 -0.931107 -0.332188 -0.332696
5.933333 -3.630858 0.295644 0.782296 -0.901853 -0.341265 -0.229709
5.966667 -3.658507 0.282212 0.763595 -0.877070 -0.340567 -0.083691
6.000000 -3.683319 0.269339 0.739358 -0.859158 -0.331099 0.125731
6.033333 -3.707743 0.256287 0.754708 -0.849325 -0.313909 0.397067
6.066667 -3.731778 0.243073 0.743843 -0.847405 -0.290475 0.708424
6.100000 -3.755430 0.232078 0.740376 -0.852685 -0.262657 1.073231
6.133333 -3.778695 0.220955 0.732000 -0.863692 -0.232014 1.453704
6.166667 -3.806222 0.213318 0.765953 -0.878135 -0.199833 1.841953
6.200000 -3.840615 0.211125 0.918533 -0.892292 -0.167873 2.198123
6.233333 -3.874605 0.208837 0.918533 -0.903326 -0.137728 2.523651
6.266667 -3.908181 0.206461 1.177661 -0.909013 -0.110532 2.804178
6.300000 -3.941331 0.204001 1.230925 -0.907653 -0.086918 3.020188
6.333333 -3.976543 0.202247 1.415549 -0.897997 -0.067580 3.171085
6.366667 -4.008297 0.201262 1.522473 -0.880030 -0.052710 3.255776
6.400000 -4.039589 0.200209 1.595105 -0.855278 -0.041572 3.300586
6.433333 -4.068127 0.199179 1.754442 -0.825155 -0.033343 3.282200
6.466667 -4.092720 0.198664 1.835043 -0.791327 -0.027198 3.236276
6.500000 -4.116829 0.198096 1.903925 -0.755348 -0.022420 3.165809
6.533333 -4.140451 0.197477 2.010596 -0.719153 -0.018180 3.094022
6.566667 -4.163582 0.196813 2.155143 -0.684057 -0.013462 3.021449
6.600000 -4.186219 0.196106 2.240918 -0.651445 -0.007075 2.942220
6.633333 -4.207969 0.195632 2.362076 -0.622479 0.002120 2.879156
6.666667 -4.227710 0.195538 2.444927 -0.597939 0.015231 2.816255
6.700000 -4.246950 0.195412 2.536606 -0.577505 0.032269 2.754403
6.733333 -4.264631 0.195222 2.624460 -0.560604 0.053214 2.684620
6.766667 -4.281061 0.195255 2.701560 -0.546437 0.077257 2.611978
6.800000 -4.296532 0.195804 2.779824 -0.533150 0.102275 2.532890
6.833333 -4.311598 0.197856 2.857658 -0.518942 0.126075 2.441744
6.866667 -4.326169 0.199889 2.950456 -0.502013 0.146533 2.334835
6.900000 -4.343459 0.206075 3.036015 -0.482206 0.162955 2.212228
6.933333 -4.366281 0.219808 3.127687 -0.458597 0.173920 2.071027
6.966667 -4.388604 0.233506 -3.069504 -0.430407 0.178407 1.904720
7.000000 -4.410423 0.247156 -3.009992 -0.397287 0.176097 1.717385
7.033333 -4.419110 0.250431 -2.957682 -0.359988 0.167770 1.510749
7.066667 -4.427292 0.253645 -2.903549 -0.319392 0.154177 1.292827
7.100000 -4.434978 0.256798 -2.868320 -0.276267 0.136054 1.071650
7.133333 -4.442173 0.259890 -2.836530 -0.232708 0.115558 0.856770
7.166667 -4.448886 0.262918 -2.814141 -0.190921 0.094882 0.659790
7.200000 -4.455125 0.265883 -2.810130 -0.153213 0.076182 0.484460
7.233333 -4.458482 0.267907 -2.811477 -0.119982 0.059857 0.336357
7.266667 -4.460256 0.268775 -2.808137 -0.091786 0.046397 0.216952
7.300000 -4.461586 0.269579 -2.825041 -0.068706 0.035867 0.126923
7.333333 -4.462490 0.270077 -2.815434 -0.050141 0.027692 0.062459
7.366667 -4.462904 0.270474 -2.818121 -0.035441 0.021201 0.019543
7.400000 -4.462912 0.270812 -2.822063 -0.023869 0.015758 -0.005167
7.433333 -4.462528 0.271092 -2.824874 -0.015348 0.011423 -0.016726
7.466667 -4.462256 0.270932 -2.821426 -0.009436 0.008103 -0.018976
7.500000 -4.462195 0.271354 -2.823729 -0.005636 0.005653 -0.018269
7.533333 -4.462558 0.271342 -2.828041 -0.003477 0.003862 -0.014097
7.566667 -4.462518 0.271443 -2.817010 -0.002432 0.002533 -0.009925
