t x y theta dxdt dydt dthetadt
0.000000 0.000000 0.000000 0.148207 -0.007638 0.017633 -0.003198
0.033333 -0.000277 0.000737 0.148074 -0.009079 0.022718 0.001032
0.066667 -0.000574 0.001483 0.145872 -0.010691 0.028358 0.004191
0.100000 -0.000936 0.002506 0.152422 -0.012486 0.034533 0.004556
0.133333 -0.001336 0.003607 0.144498 -0.014490 0.041289 0.005655
0.166667 -0.001805 0.005001 0.138410 -0.016748 0.048711 0.008471
0.200000 -0.002329 0.006533 0.151339 -0.019323 0.056949 0.015217
0.233333 -0.002924 0.008374 0.157206 -0.022306 0.066215 0.028924
0.266667 -0.003634 0.010444 0.146286 -0.025783 0.076695 0.053304
0.300000 -0.004418 0.012839 0.155236 -0.029819 0.088554 0.091444
0.333333 -0.005346 0.015609 0.149270 -0.034439 0.101851 0.140189
0.366667 -0.006402 0.018806 0.146408 -0.039666 0.116621 0.197320
0.400000 -0.007538 0.022350 0.150208 -0.045516 0.132839 0.262135
0.433333 -0.008898 0.026498 0.145767 -0.051963 0.150411 0.332912
0.466667 -0.010544 0.031384 0.152596 -0.058973 0.169218 0.405438
0.500000 -0.012502 0.037123 0.170151 -0.066528 0.189176 0.477995
0.533333 -0.014855 0.043848 0.209189 -0.074621 0.210254 0.550092
0.566667 -0.017708 0.051629 0.247960 -0.083164 0.232332 0.621927
0.600000 -0.020644 0.059790 0.276720 -0.092012 0.255226 0.688950
0.633333 -0.023662 0.068334 0.293773 -0.100996 0.278774 0.747974
0.666667 -0.026762 0.077265 0.295829 -0.109963 0.302922 0.799835
0.700000 -0.030453 0.087420 0.304768 -0.118686 0.327556 0.843552
0.733333 -0.034714 0.098741 0.357046 -0.126923 0.352491 0.874392
0.766667 -0.039503 0.111190 0.400494 -0.134440 0.377583 0.887237
0.800000 -0.044368 0.124032 0.430103 -0.141047 0.402750 0.881486
0.833333 -0.049552 0.137924 0.454262 -0.146576 0.427799 0.856431
0.866667 -0.054945 0.152821 0.488688 -0.150862 0.452379 0.808560
0.900000 -0.060507 0.168742 0.529790 -0.153876 0.476162 0.736198
0.933333 -0.066134 0.185049 0.574810 -0.155587 0.498961 0.647848
0.966667 -0.071729 0.202306 0.616471 -0.156111 0.520602 0.553010
1.000000 -0.077184 0.220418 0.634468 -0.155581 0.540873 0.457816
1.033333 -0.082384 0.239354 0.636713 -0.154160 0.559678 0.366047
1.066667 -0.087638 0.258657 0.614967 -0.151998 0.577061 0.286824
1.100000 -0.092420 0.278677 0.589861 -0.149237 0.593110 0.227934
1.133333 -0.097254 0.299052 0.596284 -0.146102 0.607833 0.188338
1.166667 -0.102136 0.319777 0.613277 -0.142720 0.621299 0.165145
1.200000 -0.107065 0.340843 0.614684 -0.139179 0.633652 0.154816
1.233333 -0.112040 0.362246 0.615656 -0.135559 0.645067 0.154750
1.266667 -0.116258 0.384097 0.619311 -0.132034 0.655669 0.157884
1.300000 -0.120519 0.406270 0.635517 -0.128685 0.665588 0.156474
1.333333 -0.124821 0.428757 0.664470 -0.125553 0.674948 0.149572
1.366667 -0.128791 0.451500 0.673135 -0.122729 0.683833 0.139064
1.400000 -0.132560 0.474481 0.678876 -0.120342 0.692303 0.126798
1.433333 -0.136368 0.497753 0.673651 -0.118532 0.700350 0.116322
1.466667 -0.140104 0.521312 0.658897 -0.117314 0.707964 0.112088
1.500000 -0.143819 0.545132 0.658828 -0.116767 0.715086 0.118533
1.533333 -0.147551 0.569152 0.662873 -0.116945 0.721696 0.135817
1.566667 -0.151322 0.593430 0.652643 -0.117849 0.727747 0.162894
1.600000 -0.155133 0.617958 0.659536 -0.119456 0.733157 0.197148
1.633333 -0.158984 0.642727 0.662702 -0.121715 0.737897 0.235490
1.666667 -0.163000 0.667523 0.679291 -0.124569 0.741981 0.270913
1.700000 -0.167055 0.692544 0.701916 -0.127916 0.745465 0.300069
1.733333 -0.171150 0.717780 0.724160 -0.131655 0.748375 0.321524
1.766667 -0.175448 0.742899 0.732685 -0.135688 0.750800 0.332635
1.800000 -0.180022 0.768012 0.750342 -0.139890 0.752878 0.334810
1.833333 -0.184868 0.793060 0.757546 -0.144142 0.754738 0.327126
1.866667 -0.189751 0.818290 0.759982 -0.148383 0.756447 0.314453
1.900000 -0.194885 0.843454 0.782157 -0.152558 0.758075 0.295550
1.933333 -0.200264 0.868547 0.788051 -0.156602 0.759706 0.269648
1.966667 -0.205675 0.893798 0.792837 -0.160462 0.761374 0.236256
2.000000 -0.211118 0.919197 0.786927 -0.164119 0.763078 0.195129
2.033333 -0.216590 0.944737 0.796966 -0.167577 0.764789 0.148553
2.066667 -0.222090 0.970409 0.811146 -0.170814 0.766506 0.095236
2.100000 -0.227822 0.996073 0.838794 -0.173826 0.768199 0.035820
2.133333 -0.233729 1.021739 0.854862 -0.176624 0.769823 -0.029860
2.166667 -0.239773 1.047426 0.840478 -0.179216 0.771356 -0.102540
2.200000 -0.245936 1.073135 0.823934 -0.181573 0.772787 -0.183015
2.233333 -0.252117 1.098935 0.798773 -0.183663 0.774121 -0.272132
2.266667 -0.258371 1.124712 0.780935 -0.185453 0.775363 -0.366999
2.300000 -0.264639 1.150563 0.785659 -0.186913 0.776532 -0.461029
2.333333 -0.270977 1.176490 0.774628 -0.188011 0.777649 -0.549767
2.366667 -0.277323 1.202475 0.767318 -0.188732 0.778720 -0.631843
2.400000 -0.283676 1.228509 0.750512 -0.189082 0.779750 -0.705817
2.433333 -0.290059 1.254549 0.703788 -0.189047 0.780752 -0.768711
2.466667 -0.296446 1.280609 0.678491 -0.188607 0.781734 -0.824076
2.500000 -0.302833 1.306692 0.635999 -0.187735 0.782701 -0.874650
2.533333 -0.309148 1.332779 0.601272 -0.186430 0.783653 -0.923556
2.566667 -0.315458 1.358871 0.552856 -0.184680 0.784595 -0.964374
2.600000 -0.321761 1.384961 0.526702 -0.182490 0.785522 -0.994940
2.633333 -0.327929 1.411165 0.509084 -0.179912 0.786397 -1.016469
2.666667 -0.333953 1.437442 0.492494 -0.177033 0.787170 -1.021872
2.700000 -0.339964 1.463688 0.445497 -0.173959 0.787801 -1.007927
2.733333 -0.345781 1.490003 0.414702 -0.170777 0.788253 -0.970479
2.766667 -0.351387 1.516353 0.374560 -0.167581 0.788502 -0.912881
2.800000 -0.356790 1.542774 0.321017 -0.164455 0.788537 -0.834300
2.833333 -0.361994 1.569238 0.275338 -0.161440 0.788387 -0.733493
2.866667 -0.367177 1.595624 0.233392 -0.158515 0.788114 -0.614858
2.900000 -0.372338 1.621921 0.210759 -0.155624 0.787792 -0.485308
2.933333 -0.377477 1.648121 0.200762 -0.152692 0.787492 -0.351704
2.966667 -0.382593 1.674211 0.204989 -0.149589 0.787312 -0.220572
3.000000 -0.387646 1.700308 0.225281 -0.146125 0.787381 -0.101664
3.033333 -0.392642 1.726460 0.232944 -0.142137 0.787778 -0.001930
3.066667 -0.397563 1.752612 0.243093 -0.137524 0.788530 0.076108
3.100000 -0.402347 1.778794 0.253995 -0.132255 0.789588 0.134243
3.133333 -0.406963 1.805024 0.256752 -0.126320 0.790887 0.178407
3.166667 -0.411311 1.831318 0.263072 -0.119825 0.792262 0.217106
3.200000 -0.415316 1.857708 0.270378 -0.112980 0.793529 0.262361
3.233333 -0.418935 1.884334 0.277308 -0.106017 0.794505 0.320690
3.266667 -0.422528 1.910751 0.274057 -0.099121 0.795140 0.394212
3.300000 -0.425570 1.937487 0.276302 -0.092475 0.795400 0.480790
3.333333 -0.427954 1.964631 0.275991 -0.086288 0.795236 0.575954
3.366667 -0.430316 1.991527 0.282439 -0.080688 0.794683 0.673725
3.400000 -0.432658 2.018159 0.323917 -0.075764 0.793760 0.763457
3.433333 -0.434982 2.044515 0.360809 -0.071566 0.792602 0.839237
3.466667 -0.437290 2.070580 0.407291 -0.068167 0.791169 0.896244
3.500000 -0.439585 2.096341 0.460693 -0.065593 0.789558 0.934154
3.533333 -0.441566 2.122794 0.514735 -0.063799 0.787872 0.949250
3.566667 -0.443539 2.148914 0.545453 -0.062798 0.786244 0.940470
3.600000 -0.445388 2.175653 0.581031 -0.062581 0.784661 0.911914
3.633333 -0.447234 2.202028 0.580056 -0.063128 0.782958 0.870869
3.666667 -0.449078 2.228023 0.606811 -0.064455 0.781086 0.820214
3.700000 -0.450924 2.253622 0.637633 -0.066596 0.778846 0.764380
3.733333 -0.452959 2.279582 0.665470 -0.069622 0.776107 0.709049
3.766667 -0.455230 2.305782 0.680173 -0.073554 0.772580 0.657011
3.800000 -0.457511 2.331536 0.715130 -0.078457 0.768211 0.608412
3.833333 -0.460176 2.357566 0.732242 -0.084444 0.762934 0.555266
3.866667 -0.462853 2.383116 0.752056 -0.091537 0.756624 0.496263
3.900000 -0.465990 2.408786 0.771704 -0.099668 0.749121 0.423609
3.933333 -0.469141 2.433939 0.782471 -0.108731 0.740282 0.331871
3.966667 -0.472309 2.458558 0.800776 -0.118647 0.730113 0.215036
4.000000 -0.476002 2.482992 0.800188 -0.129200 0.718499 0.072994
4.033333 -0.480227 2.507123 0.814838 -0.140112 0.705435 -0.092452
4.066667 -0.485019 2.530835 0.815327 -0.151099 0.690934 -0.276711
4.100000 -0.490389 2.553989 0.816998 -0.161959 0.675127 -0.469463
4.133333 -0.496385 2.576576 0.817720 -0.172470 0.658094 -0.660852
4.166667 -0.503068 2.598468 0.799758 -0.182283 0.639862 -0.839587
4.200000 -0.509761 2.619697 0.760681 -0.191163 0.620504 -1.002120
4.233333 -0.516460 2.640245 0.690758 -0.198898 0.600037 -1.138317
4.266667 -0.523164 2.660096 0.615850 -0.205321 0.578450 -1.244830
4.300000 -0.530409 2.679136 0.547023 -0.210255 0.555708 -1.320069
4.333333 -0.537650 2.697445 0.501434 -0.213562 0.531704 -1.366415
4.366667 -0.545235 2.714996 0.448307 -0.215250 0.506350 -1.385539
4.400000 -0.552809 2.731783 0.413449 -0.215330 0.479582 -1.379177
4.433333 -0.560505 2.747744 0.375975 -0.213761 0.451235 -1.356117
4.466667 -0.568182 2.762909 0.350987 -0.210547 0.421239 -1.322606
4.500000 -0.575728 2.777042 0.307270 -0.205763 0.389523 -1.280726
4.533333 -0.582992 2.790049 0.254997 -0.199496 0.356054 -1.226048
4.566667 -0.589841 2.801773 0.206223 -0.191787 0.320684 -1.152940
4.600000 -0.596092 2.811983 0.159675 -0.182707 0.283298 -1.052493
4.633333 -0.602306 2.821328 0.121203 -0.172461 0.243922 -0.912424
4.666667 -0.607691 2.828797 0.081321 -0.161274 0.202614 -0.723914
4.700000 -0.613034 2.835379 0.043728 -0.149294 0.159286 -0.489318
4.733333 -0.618333 2.841065 0.006679 -0.136734 0.113912 -0.216160
4.766667 -0.622453 2.843967 -0.026184 -0.123956 0.066723 0.083250
4.800000 -0.626527 2.845957 -0.034081 -0.111228 0.017842 0.393717
4.833333 -0.630554 2.847027 -0.002915 -0.098825 -0.032595 0.693922
4.866667 -0.633477 2.845381 0.035072 -0.087015 -0.084556 0.966560
4.900000 -0.635487 2.841157 0.110718 -0.076216 -0.137711 1.198143
4.933333 -0.637453 2.836003 0.179897 -0.066785 -0.191631 1.378331
4.966667 -0.638826 2.828372 0.276871 -0.058895 -0.245970 1.495875
5.000000 -0.640159 2.819812 0.348662 -0.052761 -0.300324 1.544062
5.033333 -0.641277 2.808932 0.402206 -0.048576 -0.354200 1.526370
5.066667 -0.642306 2.795815 0.449690 -0.046418 -0.407100 1.446971
5.100000 -0.643326 2.780568 0.502398 -0.046176 -0.458715 1.316099
5.133333 -0.644316 2.764413 0.545832 -0.047788 -0.508909 1.140402
5.166667 -0.645565 2.746228 0.587422 -0.051232 -0.557716 0.934041
5.200000 -0.647173 2.726059 0.624021 -0.056512 -0.605134 0.710571
5.233333 -0.649272 2.703957 0.645209 -0.063462 -0.651234 0.476870
5.266667 -0.651349 2.680990 0.669090 -0.071911 -0.696100 0.237104
5.300000 -0.653405 2.657170 0.677820 -0.081740 -0.739880 -0.004887
5.333333 -0.655442 2.632511 0.655975 -0.092711 -0.782593 -0.238828
5.366667 -0.658172 2.606038 0.636676 -0.104497 -0.824117 -0.458818
5.400000 -0.661565 2.577859 0.619753 -0.116683 -0.864371 -0.661671
5.433333 -0.665631 2.548049 0.595219 -0.128953 -0.903349 -0.840533
5.466667 -0.670391 2.516680 0.543323 -0.140998 -0.940973 -0.984136
5.500000 -0.675840 2.483860 0.492762 -0.152407 -0.976978 -1.086684
5.533333 -0.681977 2.449677 0.453428 -0.162759 -1.011155 -1.150178
5.566667 -0.688086 2.414786 0.401036 -0.171788 -1.043426 -1.173920
5.600000 -0.694163 2.379207 0.347492 -0.179309 -1.073790 -1.157100
5.633333 -0.700795 2.342359 0.302276 -0.185161 -1.102249 -1.103300
5.666667 -0.707387 2.304870 0.258357 -0.189299 -1.128877 -1.022921
5.700000 -0.713934 2.266766 0.213819 -0.191844 -1.153915 -0.921470
5.733333 -0.720683 2.227630 0.176893 -0.193041 -1.177593 -0.799883
5.766667 -0.727378 2.187927 0.160306 -0.193035 -1.200083 -0.664631
5.800000 -0.734058 2.147313 0.153160 -0.191936 -1.221438 -0.522589
5.833333 -0.740676 2.106183 0.141523 -0.189896 -1.241742 -0.376723
5.866667 -0.747105 2.064063 0.129350 -0.186976 -1.261044 -0.226454
5.900000 -0.753462 2.021481 0.127004 -0.183181 -1.279335 -0.078228
5.933333 -0.759499 1.978017 0.119102 -0.178509 -1.296630 0.061426
5.966667 -0.765456 1.934146 0.120385 -0.172991 -1.312925 0.190075
6.000000 -0.771328 1.889895 0.118577 -0.166689 -1.328293 0.309572
6.033333 -0.777112 1.845292 0.139755 -0.159573 -1.342778 0.414980
6.066667 -0.782803 1.800365 0.167983 -0.151642 -1.356449 0.502184
6.100000 -0.787943 1.754849 0.199082 -0.142935 -1.369351 0.572569
6.133333 -0.792499 1.708785 0.220716 -0.133467 -1.381541 0.627242
6.166667 -0.796952 1.662484 0.258550 -0.123301 -1.393049 0.662900
6.200000 -0.800770 1.615507 0.292781 -0.112584 -1.403810 0.675471
6.233333 -0.804479 1.568351 0.305602 -0.101542 -1.413713 0.668836
6.266667 -0.808079 1.521046 0.322491 -0.090412 -1.422602 0.644193
6.300000 -0.811068 1.473291 0.339923 -0.079361 -1.430320 0.604170
6.333333 -0.813459 1.425164 0.372244 -0.068498 -1.436663 0.547667
6.366667 -0.815242 1.376693 0.386635 -0.057897 -1.441380 0.485296
6.400000 -0.816414 1.327997 0.416169 -0.047508 -1.444239 0.418704
6.433333 -0.817471 1.279302 0.428518 -0.037204 -1.444971 0.347460
6.466667 -0.818414 1.230640 0.447874 -0.026890 -1.443345 0.275845
6.500000 -0.819244 1.182040 0.430654 -0.016507 -1.439205 0.206743
6.533333 -0.819962 1.133534 0.455515 -0.006024 -1.432495 0.144454
6.566667 -0.820568 1.085150 0.451872 0.004601 -1.423309 0.083891
6.600000 -0.820593 1.037038 0.439334 0.015377 -1.411700 0.029532
6.633333 -0.820043 0.989374 0.435628 0.026196 -1.397874 -0.015158
6.666667 -0.818966 0.942346 0.425424 0.036954 -1.382063 -0.049066
6.700000 -0.817352 0.896177 0.440882 0.047534 -1.364262 -0.074704
6.733333 -0.815227 0.851070 0.437319 0.057781 -1.344472 -0.087828
6.766667 -0.812523 0.807023 0.418352 0.067519 -1.322412 -0.081916
6.800000 -0.809725 0.763295 0.428921 0.076587 -1.297777 -0.052957
6.833333 -0.806835 0.719910 0.422778 0.084943 -1.270156 0.007890
6.866667 -0.803858 0.676894 0.416487 0.092633 -1.238791 0.111732
6.900000 -0.800798 0.634270 0.408966 0.099718 -1.203310 0.277329
6.933333 -0.797208 0.594229 0.393347 0.106296 -1.163133 0.515252
6.966667 -0.793544 0.554624 0.385064 0.112498 -1.118107 0.838030
7.000000 -0.789811 0.515478 0.400046 0.118402 -1.068251 1.256436
7.033333 -0.785686 0.479725 0.428672 0.124020 -1.013853 1.769648
7.066667 -0.781502 0.444467 0.456255 0.129296 -0.955803 2.367189
7.100000 -0.776987 0.413030 0.506720 0.134079 -0.894901 3.026246
7.133333 -0.772179 0.385507 0.592362 0.138234 -0.832457 3.719700
7.166667 -0.767328 0.358514 0.714467 0.141609 -0.769572 4.404489
7.200000 -0.762243 0.335430 0.900624 0.143978 -0.707695 5.031752
7.233333 -0.757126 0.312887 1.133485 0.145170 -0.647784 5.555367
7.266667 -0.751949 0.294022 1.338160 0.144924 -0.590713 5.938077
7.300000 -0.746752 0.275699 1.622970 0.143155 -0.537159 6.144227
7.333333 -0.741683 0.260673 1.920441 0.139798 -0.487379 6.149956
7.366667 -0.736606 0.246184 2.200291 0.134697 -0.441614 5.950913
7.400000 -0.731527 0.232225 2.461863 0.127840 -0.399530 5.553525
7.433333 -0.727222 0.220951 2.706152 0.119181 -0.361216 4.976454
7.466667 -0.722925 0.210193 2.875815 0.108833 -0.326373 4.241703
7.500000 -0.718642 0.199943 2.997934 0.096771 -0.294796 3.389297
7.533333 -0.715606 0.191527 3.087664 0.083032 -0.266213 2.464530
7.566667 -0.712592 0.183598 3.141259 0.067802 -0.240374 1.508553
7.600000 -0.710867 0.176927 -3.108815 0.051425 -0.217263 0.565198
7.633333 -0.709167 0.170718 -3.104587 0.034245 -0.196490 -0.327159
7.666667 -0.707495 0.164958 3.137479 0.016619 -0.177856 -1.136386
7.700000 -0.706960 0.159793 3.072059 -0.000889 -0.161183 -1.844714
7.733333 -0.707454 0.155060 2.935409 -0.017811 -0.146319 -2.440967
7.766667 -0.708850 0.150663 2.793880 -0.033627 -0.133094 -2.916657
7.800000 -0.711006 0.146602 2.650470 -0.048052 -0.121197 -3.269886
7.833333 -0.713802 0.142861 2.497903 -0.060729 -0.110496 -3.501916
7.866667 -0.716618 0.139483 2.369951 -0.071334 -0.100884 -3.619251
7.900000 -0.719869 0.136460 2.226807 -0.079749 -0.092238 -3.626035
7.933333 -0.723133 0.133772 2.085885 -0.085951 -0.084528 -3.537630
7.966667 -0.726591 0.131379 1.958258 -0.090081 -0.077734 -3.372014
8.000000 -0.730080 0.129186 1.848143 -0.092312 -0.071899 -3.148770
8.033333 -0.733461 0.127090 1.727148 -0.092973 -0.067046 -2.887766
8.066667 -0.736624 0.124976 1.627850 -0.092463 -0.063100 -2.604434
