t x y theta dxdt dydt dthetadt
0.000000 0.000000 0.000000 -0.382885 0.005428 -0.001309 0.002774
0.033333 0.000139 -0.000140 -0.377356 0.008998 -0.000404 0.002897
0.066667 0.000205 -0.000505 -0.386567 0.014198 0.001457 0.007351
0.100000 0.000592 -0.000668 -0.394272 0.021736 0.004489 0.019958
0.133333 0.001039 -0.000887 -0.386990 0.032214 0.008870 0.037535
0.166667 0.001582 -0.000894 -0.384300 0.046508 0.014742 0.058201
0.200000 0.002223 -0.000685 -0.376347 0.065268 0.022209 0.077978
0.233333 0.002962 -0.000254 -0.381536 0.088751 0.031256 0.090995
0.266667 0.004379 0.000296 -0.384654 0.117134 0.041807 0.092404
0.300000 0.006800 0.001484 -0.383970 0.150059 0.053839 0.079934
0.333333 0.010643 0.003085 -0.383459 0.187133 0.067500 0.059859
0.366667 0.017213 0.005542 -0.353680 0.227016 0.083061 0.039769
0.400000 0.023877 0.008236 -0.326701 0.268405 0.101090 0.033697
0.433333 0.034500 0.011849 -0.319697 0.309887 0.122176 0.056176
0.466667 0.045203 0.015701 -0.335673 0.349992 0.147164 0.120438
0.500000 0.060970 0.020626 -0.349429 0.386754 0.176771 0.238284
0.533333 0.076793 0.025789 -0.383141 0.418376 0.211347 0.417533
0.566667 0.092659 0.031187 -0.417213 0.443690 0.251020 0.660033
0.600000 0.108552 0.036823 -0.411523 0.461551 0.295473 0.956665
0.633333 0.126327 0.044907 -0.397609 0.471189 0.344406 1.294931
0.666667 0.144451 0.055714 -0.371076 0.472013 0.396949 1.655524
0.700000 0.162884 0.069914 -0.280443 0.464769 0.451877 2.007808
0.733333 0.180438 0.087722 -0.171481 0.450185 0.508083 2.316850
0.766667 0.197945 0.105733 -0.072126 0.429157 0.564400 2.551931
0.800000 0.213345 0.126831 0.052122 0.402953 0.619720 2.691642
0.833333 0.226001 0.150382 0.191727 0.373347 0.673160 2.720547
0.866667 0.238569 0.174089 0.327140 0.342240 0.724569 2.632364
0.900000 0.248918 0.199573 0.453406 0.311126 0.774308 2.440251
0.933333 0.257678 0.226680 0.555302 0.281522 0.822753 2.166868
0.966667 0.264833 0.254987 0.632802 0.254887 0.870319 1.836840
1.000000 0.270785 0.284777 0.699318 0.232268 0.917372 1.476235
1.033333 0.276617 0.314612 0.715799 0.213891 0.964281 1.114920
1.066667 0.282103 0.347041 0.717796 0.199770 1.010488 0.776912
1.100000 0.287462 0.379459 0.708334 0.189530 1.055443 0.482709
1.133333 0.292918 0.415103 0.686119 0.182581 1.098509 0.244959
1.166667 0.298747 0.454088 0.675306 0.178036 1.138950 0.070091
1.200000 0.305081 0.496714 0.675069 0.174830 1.175668 -0.041125
1.233333 0.311278 0.539189 0.657584 0.172039 1.206730 -0.100179
1.266667 0.317334 0.581471 0.648335 0.168644 1.230568 -0.116581
1.300000 0.323244 0.623520 0.643357 0.163803 1.245484 -0.113600
1.333333 0.329004 0.665295 0.633561 0.156836 1.250211 -0.110539
1.366667 0.334506 0.710226 0.644037 0.147183 1.242857 -0.123558
1.400000 0.339852 0.754799 0.622928 0.134748 1.222694 -0.162800
1.433333 0.345036 0.798970 0.646118 0.119613 1.189102 -0.234410
1.466667 0.350054 0.842696 0.660348 0.102100 1.142033 -0.338445
1.500000 0.354904 0.885933 0.670529 0.082536 1.081451 -0.464513
1.533333 0.358000 0.924793 0.673389 0.061361 1.007384 -0.606356
1.566667 0.359297 0.958844 0.656428 0.039212 0.921370 -0.753182
1.600000 0.359080 0.987671 0.622492 0.016573 0.823949 -0.899037
1.633333 0.358679 1.015870 0.547336 -0.006032 0.717116 -1.029527
1.666667 0.358095 1.043414 0.489952 -0.028190 0.602492 -1.140942
1.700000 0.356186 1.060417 0.430966 -0.049392 0.482526 -1.228477
1.733333 0.354090 1.076722 0.370655 -0.069390 0.359032 -1.284652
1.766667 0.350774 1.081524 0.327144 -0.088064 0.234494 -1.308905
1.800000 0.347270 1.085610 0.314427 -0.105356 0.112154 -1.303006
1.833333 0.343582 1.088975 0.276313 -0.121294 -0.005650 -1.275382
1.866667 0.339714 1.091617 0.222641 -0.135905 -0.116582 -1.226634
1.900000 0.334807 1.084017 0.175271 -0.149335 -0.219165 -1.163213
1.933333 0.328764 1.066549 0.131274 -0.161379 -0.311363 -1.090841
1.966667 0.322542 1.048385 0.094928 -0.171942 -0.393387 -1.011824
2.000000 0.316149 1.029544 0.052855 -0.180899 -0.465837 -0.923976
2.033333 0.309589 1.010046 0.025109 -0.188130 -0.529323 -0.831197
2.066667 0.302870 0.989910 -0.010913 -0.193464 -0.584598 -0.738810
2.100000 0.295998 0.969159 -0.039029 -0.196785 -0.633184 -0.647902
2.133333 0.288979 0.947812 -0.053912 -0.198407 -0.677095 -0.563309
2.166667 0.281821 0.925892 -0.048841 -0.198563 -0.717448 -0.491637
2.200000 0.274530 0.903420 -0.052127 -0.197489 -0.755364 -0.440567
2.233333 0.267112 0.880418 -0.066164 -0.195438 -0.791865 -0.408169
2.266667 0.261240 0.850733 -0.073698 -0.192924 -0.827100 -0.395712
2.300000 0.255249 0.820569 -0.076521 -0.190392 -0.860247 -0.406046
2.333333 0.249144 0.789957 -0.086634 -0.188052 -0.890068 -0.436100
2.366667 0.242931 0.758926 -0.113617 -0.186122 -0.915179 -0.476460
2.400000 0.237201 0.725933 -0.128056 -0.184841 -0.933973 -0.518912
2.433333 0.231372 0.692583 -0.133801 -0.184366 -0.944859 -0.562096
2.466667 0.225532 0.659098 -0.158051 -0.184468 -0.947406 -0.599851
2.500000 0.219600 0.625322 -0.180636 -0.184881 -0.941316 -0.626222
2.533333 0.213582 0.591288 -0.209972 -0.185347 -0.926444 -0.637945
2.566667 0.207273 0.558243 -0.242539 -0.185569 -0.903053 -0.640188
2.600000 0.200649 0.526164 -0.272497 -0.185146 -0.871729 -0.636071
2.633333 0.193907 0.496065 -0.298132 -0.183731 -0.833340 -0.622211
2.666667 0.187464 0.468264 -0.326567 -0.181141 -0.788688 -0.599493
2.700000 0.180863 0.442124 -0.329447 -0.177233 -0.739017 -0.570257
2.733333 0.174536 0.417061 -0.329347 -0.171952 -0.686035 -0.537499
2.766667 0.168661 0.394236 -0.356615 -0.165333 -0.631460 -0.498182
2.800000 0.163111 0.374018 -0.373357 -0.157594 -0.577283 -0.450318
2.833333 0.157795 0.356539 -0.392478 -0.149051 -0.525766 -0.392059
2.866667 0.153045 0.341989 -0.409912 -0.140138 -0.478947 -0.322189
2.900000 0.148273 0.327436 -0.428664 -0.131390 -0.438506 -0.237411
2.933333 0.144017 0.315755 -0.440903 -0.123442 -0.405855 -0.135311
2.966667 0.140218 0.306333 -0.450469 -0.116861 -0.381984 -0.020407
3.000000 0.137318 0.297811 -0.452090 -0.112338 -0.367420 0.100494
3.033333 0.134410 0.289312 -0.453296 -0.110561 -0.361767 0.216389
3.066667 0.131623 0.279869 -0.447035 -0.112084 -0.364177 0.317389
3.100000 0.128786 0.268556 -0.434323 -0.117235 -0.373437 0.395765
3.133333 0.125942 0.257281 -0.406311 -0.126014 -0.387715 0.445956
3.166667 0.122783 0.243508 -0.349605 -0.138358 -0.404940 0.462459
3.200000 0.119616 0.229789 -0.306321 -0.153653 -0.422823 0.445881
3.233333 0.115193 0.214062 -0.285619 -0.170798 -0.439169 0.400464
3.266667 0.109128 0.197189 -0.268478 -0.188578 -0.452089 0.333538
3.300000 0.103059 0.180406 -0.266123 -0.205610 -0.459899 0.250096
3.333333 0.094925 0.163069 -0.277616 -0.220473 -0.461424 0.156220
3.366667 0.085114 0.146051 -0.275290 -0.231696 -0.456121 0.065989
3.400000 0.075316 0.129165 -0.293068 -0.238218 -0.443937 -0.012097
3.433333 0.065542 0.112422 -0.295874 -0.239623 -0.425580 -0.075361
3.466667 0.055534 0.097119 -0.281990 -0.235762 -0.401995 -0.124136
3.500000 0.045566 0.081983 -0.307460 -0.227049 -0.374548 -0.157159
3.533333 0.036585 0.069130 -0.321392 -0.214198 -0.344579 -0.176993
3.566667 0.029416 0.059020 -0.318548 -0.198333 -0.313393 -0.189665
3.600000 0.022312 0.049101 -0.322234 -0.180502 -0.282123 -0.200286
3.633333 0.018636 0.042824 -0.330464 -0.161785 -0.251803 -0.207788
3.666667 0.015034 0.036742 -0.326617 -0.143174 -0.223148 -0.211264
3.700000 0.011508 0.030855 -0.331596 -0.125379 -0.196584 -0.211849
3.733333 0.008060 0.025166 -0.351946 -0.109043 -0.172509 -0.209826
3.766667 0.004691 0.019674 -0.361875 -0.094374 -0.150911 -0.203330
3.800000 0.001402 0.014382 -0.369609 -0.081579 -0.131775 -0.191057
3.833333 -0.001805 0.009289 -0.385566 -0.070322 -0.114520 -0.175158
3.866667 -0.003147 0.006919 -0.385439 -0.060381 -0.098882 -0.155574
3.900000 -0.004404 0.004745 -0.387364 -0.051523 -0.084611 -0.133674
3.933333 -0.005577 0.002765 -0.400307 -0.043518 -0.071496 -0.108175
3.966667 -0.006668 0.000977 -0.392115 -0.036309 -0.059576 -0.083730
4.000000 -0.007677 -0.000623 -0.399777 -0.029837 -0.048886 -0.061035
4.033333 -0.008606 -0.002036 -0.388782 -0.024280 -0.039722 -0.042808
4.066667 -0.009017 -0.002810 -0.399749 -0.019584 -0.032008 -0.027854
4.100000 -0.009349 -0.003405 -0.389514 -0.015703 -0.025635 -0.017070
4.133333 -0.009604 -0.003825 -0.397549 -0.012556 -0.020454 -0.012028
4.166667 -0.010029 -0.004230 -0.399360 -0.009983 -0.016233 -0.008756
4.200000 -0.010215 -0.004482 -0.399929 -0.007863 -0.012749 -0.007949
