t x y theta dxdt dydt dthetadt
0.000000 0.000000 0.000000 -0.073354 0.126553 -0.043531 -0.164225
0.033333 0.004026 -0.001220 -0.088682 0.130378 -0.048382 -0.177666
0.066667 0.008054 -0.002855 -0.082293 0.135830 -0.053511 -0.188820
0.100000 0.012211 -0.005002 -0.086434 0.142775 -0.058797 -0.198106
0.133333 0.016681 -0.007034 -0.092794 0.151085 -0.064194 -0.195891
0.166667 0.021560 -0.009594 -0.104891 0.160758 -0.069637 -0.184637
0.200000 0.026765 -0.012030 -0.131263 0.171825 -0.074910 -0.158915
0.233333 0.032414 -0.014898 -0.133833 0.184151 -0.079786 -0.122807
0.266667 0.038402 -0.017631 -0.153440 0.197614 -0.084159 -0.073907
0.300000 0.044735 -0.020223 -0.148228 0.212223 -0.088081 -0.014864
0.333333 0.051882 -0.023307 -0.153498 0.227887 -0.091485 0.045549
0.366667 0.059919 -0.026879 -0.146701 0.244466 -0.094336 0.103367
0.400000 0.068318 -0.030293 -0.148765 0.261858 -0.096650 0.151779
0.433333 0.077082 -0.033542 -0.130180 0.280100 -0.098569 0.190451
0.466667 0.086572 -0.037014 -0.101640 0.299090 -0.100088 0.210764
0.500000 0.096838 -0.040606 -0.086014 0.318606 -0.101053 0.212317
0.533333 0.107481 -0.044012 -0.072997 0.338530 -0.101447 0.198907
0.566667 0.118504 -0.047225 -0.074390 0.358756 -0.101274 0.175640
0.600000 0.130734 -0.050633 -0.067649 0.379076 -0.100517 0.144563
0.633333 0.144085 -0.054283 -0.059697 0.399132 -0.099039 0.108432
0.666667 0.157822 -0.057718 -0.068912 0.418694 -0.096800 0.075976
0.700000 0.172524 -0.061235 -0.067849 0.437512 -0.093853 0.048893
0.733333 0.187612 -0.064521 -0.064961 0.455224 -0.090207 0.022986
0.766667 0.203583 -0.067782 -0.070156 0.471381 -0.085834 -0.008388
0.800000 0.219940 -0.070795 -0.083901 0.485727 -0.080751 -0.043857
0.833333 0.236970 -0.073530 -0.090308 0.498121 -0.075043 -0.082101
0.866667 0.254382 -0.076002 -0.074549 0.508396 -0.068730 -0.126792
0.900000 0.272042 -0.078131 -0.053840 0.516610 -0.061780 -0.178787
0.933333 0.289748 -0.080096 -0.052028 0.523030 -0.054066 -0.233406
0.966667 0.307832 -0.081775 -0.059744 0.528148 -0.045512 -0.289449
1.000000 0.326293 -0.083159 -0.075133 0.532356 -0.036018 -0.350656
1.033333 0.344510 -0.084510 -0.100475 0.536160 -0.025360 -0.420615
1.066667 0.362205 -0.085717 -0.138549 0.540161 -0.013241 -0.495115
1.100000 0.379387 -0.086508 -0.173517 0.544892 0.000685 -0.569233
1.133333 0.396942 -0.086975 -0.185603 0.550695 0.016623 -0.642480
1.166667 0.414550 -0.086770 -0.183718 0.557856 0.034883 -0.711059
1.200000 0.432515 -0.085852 -0.182103 0.566707 0.055850 -0.774098
1.233333 0.451150 -0.084101 -0.202439 0.577358 0.079612 -0.831824
1.266667 0.470519 -0.081342 -0.229141 0.589769 0.106051 -0.893053
1.300000 0.490260 -0.078234 -0.304105 0.603723 0.134842 -0.962024
1.333333 0.510371 -0.074772 -0.356124 0.619145 0.165811 -1.042839
1.366667 0.531081 -0.069528 -0.392280 0.635905 0.198590 -1.135089
1.400000 0.552359 -0.062454 -0.401922 0.653769 0.232532 -1.239447
1.433333 0.574374 -0.053476 -0.433503 0.672589 0.267083 -1.356200
1.466667 0.596752 -0.044143 -0.455797 0.692364 0.301862 -1.481438
1.500000 0.619910 -0.033094 -0.513055 0.713290 0.336624 -1.615574
1.533333 0.643939 -0.020403 -0.575900 0.735345 0.370838 -1.750639
1.566667 0.668318 -0.007372 -0.628890 0.758426 0.404102 -1.883127
1.600000 0.693811 0.007164 -0.690361 0.782607 0.436374 -2.003806
1.633333 0.719644 0.022025 -0.768389 0.807998 0.467829 -2.106697
1.666667 0.746830 0.038279 -0.861525 0.834567 0.498482 -2.183207
1.700000 0.775441 0.055997 -0.943813 0.862009 0.528220 -2.231341
1.733333 0.804370 0.074011 -1.053822 0.890186 0.557236 -2.254824
1.766667 0.833606 0.092310 -1.143328 0.919032 0.585702 -2.256292
1.800000 0.864649 0.112344 -1.216697 0.948133 0.613473 -2.237401
1.833333 0.897492 0.134194 -1.288407 0.977123 0.640284 -2.195355
1.866667 0.930608 0.156286 -1.327661 1.005809 0.666038 -2.137146
1.900000 0.963985 0.178605 -1.371697 1.034471 0.690963 -2.061000
1.933333 0.999609 0.202737 -1.458650 1.063378 0.715157 -1.965618
1.966667 1.035463 0.227062 -1.548141 1.092796 0.738715 -1.848628
2.000000 1.073476 0.253121 -1.605520 1.123186 0.761885 -1.712958
2.033333 1.111684 0.279333 -1.689729 1.154842 0.784900 -1.564349
2.066667 1.150069 0.305679 -1.756131 1.187937 0.807876 -1.402254
2.100000 1.188612 0.332137 -1.813234 1.222149 0.830600 -1.230124
2.133333 1.227292 0.358688 -1.857060 1.257264 0.852997 -1.054574
2.166667 1.268571 0.386961 -1.860220 1.292857 0.874851 -0.887639
2.200000 1.312347 0.416794 -1.860806 1.328504 0.895963 -0.737329
2.233333 1.358607 0.448047 -1.872921 1.363659 0.916023 -0.610648
2.266667 1.407272 0.480599 -1.880687 1.397488 0.934598 -0.513110
2.300000 1.455950 0.513120 -1.885848 1.429444 0.951416 -0.446738
2.333333 1.504611 0.545584 -1.893793 1.458721 0.966032 -0.413117
2.366667 1.553225 0.577962 -1.898345 1.484943 0.978285 -0.404943
2.400000 1.604176 0.611385 -1.916577 1.507747 0.988035 -0.413165
2.433333 1.655015 0.644667 -1.949357 1.527114 0.995350 -0.431621
2.466667 1.707743 0.678809 -1.957786 1.543127 1.000383 -0.456473
2.500000 1.760290 0.712751 -1.969115 1.555556 1.003147 -0.483842
2.533333 1.812622 0.746461 -1.996479 1.564243 1.003700 -0.503967
2.566667 1.864702 0.779910 -2.001877 1.568806 1.001947 -0.515610
2.600000 1.917832 0.813690 -2.018166 1.568769 0.997730 -0.520252
2.633333 1.971654 0.847658 -2.030850 1.563217 0.990662 -0.518094
2.666667 2.025708 0.881532 -2.066230 1.551657 0.980539 -0.502833
2.700000 2.079513 0.915134 -2.083794 1.533968 0.967306 -0.473590
2.733333 2.132569 0.948212 -2.096395 1.510111 0.950945 -0.435837
2.766667 2.184425 0.980544 -2.121471 1.480127 0.931476 -0.387868
2.800000 2.234512 1.011904 -2.149043 1.444641 0.909157 -0.329202
2.833333 2.282281 1.042069 -2.153196 1.405098 0.884613 -0.256514
2.866667 2.329474 1.071708 -2.153703 1.362382 0.858155 -0.175166
2.900000 2.376059 1.100792 -2.162099 1.316881 0.829815 -0.083808
2.933333 2.419146 1.128100 -2.158107 1.268814 0.799464 0.025528
2.966667 2.458208 1.153344 -2.164529 1.218236 0.766789 0.157592
3.000000 2.496581 1.177960 -2.154026 1.164342 0.730985 0.312331
3.033333 2.534240 1.201927 -2.139179 1.105387 0.690707 0.483593
3.066667 2.571163 1.225222 -2.136267 1.040111 0.644806 0.672084
3.100000 2.607329 1.247824 -2.133887 0.967993 0.592599 0.873567
3.133333 2.642716 1.269713 -2.120740 0.888589 0.533461 1.075848
3.166667 2.677304 1.290867 -2.080174 0.801444 0.466815 1.264505
3.200000 2.706364 1.308488 -2.034114 0.707078 0.392643 1.434118
3.233333 2.730101 1.322487 -1.968685 0.606982 0.311516 1.584081
3.266667 2.748703 1.332740 -1.864879 0.503046 0.224309 1.701596
3.300000 2.762524 1.339129 -1.756411 0.397045 0.131702 1.773191
3.333333 2.771874 1.341611 -1.685373 0.291340 0.035012 1.794898
3.366667 2.777009 1.340167 -1.661181 0.188864 -0.063816 1.768966
3.400000 2.778211 1.334858 -1.602544 0.091965 -0.162987 1.695244
3.433333 2.778598 1.328769 -1.535774 0.002195 -0.260967 1.576637
3.466667 2.775784 1.318791 -1.484832 -0.079513 -0.356417 1.431330
3.500000 2.770154 1.305071 -1.415012 -0.152582 -0.447978 1.282527
3.533333 2.762088 1.287668 -1.353633 -0.217098 -0.534971 1.143018
3.566667 2.751859 1.266710 -1.321514 -0.273769 -0.617260 1.019783
3.600000 2.739828 1.242280 -1.306401 -0.323386 -0.694776 0.917613
3.633333 2.726242 1.214523 -1.304637 -0.366371 -0.767326 0.842542
3.666667 2.712002 1.186127 -1.305446 -0.403251 -0.834897 0.790099
3.700000 2.697140 1.157127 -1.310639 -0.434551 -0.897688 0.753947
3.733333 2.681296 1.125463 -1.283721 -0.460685 -0.955735 0.731969
3.766667 2.664889 1.093261 -1.258046 -0.482028 -1.009289 0.721086
3.800000 2.647723 1.058590 -1.222000 -0.498969 -1.058588 0.718226
3.833333 2.629995 1.021594 -1.151522 -0.512003 -1.103960 0.709792
3.866667 2.611917 0.982426 -1.118157 -0.521455 -1.145494 0.692015
3.900000 2.593402 0.942878 -1.090311 -0.527647 -1.183080 0.659735
3.933333 2.574924 0.901578 -1.096449 -0.531027 -1.216614 0.614377
3.966667 2.556645 0.858881 -1.071173 -0.531863 -1.245494 0.559283
4.000000 2.538027 0.815938 -1.066719 -0.530336 -1.269339 0.504059
4.033333 2.520057 0.772137 -1.039947 -0.526871 -1.287935 0.464586
4.066667 2.502820 0.727393 -1.022608 -0.521964 -1.301297 0.445477
4.100000 2.485338 0.682546 -1.013041 -0.515963 -1.309201 0.450522
4.133333 2.467640 0.637644 -1.024646 -0.509026 -1.311554 0.474345
4.166667 2.451408 0.592951 -1.029200 -0.501577 -1.308813 0.509038
4.200000 2.435020 0.548300 -1.015667 -0.493947 -1.300886 0.537568
4.233333 2.418503 0.503740 -0.986437 -0.486084 -1.287208 0.542905
4.266667 2.401887 0.459320 -0.966639 -0.477777 -1.267206 0.512681
4.300000 2.386531 0.417126 -0.929196 -0.468955 -1.240614 0.436876
4.333333 2.371132 0.375166 -0.883519 -0.459584 -1.207056 0.309847
4.366667 2.355717 0.333485 -0.839756 -0.449164 -1.165387 0.137676
4.400000 2.340311 0.292128 -0.811995 -0.437348 -1.115246 -0.064832
4.433333 2.325758 0.254761 -0.786130 -0.424096 -1.057362 -0.282303
4.466667 2.311268 0.217804 -0.800806 -0.409364 -0.992052 -0.496595
4.500000 2.296867 0.181297 -0.859806 -0.392955 -0.919634 -0.683700
4.533333 2.283492 0.149925 -0.920581 -0.374681 -0.840554 -0.816441
4.566667 2.271211 0.124090 -0.986699 -0.354830 -0.756660 -0.878221
4.600000 2.259092 0.098809 -1.074634 -0.333568 -0.669239 -0.859759
4.633333 2.248448 0.079773 -1.126216 -0.310930 -0.578899 -0.755236
4.666667 2.238011 0.061339 -1.180339 -0.287113 -0.486858 -0.562703
4.700000 2.229335 0.049261 -1.184642 -0.262598 -0.395077 -0.299202
4.733333 2.220908 0.037819 -1.169078 -0.237832 -0.305242 0.009826
4.766667 2.212747 0.027024 -1.166395 -0.212972 -0.217725 0.341772
4.800000 2.205942 0.021157 -1.189254 -0.188360 -0.133604 0.678811
4.833333 2.200409 0.019682 -1.154529 -0.164233 -0.053956 1.001603
4.866667 2.195997 0.022043 -1.085687 -0.140727 0.019961 1.283539
4.900000 2.191919 0.025072 -0.994334 -0.117518 0.087976 1.507789
4.933333 2.188745 0.030885 -0.920979 -0.094211 0.149537 1.661297
4.966667 2.186225 0.038987 -0.853748 -0.070342 0.203539 1.724785
5.000000 2.184301 0.048948 -0.793122 -0.045049 0.249699 1.674628
5.033333 2.182876 0.060281 -0.725457 -0.017578 0.288097 1.500038
5.066667 2.182064 0.072525 -0.656149 0.012731 0.319577 1.210300
5.100000 2.181661 0.085391 -0.561759 0.046131 0.344707 0.823337
5.133333 2.181678 0.098868 -0.463746 0.082660 0.364518 0.360790
5.166667 2.183157 0.112167 -0.400290 0.121967 0.380399 -0.144957
5.200000 2.186453 0.125143 -0.413077 0.163151 0.393609 -0.651071
5.233333 2.191895 0.137893 -0.473474 0.205369 0.405382 -1.122018
5.266667 2.199722 0.150738 -0.578919 0.247872 0.416853 -1.529983
5.300000 2.210097 0.164029 -0.717070 0.290051 0.429236 -1.853667
5.333333 2.223196 0.178195 -0.859516 0.331401 0.443629 -2.073967
5.366667 2.236743 0.192890 -0.982629 0.371911 0.460972 -2.181765
5.400000 2.250734 0.208104 -1.079929 0.411975 0.481976 -2.187169
5.433333 2.265163 0.223822 -1.145931 0.451910 0.506836 -2.106270
5.466667 2.280027 0.240032 -1.199550 0.491984 0.535337 -1.965068
5.500000 2.295319 0.256721 -1.249971 0.532669 0.567055 -1.789900
5.533333 2.311036 0.273875 -1.275791 0.574458 0.601361 -1.613837
5.566667 2.329282 0.293388 -1.320040 0.617231 0.637294 -1.459979
5.600000 2.350032 0.315165 -1.343308 0.660738 0.673873 -1.340787
5.633333 2.373243 0.339014 -1.394899 0.704585 0.710201 -1.258897
5.666667 2.398953 0.364792 -1.432586 0.748331 0.745479 -1.210833
5.700000 2.427129 0.392350 -1.468636 0.791053 0.778780 -1.193319
5.733333 2.455653 0.420254 -1.510246 0.831874 0.809279 -1.190661
5.766667 2.484507 0.448479 -1.546245 0.870511 0.836599 -1.198401
5.800000 2.513669 0.476999 -1.580916 0.906745 0.860552 -1.206868
5.833333 2.545425 0.506860 -1.613856 0.940511 0.881116 -1.215495
5.866667 2.577447 0.536965 -1.675401 0.971874 0.898461 -1.219633
5.900000 2.609712 0.567285 -1.708820 1.001213 0.912994 -1.213532
5.933333 2.644079 0.598472 -1.757238 1.028632 0.925061 -1.199276
5.966667 2.678640 0.629820 -1.796570 1.053815 0.934748 -1.171114
6.000000 2.714705 0.661708 -1.836841 1.076262 0.942021 -1.131120
6.033333 2.751903 0.693911 -1.885179 1.095433 0.946798 -1.075860
6.066667 2.789915 0.726217 -1.914671 1.110504 0.948786 -1.009912
6.100000 2.828772 0.758665 -1.962581 1.120439 0.947569 -0.935731
6.133333 2.868012 0.791054 -1.987171 1.124553 0.942855 -0.858262
6.166667 2.907251 0.823151 -2.018807 1.122264 0.934431 -0.781528
6.200000 2.946480 0.855206 -2.048687 1.113015 0.921994 -0.705373
6.233333 2.984857 0.886518 -2.055146 1.096645 0.905473 -0.634473
6.266667 3.023163 0.917730 -2.068614 1.073187 0.884855 -0.566933
6.300000 3.059900 0.947718 -2.073585 1.042975 0.860260 -0.507162
6.333333 3.096509 0.977554 -2.093452 1.006247 0.831744 -0.449434
6.366667 3.130856 1.005733 -2.110201 0.963471 0.799451 -0.395795
6.400000 3.163019 1.032317 -2.128742 0.915638 0.763914 -0.348954
6.433333 3.192659 1.057107 -2.139899 0.863304 0.725384 -0.306592
6.466667 3.222073 1.081648 -2.166030 0.807342 0.684357 -0.269702
6.500000 3.248665 1.104230 -2.165335 0.748705 0.641394 -0.235346
6.533333 3.272221 1.124695 -2.162591 0.688408 0.597114 -0.209726
6.566667 3.295501 1.144857 -2.163298 0.627310 0.552063 -0.191258
6.600000 3.315270 1.162529 -2.163803 0.565972 0.506582 -0.178859
6.633333 3.331471 1.177649 -2.175105 0.505391 0.461325 -0.172095
6.666667 3.347367 1.192426 -2.164322 0.446295 0.416764 -0.169504
6.700000 3.359847 1.204660 -2.175307 0.389449 0.373434 -0.167217
6.733333 3.372014 1.216533 -2.181519 0.335445 0.331752 -0.160339
6.766667 3.380984 1.226046 -2.184923 0.285253 0.292397 -0.147353
6.800000 3.389641 1.235186 -2.208002 0.239472 0.255798 -0.126619
6.833333 3.395821 1.242411 -2.221475 0.198282 0.222103 -0.099514
6.866667 3.399962 1.248050 -2.230293 0.162008 0.191570 -0.067237
6.900000 3.402449 1.252372 -2.232798 0.130608 0.164195 -0.034715
6.933333 3.404646 1.256313 -2.228298 0.104115 0.140045 -0.004980
6.966667 3.406562 1.259874 -2.224608 0.081967 0.118775 0.020389
7.000000 3.408207 1.263057 -2.203157 0.063864 0.100215 0.036498
7.033333 3.409590 1.265862 -2.189718 0.049420 0.084151 0.043058
7.066667 3.410739 1.268150 -2.190951 0.037949 0.070155 0.040645
7.100000 3.411645 1.270064 -2.185529 0.028776 0.057789 0.030250
7.133333 3.412319 1.271606 -2.191247 0.021235 0.046631 0.016050
7.166667 3.412771 1.272778 -2.198995 0.014899 0.036425 -0.001302
7.200000 3.413069 1.273721 -2.203931 0.009340 0.026924 -0.014490
7.233333 3.413257 1.274491 -2.202541 0.004285 0.017935 -0.022015
7.266667 3.413254 1.274898 -2.212912 -0.000395 0.009367 -0.023110
7.300000 3.413072 1.274946 -2.208706 -0.004706 0.001223 -0.017310
7.333333 3.412720 1.274638 -2.216264 -0.008678 -0.006547 -0.007530
7.366667 3.412322 1.274328 -2.209850 -0.012353 -0.014024 0.005959
7.400000 3.411777 1.273669 -2.207065 -0.015775 -0.021311 0.018564
7.433333 3.411095 1.272663 -2.206388 -0.018961 -0.028451 0.029357
7.466667 3.410399 1.271661 -2.196699 -0.021959 -0.035555 0.036384
7.500000 3.409589 1.270320 -2.204416 -0.024841 -0.042769 0.040658
7.533333 3.408743 1.268924 -2.196928 -0.027668 -0.050245 0.040803
7.566667 3.407805 1.267196 -2.197326 -0.030522 -0.058128 0.037747
7.600000 3.406735 1.265317 -2.194336 -0.033529 -0.066640 0.032394
7.633333 3.405595 1.263113 -2.197948 -0.036822 -0.076019 0.026078
7.666667 3.404328 1.260648 -2.194797 -0.040466 -0.086390 0.019092
7.700000 3.403013 1.257866 -2.192089 -0.044500 -0.097896 0.008843
7.733333 3.401660 1.254772 -2.190561 -0.048957 -0.110629 -0.004230
7.766667 3.400280 1.251370 -2.197558 -0.053796 -0.124596 -0.021363
7.800000 3.398592 1.247411 -2.188639 -0.058776 -0.139658 -0.039459
7.833333 3.396565 1.242730 -2.195067 -0.063628 -0.155638 -0.056295
7.866667 3.394547 1.237757 -2.198104 -0.067944 -0.172442 -0.060036
7.900000 3.392042 1.231841 -2.194777 -0.071238 -0.189779 -0.036241
7.933333 3.388990 1.224769 -2.195907 -0.072981 -0.207308 0.032705
7.966667 3.385982 1.217425 -2.197060 -0.072690 -0.224741 0.163582
8.000000 3.383029 1.209817 -2.205289 -0.069851 -0.241870 0.366472
8.033333 3.379762 1.200890 -2.223303 -0.063974 -0.258469 0.651895
8.066667 3.376576 1.191716 -2.248277 -0.054635 -0.274294 1.013099
8.100000 3.373483 1.182307 -2.258930 -0.041528 -0.289299 1.442115
8.133333 3.371526 1.172078 -2.219839 -0.024238 -0.303624 1.918535
8.166667 3.369685 1.161634 -2.187008 -0.002057 -0.317516 2.421144
8.200000 3.370192 1.150454 -2.069997 0.025046 -0.331108 2.922719
8.233333 3.370835 1.139081 -1.936132 0.057325 -0.344805 3.393561
8.266667 3.371621 1.127527 -1.768348 0.094605 -0.358928 3.811110
8.300000 3.372558 1.115803 -1.579188 0.137000 -0.373920 4.147152
8.333333 3.377230 1.103345 -1.401962 0.183942 -0.390022 4.382304
8.366667 3.382064 1.090741 -1.217668 0.234271 -0.407265 4.493735
8.400000 3.390712 1.077235 -1.072210 0.287382 -0.425937 4.480832
8.433333 3.399524 1.063609 -0.896678 0.342167 -0.445976 4.343341
8.466667 3.412079 1.048798 -0.738150 0.397526 -0.467295 4.088005
8.500000 3.428326 1.032659 -0.575635 0.451556 -0.489345 3.730044
8.533333 3.444719 1.016444 -0.444541 0.503258 -0.511827 3.293384
8.566667 3.464429 0.998617 -0.301711 0.551666 -0.534414 2.807576
8.600000 3.484263 0.980749 -0.183844 0.595881 -0.556535 2.289808
8.633333 3.507225 0.960735 -0.091420 0.635022 -0.577576 1.761591
8.666667 3.530279 0.940718 -0.076811 0.668788 -0.597062 1.247824
8.700000 3.553406 0.920718 -0.097456 0.697698 -0.614838 0.772000
8.733333 3.578943 0.898537 -0.116622 0.721598 -0.630293 0.345433
8.766667 3.604514 0.876416 -0.128543 0.740797 -0.642926 -0.018667
8.800000 3.630100 0.854378 -0.159341 0.755335 -0.652090 -0.311259
8.833333 3.655679 0.832446 -0.193849 0.765646 -0.657263 -0.524261
8.866667 3.682333 0.809287 -0.220317 0.771700 -0.657543 -0.665679
8.900000 3.708937 0.786280 -0.262437 0.773227 -0.652057 -0.748200
8.933333 3.735880 0.762952 -0.281648 0.770270 -0.640064 -0.780973
8.966667 3.762724 0.739783 -0.314949 0.762613 -0.620654 -0.778773
9.000000 3.789173 0.717321 -0.330304 0.750291 -0.593379 -0.759997
9.033333 3.815174 0.695877 -0.366341 0.733353 -0.558146 -0.746818
9.066667 3.841011 0.674701 -0.402226 0.712043 -0.515255 -0.749484
9.100000 3.865770 0.655625 -0.420610 0.686659 -0.465102 -0.773946
9.133333 3.889179 0.639105 -0.452443 0.657477 -0.408516 -0.824800
9.166667 3.910959 0.625631 -0.453970 0.625115 -0.347107 -0.905797
9.200000 3.931010 0.615638 -0.447097 0.590178 -0.282483 -1.004200
9.233333 3.950801 0.605993 -0.475223 0.553107 -0.215902 -1.104167
9.266667 3.968598 0.600514 -0.480107 0.514705 -0.149211 -1.199419
9.300000 3.984319 0.599550 -0.518693 0.475513 -0.084097 -1.282159
9.333333 3.999739 0.598947 -0.619779 0.436265 -0.022107 -1.342330
9.366667 4.014846 0.598706 -0.730224 0.397311 0.036022 -1.362962
9.400000 4.027009 0.602691 -0.792427 0.358790 0.089818 -1.340712
9.433333 4.038839 0.607031 -0.838855 0.320699 0.138814 -1.276822
9.466667 4.046963 0.615265 -0.880465 0.282675 0.183256 -1.162202
9.500000 4.054740 0.623837 -0.931099 0.244669 0.223533 -0.991394
9.533333 4.062168 0.632736 -0.941821 0.206443 0.260144 -0.773541
9.566667 4.069242 0.641951 -0.961632 0.167804 0.293411 -0.528944
9.600000 4.075958 0.651470 -0.977150 0.128582 0.323882 -0.271915
9.633333 4.079114 0.663711 -0.992248 0.089209 0.351780 -0.011147
9.666667 4.081909 0.676231 -1.006541 0.049964 0.377510 0.235654
9.700000 4.084344 0.689013 -1.006263 0.010965 0.401411 0.449425
9.733333 4.083960 0.703267 -0.977824 -0.027488 0.423792 0.624036
9.766667 4.081200 0.718518 -0.948109 -0.064778 0.444816 0.760733
9.800000 4.076503 0.734544 -0.875592 -0.099978 0.464359 0.857835
9.833333 4.071462 0.750764 -0.785700 -0.132850 0.482828 0.909206
9.866667 4.066087 0.767161 -0.722788 -0.162998 0.500429 0.916892
9.900000 4.059505 0.784221 -0.715648 -0.189866 0.517176 0.888401
9.933333 4.051698 0.801978 -0.704039 -0.213178 0.533073 0.831955
9.966667 4.043584 0.819851 -0.679484 -0.233046 0.548225 0.755144
10.000000 4.035174 0.837819 -0.667360 -0.249927 0.562632 0.671606
10.033333 4.025936 0.856750 -0.638266 -0.263949 0.575730 0.597171
10.066667 4.016187 0.876597 -0.622917 -0.275247 0.586800 0.542495
10.100000 4.006176 0.896473 -0.635067 -0.284098 0.595023 0.514647
10.133333 3.996122 0.917199 -0.619117 -0.290799 0.599630 0.518114
10.166667 3.985977 0.938682 -0.599695 -0.295542 0.599859 0.555580
10.200000 3.975759 0.960635 -0.573509 -0.298369 0.594795 0.622120
10.233333 3.965328 0.982520 -0.559175 -0.299496 0.584057 0.716901
10.266667 3.954913 1.004004 -0.548713 -0.299182 0.567480 0.837890
10.300000 3.944596 1.024564 -0.543771 -0.297753 0.545450 0.979331
10.333333 3.934513 1.043678 -0.508241 -0.295342 0.518145 1.132344
10.366667 3.924807 1.060739 -0.469791 -0.291987 0.485596 1.289901
10.400000 3.914943 1.077614 -0.426433 -0.287835 0.448528 1.444728
10.433333 3.905604 1.091178 -0.368179 -0.283000 0.407702 1.580908
10.466667 3.896126 1.104521 -0.287586 -0.277453 0.363447 1.683114
10.500000 3.886519 1.117625 -0.233329 -0.271060 0.315707 1.741660
10.533333 3.877801 1.126186 -0.162862 -0.263922 0.265273 1.752098
10.566667 3.868972 1.134483 -0.069333 -0.256151 0.213088 1.711603
10.600000 3.860038 1.142502 0.009458 -0.247791 0.159696 1.621717
10.633333 3.851008 1.150235 0.078974 -0.238771 0.105125 1.491635
10.666667 3.843092 1.153002 0.138347 -0.229318 0.050435 1.335442
10.700000 3.836208 1.150973 0.181760 -0.219773 -0.002872 1.163496
10.733333 3.829247 1.148641 0.202987 -0.210180 -0.054340 0.987917
10.766667 3.822216 1.146005 0.219265 -0.200654 -0.103299 0.816520
10.800000 3.816171 1.139365 0.224591 -0.191323 -0.148751 0.657275
10.833333 3.810064 1.132427 0.221346 -0.182369 -0.189445 0.514805
10.866667 3.803899 1.125196 0.221484 -0.173688 -0.225222 0.389245
10.900000 3.798817 1.114998 0.256219 -0.164968 -0.256342 0.280023
10.933333 3.793682 1.104521 0.264941 -0.155994 -0.282486 0.182995
10.966667 3.788497 1.093773 0.281686 -0.146483 -0.303400 0.096287
11.000000 3.783263 1.082765 0.291182 -0.136130 -0.319493 0.015283
11.033333 3.777983 1.071503 0.279340 -0.124553 -0.331045 -0.064333
11.066667 3.773447 1.059405 0.281490 -0.111497 -0.337774 -0.145986
11.100000 3.769700 1.046914 0.268997 -0.096919 -0.339557 -0.227932
11.133333 3.766820 1.034450 0.251968 -0.081080 -0.336483 -0.309935
11.166667 3.763895 1.021773 0.240621 -0.064400 -0.328936 -0.389422
11.200000 3.760923 1.008892 0.217895 -0.047309 -0.316976 -0.461344
11.233333 3.759293 0.997129 0.192766 -0.030710 -0.300934 -0.520468
11.266667 3.759034 0.986745 0.183921 -0.015571 -0.281639 -0.559373
11.300000 3.760057 0.977845 0.179443 -0.002802 -0.260000 -0.573314
11.333333 3.761019 0.968774 0.158908 0.007079 -0.237004 -0.561128
11.366667 3.762847 0.961143 0.131833 0.013385 -0.213614 -0.526281
11.400000 3.765065 0.954911 0.097030 0.015397 -0.190918 -0.472432
11.433333 3.767151 0.949995 0.040995 0.012967 -0.170022 -0.405068
11.466667 3.768443 0.946420 0.010737 0.006102 -0.151781 -0.334054
11.500000 3.769635 0.942686 0.016600 -0.005037 -0.136632 -0.273001
11.533333 3.770720 0.938790 0.016744 -0.020418 -0.124903 -0.224174
11.566667 3.769284 0.936030 0.032058 -0.039349 -0.116968 -0.187559
11.600000 3.767730 0.933106 0.061218 -0.061058 -0.112934 -0.167462
11.633333 3.766050 0.930015 0.086462 -0.084798 -0.112601 -0.167288
11.666667 3.764240 0.926755 0.070988 -0.109821 -0.115517 -0.183394
11.700000 3.759876 0.923643 0.057969 -0.135284 -0.121391 -0.204045
11.733333 3.755374 0.920358 0.055025 -0.160347 -0.129927 -0.230363
11.766667 3.748965 0.916546 0.029264 -0.184493 -0.140384 -0.262057
11.800000 3.740995 0.911785 -0.006409 -0.207126 -0.152084 -0.292222
11.833333 3.732885 0.906846 -0.060893 -0.227797 -0.164500 -0.308963
11.866667 3.724635 0.901728 -0.064579 -0.246116 -0.177293 -0.310509
11.900000 3.714995 0.894597 -0.038193 -0.261973 -0.190077 -0.299611
11.933333 3.705218 0.887288 -0.019856 -0.275228 -0.202629 -0.268878
11.966667 3.695308 0.879802 -0.015364 -0.285943 -0.215043 -0.214820
12.000000 3.685265 0.872141 -0.035963 -0.294368 -0.227679 -0.137274
12.033333 3.675092 0.864308 -0.058585 -0.300707 -0.241020 -0.044940
12.066667 3.664791 0.856303 -0.087701 -0.305168 -0.255546 0.064675
12.100000 3.654364 0.848128 -0.101886 -0.307973 -0.271833 0.193706
12.133333 3.643812 0.839787 -0.108193 -0.309373 -0.290185 0.335895
12.166667 3.633138 0.831279 -0.091735 -0.309443 -0.310909 0.483332
12.200000 3.622342 0.822609 -0.078996 -0.308234 -0.333974 0.625339
12.233333 3.611732 0.811865 -0.044472 -0.305918 -0.358924 0.753107
12.266667 3.601361 0.799033 0.014031 -0.302696 -0.385091 0.850084
12.300000 3.590873 0.786050 0.072483 -0.298721 -0.411576 0.900785
12.333333 3.580897 0.771301 0.123403 -0.294240 -0.437390 0.896633
12.366667 3.571367 0.754933 0.159006 -0.289600 -0.461359 0.835704
12.400000 3.561718 0.738441 0.197797 -0.285128 -0.482444 0.720287
12.433333 3.552486 0.720886 0.235100 -0.281094 -0.500006 0.559640
12.466667 3.543554 0.702542 0.260194 -0.277747 -0.513769 0.370107
12.500000 3.534817 0.683733 0.278089 -0.275334 -0.523667 0.169740
12.533333 3.526143 0.664832 0.276372 -0.273979 -0.529963 -0.024592
12.566667 3.517318 0.646063 0.250680 -0.273455 -0.533097 -0.197848
12.600000 3.508376 0.627829 0.229943 -0.273299 -0.533429 -0.335812
12.633333 3.499414 0.610485 0.197436 -0.272768 -0.531251 -0.427816
12.666667 3.490312 0.593113 0.168048 -0.270872 -0.526615 -0.471674
12.700000 3.481066 0.575725 0.129484 -0.266365 -0.519417 -0.468110
12.733333 3.471672 0.558332 0.095306 -0.258025 -0.509424 -0.421825
12.766667 3.462125 0.540945 0.065059 -0.245137 -0.496493 -0.336373
12.800000 3.452423 0.523574 0.059881 -0.227437 -0.480649 -0.222886
12.833333 3.442560 0.506231 0.060997 -0.205134 -0.461961 -0.096052
12.866667 3.432533 0.488926 0.069698 -0.178764 -0.440692 0.032730
12.900000 3.425059 0.473145 0.074728 -0.149505 -0.417497 0.152752
12.933333 3.420082 0.458997 0.093094 -0.118779 -0.393160 0.256363
12.966667 3.417592 0.446543 0.113720 -0.087895 -0.368506 0.329261
13.000000 3.417418 0.435865 0.129261 -0.058070 -0.344424 0.371664
13.033333 3.419347 0.427025 0.139421 -0.030502 -0.321893 0.388763
13.066667 3.421039 0.418261 0.149956 -0.006437 -0.301803 0.388099
13.100000 3.422475 0.409572 0.212695 0.013528 -0.284653 0.370461
13.133333 3.423636 0.400962 0.225082 0.029248 -0.270673 0.337446
13.166667 3.424501 0.392430 0.223772 0.040811 -0.259804 0.295407
13.200000 3.426689 0.384358 0.215807 0.048433 -0.251715 0.241154
13.233333 3.428541 0.376366 0.206584 0.052721 -0.245781 0.164326
13.266667 3.430036 0.368455 0.212128 0.054396 -0.241352 0.048208
13.300000 3.432447 0.360526 0.216395 0.053853 -0.237889 -0.112124
13.333333 3.435421 0.352605 0.230574 0.051180 -0.234978 -0.325411
13.366667 3.437969 0.344766 0.245026 0.046030 -0.232139 -0.602974
13.400000 3.440205 0.337064 0.267816 0.038187 -0.228978 -0.951692
13.433333 3.441967 0.329444 0.262782 0.027247 -0.225251 -1.364088
13.466667 3.443234 0.321906 0.223972 0.012819 -0.220711 -1.820582
13.500000 3.443982 0.314450 0.173201 -0.005542 -0.214859 -2.299636
13.533333 3.444187 0.307077 0.106673 -0.028114 -0.207212 -2.770546
13.566667 3.443825 0.299787 -0.015895 -0.054519 -0.197711 -3.189993
13.600000 3.442875 0.292578 -0.169739 -0.084730 -0.186157 -3.515165
13.633333 3.441314 0.285452 -0.345850 -0.118714 -0.172352 -3.713279
13.666667 3.439119 0.278407 -0.526143 -0.156435 -0.156103 -3.763064
13.700000 3.432340 0.273971 -0.730103 -0.197280 -0.137899 -3.651115
13.733333 3.424888 0.269614 -0.905634 -0.240884 -0.118215 -3.378311
13.766667 3.416745 0.265332 -1.051916 -0.287355 -0.097342 -2.967572
13.800000 3.407895 0.261122 -1.186787 -0.336458 -0.075967 -2.448285
13.833333 3.395035 0.260165 -1.272107 -0.387792 -0.055137 -1.858324
13.866667 3.381438 0.259270 -1.307913 -0.441047 -0.036026 -1.238124
13.900000 3.367092 0.258430 -1.298030 -0.496528 -0.019379 -0.637634
13.933333 3.349084 0.259602 -1.276210 -0.553955 -0.006121 -0.097032
13.966667 3.330306 0.260814 -1.228061 -0.612821 0.002688 0.353194
14.000000 3.310752 0.262056 -1.185859 -0.672597 0.006285 0.686584
14.033333 3.288088 0.263929 -1.117653 -0.732882 0.004579 0.888770
14.066667 3.262593 0.265955 -1.047834 -0.792922 -0.002268 0.956577
14.100000 3.234501 0.267673 -0.985824 -0.851525 -0.013911 0.904432
14.133333 3.204045 0.268651 -0.923717 -0.908063 -0.029752 0.744361
14.166667 3.171462 0.268462 -0.873743 -0.961823 -0.048887 0.496973
14.200000 3.136993 0.266715 -0.853718 -1.012161 -0.070466 0.186433
14.233333 3.100825 0.263076 -0.864334 -1.058582 -0.093740 -0.158658
14.266667 3.063887 0.259404 -0.864683 -1.101059 -0.118167 -0.513154
14.300000 3.025286 0.253484 -0.898257 -1.139877 -0.143226 -0.856899
14.333333 2.985932 0.247529 -0.955274 -1.175295 -0.168456 -1.167611
14.366667 2.945836 0.241538 -1.013177 -1.207840 -0.193551 -1.431552
14.400000 2.905008 0.235510 -1.092268 -1.238181 -0.218212 -1.637046
14.433333 2.863458 0.229445 -1.170302 -1.266951 -0.242506 -1.786872
14.466667 2.820744 0.221545 -1.253578 -1.294516 -0.266163 -1.882797
14.500000 2.776981 0.211930 -1.328031 -1.321211 -0.289117 -1.931469
14.533333 2.732279 0.200804 -1.413440 -1.347201 -0.311121 -1.941290
14.566667 2.686903 0.189652 -1.468372 -1.372539 -0.331837 -1.921582
14.600000 2.640471 0.177233 -1.520589 -1.397178 -0.350819 -1.882662
14.633333 2.593392 0.164801 -1.571897 -1.420990 -0.367469 -1.823340
14.666667 2.545319 0.151463 -1.630130 -1.443921 -0.381495 -1.742883
14.700000 2.496380 0.137430 -1.690311 -1.465852 -0.392624 -1.636283
14.733333 2.446841 0.123408 -1.740931 -1.486701 -0.400904 -1.500845
14.766667 2.396718 0.109407 -1.814831 -1.506330 -0.406489 -1.323380
14.800000 2.345965 0.095291 -1.874148 -1.524596 -0.409757 -1.095599
14.833333 2.294662 0.081214 -1.923798 -1.541361 -0.411084 -0.817269
14.866667 2.242824 0.067187 -1.967086 -1.556469 -0.410893 -0.492404
14.900000 2.190288 0.053430 -2.013990 -1.569813 -0.409642 -0.128463
14.933333 2.137254 0.039743 -2.027668 -1.581340 -0.407676 0.266078
14.966667 2.083738 0.026133 -2.012083 -1.591067 -0.405274 0.668827
15.000000 2.029759 0.012612 -1.961739 -1.599074 -0.402530 1.061780
15.033333 1.975636 -0.000556 -1.894497 -1.605471 -0.399559 1.429995
15.066667 1.921522 -0.013569 -1.827300 -1.610463 -0.396353 1.756993
15.100000 1.867595 -0.026595 -1.724617 -1.614292 -0.392775 2.028149
15.133333 1.814040 -0.039770 -1.635852 -1.617226 -0.388664 2.235654
15.166667 1.760112 -0.052810 -1.553048 -1.619592 -0.383734 2.377207
15.200000 1.706369 -0.066035 -1.451318 -1.621772 -0.377801 2.452383
15.233333 1.652285 -0.079107 -1.357674 -1.624101 -0.370639 2.460404
15.266667 1.597877 -0.092015 -1.279563 -1.626795 -0.362045 2.407966
15.300000 1.543713 -0.104414 -1.187554 -1.629999 -0.351883 2.303771
15.333333 1.489754 -0.115914 -1.095603 -1.633774 -0.340124 2.150009
15.366667 1.435520 -0.127222 -1.009670 -1.638106 -0.327096 1.950446
15.400000 1.381028 -0.138329 -0.958767 -1.642885 -0.312906 1.713209
15.433333 1.326294 -0.149228 -0.877906 -1.648059 -0.297480 1.449662
15.466667 1.271334 -0.159910 -0.817078 -1.653614 -0.280752 1.170996
15.500000 1.216015 -0.168066 -0.785632 -1.659479 -0.262782 0.889852
15.533333 1.160503 -0.175990 -0.753857 -1.665616 -0.243384 0.625987
15.566667 1.104816 -0.183679 -0.764634 -1.672057 -0.222109 0.403031
15.600000 1.048971 -0.191125 -0.783778 -1.678807 -0.198920 0.234744
15.633333 0.992985 -0.198325 -0.771527 -1.685799 -0.174182 0.130843
15.666667 0.936876 -0.205272 -0.800965 -1.693033 -0.148261 0.096458
15.700000 0.880659 -0.211962 -0.848982 -1.700580 -0.121167 0.128058
15.733333 0.823946 -0.215757 -0.882061 -1.708514 -0.093409 0.217260
15.766667 0.766725 -0.216885 -0.892373 -1.716859 -0.065870 0.346137
15.800000 0.709451 -0.217749 -0.875480 -1.725763 -0.039243 0.496133
15.833333 0.652143 -0.218350 -0.830019 -1.735508 -0.014054 0.652141
15.866667 0.594175 -0.217437 -0.776010 -1.746276 0.009024 0.797294
15.900000 0.535557 -0.215374 -0.719763 -1.758274 0.029005 0.919199
15.933333 0.476962 -0.213055 -0.671809 -1.771620 0.045470 1.006488
15.966667 0.418412 -0.210485 -0.620861 -1.786443 0.058473 1.053163
16.000000 0.359106 -0.207636 -0.579358 -1.802728 0.068089 1.063104
16.033333 0.299885 -0.204542 -0.561969 -1.820364 0.074416 1.040577
16.066667 0.239526 -0.201332 -0.529788 -1.839224 0.077822 0.992230
16.100000 0.178142 -0.198156 -0.487207 -1.859085 0.078913 0.926111
16.133333 0.115802 -0.195127 -0.474821 -1.879704 0.078097 0.851671
16.166667 0.052472 -0.192271 -0.442073 -1.900710 0.075686 0.776764
16.200000 -0.011757 -0.189658 -0.404658 -1.921700 0.072084 0.702747
16.233333 -0.076873 -0.187413 -0.380324 -1.942072 0.067806 0.628554
16.266667 -0.141727 -0.184946 -0.360510 -1.961275 0.063274 0.556108
16.300000 -0.207223 -0.182872 -0.342754 -1.978788 0.058876 0.487895
16.333333 -0.273729 -0.181117 -0.330832 -1.994166 0.054979 0.423630
16.366667 -0.341098 -0.179682 -0.326349 -2.006981 0.051921 0.364955
16.400000 -0.409245 -0.178465 -0.318528 -2.016795 0.049985 0.318144
16.433333 -0.477968 -0.177443 -0.308613 -2.023310 0.049349 0.286505
16.466667 -0.546242 -0.176202 -0.304349 -2.026221 0.050168 0.271111
16.500000 -0.614868 -0.174932 -0.296622 -2.025224 0.052469 0.270681
16.533333 -0.683583 -0.173520 -0.297594 -2.019930 0.056220 0.286201
16.566667 -0.751743 -0.171888 -0.299140 -2.009957 0.061270 0.316924
16.600000 -0.819315 -0.170035 -0.288374 -1.994962 0.067358 0.357316
16.633333 -0.886737 -0.167810 -0.274218 -1.974521 0.074126 0.406056
16.666667 -0.953500 -0.165363 -0.253796 -1.948217 0.081214 0.459198
16.700000 -1.019394 -0.162538 -0.246486 -1.915407 0.088212 0.517147
16.733333 -1.084048 -0.159262 -0.210550 -1.875424 0.094658 0.572922
16.766667 -1.147127 -0.155640 -0.199808 -1.827966 0.100176 0.622608
16.800000 -1.209416 -0.151796 -0.176396 -1.773006 0.104506 0.662320
16.833333 -1.270882 -0.147731 -0.158573 -1.710444 0.107427 0.687845
16.866667 -1.329517 -0.143531 -0.122587 -1.640352 0.108726 0.699328
16.900000 -1.384849 -0.139355 -0.102440 -1.563033 0.108257 0.688530
16.933333 -1.436834 -0.135312 -0.063452 -1.479481 0.106104 0.653712
16.966667 -1.484838 -0.131575 -0.037614 -1.390617 0.102400 0.590817
17.000000 -1.531898 -0.127618 -0.017197 -1.297163 0.097246 0.495882
17.033333 -1.573827 -0.124264 0.018758 -1.200569 0.091006 0.359273
17.066667 -1.610074 -0.121672 0.036332 -1.102046 0.084172 0.171474
17.100000 -1.645344 -0.118855 0.040667 -1.003222 0.077387 -0.068039
17.133333 -1.679630 -0.115811 0.045772 -0.904785 0.071293 -0.355645
17.166667 -1.706700 -0.113973 0.035590 -0.807369 0.066745 -0.685908
17.200000 -1.732784 -0.111903 0.054162 -0.711605 0.064601 -1.047191
17.233333 -1.750962 -0.111234 0.022622 -0.618222 0.065580 -1.409072
17.266667 -1.768169 -0.110323 -0.032939 -0.527940 0.070120 -1.740701
17.300000 -1.784419 -0.109165 -0.090281 -0.441145 0.078786 -2.013836
17.333333 -1.799724 -0.107754 -0.182267 -0.358797 0.091850 -2.202266
17.366667 -1.809680 -0.106022 -0.329599 -0.281807 0.109203 -2.278219
17.400000 -1.815055 -0.103289 -0.461065 -0.211384 0.130672 -2.222334
17.433333 -1.819540 -0.100290 -0.595006 -0.147556 0.155877 -2.037683
17.466667 -1.820914 -0.095141 -0.717204 -0.090781 0.184547 -1.735922
17.500000 -1.819888 -0.087372 -0.822111 -0.041715 0.215814 -1.332113
17.533333 -1.818051 -0.079332 -0.870372 -0.001001 0.249037 -0.852942
17.566667 -1.815434 -0.071022 -0.875443 0.031096 0.283530 -0.337381
17.600000 -1.812065 -0.062444 -0.841446 0.054929 0.318729 0.179523
17.633333 -1.808540 -0.050663 -0.784776 0.070093 0.353990 0.669875
17.666667 -1.804324 -0.038620 -0.722258 0.076643 0.388760 1.117769
17.700000 -1.800765 -0.023750 -0.642621 0.075309 0.422721 1.507207
17.733333 -1.796573 -0.008631 -0.563006 0.067195 0.455410 1.838683
17.766667 -1.791779 0.006728 -0.497584 0.053331 0.486456 2.124988
17.800000 -1.788355 0.023810 -0.431501 0.034612 0.515304 2.378696
17.833333 -1.786439 0.042231 -0.350845 0.012493 0.541736 2.614659
17.866667 -1.786189 0.061743 -0.283052 -0.011243 0.565382 2.838195
17.900000 -1.787832 0.082163 -0.207088 -0.035130 0.586142 3.059075
17.933333 -1.788996 0.102769 -0.104688 -0.057961 0.603812 3.275926
17.966667 -1.792576 0.123909 -0.010484 -0.078493 0.618217 3.483290
18.000000 -1.798676 0.145507 0.148149 -0.095589 0.629200 3.668454
18.033333 -1.804351 0.167249 0.292941 -0.108655 0.636574 3.823617
18.066667 -1.809614 0.189121 0.456080 -0.117708 0.640110 3.940905
18.100000 -1.814480 0.211108 0.610099 -0.123060 0.639484 4.012728
18.133333 -1.818964 0.233196 0.752786 -0.124876 0.634739 4.036445
18.166667 -1.823080 0.255371 0.887385 -0.123751 0.625727 4.008118
18.200000 -1.826842 0.277618 1.022921 -0.120557 0.612660 3.936021
18.233333 -1.830265 0.299922 1.160909 -0.115908 0.595429 3.816022
18.266667 -1.834279 0.320106 1.297825 -0.110166 0.574481 3.651231
18.300000 -1.837981 0.340320 1.422670 -0.103412 0.550048 3.442646
18.333333 -1.841745 0.357988 1.513560 -0.095718 0.522281 3.191602
18.366667 -1.845225 0.375665 1.635109 -0.086972 0.491740 2.901228
18.400000 -1.848418 0.390678 1.743112 -0.076852 0.458973 2.575888
18.433333 -1.851354 0.405686 1.864950 -0.065214 0.424993 2.230498
18.466667 -1.854045 0.420683 1.961457 -0.052067 0.390230 1.879040
18.500000 -1.855903 0.432617 2.021483 -0.037707 0.355806 1.537228
18.533333 -1.857543 0.444532 2.044209 -0.022724 0.322795 1.219374
18.566667 -1.857918 0.453648 2.032194 -0.007939 0.292562 0.948930
18.600000 -1.858104 0.462742 2.028424 0.005703 0.266211 0.739561
18.633333 -1.857170 0.469900 2.038838 0.017125 0.244966 0.602186
18.666667 -1.855320 0.475607 2.018872 0.025265 0.230343 0.545228
18.700000 -1.852856 0.480464 1.998203 0.029366 0.223023 0.570092
18.733333 -1.850266 0.485314 2.000690 0.028760 0.223645 0.675562
18.766667 -1.847566 0.490161 2.024747 0.023232 0.231962 0.841450
18.800000 -1.844773 0.495011 2.062797 0.012821 0.247563 1.048781
18.833333 -1.842862 0.501258 2.114730 -0.002120 0.269311 1.272851
18.866667 -1.842134 0.509248 2.133655 -0.021003 0.295681 1.488531
18.900000 -1.842738 0.519328 2.193201 -0.043348 0.325271 1.671473
18.933333 -1.844814 0.531689 2.255201 -0.068383 0.356380 1.802016
18.966667 -1.848580 0.546388 2.351070 -0.095397 0.387514 1.870827
19.000000 -1.852327 0.561094 2.455947 -0.123914 0.417407 1.874841
19.033333 -1.856062 0.575801 2.550401 -0.153503 0.445192 1.819401
19.066667 -1.862352 0.592438 2.641548 -0.183855 0.470259 1.707552
19.100000 -1.868643 0.609062 2.708672 -0.214626 0.492267 1.554073
19.133333 -1.874938 0.625668 2.756106 -0.245631 0.511257 1.370193
19.166667 -1.883829 0.643528 2.780250 -0.276744 0.527529 1.173970
19.200000 -1.892730 0.661353 2.805793 -0.307585 0.541265 0.978380
19.233333 -1.903728 0.680014 2.811483 -0.337550 0.552517 0.794044
19.266667 -1.916686 0.699443 2.818697 -0.366014 0.561383 0.634487
19.300000 -1.929649 0.718806 2.817116 -0.392324 0.567872 0.502891
19.333333 -1.943997 0.738572 2.838227 -0.415716 0.571877 0.404238
19.366667 -1.959436 0.758555 2.855773 -0.435560 0.573270 0.332607
19.400000 -1.975697 0.778552 2.871830 -0.451326 0.572040 0.284114
19.433333 -1.992455 0.798379 2.893473 -0.462797 0.568272 0.250986
19.466667 -2.009388 0.817842 2.877434 -0.470015 0.562159 0.227644
19.500000 -2.026198 0.836843 2.880300 -0.472978 0.553828 0.210576
19.533333 -2.042631 0.855223 2.884642 -0.471963 0.543505 0.195975
19.566667 -2.059006 0.873447 2.891750 -0.467381 0.531478 0.184467
19.600000 -2.074758 0.890928 2.904478 -0.459801 0.518060 0.174737
19.633333 -2.090434 0.908232 2.903966 -0.449807 0.503567 0.170333
19.666667 -2.106025 0.925350 2.912710 -0.437722 0.488075 0.168455
19.700000 -2.120514 0.941438 2.914081 -0.424147 0.471860 0.168849
19.733333 -2.134901 0.957321 2.924913 -0.409434 0.455004 0.171588
19.766667 -2.148089 0.972049 2.933007 -0.393773 0.437495 0.177030
19.800000 -2.161160 0.986557 2.936149 -0.377110 0.419137 0.186493
19.833333 -2.172896 0.999751 2.944487 -0.359535 0.399905 0.196612
19.866667 -2.184503 1.012713 2.941896 -0.341221 0.379888 0.208966
19.900000 -2.195975 1.025437 2.945410 -0.322076 0.358973 0.222210
19.933333 -2.207307 1.037917 2.953144 -0.302196 0.337235 0.234716
19.966667 -2.217441 1.049231 2.966680 -0.281686 0.314778 0.243148
20.000000 -2.226415 1.059317 2.974662 -0.260905 0.291954 0.244029
20.033333 -2.235236 1.069147 2.982872 -0.239888 0.268825 0.237605
20.066667 -2.242962 1.077831 2.993079 -0.218804 0.245589 0.223523
20.100000 -2.249572 1.085308 3.014444 -0.197988 0.222590 0.201729
20.133333 -2.255036 1.091581 3.028665 -0.177781 0.200178 0.173672
20.166667 -2.260341 1.097595 3.038240 -0.158455 0.178641 0.141310
20.200000 -2.264627 1.102509 3.033921 -0.140192 0.158178 0.108424
20.233333 -2.268757 1.107167 3.029471 -0.123343 0.139137 0.077515
20.266667 -2.272732 1.111571 3.023377 -0.108032 0.121654 0.049161
20.300000 -2.275884 1.115137 3.027005 -0.094275 0.105763 0.026445
20.333333 -2.278369 1.117964 3.020409 -0.081965 0.091381 0.010663
20.366667 -2.280271 1.120183 3.020010 -0.071083 0.078492 0.002414
20.400000 -2.282027 1.122162 3.023281 -0.061505 0.066975 0.000276
20.433333 -2.283641 1.123906 3.021222 -0.053072 0.056680 0.000908
20.466667 -2.285114 1.125419 3.025821 -0.045699 0.047517 0.004710
20.500000 -2.286327 1.126653 3.025785 -0.039280 0.039356 0.010053
20.533333 -2.287407 1.127667 3.026609 -0.033713 0.032084 0.014067
20.566667 -2.288357 1.128465 3.033734 -0.028828 0.025541 0.015547
20.600000 -2.289188 1.129121 3.022405 -0.024523 0.019630 0.014045
20.633333 -2.289888 1.129712 3.024151 -0.020708 0.014262 0.012680
20.666667 -2.290469 1.130103 3.027706 -0.017298 0.009369 0.010149
20.700000 -2.290935 1.130299 3.025175 -0.014254 0.004956 0.006751
20.733333 -2.291289 1.130305 3.036226 -0.011570 0.001047 0.003144
