t x y theta dxdt dydt dthetadt
0.000000 0.000000 0.000000 0.917650 0.065527 0.002470 -0.228625
0.033333 0.002206 0.000059 0.912342 0.054976 0.002219 -0.230702
0.066667 0.004264 0.000117 0.897181 0.043413 0.002001 -0.220492
0.100000 0.005103 0.000182 0.892969 0.031191 0.002031 -0.202475
0.133333 0.005783 0.000243 0.891594 0.018158 0.002460 -0.180102
0.166667 0.006298 0.000298 0.887499 0.003695 0.003545 -0.159789
0.200000 0.006292 0.000261 0.881406 -0.012810 0.005440 -0.147194
0.233333 0.005958 0.000165 0.885999 -0.031955 0.008302 -0.142341
0.266667 0.005445 0.000060 0.887547 -0.054543 0.012228 -0.150370
0.300000 0.004749 -0.000053 0.885909 -0.081165 0.017190 -0.168447
0.333333 0.003015 0.000398 0.889673 -0.111747 0.023127 -0.195773
0.366667 0.001092 0.000837 0.865325 -0.145974 0.029908 -0.226704
0.400000 -0.002249 0.001668 0.864002 -0.183648 0.037457 -0.258694
0.433333 -0.007992 0.003173 0.851084 -0.224412 0.045627 -0.288854
0.466667 -0.016614 0.004795 0.850359 -0.267044 0.054183 -0.312661
0.500000 -0.027912 0.007190 0.827451 -0.310211 0.062879 -0.330109
0.533333 -0.039395 0.009551 0.816615 -0.352945 0.071580 -0.338754
0.566667 -0.051055 0.011875 0.793301 -0.394124 0.080086 -0.340470
0.600000 -0.067068 0.014977 0.769962 -0.432270 0.088099 -0.334061
0.633333 -0.083241 0.018029 0.773742 -0.466279 0.095364 -0.321717
0.666667 -0.099562 0.021027 0.767774 -0.496059 0.101535 -0.305965
0.700000 -0.118166 0.024749 0.751955 -0.521754 0.106334 -0.289125
0.733333 -0.138013 0.029051 0.749689 -0.543591 0.109283 -0.274627
0.766667 -0.157968 0.033279 0.734657 -0.561976 0.109969 -0.263992
0.800000 -0.177554 0.037707 0.724617 -0.578366 0.108051 -0.260335
0.833333 -0.197217 0.042052 0.721304 -0.593999 0.103287 -0.264104
0.866667 -0.216941 0.046308 0.719680 -0.610113 0.095720 -0.272593
0.900000 -0.236711 0.050471 0.709763 -0.628097 0.085453 -0.286127
0.933333 -0.256511 0.054534 0.703639 -0.649046 0.072905 -0.302456
0.966667 -0.276538 0.057555 0.704792 -0.674034 0.058573 -0.322083
1.000000 -0.298172 0.058802 0.674774 -0.702931 0.043199 -0.342025
1.033333 -0.319782 0.059935 0.664877 -0.735624 0.027445 -0.359922
1.066667 -0.344222 0.059728 0.649617 -0.770953 0.011961 -0.375347
1.100000 -0.368599 0.059401 0.634599 -0.807580 -0.002668 -0.384488
1.133333 -0.396731 0.058192 0.622546 -0.843991 -0.015950 -0.384704
1.166667 -0.424753 0.056857 0.610724 -0.878267 -0.027869 -0.369916
1.200000 -0.458999 0.055292 0.602773 -0.908586 -0.038767 -0.338558
1.233333 -0.493078 0.053593 0.581224 -0.933132 -0.048982 -0.287886
1.266667 -0.526959 0.051760 0.566885 -0.950853 -0.059073 -0.215075
1.300000 -0.560610 0.049796 0.548636 -0.960032 -0.069846 -0.118533
1.333333 -0.594000 0.047699 0.533183 -0.959086 -0.082441 0.000314
1.366667 -0.627099 0.045471 0.537203 -0.946900 -0.097473 0.135374
1.400000 -0.661372 0.043159 0.538457 -0.922847 -0.115633 0.280242
1.433333 -0.695290 0.040716 0.540019 -0.886134 -0.137747 0.422208
1.466667 -0.728821 0.038142 0.556197 -0.835867 -0.164533 0.546590
1.500000 -0.756639 0.031559 0.578534 -0.772907 -0.196130 0.638827
1.533333 -0.784007 0.024859 0.620495 -0.698903 -0.232407 0.688286
1.566667 -0.810898 0.018048 0.668225 -0.615968 -0.273364 0.690453
1.600000 -0.837287 0.011130 0.727143 -0.526647 -0.318727 0.644072
1.633333 -0.855136 0.001127 0.772775 -0.434525 -0.367748 0.556540
1.666667 -0.866229 -0.011506 0.804907 -0.343708 -0.419468 0.440534
1.700000 -0.871920 -0.026607 0.823542 -0.257215 -0.473118 0.312201
1.733333 -0.873152 -0.044129 0.833182 -0.177685 -0.527303 0.187285
1.766667 -0.871698 -0.063368 0.806862 -0.107298 -0.579796 0.082968
1.800000 -0.869670 -0.082603 0.776880 -0.047670 -0.628300 0.016064
1.833333 -0.866701 -0.104841 0.735641 0.001057 -0.670113 0.002426
1.866667 -0.863833 -0.129641 0.716959 0.039814 -0.701972 0.052458
1.900000 -0.861485 -0.156978 0.705592 0.069934 -0.719746 0.175327
1.933333 -0.859212 -0.185888 0.716295 0.093252 -0.720212 0.373320
1.966667 -0.856518 -0.215394 0.725641 0.111793 -0.701516 0.641593
2.000000 -0.853250 -0.244742 0.744329 0.127531 -0.661964 0.967773
2.033333 -0.849411 -0.273905 0.765706 0.141905 -0.601547 1.327919
2.066667 -0.844137 -0.300341 0.795377 0.155701 -0.522261 1.695702
2.100000 -0.837762 -0.321042 0.842445 0.169268 -0.428794 2.036797
2.133333 -0.830837 -0.341476 0.909432 0.182598 -0.325716 2.323946
2.166667 -0.823879 -0.353514 1.013699 0.195653 -0.217218 2.527601
2.200000 -0.816662 -0.355918 1.139171 0.208494 -0.107950 2.627507
2.233333 -0.810064 -0.346159 1.306855 0.221207 -0.002627 2.612944
2.266667 -0.802969 -0.336110 1.445713 0.234064 0.095458 2.483312
2.300000 -0.795381 -0.325784 1.602793 0.247425 0.185139 2.244901
2.333333 -0.787305 -0.315190 1.715156 0.262315 0.265138 1.906950
2.366667 -0.778745 -0.304341 1.776554 0.279535 0.334426 1.489087
2.400000 -0.769705 -0.293248 1.792027 0.300272 0.392313 1.012174
2.433333 -0.760189 -0.281923 1.782557 0.325520 0.440096 0.501399
2.466667 -0.750204 -0.270378 1.758718 0.356195 0.478878 -0.024338
2.500000 -0.738839 -0.251577 1.730489 0.393087 0.508727 -0.540487
2.533333 -0.726179 -0.228713 1.703290 0.435684 0.529917 -1.025794
2.566667 -0.713082 -0.205682 1.676861 0.483591 0.542643 -1.466708
2.600000 -0.699555 -0.182509 1.635983 0.535616 0.547252 -1.853139
2.633333 -0.685608 -0.159219 1.576390 0.590660 0.543108 -2.178737
2.666667 -0.663927 -0.138951 1.489841 0.647124 0.529492 -2.433932
2.700000 -0.641846 -0.118602 1.374038 0.703560 0.506865 -2.613183
2.733333 -0.612484 -0.105214 1.240841 0.758681 0.476455 -2.713214
2.766667 -0.582753 -0.091770 1.105373 0.811200 0.439494 -2.725952
2.800000 -0.552676 -0.078284 0.963052 0.859865 0.397779 -2.645380
2.833333 -0.522278 -0.064769 0.852637 0.903319 0.353087 -2.473354
2.866667 -0.491584 -0.051238 0.773478 0.941197 0.307382 -2.220244
2.900000 -0.460617 -0.037706 0.687742 0.973119 0.262035 -1.903235
2.933333 -0.426170 -0.031056 0.623307 0.999552 0.217938 -1.540482
2.966667 -0.391494 -0.024420 0.582005 1.020966 0.175987 -1.155305
3.000000 -0.355249 -0.022035 0.553063 1.037932 0.136945 -0.773784
3.033333 -0.318828 -0.019668 0.556080 1.051101 0.101643 -0.415769
3.066667 -0.282449 -0.019912 0.557175 1.060472 0.071016 -0.092728
3.100000 -0.245952 -0.020175 0.577151 1.065662 0.046014 0.186608
3.133333 -0.209367 -0.020454 0.608625 1.066237 0.026780 0.414604
3.166667 -0.174028 -0.021046 0.638485 1.061872 0.013475 0.587556
3.200000 -0.138660 -0.021653 0.668600 1.052598 0.005357 0.707282
3.233333 -0.102619 -0.022358 0.696473 1.038568 0.001631 0.777802
3.266667 -0.066567 -0.022910 0.734703 1.020252 0.001077 0.801531
3.300000 -0.030572 -0.023470 0.783777 0.998340 0.002417 0.781466
3.333333 0.004604 -0.022909 0.813016 0.972995 0.004839 0.728191
3.366667 0.037986 -0.022146 0.840088 0.943948 0.007483 0.648996
3.400000 0.069144 -0.021565 0.864500 0.910931 0.009950 0.553477
3.433333 0.096870 -0.020901 0.888123 0.873926 0.011834 0.451205
3.466667 0.124408 -0.020249 0.898992 0.832570 0.013017 0.350780
3.500000 0.151737 -0.019606 0.909725 0.786789 0.013548 0.266171
3.533333 0.178836 -0.018972 0.904229 0.736841 0.013730 0.203357
3.566667 0.205685 -0.018346 0.888164 0.683361 0.013902 0.170887
3.600000 0.232265 -0.017726 0.892731 0.626640 0.014372 0.170226
3.633333 0.253920 -0.017556 0.871468 0.566635 0.015402 0.199428
3.666667 0.271356 -0.017652 0.883835 0.504023 0.017144 0.251486
3.700000 0.284164 -0.017548 0.869750 0.439884 0.019521 0.318239
3.733333 0.296650 -0.017461 0.879919 0.375490 0.022290 0.388213
3.766667 0.308810 -0.017389 0.906462 0.312295 0.025148 0.447507
3.800000 0.318256 -0.016635 0.929881 0.252126 0.027754 0.488077
3.833333 0.324804 -0.014882 0.963934 0.196763 0.029817 0.502548
3.866667 0.328567 -0.012849 1.017044 0.147431 0.031041 0.491504
3.900000 0.329891 -0.010718 1.040376 0.104661 0.031253 0.452776
3.933333 0.330885 -0.008614 1.069651 0.068673 0.030315 0.388172
3.966667 0.330077 -0.007826 1.074804 0.039576 0.028306 0.308490
4.000000 0.328954 -0.007065 1.061858 0.017073 0.025423 0.221978
4.033333 0.327474 -0.006389 1.066822 0.000703 0.021965 0.136541
4.066667 0.326299 -0.005782 1.073370 -0.010160 0.018308 0.059106
4.100000 0.325439 -0.005651 1.053074 -0.016163 0.014925 -0.003215
4.133333 0.324292 -0.005543 1.043609 -0.017825 0.012305 -0.041440
