t x y theta dxdt dydt dthetadt
0.000000 0.000000 0.000000 -0.018162 0.018989 -0.022953 0.399292
0.033333 0.001224 -0.000560 -0.012289 0.016543 -0.028936 0.515043
0.066667 0.001570 -0.001361 -0.012475 0.016517 -0.035634 0.636618
0.100000 0.000856 -0.002419 0.012792 0.019894 -0.042944 0.756122
0.133333 -0.000584 -0.004039 0.073455 0.027590 -0.050696 0.863014
0.166667 -0.001544 -0.005983 0.117969 0.040442 -0.058748 0.952123
0.200000 -0.001904 -0.008183 0.157447 0.058970 -0.066967 1.016631
0.233333 -0.001645 -0.010644 0.201850 0.083757 -0.075251 1.053184
0.266667 0.001003 -0.013297 0.242966 0.114751 -0.083542 1.054255
0.300000 0.004309 -0.016224 0.276587 0.151704 -0.091796 1.020547
0.333333 0.008290 -0.019431 0.329909 0.193902 -0.100101 0.957419
0.366667 0.012963 -0.022923 0.353280 0.240611 -0.108559 0.867848
0.400000 0.021684 -0.026588 0.400430 0.291092 -0.117343 0.756040
0.433333 0.031127 -0.030550 0.412876 0.344708 -0.126677 0.629399
0.466667 0.045295 -0.034744 0.433741 0.400552 -0.136727 0.493935
0.500000 0.060206 -0.039245 0.458964 0.457935 -0.147713 0.354137
0.533333 0.075869 -0.044060 0.466119 0.516178 -0.159749 0.214615
0.566667 0.092289 -0.049193 0.462462 0.574635 -0.172993 0.078723
0.600000 0.113182 -0.054865 0.470672 0.632548 -0.187449 -0.044577
0.633333 0.134843 -0.060866 0.448306 0.688981 -0.203099 -0.153929
0.666667 0.159818 -0.067618 0.440908 0.743620 -0.219920 -0.245480
0.700000 0.185563 -0.074706 0.426634 0.796008 -0.237831 -0.316017
0.733333 0.214210 -0.082839 0.402854 0.845726 -0.256725 -0.363748
0.766667 0.244869 -0.091875 0.390536 0.892208 -0.276343 -0.388659
0.800000 0.276286 -0.101256 0.370369 0.935427 -0.296536 -0.394076
0.833333 0.309459 -0.111618 0.350319 0.975331 -0.317003 -0.382016
0.866667 0.343376 -0.122327 0.331133 1.011947 -0.337476 -0.354693
0.900000 0.378296 -0.134005 0.311747 1.045324 -0.357596 -0.314625
0.933333 0.413944 -0.146030 0.317938 1.075871 -0.377120 -0.269078
0.966667 0.450629 -0.159291 0.310400 1.104202 -0.395878 -0.221223
1.000000 0.488093 -0.173135 0.300067 1.130582 -0.413651 -0.177139
1.033333 0.526526 -0.187885 0.289798 1.155517 -0.430383 -0.141268
1.066667 0.565649 -0.202976 0.295548 1.179342 -0.446044 -0.118011
1.100000 0.605449 -0.218405 0.289585 1.202421 -0.460750 -0.110165
1.133333 0.646143 -0.234247 0.296415 1.224896 -0.474561 -0.116733
1.166667 0.687491 -0.250420 0.306568 1.246861 -0.487726 -0.136042
1.200000 0.729483 -0.266921 0.295969 1.268437 -0.500547 -0.163282
1.233333 0.772107 -0.283746 0.299681 1.289573 -0.513300 -0.194384
1.266667 0.815348 -0.300891 0.304048 1.310147 -0.526189 -0.223441
1.300000 0.859195 -0.318352 0.286913 1.330092 -0.539367 -0.248063
1.333333 0.903635 -0.336123 0.259639 1.349434 -0.552998 -0.262765
1.366667 0.949457 -0.354583 0.241642 1.368099 -0.566967 -0.266495
1.400000 0.996273 -0.373794 0.214698 1.385981 -0.581092 -0.256863
1.433333 1.043163 -0.393246 0.217358 1.403054 -0.595178 -0.236950
1.466667 1.090262 -0.413094 0.202981 1.419383 -0.609064 -0.206670
1.500000 1.137919 -0.434265 0.207642 1.434991 -0.622508 -0.170151
1.533333 1.186044 -0.455766 0.193891 1.449936 -0.635343 -0.132007
1.566667 1.234657 -0.477534 0.200783 1.464472 -0.647559 -0.094613
1.600000 1.283742 -0.499561 0.202043 1.479016 -0.659270 -0.063837
1.633333 1.333259 -0.521758 0.207755 1.493908 -0.670587 -0.037774
1.666667 1.383234 -0.544396 0.205691 1.509433 -0.681603 -0.020266
1.700000 1.433633 -0.567267 0.198951 1.525878 -0.692578 -0.007920
1.733333 1.484441 -0.590362 0.211302 1.543438 -0.703615 -0.000949
1.766667 1.535640 -0.613673 0.191104 1.562246 -0.714827 0.001101
1.800000 1.587484 -0.637203 0.204223 1.582183 -0.726197 -0.000251
1.833333 1.639686 -0.660930 0.196419 1.603205 -0.737719 -0.002804
1.866667 1.693171 -0.686166 0.198927 1.625261 -0.749441 -0.005139
1.900000 1.747670 -0.711623 0.205333 1.648238 -0.761320 -0.009757
1.933333 1.803616 -0.737787 0.217906 1.671783 -0.773250 -0.015560
1.966667 1.859844 -0.764103 0.197590 1.695374 -0.784978 -0.019042
2.000000 1.916872 -0.790333 0.207522 1.718634 -0.796336 -0.020422
2.033333 1.974138 -0.816690 0.193723 1.741174 -0.807097 -0.020735
2.066667 2.032487 -0.843634 0.210812 1.762564 -0.816943 -0.023807
2.100000 2.092464 -0.871266 0.183850 1.782415 -0.825555 -0.022032
2.133333 2.152611 -0.898987 0.198519 1.800761 -0.832836 -0.016593
2.166667 2.213402 -0.927018 0.187933 1.817691 -0.838824 -0.013068
2.200000 2.275634 -0.956331 0.203949 1.833242 -0.843443 -0.012964
2.233333 2.337959 -0.985689 0.178718 1.847393 -0.846815 -0.018605
2.266667 2.399401 -1.014550 0.197667 1.860242 -0.849356 -0.027545
2.300000 2.461029 -1.042766 0.206389 1.871969 -0.851551 -0.049696
2.333333 2.523276 -1.071244 0.205469 1.882406 -0.853902 -0.085078
2.366667 2.586344 -1.099347 0.199716 1.891410 -0.856922 -0.130597
2.400000 2.649980 -1.127050 0.185924 1.898830 -0.861268 -0.178514
2.433333 2.714072 -1.155178 0.194014 1.904351 -0.867365 -0.227342
2.466667 2.778071 -1.183249 0.202496 1.907423 -0.875316 -0.271640
2.500000 2.841949 -1.211248 0.189821 1.907299 -0.885063 -0.303178
2.533333 2.906780 -1.239943 0.164493 1.903404 -0.896296 -0.315196
2.566667 2.971848 -1.269946 0.130246 1.895228 -0.908506 -0.304870
2.600000 3.036294 -1.301235 0.103289 1.882373 -0.921074 -0.275335
2.633333 3.100504 -1.332385 0.094792 1.864767 -0.933419 -0.224074
2.666667 3.162926 -1.364869 0.074898 1.842740 -0.944875 -0.152249
2.700000 3.225056 -1.397176 0.073042 1.816841 -0.954817 -0.065519
2.733333 3.286869 -1.429284 0.080283 1.787755 -0.962759 0.026205
2.766667 3.346843 -1.462039 0.080158 1.756292 -0.968414 0.115783
2.800000 3.404973 -1.495450 0.092978 1.723285 -0.971466 0.197453
2.833333 3.460950 -1.528129 0.109580 1.689459 -0.971483 0.266718
2.866667 3.515365 -1.560762 0.133621 1.655299 -0.968284 0.317864
2.900000 3.569350 -1.593089 0.143140 1.621104 -0.961628 0.354169
2.933333 3.622779 -1.626393 0.161974 1.587131 -0.951234 0.381197
2.966667 3.675151 -1.659176 0.176256 1.553200 -0.936495 0.403276
3.000000 3.726773 -1.691924 0.197010 1.518731 -0.916574 0.422992
3.033333 3.777134 -1.723140 0.203013 1.483247 -0.891086 0.443163
3.066667 3.826135 -1.753308 0.209039 1.446255 -0.859649 0.467446
3.100000 3.874608 -1.783037 0.206876 1.407542 -0.822210 0.493403
3.133333 3.922541 -1.812308 0.221094 1.366804 -0.778888 0.518360
3.166667 3.967632 -1.838434 0.237502 1.324371 -0.730661 0.541547
3.200000 4.012159 -1.864065 0.269936 1.281050 -0.679196 0.564028
3.233333 4.054072 -1.886670 0.305228 1.237650 -0.625995 0.581334
3.266667 4.095404 -1.908750 0.339034 1.194930 -0.572442 0.588769
3.300000 4.133677 -1.925894 0.357409 1.153690 -0.520075 0.587053
3.333333 4.168970 -1.938302 0.366199 1.114668 -0.470515 0.579633
3.366667 4.203672 -1.950159 0.382865 1.077903 -0.424460 0.565027
3.400000 4.237784 -1.961463 0.408894 1.043133 -0.382074 0.541230
3.433333 4.271305 -1.972210 0.421167 1.009687 -0.343074 0.512734
3.466667 4.304236 -1.982398 0.434457 0.976961 -0.307225 0.483130
3.500000 4.336578 -1.992025 0.451847 0.943803 -0.273545 0.449583
3.533333 4.368333 -2.001089 0.471728 0.909053 -0.240748 0.405081
3.566667 4.399502 -2.009589 0.474903 0.872065 -0.208010 0.351588
3.600000 4.430088 -2.017524 0.483991 0.832435 -0.174813 0.291100
3.633333 4.460093 -2.024892 0.514074 0.790198 -0.141090 0.219240
3.666667 4.486351 -2.029804 0.547432 0.745508 -0.107032 0.130766
3.700000 4.510126 -2.032681 0.544163 0.698959 -0.073369 0.027533
3.733333 4.531884 -2.033172 0.532991 0.651255 -0.040976 -0.082636
3.766667 4.551508 -2.031659 0.524293 0.602881 -0.010651 -0.197965
3.800000 4.570596 -2.029597 0.511208 0.554203 0.016964 -0.313376
3.833333 4.587523 -2.026887 0.503575 0.505590 0.041340 -0.418899
3.866667 4.602305 -2.024585 0.489369 0.457317 0.062545 -0.498011
3.900000 4.616597 -2.021758 0.475272 0.409626 0.081037 -0.544982
3.933333 4.630418 -2.018411 0.446442 0.362871 0.097429 -0.560777
3.966667 4.643785 -2.014554 0.414191 0.317564 0.112502 -0.543836
4.000000 4.654949 -2.011400 0.356603 0.274362 0.127139 -0.494313
4.033333 4.663299 -2.008165 0.313861 0.233939 0.142195 -0.414677
4.066667 4.668581 -2.003897 0.303794 0.197141 0.157966 -0.317536
4.100000 4.671209 -1.998282 0.301823 0.165013 0.174211 -0.208585
4.133333 4.673503 -1.992191 0.311013 0.138501 0.190354 -0.092357
4.166667 4.675492 -1.985633 0.319349 0.118400 0.205641 0.023520
4.200000 4.677207 -1.978618 0.347897 0.105206 0.219118 0.125939
4.233333 4.678994 -1.970438 0.348627 0.098936 0.229848 0.207462
4.266667 4.681071 -1.961552 0.344517 0.099028 0.237252 0.267836
4.300000 4.683463 -1.951458 0.361723 0.104308 0.241262 0.308023
4.333333 4.685697 -1.940944 0.384734 0.113627 0.242008 0.331542
4.366667 4.688889 -1.930953 0.406648 0.125779 0.239767 0.340719
4.400000 4.693291 -1.921795 0.421749 0.139598 0.235020 0.343504
4.433333 4.698869 -1.914469 0.420549 0.154304 0.228345 0.341636
4.466667 4.705493 -1.908969 0.423692 0.169445 0.220401 0.334690
4.500000 4.712089 -1.903091 0.432663 0.185026 0.211570 0.322787
4.533333 4.718680 -1.896840 0.442850 0.200918 0.202325 0.302102
4.566667 4.725288 -1.890218 0.467687 0.217170 0.192989 0.274039
4.600000 4.731936 -1.883231 0.468109 0.234137 0.183577 0.240470
4.633333 4.738647 -1.875883 0.483569 0.252049 0.174020 0.201168
4.666667 4.747480 -1.870528 0.512010 0.271225 0.163988 0.158179
4.700000 4.756417 -1.864817 0.513635 0.291776 0.153393 0.110979
4.733333 4.765478 -1.858753 0.506823 0.313953 0.142193 0.067149
4.766667 4.776521 -1.854381 0.510055 0.338034 0.130600 0.029048
4.800000 4.787725 -1.849657 0.491974 0.364014 0.119124 -0.002587
4.833333 4.800091 -1.846406 0.498150 0.392250 0.108495 -0.025217
4.866667 4.813975 -1.844181 0.479334 0.422997 0.099471 -0.037965
4.900000 4.828067 -1.841596 0.479815 0.456592 0.092659 -0.038597
4.933333 4.843420 -1.839822 0.477226 0.493006 0.088621 -0.036083
4.966667 4.859005 -1.837680 0.474718 0.532486 0.087620 -0.034428
5.000000 4.876243 -1.835917 0.480752 0.575248 0.089876 -0.041106
5.033333 4.893733 -1.833775 0.472229 0.620869 0.095204 -0.057271
5.066667 4.913794 -1.831120 0.492943 0.669367 0.103266 -0.084966
5.100000 4.937408 -1.827990 0.496083 0.720481 0.113710 -0.128036
5.133333 4.961293 -1.824465 0.502717 0.774931 0.126042 -0.183030
5.166667 4.990217 -1.819937 0.499012 0.832115 0.139778 -0.247084
5.200000 5.019410 -1.815006 0.467120 0.891664 0.154311 -0.314307
5.233333 5.048868 -1.809666 0.476901 0.954242 0.169255 -0.386840
5.266667 5.078586 -1.803914 0.450741 1.019855 0.184445 -0.465871
5.300000 5.114801 -1.797088 0.424339 1.089273 0.199682 -0.550827
5.333333 5.151260 -1.789844 0.393116 1.161941 0.214789 -0.646693
5.366667 5.187950 -1.782177 0.368970 1.238616 0.229742 -0.764892
5.400000 5.230419 -1.774586 0.361417 1.320041 0.244702 -0.916750
5.433333 5.273088 -1.766567 0.347155 1.405937 0.259809 -1.113871
5.466667 5.323336 -1.757643 0.320534 1.495774 0.274972 -1.359109
5.500000 5.373736 -1.748285 0.303516 1.588303 0.290186 -1.662765
5.533333 5.424260 -1.738493 0.243069 1.682893 0.305483 -2.019024
5.566667 5.483515 -1.728004 0.205798 1.777590 0.320900 -2.415260
5.600000 5.542828 -1.717076 0.121935 1.869963 0.336422 -2.837696
5.633333 5.611020 -1.705595 0.058295 1.956173 0.352154 -3.259593
5.666667 5.679182 -1.693674 -0.075691 2.032784 0.368762 -3.664707
5.700000 5.747266 -1.681314 -0.239631 2.095749 0.387002 -4.020098
5.733333 5.822108 -1.667548 -0.402963 2.139491 0.407676 -4.306030
5.766667 5.901827 -1.653088 -0.634950 2.159872 0.431461 -4.500488
5.800000 5.982471 -1.639819 -0.782950 2.152226 0.459118 -4.583677
5.833333 6.062809 -1.626112 -0.980667 2.114901 0.491149 -4.543665
5.866667 6.142777 -1.611969 -1.143595 2.045927 0.527673 -4.372692
5.900000 6.219926 -1.596502 -1.295625 1.945243 0.568465 -4.078631
5.933333 6.293454 -1.578246 -1.497174 1.816169 0.612995 -3.664081
5.966667 6.359906 -1.557789 -1.628354 1.661658 0.660900 -3.146502
6.000000 6.418027 -1.534340 -1.752448 1.486725 0.711419 -2.539985
6.033333 6.465423 -1.508893 -1.845279 1.295966 0.763790 -1.867724
6.066667 6.500554 -1.481449 -1.873979 1.096565 0.816885 -1.146116
6.100000 6.535006 -1.453614 -1.931502 0.894476 0.869852 -0.390222
6.133333 6.555703 -1.422734 -1.921565 0.694613 0.922225 0.365329
6.166667 6.575706 -1.391492 -1.893446 0.502149 0.973400 1.101748
6.200000 6.581524 -1.357216 -1.822105 0.322336 1.022656 1.790979
6.233333 6.586663 -1.322614 -1.745669 0.158736 1.069540 2.414267
6.266667 6.591140 -1.287709 -1.606677 0.012148 1.113956 2.942941
6.300000 6.584613 -1.249842 -1.483685 -0.115220 1.155336 3.354369
6.333333 6.568806 -1.207648 -1.343323 -0.221841 1.192779 3.647066
6.366667 6.552420 -1.165222 -1.195254 -0.306193 1.225401 3.815729
6.400000 6.535492 -1.122593 -0.962064 -0.368638 1.252797 3.859558
6.433333 6.518063 -1.079790 -0.814520 -0.408722 1.274432 3.781216
6.466667 6.499358 -1.034894 -0.673673 -0.425610 1.289750 3.599079
6.500000 6.480711 -0.989454 -0.537135 -0.420524 1.298723 3.333611
6.533333 6.461680 -0.943933 -0.431498 -0.395433 1.301683 3.000476
6.566667 6.442307 -0.898362 -0.324156 -0.353122 1.298982 2.614590
6.600000 6.426405 -0.854358 -0.239700 -0.296038 1.291055 2.202145
6.633333 6.414639 -0.812520 -0.206641 -0.227013 1.278523 1.784983
6.666667 6.407391 -0.769757 -0.162807 -0.149106 1.262123 1.374894
6.700000 6.404952 -0.726931 -0.115696 -0.065070 1.242686 0.981088
6.733333 6.407907 -0.685440 -0.088005 0.021997 1.221102 0.611035
6.766667 6.410687 -0.644076 -0.087555 0.109415 1.198277 0.274313
6.800000 6.413308 -0.602868 -0.097179 0.194888 1.174751 -0.027531
6.833333 6.421385 -0.564765 -0.099997 0.276595 1.150863 -0.300398
6.866667 6.435262 -0.528145 -0.130365 0.353231 1.126906 -0.539696
6.900000 6.449003 -0.491753 -0.154371 0.424046 1.103027 -0.748242
6.933333 6.468345 -0.456045 -0.200879 0.489242 1.079099 -0.924344
6.966667 6.487549 -0.420610 -0.230845 0.549027 1.054993 -1.073830
7.000000 6.506609 -0.385469 -0.291908 0.603280 1.030816 -1.203192
7.033333 6.529816 -0.351321 -0.323073 0.651500 1.006459 -1.309118
7.066667 6.552865 -0.317509 -0.381222 0.693301 0.981757 -1.398902
7.100000 6.575745 -0.284052 -0.427565 0.727971 0.956381 -1.468572
7.133333 6.601449 -0.251807 -0.475057 0.754705 0.929855 -1.519080
7.166667 6.629379 -0.221000 -0.527648 0.772501 0.901796 -1.543552
7.200000 6.658902 -0.192425 -0.562235 0.780215 0.871796 -1.536418
7.233333 6.688199 -0.164276 -0.637243 0.777327 0.839584 -1.495102
7.266667 6.717252 -0.136566 -0.699114 0.763172 0.804826 -1.415189
7.300000 6.746045 -0.109309 -0.761254 0.737639 0.767383 -1.298531
7.333333 6.774559 -0.082520 -0.845006 0.701237 0.727398 -1.145278
7.366667 6.800495 -0.057847 -0.872936 0.655007 0.684857 -0.966294
7.400000 6.823895 -0.034498 -0.922163 0.600933 0.639628 -0.768176
7.433333 6.843716 -0.012809 -0.944547 0.541162 0.591921 -0.562609
7.466667 6.859059 0.005437 -0.948378 0.478375 0.542376 -0.360862
7.500000 6.874063 0.023170 -0.936027 0.414985 0.491482 -0.173776
7.533333 6.885684 0.039119 -0.911275 0.353316 0.439857 -0.016968
7.566667 6.894330 0.052371 -0.899126 0.295506 0.388383 0.108684
7.600000 6.900466 0.063182 -0.885977 0.243213 0.338203 0.196886
7.633333 6.906264 0.073477 -0.871391 0.197339 0.290163 0.247577
7.666667 6.910448 0.081992 -0.854282 0.158031 0.244766 0.265175
7.700000 6.913422 0.088513 -0.850515 0.125529 0.202803 0.256405
7.733333 6.915384 0.093386 -0.837538 0.099428 0.164870 0.233132
7.766667 6.916947 0.097276 -0.829065 0.078944 0.131205 0.199700
7.800000 6.918253 0.099869 -0.827002 0.063091 0.101815 0.161683
7.833333 6.919286 0.101313 -0.815245 0.051151 0.076855 0.125767
7.866667 6.920513 0.102119 -0.819849 0.042449 0.056324 0.095556
7.900000 6.921817 0.102741 -0.819774 0.036128 0.039833 0.069302
7.933333 6.922852 0.102926 -0.817085 0.031504 0.026889 0.047142
7.966667 6.923626 0.102685 -0.828670 0.028145 0.017168 0.030007
8.000000 6.924416 0.102815 -0.821782 0.025696 0.010196 0.019317
8.033333 6.925312 0.103222 -0.815234 0.023794 0.005306 0.013523
8.066667 6.925969 0.103239 -0.819447 0.022281 0.001970 0.008271
8.100000 6.926396 0.102877 -0.814691 0.021076 -0.000202 0.005472
