t x y theta dxdt dydt dthetadt
0.000000 0.000000 0.000000 0.001404 -0.003563 -0.005110 -0.009118
0.033333 0.000017 -0.000047 0.005483 -0.006314 -0.007227 -0.004654
0.066667 -0.000233 -0.000199 -0.001304 -0.010608 -0.010100 -0.000505
0.100000 -0.000758 -0.000458 0.011358 -0.017070 -0.013966 0.005646
0.133333 -0.001103 -0.000877 -0.009677 -0.026344 -0.019021 0.011567
0.166667 -0.001383 -0.001402 -0.003951 -0.038979 -0.025430 0.018147
0.200000 -0.001666 -0.002013 0.008535 -0.055424 -0.033362 0.018539
0.233333 -0.002252 -0.002741 0.001364 -0.075649 -0.042803 0.015408
0.266667 -0.003150 -0.003586 0.010756 -0.099586 -0.053653 0.005277
0.300000 -0.005199 -0.004836 0.005645 -0.127095 -0.065787 -0.011552
0.333333 -0.007573 -0.006207 0.016352 -0.157962 -0.079102 -0.038523
0.366667 -0.012948 -0.008788 0.004403 -0.191758 -0.093430 -0.071622
0.400000 -0.022126 -0.013183 0.015092 -0.228049 -0.108647 -0.106256
0.433333 -0.031636 -0.017697 0.018387 -0.266816 -0.124757 -0.142060
0.466667 -0.041477 -0.022326 0.010261 -0.307595 -0.141650 -0.173959
0.500000 -0.051647 -0.027069 -0.004272 -0.350060 -0.159263 -0.198821
0.533333 -0.062144 -0.031924 -0.009153 -0.394159 -0.177600 -0.211644
0.566667 -0.072964 -0.036887 -0.038597 -0.440535 -0.196971 -0.215344
0.600000 -0.090188 -0.044393 -0.050595 -0.489690 -0.217506 -0.209446
0.633333 -0.107725 -0.051999 -0.059339 -0.541734 -0.239261 -0.191239
0.666667 -0.125565 -0.059700 -0.071473 -0.596717 -0.262189 -0.160394
0.700000 -0.143697 -0.067489 -0.064068 -0.655162 -0.286413 -0.124089
0.733333 -0.165451 -0.077471 -0.053653 -0.716829 -0.311727 -0.085587
0.766667 -0.189812 -0.087963 -0.074489 -0.780617 -0.337557 -0.045786
0.800000 -0.217812 -0.100349 -0.081986 -0.845495 -0.363428 -0.009155
0.833333 -0.246042 -0.112789 -0.056817 -0.910622 -0.388902 0.018279
0.866667 -0.277364 -0.126162 -0.060275 -0.975203 -0.413621 0.031962
0.900000 -0.311515 -0.141023 -0.065736 -1.037125 -0.436719 0.036454
0.933333 -0.349714 -0.157025 -0.055225 -1.094754 -0.457664 0.029504
0.966667 -0.388039 -0.173029 -0.057430 -1.147065 -0.476121 0.010630
1.000000 -0.426458 -0.189022 -0.042947 -1.193425 -0.491955 -0.019255
1.033333 -0.471502 -0.207305 -0.038664 -1.232658 -0.504836 -0.054771
1.066667 -0.516568 -0.225543 -0.041708 -1.264472 -0.514647 -0.094465
1.100000 -0.561616 -0.243720 -0.044701 -1.289572 -0.521709 -0.140885
1.133333 -0.606606 -0.261819 -0.060542 -1.309037 -0.526356 -0.184573
1.166667 -0.651499 -0.279823 -0.070500 -1.323762 -0.528887 -0.224222
1.200000 -0.696254 -0.297716 -0.075971 -1.333976 -0.529378 -0.253376
1.233333 -0.740832 -0.315481 -0.072688 -1.341009 -0.528293 -0.272564
1.266667 -0.785193 -0.333100 -0.117505 -1.344643 -0.525788 -0.275632
1.300000 -0.829296 -0.350558 -0.113818 -1.344154 -0.521809 -0.258868
1.333333 -0.873104 -0.367838 -0.127547 -1.338499 -0.516209 -0.226791
1.366667 -0.916575 -0.384923 -0.135520 -1.326217 -0.508703 -0.180378
1.400000 -0.964431 -0.402488 -0.151758 -1.305843 -0.498983 -0.125162
1.433333 -1.011869 -0.419823 -0.164721 -1.274908 -0.486443 -0.063093
1.466667 -1.058844 -0.436913 -0.164254 -1.232384 -0.470775 -0.003953
1.500000 -1.105314 -0.453739 -0.164609 -1.177341 -0.451731 0.046472
1.533333 -1.146625 -0.469400 -0.140676 -1.108831 -0.429051 0.081150
1.566667 -1.187350 -0.484768 -0.133110 -1.026419 -0.402675 0.100624
1.600000 -1.221241 -0.498404 -0.128487 -0.931132 -0.372848 0.104344
1.633333 -1.251015 -0.510612 -0.108917 -0.825027 -0.339988 0.092629
1.666667 -1.280109 -0.522489 -0.088922 -0.709654 -0.304399 0.070488
1.700000 -1.303420 -0.532366 -0.095327 -0.587702 -0.266688 0.047055
1.733333 -1.321417 -0.540468 -0.090933 -0.462131 -0.227422 0.031477
1.766667 -1.333096 -0.546937 -0.106479 -0.336519 -0.187120 0.025663
1.800000 -1.344029 -0.553041 -0.111298 -0.213116 -0.146072 0.031455
1.833333 -1.348252 -0.557235 -0.139383 -0.094032 -0.104678 0.052504
1.866667 -1.346804 -0.559984 -0.148667 0.018215 -0.063423 0.090774
1.900000 -1.340396 -0.561380 -0.141075 0.122108 -0.022472 0.136374
1.933333 -1.330352 -0.561263 -0.131176 0.216641 0.018014 0.183096
1.966667 -1.317131 -0.559163 -0.117224 0.301631 0.057663 0.225361
2.000000 -1.303214 -0.556687 -0.097148 0.376631 0.096084 0.259685
2.033333 -1.288622 -0.553838 -0.065278 0.442115 0.133182 0.276279
2.066667 -1.271342 -0.548339 -0.051293 0.499216 0.168854 0.269632
2.100000 -1.251858 -0.540269 -0.045417 0.549534 0.202976 0.244090
2.133333 -1.231766 -0.531839 -0.038241 0.594552 0.235338 0.202911
2.166667 -1.211092 -0.523057 -0.031151 0.635838 0.266077 0.152276
2.200000 -1.189863 -0.513930 -0.011426 0.675061 0.295395 0.096870
2.233333 -1.168105 -0.504466 -0.018238 0.713363 0.323458 0.047435
2.266667 -1.142351 -0.492015 -0.030440 0.751749 0.350650 0.009618
2.300000 -1.116125 -0.479246 -0.040619 0.790522 0.377366 -0.013866
2.333333 -1.089460 -0.466171 -0.043632 0.829651 0.403936 -0.022746
2.366667 -1.062386 -0.452802 -0.053263 0.869045 0.430716 -0.018373
2.400000 -1.034937 -0.439150 -0.047489 0.908520 0.458055 -0.003836
2.433333 -1.003489 -0.423567 -0.056522 0.947727 0.486062 0.015058
2.466667 -0.969427 -0.406591 -0.064056 0.986100 0.514703 0.035386
2.500000 -0.935097 -0.389374 -0.052473 1.023272 0.543908 0.050190
2.533333 -0.899386 -0.371142 -0.034704 1.058976 0.573593 0.057846
2.566667 -0.863832 -0.351635 -0.030798 1.092673 0.603270 0.053119
2.600000 -0.825482 -0.330142 -0.020641 1.123568 0.632160 0.038647
2.633333 -0.787029 -0.308477 -0.013680 1.151160 0.659599 0.016744
2.666667 -0.748516 -0.286661 -0.020753 1.175266 0.685047 -0.012521
2.700000 -0.708213 -0.262836 -0.013471 1.194932 0.707589 -0.041932
2.733333 -0.666772 -0.237382 -0.025600 1.209307 0.726406 -0.070202
2.766667 -0.624384 -0.210931 -0.041370 1.216794 0.740660 -0.088475
2.800000 -0.582121 -0.184420 -0.031048 1.216224 0.749852 -0.100255
2.833333 -0.539666 -0.157771 -0.053784 1.206419 0.753614 -0.107535
2.866667 -0.497474 -0.131616 -0.048907 1.185377 0.751262 -0.115127
2.900000 -0.455551 -0.105475 -0.078483 1.152083 0.742597 -0.125869
2.933333 -0.413258 -0.078847 -0.070529 1.105115 0.727326 -0.144543
2.966667 -0.372725 -0.053433 -0.059990 1.044614 0.705594 -0.178785
3.000000 -0.332604 -0.028104 -0.052877 0.970573 0.677445 -0.223027
3.033333 -0.299736 -0.005257 -0.044785 0.883328 0.642823 -0.271870
3.066667 -0.267368 0.017464 -0.063188 0.784514 0.602132 -0.311679
3.100000 -0.244663 0.036649 -0.056576 0.676561 0.556036 -0.341318
3.133333 -0.222524 0.055673 -0.074793 0.562834 0.505576 -0.347830
3.166667 -0.200977 0.074519 -0.107565 0.445983 0.451734 -0.321377
3.200000 -0.187796 0.089948 -0.149894 0.329307 0.395762 -0.261554
3.233333 -0.181067 0.102332 -0.177605 0.215789 0.339202 -0.175202
3.266667 -0.180444 0.112049 -0.226689 0.107995 0.283545 -0.072277
3.300000 -0.183954 0.118031 -0.229526 0.007047 0.230055 0.043957
3.333333 -0.188118 0.123792 -0.210478 -0.086569 0.179768 0.157168
3.366667 -0.195108 0.126603 -0.161260 -0.171982 0.133954 0.249647
3.400000 -0.202748 0.129191 -0.124612 -0.249798 0.093378 0.308135
3.433333 -0.213847 0.129833 -0.101477 -0.321158 0.058440 0.331531
3.466667 -0.225585 0.130256 -0.072006 -0.387809 0.029243 0.315086
3.500000 -0.240644 0.129279 -0.035841 -0.451100 0.005572 0.257069
3.533333 -0.256321 0.128091 -0.020921 -0.512150 -0.012844 0.168285
3.566667 -0.272604 0.126694 -0.038416 -0.572691 -0.026865 0.066555
3.600000 -0.292198 0.124785 -0.049675 -0.633371 -0.037113 -0.031841
3.633333 -0.314661 0.122592 -0.060507 -0.694274 -0.044253 -0.119909
3.666667 -0.339058 0.120501 -0.085013 -0.754855 -0.048934 -0.185687
3.700000 -0.364786 0.118334 -0.097065 -0.814863 -0.051831 -0.219895
3.733333 -0.393116 0.116439 -0.116945 -0.873992 -0.053632 -0.222704
3.766667 -0.424070 0.114350 -0.127735 -0.931335 -0.054764 -0.202086
3.800000 -0.457215 0.112900 -0.134655 -0.986386 -0.055792 -0.167080
3.833333 -0.492538 0.111524 -0.151756 -1.038870 -0.057192 -0.120304
3.866667 -0.528259 0.109985 -0.141992 -1.088890 -0.059323 -0.070718
3.900000 -0.566185 0.108127 -0.137092 -1.135623 -0.062346 -0.025529
3.933333 -0.606072 0.106420 -0.123316 -1.178460 -0.066370 0.007444
3.966667 -0.646252 0.104563 -0.128262 -1.216628 -0.071570 0.026791
4.000000 -0.686689 0.102559 -0.119850 -1.249183 -0.077926 0.034009
4.033333 -0.731005 0.099679 -0.119082 -1.274881 -0.085268 0.026180
4.066667 -0.775498 0.096663 -0.107762 -1.291183 -0.093453 0.004328
4.100000 -0.820126 0.093514 -0.108155 -1.296541 -0.102286 -0.031460
4.133333 -0.867083 0.090176 -0.116939 -1.289333 -0.111555 -0.077765
4.166667 -0.914700 0.086483 -0.119776 -1.269078 -0.120919 -0.131904
4.200000 -0.962321 0.082675 -0.115292 -1.235349 -0.130111 -0.194447
4.233333 -1.007278 0.077875 -0.117978 -1.187640 -0.138838 -0.261818
4.266667 -1.052151 0.072971 -0.130479 -1.127283 -0.146645 -0.327638
4.300000 -1.088755 0.067334 -0.153931 -1.055932 -0.153083 -0.383800
4.333333 -1.125200 0.061605 -0.156322 -0.975331 -0.157613 -0.425107
4.366667 -1.161455 0.055791 -0.167935 -0.886642 -0.159697 -0.449943
4.400000 -1.183235 0.049874 -0.187806 -0.792221 -0.158795 -0.453419
4.433333 -1.204776 0.043885 -0.215138 -0.695349 -0.154686 -0.435345
4.466667 -1.226060 0.037830 -0.266653 -0.599283 -0.147441 -0.395977
4.500000 -1.247073 0.031717 -0.284698 -0.505922 -0.137245 -0.345612
4.533333 -1.267798 0.025555 -0.306806 -0.417285 -0.124531 -0.285335
4.566667 -1.278259 0.020712 -0.305603 -0.336200 -0.110015 -0.218420
4.600000 -1.281789 0.017752 -0.298651 -0.263667 -0.094581 -0.151053
4.633333 -1.285016 0.014757 -0.271102 -0.200112 -0.078905 -0.088516
4.666667 -1.286088 0.013254 -0.270346 -0.145440 -0.063687 -0.040607
4.700000 -1.286637 0.012845 -0.274444 -0.100311 -0.049665 -0.003445
4.733333 -1.286897 0.012408 -0.278049 -0.065217 -0.037447 0.016790
4.766667 -1.286874 0.011947 -0.282926 -0.038962 -0.027320 0.023098
4.800000 -1.287275 0.011793 -0.267435 -0.020414 -0.019281 0.017897
4.833333 -1.287406 0.011616 -0.280083 -0.008371 -0.013347 0.008234
4.866667 -1.287274 0.011419 -0.266199 -0.001376 -0.009249 -0.000602
4.900000 -1.286886 0.011202 -0.274057 0.002208 -0.006535 -0.009151
4.933333 -1.286250 0.010967 -0.282185 0.003981 -0.004766 -0.012966
4.966667 -1.285979 0.010940 -0.277008 0.004763 -0.003630 -0.014680
