t x y theta dxdt dydt dthetadt
0.000000 0.000000 0.000000 -2.889338 -0.103133 -0.110310 -0.000200
0.033333 -0.003403 -0.003721 -2.889608 -0.101713 -0.113235 0.004032
0.066667 -0.006760 -0.007539 -2.889342 -0.100333 -0.116177 0.005878
0.100000 -0.010074 -0.011455 -2.884904 -0.098994 -0.119139 0.006015
0.133333 -0.013342 -0.015470 -2.883913 -0.097695 -0.122122 0.005849
0.166667 -0.016571 -0.019586 -2.894868 -0.096438 -0.125126 0.005779
0.200000 -0.019756 -0.023803 -2.878781 -0.095224 -0.128154 0.005508
0.233333 -0.022899 -0.028119 -2.882794 -0.094057 -0.131210 0.003667
0.266667 -0.026009 -0.032541 -2.885992 -0.092940 -0.134293 0.002988
0.300000 -0.029078 -0.037063 -2.882361 -0.091876 -0.137408 0.002717
0.333333 -0.032109 -0.041688 -2.888412 -0.090869 -0.140557 0.002363
0.366667 -0.035100 -0.046413 -2.885156 -0.089921 -0.143740 0.001242
0.400000 -0.038067 -0.051249 -2.893112 -0.089031 -0.146956 0.001221
0.433333 -0.040998 -0.056187 -2.885302 -0.088197 -0.150203 0.001930
0.466667 -0.043907 -0.061237 -2.882182 -0.087419 -0.153481 0.002493
0.500000 -0.046797 -0.066401 -2.886389 -0.086693 -0.156786 0.004144
0.533333 -0.049669 -0.071681 -2.879983 -0.086013 -0.160114 0.005732
0.566667 -0.052525 -0.077077 -2.885192 -0.085375 -0.163462 0.006675
0.600000 -0.055350 -0.082576 -2.887912 -0.084781 -0.166834 0.005579
0.633333 -0.058162 -0.088193 -2.885026 -0.084228 -0.170226 0.004355
0.666667 -0.060964 -0.093931 -2.889824 -0.083712 -0.173638 0.003071
0.700000 -0.063737 -0.099771 -2.877592 -0.083233 -0.177068 0.000857
0.733333 -0.066481 -0.105712 -2.883234 -0.082794 -0.180520 -0.000890
0.766667 -0.069220 -0.111778 -2.885794 -0.082393 -0.183992 -0.001487
0.800000 -0.071955 -0.117968 -2.884017 -0.082024 -0.187475 -0.001398
0.833333 -0.074663 -0.124259 -2.878250 -0.081682 -0.190964 -0.001782
0.866667 -0.077371 -0.130677 -2.885300 -0.081364 -0.194451 -0.002350
0.900000 -0.080078 -0.137223 -2.886284 -0.081058 -0.197924 -0.002695
0.933333 -0.082787 -0.143899 -2.891420 -0.080751 -0.201364 -0.002183
0.966667 -0.085473 -0.150674 -2.885147 -0.080433 -0.204762 -0.002495
1.000000 -0.088163 -0.157580 -2.892298 -0.080101 -0.208111 -0.001359
1.033333 -0.090830 -0.164583 -2.869803 -0.079752 -0.211406 0.000260
1.066667 -0.093504 -0.171720 -2.886846 -0.079387 -0.214653 0.002710
1.100000 -0.096157 -0.178953 -2.881758 -0.079014 -0.217860 0.004197
1.133333 -0.098788 -0.186281 -2.892666 -0.078645 -0.221043 0.004938
1.166667 -0.101399 -0.193703 -2.883680 -0.078289 -0.224213 0.005836
1.200000 -0.103989 -0.201219 -2.890627 -0.077958 -0.227386 0.005561
1.233333 -0.106559 -0.208827 -2.876161 -0.077660 -0.230573 0.003836
1.266667 -0.109109 -0.216526 -2.883054 -0.077406 -0.233787 -0.000162
1.300000 -0.111673 -0.224365 -2.885873 -0.077201 -0.237037 -0.005879
1.333333 -0.114219 -0.232292 -2.888703 -0.077054 -0.240338 -0.015429
1.366667 -0.116780 -0.240360 -2.874748 -0.076968 -0.243692 -0.029232
1.400000 -0.119359 -0.248568 -2.885056 -0.076943 -0.247102 -0.047181
1.433333 -0.121919 -0.256862 -2.880849 -0.076977 -0.250568 -0.067282
1.466667 -0.124461 -0.265240 -2.881280 -0.077067 -0.254085 -0.091361
1.500000 -0.127022 -0.273761 -2.887278 -0.077210 -0.257648 -0.117560
1.533333 -0.129565 -0.282362 -2.888863 -0.077398 -0.261244 -0.144323
1.566667 -0.132128 -0.291107 -2.898025 -0.077630 -0.264869 -0.168553
1.600000 -0.134712 -0.299994 -2.901429 -0.077899 -0.268510 -0.191500
1.633333 -0.137317 -0.309023 -2.914793 -0.078194 -0.272146 -0.211875
1.666667 -0.139943 -0.318191 -2.920305 -0.078498 -0.275748 -0.224775
1.700000 -0.142550 -0.327431 -2.932238 -0.078799 -0.279291 -0.230031
1.733333 -0.145178 -0.336807 -2.934881 -0.079082 -0.282747 -0.228106
1.766667 -0.147825 -0.346314 -2.945465 -0.079330 -0.286086 -0.220340
1.800000 -0.150492 -0.355951 -2.967552 -0.079536 -0.289291 -0.202440
1.833333 -0.153178 -0.365712 -2.971475 -0.079698 -0.292355 -0.176753
1.866667 -0.155883 -0.375596 -2.970214 -0.079818 -0.295277 -0.147021
1.900000 -0.158566 -0.385536 -2.979019 -0.079894 -0.298050 -0.114619
1.933333 -0.161226 -0.395531 -2.987441 -0.079933 -0.300679 -0.077450
1.966667 -0.163862 -0.405579 -2.991295 -0.079948 -0.303179 -0.035634
2.000000 -0.166515 -0.415729 -2.984780 -0.079946 -0.305559 0.005751
2.033333 -0.169183 -0.425979 -2.979979 -0.079943 -0.307831 0.046349
2.066667 -0.171866 -0.436323 -2.979806 -0.079950 -0.310010 0.087198
2.100000 -0.174522 -0.446707 -2.979880 -0.079977 -0.312107 0.127462
2.133333 -0.177192 -0.457175 -2.968134 -0.080023 -0.314121 0.161774
2.166667 -0.179834 -0.467677 -2.966413 -0.080075 -0.316039 0.188291
2.200000 -0.182489 -0.478253 -2.964360 -0.080122 -0.317850 0.209507
2.233333 -0.185155 -0.488899 -2.958256 -0.080141 -0.319537 0.227160
2.266667 -0.187833 -0.499609 -2.938748 -0.080111 -0.321083 0.239905
2.300000 -0.190521 -0.510378 -2.923357 -0.080009 -0.322475 0.249677
2.333333 -0.193217 -0.521199 -2.905107 -0.079821 -0.323709 0.260061
2.366667 -0.195922 -0.532067 -2.902807 -0.079532 -0.324778 0.274459
2.400000 -0.198634 -0.542978 -2.900597 -0.079128 -0.325680 0.292414
2.433333 -0.201308 -0.553896 -2.897640 -0.078598 -0.326416 0.312093
2.466667 -0.203942 -0.564817 -2.897242 -0.077939 -0.326993 0.336591
2.500000 -0.206537 -0.575737 -2.889672 -0.077152 -0.327418 0.363489
2.533333 -0.209118 -0.586683 -2.868036 -0.076238 -0.327698 0.391626
2.566667 -0.211655 -0.597621 -2.851729 -0.075206 -0.327845 0.414112
2.600000 -0.214167 -0.608576 -2.845088 -0.074068 -0.327870 0.427817
2.633333 -0.216646 -0.619546 -2.815314 -0.072830 -0.327776 0.430447
2.666667 -0.219078 -0.630496 -2.804672 -0.071496 -0.327559 0.417896
2.700000 -0.221460 -0.641422 -2.769100 -0.070068 -0.327218 0.386905
2.733333 -0.223793 -0.652349 -2.744934 -0.068546 -0.326749 0.337166
2.766667 -0.226073 -0.663272 -2.741061 -0.066927 -0.326147 0.274161
2.800000 -0.228293 -0.674186 -2.731313 -0.065208 -0.325404 0.200104
2.833333 -0.230457 -0.685061 -2.727026 -0.063387 -0.324519 0.119096
2.866667 -0.232565 -0.695892 -2.723186 -0.061460 -0.323493 0.034272
2.900000 -0.234614 -0.706675 -2.728871 -0.059429 -0.322324 -0.045756
2.933333 -0.236585 -0.717427 -2.735456 -0.057292 -0.321012 -0.117044
2.966667 -0.238474 -0.728142 -2.741580 -0.055056 -0.319556 -0.180436
3.000000 -0.240300 -0.738797 -2.748655 -0.052726 -0.317959 -0.233355
3.033333 -0.242038 -0.749404 -2.773123 -0.050306 -0.316218 -0.272714
3.066667 -0.243710 -0.759942 -2.780637 -0.047805 -0.314332 -0.299582
3.100000 -0.245285 -0.770421 -2.788257 -0.045227 -0.312295 -0.316873
3.133333 -0.246760 -0.780833 -2.800324 -0.042576 -0.310105 -0.327487
3.166667 -0.248131 -0.791171 -2.819558 -0.039853 -0.307760 -0.329278
3.200000 -0.249396 -0.801431 -2.822878 -0.037063 -0.305255 -0.324462
3.233333 -0.250588 -0.811602 -2.841998 -0.034208 -0.302587 -0.318250
3.266667 -0.251707 -0.821682 -2.846832 -0.031291 -0.299756 -0.309669
3.300000 -0.252752 -0.831664 -2.864091 -0.028318 -0.296763 -0.299080
3.333333 -0.253679 -0.841543 -2.870622 -0.025293 -0.293610 -0.285385
3.366667 -0.254486 -0.851312 -2.869201 -0.022213 -0.290294 -0.271999
3.400000 -0.255172 -0.860965 -2.886153 -0.019077 -0.286818 -0.256624
3.433333 -0.255733 -0.870495 -2.895563 -0.015890 -0.283181 -0.238251
3.466667 -0.256214 -0.879909 -2.907256 -0.012651 -0.279383 -0.216490
3.500000 -0.256613 -0.889203 -2.911500 -0.009365 -0.275422 -0.192260
3.533333 -0.256882 -0.898355 -2.918517 -0.006034 -0.271299 -0.166245
3.566667 -0.257020 -0.907358 -2.924865 -0.002670 -0.267018 -0.137524
3.600000 -0.257074 -0.916230 -2.929749 0.000716 -0.262584 -0.109614
3.633333 -0.256994 -0.924941 -2.941490 0.004116 -0.258006 -0.081082
3.666667 -0.256829 -0.933514 -2.935818 0.007521 -0.253291 -0.056273
3.700000 -0.256529 -0.941914 -2.934297 0.010917 -0.248453 -0.036085
3.733333 -0.256094 -0.950134 -2.931593 0.014287 -0.243506 -0.022713
3.766667 -0.255525 -0.958170 -2.929244 0.017622 -0.238463 -0.012705
3.800000 -0.254867 -0.966052 -2.926909 0.020911 -0.233335 -0.001962
3.833333 -0.254076 -0.973737 -2.929374 0.024147 -0.228130 0.008118
3.866667 -0.253196 -0.981263 -2.920551 0.027324 -0.222855 0.024398
3.900000 -0.252227 -0.988626 -2.930641 0.030458 -0.217500 0.049828
3.933333 -0.251171 -0.995823 -2.934725 0.033569 -0.212045 0.088859
3.966667 -0.249980 -1.002799 -2.918522 0.036686 -0.206467 0.135822
4.000000 -0.248700 -1.009602 -2.936886 0.039843 -0.200733 0.186728
4.033333 -0.247331 -1.016231 -2.948096 0.043070 -0.194815 0.239338
4.066667 -0.245872 -1.022681 -2.952254 0.046396 -0.188688 0.288435
4.100000 -0.244324 -1.028951 -2.916073 0.049842 -0.182334 0.328410
4.133333 -0.242685 -1.035036 -2.882598 0.053420 -0.175743 0.350688
4.166667 -0.240903 -1.040869 -2.857714 0.057135 -0.168909 0.354440
4.200000 -0.238976 -1.046448 -2.828625 0.060987 -0.161836 0.336695
4.233333 -0.236901 -1.051766 -2.830577 0.064975 -0.154525 0.296238
4.266667 -0.234677 -1.056820 -2.810795 0.069087 -0.146991 0.228891
4.300000 -0.232300 -1.061604 -2.791221 0.073304 -0.139254 0.133602
4.333333 -0.229769 -1.066115 -2.795980 0.077601 -0.131341 0.015578
4.366667 -0.227150 -1.070425 -2.807290 0.081951 -0.123282 -0.121474
4.400000 -0.224373 -1.074453 -2.809481 0.086322 -0.115113 -0.272073
4.433333 -0.221437 -1.078191 -2.811617 0.090674 -0.106879 -0.430325
4.466667 -0.218341 -1.081636 -2.826445 0.094979 -0.098614 -0.585775
4.500000 -0.215083 -1.084783 -2.838585 0.099207 -0.090350 -0.726184
4.533333 -0.211662 -1.087628 -2.849092 0.103332 -0.082121 -0.844941
4.566667 -0.208079 -1.090167 -2.893171 0.107319 -0.073968 -0.935699
4.600000 -0.204412 -1.092494 -2.939860 0.111150 -0.065909 -0.991508
4.633333 -0.200588 -1.094510 -3.017669 0.114815 -0.057956 -1.003759
4.666667 -0.196613 -1.096210 -3.080440 0.118297 -0.050128 -0.967993
4.700000 -0.192556 -1.097697 -3.124656 0.121592 -0.042433 -0.885681
4.733333 -0.188420 -1.098971 3.129300 0.124704 -0.034859 -0.758588
4.766667 -0.184205 -1.100031 3.113740 0.127651 -0.027381 -0.594299
4.800000 -0.179883 -1.100832 3.089448 0.130438 -0.019980 -0.403096
4.833333 -0.175461 -1.101370 3.067751 0.133075 -0.012622 -0.202142
4.866667 -0.170944 -1.101642 3.068845 0.135578 -0.005264 -0.007116
4.900000 -0.166354 -1.101699 3.072142 0.137953 0.002142 0.173024
4.933333 -0.161688 -1.101487 3.094378 0.140200 0.009624 0.328910
4.966667 -0.156951 -1.101059 3.135141 0.142312 0.017204 0.456765
5.000000 -0.152144 -1.100418 -3.109752 0.144288 0.024902 0.558057
5.033333 -0.147270 -1.099564 -3.093357 0.146126 0.032716 0.636877
5.066667 -0.142336 -1.098370 -3.062562 0.147826 0.040637 0.697663
5.100000 -0.137337 -1.096963 -3.041461 0.149387 0.048641 0.741065
5.133333 -0.132296 -1.095221 -3.024254 0.150821 0.056697 0.772662
5.166667 -0.127221 -1.093150 -3.001353 0.152139 0.064764 0.797854
5.200000 -0.122085 -1.090868 -2.976807 0.153356 0.072795 0.813839
5.233333 -0.116933 -1.088265 -2.950226 0.154476 0.080743 0.819361
5.266667 -0.111773 -1.085348 -2.931954 0.155506 0.088572 0.815003
5.300000 -0.106556 -1.082225 -2.910581 0.156457 0.096243 0.800879
5.333333 -0.101342 -1.078798 -2.840594 0.157332 0.103733 0.770633
5.366667 -0.096072 -1.075167 -2.804477 0.158128 0.111043 0.719795
5.400000 -0.090748 -1.071335 -2.774596 0.158840 0.118172 0.649573
5.433333 -0.085443 -1.067228 -2.759734 0.159468 0.125124 0.561819
5.466667 -0.080085 -1.062923 -2.743535 0.159998 0.131910 0.455566
5.500000 -0.074675 -1.058422 -2.731267 0.160418 0.138540 0.332394
5.533333 -0.069291 -1.053669 -2.718453 0.160705 0.145026 0.200888
5.566667 -0.063935 -1.048676 -2.712111 0.160860 0.151361 0.068077
5.600000 -0.058529 -1.043494 -2.712111 0.160890 0.157541 -0.061504
5.633333 -0.053152 -1.038090 -2.725142 0.160801 0.163564 -0.183181
5.666667 -0.047728 -1.032500 -2.729470 0.160615 0.169421 -0.291042
5.700000 -0.042335 -1.026710 -2.748873 0.160363 0.175099 -0.380983
5.733333 -0.036975 -1.020730 -2.759650 0.160088 0.180593 -0.452740
5.766667 -0.031647 -1.014570 -2.782772 0.159811 0.185898 -0.508916
5.800000 -0.026353 -1.008241 -2.813804 0.159557 0.191013 -0.548785
5.833333 -0.021092 -1.001750 -2.845138 0.159356 0.195945 -0.575554
5.866667 -0.015866 -0.995112 -2.876944 0.159228 0.200695 -0.590373
5.900000 -0.010594 -0.988306 -2.886632 0.159183 0.205267 -0.597010
5.933333 -0.005276 -0.981333 -2.901831 0.159215 0.209661 -0.596752
5.966667 0.000007 -0.974243 -2.914474 0.159332 0.213889 -0.587705
6.000000 0.005338 -0.966991 -2.924063 0.159528 0.217961 -0.571751
6.033333 0.010634 -0.959641 -2.947018 0.159790 0.221885 -0.545592
6.066667 0.015978 -0.952135 -2.969537 0.160101 0.225668 -0.508195
6.100000 0.021289 -0.944544 -3.000453 0.160462 0.229333 -0.454137
6.133333 0.026648 -0.936803 -3.012505 0.160884 0.232904 -0.383061
6.166667 0.032055 -0.928915 -3.043562 0.161357 0.236380 -0.297154
6.200000 0.037424 -0.920967 -3.052463 0.161882 0.239767 -0.198961
6.233333 0.042751 -0.912970 -3.070868 0.162467 0.243072 -0.093400
6.266667 0.048128 -0.904832 -3.080365 0.163129 0.246316 0.010783
6.300000 0.053556 -0.896556 -3.069850 0.163861 0.249489 0.103243
6.333333 0.059037 -0.888145 -3.048866 0.164658 0.252584 0.178677
6.366667 0.064570 -0.879600 -3.032068 0.165530 0.255605 0.233213
6.400000 0.070068 -0.871039 -2.991126 0.166475 0.258545 0.264297
6.433333 0.075620 -0.862350 -2.970854 0.167486 0.261385 0.270084
6.466667 0.081228 -0.853534 -2.955474 0.168545 0.264097 0.256164
6.500000 0.086819 -0.844713 -2.958659 0.169658 0.266687 0.227733
6.533333 0.092469 -0.835770 -2.955934 0.170828 0.269154 0.189405
6.566667 0.098176 -0.826707 -2.954117 0.172058 0.271503 0.144311
6.600000 0.103944 -0.817528 -2.964581 0.173349 0.273748 0.100559
6.633333 0.109725 -0.808347 -2.967079 0.174715 0.275921 0.061948
6.666667 0.115569 -0.799054 -2.960586 0.176166 0.278042 0.024884
6.700000 0.121440 -0.789760 -2.957658 0.177703 0.280117 -0.009440
6.733333 0.127346 -0.780466 -2.954692 0.179327 0.282174 -0.042857
6.766667 0.133318 -0.771066 -2.955868 0.181039 0.284232 -0.073996
6.800000 0.139357 -0.761560 -2.938790 0.182843 0.286306 -0.110295
6.833333 0.145465 -0.751951 -2.956856 0.184736 0.288385 -0.149652
6.866667 0.151636 -0.742341 -2.955169 0.186716 0.290475 -0.187335
6.900000 0.157878 -0.732632 -2.971394 0.188781 0.292574 -0.224904
6.933333 0.164192 -0.722825 -2.972133 0.190924 0.294654 -0.261731
6.966667 0.170581 -0.712922 -2.992170 0.193137 0.296680 -0.297806
7.000000 0.177044 -0.703013 -3.024435 0.195413 0.298641 -0.323084
7.033333 0.183584 -0.693011 -3.023940 0.197746 0.300543 -0.341280
7.066667 0.190203 -0.682918 -3.030568 0.200133 0.302376 -0.350098
7.100000 0.196900 -0.672736 -3.037485 0.202571 0.304139 -0.346503
7.133333 0.203681 -0.662540 -3.052253 0.205065 0.305837 -0.327340
7.166667 0.210548 -0.652328 -3.058732 0.207614 0.307495 -0.292785
7.200000 0.217503 -0.642098 -3.079452 0.210223 0.309117 -0.250820
7.233333 0.224542 -0.631785 -3.104391 0.212894 0.310701 -0.195980
7.266667 0.231667 -0.621391 -3.115755 0.215633 0.312254 -0.131867
7.300000 0.238887 -0.610971 -3.129099 0.218442 0.313794 -0.061801
7.333333 0.246195 -0.600472 -3.114245 0.221318 0.315334 0.008431
7.366667 0.253592 -0.589895 -3.117609 0.224265 0.316868 0.078013
7.400000 0.261095 -0.579288 -3.102761 0.227281 0.318398 0.144954
7.433333 0.268707 -0.568651 -3.088239 0.230364 0.319927 0.199617
7.466667 0.276431 -0.557983 -3.076790 0.233505 0.321465 0.239714
7.500000 0.284250 -0.547243 -3.066276 0.236697 0.323010 0.264769
7.533333 0.292191 -0.536470 -3.056698 0.239934 0.324564 0.283967
7.566667 0.300229 -0.525627 -3.035341 0.243205 0.326139 0.301216
7.600000 0.308397 -0.514749 -3.024592 0.246508 0.327745 0.325727
7.633333 0.316665 -0.503805 -3.026165 0.249848 0.329380 0.371869
7.666667 0.325033 -0.492793 -3.017703 0.253239 0.331034 0.444464
7.700000 0.333543 -0.481744 -3.003582 0.256701 0.332701 0.535199
7.733333 0.342156 -0.470631 -2.999121 0.260260 0.334371 0.618703
7.766667 0.350872 -0.459455 -3.003817 0.263938 0.336031 0.673384
7.800000 0.359692 -0.448216 -2.997055 0.267757 0.337670 0.674848
7.833333 0.368618 -0.436917 -2.990156 0.271731 0.339277 0.593778
7.866667 0.377649 -0.425558 -2.909372 0.275867 0.340842 0.406751
7.900000 0.386846 -0.414155 -2.823122 0.280164 0.342353 0.117752
7.933333 0.396210 -0.402706 -2.752932 0.284599 0.343802 -0.257650
7.966667 0.405745 -0.391213 -2.666793 0.289151 0.345182 -0.705684
8.000000 0.415453 -0.379675 -2.631960 0.293783 0.346490 -1.202717
8.033333 0.425339 -0.368091 -2.736605 0.298447 0.347728 -1.713067
8.066667 0.435405 -0.356461 -2.887772 0.303085 0.348911 -2.188300
8.100000 0.445581 -0.344779 -3.039292 0.307655 0.350052 -2.595867
8.133333 0.455944 -0.333041 3.087213 0.312131 0.351160 -2.904001
8.166667 0.466476 -0.321315 2.936945 0.316494 0.352251 -3.078011
8.200000 0.477178 -0.309595 2.794083 0.320739 0.353341 -3.102397
8.233333 0.487991 -0.297827 2.694231 0.324880 0.354444 -2.983411
8.266667 0.498916 -0.286013 2.568782 0.328952 0.355571 -2.746339
8.300000 0.509952 -0.274154 2.461653 0.332977 0.356736 -2.420442
8.333333 0.521099 -0.262250 2.393728 0.336976 0.357957 -2.038687
8.366667 0.532358 -0.250303 2.315246 0.340966 0.359238 -1.637631
8.400000 0.543728 -0.238314 2.271616 0.344969 0.360582 -1.242429
8.433333 0.555265 -0.226287 2.257246 0.348991 0.361990 -0.867409
8.466667 0.566968 -0.214214 2.246116 0.353020 0.363463 -0.521246
8.500000 0.578831 -0.202088 2.272426 0.357042 0.364990 -0.210408
8.533333 0.590804 -0.189925 2.273484 0.361037 0.366567 0.061656
8.566667 0.602929 -0.177698 2.308126 0.364985 0.368194 0.283925
8.600000 0.615199 -0.165401 2.317938 0.368855 0.369863 0.443743
8.633333 0.627609 -0.153028 2.320098 0.372624 0.371551 0.528065
8.666667 0.640127 -0.140623 2.343298 0.376284 0.373240 0.520453
8.700000 0.652753 -0.128187 2.372561 0.379840 0.374923 0.409887
8.733333 0.665496 -0.115657 2.417662 0.383295 0.376583 0.183502
8.766667 0.678346 -0.103026 2.474181 0.386667 0.378210 -0.155624
8.800000 0.691303 -0.090368 2.521953 0.389977 0.379810 -0.597326
8.833333 0.704365 -0.077686 2.552059 0.393252 0.381404 -1.130076
8.866667 0.717526 -0.064896 2.548426 0.396512 0.383005 -1.728214
8.900000 0.730792 -0.052085 2.489750 0.399773 0.384618 -2.363854
8.933333 0.744162 -0.039255 2.381202 0.403049 0.386250 -3.000860
8.966667 0.757634 -0.026406 2.234131 0.406347 0.387908 -3.606953
9.000000 0.771208 -0.013542 2.042607 0.409671 0.389590 -4.155622
9.033333 0.784902 -0.000572 1.837939 0.413022 0.391291 -4.619762
9.066667 0.798719 0.012501 1.628139 0.416404 0.393015 -4.981660
9.100000 0.812663 0.025676 1.427221 0.419812 0.394763 -5.233703
9.133333 0.826735 0.038949 1.271536 0.423245 0.396526 -5.386821
9.166667 0.840905 0.052228 1.070603 0.426698 0.398291 -5.454748
9.200000 0.855172 0.065509 0.886557 0.430165 0.400043 -5.458172
9.233333 0.869568 0.078882 0.690844 0.433637 0.401770 -5.413202
9.266667 0.884059 0.092252 0.510821 0.437105 0.403459 -5.340661
9.300000 0.898677 0.105706 0.329539 0.440558 0.405100 -5.253255
9.333333 0.913421 0.119240 0.167609 0.443988 0.406691 -5.148862
9.366667 0.928290 0.132847 -0.024674 0.447382 0.408216 -5.023798
9.400000 0.943283 0.146525 -0.167994 0.450725 0.409654 -4.870122
9.433333 0.958396 0.160267 -0.317710 0.453998 0.410986 -4.691483
9.466667 0.973598 0.173990 -0.492602 0.457181 0.412182 -4.484611
9.500000 0.988913 0.187771 -0.669329 0.460258 0.413224 -4.249689
9.533333 1.004337 0.201608 -0.838989 0.463210 0.414098 -3.988431
9.566667 1.019863 0.215498 -0.972193 0.466026 0.414806 -3.712052
9.600000 1.035486 0.229440 -1.088726 0.468701 0.415348 -3.425939
9.633333 1.051191 0.243346 -1.183035 0.471235 0.415730 -3.128550
9.666667 1.066977 0.257212 -1.286442 0.473624 0.415954 -2.819964
9.700000 1.082841 0.271034 -1.351903 0.475871 0.416031 -2.505023
9.733333 1.098772 0.284896 -1.400728 0.477975 0.415960 -2.187905
9.766667 1.114765 0.298795 -1.481620 0.479935 0.415746 -1.859621
9.800000 1.130811 0.312729 -1.556769 0.481748 0.415401 -1.515892
9.833333 1.146931 0.326603 -1.612951 0.483410 0.414927 -1.152457
9.866667 1.163089 0.340501 -1.666917 0.484918 0.414317 -0.770026
9.900000 1.179318 0.354333 -1.705269 0.486262 0.413560 -0.360609
9.933333 1.195617 0.368093 -1.711832 0.487427 0.412651 0.075743
9.966667 1.211930 0.381856 -1.712517 0.488402 0.411575 0.527385
10.000000 1.228251 0.395615 -1.680857 0.489178 0.410321 0.977163
10.033333 1.244638 0.409289 -1.650326 0.489756 0.408875 1.407877
10.066667 1.261021 0.422942 -1.576399 0.490141 0.407232 1.806088
10.100000 1.277389 0.436561 -1.486550 0.490361 0.405379 2.149641
10.133333 1.293820 0.450083 -1.384918 0.490446 0.403291 2.422877
10.166667 1.310222 0.463548 -1.271526 0.490439 0.400954 2.617206
10.200000 1.326591 0.476942 -1.163629 0.490377 0.398345 2.733690
10.233333 1.342920 0.490251 -1.034657 0.490295 0.395448 2.771046
10.266667 1.359207 0.503461 -0.912021 0.490238 0.392252 2.728292
10.300000 1.375450 0.516556 -0.805830 0.490238 0.388763 2.616108
10.333333 1.391752 0.529528 -0.736405 0.490330 0.384982 2.446427
10.366667 1.408111 0.542373 -0.666775 0.490527 0.380915 2.230274
10.400000 1.424429 0.555058 -0.565434 0.490852 0.376568 1.972711
10.433333 1.440804 0.567608 -0.502804 0.491312 0.371954 1.684772
10.466667 1.457144 0.579965 -0.453439 0.491898 0.367084 1.377512
10.500000 1.473540 0.592178 -0.400094 0.492591 0.361952 1.053643
10.533333 1.489911 0.604167 -0.380718 0.493381 0.356572 0.716125
10.566667 1.506339 0.616002 -0.358517 0.494261 0.350945 0.358601
10.600000 1.522823 0.627681 -0.354703 0.495217 0.345078 -0.012508
10.633333 1.539363 0.639198 -0.342106 0.496244 0.338978 -0.402309
10.666667 1.555903 0.650431 -0.363220 0.497333 0.332640 -0.813564
10.700000 1.572499 0.661495 -0.388261 0.498487 0.326070 -1.249457
10.733333 1.589107 0.672245 -0.440988 0.499696 0.319255 -1.707801
10.766667 1.605771 0.682820 -0.498583 0.500951 0.312194 -2.171761
10.800000 1.622492 0.693214 -0.581628 0.502248 0.304879 -2.636211
10.833333 1.639239 0.703265 -0.655690 0.503586 0.297315 -3.078859
10.866667 1.656042 0.713129 -0.729619 0.504965 0.289508 -3.485135
10.900000 1.672881 0.722639 -0.913000 0.506385 0.281480 -3.817136
10.933333 1.689776 0.731956 -1.051735 0.507846 0.273261 -4.072952
10.966667 1.706728 0.741078 -1.234111 0.509349 0.264881 -4.235442
11.000000 1.723725 0.749844 -1.434361 0.510895 0.256384 -4.295950
11.033333 1.740771 0.758254 -1.658829 0.512482 0.247794 -4.255126
11.066667 1.757868 0.766314 -1.781402 0.514110 0.239162 -4.111404
11.100000 1.775020 0.774026 -1.953437 0.515776 0.230532 -3.902124
11.133333 1.792229 0.781531 -2.106025 0.517479 0.221947 -3.618215
11.166667 1.809496 0.788826 -2.182304 0.519218 0.213449 -3.297860
11.200000 1.826824 0.795787 -2.307241 0.520989 0.205065 -2.955903
11.233333 1.844216 0.802417 -2.307241 0.522790 0.196828 -2.623124
11.266667 1.861666 0.808833 -2.469433 0.524617 0.188738 -2.306249
11.300000 1.879184 0.814927 -2.469433 0.526467 0.180781 -2.011185
11.333333 1.896760 0.820805 -2.562339 0.528337 0.172945 -1.745132
11.366667 1.914407 0.826371 -2.604073 0.530223 0.165226 -1.493962
11.400000 1.932111 0.831719 -2.630713 0.532122 0.157608 -1.257101
11.433333 1.949873 0.836847 -2.684675 0.534034 0.150073 -1.014544
11.466667 1.967693 0.841755 -2.705447 0.535956 0.142611 -0.780014
11.500000 1.985592 0.846366 -2.760742 0.537887 0.135214 -0.530113
11.533333 2.003548 0.850756 -2.779575 0.539830 0.127871 -0.285137
11.566667 2.021585 0.854859 -2.781268 0.541784 0.120559 -0.042750
11.600000 2.039679 0.858739 -2.781268 0.543749 0.113267 0.188437
11.633333 2.057831 0.862396 -2.799397 0.545725 0.105992 0.404407
11.666667 2.076040 0.865830 -2.691624 0.547712 0.098728 0.602384
11.700000 2.094334 0.868990 -2.704217 0.549714 0.091469 0.764309
11.733333 2.112684 0.871927 -2.619121 0.551730 0.084214 0.896802
11.766667 2.131116 0.874596 -2.619121 0.553756 0.076963 0.992719
11.800000 2.149604 0.877042 -2.576129 0.555790 0.069719 1.057540
11.833333 2.168148 0.879265 -2.504995 0.557828 0.062481 1.082126
11.866667 2.186773 0.881228 -2.497806 0.559863 0.055256 1.082989
11.900000 2.205479 0.882935 -2.434194 0.561886 0.048054 1.057461
11.933333 2.224239 0.884420 -2.420156 0.563890 0.040882 1.020718
11.966667 2.243076 0.885652 -2.376853 0.565874 0.033742 0.972772
12.000000 2.261990 0.886637 -2.337073 0.567834 0.026639 0.913314
12.033333 2.280976 0.887374 -2.295382 0.569766 0.019577 0.850836
12.066667 2.300014 0.887891 -2.279482 0.571668 0.012560 0.777749
12.100000 2.319104 0.888189 -2.263754 0.573542 0.005585 0.705675
12.133333 2.338244 0.888267 -2.238636 0.575385 -0.001344 0.623120
12.166667 2.357452 0.888107 -2.208280 0.577196 -0.008223 0.533432
12.200000 2.376722 0.887713 -2.202710 0.578970 -0.015050 0.442120
12.233333 2.396057 0.887086 -2.188955 0.580712 -0.021825 0.349930
12.266667 2.415454 0.886230 -2.157228 0.582419 -0.028546 0.258610
12.300000 2.434912 0.885146 -2.147629 0.584089 -0.035209 0.165441
12.333333 2.454430 0.883837 -2.161343 0.585721 -0.041808 0.078262
12.366667 2.473992 0.882316 -2.160738 0.587314 -0.048340 -0.000152
12.400000 2.493612 0.880575 -2.171139 0.588868 -0.054803 -0.069944
12.433333 2.513275 0.878625 -2.169965 0.590384 -0.061193 -0.128719
12.466667 2.532979 0.876468 -2.178192 0.591863 -0.067511 -0.172483
12.500000 2.552738 0.874098 -2.190788 0.593307 -0.073759 -0.201250
12.533333 2.572536 0.871524 -2.208227 0.594717 -0.079939 -0.217433
12.566667 2.592386 0.868743 -2.226924 0.596095 -0.086056 -0.219675
12.600000 2.612287 0.865758 -2.225192 0.597437 -0.092109 -0.211068
12.633333 2.632237 0.862573 -2.227486 0.598737 -0.098102 -0.194311
12.666667 2.652222 0.859189 -2.231504 0.599990 -0.104034 -0.174195
12.700000 2.672255 0.855608 -2.249787 0.601194 -0.109904 -0.148765
12.733333 2.692334 0.851833 -2.254449 0.602345 -0.115712 -0.123279
12.766667 2.712458 0.847866 -2.248350 0.603439 -0.121457 -0.105028
12.800000 2.732610 0.843708 -2.242320 0.604472 -0.127139 -0.092981
12.833333 2.752788 0.839361 -2.264331 0.605448 -0.132757 -0.085098
12.866667 2.772990 0.834827 -2.257981 0.606367 -0.138311 -0.081891
12.900000 2.793230 0.830110 -2.255230 0.607226 -0.143800 -0.086595
12.933333 2.813492 0.825211 -2.256105 0.608028 -0.149225 -0.093979
12.966667 2.833773 0.820130 -2.248481 0.608774 -0.154585 -0.098081
13.000000 2.854090 0.814873 -2.251491 0.609464 -0.159879 -0.099524
13.033333 2.874443 0.809443 -2.253246 0.610097 -0.165107 -0.102153
13.066667 2.894811 0.803838 -2.283132 0.610665 -0.170269 -0.101882
13.100000 2.915191 0.798062 -2.302727 0.611171 -0.175364 -0.096020
13.133333 2.935581 0.792115 -2.295285 0.611611 -0.180391 -0.086460
13.166667 2.955979 0.786002 -2.277894 0.611984 -0.185351 -0.077191
13.200000 2.976412 0.779727 -2.289950 0.612287 -0.190241 -0.067245
13.233333 2.996849 0.773289 -2.283535 0.612524 -0.195062 -0.058745
13.266667 3.017288 0.766691 -2.295885 0.612700 -0.199812 -0.055189
13.300000 3.037727 0.759936 -2.289542 0.612816 -0.204489 -0.061490
13.333333 3.058164 0.753025 -2.294595 0.612873 -0.209094 -0.077435
13.366667 3.078596 0.745961 -2.273601 0.612873 -0.213624 -0.101355
13.400000 3.099022 0.738746 -2.292292 0.612828 -0.218080 -0.134416
13.433333 3.119476 0.731386 -2.288791 0.612743 -0.222460 -0.172151
13.466667 3.139919 0.723881 -2.301778 0.612618 -0.226763 -0.213335
13.500000 3.160347 0.716234 -2.309130 0.612454 -0.230990 -0.254347
13.533333 3.180760 0.708446 -2.315076 0.612257 -0.235138 -0.291458
13.566667 3.201153 0.700522 -2.328030 0.612026 -0.239208 -0.322669
13.600000 3.221568 0.692463 -2.341558 0.611748 -0.243199 -0.346721
13.633333 3.241960 0.684272 -2.351651 0.611421 -0.247111 -0.363937
13.666667 3.262324 0.675952 -2.383539 0.611041 -0.250942 -0.372175
13.700000 3.282705 0.667505 -2.390704 0.610605 -0.254693 -0.369946
13.733333 3.303099 0.658934 -2.409132 0.610094 -0.258363 -0.359149
13.766667 3.323458 0.650243 -2.413520 0.609501 -0.261950 -0.338897
13.800000 3.343780 0.641433 -2.425351 0.608824 -0.265454 -0.309197
13.833333 3.364060 0.632509 -2.445211 0.608061 -0.268876 -0.269136
13.866667 3.384347 0.623470 -2.439662 0.607215 -0.272217 -0.222229
13.900000 3.404587 0.614322 -2.460208 0.606295 -0.275477 -0.169169
13.933333 3.424827 0.605065 -2.464193 0.605328 -0.278659 -0.112251
13.966667 3.445014 0.595704 -2.474584 0.604331 -0.281765 -0.054789
14.000000 3.465145 0.586244 -2.477278 0.603316 -0.284795 0.001430
14.033333 3.485216 0.576686 -2.475155 0.602285 -0.287749 0.053562
14.066667 3.505225 0.567034 -2.466553 0.601238 -0.290627 0.101355
14.100000 3.525223 0.557284 -2.447297 0.600158 -0.293426 0.140151
14.133333 3.545207 0.547441 -2.440414 0.599021 -0.296141 0.169762
14.166667 3.565170 0.537506 -2.442016 0.597796 -0.298769 0.189650
14.200000 3.585112 0.527481 -2.421419 0.596459 -0.301305 0.197475
14.233333 3.605027 0.517372 -2.419188 0.594983 -0.303746 0.194267
14.266667 3.624912 0.507179 -2.408161 0.593344 -0.306088 0.179665
14.300000 3.644762 0.496906 -2.403422 0.591528 -0.308329 0.159382
14.333333 3.664521 0.486564 -2.399685 0.589533 -0.310468 0.133670
14.366667 3.684184 0.476155 -2.394880 0.587368 -0.312506 0.104123
14.400000 3.703747 0.465684 -2.388381 0.585044 -0.314444 0.075735
14.433333 3.723206 0.455154 -2.388788 0.582584 -0.316285 0.047689
14.466667 3.742556 0.444566 -2.381135 0.580015 -0.318031 0.023488
14.500000 3.761850 0.433918 -2.382607 0.577362 -0.319686 0.000923
14.533333 3.781083 0.423212 -2.395916 0.574632 -0.321250 -0.017899
14.566667 3.800195 0.412459 -2.394223 0.571824 -0.322723 -0.034064
14.600000 3.819239 0.401655 -2.406794 0.568925 -0.324104 -0.047852
14.633333 3.838153 0.390811 -2.395596 0.565921 -0.325391 -0.058078
14.666667 3.856991 0.379922 -2.402302 0.562785 -0.326579 -0.066186
14.700000 3.875747 0.368992 -2.393253 0.559497 -0.327666 -0.074849
14.733333 3.894418 0.358023 -2.401064 0.556051 -0.328653 -0.084508
14.766667 3.912942 0.347028 -2.415021 0.552445 -0.329539 -0.093560
14.800000 3.931372 0.336000 -2.410433 0.548684 -0.330326 -0.104022
14.833333 3.949644 0.324953 -2.405835 0.544769 -0.331014 -0.115929
14.866667 3.967755 0.313888 -2.415522 0.540715 -0.331606 -0.128818
14.900000 3.985698 0.302810 -2.418483 0.536530 -0.332102 -0.137110
14.933333 4.003529 0.291713 -2.429145 0.532216 -0.332503 -0.139909
14.966667 4.021183 0.280609 -2.430274 0.527781 -0.332810 -0.137897
15.000000 4.038715 0.269491 -2.436852 0.523230 -0.333021 -0.128900
15.033333 4.056120 0.258363 -2.454198 0.518565 -0.333137 -0.110158
15.066667 4.073395 0.247228 -2.449607 0.513775 -0.333155 -0.083570
15.100000 4.090472 0.236100 -2.457893 0.508847 -0.333074 -0.051936
15.133333 4.107408 0.224972 -2.459360 0.503771 -0.332890 -0.018940
15.166667 4.124136 0.213858 -2.466302 0.498529 -0.332601 0.014910
15.200000 4.140713 0.202750 -2.467100 0.493113 -0.332206 0.047229
15.233333 4.157072 0.191664 -2.461987 0.487518 -0.331704 0.073172
15.266667 4.173269 0.180592 -2.440714 0.481744 -0.331097 0.092111
15.300000 4.189298 0.169538 -2.434034 0.475791 -0.330384 0.102731
15.333333 4.205093 0.158515 -2.428519 0.469656 -0.329566 0.106301
15.366667 4.220709 0.147517 -2.423527 0.463333 -0.328642 0.102792
15.400000 4.236081 0.136556 -2.424053 0.456811 -0.327613 0.094036
15.433333 4.251201 0.125636 -2.423414 0.450080 -0.326477 0.081646
15.466667 4.266124 0.114751 -2.417608 0.443130 -0.325233 0.068043
15.500000 4.280844 0.103904 -2.420690 0.435958 -0.323881 0.055413
15.533333 4.295355 0.093100 -2.419887 0.428562 -0.322421 0.044788
15.566667 4.309592 0.082349 -2.416682 0.420939 -0.320852 0.035214
15.600000 4.323551 0.071656 -2.422085 0.413096 -0.319177 0.025774
15.633333 4.337225 0.061022 -2.421394 0.405036 -0.317395 0.018121
15.666667 4.350610 0.050452 -2.418041 0.396772 -0.315507 0.013431
15.700000 4.363756 0.039943 -2.413500 0.388311 -0.313516 0.008916
15.733333 4.376600 0.029503 -2.400926 0.379675 -0.311422 0.002493
15.766667 4.389139 0.019136 -2.407081 0.370886 -0.309229 -0.003293
15.800000 4.401365 0.008846 -2.420458 0.361960 -0.306936 -0.008565
15.833333 4.413325 -0.001370 -2.418204 0.352912 -0.304546 -0.015334
15.866667 4.424963 -0.011504 -2.416644 0.343741 -0.302058 -0.026810
15.900000 4.436272 -0.021551 -2.429618 0.334453 -0.299474 -0.038254
15.933333 4.447295 -0.031513 -2.421434 0.325035 -0.296792 -0.047644
15.966667 4.457978 -0.041383 -2.412588 0.315470 -0.294015 -0.056617
16.000000 4.468361 -0.051160 -2.406815 0.305741 -0.291140 -0.066221
16.033333 4.478434 -0.060839 -2.419068 0.295834 -0.288170 -0.074970
16.066667 4.488191 -0.070416 -2.427819 0.285734 -0.285105 -0.079664
16.100000 4.497624 -0.079889 -2.435333 0.275426 -0.281941 -0.083286
16.133333 4.506690 -0.089254 -2.436107 0.264905 -0.278679 -0.083935
16.166667 4.515417 -0.098509 -2.434897 0.254165 -0.275315 -0.081753
16.200000 4.523766 -0.107650 -2.447827 0.243207 -0.271848 -0.072984
16.233333 4.531733 -0.116678 -2.442862 0.232034 -0.268276 -0.058512
16.266667 4.539312 -0.125587 -2.453796 0.220652 -0.264599 -0.040498
16.300000 4.546498 -0.134376 -2.451173 0.209074 -0.260816 -0.019932
16.333333 4.553305 -0.143035 -2.446318 0.197303 -0.256928 -0.000938
16.366667 4.559722 -0.151560 -2.451010 0.185344 -0.252935 0.018136
16.400000 4.565744 -0.159947 -2.452744 0.173201 -0.248838 0.032164
16.433333 4.571363 -0.168193 -2.443401 0.160872 -0.244642 0.040815
16.466667 4.576568 -0.176295 -2.438248 0.148355 -0.240348 0.043686
16.500000 4.581354 -0.184248 -2.449852 0.135643 -0.235961 0.042092
16.533333 4.585712 -0.192063 -2.432141 0.122733 -0.231487 0.038478
16.566667 4.589634 -0.199722 -2.421609 0.109623 -0.226929 0.029785
16.600000 4.593120 -0.207239 -2.429965 0.096307 -0.222287 0.019040
16.633333 4.596153 -0.214591 -2.423447 0.082783 -0.217561 0.005737
16.666667 4.598725 -0.221776 -2.437096 0.069054 -0.212752 -0.007311
16.700000 4.600825 -0.228790 -2.441371 0.055122 -0.207858 -0.021516
16.733333 4.602473 -0.235653 -2.442430 0.040984 -0.202877 -0.034562
16.766667 4.603664 -0.242364 -2.433466 0.026643 -0.197809 -0.042874
16.800000 4.604359 -0.248893 -2.435029 0.012107 -0.192659 -0.047798
16.833333 4.604589 -0.255266 -2.439907 -0.002620 -0.187428 -0.046561
16.866667 4.604306 -0.261450 -2.435804 -0.017546 -0.182112 -0.042805
16.900000 4.603500 -0.267441 -2.448312 -0.032671 -0.176709 -0.032850
16.933333 4.602162 -0.273235 -2.449657 -0.047985 -0.171226 -0.021760
16.966667 4.600347 -0.278867 -2.455515 -0.063490 -0.165662 -0.011038
17.000000 4.598050 -0.284335 -2.451443 -0.079194 -0.160011 -0.000155
17.033333 4.595194 -0.289595 -2.463076 -0.095098 -0.154274 0.009608
17.066667 4.591773 -0.294643 -2.445080 -0.111185 -0.148460 0.017481
17.100000 4.587862 -0.299525 -2.439707 -0.127445 -0.142574 0.019340
17.133333 4.583368 -0.304188 -2.444061 -0.143877 -0.136616 0.019795
17.166667 4.578381 -0.308681 -2.440046 -0.160458 -0.130596 0.017662
17.200000 4.572794 -0.312950 -2.437494 -0.177138 -0.124538 0.013398
17.233333 4.566598 -0.316991 -2.427280 -0.193890 -0.118456 0.004643
17.266667 4.559905 -0.320860 -2.437664 -0.210717 -0.112348 -0.002367
17.300000 4.552587 -0.324495 -2.445728 -0.227611 -0.106217 -0.004780
17.333333 4.544636 -0.327891 -2.447872 -0.244563 -0.100070 -0.002646
17.366667 4.536182 -0.331113 -2.444725 -0.261574 -0.093907 0.011364
17.400000 4.527227 -0.334161 -2.456791 -0.278674 -0.087713 0.046024
17.433333 4.517612 -0.336960 -2.448112 -0.295879 -0.081481 0.111792
17.466667 4.507495 -0.339584 -2.434271 -0.313183 -0.075216 0.209554
17.500000 4.496876 -0.342034 -2.445289 -0.330582 -0.068919 0.342836
17.533333 4.485754 -0.344311 -2.446894 -0.348082 -0.062588 0.510676
17.566667 4.473938 -0.346325 -2.444318 -0.365696 -0.056218 0.705925
17.600000 4.461417 -0.348073 -2.438471 -0.383410 -0.049817 0.911190
17.633333 4.448184 -0.349553 -2.428402 -0.401206 -0.043392 1.106799
17.666667 4.434452 -0.350860 -2.385713 -0.419043 -0.036962 1.273539
17.700000 4.420223 -0.351995 -2.322493 -0.436908 -0.030531 1.389022
17.733333 4.405499 -0.352959 -2.231358 -0.454796 -0.024101 1.430121
17.766667 4.390046 -0.353655 -2.127244 -0.472692 -0.017674 1.374872
17.800000 4.373864 -0.354084 -2.040250 -0.490597 -0.011245 1.214785
17.833333 4.357195 -0.354345 -1.975989 -0.508511 -0.004808 0.949598
17.866667 4.340039 -0.354438 -1.917678 -0.526458 0.001652 0.587879
17.900000 4.322160 -0.354268 -1.865695 -0.544397 0.008123 0.143604
17.933333 4.303801 -0.353933 -1.858010 -0.562271 0.014586 -0.354708
17.966667 4.284726 -0.353335 -1.885507 -0.580003 0.021011 -0.870741
18.000000 4.265180 -0.352576 -1.943292 -0.597560 0.027388 -1.373339
18.033333 4.244931 -0.351550 -2.016303 -0.614890 0.033696 -1.836288
18.066667 4.223984 -0.350258 -2.127687 -0.631939 0.039920 -2.235755
18.100000 4.202347 -0.348696 -2.248405 -0.648693 0.046055 -2.547794
18.133333 4.180258 -0.346981 -2.362823 -0.665140 0.052092 -2.761681
18.166667 4.157723 -0.345114 -2.472270 -0.681309 0.058041 -2.879383
18.200000 4.134747 -0.343097 -2.585234 -0.697190 0.063883 -2.905752
18.233333 4.111337 -0.340934 -2.713295 -0.712814 0.069619 -2.847798
18.266667 4.087279 -0.338502 -2.828323 -0.728197 0.075239 -2.719140
18.300000 4.062798 -0.335928 -2.919103 -0.743376 0.080742 -2.537253
18.333333 4.037689 -0.333091 -3.007672 -0.758366 0.086121 -2.318911
18.366667 4.012172 -0.330118 -3.075978 -0.773164 0.091361 -2.075136
18.400000 3.986048 -0.326888 3.139751 -0.787746 0.096443 -1.814388
18.433333 3.959530 -0.323528 3.082524 -0.802082 0.101340 -1.547095
18.466667 3.932408 -0.319992 3.053884 -0.816173 0.106043 -1.281698
18.500000 3.904907 -0.316331 3.019116 -0.830012 0.110535 -1.025136
18.533333 3.876825 -0.312506 2.987756 -0.843611 0.114815 -0.781694
18.566667 3.848381 -0.308563 2.958705 -0.856992 0.118884 -0.554145
18.600000 3.819583 -0.304505 2.939364 -0.870213 0.122761 -0.348846
18.633333 3.790439 -0.300335 2.945916 -0.883301 0.126465 -0.168348
18.666667 3.760771 -0.296030 2.950323 -0.896272 0.130005 -0.011449
18.700000 3.730776 -0.291620 2.962403 -0.909120 0.133388 0.120973
18.733333 3.700289 -0.287088 2.987419 -0.921844 0.136617 0.226842
18.766667 3.669325 -0.282445 2.998374 -0.934403 0.139694 0.302905
18.800000 3.637898 -0.277694 3.015867 -0.946727 0.142609 0.352412
18.833333 3.606025 -0.272846 3.029028 -0.958746 0.145354 0.378666
18.866667 3.573725 -0.267908 3.046413 -0.970388 0.147920 0.382840
18.900000 3.541015 -0.262888 3.070193 -0.981569 0.150304 0.369174
18.933333 3.507914 -0.257795 3.077884 -0.992201 0.152502 0.344528
18.966667 3.474567 -0.252625 3.091183 -1.002241 0.154511 0.315457
19.000000 3.440869 -0.247398 3.106606 -1.011659 0.156333 0.282946
19.033333 3.406839 -0.242121 3.106677 -1.020444 0.157977 0.250211
19.066667 3.372499 -0.236802 3.111283 -1.028583 0.159457 0.220425
19.100000 3.337958 -0.231423 3.108473 -1.036097 0.160784 0.196428
19.133333 3.303146 -0.226016 3.126572 -1.043011 0.161976 0.178327
19.166667 3.268156 -0.220554 3.124681 -1.049325 0.163059 0.165968
19.200000 3.232939 -0.215082 3.132038 -1.055047 0.164051 0.162169
19.233333 3.197568 -0.209561 3.134735 -1.060194 0.164968 0.164320
19.266667 3.162016 -0.204045 3.135214 -1.064791 0.165820 0.171180
19.300000 3.126307 -0.198540 -3.136410 -1.068846 0.166623 0.180078
19.333333 3.090486 -0.192984 -3.134958 -1.072365 0.167380 0.190235
19.366667 3.054578 -0.187385 -3.133158 -1.075357 0.168089 0.200738
19.400000 3.018578 -0.181755 -3.121557 -1.077831 0.168741 0.208576
19.433333 2.982496 -0.176098 -3.120424 -1.079786 0.169333 0.219318
19.466667 2.946347 -0.170418 -3.095058 -1.081208 0.169850 0.229911
19.500000 2.910207 -0.164724 -3.088530 -1.082088 0.170272 0.247739
19.533333 2.874023 -0.159013 -3.075886 -1.082437 0.170585 0.272573
19.566667 2.837807 -0.153288 -3.086008 -1.082276 0.170783 0.309077
19.600000 2.801572 -0.147553 -3.076389 -1.081608 0.170858 0.369252
19.633333 2.765329 -0.141810 -3.067925 -1.080416 0.170799 0.453455
19.666667 2.729221 -0.136089 -3.054065 -1.078721 0.170607 0.566407
19.700000 2.693267 -0.130394 -3.044646 -1.076543 0.170288 0.694735
19.733333 2.657341 -0.124702 -3.044646 -1.073892 0.169845 0.834757
19.766667 2.621455 -0.119015 -3.004032 -1.070767 0.169278 0.970925
19.800000 2.585795 -0.113372 -3.004032 -1.067198 0.168592 1.080521
19.833333 2.550199 -0.107740 -2.919037 -1.063251 0.167802 1.139222
19.866667 2.514677 -0.102122 -2.891567 -1.058937 0.166908 1.139201
19.900000 2.479242 -0.096523 -2.838928 -1.054231 0.165901 1.080939
19.933333 2.444108 -0.090988 -2.713771 -1.049108 0.164771 0.957823
19.966667 2.409291 -0.085525 -2.609258 -1.043562 0.163513 0.774991
20.000000 2.374594 -0.080088 -2.598593 -1.037575 0.162119 0.544948
20.033333 2.340026 -0.074680 -2.589639 -1.031115 0.160580 0.295270
20.066667 2.305598 -0.069303 -2.616581 -1.024178 0.158894 0.038148
20.100000 2.271320 -0.063961 -2.644624 -1.016791 0.157062 -0.214549
20.133333 2.237427 -0.058717 -2.674560 -1.009001 0.155096 -0.440816
20.166667 2.203705 -0.053512 -2.728855 -1.000821 0.153001 -0.622008
20.200000 2.170382 -0.048413 -2.776300 -0.992277 0.150785 -0.756172
20.233333 2.137467 -0.043426 -2.797294 -0.983414 0.148461 -0.849073
20.266667 2.104967 -0.038556 -2.820217 -0.974296 0.146049 -0.907173
20.300000 2.072676 -0.033734 -2.854112 -0.964987 0.143563 -0.934885
20.333333 2.040602 -0.028963 -2.868805 -0.955498 0.140994 -0.942834
20.366667 2.008755 -0.024244 -2.903553 -0.945840 0.138321 -0.942674
20.400000 1.977356 -0.019664 -2.930853 -0.935990 0.135507 -0.933054
20.433333 1.946415 -0.015229 -2.963256 -0.925908 0.132511 -0.911593
20.466667 1.915726 -0.010851 -2.998366 -0.915518 0.129277 -0.873895
20.500000 1.885295 -0.006533 -3.037074 -0.904744 0.125759 -0.818884
20.533333 1.855130 -0.002275 -3.081857 -0.893544 0.121934 -0.743322
20.566667 1.825240 0.001920 -3.120149 -0.881890 0.117805 -0.648645
20.600000 1.795845 0.005955 3.136774 -0.869788 0.113399 -0.540356
20.633333 1.766931 0.009758 3.114834 -0.857227 0.108743 -0.424426
20.666667 1.738505 0.013331 3.110363 -0.844243 0.103901 -0.306467
20.700000 1.710573 0.016675 3.105360 -0.830887 0.098959 -0.192137
20.733333 1.683142 0.019794 3.124948 -0.817231 0.094010 -0.092152
20.766667 1.656024 0.022846 3.130224 -0.803364 0.089143 -0.009337
20.800000 1.629416 0.025679 3.141557 -0.789342 0.084436 0.054989
20.833333 1.603318 0.028298 -3.139171 -0.775243 0.079967 0.100277
20.866667 1.577755 0.030778 -3.119469 -0.761097 0.075774 0.123893
20.900000 1.552729 0.033125 -3.131096 -0.746925 0.071871 0.129685
20.933333 1.528040 0.035406 -3.132288 -0.732716 0.068244 0.125241
20.966667 1.503890 0.037564 -3.133208 -0.718457 0.064876 0.113140
21.000000 1.480086 0.039657 -3.108796 -0.704153 0.061741 0.095661
21.033333 1.456820 0.041638 -3.111340 -0.689808 0.058803 0.073306
21.066667 1.434092 0.043515 -3.101583 -0.675451 0.056037 0.050878
21.100000 1.411718 0.045328 -3.106622 -0.661104 0.053420 0.027124
21.133333 1.389877 0.047048 -3.107863 -0.646831 0.050941 -0.000847
21.166667 1.368565 0.048678 -3.107635 -0.632673 0.048584 -0.030408
21.200000 1.347778 0.050226 -3.108226 -0.618684 0.046340 -0.060869
21.233333 1.327513 0.051697 -3.109906 -0.604912 0.044195 -0.089133
21.266667 1.307764 0.053096 -3.104208 -0.591395 0.042138 -0.114506
21.300000 1.288380 0.054440 -3.121462 -0.578165 0.040152 -0.135339
21.333333 1.269362 0.055730 -3.119929 -0.565215 0.038216 -0.148335
21.366667 1.250846 0.056966 3.141270 -0.552531 0.036304 -0.153006
21.400000 1.232696 0.058150 3.139177 -0.540084 0.034396 -0.145908
21.433333 1.214914 0.059285 3.136553 -0.527839 0.032481 -0.126621
21.466667 1.197501 0.060373 3.124222 -0.515744 0.030554 -0.095857
21.500000 1.180455 0.061415 3.133621 -0.503763 0.028616 -0.055149
21.533333 1.163856 0.062348 3.108130 -0.491877 0.026679 -0.003929
21.566667 1.147696 0.063175 3.106954 -0.480073 0.024771 0.053497
21.600000 1.131904 0.063961 3.117579 -0.468346 0.022919 0.112532
21.633333 1.116536 0.064645 3.114987 -0.456701 0.021149 0.169263
21.666667 1.101535 0.065293 3.127028 -0.445157 0.019489 0.221074
21.700000 1.086944 0.065843 -3.137629 -0.433732 0.017969 0.266270
21.733333 1.072717 0.066360 -3.125296 -0.422429 0.016605 0.299024
21.766667 1.058855 0.066848 -3.102448 -0.411245 0.015400 0.317474
21.800000 1.045354 0.067308 -3.101603 -0.400180 0.014356 0.322441
21.833333 1.032216 0.067743 -3.083710 -0.389221 0.013464 0.314178
21.866667 1.019436 0.068156 -3.070249 -0.378357 0.012717 0.293812
21.900000 1.007016 0.068548 -3.051274 -0.367567 0.012094 0.264053
21.933333 0.994952 0.068922 -3.042035 -0.356842 0.011581 0.227880
21.966667 0.983243 0.069281 -3.041155 -0.346179 0.011170 0.190243
22.000000 0.971888 0.069627 -3.039079 -0.335573 0.010849 0.151988
22.033333 0.960885 0.069962 -3.038570 -0.325029 0.010614 0.116218
22.066667 0.950242 0.070294 -3.028744 -0.314548 0.010460 0.084633
22.100000 0.939955 0.070624 -3.028486 -0.304142 0.010388 0.057490
22.133333 0.930013 0.070952 -3.034963 -0.293821 0.010398 0.035924
22.166667 0.920415 0.071280 -3.032561 -0.283593 0.010491 0.019429
22.200000 0.911155 0.071616 -3.038687 -0.273468 0.010667 0.007813
22.233333 0.902234 0.071956 -3.031738 -0.263455 0.010926 -0.001159
22.266667 0.893650 0.072304 -3.030697 -0.253560 0.011269 -0.008931
22.300000 0.885387 0.072667 -3.035750 -0.243783 0.011696 -0.014560
22.333333 0.877456 0.073044 -3.036801 -0.234119 0.012206 -0.019846
22.366667 0.869853 0.073436 -3.033482 -0.224568 0.012797 -0.027112
22.400000 0.862556 0.073852 -3.032483 -0.215131 0.013472 -0.037119
22.433333 0.855561 0.074296 -3.035168 -0.205803 0.014228 -0.047494
22.466667 0.848861 0.074771 -3.041925 -0.196579 0.015064 -0.057077
22.500000 0.842478 0.075271 -3.034848 -0.187459 0.015981 -0.069766
22.533333 0.836410 0.075800 -3.042232 -0.178446 0.016978 -0.083362
22.566667 0.830621 0.076368 -3.040976 -0.169537 0.018055 -0.096316
22.600000 0.825141 0.076971 -3.055333 -0.160728 0.019211 -0.105899
22.633333 0.819967 0.077609 -3.042952 -0.152026 0.020447 -0.115094
22.666667 0.815094 0.078287 -3.057937 -0.143444 0.021767 -0.122628
22.700000 0.810481 0.079016 -3.067216 -0.134997 0.023175 -0.124980
22.733333 0.806124 0.079799 -3.074751 -0.126689 0.024671 -0.122504
22.766667 0.802059 0.080629 -3.063149 -0.118536 0.026260 -0.115529
22.800000 0.798284 0.081509 -3.077952 -0.110551 0.027945 -0.107589
22.833333 0.794794 0.082441 -3.079834 -0.102744 0.029729 -0.097558
22.866667 0.791542 0.083440 -3.088444 -0.095113 0.031612 -0.087602
22.900000 0.788568 0.084495 -3.098439 -0.087654 0.033594 -0.078347
22.933333 0.785823 0.085623 -3.095880 -0.080370 0.035674 -0.071426
22.966667 0.783301 0.086826 -3.085014 -0.073253 0.037852 -0.064799
23.000000 0.780999 0.088106 -3.085415 -0.066286 0.040122 -0.058141
23.033333 0.778911 0.089467 -3.087806 -0.059446 0.042480 -0.049350
23.066667 0.777087 0.090897 -3.088108 -0.052714 0.044919 -0.039575
23.100000 0.775469 0.092416 -3.090351 -0.046066 0.047432 -0.030050
23.133333 0.774054 0.094024 -3.105196 -0.039480 0.050014 -0.019133
23.166667 0.772838 0.095726 -3.110886 -0.032936 0.052656 -0.008157
23.200000 0.771817 0.097525 -3.108277 -0.026428 0.055359 0.005302
23.233333 0.771043 0.099406 -3.103042 -0.019953 0.058118 0.017165
23.266667 0.770514 0.101371 -3.104398 -0.013513 0.060934 0.028541
23.300000 0.770170 0.103439 -3.085477 -0.007121 0.063811 0.038531
23.333333 0.770064 0.105597 -3.098984 -0.000792 0.066754 0.046090
23.366667 0.770137 0.107864 -3.082257 0.005460 0.069765 0.049193
23.400000 0.770442 0.110224 -3.088487 0.011628 0.072845 0.046968
23.433333 0.770975 0.112680 -3.081961 0.017699 0.075998 0.041431
23.466667 0.771734 0.115233 -3.092172 0.023665 0.079227 0.034275
23.500000 0.772659 0.117907 -3.083905 0.029522 0.082531 0.026494
23.533333 0.773749 0.120702 -3.078362 0.035278 0.085910 0.017884
23.566667 0.775055 0.123601 -3.080059 0.040924 0.089365 0.010706
23.600000 0.776520 0.126628 -3.091154 0.046455 0.092901 0.005256
23.633333 0.778139 0.129786 -3.080739 0.051872 0.096519 0.000256
23.666667 0.779966 0.133052 -3.093569 0.057179 0.100220 -0.004779
23.700000 0.781997 0.136430 -3.081318 0.062379 0.104004 -0.008546
23.733333 0.784229 0.139921 -3.079031 0.067464 0.107873 -0.010436
23.766667 0.786607 0.143552 -3.081273 0.072441 0.111826 -0.010784
23.800000 0.789129 0.147327 -3.084742 0.077316 0.115860 -0.012266
23.833333 0.791794 0.151247 -3.090322 0.082094 0.119969 -0.010924
23.866667 0.794649 0.155286 -3.090513 0.086783 0.124147 -0.008194
23.900000 0.797642 0.159476 -3.087964 0.091394 0.128385 -0.005067
23.933333 0.800771 0.163819 -3.081425 0.095943 0.132675 -0.002057
23.966667 0.804035 0.168317 -3.096956 0.100448 0.137002 0.000767
24.000000 0.807432 0.172973 -3.092358 0.104925 0.141355 0.006228
24.033333 0.811004 0.177755 -3.083682 0.109382 0.145726 0.010229
24.066667 0.814750 0.182664 -3.086228 0.113822 0.150114 0.013541
24.100000 0.818623 0.187738 -3.079508 0.118246 0.154518 0.015976
24.133333 0.822625 0.192978 -3.088341 0.122651 0.158943 0.019856
24.166667 0.826791 0.198348 -3.089570 0.127024 0.163401 0.024279
24.200000 0.831120 0.203849 -3.078855 0.131350 0.167906 0.026920
24.233333 0.835572 0.209523 -3.081510 0.135621 0.172466 0.029727
24.266667 0.840182 0.215330 -3.085079 0.139834 0.177088 0.031767
24.300000 0.844947 0.221270 -3.087753 0.143980 0.181781 0.034513
24.333333 0.849832 0.227388 -3.077636 0.148057 0.186545 0.034402
24.366667 0.854867 0.233641 -3.083489 0.152063 0.191383 0.032446
24.400000 0.860021 0.240078 -3.072390 0.156004 0.196290 0.029528
24.433333 0.865294 0.246700 -3.074755 0.159882 0.201266 0.026397
24.466667 0.870684 0.253510 -3.071111 0.163701 0.206298 0.023526
24.500000 0.876216 0.260456 -3.066413 0.167469 0.211367 0.017650
24.533333 0.881864 0.267592 -3.067197 0.171191 0.216455 0.011581
24.566667 0.887647 0.274865 -3.079889 0.174877 0.221542 0.005381
24.600000 0.893547 0.282332 -3.078266 0.178530 0.226605 0.000272
24.633333 0.899561 0.289996 -3.076219 0.182155 0.231619 -0.005730
24.666667 0.905703 0.297794 -3.073813 0.185751 0.236582 -0.012103
24.700000 0.911959 0.305791 -3.068524 0.189317 0.241489 -0.015427
24.733333 0.918330 0.313987 -3.075329 0.192853 0.246337 -0.016856
24.766667 0.924822 0.322318 -3.074267 0.196357 0.251124 -0.018360
24.800000 0.931433 0.330782 -3.068205 0.199829 0.255864 -0.019999
24.833333 0.938162 0.339379 -3.084151 0.203267 0.260579 -0.018273
24.866667 0.945006 0.348108 -3.079108 0.206671 0.265272 -0.009192
24.900000 0.951962 0.357045 -3.074673 0.210037 0.269950 0.019131
24.933333 0.959029 0.366111 -3.082728 0.213366 0.274635 0.087251
24.966667 0.966203 0.375308 -3.087565 0.216657 0.279349 0.220059
25.000000 0.973491 0.384715 -3.079276 0.219907 0.284086 0.440627
25.033333 0.980882 0.394249 -3.078938 0.223118 0.288844 0.766568
25.066667 0.988375 0.403909 -3.080245 0.226292 0.293634 1.210146
25.100000 0.995981 0.413783 -3.079692 0.229437 0.298475 1.763894
25.133333 1.003700 0.423871 -3.075800 0.232555 0.303364 2.399629
25.166667 1.011514 0.434081 -3.066971 0.235645 0.308287 3.085609
25.200000 1.019420 0.444412 -3.004665 0.238714 0.313261 3.783586
25.233333 1.027416 0.454862 -2.846861 0.241759 0.318285 4.450901
25.266667 1.035526 0.465527 -2.603088 0.244778 0.323339 5.040210
25.300000 1.043749 0.476403 -2.327375 0.247761 0.328391 5.514432
25.333333 1.052054 0.487394 -2.036880 0.250704 0.333423 5.852327
25.366667 1.060467 0.498589 -1.768757 0.253603 0.338420 6.031087
25.400000 1.068986 0.509984 -1.514252 0.256448 0.343340 6.040877
25.433333 1.077607 0.521573 -1.291618 0.259230 0.348143 5.889290
25.466667 1.086328 0.533350 -1.127752 0.261939 0.352794 5.605930
25.500000 1.095121 0.545229 -0.938234 0.264568 0.357274 5.221522
25.533333 1.104009 0.557282 -0.768320 0.267107 0.361549 4.768401
25.566667 1.112963 0.569433 -0.611612 0.269546 0.365594 4.282032
25.600000 1.122011 0.581743 -0.481622 0.271882 0.369401 3.791559
25.633333 1.131121 0.594144 -0.360083 0.274114 0.372979 3.317546
25.666667 1.140322 0.606688 -0.256343 0.276247 0.376341 2.863202
25.700000 1.149613 0.619367 -0.181100 0.278279 0.379490 2.436702
25.733333 1.158958 0.632127 -0.111602 0.280218 0.382447 2.040315
25.766667 1.168355 0.644967 -0.067825 0.282066 0.385224 1.677869
25.800000 1.177802 0.657883 -0.032083 0.283825 0.387834 1.352170
25.833333 1.187296 0.670872 -0.004302 0.285493 0.390282 1.063157
25.866667 1.196834 0.683930 0.020155 0.287074 0.392574 0.814084
25.900000 1.206444 0.697079 0.035994 0.288569 0.394722 0.599322
25.933333 1.216122 0.710311 0.038077 0.289974 0.396727 0.418035
25.966667 1.225837 0.723603 0.049773 0.291284 0.398590 0.262018
26.000000 1.235587 0.736951 0.049559 0.292491 0.400307 0.124483
26.033333 1.245386 0.750361 0.053606 0.293583 0.401867 0.000975
26.066667 1.255216 0.763819 0.046159 0.294540 0.403258 -0.112559
26.100000 1.265083 0.777324 0.047025 0.295346 0.404461 -0.217958
26.133333 1.274980 0.790868 0.045623 0.295989 0.405467 -0.323287
26.166667 1.284900 0.804451 0.031857 0.296463 0.406274 -0.429693
26.200000 1.294834 0.818056 0.015560 0.296767 0.406883 -0.543544
26.233333 1.304785 0.831692 -0.016787 0.296909 0.407306 -0.670425
26.266667 1.314735 0.845333 -0.033176 0.296901 0.407561 -0.812962
26.300000 1.324674 0.858969 -0.064891 0.296763 0.407671 -0.966327
26.333333 1.334595 0.872591 -0.092947 0.296510 0.407659 -1.121152
26.366667 1.344488 0.886192 -0.115610 0.296158 0.407548 -1.271548
26.400000 1.354349 0.899766 -0.149245 0.295722 0.407359 -1.400526
26.433333 1.364169 0.913310 -0.195606 0.295215 0.407110 -1.492001
26.466667 1.373992 0.926863 -0.253818 0.294650 0.406819 -1.534956
26.500000 1.383814 0.940422 -0.325246 0.294032 0.406489 -1.524931
26.533333 1.393634 0.953983 -0.436487 0.293363 0.406124 -1.457264
26.566667 1.403449 0.967543 -0.547745 0.292640 0.405717 -1.325618
26.600000 1.413200 0.981074 -0.607271 0.291858 0.405257 -1.137519
26.633333 1.422943 0.994599 -0.627296 0.291007 0.404726 -0.907158
26.666667 1.432622 1.008094 -0.638097 0.290078 0.404105 -0.646952
26.700000 1.442289 1.021576 -0.662006 0.289068 0.403379 -0.373023
26.733333 1.451942 1.035041 -0.653819 0.287981 0.402541 -0.108314
26.766667 1.461533 1.048472 -0.638278 0.286828 0.401584 0.125603
26.800000 1.471107 1.061879 -0.624360 0.285618 0.400505 0.316241
26.833333 1.480619 1.075244 -0.571665 0.284368 0.399307 0.460260
26.866667 1.490069 1.088559 -0.535639 0.283094 0.397993 0.555463
26.900000 1.499498 1.101843 -0.515686 0.281809 0.396559 0.606315
26.933333 1.508868 1.115065 -0.486936 0.280523 0.394996 0.623687
26.966667 1.518181 1.128220 -0.474541 0.279245 0.393289 0.619269
27.000000 1.527438 1.141301 -0.446937 0.277987 0.391430 0.601303
27.033333 1.536667 1.154340 -0.427770 0.276755 0.389403 0.576524
27.066667 1.545867 1.167331 -0.417606 0.275550 0.387199 0.553188
27.100000 1.555037 1.180274 -0.397271 0.274373 0.384815 0.530583
27.133333 1.564160 1.193113 -0.398465 0.273222 0.382251 0.509935
27.166667 1.573251 1.205897 -0.382916 0.272094 0.379516 0.485659
27.200000 1.582300 1.218564 -0.368563 0.270978 0.376618 0.456209
27.233333 1.591310 1.231108 -0.333006 0.269869 0.373568 0.419731
27.266667 1.600284 1.243521 -0.317125 0.268765 0.370377 0.366172
27.300000 1.609224 1.255800 -0.286066 0.267659 0.367069 0.293803
27.333333 1.618132 1.267942 -0.278057 0.266546 0.363669 0.186554
27.366667 1.627000 1.280016 -0.284779 0.265420 0.360190 0.026684
27.400000 1.635827 1.292018 -0.257294 0.264280 0.356647 -0.198480
27.433333 1.644622 1.303873 -0.257388 0.263118 0.353063 -0.502279
27.466667 1.653384 1.315576 -0.271558 0.261929 0.349456 -0.874140
27.500000 1.662103 1.327202 -0.290525 0.260705 0.345827 -1.312403
27.533333 1.670784 1.338669 -0.318773 0.259445 0.342183 -1.783316
27.566667 1.679427 1.349973 -0.320118 0.258144 0.338554 -2.239045
27.600000 1.688022 1.361196 -0.368536 0.256800 0.334961 -2.655508
27.633333 1.696570 1.372335 -0.414704 0.255411 0.331406 -3.009271
27.666667 1.705070 1.383303 -0.612621 0.253978 0.327891 -3.303617
27.700000 1.713521 1.394101 -0.919910 0.252502 0.324432 -3.510386
27.733333 1.721921 1.404812 -1.110129 0.250985 0.321024 -3.641065
27.766667 1.730269 1.415434 -1.318226 0.249429 0.317643 -3.708769
27.800000 1.738564 1.425966 -1.351434 0.247839 0.314276 -3.714121
27.833333 1.746806 1.436407 -1.484507 0.246217 0.310921 -3.649047
27.866667 1.754994 1.446756 -1.506604 0.244567 0.307571 -3.510938
27.900000 1.763126 1.457011 -1.500573 0.242893 0.304199 -3.348799
27.933333 1.771200 1.467108 -1.652806 0.241198 0.300801 -3.170985
27.966667 1.779213 1.477049 -1.796860 0.239484 0.297383 -2.997619
28.000000 1.787168 1.486894 -2.007967 0.237753 0.293945 -2.818623
28.033333 1.795065 1.496642 -2.128318 0.236006 0.290490 -2.650313
28.066667 1.802905 1.506246 -2.238131 0.234244 0.287032 -2.474563
28.100000 1.810686 1.515751 -2.288315 0.232468 0.283595 -2.242802
28.133333 1.818407 1.525158 -2.318917 0.230678 0.280188 -1.938750
28.166667 1.826072 1.534427 -2.342855 0.228875 0.276814 -1.546227
28.200000 1.833675 1.543597 -2.341011 0.227057 0.273475 -1.103500
28.233333 1.841221 1.552633 -2.435040 0.225224 0.270174 -0.613697
28.266667 1.848703 1.561568 -2.532872 0.223377 0.266904 -0.101928
28.300000 1.856121 1.570402 -2.609967 0.221514 0.263661 0.408195
28.333333 1.863475 1.579135 -2.591100 0.219634 0.260440 0.894999
28.366667 1.870764 1.587766 -2.591100 0.217739 0.257239 1.341570
28.400000 1.877987 1.596294 -2.422309 0.215831 0.254051 1.758290
28.433333 1.885160 1.604703 -2.276715 0.213911 0.250866 2.146669
28.466667 1.892266 1.613008 -2.083550 0.211984 0.247675 2.482809
28.500000 1.899305 1.621211 -1.937338 0.210053 0.244464 2.751300
28.533333 1.906276 1.629312 -1.937338 0.208122 0.241222 2.968353
28.566667 1.913178 1.637309 -1.937338 0.206194 0.237938 3.150220
28.600000 1.920012 1.645203 -1.803234 0.204267 0.234607 3.303750
28.633333 1.926777 1.652994 -1.672052 0.202344 0.231221 3.411542
28.666667 1.933490 1.660656 -1.520131 0.200424 0.227780 3.531466
28.700000 1.940133 1.668214 -1.449755 0.198503 0.224291 3.669038
28.733333 1.946724 1.675641 -1.390041 0.196576 0.220766 3.824043
28.766667 1.953244 1.682965 -1.158617 0.194637 0.217216 3.969128
28.800000 1.959705 1.690154 -1.066965 0.192680 0.213658 4.109916
28.833333 1.966106 1.697207 -0.884904 0.190696 0.210113 4.273465
28.866667 1.972444 1.704121 -0.648015 0.188677 0.206597 4.393333
28.900000 1.978710 1.710933 -0.482409 0.186617 0.203126 4.463230
28.933333 1.984910 1.717610 -0.482409 0.184508 0.199709 4.446542
28.966667 1.991037 1.724185 -0.482409 0.182345 0.196360 4.361122
29.000000 1.997090 1.730659 -0.071022 0.180124 0.193085 4.176789
29.033333 2.003068 1.737033 -0.071022 0.177841 0.189886 3.886528
29.066667 2.008972 1.743308 0.326831 0.175497 0.186761 3.494961
29.100000 2.014796 1.749464 0.490858 0.173097 0.183707 3.019549
29.133333 2.020544 1.755522 0.490858 0.170648 0.180722 2.480350
29.166667 2.026217 1.761481 0.649414 0.168157 0.177800 1.858328
29.200000 2.031796 1.767341 0.709437 0.165633 0.174939 1.200129
29.233333 2.037277 1.773106 0.622985 0.163087 0.172139 0.510999
29.266667 2.042658 1.778785 0.622985 0.160528 0.169405 -0.130847
29.300000 2.047962 1.784369 0.536835 0.157963 0.166737 -0.733965
29.333333 2.053167 1.789882 0.536835 0.155400 0.164137 -1.282114
29.366667 2.058294 1.795300 0.536835 0.152848 0.161602 -1.739866
29.400000 2.063345 1.800624 0.376950 0.150311 0.159133 -2.113939
29.433333 2.068319 1.805856 0.316781 0.147790 0.156722 -2.413728
29.466667 2.073201 1.811029 0.219323 0.145287 0.154360 -2.681353
29.500000 2.078006 1.816111 0.044560 0.142802 0.152041 -2.871092
29.533333 2.082721 1.821137 -0.066801 0.140333 0.149756 -2.987076
29.566667 2.087348 1.826107 -0.066801 0.137877 0.147497 -3.028885
29.600000 2.091899 1.830989 -0.066801 0.135433 0.145256 -3.007632
29.633333 2.096373 1.835781 -0.451996 0.132999 0.143031 -2.893144
29.666667 2.100760 1.840520 -0.451996 0.130575 0.140820 -2.692540
29.700000 2.105070 1.845171 -0.607346 0.128156 0.138624 -2.446559
29.733333 2.109295 1.849772 -0.779240 0.125739 0.136450 -2.146205
29.766667 2.113445 1.854286 -0.779240 0.123321 0.134304 -1.806572
29.800000 2.117518 1.858715 -0.824400 0.120897 0.132190 -1.422014
29.833333 2.121516 1.863059 -0.824400 0.118464 0.130108 -1.053512
29.866667 2.125439 1.867318 -0.887866 0.116020 0.128058 -0.694799
29.900000 2.129273 1.871533 -0.860201 0.113568 0.126035 -0.356460
29.933333 2.133019 1.875701 -0.846209 0.111108 0.124033 -0.066158
29.966667 2.136676 1.879822 -0.835419 0.108646 0.122040 0.176458
30.000000 2.140258 1.883862 -0.816269 0.106189 0.120044 0.356905
30.033333 2.143750 1.887847 -0.811917 0.103742 0.118033 0.511857
30.066667 2.147168 1.891752 -0.780052 0.101313 0.115992 0.633407
30.100000 2.150496 1.895598 -0.750519 0.098906 0.113914 0.729464
30.133333 2.153733 1.899381 -0.687912 0.096526 0.111792 0.807184
