t x y theta dxdt dydt dthetadt
0.000000 0.000000 0.000000 -1.752904 -0.096778 0.116200 0.020001
0.033333 -0.003272 0.003920 -1.739718 -0.098898 0.118104 0.021406
0.066667 -0.006595 0.007883 -1.747121 -0.101034 0.120008 0.019620
0.100000 -0.010002 0.011922 -1.744768 -0.103183 0.121913 0.016753
0.133333 -0.013460 0.016001 -1.736965 -0.105343 0.123813 0.011604
0.166667 -0.017003 0.020158 -1.742486 -0.107501 0.125698 0.008909
0.200000 -0.020630 0.024393 -1.736816 -0.109645 0.127551 0.003375
0.233333 -0.024307 0.028664 -1.735243 -0.111768 0.129366 -0.001863
0.266667 -0.028071 0.033013 -1.742171 -0.113868 0.131142 -0.005186
0.300000 -0.031922 0.037439 -1.749863 -0.115941 0.132873 -0.008241
0.333333 -0.035861 0.041944 -1.738370 -0.117979 0.134551 -0.008642
0.366667 -0.039846 0.046479 -1.745480 -0.119988 0.136183 -0.016669
0.400000 -0.043875 0.051045 -1.750380 -0.121980 0.137780 -0.047177
0.433333 -0.047993 0.055688 -1.733238 -0.123962 0.139353 -0.127260
0.466667 -0.052154 0.060358 -1.752106 -0.125943 0.140908 -0.279922
0.500000 -0.056356 0.065053 -1.739937 -0.127932 0.142460 -0.527449
0.533333 -0.060648 0.069825 -1.749700 -0.129942 0.144023 -0.884807
0.566667 -0.064979 0.074618 -1.745293 -0.131975 0.145602 -1.349247
0.600000 -0.069401 0.079488 -1.740970 -0.134016 0.147183 -1.892793
0.633333 -0.073914 0.084434 -1.739288 -0.136053 0.148746 -2.472571
0.666667 -0.078461 0.089397 -1.741146 -0.138073 0.150270 -3.050380
0.700000 -0.083101 0.094435 -1.823421 -0.140047 0.151719 -3.580169
0.733333 -0.087833 0.099549 -2.060449 -0.141949 0.153053 -4.017582
0.766667 -0.092656 0.104741 -2.342482 -0.143756 0.154232 -4.327275
0.800000 -0.097507 0.109943 -2.617397 -0.145463 0.155228 -4.488905
0.833333 -0.102448 0.115229 -2.868688 -0.147062 0.156015 -4.495971
0.866667 -0.107414 0.120519 -3.058084 -0.148546 0.156567 -4.345452
0.900000 -0.112402 0.125811 3.094477 -0.149929 0.156869 -4.052453
0.933333 -0.117411 0.131102 2.985692 -0.151227 0.156911 -3.653781
0.966667 -0.122510 0.136366 2.900666 -0.152453 0.156705 -3.187647
1.000000 -0.127626 0.141625 2.833894 -0.153608 0.156264 -2.693292
1.033333 -0.132756 0.146877 2.767921 -0.154697 0.155607 -2.197396
1.066667 -0.137899 0.152119 2.717267 -0.155720 0.154762 -1.712555
1.100000 -0.143106 0.157314 2.664445 -0.156664 0.153764 -1.232786
1.133333 -0.148368 0.162457 2.639567 -0.157507 0.152646 -0.739469
1.166667 -0.153677 0.167543 2.592051 -0.158233 0.151432 -0.213396
1.200000 -0.159023 0.172565 2.565121 -0.158825 0.150153 0.359048
1.233333 -0.164392 0.177514 2.549292 -0.159263 0.148845 0.974498
1.266667 -0.169761 0.182440 2.551226 -0.159531 0.147541 1.612217
1.300000 -0.175125 0.187340 2.601100 -0.159622 0.146265 2.235219
1.333333 -0.180484 0.192212 2.676618 -0.159538 0.145035 2.808387
1.366667 -0.185828 0.196988 2.784762 -0.159282 0.143873 3.292979
1.400000 -0.191161 0.201732 2.972785 -0.158868 0.142789 3.656854
1.433333 -0.196481 0.206441 -3.078115 -0.158314 0.141780 3.880632
1.466667 -0.201785 0.211114 -2.844525 -0.157639 0.140844 3.955058
1.500000 -0.207051 0.215780 -2.620920 -0.156859 0.139978 3.880693
1.533333 -0.212278 0.220434 -2.449951 -0.155986 0.139179 3.662514
1.566667 -0.217467 0.225074 -2.361688 -0.155033 0.138431 3.317646
1.600000 -0.222629 0.229669 -2.293713 -0.154008 0.137713 2.866251
1.633333 -0.227764 0.234217 -2.232260 -0.152916 0.137001 2.330673
1.666667 -0.232857 0.238756 -2.171926 -0.151765 0.136269 1.731090
1.700000 -0.237909 0.243289 -2.121327 -0.150556 0.135500 1.091979
1.733333 -0.242917 0.247821 -2.065512 -0.149289 0.134669 0.423444
1.766667 -0.247880 0.252356 -2.031700 -0.147961 0.133760 -0.278660
1.800000 -0.252803 0.256832 -2.015784 -0.146563 0.132765 -1.020091
1.833333 -0.257683 0.261247 -2.047385 -0.145085 0.131683 -1.801678
1.866667 -0.262509 0.265678 -2.105530 -0.143514 0.130511 -2.613185
1.900000 -0.267287 0.270043 -2.197976 -0.141843 0.129234 -3.452114
1.933333 -0.272015 0.274339 -2.350367 -0.140066 0.127851 -4.293319
1.966667 -0.276690 0.278564 -2.521846 -0.138180 0.126365 -5.097981
2.000000 -0.281310 0.282716 -2.720734 -0.136188 0.124773 -5.820292
2.033333 -0.285844 0.286906 -2.898427 -0.134101 0.123064 -6.431117
2.066667 -0.290318 0.291017 3.118783 -0.131930 0.121239 -6.907140
2.100000 -0.294699 0.295063 2.798991 -0.129687 0.119302 -7.213072
2.133333 -0.298983 0.299048 2.437278 -0.127388 0.117256 -7.323029
2.166667 -0.303168 0.302973 2.128342 -0.125051 0.115094 -7.224634
2.200000 -0.307285 0.306810 1.892248 -0.122694 0.112813 -6.920690
2.233333 -0.311330 0.310556 1.628419 -0.120329 0.110426 -6.403987
2.266667 -0.315302 0.314208 1.363312 -0.117967 0.107933 -5.682086
2.300000 -0.319199 0.317764 1.131145 -0.115618 0.105331 -4.785364
2.333333 -0.323019 0.321221 0.947081 -0.113282 0.102618 -3.759350
2.366667 -0.326752 0.324608 0.797245 -0.110950 0.099797 -2.644399
