t x y theta dxdt dydt dthetadt
0.000000 0.000000 0.000000 -2.195186 0.002078 -0.012822 -0.001735
0.033333 0.000217 -0.000417 -2.204148 0.007108 -0.012936 -0.002729
0.066667 0.000563 -0.000844 -2.197282 0.012256 -0.013047 -0.002607
0.100000 0.001046 -0.001279 -2.197592 0.017585 -0.013147 -0.003453
0.133333 0.001674 -0.001721 -2.205078 0.023128 -0.013230 -0.003749
0.166667 0.002453 -0.002172 -2.195105 0.028920 -0.013293 -0.002513
0.200000 0.003393 -0.002630 -2.202902 0.034985 -0.013331 -0.001309
0.233333 0.004500 -0.003095 -2.196054 0.041348 -0.013342 0.000444
0.266667 0.005899 -0.003550 -2.191600 0.048023 -0.013323 0.001820
0.300000 0.007483 -0.004009 -2.204517 0.055007 -0.013276 0.003696
0.333333 0.009373 -0.004456 -2.199246 0.062293 -0.013201 0.003494
0.366667 0.011579 -0.004889 -2.204004 0.069868 -0.013100 0.003437
0.400000 0.013996 -0.005326 -2.197764 0.077719 -0.012975 0.002574
0.433333 0.016743 -0.005748 -2.198744 0.085820 -0.012829 0.003606
0.466667 0.019721 -0.006172 -2.188833 0.094157 -0.012665 0.004384
0.500000 0.022939 -0.006597 -2.199641 0.102716 -0.012484 0.005246
0.533333 0.026407 -0.007022 -2.199338 0.111506 -0.012284 0.006889
0.566667 0.030135 -0.007447 -2.201602 0.120557 -0.012059 0.007518
0.600000 0.034234 -0.007852 -2.193049 0.129888 -0.011806 0.008191
0.633333 0.038713 -0.008237 -2.202373 0.139532 -0.011519 0.006834
0.666667 0.043484 -0.008618 -2.197079 0.149508 -0.011193 0.007049
0.700000 0.048558 -0.008995 -2.199400 0.159836 -0.010826 0.005764
0.733333 0.053946 -0.009366 -2.196261 0.170513 -0.010416 0.004868
0.766667 0.059660 -0.009732 -2.187244 0.181528 -0.009967 0.002672
0.800000 0.065795 -0.010071 -2.194283 0.192882 -0.009478 0.000391
0.833333 0.072358 -0.010383 -2.193194 0.204578 -0.008945 -0.002123
0.866667 0.079359 -0.010667 -2.201889 0.216615 -0.008369 -0.005977
0.900000 0.086734 -0.010939 -2.200013 0.228987 -0.007751 -0.008194
0.933333 0.094494 -0.011198 -2.193095 0.241695 -0.007088 -0.010747
0.966667 0.102653 -0.011443 -2.198173 0.254742 -0.006379 -0.010328
1.000000 0.111283 -0.011655 -2.187665 0.268124 -0.005621 -0.010320
1.033333 0.120390 -0.011833 -2.206656 0.281833 -0.004819 -0.008283
1.066667 0.129935 -0.011993 -2.198855 0.295875 -0.003971 -0.007328
1.100000 0.139932 -0.012133 -2.204272 0.310259 -0.003077 -0.006437
1.133333 0.150430 -0.012235 -2.196914 0.324986 -0.002138 -0.004610
1.166667 0.161438 -0.012299 -2.199074 0.340054 -0.001159 -0.004159
1.200000 0.172964 -0.012323 -2.193694 0.355462 -0.000144 -0.002253
1.233333 0.184995 -0.012320 -2.201327 0.371210 0.000907 -0.002148
1.266667 0.197559 -0.012276 -2.199771 0.387297 0.001993 0.000048
1.300000 0.210663 -0.012187 -2.198157 0.403719 0.003111 0.001225
1.333333 0.224317 -0.012068 -2.197799 0.420478 0.004261 0.001609
1.366667 0.238535 -0.011915 -2.198273 0.437580 0.005445 0.001802
1.400000 0.253333 -0.011727 -2.204870 0.455031 0.006669 0.002013
1.433333 0.268725 -0.011501 -2.200410 0.472832 0.007933 0.002641
1.466667 0.284692 -0.011227 -2.196428 0.490989 0.009242 0.001576
1.500000 0.301284 -0.010911 -2.198536 0.509507 0.010601 0.001705
1.533333 0.318464 -0.010544 -2.193872 0.528407 0.012013 0.002051
1.566667 0.336300 -0.010131 -2.200289 0.547692 0.013482 0.003025
1.600000 0.354809 -0.009670 -2.194905 0.567376 0.015007 0.002093
1.633333 0.374007 -0.009160 -2.201346 0.587458 0.016590 0.001563
1.666667 0.393814 -0.008593 -2.199663 0.607917 0.018230 0.001990
1.700000 0.414342 -0.007971 -2.199520 0.628713 0.019925 0.001938
1.733333 0.435489 -0.007291 -2.194858 0.649798 0.021675 0.001251
1.766667 0.457389 -0.006552 -2.201730 0.671131 0.023480 -0.001338
1.800000 0.480060 -0.005751 -2.200987 0.692662 0.025337 -0.007414
1.833333 0.503518 -0.004887 -2.194441 0.714377 0.027248 -0.023017
1.866667 0.527780 -0.003957 -2.195491 0.736257 0.029212 -0.050662
1.900000 0.552680 -0.002962 -2.195784 0.758312 0.031230 -0.093472
1.933333 0.578418 -0.001895 -2.197582 0.780506 0.033299 -0.155876
1.966667 0.604800 -0.000761 -2.200188 0.802818 0.035417 -0.241449
2.000000 0.631828 0.000441 -2.202161 0.825246 0.037583 -0.348778
2.033333 0.659505 0.001712 -2.193902 0.847785 0.039791 -0.473201
2.066667 0.688089 0.003066 -2.203844 0.870471 0.042040 -0.611296
2.100000 0.717324 0.004491 -2.214299 0.893330 0.044324 -0.761064
2.133333 0.747501 0.006003 -2.258198 0.916450 0.046643 -0.910379
2.166667 0.778638 0.007602 -2.305125 0.939884 0.048994 -1.049921
2.200000 0.810428 0.009276 -2.340434 0.963634 0.051373 -1.174919
2.233333 0.842871 0.011024 -2.370625 0.987681 0.053777 -1.283493
2.266667 0.875966 0.012848 -2.449061 1.012006 0.056206 -1.370338
2.300000 0.909713 0.014749 -2.507852 1.036622 0.058657 -1.429182
2.333333 0.944487 0.016736 -2.574995 1.061509 0.061133 -1.465540
2.366667 0.980292 0.018811 -2.621547 1.086697 0.063635 -1.483815
2.400000 1.017132 0.020973 -2.655294 1.112250 0.066168 -1.484750
2.433333 1.054616 0.023214 -2.709683 1.138226 0.068736 -1.465607
2.466667 1.093138 0.025545 -2.746735 1.164628 0.071340 -1.435543
2.500000 1.132295 0.027958 -2.790597 1.191391 0.073980 -1.400165
2.533333 1.172085 0.030451 -2.854372 1.218453 0.076655 -1.361197
2.566667 1.212902 0.033037 -2.918137 1.245718 0.079368 -1.314358
2.600000 1.254739 0.035717 -2.946267 1.273079 0.082124 -1.261578
2.633333 1.297594 0.038492 -2.987772 1.300389 0.084932 -1.205115
2.666667 1.341456 0.041363 -3.030754 1.327502 0.087803 -1.141102
2.700000 1.386315 0.044331 -3.067840 1.354297 0.090751 -1.067733
2.733333 1.432159 0.047396 -3.102239 1.380644 0.093795 -0.984235
2.766667 1.478975 0.050556 -3.136143 1.406397 0.096944 -0.899883
2.800000 1.526748 0.053814 3.124550 1.431401 0.100198 -0.811816
2.833333 1.575089 0.057157 3.091903 1.455572 0.103551 -0.723702
2.866667 1.623988 0.060585 3.048903 1.478891 0.107001 -0.636008
2.900000 1.673725 0.064168 3.052395 1.501335 0.110531 -0.554646
2.933333 1.724289 0.067906 3.028248 1.522901 0.114113 -0.481947
2.966667 1.775662 0.071799 3.034213 1.543614 0.117723 -0.415468
3.000000 1.827548 0.075777 3.016430 1.563557 0.121341 -0.360180
3.033333 1.880203 0.079909 3.006164 1.582740 0.124935 -0.316347
3.066667 1.933608 0.084194 2.998426 1.601118 0.128467 -0.285589
3.100000 1.987488 0.088563 2.978290 1.618698 0.131921 -0.258342
3.133333 2.041829 0.093016 2.998732 1.635506 0.135290 -0.235061
3.166667 2.096864 0.097622 2.996519 1.651561 0.138573 -0.211458
3.200000 2.152333 0.102311 2.983763 1.666862 0.141772 -0.187337
3.233333 2.208221 0.107082 2.958740 1.681490 0.144915 -0.159289
3.266667 2.264735 0.112003 2.939148 1.695559 0.148038 -0.124677
3.300000 2.321639 0.117006 2.934734 1.709131 0.151160 -0.091012
3.333333 2.378918 0.122087 2.939170 1.722237 0.154291 -0.053569
3.366667 2.436558 0.127248 2.939137 1.734932 0.157450 -0.016421
3.400000 2.494543 0.132488 2.947243 1.747248 0.160647 0.021172
3.433333 2.553032 0.137870 2.958040 1.759154 0.163868 0.054362
3.466667 2.611998 0.143396 2.955454 1.770607 0.167095 0.080900
3.500000 2.671262 0.148996 2.970172 1.781585 0.170319 0.102926
3.533333 2.730961 0.154735 2.961290 1.792072 0.173539 0.118827
3.566667 2.791067 0.160611 2.967180 1.802005 0.176734 0.132187
3.600000 2.851555 0.166622 2.980700 1.811326 0.179889 0.145132
3.633333 2.912275 0.172703 2.976515 1.820017 0.183004 0.162116
3.666667 2.973209 0.178852 2.987062 1.828068 0.186087 0.181976
3.700000 3.034450 0.185130 2.982371 1.835448 0.189131 0.205196
3.733333 3.095872 0.191474 2.984906 1.842141 0.192138 0.230490
3.766667 3.157455 0.197881 2.989105 1.848156 0.195119 0.256309
3.800000 3.219271 0.204410 3.009923 1.853509 0.198086 0.278228
3.833333 3.281292 0.211060 3.019840 1.858193 0.201045 0.292121
3.866667 3.343479 0.217824 3.026845 1.862186 0.203992 0.300371
3.900000 3.405803 0.224701 3.049506 1.865485 0.206925 0.300126
3.933333 3.468236 0.231687 3.073528 1.868072 0.209830 0.290877
3.966667 3.530723 0.238724 3.078669 1.869921 0.212687 0.270977
4.000000 3.593259 0.245864 3.088949 1.871010 0.215475 0.246354
4.033333 3.655815 0.253103 3.080246 1.871335 0.218168 0.223822
4.066667 3.718371 0.260439 3.093013 1.870905 0.220742 0.201007
4.100000 3.780897 0.267869 3.116836 1.869731 0.223176 0.182012
4.133333 3.843365 0.275390 3.111100 1.867843 0.225452 0.169396
4.166667 3.905745 0.282996 3.096773 1.865268 0.227549 0.165588
4.200000 3.968005 0.290686 3.108440 1.862038 0.229443 0.166723
4.233333 4.030174 0.298409 3.093650 1.858182 0.231120 0.168800
4.266667 4.092164 0.306206 3.116134 1.853730 0.232572 0.174265
4.300000 4.154026 0.314031 3.124001 1.848697 0.233796 0.182093
4.333333 4.215651 0.321924 -3.141388 1.843085 0.234787 0.188888
4.366667 4.277091 0.329821 -3.126145 1.836902 0.235557 0.190899
4.400000 4.338317 0.337720 -3.132250 1.830144 0.236126 0.191137
4.433333 4.399344 0.345635 -3.130105 1.822806 0.236511 0.187440
4.466667 4.460156 0.353563 -3.118428 1.814868 0.236728 0.179141
4.500000 4.520665 0.361481 -3.117797 1.806322 0.236794 0.168047
4.533333 4.580843 0.369387 -3.110892 1.797171 0.236734 0.155961
4.566667 4.640754 0.377299 -3.101592 1.787416 0.236565 0.148445
4.600000 4.700380 0.385212 -3.092139 1.777052 0.236296 0.140898
4.633333 4.759585 0.393103 -3.102480 1.766086 0.235939 0.136181
4.666667 4.818348 0.400969 -3.089074 1.754541 0.235504 0.136105
4.700000 4.876777 0.408829 -3.091659 1.742429 0.234996 0.138796
4.733333 4.934705 0.416659 -3.078660 1.729759 0.234413 0.142718
4.766667 4.992266 0.424477 -3.078249 1.716541 0.233757 0.144141
4.800000 5.049444 0.432281 -3.081735 1.702791 0.233026 0.145522
4.833333 5.106029 0.440047 -3.074175 1.688492 0.232214 0.143091
4.866667 5.162201 0.447793 -3.071830 1.673585 0.231307 0.133289
4.900000 5.217944 0.455517 -3.046402 1.658014 0.230292 0.111784
4.933333 5.273013 0.463193 -3.049170 1.641701 0.229148 0.080794
4.966667 5.327624 0.470841 -3.052759 1.624567 0.227860 0.039613
5.000000 5.381762 0.478461 -3.034911 1.606563 0.226413 -0.013402
5.033333 5.435144 0.486014 -3.027914 1.587661 0.224806 -0.074100
5.066667 5.488025 0.493534 -3.038079 1.567858 0.223048 -0.139399
5.100000 5.540393 0.501016 -3.032335 1.547146 0.221154 -0.203244
5.133333 5.591929 0.508411 -3.049888 1.525573 0.219152 -0.264109
5.166667 5.642614 0.515713 -3.072343 1.503210 0.217074 -0.318073
5.200000 5.692429 0.522916 -3.088645 1.480133 0.214953 -0.356637
5.233333 5.741356 0.530015 -3.102964 1.456419 0.212818 -0.376745
5.266667 5.789384 0.537009 -3.120899 1.432178 0.210698 -0.373595
5.300000 5.836827 0.543953 -3.138406 1.407568 0.208618 -0.343438
5.333333 5.883674 0.550845 3.126980 1.382688 0.206591 -0.284651
5.366667 5.929490 0.557685 3.117022 1.357584 0.204617 -0.197990
5.400000 5.974255 0.564471 3.102106 1.332252 0.202681 -0.091377
5.433333 6.017945 0.571202 3.091420 1.306701 0.200757 0.031618
5.466667 6.061004 0.577874 3.085030 1.280937 0.198807 0.164525
5.500000 6.103425 0.584485 3.076443 1.254895 0.196791 0.304217
5.533333 6.145199 0.591033 3.104898 1.228534 0.194672 0.445479
5.566667 6.185825 0.597521 3.123364 1.201884 0.192427 0.585238
5.600000 6.225289 0.603946 -3.110979 1.175041 0.190048 0.719692
5.633333 6.264088 0.610304 -3.076626 1.148084 0.187542 0.842089
5.666667 6.302216 0.616593 -3.037446 1.121076 0.184921 0.944799
5.700000 6.339228 0.622751 -3.014836 1.094162 0.182206 1.015010
5.733333 6.375129 0.628780 -2.999642 1.067499 0.179423 1.048531
5.766667 6.409924 0.634679 -2.970639 1.041177 0.176593 1.038125
5.800000 6.444032 0.640504 -2.916380 1.015201 0.173733 0.981865
5.833333 6.477051 0.646205 -2.842335 0.989596 0.170857 0.876794
5.866667 6.509380 0.651829 -2.773659 0.964385 0.167977 0.723404
5.900000 6.541017 0.657374 -2.740800 0.939514 0.165093 0.528350
5.933333 6.571959 0.662840 -2.722131 0.914903 0.162201 0.293739
5.966667 6.602207 0.668227 -2.722189 0.890478 0.159292 0.034492
6.000000 6.631759 0.673532 -2.720059 0.866209 0.156359 -0.233838
6.033333 6.660338 0.678723 -2.737793 0.842054 0.153394 -0.487275
6.066667 6.687965 0.683799 -2.749420 0.817993 0.150395 -0.703204
6.100000 6.714658 0.688756 -2.811055 0.794060 0.147365 -0.864530
6.133333 6.740657 0.693629 -2.870359 0.770303 0.144310 -0.956892
6.166667 6.765757 0.698373 -2.940332 0.746793 0.141232 -0.978710
6.200000 6.790165 0.703033 -3.000474 0.723601 0.138134 -0.934173
6.233333 6.813705 0.707551 -3.051102 0.700785 0.135017 -0.836785
6.266667 6.836556 0.711983 -3.100986 0.678358 0.131879 -0.702369
6.300000 6.858721 0.716330 -3.117694 0.656294 0.128709 -0.552489
6.333333 6.880203 0.720591 -3.125850 0.634567 0.125497 -0.405564
6.366667 6.901003 0.724765 -3.109512 0.613125 0.122236 -0.282289
6.400000 6.921127 0.728853 -3.070337 0.591915 0.118919 -0.199260
6.433333 6.940457 0.732766 -3.053464 0.570880 0.115529 -0.165510
6.466667 6.959118 0.736593 -3.050726 0.549978 0.112043 -0.186170
6.500000 6.977017 0.740229 -3.044399 0.529191 0.108465 -0.254971
6.533333 6.994254 0.743781 -3.061819 0.508500 0.104797 -0.362114
6.566667 7.010833 0.747247 -3.062336 0.487907 0.101041 -0.488809
6.600000 7.026758 0.750628 -3.071659 0.467415 0.097198 -0.612732
6.633333 7.041990 0.753793 -3.106639 0.447031 0.093275 -0.718481
6.666667 7.056578 0.756875 3.139992 0.426777 0.089300 -0.794804
6.700000 7.070429 0.759784 3.077241 0.406667 0.085282 -0.831211
6.733333 7.083647 0.762611 3.012996 0.386705 0.081214 -0.822069
6.766667 7.096150 0.765246 2.987630 0.366911 0.077119 -0.769439
6.800000 7.107949 0.767679 2.959105 0.347303 0.073013 -0.682582
6.833333 7.119132 0.770034 2.925625 0.327910 0.068918 -0.570945
6.866667 7.129705 0.772312 2.906926 0.308748 0.064830 -0.439336
6.900000 7.139603 0.774367 2.897441 0.289828 0.060740 -0.299126
6.933333 7.148905 0.776348 2.906426 0.271168 0.056650 -0.163852
6.966667 7.157549 0.778102 2.921691 0.252770 0.052545 -0.038918
7.000000 7.165612 0.779786 2.917057 0.234631 0.048417 0.074963
7.033333 7.173100 0.781403 2.918862 0.216744 0.044256 0.181476
7.066667 7.179962 0.782799 2.948044 0.199117 0.040091 0.275887
7.100000 7.186266 0.784131 2.959115 0.181755 0.035959 0.357099
7.133333 7.191970 0.785243 2.959460 0.164675 0.031909 0.426512
7.166667 7.197131 0.786297 2.955379 0.147880 0.027966 0.478644
7.200000 7.201716 0.787136 2.974063 0.131381 0.024165 0.503749
7.233333 7.205736 0.787767 2.997072 0.115193 0.020551 0.489694
7.266667 7.209201 0.788197 3.031717 0.099320 0.017147 0.432310
7.300000 7.212156 0.788580 3.063989 0.083763 0.013964 0.328800
7.333333 7.214611 0.788919 3.090243 0.068511 0.011007 0.179354
7.366667 7.216574 0.789219 -3.138379 0.053567 0.008301 -0.010000
7.400000 7.218053 0.789482 -3.123160 0.038924 0.005846 -0.225074
7.433333 7.219059 0.789712 -3.124818 0.024571 0.003616 -0.449428
7.466667 7.219615 0.789743 3.133407 0.010493 0.001581 -0.661974
7.500000 7.219656 0.789648 3.061124 -0.003314 -0.000267 -0.841372
7.533333 7.219251 0.789531 2.995753 -0.016844 -0.001943 -0.971523
7.566667 7.218410 0.789395 2.949284 -0.030095 -0.003461 -1.040401
7.600000 7.217142 0.789246 2.868583 -0.043059 -0.004826 -1.043019
7.633333 7.215410 0.789010 2.809360 -0.055721 -0.006019 -0.979596
7.666667 7.213271 0.788769 2.761621 -0.068059 -0.007038 -0.861287
7.700000 7.210702 0.788459 2.735090 -0.080060 -0.007897 -0.707789
7.733333 7.207745 0.788151 2.721593 -0.091713 -0.008612 -0.536093
7.766667 7.204412 0.787849 2.725474 -0.103008 -0.009192 -0.361695
7.800000 7.200703 0.787502 2.736860 -0.113938 -0.009644 -0.201228
7.833333 7.196637 0.787169 2.750398 -0.124502 -0.009990 -0.065538
7.866667 7.192231 0.786803 2.755522 -0.134705 -0.010236 0.041809
7.900000 7.187497 0.786407 2.759375 -0.144556 -0.010379 0.124776
7.933333 7.182437 0.786039 2.765150 -0.154064 -0.010411 0.185374
7.966667 7.177062 0.785702 2.783857 -0.163241 -0.010332 0.225191
8.000000 7.171397 0.785346 2.790287 -0.172100 -0.010147 0.247345
8.033333 7.165450 0.784972 2.790547 -0.180652 -0.009838 0.253053
8.066667 7.159232 0.784584 2.788117 -0.188907 -0.009391 0.240154
8.100000 7.152739 0.784246 2.787794 -0.196870 -0.008791 0.205336
8.133333 7.145984 0.783962 2.801269 -0.204544 -0.008028 0.149337
8.166667 7.138979 0.783679 2.834951 -0.211932 -0.007083 0.072960
8.200000 7.131730 0.783404 2.869279 -0.219033 -0.005936 -0.022734
8.233333 7.124243 0.783147 2.888465 -0.225841 -0.004575 -0.135500
8.266667 7.116535 0.782963 2.870006 -0.232347 -0.002996 -0.260161
8.300000 7.108608 0.782818 2.849027 -0.238539 -0.001188 -0.388777
8.333333 7.100481 0.782755 2.810580 -0.244404 0.000862 -0.513273
8.366667 7.092166 0.782778 2.787811 -0.249928 0.003156 -0.624766
8.400000 7.083665 0.782873 2.763673 -0.255098 0.005689 -0.712592
8.433333 7.074990 0.783047 2.727495 -0.259900 0.008461 -0.770058
8.466667 7.066158 0.783323 2.690285 -0.264322 0.011474 -0.795060
8.500000 7.057179 0.783703 2.658431 -0.268352 0.014726 -0.792102
8.533333 7.048065 0.784194 2.613648 -0.271979 0.018212 -0.765584
8.566667 7.038842 0.784808 2.593580 -0.275190 0.021941 -0.724270
8.600000 7.029533 0.785557 2.564620 -0.277964 0.025929 -0.679096
8.633333 7.020120 0.786430 2.551880 -0.280292 0.030186 -0.641187
8.666667 7.010659 0.787462 2.533188 -0.282171 0.034716 -0.617463
8.700000 7.001115 0.788626 2.525644 -0.283588 0.039539 -0.609084
8.733333 6.991496 0.789925 2.516124 -0.284539 0.044660 -0.620511
8.766667 6.981883 0.791421 2.504789 -0.285030 0.050080 -0.650989
8.800000 6.972291 0.793125 2.493518 -0.285072 0.055789 -0.697564
8.833333 6.962655 0.794977 2.459950 -0.284671 0.061787 -0.748678
8.866667 6.953070 0.797063 2.452571 -0.283832 0.068066 -0.799935
8.900000 6.943548 0.799395 2.423317 -0.282575 0.074608 -0.847540
8.933333 6.934104 0.801984 2.371483 -0.280911 0.081402 -0.886601
8.966667 6.924654 0.804734 2.314162 -0.278841 0.088448 -0.910713
9.000000 6.915316 0.807759 2.274828 -0.276362 0.095745 -0.916747
9.033333 6.906103 0.811067 2.241680 -0.273470 0.103294 -0.912592
9.066667 6.896911 0.814546 2.233704 -0.270149 0.111110 -0.899400
9.100000 6.887869 0.818323 2.197804 -0.266392 0.119197 -0.878864
9.133333 6.878988 0.822405 2.161646 -0.262210 0.127538 -0.854180
9.166667 6.870154 0.826665 2.152738 -0.257619 0.136112 -0.835553
9.200000 6.861505 0.831245 2.130909 -0.252650 0.144883 -0.827010
9.233333 6.853054 0.836151 2.097683 -0.247355 0.153794 -0.824865
9.266667 6.844816 0.841390 2.070254 -0.241822 0.162751 -0.824054
9.300000 6.836806 0.846970 2.049847 -0.236127 0.171673 -0.824769
9.333333 6.829035 0.852897 2.021157 -0.230320 0.180509 -0.826533
9.366667 6.821520 0.859176 1.987232 -0.224465 0.189193 -0.819373
9.400000 6.814273 0.865813 1.957190 -0.218615 0.197672 -0.801739
9.433333 6.807131 0.872637 1.918632 -0.212798 0.205923 -0.776286
9.466667 6.800099 0.879648 1.891382 -0.207000 0.213961 -0.748911
9.500000 6.793377 0.887031 1.858408 -0.201194 0.221821 -0.717001
9.533333 6.786777 0.894601 1.834425 -0.195368 0.229518 -0.680377
9.566667 6.780304 0.902357 1.819232 -0.189479 0.237094 -0.646345
9.600000 6.773963 0.910298 1.822868 -0.183468 0.244608 -0.616372
9.633333 6.767760 0.918424 1.798831 -0.177268 0.252123 -0.589288
9.666667 6.761900 0.926940 1.769273 -0.170836 0.259676 -0.562540
9.700000 6.756390 0.935847 1.769969 -0.164168 0.267265 -0.541414
9.733333 6.751031 0.944935 1.743583 -0.157253 0.274896 -0.523521
9.766667 6.745829 0.954203 1.710015 -0.150096 0.282554 -0.505139
9.800000 6.740787 0.963649 1.696175 -0.142697 0.290232 -0.483423
9.833333 6.736131 0.973482 1.689970 -0.135114 0.297865 -0.458428
9.866667 6.731644 0.983489 1.657506 -0.127353 0.305441 -0.430542
9.900000 6.727566 0.993880 1.647914 -0.119406 0.312965 -0.396457
9.933333 6.723663 1.004440 1.643441 -0.111245 0.320458 -0.359645
9.966667 6.720190 1.015375 1.625377 -0.102869 0.327920 -0.320491
10.000000 6.716897 1.026475 1.622217 -0.094303 0.335334 -0.281574
10.033333 6.713786 1.037736 1.616642 -0.085515 0.342734 -0.243272
10.066667 6.710861 1.049155 1.602830 -0.076516 0.350120 -0.207697
10.100000 6.708381 1.060922 1.590501 -0.067314 0.357492 -0.173159
10.133333 6.706343 1.073032 1.590948 -0.057961 0.364817 -0.136847
10.166667 6.704495 1.085289 1.591022 -0.048484 0.372085 -0.102061
10.200000 6.703075 1.097869 1.593299 -0.038936 0.379262 -0.066704
10.233333 6.701847 1.110588 1.584078 -0.029383 0.386305 -0.029232
10.266667 6.701030 1.123611 1.571582 -0.019906 0.393156 0.012600
10.300000 6.700612 1.136927 1.585770 -0.010572 0.399765 0.055412
10.333333 6.700581 1.150521 1.588349 -0.001421 0.406104 0.099234
10.366667 6.700744 1.164236 1.584822 0.007511 0.412143 0.148182
10.400000 6.701269 1.178205 1.588736 0.016233 0.417893 0.199663
10.433333 6.701987 1.192283 1.603730 0.024744 0.423349 0.250721
10.466667 6.703044 1.206588 1.609261 0.033060 0.428522 0.300166
10.500000 6.704291 1.220992 1.613004 0.041194 0.433421 0.347940
10.533333 6.705726 1.235487 1.637659 0.049172 0.438064 0.391769
10.566667 6.707467 1.250171 1.644753 0.056999 0.442450 0.427747
10.600000 6.709504 1.265029 1.659920 0.064670 0.446572 0.455980
10.633333 6.711825 1.280045 1.687816 0.072175 0.450413 0.477871
10.666667 6.714419 1.295208 1.708973 0.079509 0.453967 0.490329
10.700000 6.717275 1.310503 1.729887 0.086655 0.457214 0.493865
10.733333 6.720381 1.325915 1.741730 0.093573 0.460115 0.489716
10.766667 6.723728 1.341429 1.751833 0.100238 0.462649 0.479528
10.800000 6.727246 1.356984 1.780663 0.106631 0.464795 0.464316
10.833333 6.730931 1.372574 1.783813 0.112751 0.466551 0.447001
10.866667 6.734827 1.388226 1.813258 0.118594 0.467907 0.431629
10.900000 6.738925 1.403924 1.818695 0.124168 0.468867 0.421660
10.933333 6.743213 1.419652 1.828608 0.129490 0.469446 0.417536
10.966667 6.747682 1.435393 1.847234 0.134584 0.469664 0.419839
11.000000 6.752302 1.451134 1.850245 0.139463 0.469528 0.430180
11.033333 6.757085 1.466858 1.862394 0.144134 0.469051 0.444336
11.066667 6.762012 1.482567 1.880099 0.148603 0.468243 0.460792
11.100000 6.767078 1.498253 1.882165 0.152875 0.467102 0.476268
11.133333 6.772284 1.513879 1.904770 0.156954 0.465630 0.488824
11.166667 6.777620 1.529430 1.929298 0.160844 0.463824 0.497986
11.200000 6.783078 1.544891 1.947726 0.164552 0.461701 0.501618
11.233333 6.788661 1.560300 1.977720 0.168085 0.459259 0.499902
11.266667 6.794363 1.575651 1.999905 0.171448 0.456493 0.494409
11.300000 6.800181 1.590937 2.011072 0.174641 0.453401 0.482795
11.333333 6.806092 1.606069 2.026226 0.177665 0.449983 0.464925
11.366667 6.812109 1.621123 2.039732 0.180519 0.446229 0.436660
11.400000 6.818206 1.635993 2.035357 0.183195 0.442112 0.395073
11.433333 6.824377 1.650665 2.055953 0.185690 0.437622 0.335881
11.466667 6.830642 1.665237 2.073949 0.187996 0.432754 0.252851
11.500000 6.836997 1.679702 2.085925 0.190107 0.427508 0.147073
11.533333 6.843438 1.694054 2.109213 0.192012 0.421869 0.019791
11.566667 6.849925 1.708143 2.122734 0.193704 0.415843 -0.121072
11.600000 6.856451 1.721956 2.130641 0.195179 0.409448 -0.269679
11.633333 6.863007 1.735478 2.126155 0.196429 0.402704 -0.409884
11.666667 6.869632 1.748862 2.118217 0.197458 0.395647 -0.526060
11.700000 6.876320 1.762101 2.064416 0.198275 0.388326 -0.604697
11.733333 6.883010 1.775022 2.022488 0.198889 0.380804 -0.634810
11.766667 6.889695 1.787618 1.957366 0.199297 0.373122 -0.608243
11.800000 6.896364 1.799885 1.894126 0.199508 0.365330 -0.515807
11.833333 6.903006 1.811820 1.869318 0.199542 0.357486 -0.360470
11.866667 6.909691 1.823584 1.865970 0.199414 0.349630 -0.152100
11.900000 6.916415 1.835170 1.852492 0.199122 0.341785 0.089973
11.933333 6.923084 1.846427 1.850498 0.198669 0.333969 0.348403
11.966667 6.929690 1.857356 1.884797 0.198068 0.326209 0.607097
12.000000 6.936323 1.868094 1.916178 0.197317 0.318502 0.845713
12.033333 6.942979 1.878637 1.966578 0.196385 0.310816 1.047311
12.066667 6.949539 1.888864 2.026311 0.195250 0.303127 1.204607
12.100000 6.955992 1.898780 2.072354 0.193926 0.295433 1.324157
12.133333 6.962458 1.908488 2.137134 0.192426 0.287725 1.407577
12.166667 6.968932 1.917985 2.240002 0.190770 0.279988 1.448378
12.200000 6.975411 1.927266 2.278121 0.188970 0.272214 1.451807
12.233333 6.981755 1.936249 2.277848 0.187079 0.264428 1.428249
12.266667 6.987960 1.944933 2.297682 0.185135 0.256637 1.387630
12.300000 6.994021 1.953318 2.388175 0.183140 0.248826 1.325143
12.333333 7.000074 1.961474 2.441395 0.181098 0.240986 1.245328
12.366667 7.005973 1.969335 2.505098 0.179007 0.233113 1.160244
12.400000 7.011860 1.976959 2.521032 0.176879 0.225211 1.075168
12.433333 7.017730 1.984345 2.567947 0.174682 0.217263 0.985450
12.466667 7.023583 1.991489 2.594114 0.172391 0.209254 0.887071
12.500000 7.029414 1.998389 2.620345 0.169981 0.201175 0.789978
12.533333 7.035088 2.004988 2.637078 0.167438 0.193019 0.697316
12.566667 7.040736 2.011337 2.660362 0.164735 0.184775 0.612212
12.600000 7.046229 2.017384 2.670248 0.161864 0.176436 0.532788
12.633333 7.051566 2.023127 2.691572 0.158858 0.168014 0.463750
12.666667 7.056870 2.028613 2.700248 0.155751 0.159524 0.406499
12.700000 7.062022 2.033796 2.699178 0.152608 0.150988 0.358857
12.733333 7.067021 2.038678 2.713823 0.149471 0.142424 0.319835
12.766667 7.071868 2.043260 2.738750 0.146413 0.133859 0.284762
12.800000 7.076678 2.047577 2.740594 0.143475 0.125307 0.254036
12.833333 7.081337 2.051594 2.746980 0.140669 0.116774 0.228368
12.866667 7.085956 2.055343 2.750971 0.138001 0.108264 0.208788
12.900000 7.090429 2.058792 2.758880 0.135455 0.099772 0.192430
12.933333 7.094858 2.061970 2.765035 0.133022 0.091296 0.177242
12.966667 7.099244 2.064874 2.775291 0.130660 0.082824 0.164566
13.000000 7.103586 2.067504 2.762086 0.128330 0.074346 0.156888
13.033333 7.107882 2.069857 2.764365 0.125994 0.065854 0.150305
13.066667 7.112039 2.071914 2.786187 0.123629 0.057340 0.143599
13.100000 7.116150 2.073693 2.789107 0.121205 0.048798 0.137938
13.133333 7.120214 2.075193 2.789528 0.118694 0.040222 0.134125
13.166667 7.124143 2.076397 2.804310 0.116092 0.031611 0.131602
13.200000 7.127940 2.077307 2.801228 0.113410 0.022968 0.126562
13.233333 7.131690 2.077934 2.801296 0.110668 0.014297 0.124321
13.266667 7.135391 2.078279 2.809895 0.107876 0.005599 0.124863
13.300000 7.138964 2.078328 2.807637 0.105060 -0.003119 0.127822
13.333333 7.142413 2.078082 2.825142 0.102244 -0.011852 0.132220
13.366667 7.145740 2.077539 2.808451 0.099449 -0.020597 0.139363
13.400000 7.148945 2.076699 2.823381 0.096684 -0.029352 0.146714
13.433333 7.152103 2.075575 2.821285 0.093958 -0.038116 0.149891
13.466667 7.155215 2.074166 2.829065 0.091277 -0.046888 0.147665
13.500000 7.158213 2.072460 2.834131 0.088637 -0.055671 0.141864
13.533333 7.161101 2.070457 2.848186 0.086028 -0.064466 0.132286
13.566667 7.163881 2.068156 2.865736 0.083448 -0.073276 0.114258
13.600000 7.166617 2.065572 2.867424 0.080887 -0.082101 0.094841
13.633333 7.169311 2.062703 2.858577 0.078335 -0.090944 0.076347
13.666667 7.171905 2.059534 2.876630 0.075798 -0.099802 0.059927
13.700000 7.174398 2.056067 2.868675 0.073290 -0.108670 0.043736
13.733333 7.176796 2.052300 2.856750 0.070825 -0.117541 0.030962
13.766667 7.179099 2.048234 2.855986 0.068412 -0.126410 0.027371
13.800000 7.181310 2.043867 2.842095 0.066073 -0.135270 0.027989
13.833333 7.183431 2.039200 2.860936 0.063834 -0.144108 0.028453
13.866667 7.185466 2.034232 2.866301 0.061712 -0.152917 0.029367
13.900000 7.187468 2.028985 2.854954 0.059705 -0.161699 0.031043
13.933333 7.189388 2.023437 2.870546 0.057816 -0.170452 0.028259
13.966667 7.191228 2.017585 2.874610 0.056044 -0.179177 0.018728
14.000000 7.193042 2.011459 2.870051 0.054386 -0.187873 0.006743
14.033333 7.194832 2.005061 2.874091 0.052818 -0.196547 -0.000827
14.066667 7.196550 1.998358 2.882501 0.051324 -0.205205 -0.001998
14.100000 7.198247 1.991386 2.884392 0.049896 -0.213848 0.003508
14.133333 7.199874 1.984109 2.865464 0.048529 -0.222473 0.024160
14.166667 7.201486 1.976568 2.856465 0.047217 -0.231080 0.063760
14.200000 7.203032 1.968720 2.845509 0.045955 -0.239672 0.120564
14.233333 7.204514 1.960569 2.848129 0.044753 -0.248247 0.191141
14.266667 7.205935 1.952114 2.850403 0.043629 -0.256806 0.274063
14.300000 7.207350 1.943402 2.861258 0.042601 -0.265342 0.369659
14.333333 7.208761 1.934435 2.884200 0.041679 -0.273857 0.471850
14.366667 7.210118 1.925170 2.902108 0.040890 -0.282361 0.577516
14.400000 7.211425 1.915604 2.924279 0.040258 -0.290852 0.687875
14.433333 7.212688 1.905735 2.945463 0.039803 -0.299322 0.806552
14.466667 7.213958 1.895623 2.981164 0.039536 -0.307757 0.934465
14.500000 7.215237 1.885270 3.028745 0.039468 -0.316162 1.067722
14.533333 7.216502 1.874604 3.056881 0.039618 -0.324532 1.205178
14.566667 7.217766 1.863620 3.073900 0.039987 -0.332851 1.339145
14.600000 7.219042 1.852318 3.102902 0.040570 -0.341105 1.459736
14.633333 7.220338 1.840788 -3.140879 0.041360 -0.349312 1.554530
14.666667 7.221657 1.829034 -3.068298 0.042354 -0.357487 1.611907
14.700000 7.223084 1.816897 -2.981471 0.043530 -0.365609 1.629766
14.733333 7.224540 1.804545 -2.893992 0.044865 -0.373678 1.600823
14.766667 7.226026 1.791980 -2.814376 0.046339 -0.381690 1.528335
14.800000 7.227547 1.779207 -2.727984 0.047933 -0.389665 1.418306
14.833333 7.229167 1.766057 -2.689278 0.049626 -0.397585 1.283901
14.866667 7.230827 1.752708 -2.630232 0.051398 -0.405433 1.134910
14.900000 7.232576 1.738989 -2.624237 0.053241 -0.413217 0.981081
14.933333 7.234370 1.725079 -2.622326 0.055148 -0.420927 0.833622
14.966667 7.236246 1.710811 -2.629527 0.057118 -0.428550 0.698584
15.000000 7.238171 1.696362 -2.621731 0.059146 -0.436045 0.577988
15.033333 7.240149 1.681739 -2.606404 0.061237 -0.443399 0.461342
15.066667 7.242211 1.666785 -2.594164 0.063399 -0.450592 0.349338
15.100000 7.244330 1.651666 -2.566428 0.065644 -0.457628 0.232559
15.133333 7.246538 1.636239 -2.527463 0.067984 -0.464499 0.105747
15.166667 7.248838 1.620518 -2.482448 0.070427 -0.471194 -0.039665
15.200000 7.251201 1.604648 -2.486158 0.072989 -0.477717 -0.203639
15.233333 7.253629 1.588637 -2.497322 0.075676 -0.484055 -0.378076
15.266667 7.256161 1.572366 -2.542303 0.078495 -0.490197 -0.557388
15.300000 7.258801 1.555845 -2.569629 0.081445 -0.496096 -0.730669
15.333333 7.261513 1.539201 -2.605339 0.084530 -0.501729 -0.886486
15.366667 7.264341 1.522336 -2.656695 0.087755 -0.507080 -1.008211
15.400000 7.267293 1.505263 -2.696880 0.091122 -0.512119 -1.090011
15.433333 7.270372 1.487998 -2.744960 0.094637 -0.516811 -1.126855
15.466667 7.273586 1.470556 -2.787650 0.098308 -0.521123 -1.125043
15.500000 7.276880 1.453025 -2.833790 0.102148 -0.525043 -1.085601
15.533333 7.280322 1.435347 -2.876650 0.106151 -0.528542 -1.015386
15.566667 7.283848 1.417593 -2.930283 0.110316 -0.531600 -0.923602
15.600000 7.287536 1.399730 -2.950315 0.114640 -0.534210 -0.818137
15.633333 7.291396 1.381777 -2.981234 0.119104 -0.536381 -0.706329
15.666667 7.295435 1.363754 -2.996159 0.123677 -0.538133 -0.588673
15.700000 7.299563 1.345683 -3.010192 0.128318 -0.539477 -0.475796
15.733333 7.303884 1.327582 -3.015148 0.133001 -0.540438 -0.370624
15.766667 7.308403 1.309469 -3.021118 0.137683 -0.541033 -0.278169
15.800000 7.313126 1.291360 -3.037078 0.142322 -0.541282 -0.196833
15.833333 7.318055 1.273275 -3.026914 0.146896 -0.541195 -0.130320
15.866667 7.323076 1.255177 -3.028826 0.151410 -0.540765 -0.080099
15.900000 7.328188 1.237073 -3.027112 0.155864 -0.539997 -0.039213
15.933333 7.333511 1.219047 -3.032174 0.160254 -0.538899 -0.008421
15.966667 7.338926 1.201028 -3.024483 0.164609 -0.537460 0.012616
16.000000 7.344432 1.183025 -3.016825 0.168959 -0.535678 0.021660
16.033333 7.350150 1.165145 -3.042178 0.173315 -0.533567 0.026582
16.066667 7.355959 1.147294 -3.021155 0.177670 -0.531152 0.027380
16.100000 7.361858 1.129477 -3.013874 0.182040 -0.528439 0.021325
16.133333 7.367969 1.111821 -3.015957 0.186450 -0.525420 0.010075
16.166667 7.374292 1.094336 -3.015125 0.190888 -0.522122 -0.001672
16.200000 7.380826 1.077033 -3.016237 0.195331 -0.518576 -0.009228
16.233333 7.387448 1.059791 -3.009983 0.199776 -0.514789 -0.017705
16.266667 7.394156 1.042615 -3.013141 0.204220 -0.510770 -0.019407
16.300000 7.401074 1.025648 -3.030225 0.208629 -0.506562 -0.006548
16.333333 7.408077 1.008760 -3.036634 0.212957 -0.502218 0.023568
16.366667 7.415162 0.991955 -3.024825 0.217187 -0.497759 0.067612
16.400000 7.422457 0.975378 -3.024792 0.221325 -0.493186 0.120430
16.433333 7.429962 0.959031 -3.029860 0.225358 -0.488512 0.181053
16.466667 7.437675 0.942920 -3.034239 0.229263 -0.483761 0.239050
16.500000 7.445464 0.926915 -3.039810 0.233052 -0.478916 0.282554
16.533333 7.453327 0.911021 -3.026675 0.236744 -0.473948 0.304713
16.566667 7.461262 0.895242 -2.998131 0.240352 -0.468833 0.305099
16.600000 7.469397 0.879709 -2.951702 0.243876 -0.463550 0.281065
16.633333 7.477600 0.864301 -2.904598 0.247323 -0.458079 0.227712
16.666667 7.485868 0.849023 -2.885137 0.250716 -0.452379 0.145922
16.700000 7.494198 0.833880 -2.901316 0.254059 -0.446441 0.039710
16.733333 7.502690 0.818984 -2.920581 0.257335 -0.440272 -0.082259
16.766667 7.511333 0.804337 -2.929845 0.260517 -0.433897 -0.212493
16.800000 7.520115 0.789941 -2.939227 0.263579 -0.427337 -0.339179
16.833333 7.529023 0.775800 -2.946485 0.266490 -0.420625 -0.446431
16.866667 7.538041 0.761915 -2.961552 0.269209 -0.413794 -0.526730
16.900000 7.547155 0.748292 -2.987688 0.271695 -0.406877 -0.577184
16.933333 7.556354 0.734932 -3.025896 0.273924 -0.399909 -0.603905
16.966667 7.565594 0.721736 -3.068239 0.275884 -0.392900 -0.611302
17.000000 7.574869 0.708708 -3.097803 0.277565 -0.385865 -0.603517
17.033333 7.584178 0.695851 -3.133362 0.278966 -0.378783 -0.588509
17.066667 7.593537 0.683276 -3.130909 0.280086 -0.371631 -0.570336
17.100000 7.602938 0.670991 -3.131650 0.280925 -0.364361 -0.547551
17.133333 7.612371 0.659001 3.133928 0.281480 -0.356917 -0.513531
17.166667 7.621823 0.647192 -3.140561 0.281759 -0.349273 -0.465778
17.200000 7.631289 0.635690 3.124717 0.281759 -0.341403 -0.398573
17.233333 7.640768 0.624372 3.096224 0.281487 -0.333322 -0.302799
17.266667 7.650257 0.613241 3.056305 0.280961 -0.325059 -0.165859
17.300000 7.659671 0.602488 3.032783 0.280222 -0.316683 0.015669
17.333333 7.669088 0.591926 3.021703 0.279304 -0.308242 0.234374
17.366667 7.678420 0.581754 3.011977 0.278242 -0.299787 0.480249
17.400000 7.687660 0.571979 3.009104 0.277081 -0.291379 0.730204
17.433333 7.696803 0.562603 3.040369 0.275862 -0.283073 0.953577
17.466667 7.705935 0.553420 3.077109 0.274619 -0.274916 1.118625
17.500000 7.715054 0.544431 -3.138278 0.273362 -0.266915 1.199463
17.533333 7.724128 0.535779 -3.042386 0.272109 -0.259119 1.183281
17.566667 7.733182 0.527321 -2.925741 0.270861 -0.251539 1.064143
17.600000 7.742215 0.519056 -2.822313 0.269604 -0.244167 0.848893
17.633333 7.751222 0.510985 -2.738419 0.268314 -0.236971 0.555684
17.666667 7.760167 0.503225 -2.728005 0.266962 -0.229925 0.206759
17.700000 7.769082 0.495658 -2.758440 0.265526 -0.223018 -0.169154
17.733333 7.777927 0.488379 -2.829276 0.263969 -0.216212 -0.541095
17.766667 7.786700 0.481374 -2.901512 0.262262 -0.209492 -0.879098
17.800000 7.795433 0.474560 -2.953668 0.260381 -0.202854 -1.156875
17.833333 7.804125 0.467936 -3.013667 0.258303 -0.196306 -1.356256
17.866667 7.812771 0.461502 -3.082857 0.256013 -0.189842 -1.471707
17.900000 7.821330 0.455288 -3.137956 0.253497 -0.183461 -1.507239
17.933333 7.829799 0.449283 3.081051 0.250759 -0.177164 -1.476454
17.966667 7.838215 0.443463 3.030655 0.247814 -0.170945 -1.393631
18.000000 7.846465 0.437888 2.986836 0.244685 -0.164801 -1.269853
18.033333 7.854657 0.432495 2.938125 0.241401 -0.158729 -1.113239
18.066667 7.862683 0.427326 2.887159 0.238006 -0.152739 -0.927837
18.100000 7.870541 0.422371 2.851719 0.234548 -0.146838 -0.711248
18.133333 7.878233 0.417623 2.847795 0.231070 -0.141034 -0.462447
18.166667 7.885859 0.413050 2.840740 0.227611 -0.135343 -0.183839
18.200000 7.893314 0.408673 2.818383 0.224204 -0.129773 0.112700
18.233333 7.900699 0.404468 2.806416 0.220876 -0.124337 0.413523
18.266667 7.908012 0.400432 2.783827 0.217620 -0.119041 0.709684
18.300000 7.915251 0.396564 2.807408 0.214417 -0.113889 0.983076
18.333333 7.922293 0.392888 2.894675 0.211235 -0.108885 1.217169
18.366667 7.929258 0.389376 2.988718 0.208040 -0.104036 1.398391
18.400000 7.936144 0.386024 3.037058 0.204784 -0.099348 1.521304
18.433333 7.942949 0.382832 3.134965 0.201427 -0.094820 1.576934
18.466667 7.949673 0.379796 -3.076535 0.197953 -0.090452 1.559640
18.500000 7.956313 0.376914 -3.001317 0.194353 -0.086247 1.472661
18.533333 7.962793 0.374152 -2.952220 0.190624 -0.082195 1.333262
18.566667 7.969109 0.371506 -2.895401 0.186780 -0.078283 1.155585
18.600000 7.975261 0.368974 -2.873558 0.182849 -0.074497 0.951909
18.633333 7.981324 0.366586 -2.843710 0.178861 -0.070822 0.745420
18.666667 7.987224 0.364308 -2.845156 0.174839 -0.067245 0.552797
18.700000 7.992963 0.362135 -2.823412 0.170815 -0.063752 0.386285
18.733333 7.998543 0.360065 -2.828518 0.166816 -0.060336 0.245995
18.766667 8.003965 0.358096 -2.843463 0.162866 -0.056989 0.137295
18.800000 8.009296 0.356259 -2.849935 0.158974 -0.053708 0.061489
18.833333 8.014535 0.354551 -2.856634 0.155153 -0.050488 0.012612
18.866667 8.019681 0.352971 -2.853416 0.151407 -0.047324 -0.016665
18.900000 8.024681 0.351479 -2.853747 0.147731 -0.044219 -0.028989
18.933333 8.029537 0.350073 -2.862909 0.144119 -0.041175 -0.025836
