t x y theta dxdt dydt dthetadt
0.000000 0.000000 0.000000 0.591091 -0.068056 0.058558 0.002211
0.033333 -0.002323 0.001954 0.599424 -0.073250 0.058781 -0.001155
0.066667 -0.004792 0.003947 0.601294 -0.078645 0.058957 -0.004436
0.100000 -0.007415 0.005980 0.593754 -0.084245 0.059082 -0.007228
0.133333 -0.010255 0.007981 0.602378 -0.090046 0.059152 -0.009848
0.166667 -0.013315 0.009947 0.595270 -0.096053 0.059150 -0.011390
0.200000 -0.016600 0.011876 0.594009 -0.102278 0.059062 -0.011210
0.233333 -0.020075 0.013843 0.597008 -0.108726 0.058878 -0.009446
0.266667 -0.023751 0.015843 0.597659 -0.115405 0.058598 -0.007674
0.300000 -0.027641 0.017876 0.596092 -0.122310 0.058217 -0.006285
0.333333 -0.031774 0.019861 0.588663 -0.129446 0.057739 -0.003888
0.366667 -0.036156 0.021798 0.591047 -0.136822 0.057183 -0.001358
0.400000 -0.040791 0.023681 0.594434 -0.144443 0.056552 0.000370
0.433333 -0.045682 0.025592 0.595080 -0.152319 0.055857 0.001636
0.466667 -0.050835 0.027445 0.599849 -0.160453 0.055104 0.002713
0.500000 -0.056255 0.029237 0.594502 -0.168849 0.054310 0.003807
0.533333 -0.061967 0.031048 0.597998 -0.177498 0.053474 0.003210
0.566667 -0.067954 0.032794 0.597052 -0.186390 0.052584 0.001721
0.600000 -0.074260 0.034554 0.589760 -0.195516 0.051632 0.000855
0.633333 -0.080850 0.036242 0.596755 -0.204866 0.050607 -0.000825
0.666667 -0.087787 0.037940 0.595969 -0.214433 0.049493 -0.001580
0.700000 -0.095088 0.039645 0.597670 -0.224222 0.048267 -0.002119
0.733333 -0.102682 0.041268 0.595210 -0.234248 0.046927 -0.000264
0.766667 -0.110669 0.042892 0.597999 -0.244519 0.045462 0.004963
0.800000 -0.118956 0.044428 0.588659 -0.255072 0.043882 0.017170
0.833333 -0.127548 0.045874 0.594688 -0.265921 0.042184 0.044906
0.866667 -0.136446 0.047225 0.594862 -0.277118 0.040381 0.097223
0.900000 -0.145803 0.048564 0.600349 -0.288706 0.038481 0.185068
0.933333 -0.155473 0.049802 0.594816 -0.300726 0.036486 0.319093
0.966667 -0.165637 0.051018 0.592764 -0.313188 0.034400 0.508922
1.000000 -0.176120 0.052127 0.592597 -0.326058 0.032208 0.755315
1.033333 -0.187133 0.053206 0.599974 -0.339295 0.029896 1.051020
1.066667 -0.198468 0.054170 0.610350 -0.352803 0.027436 1.383688
1.100000 -0.210374 0.055093 0.638431 -0.366476 0.024800 1.737936
1.133333 -0.222873 0.055961 0.681764 -0.380190 0.021952 2.092842
1.166667 -0.235698 0.056704 0.770143 -0.393859 0.018868 2.425336
1.200000 -0.249163 0.057355 0.894264 -0.407397 0.015529 2.715618
1.233333 -0.263289 0.057890 1.031117 -0.420722 0.011928 2.950435
1.266667 -0.277741 0.058290 1.182388 -0.433782 0.008060 3.117308
1.300000 -0.292520 0.058553 1.339968 -0.446546 0.003926 3.210993
1.333333 -0.307625 0.058674 1.452530 -0.459061 -0.000483 3.237615
1.366667 -0.323056 0.058651 1.546617 -0.471391 -0.005204 3.209853
1.400000 -0.338812 0.058479 1.656085 -0.483655 -0.010267 3.148176
1.433333 -0.355295 0.058058 1.756618 -0.496005 -0.015724 3.069681
1.466667 -0.372102 0.057482 1.849670 -0.508592 -0.021625 2.993139
1.500000 -0.389229 0.056750 1.955169 -0.521516 -0.027996 2.928718
1.533333 -0.406677 0.055857 2.014494 -0.534813 -0.034854 2.878290
1.566667 -0.424442 0.054801 2.083354 -0.548456 -0.042173 2.837779
1.600000 -0.442524 0.053579 2.159136 -0.562389 -0.049928 2.800195
1.633333 -0.461321 0.051963 2.267320 -0.576503 -0.058044 2.758765
1.666667 -0.480826 0.049931 2.396004 -0.590675 -0.066455 2.704523
1.700000 -0.501026 0.047464 2.516862 -0.604787 -0.075091 2.635050
1.733333 -0.521530 0.044823 2.629633 -0.618695 -0.083849 2.544169
1.766667 -0.542707 0.041714 2.712638 -0.632259 -0.092623 2.431595
1.800000 -0.564181 0.038428 2.780863 -0.645359 -0.101328 2.296596
1.833333 -0.585947 0.034962 2.837126 -0.657958 -0.109950 2.143461
1.866667 -0.608329 0.031000 2.901467 -0.670014 -0.118434 1.979931
1.900000 -0.630995 0.026857 2.957820 -0.681547 -0.126769 1.811655
1.933333 -0.653938 0.022532 3.021118 -0.692622 -0.134989 1.649471
1.966667 -0.677153 0.018024 3.080971 -0.703366 -0.143176 1.498646
2.000000 -0.700908 0.012997 3.127912 -0.713856 -0.151362 1.361970
2.033333 -0.724925 0.007786 -3.112541 -0.724096 -0.159526 1.238655
2.066667 -0.749196 0.002391 -3.079975 -0.734136 -0.167704 1.129015
2.100000 -0.773717 -0.003188 -3.052188 -0.743995 -0.175911 1.032819
2.133333 -0.798723 -0.009177 -3.020990 -0.753646 -0.184123 0.949152
2.166667 -0.824189 -0.015577 -2.992425 -0.763017 -0.192284 0.877860
2.200000 -0.849886 -0.022160 -2.973827 -0.772081 -0.200394 0.821427
2.233333 -0.875806 -0.028925 -2.956712 -0.780834 -0.208485 0.781098
2.266667 -0.902123 -0.036091 -2.928781 -0.789228 -0.216557 0.758004
2.300000 -0.928650 -0.043436 -2.903646 -0.797216 -0.224607 0.755878
2.333333 -0.955520 -0.051170 -2.884806 -0.804786 -0.232645 0.782840
2.366667 -0.982584 -0.059080 -2.858605 -0.811952 -0.240688 0.849630
2.400000 -1.009834 -0.067166 -2.831989 -0.818712 -0.248714 0.963001
2.433333 -1.037263 -0.075426 -2.807326 -0.825060 -0.256677 1.130179
2.466667 -1.064931 -0.084038 -2.777663 -0.831014 -0.264528 1.346208
2.500000 -1.092810 -0.092992 -2.765146 -0.836586 -0.272202 1.601197
2.533333 -1.120889 -0.102279 -2.735910 -0.841791 -0.279657 1.872674
2.566667 -1.149140 -0.111887 -2.709226 -0.846619 -0.286837 2.133313
2.600000 -1.177539 -0.121805 -2.633876 -0.851058 -0.293686 2.355734
2.633333 -1.206069 -0.131883 -2.530972 -0.855087 -0.300161 2.513597
2.666667 -1.234721 -0.142117 -2.382366 -0.858685 -0.306242 2.597468
2.700000 -1.263487 -0.152505 -2.224688 -0.861829 -0.311935 2.598302
2.733333 -1.292359 -0.163043 -2.067659 -0.864495 -0.317242 2.513481
2.766667 -1.321329 -0.173728 -1.920594 -0.866677 -0.322186 2.345723
2.800000 -1.350387 -0.184558 -1.849638 -0.868379 -0.326809 2.105167
2.833333 -1.379526 -0.195528 -1.797133 -0.869615 -0.331150 1.800570
2.866667 -1.408674 -0.206689 -1.776502 -0.870399 -0.335228 1.435746
2.900000 -1.437809 -0.218014 -1.798733 -0.870759 -0.339045 1.023534
2.933333 -1.466908 -0.229470 -1.801740 -0.870738 -0.342606 0.583339
2.966667 -1.495954 -0.241033 -1.779690 -0.870378 -0.345906 0.134783
3.000000 -1.525040 -0.252718 -1.709129 -0.869729 -0.348940 -0.313901
3.033333 -1.554054 -0.264472 -1.657786 -0.868843 -0.351714 -0.747494
3.066667 -1.582996 -0.276283 -1.679131 -0.867768 -0.354236 -1.149465
3.100000 -1.611953 -0.288206 -1.728784 -0.866530 -0.356523 -1.511183
3.133333 -1.640836 -0.300161 -1.823256 -0.865144 -0.358595 -1.823392
3.166667 -1.669639 -0.312136 -1.949804 -0.863601 -0.360467 -2.074982
3.200000 -1.698434 -0.324213 -2.080761 -0.861891 -0.362145 -2.244780
3.233333 -1.727140 -0.336290 -2.201617 -0.859996 -0.363648 -2.323030
3.266667 -1.755822 -0.348462 -2.319876 -0.857904 -0.365000 -2.309542
3.300000 -1.784473 -0.360726 -2.406887 -0.855607 -0.366221 -2.207962
3.333333 -1.813087 -0.373080 -2.490060 -0.853089 -0.367319 -2.029615
3.366667 -1.841571 -0.385408 -2.533299 -0.850343 -0.368305 -1.798604
3.400000 -1.869912 -0.397708 -2.581428 -0.847368 -0.369203 -1.541219
3.433333 -1.898107 -0.409978 -2.618423 -0.844146 -0.370012 -1.280123
3.466667 -1.926235 -0.422325 -2.653947 -0.840661 -0.370728 -1.031284
3.500000 -1.954187 -0.434633 -2.668585 -0.836910 -0.371357 -0.804178
3.533333 -1.982060 -0.447012 -2.687491 -0.832883 -0.371904 -0.605402
3.566667 -2.009845 -0.459458 -2.701399 -0.828580 -0.372375 -0.430445
3.600000 -2.037535 -0.471969 -2.719362 -0.823986 -0.372756 -0.274957
3.633333 -2.064984 -0.484422 -2.726170 -0.819116 -0.373052 -0.129584
3.666667 -2.092326 -0.496933 -2.712099 -0.813971 -0.373269 0.011734
3.700000 -2.119404 -0.509380 -2.711702 -0.808550 -0.373409 0.156491
3.733333 -2.146362 -0.521879 -2.697462 -0.802863 -0.373493 0.307160
3.766667 -2.173044 -0.534312 -2.697950 -0.796931 -0.373549 0.464594
3.800000 -2.199594 -0.546792 -2.697696 -0.790778 -0.373616 0.623816
3.833333 -2.225858 -0.559212 -2.678309 -0.784414 -0.373719 0.775833
3.866667 -2.251829 -0.571578 -2.640843 -0.777886 -0.373897 0.913392
3.900000 -2.277652 -0.583985 -2.625249 -0.771236 -0.374167 1.026602
3.933333 -2.303321 -0.596430 -2.578325 -0.764518 -0.374539 1.109223
3.966667 -2.328832 -0.608911 -2.506829 -0.757745 -0.375005 1.154595
4.000000 -2.354032 -0.621405 -2.448773 -0.750927 -0.375558 1.162996
4.033333 -2.378921 -0.633925 -2.370588 -0.744073 -0.376182 1.135066
4.066667 -2.403483 -0.646480 -2.311193 -0.737166 -0.376847 1.077204
4.100000 -2.427868 -0.659062 -2.286073 -0.730191 -0.377527 0.995700
4.133333 -2.452070 -0.671668 -2.278127 -0.723104 -0.378198 0.901368
4.166667 -2.476087 -0.684296 -2.246554 -0.715906 -0.378842 0.803395
4.200000 -2.499913 -0.696945 -2.243944 -0.708606 -0.379436 0.709835
4.233333 -2.523545 -0.709611 -2.225489 -0.701200 -0.379964 0.628756
4.266667 -2.546979 -0.722293 -2.219501 -0.693674 -0.380420 0.562259
4.300000 -2.570019 -0.735004 -2.206207 -0.686028 -0.380797 0.509092
4.333333 -2.592660 -0.747733 -2.194322 -0.678307 -0.381093 0.461947
4.366667 -2.615093 -0.760471 -2.162394 -0.670544 -0.381305 0.413838
4.400000 -2.637313 -0.773216 -2.139901 -0.662753 -0.381426 0.352789
4.433333 -2.659318 -0.785965 -2.111380 -0.654962 -0.381449 0.263489
4.466667 -2.680922 -0.798684 -2.100671 -0.647226 -0.381370 0.133678
4.500000 -2.702306 -0.811403 -2.100892 -0.639559 -0.381180 -0.038078
4.533333 -2.723466 -0.824120 -2.101645 -0.631922 -0.380866 -0.241474
4.566667 -2.744400 -0.836832 -2.091085 -0.624269 -0.380410 -0.459875
4.600000 -2.765106 -0.849538 -2.098837 -0.616579 -0.379814 -0.669242
4.633333 -2.785580 -0.862235 -2.096630 -0.608828 -0.379077 -0.838876
4.666667 -2.805822 -0.874920 -2.125958 -0.600958 -0.378195 -0.938760
4.700000 -2.825829 -0.887593 -2.183260 -0.592936 -0.377180 -0.951829
4.733333 -2.845460 -0.900149 -2.265029 -0.584764 -0.376062 -0.872718
4.766667 -2.864852 -0.912688 -2.389782 -0.576446 -0.374885 -0.698771
4.800000 -2.884003 -0.925207 -2.516773 -0.567961 -0.373690 -0.433035
4.833333 -2.902811 -0.937634 -2.559768 -0.559298 -0.372525 -0.089513
4.866667 -2.921296 -0.949985 -2.522048 -0.550469 -0.371450 0.307218
4.900000 -2.939466 -0.962274 -2.458548 -0.541493 -0.370515 0.730843
4.933333 -2.957391 -0.974536 -2.382976 -0.532377 -0.369741 1.150639
4.966667 -2.975068 -0.986770 -2.311047 -0.523138 -0.369134 1.529993
5.000000 -2.992427 -0.998990 -2.241827 -0.513815 -0.368690 1.833458
5.033333 -3.009461 -1.011215 -2.168810 -0.504422 -0.368400 2.040868
5.066667 -3.026155 -1.023461 -2.068037 -0.494979 -0.368231 2.145689
5.100000 -3.042486 -1.035738 -1.965813 -0.485499 -0.368138 2.152540
5.133333 -3.058431 -1.048060 -1.858451 -0.476000 -0.368090 2.073963
5.166667 -3.074126 -1.060342 -1.776781 -0.466494 -0.368058 1.928792
5.200000 -3.089420 -1.072680 -1.699159 -0.456999 -0.368003 1.734863
5.233333 -3.104465 -1.084974 -1.648058 -0.447545 -0.367881 1.509123
5.266667 -3.119261 -1.097223 -1.614525 -0.438160 -0.367656 1.267901
5.300000 -3.133811 -1.109425 -1.580950 -0.428855 -0.367304 1.018705
5.333333 -3.147975 -1.121667 -1.551715 -0.419644 -0.366798 0.768200
5.366667 -3.161769 -1.133937 -1.541070 -0.410551 -0.366100 0.513632
5.400000 -3.175204 -1.146219 -1.537463 -0.401587 -0.365181 0.254296
5.433333 -3.188396 -1.158446 -1.534927 -0.392766 -0.364016 -0.022538
5.466667 -3.201261 -1.170654 -1.543665 -0.384113 -0.362587 -0.334666
5.500000 -3.213886 -1.182803 -1.539690 -0.375665 -0.360872 -0.688837
5.533333 -3.226218 -1.194894 -1.562363 -0.367448 -0.358859 -1.080504
5.566667 -3.238270 -1.206906 -1.557293 -0.359471 -0.356564 -1.491501
5.600000 -3.250056 -1.218818 -1.562042 -0.351736 -0.354021 -1.895684
5.633333 -3.261590 -1.230608 -1.625369 -0.344243 -0.351265 -2.253491
5.666667 -3.272893 -1.242328 -1.706286 -0.336972 -0.348338 -2.518886
5.700000 -3.283962 -1.253898 -1.845755 -0.329900 -0.345294 -2.651640
5.733333 -3.294800 -1.265312 -2.011200 -0.323000 -0.342191 -2.627764
5.766667 -3.305415 -1.276649 -2.191104 -0.316244 -0.339075 -2.435057
5.800000 -3.315811 -1.287909 -2.392806 -0.309608 -0.335976 -2.073765
5.833333 -3.326007 -1.299025 -2.563931 -0.303052 -0.332926 -1.562830
5.866667 -3.335989 -1.310060 -2.636236 -0.296547 -0.329951 -0.939807
5.900000 -3.345777 -1.320974 -2.635725 -0.290047 -0.327065 -0.252209
5.933333 -3.355355 -1.331803 -2.564543 -0.283525 -0.324265 0.443858
5.966667 -3.364724 -1.342538 -2.471963 -0.276955 -0.321544 1.096160
6.000000 -3.373866 -1.353192 -2.348118 -0.270318 -0.318899 1.651644
6.033333 -3.382808 -1.363757 -2.258129 -0.263615 -0.316313 2.074711
6.066667 -3.391485 -1.374262 -2.124815 -0.256839 -0.313768 2.352264
6.100000 -3.399968 -1.384674 -2.017299 -0.250007 -0.311236 2.497549
6.133333 -3.408259 -1.394994 -1.901058 -0.243126 -0.308697 2.545309
6.166667 -3.416216 -1.405262 -1.805229 -0.236208 -0.306122 2.532272
6.200000 -3.423988 -1.415433 -1.725702 -0.229262 -0.303484 2.500146
6.233333 -3.431420 -1.425546 -1.661328 -0.222317 -0.300760 2.476621
6.266667 -3.438675 -1.435561 -1.616265 -0.215409 -0.297923 2.478192
6.300000 -3.445756 -1.445476 -1.571114 -0.208576 -0.294946 2.491412
6.333333 -3.452667 -1.455290 -1.523924 -0.201870 -0.291809 2.489458
6.366667 -3.459287 -1.465011 -1.483147 -0.195339 -0.288505 2.444981
6.400000 -3.465640 -1.474626 -1.408073 -0.189045 -0.285013 2.323882
6.433333 -3.471744 -1.484120 -1.243352 -0.183028 -0.281310 2.095266
6.466667 -3.477618 -1.493478 -1.061189 -0.177334 -0.277373 1.726774
6.500000 -3.483282 -1.502686 -0.906891 -0.172010 -0.273188 1.204574
6.533333 -3.488802 -1.511785 -0.798136 -0.167094 -0.268738 0.532408
6.566667 -3.494181 -1.520777 -0.766861 -0.162618 -0.263988 -0.285480
6.600000 -3.499429 -1.529562 -0.792162 -0.158585 -0.258935 -1.214470
6.633333 -3.504571 -1.538123 -0.857828 -0.154983 -0.253608 -2.193755
6.666667 -3.509588 -1.546573 -0.974545 -0.151783 -0.248043 -3.147437
6.700000 -3.514481 -1.554912 -1.097606 -0.148938 -0.242285 -4.001772
6.733333 -3.519315 -1.562988 -1.296594 -0.146403 -0.236386 -4.707703
6.766667 -3.524106 -1.570790 -1.519606 -0.144128 -0.230437 -5.228323
6.800000 -3.528856 -1.578313 -1.808238 -0.142077 -0.224518 -5.562716
6.833333 -3.533570 -1.585555 -2.098760 -0.140230 -0.218694 -5.738594
6.866667 -3.538184 -1.592685 -2.338845 -0.138561 -0.213036 -5.805282
6.900000 -3.542780 -1.599551 -2.642776 -0.137056 -0.207618 -5.806105
6.933333 -3.547285 -1.606305 -2.829980 -0.135691 -0.202506 -5.763026
6.966667 -3.551702 -1.612949 -2.908361 -0.134461 -0.197723 -5.672344
7.000000 -3.556140 -1.619375 -2.985493 -0.133355 -0.193276 -5.508663
7.033333 -3.560498 -1.625692 -3.002472 -0.132359 -0.189149 -5.249884
7.066667 -3.564876 -1.631809 3.136641 -0.131462 -0.185325 -4.842405
7.100000 -3.569235 -1.637843 2.849940 -0.130650 -0.181756 -4.244345
7.133333 -3.573580 -1.643797 2.522560 -0.129908 -0.178393 -3.432509
7.166667 -3.577917 -1.649671 2.261795 -0.129198 -0.175200 -2.403060
7.200000 -3.582194 -1.655441 1.979760 -0.128515 -0.172136 -1.178310
7.233333 -3.586480 -1.661130 1.812938 -0.127865 -0.169176 0.217670
7.266667 -3.590713 -1.666717 1.820826 -0.127282 -0.166278 1.704964
7.300000 -3.594985 -1.672226 1.994697 -0.126802 -0.163417 3.175816
7.333333 -3.599210 -1.677635 2.306727 -0.126468 -0.160572 4.523443
7.366667 -3.603391 -1.682944 2.627167 -0.126353 -0.157727 5.646173
7.400000 -3.607532 -1.688155 3.002817 -0.126499 -0.154874 6.458297
7.433333 -3.611635 -1.693268 -2.896345 -0.126926 -0.152007 6.900626
7.466667 -3.615705 -1.698285 -2.610116 -0.127624 -0.149129 6.977081
7.500000 -3.619744 -1.703207 -2.256662 -0.128593 -0.146245 6.732141
7.533333 -3.623945 -1.708031 -1.989346 -0.129811 -0.143358 6.236936
7.566667 -3.628303 -1.712761 -1.799950 -0.131218 -0.140471 5.566379
7.600000 -3.632819 -1.717396 -1.669656 -0.132740 -0.137596 4.809174
7.633333 -3.637314 -1.721940 -1.584520 -0.134313 -0.134740 4.043388
7.666667 -3.641792 -1.726395 -1.521766 -0.135883 -0.131917 3.312208
7.700000 -3.646392 -1.730740 -1.445197 -0.137375 -0.129139 2.654240
7.733333 -3.651087 -1.734972 -1.388516 -0.138745 -0.126421 2.086350
7.766667 -3.655770 -1.739119 -1.339739 -0.139985 -0.123778 1.618214
7.800000 -3.660513 -1.743167 -1.281384 -0.141119 -0.121221 1.238570
7.833333 -3.665248 -1.747133 -1.242356 -0.142172 -0.118762 0.931927
7.866667 -3.669977 -1.751017 -1.233651 -0.143173 -0.116415 0.688765
7.900000 -3.674746 -1.754830 -1.247262 -0.144170 -0.114184 0.496691
7.933333 -3.679561 -1.758578 -1.239809 -0.145207 -0.112072 0.344703
7.966667 -3.684374 -1.762249 -1.244576 -0.146318 -0.110080 0.223410
8.000000 -3.689257 -1.765868 -1.241737 -0.147525 -0.108206 0.132818
8.033333 -3.694140 -1.769411 -1.242000 -0.148863 -0.106452 0.070492
8.066667 -3.699111 -1.772915 -1.250890 -0.150350 -0.104812 0.032107
8.100000 -3.704086 -1.776347 -1.248141 -0.151995 -0.103284 -0.002136
8.133333 -3.709170 -1.779752 -1.251635 -0.153783 -0.101856 -0.051853
8.166667 -3.714259 -1.783088 -1.243056 -0.155716 -0.100528 -0.139712
8.200000 -3.719474 -1.786405 -1.240562 -0.157792 -0.099296 -0.287586
8.233333 -3.724696 -1.789655 -1.242102 -0.159980 -0.098145 -0.512767
8.266667 -3.730064 -1.792900 -1.239232 -0.162279 -0.097070 -0.828614
8.300000 -3.735439 -1.796079 -1.245729 -0.164684 -0.096069 -1.225650
8.333333 -3.740978 -1.799263 -1.243670 -0.167204 -0.095142 -1.682736
8.366667 -3.746691 -1.802458 -1.244151 -0.169796 -0.094269 -2.168187
8.400000 -3.752411 -1.805590 -1.257449 -0.172431 -0.093440 -2.650080
8.433333 -3.758138 -1.808661 -1.391312 -0.175108 -0.092654 -3.089584
8.466667 -3.763872 -1.811671 -1.573804 -0.177820 -0.091916 -3.445389
8.500000 -3.769816 -1.814705 -1.794662 -0.180559 -0.091229 -3.681261
8.533333 -3.775970 -1.817763 -1.994357 -0.183317 -0.090598 -3.780060
8.566667 -3.782130 -1.820762 -2.173385 -0.186139 -0.090052 -3.731688
8.600000 -3.788500 -1.823787 -2.333431 -0.189026 -0.089602 -3.536485
8.633333 -3.794872 -1.826756 -2.511499 -0.191951 -0.089241 -3.213082
8.666667 -3.801246 -1.829667 -2.609187 -0.194858 -0.088949 -2.795655
8.700000 -3.807620 -1.832524 -2.686594 -0.197705 -0.088704 -2.328950
8.733333 -3.814192 -1.835420 -2.720395 -0.200451 -0.088486 -1.848577
8.766667 -3.820949 -1.838359 -2.743068 -0.203011 -0.088251 -1.391760
8.800000 -3.827877 -1.841340 -2.751261 -0.205332 -0.087966 -0.985314
8.833333 -3.834954 -1.844357 -2.743822 -0.207363 -0.087604 -0.650962
8.866667 -3.842023 -1.847320 -2.758354 -0.209064 -0.087144 -0.388463
8.900000 -3.849197 -1.850307 -2.740607 -0.210379 -0.086561 -0.196250
8.933333 -3.856357 -1.853239 -2.743555 -0.211262 -0.085832 -0.065263
8.966667 -3.863500 -1.856117 -2.745333 -0.211710 -0.084957 0.016591
9.000000 -3.870624 -1.858941 -2.741624 -0.211723 -0.083940 0.060496
9.033333 -3.877726 -1.861711 -2.727798 -0.211336 -0.082799 0.083135
9.066667 -3.884831 -1.864464 -2.718851 -0.210586 -0.081548 0.087251
9.100000 -3.891909 -1.867163 -2.717750 -0.209540 -0.080211 0.086127
9.133333 -3.898946 -1.869828 -2.713011 -0.208252 -0.078810 0.083113
9.166667 -3.905923 -1.872452 -2.724858 -0.206749 -0.077350 0.082320
9.200000 -3.912822 -1.875027 -2.708017 -0.205047 -0.075832 0.082679
9.233333 -3.919631 -1.877549 -2.717283 -0.203139 -0.074241 0.090016
9.266667 -3.926399 -1.880016 -2.711175 -0.201016 -0.072574 0.126385
9.300000 -3.933124 -1.882427 -2.717078 -0.198642 -0.070813 0.216201
9.333333 -3.939698 -1.884766 -2.710392 -0.195973 -0.068946 0.390086
9.366667 -3.946224 -1.887049 -2.711216 -0.192991 -0.066967 0.680336
9.400000 -3.952699 -1.889275 -2.708035 -0.189689 -0.064880 1.121806
9.433333 -3.959121 -1.891445 -2.692768 -0.186072 -0.062697 1.727666
9.466667 -3.965488 -1.893559 -2.672469 -0.182142 -0.060426 2.469918
9.500000 -3.971625 -1.895570 -2.667025 -0.177946 -0.058087 3.294407
9.533333 -3.977523 -1.897476 -2.669963 -0.173546 -0.055710 4.137488
9.566667 -3.983174 -1.899270 -2.619366 -0.169000 -0.053322 4.924218
9.600000 -3.988761 -1.901007 -2.391479 -0.164342 -0.050946 5.568883
9.633333 -3.994105 -1.902637 -2.049076 -0.159628 -0.048608 5.991336
9.666667 -3.999204 -1.904166 -1.652875 -0.154929 -0.046340 6.149960
9.700000 -4.004235 -1.905637 -1.227411 -0.150263 -0.044159 6.028089
9.733333 -4.009196 -1.907051 -0.848527 -0.145628 -0.042073 5.621658
9.766667 -4.013929 -1.908392 -0.540824 -0.141024 -0.040082 4.949266
