t x y theta dxdt dydt dthetadt
0.000000 0.000000 0.000000 0.380867 0.003673 0.002323 0.004494
0.033333 -0.000340 0.000191 0.384420 0.006585 0.003003 0.006880
0.066667 -0.000147 0.000295 0.381802 0.011092 0.003999 0.015044
0.100000 -0.000172 0.000444 0.375717 0.017719 0.005449 0.038292
0.133333 0.000370 0.000503 0.382465 0.027039 0.007445 0.079687
0.166667 0.000874 0.000492 0.386348 0.039879 0.010104 0.147229
0.200000 0.001417 0.000605 0.384316 0.057397 0.013599 0.248111
0.233333 0.002256 0.000820 0.385527 0.080454 0.018007 0.386972
0.266667 0.003443 0.001182 0.385529 0.109782 0.023338 0.559088
0.300000 0.005615 0.001844 0.394496 0.146302 0.029747 0.753245
0.333333 0.008461 0.002397 0.377477 0.191210 0.037555 0.966646
0.366667 0.013345 0.003435 0.400795 0.244794 0.046927 1.192327
0.400000 0.021402 0.005511 0.455974 0.306369 0.057808 1.420892
0.433333 0.030175 0.007463 0.559222 0.375539 0.070382 1.639229
0.466667 0.039676 0.009283 0.624973 0.451551 0.084779 1.843800
0.500000 0.054529 0.011733 0.706297 0.532749 0.100838 2.029354
0.533333 0.074525 0.014816 0.774697 0.616487 0.118014 2.188402
0.566667 0.095263 0.017744 0.867781 0.700722 0.135812 2.311331
0.600000 0.120516 0.022093 0.930727 0.783921 0.153846 2.393661
0.633333 0.150299 0.027959 1.022630 0.863902 0.171069 2.436188
0.666667 0.184507 0.035397 1.086306 0.938269 0.186254 2.432295
0.700000 0.219430 0.042632 1.187291 1.005759 0.198249 2.379407
0.733333 0.255054 0.049650 1.274731 1.066174 0.206063 2.273054
0.766667 0.293644 0.058381 1.384621 1.119306 0.208600 2.112933
0.800000 0.334385 0.067763 1.476013 1.165427 0.204749 1.901006
0.833333 0.375773 0.076883 1.550845 1.205598 0.194201 1.640329
0.866667 0.417795 0.085446 1.631783 1.241626 0.177048 1.340650
0.900000 0.459747 0.092365 1.687394 1.274853 0.153760 1.016491
0.933333 0.502281 0.098978 1.690665 1.306219 0.125059 0.686770
0.966667 0.545610 0.103150 1.713544 1.336685 0.092342 0.372289
1.000000 0.589478 0.106990 1.686147 1.366794 0.057257 0.091386
1.033333 0.634710 0.108539 1.660313 1.396772 0.021330 -0.139984
1.066667 0.680656 0.107734 1.638496 1.426520 -0.013940 -0.312430
1.100000 0.729128 0.105102 1.592131 1.455690 -0.047347 -0.421337
1.133333 0.780125 0.100732 1.555460 1.483780 -0.077742 -0.472221
1.166667 0.831530 0.095996 1.522277 1.510108 -0.104770 -0.473455
1.200000 0.883313 0.090889 1.512395 1.534115 -0.128355 -0.440652
1.233333 0.935445 0.085409 1.495131 1.555335 -0.148924 -0.391342
1.266667 0.987896 0.079556 1.494366 1.573369 -0.167333 -0.338119
1.300000 1.041278 0.073780 1.491833 1.588231 -0.184640 -0.296120
1.333333 1.094918 0.067626 1.488030 1.600272 -0.202252 -0.274802
1.366667 1.149343 0.061465 1.506676 1.610012 -0.221316 -0.280853
1.400000 1.203963 0.054919 1.506954 1.617833 -0.242804 -0.312279
1.433333 1.258309 0.047632 1.497054 1.623949 -0.267336 -0.363581
1.466667 1.312786 0.039958 1.495386 1.628506 -0.295122 -0.431589
1.500000 1.366241 0.030933 1.467128 1.631700 -0.326131 -0.504860
1.533333 1.420595 0.020502 1.445166 1.633513 -0.359896 -0.573455
1.566667 1.475521 0.008350 1.414516 1.633898 -0.395680 -0.628261
1.600000 1.530753 -0.005599 1.397612 1.632788 -0.432923 -0.665868
1.633333 1.585874 -0.020984 1.359262 1.630279 -0.470961 -0.687142
1.666667 1.640782 -0.038158 1.316009 1.626508 -0.509131 -0.688000
1.700000 1.695483 -0.056702 1.289663 1.621097 -0.546779 -0.674454
1.733333 1.750055 -0.075596 1.266108 1.613744 -0.583830 -0.652883
1.766667 1.803367 -0.095928 1.250942 1.604278 -0.620455 -0.630219
1.800000 1.856486 -0.116588 1.232952 1.592710 -0.656642 -0.611058
1.833333 1.909909 -0.139815 1.233907 1.578942 -0.692435 -0.592532
1.866667 1.963075 -0.163344 1.217315 1.562853 -0.728110 -0.581217
1.900000 2.015956 -0.187162 1.201108 1.544595 -0.764134 -0.576097
1.933333 2.067719 -0.213748 1.189534 1.524421 -0.800104 -0.570150
1.966667 2.119134 -0.240589 1.143640 1.502356 -0.835691 -0.562569
2.000000 2.170171 -0.267667 1.132896 1.478337 -0.870655 -0.548931
2.033333 2.218536 -0.297183 1.128645 1.452585 -0.904857 -0.534797
2.066667 2.265862 -0.330337 1.078718 1.425386 -0.937755 -0.513112
2.100000 2.312727 -0.363661 1.054265 1.397296 -0.968345 -0.489245
2.133333 2.359105 -0.397131 1.015590 1.368292 -0.996404 -0.470765
2.166667 2.404971 -0.430723 1.041172 1.338127 -1.021633 -0.457206
2.200000 2.450301 -0.464410 1.026993 1.306555 -1.043732 -0.452937
2.233333 2.492369 -0.501558 1.037939 1.272923 -1.062241 -0.455747
2.266667 2.533854 -0.538745 1.052531 1.236279 -1.077214 -0.476311
2.300000 2.574735 -0.575943 0.983314 1.195293 -1.088867 -0.501150
2.333333 2.614992 -0.613124 0.978929 1.149441 -1.097023 -0.525955
2.366667 2.654605 -0.650257 0.964733 1.098745 -1.101410 -0.543791
2.400000 2.693555 -0.687314 0.971813 1.043157 -1.101614 -0.549654
2.433333 2.731822 -0.724266 0.915125 0.982738 -1.097574 -0.533175
2.466667 2.764593 -0.762019 0.864339 0.918308 -1.088812 -0.478787
2.500000 2.792881 -0.799725 0.858140 0.851255 -1.074863 -0.400018
2.533333 2.820446 -0.837232 0.824937 0.782631 -1.055113 -0.295620
2.566667 2.844723 -0.873713 0.817903 0.713500 -1.028862 -0.172998
2.600000 2.865873 -0.909207 0.815996 0.645277 -0.995765 -0.034532
2.633333 2.884404 -0.942908 0.816898 0.579663 -0.955300 0.104963
2.666667 2.901437 -0.975943 0.813838 0.517608 -0.907422 0.228739
2.700000 2.916700 -1.007680 0.842632 0.459596 -0.852380 0.339416
2.733333 2.930316 -1.037311 0.865341 0.406250 -0.791119 0.430396
2.766667 2.942489 -1.064558 0.907062 0.358023 -0.725202 0.498734
2.800000 2.952807 -1.089318 0.953092 0.315062 -0.656166 0.538632
2.833333 2.961646 -1.110793 0.957012 0.277211 -0.585966 0.552983
2.866667 2.968996 -1.128383 0.953562 0.244550 -0.516536 0.549224
2.900000 2.974915 -1.141539 0.975417 0.217078 -0.450064 0.529286
2.933333 2.980164 -1.154237 0.995231 0.194569 -0.388158 0.497547
2.966667 2.984681 -1.162911 1.033170 0.176505 -0.332122 0.456847
3.000000 2.988555 -1.171122 1.039242 0.162206 -0.282838 0.416877
3.033333 2.993071 -1.176880 1.049603 0.150907 -0.240697 0.376914
3.066667 2.996967 -1.182178 1.051326 0.141768 -0.205542 0.336776
3.100000 3.002206 -1.186911 1.072478 0.133853 -0.176463 0.296693
3.133333 3.007823 -1.191950 1.076760 0.126221 -0.152625 0.258348
3.166667 3.012849 -1.196539 1.091045 0.118138 -0.132788 0.225049
3.200000 3.017294 -1.200678 1.098303 0.109060 -0.115972 0.190535
3.233333 3.021165 -1.204372 1.096335 0.098741 -0.101121 0.159999
3.266667 3.024473 -1.207623 1.096977 0.087002 -0.087481 0.131174
3.300000 3.027253 -1.210217 1.098934 0.074016 -0.074640 0.107038
3.333333 3.029489 -1.212376 1.116116 0.060125 -0.062311 0.081956
3.366667 3.031190 -1.214104 1.101487 0.045529 -0.050457 0.051445
3.400000 3.032367 -1.215406 1.113288 0.030406 -0.038979 0.007777
3.433333 3.033030 -1.216287 1.108025 0.014614 -0.027737 -0.062406
3.466667 3.033189 -1.216752 1.115100 -0.001981 -0.016551 -0.169286
3.500000 3.032855 -1.216806 1.117724 -0.019607 -0.005192 -0.322645
3.533333 3.032210 -1.216815 1.113805 -0.038584 0.006660 -0.518633
3.566667 3.031310 -1.216646 1.113802 -0.058957 0.019288 -0.751516
3.600000 3.029928 -1.216317 1.096686 -0.080753 0.032959 -0.998728
3.633333 3.027701 -1.215721 1.105393 -0.103377 0.047918 -1.237081
3.666667 3.025035 -1.214741 1.079683 -0.125960 0.064664 -1.438735
3.700000 3.020187 -1.213029 1.023932 -0.147521 0.083634 -1.588074
3.733333 3.014925 -1.210944 0.909537 -0.167053 0.105203 -1.672447
3.766667 3.007181 -1.206441 0.772896 -0.183485 0.129564 -1.683882
3.800000 2.999055 -1.201580 0.612188 -0.195682 0.156986 -1.621292
3.833333 2.990563 -1.196368 0.537359 -0.203148 0.187326 -1.489983
3.866667 2.981720 -1.190816 0.491034 -0.205998 0.219929 -1.301255
3.900000 2.972544 -1.184933 0.489286 -0.204646 0.254196 -1.061953
3.933333 2.963051 -1.178727 0.501723 -0.199684 0.289483 -0.790701
3.966667 2.955927 -1.168300 0.523990 -0.192442 0.325015 -0.508068
4.000000 2.951807 -1.154267 0.514529 -0.184839 0.359366 -0.243220
4.033333 2.947413 -1.139958 0.484526 -0.178743 0.391100 -0.004515
4.066667 2.942755 -1.125391 0.480021 -0.175759 0.418828 0.200781
4.100000 2.937843 -1.110584 0.476678 -0.177410 0.440973 0.370575
4.133333 2.933579 -1.094136 0.514311 -0.184965 0.455995 0.507970
4.166667 2.929623 -1.076356 0.534311 -0.198823 0.463077 0.620284
4.200000 2.924783 -1.057885 0.552660 -0.218253 0.462374 0.717534
4.233333 2.919726 -1.039257 0.597732 -0.242109 0.454530 0.786511
4.266667 2.912519 -1.021384 0.648864 -0.268670 0.440739 0.822043
4.300000 2.903367 -1.005360 0.692638 -0.295929 0.422692 0.813519
4.333333 2.892072 -0.991145 0.700316 -0.321344 0.402469 0.756024
4.366667 2.879218 -0.978758 0.746118 -0.342537 0.382011 0.636898
4.400000 2.864765 -0.968069 0.767515 -0.357327 0.362976 0.456963
4.433333 2.849361 -0.959296 0.806965 -0.363851 0.346896 0.231409
4.466667 2.833835 -0.950477 0.849309 -0.361142 0.334737 -0.036075
4.500000 2.818206 -0.941623 0.866855 -0.348286 0.326901 -0.333266
4.533333 2.803931 -0.932496 0.841349 -0.325437 0.323156 -0.645454
4.566667 2.791160 -0.922558 0.784677 -0.293171 0.322787 -0.940677
4.600000 2.781021 -0.911037 0.760897 -0.253304 0.324692 -1.206951
4.633333 2.770844 -0.899530 0.716094 -0.207818 0.327467 -1.434709
4.666667 2.765239 -0.887277 0.635512 -0.158698 0.329848 -1.601929
4.700000 2.759614 -0.875069 0.502996 -0.108643 0.330848 -1.692723
4.733333 2.759628 -0.863321 0.429394 -0.060632 0.329902 -1.711830
4.766667 2.759629 -0.851648 0.371827 -0.017265 0.326737 -1.682262
4.800000 2.759615 -0.840062 0.282731 0.019901 0.321462 -1.609198
4.833333 2.763413 -0.829368 0.226991 0.049371 0.314503 -1.505647
4.866667 2.769910 -0.819325 0.196775 0.069980 0.306459 -1.398302
4.900000 2.776380 -0.809410 0.169470 0.081319 0.297908 -1.319178
4.933333 2.782813 -0.799634 0.143354 0.084237 0.289156 -1.275115
4.966667 2.787378 -0.790498 0.121071 0.079608 0.280489 -1.265173
5.000000 2.791893 -0.781522 0.116774 0.068095 0.272056 -1.307580
5.033333 2.793774 -0.772946 0.116919 0.051079 0.263613 -1.407957
5.066667 2.793891 -0.764212 0.065308 0.030593 0.254482 -1.557497
5.100000 2.793944 -0.755665 -0.031370 0.008462 0.243965 -1.738334
5.133333 2.793932 -0.747316 -0.092286 -0.013919 0.231582 -1.944579
5.166667 2.793853 -0.739173 -0.162079 -0.035461 0.216775 -2.159441
5.200000 2.791098 -0.731236 -0.228578 -0.054858 0.198985 -2.349204
5.233333 2.788274 -0.723522 -0.301482 -0.071672 0.177877 -2.490926
5.266667 2.784290 -0.716979 -0.360979 -0.086165 0.153446 -2.576065
5.300000 2.780239 -0.710675 -0.479563 -0.098567 0.125199 -2.596231
5.333333 2.776121 -0.704618 -0.643902 -0.109090 0.091954 -2.534639
5.366667 2.772074 -0.701710 -0.761836 -0.117808 0.052817 -2.396210
5.400000 2.767986 -0.702048 -0.856623 -0.125233 0.007152 -2.194362
5.433333 2.763832 -0.702644 -0.962756 -0.131464 -0.045317 -1.937825
5.466667 2.759613 -0.703497 -1.041767 -0.136525 -0.104586 -1.630522
5.500000 2.755330 -0.704606 -1.063563 -0.140514 -0.169661 -1.292503
5.533333 2.750984 -0.705972 -1.073717 -0.143750 -0.238311 -0.955778
5.566667 2.745428 -0.711058 -1.093433 -0.146151 -0.308865 -0.635936
5.600000 2.739137 -0.720616 -1.100480 -0.147014 -0.379852 -0.342778
5.633333 2.733216 -0.736310 -1.091717 -0.145772 -0.449601 -0.091037
5.666667 2.728557 -0.759608 -1.057432 -0.141931 -0.516101 0.105887
5.700000 2.723831 -0.783105 -1.042134 -0.134967 -0.577835 0.258670
5.733333 2.719037 -0.806774 -1.025189 -0.123946 -0.633500 0.383085
5.766667 2.714178 -0.830592 -1.011632 -0.108515 -0.681085 0.488833
5.800000 2.709252 -0.854532 -0.989645 -0.089019 -0.718573 0.585097
5.833333 2.704261 -0.878569 -0.987888 -0.065735 -0.744942 0.686270
5.866667 2.699204 -0.902677 -0.966837 -0.038804 -0.760156 0.808717
5.900000 2.697493 -0.931249 -0.955131 -0.008653 -0.763824 0.949514
5.933333 2.699799 -0.960539 -0.912683 0.022989 -0.756159 1.097447
5.966667 2.702025 -0.989816 -0.894536 0.054386 -0.738096 1.241706
6.000000 2.704161 -1.019048 -0.871478 0.083673 -0.710888 1.359528
6.033333 2.706199 -1.048205 -0.808323 0.108785 -0.675239 1.427404
6.066667 2.711732 -1.072362 -0.738314 0.127370 -0.632046 1.420010
6.100000 2.719465 -1.092618 -0.678743 0.137636 -0.583111 1.325952
6.133333 2.728299 -1.108496 -0.559292 0.139384 -0.530625 1.147486
6.166667 2.736987 -1.124206 -0.485729 0.132619 -0.476470 0.888592
6.200000 2.744548 -1.136665 -0.391777 0.118575 -0.422270 0.564793
6.233333 2.751932 -1.148924 -0.342972 0.098828 -0.369788 0.202174
6.266667 2.754860 -1.159022 -0.360195 0.075915 -0.320106 -0.167549
6.300000 2.757584 -1.168893 -0.411140 0.052126 -0.273620 -0.515799
6.333333 2.756284 -1.177322 -0.515807 0.029837 -0.229807 -0.814228
6.366667 2.752743 -1.184670 -0.600554 0.011788 -0.188199 -1.042660
6.400000 2.748501 -1.190373 -0.677372 -0.000415 -0.148599 -1.183072
6.433333 2.746128 -1.193957 -0.728209 -0.005507 -0.110982 -1.234570
6.466667 2.743521 -1.197270 -0.754098 -0.003299 -0.075418 -1.213798
6.500000 2.740670 -1.200308 -0.816949 0.006370 -0.042135 -1.137892
6.533333 2.742394 -1.198706 -0.889655 0.022001 -0.012053 -1.032171
6.566667 2.743860 -1.196827 -0.895420 0.040974 0.014026 -0.913466
6.600000 2.745053 -1.194673 -0.898637 0.060447 0.035778 -0.797755
6.633333 2.745964 -1.192244 -0.864540 0.077908 0.053377 -0.703482
6.666667 2.749670 -1.188448 -0.860058 0.090694 0.067113 -0.627053
6.700000 2.755431 -1.184277 -0.906433 0.095712 0.077380 -0.575295
6.733333 2.762220 -1.180265 -0.972546 0.091009 0.085452 -0.546344
6.766667 2.768768 -1.177101 -0.973923 0.075616 0.092825 -0.539264
6.800000 2.774733 -1.175197 -1.024676 0.049539 0.100853 -0.551001
6.833333 2.780311 -1.173032 -1.012665 0.012578 0.110764 -0.569947
6.866667 2.785482 -1.170607 -1.025581 -0.034377 0.123625 -0.595067
6.900000 2.785657 -1.167969 -1.020152 -0.089180 0.140296 -0.619955
6.933333 2.780640 -1.164343 -1.027041 -0.148943 0.160791 -0.641170
6.966667 2.775176 -1.160453 -1.060761 -0.210845 0.184562 -0.653783
7.000000 2.765800 -1.155023 -1.076915 -0.272050 0.210613 -0.660661
7.033333 2.753118 -1.147988 -1.140504 -0.329250 0.237458 -0.653958
7.066667 2.738359 -1.139293 -1.173838 -0.379537 0.263461 -0.630162
7.100000 2.721393 -1.128159 -1.179958 -0.421147 0.286932 -0.580811
7.133333 2.703977 -1.116779 -1.212102 -0.453843 0.306685 -0.508898
7.166667 2.685500 -1.103721 -1.245916 -0.477697 0.321818 -0.418090
7.200000 2.666582 -1.090436 -1.262804 -0.493663 0.332059 -0.306511
7.233333 2.647230 -1.076933 -1.289787 -0.503498 0.337756 -0.185995
7.266667 2.630307 -1.064622 -1.249625 -0.509502 0.339701 -0.068754
7.300000 2.612956 -1.052115 -1.244877 -0.513723 0.338997 0.035541
7.333333 2.597068 -1.041153 -1.254553 -0.517965 0.336830 0.130383
7.366667 2.582344 -1.031637 -1.247803 -0.523877 0.334520 0.213940
7.400000 2.567386 -1.022469 -1.226318 -0.532771 0.333238 0.283716
7.433333 2.550977 -1.012769 -1.178487 -0.545604 0.333906 0.335781
7.466667 2.534138 -1.002909 -1.185240 -0.562767 0.337078 0.381918
7.500000 2.514541 -0.991438 -1.181371 -0.584435 0.343060 0.427018
7.533333 2.494520 -0.979820 -1.181406 -0.610001 0.351642 0.467121
7.566667 2.474079 -0.968061 -1.163887 -0.638658 0.362326 0.503247
7.600000 2.453221 -0.956171 -1.156658 -0.669421 0.374438 0.538155
7.633333 2.431951 -0.944155 -1.127655 -0.701260 0.387331 0.580232
7.666667 2.407476 -0.930692 -1.091674 -0.732957 0.400287 0.620638
7.700000 2.382601 -0.917120 -1.070029 -0.763545 0.412727 0.652821
7.733333 2.356218 -0.902781 -1.051257 -0.792250 0.424193 0.676496
7.766667 2.328178 -0.887973 -1.031913 -0.818397 0.434159 0.691987
7.800000 2.298979 -0.872789 -1.017959 -0.841276 0.442123 0.699923
7.833333 2.268888 -0.857181 -0.960850 -0.860073 0.447181 0.696620
7.866667 2.238395 -0.841564 -0.942465 -0.874576 0.448440 0.690208
7.900000 2.208453 -0.826092 -0.920616 -0.884604 0.445018 0.686895
7.933333 2.177679 -0.810284 -0.902548 -0.890402 0.436121 0.693056
7.966667 2.146599 -0.794051 -0.874379 -0.892590 0.421251 0.709359
8.000000 2.115947 -0.778154 -0.870127 -0.892067 0.399945 0.733668
8.033333 2.085602 -0.762754 -0.844891 -0.890108 0.372477 0.766280
8.066667 2.056159 -0.748419 -0.838352 -0.887902 0.339667 0.802853
8.100000 2.027354 -0.736556 -0.821347 -0.886515 0.302470 0.837534
8.133333 1.998293 -0.724717 -0.775459 -0.886768 0.262240 0.861086
8.166667 1.969971 -0.716650 -0.735738 -0.889187 0.220896 0.868794
8.200000 1.942012 -0.712199 -0.703967 -0.894138 0.180921 0.855892
8.233333 1.913818 -0.707781 -0.653666 -0.901619 0.144425 0.821418
8.266667 1.884442 -0.705528 -0.601995 -0.911296 0.113218 0.761459
8.300000 1.853904 -0.704849 -0.574812 -0.922674 0.088842 0.678944
8.333333 1.822637 -0.705135 -0.543169 -0.935206 0.072446 0.579312
8.366667 1.790356 -0.705733 -0.548310 -0.948263 0.064084 0.473325
8.400000 1.757891 -0.706336 -0.535364 -0.961081 0.062775 0.368366
8.433333 1.725253 -0.706938 -0.535288 -0.972993 0.067647 0.272363
8.466667 1.692188 -0.705967 -0.520806 -0.983500 0.077485 0.193009
8.500000 1.659416 -0.703034 -0.537309 -0.992417 0.090933 0.135328
8.533333 1.625704 -0.697794 -0.539855 -0.999603 0.106412 0.103448
8.566667 1.591874 -0.692534 -0.544494 -1.005101 0.122768 0.091080
8.600000 1.557941 -0.687255 -0.540325 -1.009081 0.139365 0.097816
8.633333 1.523917 -0.681955 -0.540320 -1.011732 0.155355 0.118750
8.666667 1.489818 -0.676632 -0.539816 -1.013347 0.170214 0.152243
8.700000 1.455655 -0.671287 -0.527282 -1.013981 0.183708 0.191751
8.733333 1.421443 -0.665918 -0.521775 -1.013782 0.196064 0.233193
8.766667 1.387477 -0.659283 -0.506040 -1.012808 0.207431 0.275358
8.800000 1.354317 -0.651920 -0.500665 -1.011242 0.217863 0.316191
8.833333 1.320628 -0.643547 -0.494314 -1.009296 0.227459 0.352060
8.866667 1.286943 -0.635154 -0.478190 -1.007088 0.236249 0.380358
8.900000 1.253277 -0.626742 -0.466719 -1.004833 0.244200 0.403564
8.933333 1.219572 -0.617937 -0.448012 -1.002677 0.251059 0.417553
8.966667 1.186263 -0.609165 -0.420625 -1.000826 0.256792 0.421775
9.000000 1.153011 -0.600383 -0.410493 -0.999204 0.261488 0.415352
9.033333 1.119830 -0.591595 -0.403599 -0.997712 0.265379 0.401408
9.066667 1.086731 -0.582801 -0.378598 -0.996250 0.268695 0.379061
9.100000 1.054300 -0.573997 -0.362842 -0.994809 0.271654 0.346668
9.133333 1.021113 -0.564936 -0.345606 -0.993369 0.274556 0.310340
9.166667 0.987667 -0.555651 -0.343745 -0.991850 0.277573 0.274752
9.200000 0.954354 -0.546373 -0.330536 -0.990346 0.280844 0.241426
9.233333 0.920962 -0.536908 -0.323448 -0.988981 0.284410 0.209702
9.266667 0.887730 -0.527457 -0.333932 -0.987919 0.288376 0.185488
9.300000 0.854847 -0.517897 -0.329205 -0.987103 0.292819 0.171546
9.333333 0.822223 -0.508170 -0.320422 -0.986514 0.297725 0.166456
9.366667 0.790000 -0.498260 -0.312413 -0.986176 0.303074 0.164550
9.400000 0.757991 -0.488381 -0.313452 -0.986068 0.308788 0.166050
9.433333 0.725252 -0.478310 -0.320536 -0.986050 0.314785 0.171367
9.466667 0.692130 -0.467766 -0.307834 -0.985934 0.320866 0.174229
9.500000 0.658957 -0.457028 -0.295235 -0.985604 0.326853 0.173369
9.533333 0.625802 -0.445885 -0.278304 -0.984909 0.332606 0.168475
9.566667 0.592590 -0.434600 -0.272417 -0.983655 0.338012 0.164368
9.600000 0.559200 -0.422585 -0.261185 -0.981612 0.342909 0.158553
9.633333 0.526123 -0.410636 -0.264591 -0.978723 0.347171 0.151570
9.666667 0.493376 -0.398759 -0.252734 -0.974800 0.350599 0.147318
9.700000 0.460973 -0.386961 -0.268613 -0.969726 0.353024 0.149653
9.733333 0.428928 -0.375248 -0.258180 -0.963395 0.354287 0.159387
9.766667 0.397256 -0.363628 -0.263859 -0.955563 0.354065 0.176500
9.800000 0.364988 -0.351428 -0.256937 -0.946013 0.352156 0.205067
9.833333 0.333122 -0.339333 -0.252985 -0.934450 0.348342 0.242864
9.866667 0.301464 -0.327033 -0.229094 -0.920808 0.342616 0.285755
9.900000 0.269963 -0.314781 -0.223901 -0.904604 0.334748 0.327947
9.933333 0.239085 -0.302925 -0.223360 -0.885010 0.324329 0.366451
9.966667 0.208670 -0.291203 -0.216274 -0.861533 0.311275 0.398583
10.000000 0.180013 -0.280957 -0.190929 -0.833898 0.295641 0.419866
10.033333 0.151846 -0.270858 -0.169685 -0.801453 0.277368 0.429000
10.066667 0.124181 -0.260912 -0.138659 -0.763479 0.256342 0.426515
10.100000 0.099048 -0.253114 -0.122074 -0.720018 0.233008 0.410000
10.133333 0.074439 -0.245478 -0.099122 -0.671812 0.208147 0.377894
10.166667 0.050362 -0.238008 -0.102251 -0.619356 0.182422 0.329980
10.200000 0.026829 -0.230707 -0.095271 -0.562854 0.156217 0.269864
10.233333 0.008285 -0.225983 -0.076675 -0.503654 0.130347 0.201531
10.266667 -0.005390 -0.223710 -0.077771 -0.443447 0.105792 0.131271
10.300000 -0.018513 -0.221611 -0.057698 -0.383574 0.083050 0.065210
10.333333 -0.031086 -0.219684 -0.043317 -0.325043 0.062474 0.008831
10.366667 -0.038499 -0.219307 -0.062316 -0.269405 0.044441 -0.036225
10.400000 -0.045372 -0.219097 -0.072248 -0.218300 0.029442 -0.070980
10.433333 -0.049354 -0.219319 -0.094912 -0.172400 0.017486 -0.091617
10.466667 -0.052814 -0.219702 -0.114545 -0.131605 0.008202 -0.101033
10.500000 -0.054793 -0.219711 -0.116591 -0.095893 0.001283 -0.100045
10.533333 -0.056272 -0.219873 -0.104289 -0.065212 -0.003620 -0.090802
10.566667 -0.057263 -0.220183 -0.111260 -0.038653 -0.007044 -0.073402
10.600000 -0.057779 -0.220637 -0.101906 -0.015497 -0.009508 -0.049254
10.633333 -0.057650 -0.221053 -0.100204 0.004924 -0.011420 -0.026107
10.666667 -0.057217 -0.221357 -0.103575 0.022833 -0.013021 -0.007094
10.700000 -0.056346 -0.221793 -0.113696 0.038511 -0.014422 0.009039
10.733333 -0.054861 -0.222298 -0.114281 0.052131 -0.015700 0.023170
10.766667 -0.052571 -0.222742 -0.102033 0.063354 -0.016805 0.032228
10.800000 -0.049304 -0.223314 -0.094581 0.072079 -0.017727 0.037075
10.833333 -0.045657 -0.224002 -0.103912 0.078031 -0.018369 0.040365
