t x y theta dxdt dydt dthetadt
0.000000 0.000000 0.000000 -0.278970 0.010140 -0.010880 -0.034460
0.033333 0.000514 -0.000447 -0.281723 0.013259 -0.014361 -0.022916
0.066667 0.000920 -0.000878 -0.281321 0.017254 -0.018705 -0.012363
0.100000 0.001245 -0.001298 -0.290565 0.022349 -0.024112 -0.001763
0.133333 0.001820 -0.001949 -0.286086 0.028713 -0.030745 0.011332
0.166667 0.002520 -0.002723 -0.301457 0.036485 -0.038797 0.029276
0.200000 0.003453 -0.003733 -0.290024 0.045783 -0.048575 0.050528
0.233333 0.004587 -0.005009 -0.285619 0.056623 -0.060290 0.071037
0.266667 0.005939 -0.006528 -0.292614 0.068995 -0.074137 0.085268
0.300000 0.007833 -0.008589 -0.291607 0.082639 -0.090339 0.084823
0.333333 0.010493 -0.011350 -0.280416 0.097279 -0.109098 0.061493
0.366667 0.014118 -0.014976 -0.279076 0.112481 -0.130355 0.007460
0.400000 0.017923 -0.018853 -0.260474 0.127871 -0.153975 -0.077906
0.433333 0.022921 -0.023811 -0.246140 0.143051 -0.179808 -0.189740
0.466667 0.028076 -0.029020 -0.237354 0.157654 -0.207723 -0.316783
0.500000 0.034172 -0.035905 -0.234772 0.171505 -0.237323 -0.445678
0.533333 0.040839 -0.045020 -0.238453 0.184490 -0.268120 -0.561471
0.566667 0.047625 -0.054379 -0.267048 0.196699 -0.299857 -0.649121
0.600000 0.054517 -0.063977 -0.332470 0.208147 -0.332109 -0.695246
0.633333 0.061633 -0.076591 -0.385713 0.219048 -0.364428 -0.693525
0.666667 0.068827 -0.089430 -0.454711 0.229616 -0.396399 -0.642399
0.700000 0.076087 -0.102487 -0.507474 0.239929 -0.427669 -0.544394
0.733333 0.084461 -0.118437 -0.531871 0.249942 -0.457905 -0.406470
0.766667 0.092871 -0.134585 -0.529263 0.259547 -0.486724 -0.242922
0.800000 0.101303 -0.150918 -0.520429 0.268590 -0.513732 -0.072717
0.833333 0.111081 -0.169620 -0.489617 0.276506 -0.538429 0.086562
0.866667 0.120851 -0.188481 -0.478570 0.282721 -0.560259 0.223156
0.900000 0.130595 -0.207488 -0.452794 0.286607 -0.578606 0.323552
0.933333 0.141087 -0.228037 -0.428546 0.287729 -0.593129 0.381311
0.966667 0.151923 -0.249580 -0.396381 0.285481 -0.603236 0.399991
1.000000 0.162714 -0.271589 -0.388137 0.279322 -0.608428 0.386610
1.033333 0.173043 -0.293513 -0.360520 0.269239 -0.608586 0.351498
1.066667 0.182551 -0.314875 -0.358781 0.255282 -0.603680 0.299533
1.100000 0.191934 -0.336281 -0.364867 0.237810 -0.593974 0.243170
1.133333 0.201178 -0.357716 -0.361288 0.217138 -0.579490 0.192834
1.166667 0.208172 -0.377103 -0.358958 0.194110 -0.560937 0.154077
1.200000 0.214998 -0.396487 -0.334563 0.169576 -0.539085 0.128111
1.233333 0.219640 -0.414038 -0.338409 0.144421 -0.514857 0.118942
1.266667 0.224093 -0.431558 -0.353906 0.119401 -0.488906 0.128706
1.300000 0.226636 -0.446875 -0.350787 0.095260 -0.461781 0.155948
1.333333 0.228972 -0.462139 -0.358501 0.072747 -0.434213 0.196740
1.366667 0.229834 -0.475084 -0.349311 0.052207 -0.406446 0.245036
1.400000 0.230476 -0.487959 -0.339574 0.033977 -0.378697 0.302589
1.433333 0.230893 -0.500757 -0.335835 0.017986 -0.350678 0.359219
1.466667 0.230694 -0.510998 -0.312771 0.004237 -0.322679 0.409653
1.500000 0.230259 -0.521152 -0.293222 -0.007591 -0.294904 0.446993
1.533333 0.229584 -0.531213 -0.280932 -0.017914 -0.267608 0.464369
1.566667 0.228663 -0.541178 -0.245082 -0.027213 -0.240988 0.460473
1.600000 0.227431 -0.549043 -0.232314 -0.036015 -0.215448 0.429948
1.633333 0.226039 -0.555197 -0.197367 -0.044683 -0.191726 0.371119
1.666667 0.224545 -0.559853 -0.173504 -0.053628 -0.170125 0.277019
1.700000 0.222965 -0.563511 -0.173388 -0.063142 -0.151102 0.142789
1.733333 0.221122 -0.567073 -0.150859 -0.073441 -0.134948 -0.034806
1.766667 0.218996 -0.570225 -0.171477 -0.084683 -0.122118 -0.255015
1.800000 0.216363 -0.573120 -0.163136 -0.096982 -0.112691 -0.515806
1.833333 0.213149 -0.576012 -0.172542 -0.110412 -0.106439 -0.795040
1.866667 0.209277 -0.579098 -0.199022 -0.124976 -0.103070 -1.058413
1.900000 0.205128 -0.582109 -0.214244 -0.140611 -0.102083 -1.273409
1.933333 0.200109 -0.585495 -0.228067 -0.157235 -0.102964 -1.406270
1.966667 0.194812 -0.588813 -0.301620 -0.174771 -0.105120 -1.425821
2.000000 0.189236 -0.592066 -0.419084 -0.193091 -0.108091 -1.306682
2.033333 0.182510 -0.595843 -0.567001 -0.212197 -0.111508 -1.049175
2.066667 0.175507 -0.599560 -0.692417 -0.232167 -0.115163 -0.668287
2.100000 0.167485 -0.603545 -0.797091 -0.253083 -0.118874 -0.178502
2.133333 0.158387 -0.607742 -0.830350 -0.275180 -0.122507 0.392766
2.166667 0.149019 -0.611887 -0.766711 -0.298502 -0.125916 0.998679
2.200000 0.139386 -0.615983 -0.649488 -0.323137 -0.128992 1.592208
2.233333 0.128479 -0.620511 -0.541627 -0.348972 -0.131648 2.134361
2.266667 0.117317 -0.624994 -0.407481 -0.375898 -0.133741 2.588858
2.300000 0.104381 -0.629831 -0.223960 -0.403617 -0.135160 2.918853
2.333333 0.091203 -0.634625 -0.093470 -0.431661 -0.135806 3.110243
2.366667 0.076040 -0.639325 0.009328 -0.459543 -0.135618 3.172435
2.400000 0.060654 -0.643984 0.132797 -0.486796 -0.134546 3.121738
2.433333 0.043308 -0.648681 0.248517 -0.512964 -0.132656 2.976003
2.466667 0.024233 -0.653319 0.330181 -0.537401 -0.130102 2.763156
2.500000 0.004973 -0.657919 0.429970 -0.559751 -0.127120 2.514350
2.533333 -0.014457 -0.662483 0.520342 -0.579702 -0.123974 2.246164
2.566667 -0.034737 -0.666549 0.588684 -0.597179 -0.120957 1.966901
2.600000 -0.055584 -0.670207 0.641546 -0.612028 -0.118371 1.686833
2.633333 -0.076845 -0.673620 0.700613 -0.624285 -0.116435 1.415970
2.666667 -0.098212 -0.677003 0.743750 -0.634266 -0.115366 1.154623
2.700000 -0.119666 -0.680359 0.774637 -0.642198 -0.115418 0.904648
2.733333 -0.141463 -0.683813 0.792196 -0.648328 -0.116735 0.670429
2.766667 -0.163636 -0.687465 0.792337 -0.652846 -0.119366 0.458529
2.800000 -0.185939 -0.691357 0.797686 -0.656022 -0.123428 0.269663
2.833333 -0.208259 -0.695229 0.801990 -0.658056 -0.129170 0.101890
2.866667 -0.230346 -0.699687 0.801707 -0.659040 -0.136660 -0.044499
2.900000 -0.252413 -0.704127 0.789686 -0.659043 -0.145781 -0.173966
2.933333 -0.274441 -0.708548 0.780853 -0.658162 -0.156483 -0.292382
2.966667 -0.296411 -0.712951 0.768398 -0.656512 -0.168971 -0.408988
3.000000 -0.318341 -0.718262 0.743934 -0.654229 -0.183343 -0.530942
3.033333 -0.340324 -0.724649 0.730568 -0.651422 -0.199307 -0.658654
3.066667 -0.362194 -0.731016 0.706781 -0.648162 -0.216745 -0.790488
3.100000 -0.383932 -0.737358 0.696849 -0.644538 -0.235628 -0.926695
3.133333 -0.405449 -0.745373 0.693313 -0.640619 -0.255775 -1.062914
3.166667 -0.426734 -0.755275 0.646866 -0.636405 -0.276471 -1.188818
3.200000 -0.447833 -0.765141 0.591173 -0.631835 -0.296901 -1.293846
3.233333 -0.468727 -0.774964 0.532581 -0.626864 -0.316594 -1.372638
3.266667 -0.489399 -0.784737 0.461289 -0.621241 -0.335081 -1.419483
3.300000 -0.510114 -0.796571 0.398125 -0.614691 -0.351721 -1.423507
3.333333 -0.530900 -0.810579 0.331716 -0.606642 -0.365962 -1.376413
3.366667 -0.551410 -0.824509 0.283440 -0.596283 -0.377711 -1.280223
3.400000 -0.571623 -0.838349 0.236063 -0.582567 -0.386919 -1.141035
3.433333 -0.591523 -0.852087 0.174229 -0.564439 -0.393450 -0.961805
3.466667 -0.611091 -0.865712 0.139453 -0.541075 -0.396964 -0.752362
3.500000 -0.630309 -0.879210 0.125587 -0.511494 -0.397372 -0.524838
3.533333 -0.649158 -0.892571 0.121620 -0.475302 -0.394836 -0.296088
3.566667 -0.667622 -0.905781 0.108281 -0.432479 -0.389314 -0.075526
3.600000 -0.682946 -0.919489 0.113764 -0.383762 -0.380848 0.129655
3.633333 -0.697854 -0.933023 0.123822 -0.329808 -0.369344 0.308616
3.666667 -0.709243 -0.946282 0.156985 -0.271772 -0.354966 0.455991
3.700000 -0.717127 -0.958854 0.200307 -0.211458 -0.337954 0.565650
3.733333 -0.721435 -0.970406 0.225150 -0.150645 -0.318424 0.640766
3.766667 -0.725291 -0.981737 0.253262 -0.091155 -0.296710 0.680236
3.800000 -0.725909 -0.991673 0.277687 -0.034266 -0.273179 0.686268
3.833333 -0.723611 -1.000115 0.316556 0.018365 -0.248584 0.662952
3.866667 -0.720864 -1.008308 0.340739 0.065834 -0.223567 0.616591
3.900000 -0.715909 -1.014710 0.365046 0.107781 -0.198663 0.555898
3.933333 -0.710514 -1.020847 0.376915 0.144326 -0.174241 0.483164
3.966667 -0.703648 -1.025043 0.391540 0.175597 -0.150668 0.404587
4.000000 -0.696356 -1.028964 0.401951 0.201790 -0.128279 0.326125
4.033333 -0.688647 -1.032605 0.403954 0.223542 -0.107071 0.253580
4.066667 -0.680528 -1.035963 0.423611 0.241178 -0.087075 0.188275
4.100000 -0.672007 -1.039033 0.422166 0.255127 -0.068206 0.131267
4.133333 -0.662458 -1.040534 0.413644 0.265550 -0.050664 0.084192
4.166667 -0.652524 -1.041739 0.420780 0.272902 -0.034396 0.047347
4.200000 -0.642217 -1.042647 0.415911 0.277599 -0.019326 0.017490
4.233333 -0.631904 -1.042659 0.409379 0.279903 -0.005600 -0.008611
4.266667 -0.621819 -1.042013 0.410213 0.280247 0.006670 -0.031611
4.300000 -0.612082 -1.040892 0.402481 0.278950 0.017280 -0.055324
4.333333 -0.602832 -1.039540 0.412096 0.276562 0.026381 -0.085036
4.366667 -0.593963 -1.037999 0.415685 0.273613 0.033970 -0.125101
4.400000 -0.585507 -1.036507 0.415857 0.270624 0.040070 -0.179765
4.433333 -0.576734 -1.034706 0.406762 0.268204 0.044967 -0.251274
4.466667 -0.568283 -1.033225 0.400973 0.266882 0.049030 -0.340275
4.500000 -0.559527 -1.031431 0.396526 0.267056 0.052665 -0.441344
4.533333 -0.550471 -1.029322 0.384095 0.268876 0.056107 -0.545553
4.566667 -0.542349 -1.027940 0.373681 0.272259 0.059730 -0.642586
4.600000 -0.533938 -1.026238 0.356749 0.276857 0.063828 -0.719201
4.633333 -0.525241 -1.024212 0.318790 0.282249 0.068555 -0.765677
4.666667 -0.516263 -1.021861 0.281463 0.287710 0.073895 -0.775525
4.700000 -0.506273 -1.019674 0.232007 0.292368 0.079793 -0.751402
4.733333 -0.496013 -1.017155 0.166879 0.295273 0.086165 -0.696684
4.766667 -0.485487 -1.014302 0.121504 0.295587 0.092742 -0.619660
4.800000 -0.474357 -1.011145 0.091885 0.292736 0.099329 -0.532184
4.833333 -0.463176 -1.007539 0.099739 0.286167 0.105738 -0.446289
4.866667 -0.451745 -1.003590 0.097821 0.275811 0.111941 -0.371898
4.900000 -0.441220 -0.999416 0.116694 0.262218 0.117949 -0.312832
4.933333 -0.432113 -0.995167 0.135621 0.246375 0.123870 -0.274247
4.966667 -0.422769 -0.990566 0.145630 0.229374 0.129938 -0.256271
5.000000 -0.415463 -0.986139 0.156298 0.212609 0.136476 -0.253348
5.033333 -0.410053 -0.981864 0.129783 0.197731 0.143903 -0.255416
5.066667 -0.406157 -0.977676 0.092093 0.186420 0.152663 -0.254468
5.100000 -0.402022 -0.973119 0.058887 0.179798 0.163149 -0.242122
5.133333 -0.398169 -0.968245 0.024027 0.178603 0.175669 -0.207817
5.166667 -0.394102 -0.962779 0.019701 0.183474 0.190486 -0.146739
5.200000 -0.389526 -0.956694 0.018531 0.194365 0.207622 -0.060255
5.233333 -0.383961 -0.950033 0.025144 0.210601 0.226861 0.043943
5.266667 -0.378134 -0.942983 0.026538 0.231002 0.247780 0.158498
5.300000 -0.370862 -0.934961 0.030084 0.254445 0.269929 0.274424
5.333333 -0.362089 -0.925769 0.061069 0.279773 0.292782 0.379179
5.366667 -0.351718 -0.915332 0.082976 0.305619 0.315627 0.466125
5.400000 -0.339723 -0.903596 0.094877 0.330838 0.337750 0.530812
5.433333 -0.327462 -0.891465 0.114783 0.354692 0.358583 0.574046
5.466667 -0.314937 -0.878942 0.144146 0.376665 0.377584 0.596410
5.500000 -0.300959 -0.865181 0.172512 0.396265 0.394150 0.598420
5.533333 -0.286723 -0.851030 0.200806 0.413093 0.407784 0.584858
5.566667 -0.272233 -0.836492 0.224119 0.426894 0.418202 0.558682
5.600000 -0.257493 -0.821568 0.235687 0.437425 0.425336 0.523895
5.633333 -0.242506 -0.806262 0.249887 0.444154 0.429053 0.480118
5.666667 -0.226987 -0.790907 0.276330 0.446347 0.429393 0.429520
5.700000 -0.211110 -0.775837 0.290435 0.443240 0.426713 0.374775
5.733333 -0.195026 -0.761302 0.287558 0.434225 0.421528 0.312898
5.766667 -0.178713 -0.746392 0.302093 0.418733 0.414460 0.236356
5.800000 -0.162676 -0.732174 0.309230 0.396371 0.406289 0.132718
5.833333 -0.147270 -0.718656 0.311966 0.367199 0.398114 -0.005180
5.866667 -0.133008 -0.705801 0.324346 0.331940 0.391048 -0.186138
5.900000 -0.120498 -0.693692 0.334860 0.291869 0.386053 -0.419513
5.933333 -0.110143 -0.682048 0.335453 0.248406 0.384117 -0.705263
5.966667 -0.102348 -0.670659 0.317642 0.203433 0.386110 -1.031615
6.000000 -0.097547 -0.659313 0.315498 0.159127 0.392521 -1.381213
6.033333 -0.095690 -0.647734 0.299770 0.117925 0.403527 -1.737517
6.066667 -0.093586 -0.635750 0.233800 0.081968 0.419241 -2.077984
6.100000 -0.093580 -0.622897 0.140136 0.053236 0.439671 -2.377945
6.133333 -0.095112 -0.608653 -0.009076 0.033341 0.464282 -2.615717
6.166667 -0.097426 -0.592576 -0.150946 0.023614 0.492395 -2.780725
6.200000 -0.099426 -0.576078 -0.279136 0.024724 0.523424 -2.862720
6.233333 -0.101093 -0.559158 -0.414923 0.036398 0.556658 -2.854763
6.266667 -0.101694 -0.539453 -0.524100 0.057957 0.591036 -2.763297
6.300000 -0.101925 -0.519329 -0.604240 0.087972 0.625486 -2.597927
6.333333 -0.101771 -0.498785 -0.699824 0.125245 0.659382 -2.375470
6.366667 -0.098900 -0.476022 -0.774285 0.167838 0.692138 -2.109970
6.400000 -0.092936 -0.451413 -0.822291 0.213851 0.723086 -1.816931
6.433333 -0.083486 -0.425329 -0.882700 0.261583 0.751638 -1.510159
6.466667 -0.073600 -0.398847 -0.928145 0.309883 0.777715 -1.196336
6.500000 -0.059712 -0.371390 -0.959579 0.357964 0.801265 -0.882896
6.533333 -0.045377 -0.343553 -0.995325 0.404819 0.822139 -0.572349
6.566667 -0.030594 -0.315346 -1.020707 0.450397 0.840430 -0.266710
6.600000 -0.015361 -0.286777 -1.030677 0.495098 0.856474 0.033704
6.633333 0.000325 -0.257855 -1.013281 0.539828 0.870784 0.323622
6.666667 0.019908 -0.228426 -0.993371 0.584929 0.883711 0.598289
6.700000 0.039942 -0.198663 -0.953155 0.630915 0.895667 0.856145
6.733333 0.060423 -0.168578 -0.908880 0.678414 0.907156 1.095356
6.766667 0.081348 -0.138180 -0.855411 0.727675 0.918579 1.311977
6.800000 0.105231 -0.107521 -0.800601 0.778704 0.930300 1.501047
6.833333 0.132078 -0.076344 -0.759420 0.831037 0.942569 1.664517
6.866667 0.161748 -0.044744 -0.698066 0.884587 0.955655 1.801661
6.900000 0.194062 -0.012806 -0.628720 0.938992 0.969788 1.912148
6.933333 0.226769 0.019389 -0.550351 0.993625 0.985008 1.989264
6.966667 0.259852 0.051830 -0.478876 1.047674 1.001238 2.030518
7.000000 0.295696 0.084956 -0.414708 1.100472 1.018376 2.037410
7.033333 0.331880 0.118303 -0.345537 1.151912 1.036374 2.007853
7.066667 0.371156 0.153068 -0.244558 1.201584 1.054975 1.940183
7.100000 0.412963 0.188763 -0.163648 1.249421 1.073913 1.835552
7.133333 0.457340 0.225532 -0.083959 1.295636 1.093074 1.703148
7.166667 0.501957 0.262467 -0.025104 1.340805 1.112446 1.551960
7.200000 0.549090 0.300492 0.015798 1.385106 1.131685 1.386666
7.233333 0.596400 0.338649 0.066472 1.428234 1.150391 1.210896
7.266667 0.643854 0.376921 0.080583 1.470335 1.168433 1.041019
7.300000 0.691421 0.415292 0.082320 1.511459 1.185653 0.884763
7.333333 0.742769 0.455788 0.125901 1.551293 1.201589 0.744717
7.366667 0.795808 0.496569 0.151316 1.589048 1.215636 0.624930
7.400000 0.848849 0.537391 0.147140 1.624371 1.227613 0.525210
7.433333 0.903673 0.578753 0.175583 1.656857 1.237226 0.449544
7.466667 0.961312 0.621618 0.180329 1.685562 1.243847 0.388229
7.500000 1.020931 0.664980 0.180104 1.709303 1.246903 0.334915
7.533333 1.080718 0.707511 0.211104 1.727328 1.246173 0.286550
7.566667 1.140286 0.749978 0.200145 1.739169 1.241437 0.237281
7.600000 1.199588 0.792358 0.220839 1.744010 1.232168 0.181159
7.633333 1.258768 0.833950 0.229036 1.741233 1.218035 0.117662
7.666667 1.318154 0.875016 0.218068 1.730546 1.199085 0.046119
7.700000 1.377234 0.915470 0.243642 1.712021 1.175438 -0.035462
7.733333 1.435858 0.955757 0.237936 1.685776 1.147242 -0.123660
7.766667 1.493465 0.994773 0.234738 1.651727 1.114938 -0.221563
7.800000 1.549713 1.032266 0.241349 1.610252 1.079418 -0.325802
7.833333 1.605362 1.069539 0.230314 1.561929 1.041599 -0.446461
7.866667 1.658912 1.104434 0.190551 1.507302 1.002548 -0.588302
7.900000 1.709956 1.137198 0.168736 1.446459 0.963407 -0.751117
7.933333 1.757972 1.167687 0.124881 1.379540 0.925371 -0.940883
7.966667 1.803064 1.196289 0.125170 1.307486 0.889550 -1.159593
8.000000 1.844294 1.223069 0.103308 1.231172 0.856788 -1.407226
8.033333 1.884690 1.249569 0.076892 1.150929 0.827939 -1.673224
8.066667 1.924221 1.275787 0.025257 1.067152 0.803445 -1.947018
8.100000 1.957741 1.301018 -0.036861 0.980952 0.783494 -2.212633
8.133333 1.990344 1.325959 -0.117400 0.893057 0.767933 -2.445729
8.166667 2.022005 1.350606 -0.233621 0.803167 0.756346 -2.610126
8.200000 2.047129 1.375114 -0.354161 0.711004 0.748151 -2.675486
8.233333 2.065852 1.399753 -0.466667 0.617169 0.742486 -2.614080
8.266667 2.083587 1.424090 -0.603336 0.522562 0.738532 -2.401402
8.300000 2.100326 1.448122 -0.733946 0.427548 0.735466 -2.029145
8.333333 2.116063 1.471847 -0.865301 0.332456 0.732474 -1.505475
8.366667 2.126521 1.496322 -0.967506 0.238723 0.728831 -0.858319
8.400000 2.132116 1.521348 -1.042943 0.147434 0.723896 -0.118971
8.433333 2.132994 1.546543 -1.042775 0.059178 0.717113 0.666815
8.466667 2.132874 1.571415 -0.970933 -0.025782 0.707997 1.442655
8.500000 2.128308 1.595717 -0.855857 -0.106825 0.696065 2.155848
8.533333 2.122766 1.619686 -0.744192 -0.182909 0.681043 2.764153
8.566667 2.112802 1.642550 -0.570346 -0.253707 0.662811 3.231643
8.600000 2.101893 1.665074 -0.379742 -0.319075 0.641379 3.531116
8.633333 2.090059 1.687255 -0.195435 -0.379094 0.617074 3.655302
8.666667 2.074563 1.707253 -0.027186 -0.433528 0.590355 3.616698
8.700000 2.058184 1.726903 0.128961 -0.482634 0.561891 3.438704
8.733333 2.040947 1.746206 0.251913 -0.526837 0.532394 3.144651
8.766667 2.021451 1.763198 0.351514 -0.566530 0.502713 2.770190
8.800000 2.001147 1.779842 0.425109 -0.601791 0.473628 2.351423
8.833333 1.979523 1.794653 0.475325 -0.632465 0.445837 1.919667
8.866667 1.956752 1.807971 0.526897 -0.658887 0.419948 1.498313
8.900000 1.933258 1.820069 0.555052 -0.681153 0.396539 1.104759
8.933333 1.909069 1.831837 0.583801 -0.699266 0.376173 0.752162
8.966667 1.884215 1.843281 0.593383 -0.713464 0.358984 0.447050
9.000000 1.859823 1.854151 0.587813 -0.724079 0.345124 0.189835
9.033333 1.834825 1.864711 0.580143 -0.731456 0.334590 -0.026514
9.066667 1.809250 1.874966 0.563263 -0.735840 0.327243 -0.206382
9.100000 1.784814 1.885457 0.540936 -0.737623 0.322750 -0.353286
9.133333 1.759860 1.895657 0.525680 -0.737385 0.320724 -0.466190
9.166667 1.734415 1.905573 0.502804 -0.735447 0.320986 -0.551227
9.200000 1.710024 1.916173 0.485678 -0.732078 0.323226 -0.612637
9.233333 1.685198 1.926501 0.459828 -0.727666 0.327072 -0.645693
9.266667 1.661524 1.937587 0.426898 -0.722768 0.332054 -0.652568
9.300000 1.637469 1.948409 0.416642 -0.717604 0.337959 -0.640527
9.333333 1.613058 1.958973 0.400189 -0.712409 0.344415 -0.618698
9.366667 1.589322 1.970423 0.336666 -0.707505 0.350956 -0.585466
9.400000 1.566436 1.982719 0.303605 -0.703109 0.357269 -0.542503
9.433333 1.543270 1.994765 0.294868 -0.699338 0.363211 -0.497302
9.466667 1.520728 2.008009 0.308530 -0.696021 0.368847 -0.454537
9.500000 1.497953 2.021006 0.294298 -0.693232 0.374011 -0.410073
9.533333 1.474968 2.033758 0.293383 -0.690968 0.378712 -0.362677
9.566667 1.451798 2.046265 0.285651 -0.689050 0.383198 -0.319528
9.600000 1.428463 2.058528 0.262960 -0.687296 0.387734 -0.278920
9.633333 1.405640 2.071659 0.246733 -0.685587 0.392371 -0.238301
9.666667 1.382699 2.084546 0.240244 -0.683805 0.397187 -0.191906
9.700000 1.359662 2.097188 0.233227 -0.681775 0.402349 -0.142110
9.733333 1.336991 2.110326 0.223422 -0.679368 0.407858 -0.087285
9.766667 1.314460 2.124129 0.216827 -0.676549 0.413486 -0.024371
9.800000 1.291982 2.138459 0.211091 -0.673333 0.418863 0.043148
9.833333 1.269496 2.152537 0.220943 -0.669645 0.423819 0.111541
9.866667 1.247085 2.167004 0.225825 -0.665486 0.428075 0.175328
9.900000 1.224781 2.181778 0.236308 -0.660742 0.431316 0.231512
9.933333 1.202675 2.196759 0.264406 -0.655233 0.433365 0.275503
9.966667 1.180865 2.211837 0.264952 -0.648635 0.434133 0.307205
10.000000 1.159153 2.226641 0.278619 -0.640677 0.433641 0.322866
10.033333 1.137558 2.241165 0.297241 -0.630962 0.431860 0.323479
10.066667 1.116102 2.255404 0.308591 -0.619085 0.428869 0.308111
10.100000 1.095033 2.269819 0.318650 -0.604719 0.424780 0.279673
10.133333 1.074620 2.284300 0.349430 -0.587594 0.419690 0.240854
10.166667 1.054404 2.298478 0.345917 -0.567567 0.413711 0.190763
10.200000 1.034403 2.312347 0.344727 -0.544310 0.406871 0.138572
10.233333 1.016054 2.326016 0.346465 -0.517946 0.399171 0.088141
10.266667 0.997954 2.339364 0.355982 -0.488607 0.390558 0.044994
10.300000 0.982102 2.352334 0.370476 -0.456774 0.381038 0.009872
10.333333 0.966530 2.364971 0.361352 -0.422772 0.370575 -0.013553
10.366667 0.953232 2.377396 0.348401 -0.387231 0.359067 -0.023047
10.400000 0.940238 2.389477 0.316243 -0.351066 0.346427 -0.020375
10.433333 0.929542 2.401136 0.318114 -0.314955 0.332534 -0.007034
10.466667 0.919170 2.412440 0.322846 -0.279574 0.317271 0.015107
10.500000 0.911136 2.423095 0.319871 -0.245329 0.300417 0.046495
10.533333 0.905283 2.432842 0.346647 -0.213040 0.281832 0.083077
10.566667 0.899772 2.442217 0.344947 -0.183186 0.261470 0.122721
10.600000 0.894605 2.451217 0.339777 -0.156130 0.239390 0.155116
10.633333 0.889786 2.459840 0.355551 -0.132027 0.215775 0.179422
10.666667 0.886366 2.467340 0.356982 -0.111116 0.190874 0.194741
10.700000 0.883934 2.473584 0.357945 -0.093437 0.165106 0.194903
10.733333 0.882103 2.478557 0.383350 -0.078559 0.138939 0.179309
10.766667 0.880662 2.482279 0.391942 -0.066124 0.112843 0.147261
10.800000 0.879572 2.485615 0.388386 -0.055753 0.087210 0.107963
10.833333 0.878363 2.487703 0.401525 -0.047247 0.062322 0.053094
10.866667 0.876933 2.488665 0.426816 -0.040262 0.038280 -0.026755
10.900000 0.875229 2.488654 0.426816 -0.034588 0.014916 -0.133528
10.933333 0.873876 2.488268 0.385094 -0.030269 -0.008220 -0.267616
10.966667 0.872872 2.487510 0.407661 -0.027256 -0.031592 -0.427606
11.000000 0.872219 2.486387 0.396416 -0.025500 -0.055665 -0.612241
11.033333 0.871915 2.484901 0.354286 -0.024904 -0.080810 -0.801942
11.066667 0.871962 2.483058 0.358999 -0.025395 -0.107225 -0.992020
11.100000 0.871550 2.479801 0.348673 -0.026918 -0.134806 -1.169768
11.133333 0.871488 2.476198 0.324927 -0.029348 -0.163130 -1.327814
11.166667 0.871035 2.470844 0.245056 -0.032667 -0.191680 -1.462231
11.200000 0.869983 2.463741 0.140388 -0.036830 -0.219839 -1.570998
11.233333 0.868224 2.454801 0.014756 -0.041729 -0.246944 -1.656061
11.266667 0.865692 2.444190 -0.071561 -0.047194 -0.272275 -1.682711
11.300000 0.863517 2.433284 -0.071561 -0.053012 -0.295337 -1.648034
11.333333 0.861701 2.422096 -0.071561 -0.058869 -0.315786 -1.551043
11.366667 0.860249 2.410639 -0.071561 -0.064281 -0.333572 -1.385625
11.400000 0.859163 2.398927 -0.257800 -0.068818 -0.348847 -1.139191
11.433333 0.857167 2.386785 -0.323846 -0.071977 -0.361979 -0.815357
11.466667 0.854392 2.374626 -0.327596 -0.073206 -0.373608 -0.450664
11.500000 0.850761 2.362159 -0.386581 -0.071892 -0.384291 -0.044398
11.533333 0.846908 2.349268 -0.424298 -0.067331 -0.394560 0.402438
11.566667 0.843382 2.335786 -0.396025 -0.058894 -0.404643 0.876226
11.600000 0.840253 2.322137 -0.317778 -0.045803 -0.414607 1.335021
11.633333 0.837529 2.308334 -0.268617 -0.027684 -0.424368 1.754192
11.666667 0.835215 2.294393 -0.172182 -0.004550 -0.433647 2.129022
11.700000 0.834407 2.279449 -0.034480 0.023402 -0.442050 2.422759
11.733333 0.834020 2.264398 0.052986 0.055728 -0.449159 2.611502
11.766667 0.835688 2.248728 0.209246 0.091728 -0.454584 2.676795
11.800000 0.839473 2.232701 0.287075 0.130418 -0.457940 2.637345
11.833333 0.843685 2.216616 0.390702 0.171183 -0.458747 2.503002
11.866667 0.849997 2.200403 0.513822 0.213503 -0.456558 2.278071
11.900000 0.858476 2.184320 0.633189 0.256756 -0.451204 1.993584
11.933333 0.868902 2.168990 0.688579 0.300202 -0.442507 1.668750
11.966667 0.879740 2.153668 0.732850 0.343445 -0.430400 1.336154
12.000000 0.890985 2.138370 0.771293 0.386261 -0.414997 1.004574
12.033333 0.904077 2.123836 0.744028 0.428051 -0.396732 0.693833
12.066667 0.919168 2.109896 0.769908 0.468452 -0.376008 0.419792
12.100000 0.935797 2.097199 0.749203 0.507326 -0.353170 0.188377
12.133333 0.954200 2.085752 0.732079 0.544622 -0.328794 0.001155
12.166667 0.974492 2.075939 0.721841 0.579946 -0.303642 -0.148645
12.200000 0.995122 2.066226 0.699042 0.612908 -0.278289 -0.257431
12.233333 1.016073 2.056623 0.698239 0.643494 -0.253059 -0.338247
12.266667 1.038437 2.048960 0.700147 0.671567 -0.228464 -0.398949
12.300000 1.062420 2.043003 0.690400 0.696929 -0.204963 -0.450569
12.333333 1.086671 2.037177 0.667146 0.719586 -0.182730 -0.494120
12.366667 1.111169 2.031485 0.654898 0.739828 -0.161676 -0.534172
12.400000 1.136977 2.027067 0.637265 0.757798 -0.141945 -0.578418
12.433333 1.162992 2.022792 0.612323 0.773457 -0.123711 -0.622346
12.466667 1.189192 2.018662 0.568595 0.786786 -0.106879 -0.660980
12.500000 1.216071 2.015433 0.546059 0.797753 -0.091224 -0.688307
12.533333 1.243438 2.013203 0.537905 0.806186 -0.076685 -0.703929
12.566667 1.270925 2.011125 0.524487 0.811685 -0.063257 -0.703777
12.600000 1.298771 2.009864 0.491010 0.814042 -0.050731 -0.686703
12.633333 1.326691 2.008756 0.460569 0.812994 -0.038956 -0.655878
12.666667 1.354662 2.007800 0.425438 0.808375 -0.027929 -0.617521
12.700000 1.382660 2.006996 0.387781 0.799928 -0.017728 -0.577728
12.733333 1.410663 2.006344 0.368795 0.787461 -0.008293 -0.539021
12.766667 1.437872 2.006182 0.357772 0.771135 0.000392 -0.505603
12.800000 1.464080 2.006467 0.346494 0.751148 0.008335 -0.476939
12.833333 1.489087 2.007231 0.358954 0.727672 0.015444 -0.454257
12.866667 1.514013 2.008143 0.358441 0.700798 0.021656 -0.440134
12.900000 1.537123 2.009314 0.355321 0.671140 0.026907 -0.434013
12.933333 1.560115 2.010627 0.318265 0.638860 0.030928 -0.428785
12.966667 1.580753 2.012015 0.290239 0.604037 0.033521 -0.416469
13.000000 1.601241 2.013540 0.280753 0.566569 0.034485 -0.394628
13.033333 1.618495 2.014912 0.260638 0.526802 0.033821 -0.358879
13.066667 1.635574 2.016416 0.238536 0.485081 0.031535 -0.303495
13.100000 1.652468 2.018051 0.223104 0.441212 0.027630 -0.226915
13.133333 1.669167 2.019813 0.212420 0.395613 0.022480 -0.137892
13.166667 1.680445 2.020362 0.201055 0.348830 0.016534 -0.045563
13.200000 1.691513 2.021035 0.188465 0.301491 0.010215 0.049206
13.233333 1.702366 2.021831 0.192119 0.253988 0.003950 0.146616
13.266667 1.707905 2.021067 0.226492 0.207019 -0.001637 0.242286
13.300000 1.713229 2.020426 0.275122 0.161358 -0.005902 0.330646
13.333333 1.718337 2.019909 0.299648 0.117835 -0.008526 0.409283
13.366667 1.719547 2.018391 0.282071 0.076939 -0.009352 0.477057
13.400000 1.720550 2.016999 0.278891 0.039265 -0.008307 0.525128
13.433333 1.721354 2.015733 0.278190 0.005519 -0.005523 0.544157
13.466667 1.719064 2.015682 0.308453 -0.023970 -0.001621 0.527980
13.500000 1.716592 2.015760 0.345150 -0.048525 0.002560 0.471688
13.533333 1.713949 2.015964 0.389620 -0.067717 0.006275 0.366134
13.566667 1.711145 2.016296 0.424583 -0.081152 0.008695 0.202994
13.600000 1.706773 2.017478 0.456291 -0.088298 0.009057 -0.016250
