t x y theta dxdt dydt dthetadt
0.000000 0.000000 0.000000 0.394423 0.102432 0.026968 0.856793
0.033333 0.003524 0.000990 0.419087 0.101014 0.021837 0.721312
0.066667 0.006975 0.001763 0.437563 0.099142 0.016057 0.551035
0.100000 0.010376 0.002372 0.465815 0.096787 0.009599 0.339297
0.133333 0.013722 0.002812 0.471304 0.093949 0.002473 0.067953
0.166667 0.016890 0.002886 0.482407 0.090673 -0.005244 -0.279470
0.200000 0.019997 0.002781 0.493355 0.086997 -0.013495 -0.719685
0.233333 0.023041 0.002493 0.490067 0.082949 -0.022237 -1.244827
0.266667 0.025785 0.001661 0.485070 0.078571 -0.031410 -1.829081
0.300000 0.028177 0.000223 0.471770 0.073905 -0.040941 -2.442492
0.333333 0.030497 -0.001409 0.456128 0.068985 -0.050749 -3.046844
0.366667 0.032744 -0.003237 0.333962 0.063824 -0.060774 -3.600324
0.400000 0.034914 -0.005266 0.119314 0.058428 -0.070959 -4.058497
0.433333 0.037005 -0.007499 -0.093973 0.052807 -0.081244 -4.382985
0.466667 0.038735 -0.010349 -0.365943 0.046954 -0.091592 -4.536783
0.500000 0.040080 -0.013812 -0.632061 0.040896 -0.101948 -4.483760
0.533333 0.041341 -0.017486 -0.835883 0.034672 -0.112261 -4.191545
0.566667 0.042516 -0.021372 -0.993286 0.028354 -0.122465 -3.645712
0.600000 0.043603 -0.025472 -1.104224 0.022015 -0.132494 -2.861711
0.633333 0.044283 -0.030086 -1.187381 0.015748 -0.142270 -1.891093
0.666667 0.044570 -0.035152 -1.264721 0.009644 -0.151744 -0.824284
0.700000 0.044478 -0.040620 -1.379087 0.003758 -0.160924 0.234631
0.733333 0.044295 -0.046305 -1.457189 -0.001847 -0.169829 1.168946
0.766667 0.044021 -0.052208 -1.371323 -0.007142 -0.178508 1.865758
0.800000 0.043657 -0.058329 -1.178005 -0.012097 -0.187012 2.244198
0.833333 0.043203 -0.064668 -0.908722 -0.016742 -0.195443 2.260508
0.866667 0.042481 -0.071290 -0.570029 -0.021112 -0.203880 1.917237
0.900000 0.041668 -0.078130 -0.261508 -0.025261 -0.212371 1.241417
0.933333 0.040765 -0.085188 -0.069971 -0.029259 -0.220970 0.298884
0.966667 0.039714 -0.092594 -0.019324 -0.033173 -0.229721 -0.805726
1.000000 0.038539 -0.100362 -0.145255 -0.037081 -0.238687 -1.954168
1.033333 0.037247 -0.108503 -0.367986 -0.041018 -0.247894 -3.021865
1.066667 0.035867 -0.116857 -0.699843 -0.045036 -0.257399 -3.893297
1.100000 0.034314 -0.125634 -1.044745 -0.049154 -0.267243 -4.473563
1.133333 0.032674 -0.134621 -1.353466 -0.053398 -0.277492 -4.711028
1.166667 0.030777 -0.144104 -1.640807 -0.057759 -0.288159 -4.601185
1.200000 0.028796 -0.153794 -1.834016 -0.062208 -0.299237 -4.185108
1.233333 0.026731 -0.163689 -1.953225 -0.066717 -0.310700 -3.537369
1.266667 0.024584 -0.173786 -2.021696 -0.071223 -0.322476 -2.756460
1.300000 0.022153 -0.184503 -2.042860 -0.075663 -0.334490 -1.939847
1.333333 0.019484 -0.195825 -2.056425 -0.079956 -0.346596 -1.165537
1.366667 0.016610 -0.207745 -2.031261 -0.084053 -0.358701 -0.496923
1.400000 0.013570 -0.220244 -1.992116 -0.087907 -0.370666 0.033242
1.433333 0.010456 -0.232926 -1.945280 -0.091484 -0.382388 0.416024
1.466667 0.007240 -0.246132 -1.900657 -0.094755 -0.393732 0.663298
1.500000 0.003954 -0.259512 -1.846758 -0.097723 -0.404626 0.796990
1.533333 0.000601 -0.273357 -1.806087 -0.100420 -0.415040 0.837308
1.566667 -0.002817 -0.287365 -1.767750 -0.102882 -0.424958 0.811214
1.600000 -0.006297 -0.301804 -1.744206 -0.105164 -0.434407 0.740465
1.633333 -0.009837 -0.316393 -1.723778 -0.107317 -0.443392 0.644389
1.666667 -0.013441 -0.331347 -1.706704 -0.109398 -0.451962 0.535503
1.700000 -0.017114 -0.346640 -1.687993 -0.111440 -0.460095 0.422923
1.733333 -0.020858 -0.362237 -1.686465 -0.113462 -0.467771 0.317132
1.766667 -0.024672 -0.378111 -1.679662 -0.115470 -0.474943 0.222484
1.800000 -0.028562 -0.394240 -1.679487 -0.117461 -0.481560 0.142818
1.833333 -0.032525 -0.410596 -1.671043 -0.119423 -0.487570 0.075927
1.866667 -0.036559 -0.427145 -1.679957 -0.121342 -0.492919 0.022742
1.900000 -0.040634 -0.443786 -1.672192 -0.123207 -0.497598 -0.018906
1.933333 -0.044783 -0.460592 -1.696700 -0.125008 -0.501596 -0.052598
1.966667 -0.049005 -0.477527 -1.681941 -0.126735 -0.504917 -0.083232
2.000000 -0.053297 -0.494568 -1.695564 -0.128380 -0.507574 -0.114417
2.033333 -0.057618 -0.511666 -1.699979 -0.129938 -0.509605 -0.148617
2.066667 -0.062008 -0.528813 -1.702462 -0.131404 -0.511060 -0.187687
2.100000 -0.066421 -0.546002 -1.698099 -0.132771 -0.511973 -0.230580
2.133333 -0.070898 -0.563180 -1.710338 -0.134026 -0.512377 -0.278027
2.166667 -0.075393 -0.580383 -1.699683 -0.135153 -0.512309 -0.326794
2.200000 -0.079949 -0.597546 -1.714384 -0.136140 -0.511801 -0.374966
2.233333 -0.084517 -0.614715 -1.733435 -0.136973 -0.510873 -0.418540
2.266667 -0.089143 -0.631794 -1.759343 -0.137638 -0.509526 -0.456025
2.300000 -0.093812 -0.648751 -1.777683 -0.138118 -0.507767 -0.485568
2.333333 -0.098484 -0.665690 -1.811388 -0.138402 -0.505598 -0.505080
2.366667 -0.103156 -0.682603 -1.835272 -0.138477 -0.503017 -0.510638
2.400000 -0.107825 -0.699482 -1.840889 -0.138326 -0.499990 -0.503311
2.433333 -0.112488 -0.716318 -1.854477 -0.137933 -0.496485 -0.485129
2.466667 -0.117124 -0.732916 -1.874283 -0.137285 -0.492489 -0.458331
2.500000 -0.121724 -0.749271 -1.888570 -0.136379 -0.487985 -0.426357
2.533333 -0.126308 -0.765560 -1.908040 -0.135206 -0.482965 -0.390157
2.566667 -0.130875 -0.781776 -1.920199 -0.133769 -0.477444 -0.356900
2.600000 -0.135372 -0.797694 -1.928697 -0.132087 -0.471498 -0.324998
2.633333 -0.139847 -0.813524 -1.933900 -0.130179 -0.465206 -0.293793
2.666667 -0.144227 -0.829031 -1.956267 -0.128064 -0.458640 -0.254522
2.700000 -0.148499 -0.844208 -1.949849 -0.125744 -0.451852 -0.193819
2.733333 -0.152644 -0.859043 -1.957764 -0.123232 -0.444919 -0.099437
2.766667 -0.156756 -0.873765 -1.962441 -0.120513 -0.437883 0.047589
2.800000 -0.160711 -0.888149 -1.971188 -0.117568 -0.430747 0.254995
2.833333 -0.164628 -0.902408 -1.982500 -0.114358 -0.423504 0.527199
2.866667 -0.168366 -0.916314 -1.983145 -0.110851 -0.416146 0.848621
2.900000 -0.172061 -0.930085 -1.995784 -0.107036 -0.408677 1.195966
2.933333 -0.175711 -0.943713 -1.985052 -0.102907 -0.401073 1.539303
2.966667 -0.179314 -0.957194 -1.971420 -0.098488 -0.393322 1.841722
3.000000 -0.182688 -0.970304 -1.883939 -0.093798 -0.385411 2.072443
3.033333 -0.185824 -0.983056 -1.724312 -0.088912 -0.377370 2.203192
3.066667 -0.188700 -0.995464 -1.558943 -0.083914 -0.369208 2.222660
3.100000 -0.191302 -1.007535 -1.367301 -0.078899 -0.360949 2.119805
3.133333 -0.193852 -1.019437 -1.242468 -0.073942 -0.352585 1.902158
3.166667 -0.196123 -1.031012 -1.171991 -0.069144 -0.344141 1.585113
3.200000 -0.198139 -1.042249 -1.150980 -0.064598 -0.335640 1.197040
3.233333 -0.200101 -1.053308 -1.139699 -0.060350 -0.327057 0.777090
3.266667 -0.202008 -1.064185 -1.160396 -0.056415 -0.318352 0.364407
3.300000 -0.203725 -1.074658 -1.196578 -0.052770 -0.309437 0.003190
3.333333 -0.205387 -1.084943 -1.230515 -0.049404 -0.300259 -0.281055
3.366667 -0.206995 -1.095039 -1.265451 -0.046256 -0.290725 -0.470826
3.400000 -0.208447 -1.104602 -1.302296 -0.043248 -0.280726 -0.567118
3.433333 -0.209845 -1.113972 -1.348552 -0.040317 -0.270176 -0.582054
3.466667 -0.211094 -1.122695 -1.369488 -0.037436 -0.259098 -0.538967
3.500000 -0.212290 -1.131221 -1.410214 -0.034588 -0.247581 -0.458999
3.533333 -0.213435 -1.139550 -1.425185 -0.031765 -0.235745 -0.361200
3.566667 -0.214529 -1.147682 -1.415010 -0.028971 -0.223708 -0.260239
3.600000 -0.215469 -1.155072 -1.392073 -0.026234 -0.211650 -0.168773
3.633333 -0.216263 -1.161778 -1.397554 -0.023585 -0.199777 -0.093875
3.666667 -0.216919 -1.167841 -1.385569 -0.021038 -0.188212 -0.034266
3.700000 -0.217528 -1.173708 -1.383034 -0.018612 -0.177053 0.004018
3.733333 -0.218018 -1.179002 -1.382387 -0.016322 -0.166394 0.024751
3.766667 -0.218463 -1.184104 -1.381776 -0.014189 -0.156358 0.028712
3.800000 -0.218865 -1.189015 -1.393202 -0.012218 -0.146964 0.027265
3.833333 -0.219226 -1.193738 -1.388344 -0.010401 -0.138181 0.021006
3.866667 -0.219545 -1.198274 -1.394295 -0.008723 -0.129935 0.013856
3.900000 -0.219788 -1.202390 -1.374025 -0.007172 -0.122171 0.009414
3.933333 -0.219993 -1.206325 -1.391982 -0.005723 -0.114770 0.007152
3.966667 -0.220129 -1.209891 -1.387495 -0.004355 -0.107625 0.008998
4.000000 -0.220232 -1.213281 -1.384799 -0.003056 -0.100692 0.008386
4.033333 -0.220303 -1.216501 -1.394226 -0.001821 -0.093947 0.010435
4.066667 -0.220343 -1.219552 -1.376152 -0.000654 -0.087420 0.010233
4.100000 -0.220334 -1.222322 -1.383488 0.000445 -0.081108 0.010861
4.133333 -0.220275 -1.224824 -1.377830 0.001470 -0.075049 0.010080
4.166667 -0.220192 -1.227169 -1.392742 0.002419 -0.069247 0.008437
4.200000 -0.220070 -1.229279 -1.379739 0.003291 -0.063702 0.006634
4.233333 -0.219927 -1.231241 -1.385782 0.004085 -0.058419 0.002495
4.266667 -0.219765 -1.233058 -1.384238 0.004800 -0.053396 -0.001171
