t x y theta dxdt dydt dthetadt
0.000000 0.000000 0.000000 -1.375933 -0.146021 0.045038 -2.844920
0.033333 -0.004969 0.001541 -1.565841 -0.149922 0.046006 -3.264894
0.066667 -0.010052 0.003105 -1.650822 -0.153799 0.046951 -3.621571
0.100000 -0.015248 0.004690 -1.821051 -0.157649 0.047871 -3.915790
0.133333 -0.020556 0.006295 -2.026857 -0.161472 0.048768 -4.145150
0.166667 -0.026015 0.007945 -2.134279 -0.165264 0.049636 -4.315593
0.200000 -0.031583 0.009613 -2.281551 -0.169021 0.050472 -4.432611
0.233333 -0.037300 0.011323 -2.427473 -0.172741 0.051272 -4.514224
0.266667 -0.043123 0.013050 -2.569685 -0.176424 0.052032 -4.556077
0.300000 -0.049054 0.014791 -2.717383 -0.180066 0.052748 -4.574680
0.333333 -0.055125 0.016572 -2.906359 -0.183657 0.053414 -4.570734
0.366667 -0.061333 0.018394 -3.044865 -0.187192 0.054025 -4.545385
0.400000 -0.067643 0.020226 3.063513 -0.190660 0.054574 -4.495846
0.433333 -0.074092 0.022077 2.943387 -0.194052 0.055060 -4.415410
0.466667 -0.080640 0.023936 2.746787 -0.197361 0.055481 -4.305459
0.500000 -0.087286 0.025803 2.614859 -0.200577 0.055834 -4.167803
0.533333 -0.094055 0.027685 2.460672 -0.203696 0.056120 -4.010406
0.566667 -0.100920 0.029571 2.307959 -0.206713 0.056342 -3.829380
0.600000 -0.107878 0.031461 2.186703 -0.209625 0.056504 -3.635468
0.633333 -0.114939 0.033362 2.082160 -0.212432 0.056607 -3.426026
0.666667 -0.122091 0.035263 1.993527 -0.215135 0.056653 -3.211198
0.700000 -0.129331 0.037164 1.884325 -0.217734 0.056643 -2.980547
0.733333 -0.136659 0.039061 1.802299 -0.220234 0.056578 -2.734791
0.766667 -0.144066 0.040960 1.697671 -0.222637 0.056458 -2.485123
0.800000 -0.151546 0.042855 1.616218 -0.224947 0.056279 -2.228461
0.833333 -0.159108 0.044743 1.498774 -0.227168 0.056043 -1.964075
0.866667 -0.166734 0.046621 1.440515 -0.229306 0.055750 -1.692640
0.900000 -0.174420 0.048486 1.417563 -0.231370 0.055401 -1.428762
0.933333 -0.182184 0.050339 1.359868 -0.233368 0.054998 -1.174637
0.966667 -0.190004 0.052176 1.324835 -0.235309 0.054543 -0.931812
1.000000 -0.197898 0.054000 1.323824 -0.237202 0.054040 -0.705910
1.033333 -0.205847 0.055803 1.325676 -0.239055 0.053492 -0.513520
1.066667 -0.213852 0.057585 1.326543 -0.240877 0.052901 -0.355659
1.100000 -0.221911 0.059345 1.317815 -0.242672 0.052269 -0.228005
1.133333 -0.230025 0.061082 1.307695 -0.244446 0.051599 -0.130220
1.166667 -0.238206 0.062798 1.322532 -0.246201 0.050892 -0.062832
1.200000 -0.246442 0.064490 1.316260 -0.247941 0.050148 -0.019014
1.233333 -0.254741 0.066158 1.325667 -0.249667 0.049369 0.018092
1.266667 -0.263095 0.067799 1.311470 -0.251379 0.048554 0.065333
1.300000 -0.271509 0.069413 1.319926 -0.253076 0.047702 0.136744
1.333333 -0.279978 0.070998 1.330534 -0.254758 0.046815 0.251008
1.366667 -0.288502 0.072553 1.328372 -0.256422 0.045892 0.424259
1.400000 -0.297080 0.074075 1.333391 -0.258067 0.044934 0.664418
1.433333 -0.305714 0.075564 1.330193 -0.259693 0.043940 0.966585
1.466667 -0.314402 0.077019 1.328222 -0.261298 0.042912 1.310892
1.500000 -0.323145 0.078439 1.327806 -0.262881 0.041850 1.677564
1.533333 -0.331938 0.079823 1.355355 -0.264442 0.040754 2.035498
1.566667 -0.340785 0.081170 1.426770 -0.265978 0.039625 2.359473
1.600000 -0.349678 0.082480 1.571044 -0.267486 0.038462 2.615581
1.633333 -0.358625 0.083750 1.726601 -0.268962 0.037266 2.783599
1.666667 -0.367626 0.084980 1.934240 -0.270399 0.036034 2.845964
1.700000 -0.376668 0.086168 2.051659 -0.271795 0.034767 2.794373
1.733333 -0.385763 0.087314 2.207777 -0.273144 0.033463 2.627644
1.766667 -0.394910 0.088417 2.273794 -0.274440 0.032122 2.354746
1.800000 -0.404095 0.089475 2.346193 -0.275680 0.030741 2.000187
1.833333 -0.413315 0.090485 2.397175 -0.276859 0.029321 1.587691
1.866667 -0.422583 0.091448 2.437377 -0.277975 0.027859 1.152202
1.900000 -0.431884 0.092361 2.460558 -0.279022 0.026355 0.714872
1.933333 -0.441216 0.093224 2.466310 -0.279996 0.024806 0.304443
1.966667 -0.450577 0.094036 2.455631 -0.280894 0.023211 -0.067557
2.000000 -0.459973 0.094793 2.442775 -0.281713 0.021569 -0.390626
2.033333 -0.469395 0.095496 2.416238 -0.282445 0.019877 -0.659549
2.066667 -0.478843 0.096143 2.386465 -0.283084 0.018132 -0.875038
2.100000 -0.488312 0.096731 2.344060 -0.283620 0.016331 -1.032173
2.133333 -0.497800 0.097257 2.282404 -0.284045 0.014469 -1.131601
2.166667 -0.507308 0.097724 2.216393 -0.284349 0.012544 -1.171940
2.200000 -0.516821 0.098124 2.160563 -0.284524 0.010552 -1.154406
2.233333 -0.526332 0.098455 2.098247 -0.284571 0.008492 -1.078563
2.266667 -0.535860 0.098724 2.064484 -0.284491 0.006365 -0.945083
2.300000 -0.545371 0.098917 2.023511 -0.284290 0.004173 -0.754586
2.333333 -0.554896 0.099047 2.007110 -0.283967 0.001913 -0.517205
2.366667 -0.564389 0.099091 1.975396 -0.283527 -0.000416 -0.235353
2.400000 -0.573844 0.099048 1.965516 -0.282975 -0.002812 0.083068
2.433333 -0.583255 0.098912 1.955103 -0.282318 -0.005276 0.428232
2.466667 -0.592675 0.098710 1.992539 -0.281560 -0.007806 0.788134
2.500000 -0.602041 0.098409 1.990969 -0.280712 -0.010399 1.150129
2.533333 -0.611413 0.098039 2.047489 -0.279796 -0.013047 1.506289
2.566667 -0.620791 0.097600 2.097047 -0.278828 -0.015741 1.841192
2.600000 -0.630105 0.097054 2.191052 -0.277820 -0.018478 2.135269
2.633333 -0.639353 0.096399 2.292109 -0.276778 -0.021257 2.372290
2.666667 -0.648536 0.095635 2.391821 -0.275716 -0.024076 2.537114
2.700000 -0.657655 0.094761 2.490310 -0.274646 -0.026928 2.615346
2.733333 -0.666776 0.093815 2.613868 -0.273575 -0.029811 2.597511
2.766667 -0.675899 0.092796 2.714456 -0.272515 -0.032720 2.480858
2.800000 -0.684966 0.091668 2.843479 -0.271476 -0.035650 2.275396
2.833333 -0.693982 0.090429 2.942238 -0.270474 -0.038588 1.992092
2.866667 -0.702998 0.089116 3.036753 -0.269513 -0.041527 1.649839
2.900000 -0.711969 0.087693 3.097226 -0.268593 -0.044462 1.266526
2.933333 -0.720895 0.086158 3.110911 -0.267718 -0.047385 0.867960
2.966667 -0.729779 0.084511 3.127353 -0.266895 -0.050282 0.474209
3.000000 -0.738622 0.082752 3.100761 -0.266138 -0.053135 0.108816
3.033333 -0.747465 0.080919 3.085141 -0.265450 -0.055935 -0.210782
3.066667 -0.756306 0.079013 3.054893 -0.264840 -0.058669 -0.474138
3.100000 -0.765107 0.076994 3.014079 -0.264314 -0.061330 -0.666888
3.133333 -0.773866 0.074865 2.969147 -0.263869 -0.063914 -0.792929
3.166667 -0.782625 0.072663 2.919259 -0.263490 -0.066433 -0.848986
3.200000 -0.791383 0.070387 2.896304 -0.263156 -0.068900 -0.849289
3.233333 -0.800141 0.068039 2.842898 -0.262850 -0.071330 -0.799745
3.266667 -0.808898 0.065619 2.820654 -0.262556 -0.073735 -0.709131
3.300000 -0.817655 0.063126 2.784213 -0.262262 -0.076126 -0.592829
3.333333 -0.826411 0.060562 2.772526 -0.261955 -0.078514 -0.459280
3.366667 -0.835168 0.057926 2.753484 -0.261634 -0.080904 -0.325621
3.400000 -0.843924 0.055219 2.739959 -0.261298 -0.083299 -0.197623
3.433333 -0.852640 0.052411 2.757855 -0.260949 -0.085700 -0.093312
3.466667 -0.861318 0.049502 2.748133 -0.260590 -0.088108 -0.022634
3.500000 -0.869959 0.046494 2.773148 -0.260230 -0.090520 0.005305
3.533333 -0.878601 0.043417 2.783225 -0.259879 -0.092929 -0.012699
3.566667 -0.887245 0.040272 2.800724 -0.259550 -0.095328 -0.075286
3.600000 -0.895892 0.037058 2.824074 -0.259255 -0.097708 -0.182350
3.633333 -0.904540 0.033778 2.834338 -0.259004 -0.100061 -0.319614
3.666667 -0.913170 0.030409 2.827731 -0.258804 -0.102382 -0.478376
3.700000 -0.921785 0.026953 2.805727 -0.258657 -0.104668 -0.642683
3.733333 -0.930388 0.023414 2.774087 -0.258567 -0.106918 -0.799389
3.766667 -0.938985 0.019793 2.720933 -0.258535 -0.109127 -0.935573
3.800000 -0.947579 0.016094 2.666302 -0.258564 -0.111291 -1.038057
3.833333 -0.956179 0.012332 2.616760 -0.258660 -0.113403 -1.102302
3.866667 -0.964784 0.008507 2.563328 -0.258827 -0.115458 -1.123318
3.900000 -0.973396 0.004613 2.516332 -0.259069 -0.117451 -1.104313
3.933333 -0.982018 0.000652 2.471689 -0.259390 -0.119377 -1.050602
3.966667 -0.990654 -0.003374 2.440262 -0.259788 -0.121236 -0.968942
4.000000 -0.999307 -0.007461 2.402672 -0.260257 -0.123032 -0.867402
4.033333 -1.007978 -0.011607 2.376278 -0.260792 -0.124768 -0.754469
4.066667 -1.016670 -0.015809 2.370310 -0.261387 -0.126448 -0.640313
4.100000 -1.025373 -0.020067 2.346170 -0.262037 -0.128076 -0.527240
4.133333 -1.034102 -0.024375 2.331808 -0.262737 -0.129655 -0.419152
4.166667 -1.042860 -0.028733 2.324396 -0.263484 -0.131191 -0.321178
4.200000 -1.051650 -0.033139 2.313779 -0.264279 -0.132688 -0.238578
4.233333 -1.060474 -0.037591 2.294084 -0.265122 -0.134149 -0.171286
4.266667 -1.069333 -0.042088 2.300505 -0.266014 -0.135581 -0.115406
4.300000 -1.078204 -0.046635 2.310509 -0.266952 -0.136987 -0.075965
4.333333 -1.087088 -0.051231 2.324633 -0.267932 -0.138370 -0.056028
4.366667 -1.096013 -0.055871 2.322345 -0.268954 -0.139733 -0.050786
4.400000 -1.104981 -0.060555 2.310936 -0.270015 -0.141077 -0.057614
4.433333 -1.113996 -0.065284 2.318141 -0.271114 -0.142402 -0.076614
4.466667 -1.123058 -0.070056 2.333386 -0.272243 -0.143707 -0.110723
4.500000 -1.132133 -0.074872 2.318296 -0.273399 -0.144991 -0.156932
4.533333 -1.141261 -0.079731 2.307700 -0.274580 -0.146253 -0.209048
4.566667 -1.150441 -0.084633 2.294894 -0.275777 -0.147491 -0.269786
4.600000 -1.159676 -0.089577 2.294345 -0.276977 -0.148704 -0.338309
4.633333 -1.168925 -0.094561 2.279445 -0.278164 -0.149888 -0.412521
4.666667 -1.178189 -0.099581 2.264920 -0.279331 -0.151043 -0.484499
4.700000 -1.187511 -0.104642 2.263556 -0.280467 -0.152166 -0.549444
4.733333 -1.196895 -0.109741 2.231970 -0.281557 -0.153255 -0.605721
4.766667 -1.206340 -0.114878 2.227642 -0.282598 -0.154308 -0.654170
4.800000 -1.215800 -0.120049 2.199127 -0.283592 -0.155323 -0.693142
4.833333 -1.225273 -0.125252 2.138991 -0.284543 -0.156300 -0.720584
4.866667 -1.234810 -0.130488 2.115825 -0.285453 -0.157238 -0.745338
4.900000 -1.244360 -0.135754 2.079944 -0.286336 -0.158135 -0.773322
4.933333 -1.253923 -0.141049 2.049072 -0.287204 -0.158990 -0.809621
4.966667 -1.263499 -0.146372 2.029385 -0.288068 -0.159802 -0.848796
5.000000 -1.273088 -0.151721 2.029359 -0.288937 -0.160572 -0.891304
5.033333 -1.282688 -0.157094 2.020399 -0.289821 -0.161297 -0.944121
5.066667 -1.292352 -0.162493 2.011961 -0.290728 -0.161975 -1.000531
5.100000 -1.302080 -0.167915 1.950468 -0.291656 -0.162606 -1.047901
5.133333 -1.311818 -0.173358 1.901256 -0.292605 -0.163185 -1.079955
5.166667 -1.321567 -0.178821 1.867740 -0.293577 -0.163707 -1.090033
5.200000 -1.331376 -0.184300 1.811224 -0.294567 -0.164167 -1.070819
5.233333 -1.341242 -0.189789 1.734158 -0.295570 -0.164557 -1.006187
5.266667 -1.351118 -0.195296 1.701158 -0.296580 -0.164873 -0.894265
5.300000 -1.361002 -0.200819 1.655466 -0.297598 -0.165112 -0.747068
5.333333 -1.370938 -0.206345 1.638905 -0.298616 -0.165275 -0.571099
5.366667 -1.380882 -0.211885 1.604244 -0.299620 -0.165366 -0.382401
5.400000 -1.390874 -0.217423 1.595204 -0.300601 -0.165385 -0.197198
5.433333 -1.400912 -0.222957 1.610530 -0.301551 -0.165335 -0.045242
5.466667 -1.410994 -0.228481 1.609228 -0.302459 -0.165218 0.051887
5.500000 -1.421117 -0.233993 1.660792 -0.303308 -0.165040 0.078396
5.533333 -1.431280 -0.239490 1.679704 -0.304091 -0.164801 0.018254
5.566667 -1.441481 -0.244969 1.718104 -0.304794 -0.164506 -0.144027
5.600000 -1.451683 -0.250454 1.739714 -0.305409 -0.164163 -0.427333
5.633333 -1.461884 -0.255946 1.744695 -0.305927 -0.163782 -0.828830
5.666667 -1.472085 -0.261441 1.748021 -0.306346 -0.163367 -1.338881
5.700000 -1.482312 -0.266901 1.717009 -0.306669 -0.162916 -1.948832
5.733333 -1.492561 -0.272321 1.680690 -0.306898 -0.162428 -2.647521
5.766667 -1.502828 -0.277698 1.595601 -0.307040 -0.161906 -3.400223
5.800000 -1.513091 -0.283076 1.445179 -0.307100 -0.161349 -4.150144
5.833333 -1.523347 -0.288455 1.331758 -0.307082 -0.160748 -4.855596
5.866667 -1.533596 -0.293834 1.150132 -0.306984 -0.160100 -5.479097
5.900000 -1.543846 -0.299157 0.924920 -0.306807 -0.159414 -5.969604
5.933333 -1.554086 -0.304480 0.589906 -0.306553 -0.158691 -6.267827
5.966667 -1.564316 -0.309800 0.312599 -0.306225 -0.157920 -6.350199
6.000000 -1.574532 -0.315062 0.078723 -0.305826 -0.157103 -6.224649
6.033333 -1.584731 -0.320265 -0.229086 -0.305362 -0.156251 -5.889383
6.066667 -1.594916 -0.325465 -0.552439 -0.304840 -0.155380 -5.354159
6.100000 -1.605087 -0.330660 -0.751675 -0.304264 -0.154491 -4.658463
6.133333 -1.615231 -0.335801 -0.906565 -0.303637 -0.153596 -3.864699
6.166667 -1.625349 -0.340889 -0.983867 -0.302962 -0.152718 -3.025674
6.200000 -1.635438 -0.345926 -1.040996 -0.302244 -0.151874 -2.172758
6.233333 -1.645507 -0.350958 -1.042315 -0.301486 -0.151071 -1.360304
6.266667 -1.655557 -0.355983 -1.039375 -0.300687 -0.150312 -0.634643
6.300000 -1.665575 -0.360970 -0.998547 -0.299850 -0.149614 -0.017848
6.333333 -1.675561 -0.365922 -0.979899 -0.298977 -0.148985 0.485736
6.366667 -1.685524 -0.370869 -0.911649 -0.298065 -0.148425 0.884011
6.400000 -1.695452 -0.375791 -0.865898 -0.297112 -0.147931 1.177616
6.433333 -1.705347 -0.380695 -0.814393 -0.296113 -0.147505 1.390064
6.466667 -1.715205 -0.385584 -0.755172 -0.295068 -0.147146 1.546001
6.500000 -1.725036 -0.390466 -0.715761 -0.293970 -0.146848 1.670323
6.533333 -1.734839 -0.395340 -0.639804 -0.292812 -0.146604 1.772920
6.566667 -1.744598 -0.400212 -0.577361 -0.291591 -0.146408 1.862307
6.600000 -1.754310 -0.405083 -0.516672 -0.290305 -0.146255 1.944337
6.633333 -1.763973 -0.409956 -0.463139 -0.288954 -0.146137 2.015142
6.666667 -1.773604 -0.414820 -0.406374 -0.287542 -0.146042 2.068032
6.700000 -1.783178 -0.419687 -0.327995 -0.286077 -0.145961 2.084501
6.733333 -1.792719 -0.424546 -0.260927 -0.284570 -0.145887 2.063311
6.766667 -1.802197 -0.429407 -0.175806 -0.283033 -0.145814 1.996050
6.800000 -1.811609 -0.434270 -0.074444 -0.281473 -0.145740 1.879269
6.833333 -1.820953 -0.439134 0.038396 -0.279897 -0.145665 1.713018
6.866667 -1.830225 -0.443998 0.095145 -0.278317 -0.145591 1.504320
6.900000 -1.839461 -0.448853 0.163325 -0.276736 -0.145521 1.268175
6.933333 -1.848659 -0.453699 0.203795 -0.275161 -0.145456 1.015576
6.966667 -1.857820 -0.458536 0.214381 -0.273597 -0.145397 0.763526
7.000000 -1.866914 -0.463376 0.217401 -0.272049 -0.145342 0.527555
7.033333 -1.875970 -0.468206 0.207856 -0.270520 -0.145291 0.326705
7.066667 -1.884963 -0.473042 0.183548 -0.269008 -0.145245 0.171665
7.100000 -1.893895 -0.477885 0.169048 -0.267513 -0.145200 0.071659
7.133333 -1.902770 -0.482735 0.167284 -0.266036 -0.145156 0.025879
7.166667 -1.911605 -0.487576 0.161212 -0.264577 -0.145111 0.030890
7.200000 -1.920385 -0.492427 0.152604 -0.263135 -0.145062 0.082547
7.233333 -1.929125 -0.497267 0.151496 -0.261711 -0.145006 0.169673
7.266667 -1.937824 -0.502097 0.160357 -0.260304 -0.144943 0.283569
7.300000 -1.946482 -0.506916 0.169981 -0.258907 -0.144873 0.415403
7.333333 -1.955089 -0.511746 0.173354 -0.257509 -0.144798 0.564496
7.366667 -1.963655 -0.516565 0.197401 -0.256103 -0.144718 0.728698
7.400000 -1.972171 -0.521394 0.224421 -0.254678 -0.144638 0.901780
7.433333 -1.980644 -0.526212 0.269946 -0.253225 -0.144557 1.083039
7.466667 -1.989066 -0.531039 0.286632 -0.251740 -0.144473 1.269031
7.500000 -1.997445 -0.535854 0.337062 -0.250220 -0.144377 1.455064
7.533333 -2.005783 -0.540656 0.382535 -0.248664 -0.144264 1.634088
7.566667 -2.014062 -0.545462 0.433397 -0.247070 -0.144127 1.795856
7.600000 -2.022279 -0.550273 0.505884 -0.245440 -0.143958 1.937694
7.633333 -2.030433 -0.555084 0.598864 -0.243779 -0.143751 2.045939
7.666667 -2.038519 -0.559894 0.662602 -0.242094 -0.143502 2.113122
7.700000 -2.046563 -0.564689 0.774803 -0.240391 -0.143208 2.125998
7.733333 -2.054567 -0.569469 0.834883 -0.238682 -0.142866 2.076591
7.766667 -2.062494 -0.574238 0.942344 -0.236976 -0.142474 1.958571
7.800000 -2.070381 -0.578992 0.993595 -0.235275 -0.142029 1.767265
7.833333 -2.078186 -0.583728 1.094432 -0.233578 -0.141533 1.509207
7.866667 -2.085907 -0.588442 1.157573 -0.231884 -0.140986 1.189833
7.900000 -2.093589 -0.593138 1.205270 -0.230197 -0.140394 0.828057
7.933333 -2.101231 -0.597818 1.257723 -0.228518 -0.139759 0.436081
7.966667 -2.108834 -0.602479 1.258632 -0.226846 -0.139089 0.038295
8.000000 -2.116400 -0.607122 1.238267 -0.225190 -0.138388 -0.345029
8.033333 -2.123878 -0.611729 1.208967 -0.223552 -0.137664 -0.693945
8.066667 -2.131319 -0.616316 1.148330 -0.221930 -0.136921 -0.986619
8.100000 -2.138675 -0.620866 1.085312 -0.220321 -0.136164 -1.211824
8.133333 -2.145949 -0.625379 1.007391 -0.218725 -0.135397 -1.353934
8.166667 -2.153187 -0.629871 0.940553 -0.217143 -0.134626 -1.411864
8.200000 -2.160391 -0.634343 0.866140 -0.215577 -0.133856 -1.390050
8.233333 -2.167562 -0.638794 0.807410 -0.214030 -0.133090 -1.298755
8.266667 -2.174700 -0.643223 0.747176 -0.212507 -0.132331 -1.161350
8.300000 -2.181767 -0.647623 0.702982 -0.211008 -0.131579 -0.997836
8.333333 -2.188764 -0.651995 0.687560 -0.209534 -0.130833 -0.835529
8.366667 -2.195695 -0.656339 0.654333 -0.208090 -0.130093 -0.695201
8.400000 -2.202597 -0.660661 0.664711 -0.206681 -0.129356 -0.600735
8.433333 -2.209471 -0.664959 0.665047 -0.205312 -0.128624 -0.567153
8.466667 -2.216285 -0.669234 0.669982 -0.203989 -0.127897 -0.597362
8.500000 -2.223040 -0.673484 0.696455 -0.202722 -0.127176 -0.687981
8.533333 -2.229740 -0.677711 0.707858 -0.201518 -0.126462 -0.825108
8.566667 -2.236416 -0.681913 0.685783 -0.200374 -0.125757 -0.995708
8.600000 -2.243070 -0.686091 0.624698 -0.199289 -0.125061 -1.168124
8.633333 -2.249676 -0.690247 0.573630 -0.198268 -0.124371 -1.317166
8.666667 -2.256262 -0.694377 0.508789 -0.197312 -0.123686 -1.419897
8.700000 -2.262830 -0.698482 0.458051 -0.196418 -0.123006 -1.466795
8.733333 -2.269356 -0.702568 0.348510 -0.195580 -0.122331 -1.449717
8.766667 -2.275843 -0.706637 0.245815 -0.194802 -0.121660 -1.365956
8.800000 -2.282294 -0.710688 0.143150 -0.194085 -0.120993 -1.225977
8.833333 -2.288731 -0.714713 0.133102 -0.193425 -0.120333 -1.046277
8.866667 -2.295158 -0.718709 0.129627 -0.192820 -0.119683 -0.845740
8.900000 -2.301556 -0.722690 0.135645 -0.192274 -0.119040 -0.636081
8.933333 -2.307947 -0.726642 0.128779 -0.191792 -0.118404 -0.436641
8.966667 -2.314330 -0.730565 0.137271 -0.191374 -0.117779 -0.262674
9.000000 -2.320694 -0.734474 0.133349 -0.191017 -0.117163 -0.125778
9.033333 -2.327040 -0.738368 0.130687 -0.190725 -0.116556 -0.024793
9.066667 -2.333372 -0.742249 0.138529 -0.190502 -0.115951 0.045717
9.100000 -2.339704 -0.746098 0.142021 -0.190347 -0.115345 0.091769
9.133333 -2.346029 -0.749933 0.142132 -0.190261 -0.114734 0.120288
9.166667 -2.352349 -0.753753 0.156267 -0.190249 -0.114107 0.140653
9.200000 -2.358669 -0.757559 0.155633 -0.190315 -0.113459 0.158782
9.233333 -2.364995 -0.761331 0.153720 -0.190459 -0.112784 0.179306
9.266667 -2.371329 -0.765088 0.164434 -0.190681 -0.112083 0.200638
9.300000 -2.377673 -0.768829 0.174132 -0.190981 -0.111353 0.222701
9.333333 -2.384028 -0.772535 0.182387 -0.191360 -0.110597 0.249599
9.366667 -2.390401 -0.776225 0.182441 -0.191813 -0.109817 0.286322
9.400000 -2.396787 -0.779879 0.200273 -0.192340 -0.109017 0.340846
9.433333 -2.403189 -0.783495 0.212045 -0.192938 -0.108198 0.417830
9.466667 -2.409609 -0.787073 0.213027 -0.193605 -0.107360 0.528205
9.500000 -2.416056 -0.790633 0.235942 -0.194339 -0.106506 0.683851
9.533333 -2.422533 -0.794172 0.227879 -0.195138 -0.105635 0.892529
9.566667 -2.429040 -0.797690 0.262818 -0.196000 -0.104748 1.157089
9.600000 -2.435582 -0.801186 0.271607 -0.196924 -0.103842 1.487902
9.633333 -2.442149 -0.804640 0.304872 -0.197907 -0.102912 1.885567
9.666667 -2.448742 -0.808051 0.346555 -0.198951 -0.101955 2.339628
9.700000 -2.455377 -0.811437 0.422818 -0.200053 -0.100969 2.835173
9.733333 -2.462054 -0.814797 0.509345 -0.201214 -0.099949 3.359964
9.766667 -2.468776 -0.818130 0.648009 -0.202431 -0.098890 3.895507
9.800000 -2.475531 -0.821417 0.766308 -0.203704 -0.097790 4.403372
9.833333 -2.482321 -0.824657 0.970666 -0.205031 -0.096648 4.851337
9.866667 -2.489160 -0.827866 1.121696 -0.206406 -0.095459 5.223159
9.900000 -2.496050 -0.831039 1.334479 -0.207822 -0.094218 5.491805
9.933333 -2.502993 -0.834176 1.612546 -0.209278 -0.092924 5.624406
9.966667 -2.509991 -0.837270 1.869927 -0.210772 -0.091574 5.601630
10.000000 -2.517047 -0.840320 2.022698 -0.212305 -0.090166 5.428355
10.033333 -2.524146 -0.843317 2.259327 -0.213881 -0.088698 5.107518
10.066667 -2.531289 -0.846262 2.483763 -0.215511 -0.087168 4.636586
10.100000 -2.538500 -0.849153 2.679980 -0.217206 -0.085577 4.033295
10.133333 -2.545757 -0.851990 2.806981 -0.218971 -0.083929 3.332617
10.166667 -2.553063 -0.854771 2.946008 -0.220811 -0.082224 2.561309
10.200000 -2.560417 -0.857495 3.006988 -0.222732 -0.080466 1.738734
10.233333 -2.567822 -0.860162 3.034658 -0.224734 -0.078660 0.893676
10.266667 -2.575312 -0.862765 3.035016 -0.226811 -0.076809 0.052052
10.300000 -2.582889 -0.865304 2.997703 -0.228953 -0.074915 -0.763349
10.333333 -2.590553 -0.867777 2.957100 -0.231155 -0.072981 -1.543523
10.366667 -2.598306 -0.870183 2.874222 -0.233400 -0.071009 -2.265318
10.400000 -2.606148 -0.872519 2.777067 -0.235671 -0.069002 -2.925385
10.433333 -2.614047 -0.874793 2.655510 -0.237948 -0.066966 -3.512762
10.466667 -2.622003 -0.877004 2.508863 -0.240217 -0.064904 -4.010420
10.500000 -2.630045 -0.879141 2.322032 -0.242463 -0.062821 -4.407957
10.533333 -2.638170 -0.881205 2.219916 -0.244677 -0.060723 -4.701829
10.566667 -2.646376 -0.883194 2.019306 -0.246854 -0.058615 -4.892886
10.600000 -2.654661 -0.885108 1.777552 -0.248994 -0.056501 -4.959723
10.633333 -2.663008 -0.886955 1.563247 -0.251100 -0.054382 -4.901466
10.666667 -2.671426 -0.888729 1.361123 -0.253172 -0.052263 -4.724280
10.700000 -2.679907 -0.890434 1.199036 -0.255213 -0.050147 -4.435559
10.733333 -2.688453 -0.892068 1.009258 -0.257226 -0.048033 -4.024996
10.766667 -2.697064 -0.893632 0.882200 -0.259216 -0.045923 -3.505020
10.800000 -2.705738 -0.895129 0.777247 -0.261189 -0.043816 -2.905410
10.833333 -2.714477 -0.896554 0.679051 -0.263149 -0.041709 -2.249001
10.866667 -2.723279 -0.897915 0.570049 -0.265106 -0.039600 -1.557576
10.900000 -2.732146 -0.899203 0.526699 -0.267064 -0.037483 -0.860481
10.933333 -2.741080 -0.900416 0.519647 -0.269030 -0.035357 -0.199278
10.966667 -2.750080 -0.901554 0.533112 -0.271007 -0.033216 0.399390
11.000000 -2.759143 -0.902632 0.582495 -0.272998 -0.031059 0.917505
11.033333 -2.768273 -0.903634 0.685952 -0.275007 -0.028883 1.335542
11.066667 -2.777466 -0.904575 0.767603 -0.277040 -0.026690 1.635993
11.100000 -2.786728 -0.905438 0.885129 -0.279098 -0.024476 1.820351
11.133333 -2.796059 -0.906223 0.984856 -0.281182 -0.022241 1.896512
11.166667 -2.805458 -0.906929 1.073679 -0.283298 -0.019985 1.879006
11.200000 -2.814927 -0.907555 1.164597 -0.285449 -0.017707 1.788473
11.233333 -2.824471 -0.908114 1.211553 -0.287635 -0.015404 1.652509
11.266667 -2.834085 -0.908593 1.255503 -0.289856 -0.013073 1.493151
11.300000 -2.843769 -0.908989 1.281154 -0.292116 -0.010716 1.327855
11.333333 -2.853537 -0.909315 1.288984 -0.294417 -0.008329 1.169371
11.366667 -2.863393 -0.909567 1.304407 -0.296755 -0.005911 1.021391
11.400000 -2.873318 -0.909736 1.324284 -0.299122 -0.003458 0.882626
11.433333 -2.883314 -0.909820 1.374817 -0.301518 -0.000971 0.743484
11.466667 -2.893380 -0.909820 1.399865 -0.303941 0.001552 0.605996
11.500000 -2.903546 -0.909734 1.442821 -0.306385 0.004113 0.460014
11.533333 -2.913814 -0.909561 1.493644 -0.308849 0.006712 0.300454
11.566667 -2.924152 -0.909301 1.508650 -0.311336 0.009348 0.129772
11.600000 -2.934560 -0.908954 1.493603 -0.313853 0.012020 -0.047849
11.633333 -2.945079 -0.908512 1.504416 -0.316398 0.014725 -0.222238
11.666667 -2.955668 -0.907982 1.464896 -0.318975 0.017466 -0.391439
11.700000 -2.966325 -0.907363 1.420690 -0.321591 0.020241 -0.541034
11.733333 -2.977051 -0.906655 1.386467 -0.324254 0.023051 -0.658548
11.766667 -2.987895 -0.905846 1.346042 -0.326967 0.025897 -0.741531
11.800000 -2.998806 -0.904948 1.339230 -0.329731 0.028779 -0.791283
11.833333 -3.009838 -0.903946 1.297724 -0.332546 0.031697 -0.808913
11.866667 -3.020990 -0.902842 1.267531 -0.335398 0.034645 -0.798195
11.900000 -3.032209 -0.901646 1.238602 -0.338262 0.037616 -0.771610
11.933333 -3.043493 -0.900359 1.205656 -0.341114 0.040605 -0.742006
11.966667 -3.054898 -0.898964 1.188557 -0.343936 0.043607 -0.715550
12.000000 -3.066425 -0.897462 1.167775 -0.346709 0.046620 -0.694866
12.033333 -3.078072 -0.895849 1.142510 -0.349420 0.049643 -0.682864
12.066667 -3.089840 -0.894126 1.143303 -0.352065 0.052677 -0.682529
12.100000 -3.101668 -0.892310 1.104026 -0.354644 0.055723 -0.683997
12.133333 -3.113557 -0.890402 1.099936 -0.357155 0.058782 -0.683899
12.166667 -3.125505 -0.888401 1.080232 -0.359590 0.061848 -0.677607
12.200000 -3.137510 -0.886308 1.074115 -0.361946 0.064919 -0.665297
12.233333 -3.149573 -0.884123 1.017730 -0.364226 0.067993 -0.650321
12.266667 -3.161744 -0.881816 0.981681 -0.366436 0.071073 -0.630597
12.300000 -3.174024 -0.879387 0.936787 -0.368579 0.074156 -0.614923
12.333333 -3.186408 -0.876834 0.907881 -0.370656 0.077244 -0.605820
12.366667 -3.198843 -0.874189 0.919188 -0.372670 0.080337 -0.608442
12.400000 -3.211329 -0.871451 0.913603 -0.374614 0.083428 -0.621353
12.433333 -3.223863 -0.868622 0.918817 -0.376480 0.086512 -0.646223
12.466667 -3.236445 -0.865702 0.913931 -0.378257 0.089582 -0.681572
12.500000 -3.249072 -0.862690 0.893055 -0.379947 0.092639 -0.724872
12.533333 -3.261783 -0.859545 0.865823 -0.381556 0.095691 -0.768430
12.566667 -3.274537 -0.856309 0.820579 -0.383096 0.098753 -0.802823
12.600000 -3.287368 -0.852938 0.772661 -0.384574 0.101834 -0.823209
12.633333 -3.300237 -0.849477 0.738649 -0.386002 0.104953 -0.821264
12.666667 -3.313145 -0.845927 0.681000 -0.387386 0.108122 -0.793172
12.700000 -3.326088 -0.842289 0.655901 -0.388723 0.111344 -0.739260
12.733333 -3.339065 -0.838562 0.633438 -0.390011 0.114618 -0.667716
12.766667 -3.352075 -0.834747 0.604342 -0.391242 0.117934 -0.590128
12.800000 -3.365139 -0.830795 0.599828 -0.392417 0.121285 -0.516786
12.833333 -3.378253 -0.826706 0.586588 -0.393530 0.124656 -0.458841
12.866667 -3.391413 -0.822482 0.594959 -0.394572 0.128028 -0.430562
12.900000 -3.404613 -0.818121 0.591169 -0.395539 0.131379 -0.435103
12.933333 -3.417837 -0.813677 0.588710 -0.396421 0.134697 -0.472014
12.966667 -3.431093 -0.809098 0.574809 -0.397208 0.137964 -0.536752
13.000000 -3.444375 -0.804386 0.575595 -0.397893 0.141166 -0.625113
13.033333 -3.457674 -0.799593 0.550933 -0.398473 0.144293 -0.723488
13.066667 -3.470990 -0.794720 0.530187 -0.398948 0.147342 -0.817033
13.100000 -3.484318 -0.789769 0.481328 -0.399321 0.150319 -0.891394
13.133333 -3.497658 -0.784739 0.461139 -0.399597 0.153221 -0.938016
13.166667 -3.511002 -0.779583 0.388627 -0.399785 0.156051 -0.945599
13.200000 -3.524345 -0.774303 0.342254 -0.399888 0.158815 -0.902124
13.233333 -3.537694 -0.768948 0.293851 -0.399905 0.161520 -0.809962
13.266667 -3.551033 -0.763474 0.264638 -0.399836 0.164166 -0.669320
13.300000 -3.564374 -0.757928 0.224276 -0.399674 0.166753 -0.494908
13.333333 -3.577715 -0.752313 0.198682 -0.399409 0.169282 -0.292293
13.366667 -3.591054 -0.746630 0.198682 -0.399033 0.171760 -0.084822
13.400000 -3.604365 -0.740841 0.188152 -0.398536 0.174190 0.104805
13.433333 -3.617670 -0.734986 0.221852 -0.397916 0.176571 0.255248
13.466667 -3.630967 -0.729068 0.249129 -0.397174 0.178907 0.339256
13.500000 -3.644254 -0.723088 0.279039 -0.396312 0.181200 0.342166
13.533333 -3.657494 -0.717013 0.339803 -0.395331 0.183448 0.235503
13.566667 -3.670681 -0.710847 0.371567 -0.394233 0.185645 0.007758
13.600000 -3.683810 -0.704594 0.415036 -0.393024 0.187782 -0.356980
13.633333 -3.696872 -0.698256 0.407870 -0.391708 0.189854 -0.854475
13.666667 -3.709915 -0.691865 0.437172 -0.390290 0.191851 -1.479283
13.700000 -3.722937 -0.685422 0.388319 -0.388780 0.193763 -2.217010
13.733333 -3.735875 -0.678904 0.346035 -0.387202 0.195583 -3.040833
13.766667 -3.748789 -0.672338 0.259313 -0.385573 0.197307 -3.907507
13.800000 -3.761677 -0.665727 0.094752 -0.383912 0.198934 -4.753406
13.833333 -3.774464 -0.659052 -0.067472 -0.382232 0.200467 -5.530982
13.866667 -3.787147 -0.652318 -0.286082 -0.380546 0.201906 -6.172917
13.900000 -3.799799 -0.645543 -0.592559 -0.378858 0.203254 -6.625537
13.933333 -3.812341 -0.638718 -0.910668 -0.377163 0.204515 -6.829971
13.966667 -3.824850 -0.631857 -1.188010 -0.375456 0.205692 -6.763451
14.000000 -3.837324 -0.624961 -1.549733 -0.373731 0.206783 -6.417705
14.033333 -3.849763 -0.618033 -1.843316 -0.371983 0.207790 -5.803814
14.066667 -3.862164 -0.611075 -2.177380 -0.370202 0.208716 -4.949020
14.100000 -3.874527 -0.604088 -2.372795 -0.368391 0.209562 -3.907035
14.133333 -3.886850 -0.597075 -2.465239 -0.366539 0.210328 -2.742411
14.166667 -3.899069 -0.590035 -2.476812 -0.364650 0.211014 -1.515706
14.200000 -3.911187 -0.582973 -2.477820 -0.362733 0.211617 -0.301543
14.233333 -3.923208 -0.575892 -2.437539 -0.360802 0.212134 0.852852
14.266667 -3.935185 -0.568792 -2.353393 -0.358871 0.212558 1.892151
14.300000 -3.947073 -0.561680 -2.236641 -0.356958 0.212882 2.800893
14.333333 -3.958915 -0.554554 -1.993301 -0.355090 0.213099 3.559695
14.366667 -3.970711 -0.547415 -1.848372 -0.353279 0.213206 4.175632
14.400000 -3.982458 -0.540266 -1.683117 -0.351528 0.213199 4.658949
14.433333 -3.994142 -0.533128 -1.584840 -0.349833 0.213070 5.021395
14.466667 -4.005766 -0.526005 -1.355591 -0.348190 0.212822 5.273100
14.500000 -4.017336 -0.518905 -1.196994 -0.346584 0.212465 5.421793
14.533333 -4.028855 -0.511802 -0.955481 -0.345001 0.212002 5.475824
14.566667 -4.040321 -0.504699 -0.755514 -0.343432 0.211440 5.424458
14.600000 -4.051741 -0.497637 -0.554289 -0.341871 0.210789 5.264553
14.633333 -4.063116 -0.490622 -0.382434 -0.340315 0.210066 4.988110
14.666667 -4.074435 -0.483612 -0.130556 -0.338760 0.209275 4.601962
14.700000 -4.085708 -0.476655 0.045509 -0.337206 0.208419 4.102932
14.733333 -4.096924 -0.469706 0.213704 -0.335652 0.207504 3.504911
14.766667 -4.108093 -0.462814 0.333794 -0.334095 0.206542 2.833410
14.800000 -4.119203 -0.455933 0.419477 -0.332536 0.205537 2.121999
14.833333 -4.130254 -0.449066 0.487305 -0.330978 0.204485 1.398695
14.866667 -4.141258 -0.442253 0.524425 -0.329421 0.203396 0.699997
14.900000 -4.152214 -0.435494 0.487665 -0.327866 0.202273 0.065225
14.933333 -4.163109 -0.428753 0.414552 -0.326314 0.201123 -0.476371
14.966667 -4.173960 -0.422065 0.374350 -0.324765 0.199942 -0.907408
15.000000 -4.184767 -0.415430 0.304008 -0.323215 0.198739 -1.220155
15.033333 -4.195509 -0.408818 0.205327 -0.321658 0.197524 -1.403106
15.066667 -4.206211 -0.402259 0.122873 -0.320091 0.196299 -1.463841
15.100000 -4.216848 -0.395725 0.044511 -0.318515 0.195066 -1.418899
15.133333 -4.227445 -0.389245 -0.018588 -0.316923 0.193827 -1.294045
15.166667 -4.238005 -0.382819 -0.060462 -0.315312 0.192586 -1.105635
15.200000 -4.248497 -0.376421 -0.086252 -0.313682 0.191336 -0.874014
15.233333 -4.258920 -0.370053 -0.109884 -0.312032 0.190075 -0.622120
15.266667 -4.269308 -0.363740 -0.128902 -0.310355 0.188802 -0.367692
15.300000 -4.279624 -0.357459 -0.120689 -0.308643 0.187520 -0.123955
15.333333 -4.289870 -0.351211 -0.121486 -0.306898 0.186224 0.106706
15.366667 -4.300078 -0.345020 -0.089433 -0.305117 0.184911 0.310285
15.400000 -4.310248 -0.338887 -0.066450 -0.303293 0.183584 0.485013
15.433333 -4.320344 -0.332790 -0.042290 -0.301424 0.182240 0.623629
15.466667 -4.330365 -0.326730 -0.055717 -0.299511 0.180876 0.725779
15.500000 -4.340342 -0.320730 0.001419 -0.297553 0.179492 0.788208
15.533333 -4.350243 -0.314768 0.019346 -0.295543 0.178091 0.808707
15.566667 -4.360067 -0.308846 0.091651 -0.293480 0.176675 0.787573
15.600000 -4.369812 -0.302964 0.133523 -0.291364 0.175244 0.721582
15.633333 -4.379501 -0.297142 0.174984 -0.289193 0.173798 0.612749
15.666667 -4.389110 -0.291362 0.190783 -0.286961 0.172340 0.458805
15.700000 -4.398653 -0.285643 0.204389 -0.284666 0.170867 0.270519
15.733333 -4.408126 -0.279982 0.224022 -0.282306 0.169378 0.050112
15.766667 -4.417517 -0.274366 0.222205 -0.279875 0.167871 -0.182952
15.800000 -4.426824 -0.268796 0.220862 -0.277368 0.166347 -0.416580
15.833333 -4.436048 -0.263270 0.202909 -0.274785 0.164806 -0.632385
15.866667 -4.445186 -0.257791 0.177864 -0.272126 0.163246 -0.816363
15.900000 -4.454239 -0.252359 0.117804 -0.269394 0.161666 -0.959865
15.933333 -4.463189 -0.246988 0.070593 -0.266592 0.160064 -1.050063
15.966667 -4.472034 -0.241678 -0.011668 -0.263725 0.158437 -1.088072
16.000000 -4.480792 -0.236416 -0.059808 -0.260799 0.156782 -1.070894
16.033333 -4.489437 -0.231218 -0.100410 -0.257813 0.155097 -1.004717
16.066667 -4.497993 -0.226069 -0.156669 -0.254771 0.153379 -0.895234
16.100000 -4.506433 -0.220986 -0.171192 -0.251671 0.151626 -0.756248
16.133333 -4.514782 -0.215954 -0.202244 -0.248509 0.149836 -0.598784
16.166667 -4.523041 -0.210973 -0.221005 -0.245280 0.148005 -0.438580
16.200000 -4.531176 -0.206061 -0.217983 -0.241983 0.146132 -0.289939
16.233333 -4.539220 -0.201201 -0.207567 -0.238612 0.144214 -0.162240
16.266667 -4.547136 -0.196414 -0.209653 -0.235170 0.142249 -0.061567
16.300000 -4.554923 -0.191700 -0.198352 -0.231662 0.140243 0.010744
16.333333 -4.562618 -0.187040 -0.180849 -0.228094 0.138197 0.051511
16.366667 -4.570181 -0.182455 -0.173593 -0.224482 0.136122 0.065454
16.400000 -4.577611 -0.177947 -0.178098 -0.220835 0.134023 0.059886
16.433333 -4.584909 -0.173516 -0.163105 -0.217171 0.131911 0.040649
16.466667 -4.592073 -0.169162 -0.160308 -0.213508 0.129797 0.010640
16.500000 -4.599103 -0.164885 -0.168096 -0.209858 0.127690 -0.022322
16.533333 -4.606040 -0.160662 -0.175705 -0.206240 0.125600 -0.052629
16.566667 -4.612844 -0.156516 -0.181337 -0.202665 0.123536 -0.075745
16.600000 -4.619517 -0.152446 -0.180975 -0.199147 0.121506 -0.093378
16.633333 -4.626097 -0.148430 -0.197150 -0.195692 0.119516 -0.102687
16.666667 -4.632548 -0.144488 -0.195254 -0.192306 0.117568 -0.101980
16.700000 -4.638872 -0.140621 -0.202979 -0.188990 0.115666 -0.094842
16.733333 -4.645103 -0.136806 -0.206639 -0.185744 0.113808 -0.083139
16.766667 -4.651209 -0.133064 -0.201483 -0.182566 0.111995 -0.070980
16.800000 -4.657224 -0.129373 -0.210788 -0.179453 0.110225 -0.055265
16.833333 -4.663146 -0.125734 -0.209217 -0.176401 0.108495 -0.042433
16.866667 -4.668976 -0.122145 -0.214598 -0.173401 0.106801 -0.032399
16.900000 -4.674689 -0.118626 -0.206717 -0.170444 0.105137 -0.025486
16.933333 -4.680311 -0.115156 -0.214538 -0.167525 0.103497 -0.020318
16.966667 -4.685842 -0.111737 -0.200247 -0.164631 0.101875 -0.015371
17.000000 -4.691284 -0.108367 -0.204698 -0.161753 0.100262 -0.015332
17.033333 -4.696636 -0.105045 -0.209260 -0.158884 0.098656 -0.015918
17.066667 -4.701877 -0.101788 -0.215241 -0.156023 0.097054 -0.016705
17.100000 -4.707031 -0.098579 -0.217381 -0.153167 0.095456 -0.017036
17.133333 -4.712097 -0.095418 -0.206700 -0.150316 0.093860 -0.019975
17.166667 -4.717057 -0.092317 -0.211629 -0.147475 0.092270 -0.024710
17.200000 -4.721930 -0.089264 -0.216592 -0.144648 0.090689 -0.030138
17.233333 -4.726701 -0.086270 -0.215595 -0.141838 0.089120 -0.040074
17.266667 -4.731370 -0.083334 -0.213803 -0.139049 0.087566 -0.060132
17.300000 -4.735939 -0.080456 -0.209303 -0.136287 0.086029 -0.091657
17.333333 -4.740425 -0.077622 -0.221860 -0.133556 0.084515 -0.131624
17.366667 -4.744828 -0.074832 -0.218483 -0.130858 0.083023 -0.183017
17.400000 -4.749136 -0.072096 -0.212205 -0.128196 0.081556 -0.244875
17.433333 -4.753362 -0.069402 -0.223377 -0.125572 0.080115 -0.313570
