t x y theta dxdt dydt dthetadt
0.000000 0.000000 0.000000 -1.015627 0.015081 -0.006138 -0.016795
0.033333 0.000275 -0.000234 -1.024508 0.020867 -0.007124 -0.041300
0.066667 0.000952 -0.000327 -1.030132 0.028175 -0.008494 -0.090535
0.100000 0.001478 -0.000506 -1.016927 0.037129 -0.010474 -0.184315
0.133333 0.002117 -0.000737 -1.008850 0.047408 -0.013374 -0.328124
0.166667 0.003209 -0.001063 -1.016946 0.058356 -0.017512 -0.524311
0.200000 0.005025 -0.001432 -0.995606 0.068963 -0.023396 -0.780428
0.233333 0.006665 -0.001898 -0.984962 0.078124 -0.031410 -1.103006
0.266667 0.009795 -0.002533 -1.035226 0.084409 -0.041829 -1.475295
0.300000 0.014437 -0.003224 -1.086764 0.086065 -0.054789 -1.874682
0.333333 0.018875 -0.004019 -1.130862 0.081903 -0.070230 -2.290496
0.366667 0.024247 -0.005462 -1.190667 0.070600 -0.087895 -2.708271
0.400000 0.029849 -0.007815 -1.316364 0.051570 -0.107143 -3.099457
0.433333 0.034500 -0.011602 -1.469037 0.024363 -0.127283 -3.435456
0.466667 0.036600 -0.016651 -1.618332 -0.010894 -0.146882 -3.712005
0.500000 0.038441 -0.021808 -1.788492 -0.053310 -0.164464 -3.919302
0.533333 0.036199 -0.028864 -1.944397 -0.101879 -0.178507 -4.041178
0.566667 0.033683 -0.036022 -2.106684 -0.155524 -0.186503 -4.068433
0.600000 0.027560 -0.044198 -2.207835 -0.212682 -0.187693 -4.018990
0.633333 0.017945 -0.053331 -2.356038 -0.271635 -0.181473 -3.910222
0.666667 0.008056 -0.062550 -2.538218 -0.330244 -0.169454 -3.747581
0.700000 -0.005549 -0.070068 -2.684977 -0.386306 -0.153904 -3.545541
0.733333 -0.019417 -0.077662 -2.779635 -0.438133 -0.137618 -3.327233
0.766667 -0.033541 -0.085327 -2.884087 -0.483025 -0.126039 -3.112607
0.800000 -0.053385 -0.085994 -2.963927 -0.519431 -0.122227 -2.903329
0.833333 -0.073461 -0.086731 -3.043894 -0.546175 -0.129199 -2.704738
0.866667 -0.093757 -0.087542 -3.124583 -0.562849 -0.147610 -2.527840
0.900000 -0.122065 -0.071923 3.094889 -0.569210 -0.178178 -2.381374
0.933333 -0.144294 -0.074783 3.017957 -0.565254 -0.219256 -2.257400
0.966667 -0.166689 -0.077744 2.930679 -0.551832 -0.267637 -2.153119
1.000000 -0.185556 -0.089980 2.872874 -0.530007 -0.319318 -2.066917
1.033333 -0.202295 -0.107436 2.829457 -0.500989 -0.369933 -1.997343
1.066667 -0.217691 -0.127663 2.745742 -0.465920 -0.415710 -1.938281
1.100000 -0.232027 -0.148999 2.686008 -0.427098 -0.450791 -1.879783
1.133333 -0.245986 -0.170521 2.603566 -0.386220 -0.472984 -1.821198
1.166667 -0.258754 -0.191242 2.533162 -0.344994 -0.480270 -1.757172
1.200000 -0.270151 -0.210327 2.499699 -0.304834 -0.473532 -1.686014
1.233333 -0.279909 -0.227617 2.447601 -0.266922 -0.454654 -1.600221
1.266667 -0.287067 -0.242230 2.412618 -0.232653 -0.426561 -1.502608
1.300000 -0.294327 -0.256815 2.349793 -0.202632 -0.393885 -1.395047
1.333333 -0.298072 -0.268055 2.281941 -0.177913 -0.359848 -1.282692
1.366667 -0.301927 -0.279250 2.214136 -0.159378 -0.327391 -1.172605
1.400000 -0.304253 -0.287756 2.173875 -0.147665 -0.297997 -1.067790
1.433333 -0.305934 -0.294653 2.153414 -0.143155 -0.272147 -0.980483
1.466667 -0.308581 -0.300770 2.151747 -0.145463 -0.249119 -0.913887
1.500000 -0.311366 -0.306826 2.149776 -0.154076 -0.227896 -0.881356
1.533333 -0.315388 -0.313658 2.119103 -0.167767 -0.206645 -0.892011
1.566667 -0.320845 -0.321050 2.098713 -0.185229 -0.183599 -0.949689
1.600000 -0.327520 -0.329058 2.069626 -0.205004 -0.156976 -1.053536
1.633333 -0.335273 -0.337438 2.051261 -0.225674 -0.125507 -1.191284
1.666667 -0.344104 -0.344771 2.041173 -0.246294 -0.088687 -1.351233
1.700000 -0.353727 -0.350297 2.001043 -0.265944 -0.046198 -1.507383
1.733333 -0.364078 -0.353106 1.940339 -0.284160 0.001148 -1.630530
1.766667 -0.374612 -0.352240 1.860874 -0.300722 0.051265 -1.692472
1.800000 -0.384733 -0.348188 1.789090 -0.315636 0.100859 -1.674890
1.833333 -0.395015 -0.344080 1.676525 -0.329131 0.146729 -1.565543
1.866667 -0.405800 -0.336510 1.571162 -0.341427 0.185397 -1.356442
1.900000 -0.417076 -0.326007 1.491626 -0.352849 0.213234 -1.054361
1.933333 -0.429680 -0.313513 1.429133 -0.363718 0.227097 -0.683474
1.966667 -0.442443 -0.301027 1.408257 -0.374212 0.225803 -0.279532
2.000000 -0.455361 -0.288567 1.392428 -0.384403 0.209940 0.126393
2.033333 -0.468433 -0.276154 1.398669 -0.394288 0.180145 0.502117
2.066667 -0.481656 -0.263807 1.481268 -0.403861 0.138301 0.817212
2.100000 -0.495426 -0.257847 1.594241 -0.413077 0.087695 1.046997
2.133333 -0.509464 -0.258045 1.695927 -0.421905 0.032541 1.182142
2.166667 -0.523644 -0.258349 1.784241 -0.430479 -0.023602 1.227015
2.200000 -0.537772 -0.263097 1.833386 -0.439112 -0.077420 1.189563
2.233333 -0.552349 -0.270454 1.875876 -0.448216 -0.125221 1.076033
2.266667 -0.567785 -0.279749 1.884613 -0.458125 -0.163853 0.904805
2.300000 -0.583348 -0.289154 1.878728 -0.469153 -0.191895 0.701506
2.333333 -0.599035 -0.298666 1.870394 -0.481596 -0.209263 0.491413
2.366667 -0.614839 -0.308283 1.894707 -0.495415 -0.216236 0.292339
2.400000 -0.630605 -0.317773 1.926902 -0.510341 -0.214162 0.114905
2.433333 -0.646973 -0.326033 1.941390 -0.525610 -0.205393 -0.025058
2.466667 -0.663444 -0.334390 1.930278 -0.540283 -0.192738 -0.124008
2.500000 -0.681593 -0.340861 1.908557 -0.553298 -0.178539 -0.186106
2.533333 -0.701089 -0.345535 1.894581 -0.563479 -0.164793 -0.218460
2.566667 -0.722194 -0.348248 1.847302 -0.569387 -0.153431 -0.221860
2.600000 -0.743366 -0.351064 1.821273 -0.569684 -0.145827 -0.196076
2.633333 -0.764596 -0.353991 1.803931 -0.563719 -0.142498 -0.143039
2.666667 -0.785872 -0.357033 1.802079 -0.551355 -0.143478 -0.067371
2.700000 -0.806345 -0.360446 1.805113 -0.532757 -0.148079 0.025597
2.733333 -0.826844 -0.363985 1.831000 -0.508438 -0.154809 0.125147
2.766667 -0.844376 -0.369157 1.837853 -0.480167 -0.161786 0.218735
2.800000 -0.858506 -0.376420 1.850119 -0.450016 -0.166982 0.298481
2.833333 -0.872641 -0.383818 1.854041 -0.419770 -0.168607 0.359689
2.866667 -0.886776 -0.391353 1.880523 -0.390927 -0.165037 0.404989
2.900000 -0.895987 -0.398678 1.891256 -0.365198 -0.155630 0.440005
2.933333 -0.905197 -0.406143 1.918470 -0.344434 -0.140725 0.479970
2.966667 -0.914409 -0.413748 1.952485 -0.329929 -0.120970 0.533911
3.000000 -0.923624 -0.421495 1.976657 -0.322404 -0.097343 0.606787
3.033333 -0.932395 -0.424964 1.978484 -0.322608 -0.071195 0.697814
3.066667 -0.942714 -0.422808 1.950174 -0.331572 -0.044383 0.806287
3.100000 -0.953040 -0.420813 1.943822 -0.349916 -0.018361 0.930519
3.133333 -0.963373 -0.418991 1.974306 -0.377370 0.005618 1.062184
3.166667 -0.973713 -0.417356 2.032221 -0.413255 0.026140 1.196551
3.200000 -0.984060 -0.415920 2.118951 -0.457170 0.041955 1.323738
3.233333 -0.994413 -0.414694 2.169111 -0.508625 0.052558 1.441054
3.266667 -1.010823 -0.412003 2.230252 -0.566043 0.058310 1.537825
3.300000 -1.033060 -0.408425 2.288184 -0.627068 0.059236 1.607507
3.333333 -1.055282 -0.405098 2.355064 -0.689721 0.055091 1.642801
3.366667 -1.077476 -0.402037 2.404099 -0.751675 0.045598 1.636779
3.400000 -1.104649 -0.399507 2.461792 -0.810004 0.030322 1.593828
3.433333 -1.136403 -0.397802 2.515283 -0.861435 0.008506 1.513930
3.466667 -1.168071 -0.396405 2.567889 -0.903999 -0.020818 1.404957
3.500000 -1.203531 -0.396551 2.630079 -0.936320 -0.057719 1.270356
3.533333 -1.238851 -0.397030 2.665402 -0.957069 -0.101440 1.125561
3.566667 -1.274002 -0.397854 2.723722 -0.965615 -0.150646 0.986163
3.600000 -1.308955 -0.399036 2.768521 -0.962497 -0.203628 0.862806
3.633333 -1.344641 -0.404309 2.828177 -0.948958 -0.258451 0.757288
3.666667 -1.378592 -0.414911 2.817796 -0.925870 -0.312905 0.674315
3.700000 -1.410079 -0.429920 2.768313 -0.895131 -0.365106 0.620617
3.733333 -1.439065 -0.447534 2.733146 -0.859235 -0.413328 0.592828
3.766667 -1.467718 -0.465518 2.755534 -0.820591 -0.456100 0.584064
3.800000 -1.496012 -0.483868 2.783892 -0.781106 -0.492195 0.585780
3.833333 -1.520407 -0.502259 2.831079 -0.742755 -0.520999 0.600364
3.866667 -1.541897 -0.521079 2.874949 -0.707472 -0.542723 0.618781
3.900000 -1.562972 -0.540247 2.919061 -0.676208 -0.558129 0.629573
3.933333 -1.583022 -0.559290 2.957268 -0.648978 -0.568326 0.622935
3.966667 -1.602624 -0.578669 2.968141 -0.625614 -0.574605 0.600327
4.000000 -1.621765 -0.598378 2.982068 -0.605900 -0.578222 0.564712
4.033333 -1.640429 -0.618411 2.981618 -0.588588 -0.579881 0.518477
4.066667 -1.659979 -0.638086 3.000421 -0.571647 -0.579801 0.466028
4.100000 -1.680070 -0.657008 3.010300 -0.552759 -0.577938 0.413641
4.133333 -1.699636 -0.676237 3.015793 -0.529764 -0.574481 0.366018
4.166667 -1.718661 -0.695767 3.025166 -0.500117 -0.570012 0.320849
4.200000 -1.737128 -0.715592 3.033500 -0.461284 -0.565118 0.281813
4.233333 -1.755023 -0.735708 3.053153 -0.411038 -0.562300 0.251051
4.266667 -1.770198 -0.753831 3.073116 -0.348972 -0.563230 0.238370
4.300000 -1.784770 -0.772237 3.090693 -0.275919 -0.568789 0.251348
4.333333 -1.798726 -0.790920 3.101047 -0.193628 -0.579048 0.299165
4.366667 -1.807793 -0.807577 3.102383 -0.105153 -0.593300 0.390410
4.400000 -1.811703 -0.822766 3.078676 -0.013934 -0.610977 0.522602
4.433333 -1.810475 -0.838049 3.065933 0.075159 -0.628315 0.692236
4.466667 -1.803775 -0.855637 3.037374 0.158388 -0.643597 0.892370
4.500000 -1.790785 -0.879280 3.044954 0.232621 -0.655979 1.113037
4.533333 -1.777185 -0.903188 3.113163 0.295581 -0.665420 1.339810
4.566667 -1.754550 -0.945452 -3.083309 0.345299 -0.670846 1.554143
4.600000 -1.736576 -0.973655 -2.995144 0.381007 -0.672086 1.741309
4.633333 -1.721694 -0.994413 -2.907395 0.403710 -0.671090 1.888793
4.666667 -1.708957 -1.011574 -2.836765 0.415015 -0.669201 1.982705
4.700000 -1.695698 -1.028943 -2.742651 0.416929 -0.668366 2.018630
4.733333 -1.681931 -1.046520 -2.672792 0.411245 -0.670219 2.002399
4.766667 -1.667669 -1.064303 -2.595263 0.400952 -0.679225 1.947163
4.800000 -1.655168 -1.085941 -2.528218 0.387980 -0.697304 1.870699
4.833333 -1.642197 -1.107779 -2.477277 0.373279 -0.725104 1.788339
4.866667 -1.628769 -1.129809 -2.427588 0.357021 -0.762384 1.717890
4.900000 -1.617149 -1.156485 -2.376061 0.339441 -0.807754 1.672131
4.933333 -1.605094 -1.183338 -2.337382 0.320776 -0.859819 1.656303
4.966667 -1.592610 -1.210355 -2.286329 0.300857 -0.915289 1.672412
5.000000 -1.582143 -1.241627 -2.259364 0.279689 -0.972668 1.718120
5.033333 -1.574291 -1.276428 -2.201682 0.257832 -1.030810 1.790418
5.066667 -1.566032 -1.311347 -2.159174 0.236171 -1.088623 1.882993
5.100000 -1.560281 -1.350853 -2.086967 0.215432 -1.145221 1.984857
5.133333 -1.554129 -1.390431 -1.999159 0.196288 -1.199939 2.085974
5.166667 -1.547577 -1.430059 -1.927881 0.179116 -1.252614 2.176515
5.200000 -1.542436 -1.473358 -1.847451 0.164415 -1.302487 2.243572
5.233333 -1.538786 -1.520051 -1.758793 0.152362 -1.348787 2.277269
5.266667 -1.534734 -1.566706 -1.693412 0.143039 -1.390869 2.273323
5.300000 -1.530276 -1.613290 -1.593734 0.136302 -1.428212 2.234816
5.333333 -1.526541 -1.663822 -1.503825 0.132270 -1.459138 2.168973
5.366667 -1.522394 -1.714214 -1.404882 0.131207 -1.481194 2.080771
5.400000 -1.517833 -1.764430 -1.332972 0.133215 -1.491867 1.987115
5.433333 -1.513896 -1.815922 -1.281926 0.138357 -1.489403 1.907727
5.466667 -1.510179 -1.869783 -1.233808 0.146634 -1.472210 1.856335
5.500000 -1.506619 -1.924871 -1.177893 0.158125 -1.438917 1.844545
5.533333 -1.502626 -1.979624 -1.147242 0.172543 -1.389839 1.877237
5.566667 -1.497830 -2.030468 -1.114913 0.189261 -1.326063 1.966141
5.600000 -1.491916 -2.078701 -1.072857 0.207675 -1.249919 2.107019
5.633333 -1.484827 -2.123002 -1.015661 0.227050 -1.163243 2.281762
5.666667 -1.476549 -2.162142 -0.945121 0.246590 -1.068114 2.469012
5.700000 -1.467188 -2.194472 -0.865803 0.265413 -0.967106 2.644725
5.733333 -1.456958 -2.218169 -0.753545 0.282755 -0.862749 2.784588
5.766667 -1.446272 -2.241331 -0.619762 0.298271 -0.757903 2.851518
5.800000 -1.435129 -2.263947 -0.482926 0.312167 -0.654253 2.820971
5.833333 -1.423530 -2.286010 -0.351577 0.325436 -0.553677 2.684711
5.866667 -1.411474 -2.307510 -0.261396 0.339135 -0.457877 2.450939
5.900000 -1.400776 -2.319788 -0.112209 0.354627 -0.368093 2.127808
5.933333 -1.389620 -2.331497 0.009495 0.373798 -0.284206 1.734752
5.966667 -1.379010 -2.337022 0.071148 0.398879 -0.206173 1.308373
6.000000 -1.367275 -2.337032 0.086190 0.431172 -0.134809 0.883093
6.033333 -1.355076 -2.336497 0.070303 0.471014 -0.070818 0.490850
6.066667 -1.342413 -2.335430 0.029247 0.518726 -0.014873 0.147832
6.100000 -1.329283 -2.333848 -0.028632 0.574264 0.033279 -0.121017
6.133333 -1.310842 -2.330149 -0.067373 0.636470 0.072990 -0.303270
6.166667 -1.287052 -2.325524 -0.108683 0.703036 0.104505 -0.401349
6.200000 -1.262812 -2.320434 -0.119793 0.772422 0.128945 -0.425598
6.233333 -1.238132 -2.314897 -0.138625 0.843710 0.147353 -0.395905
6.266667 -1.207521 -2.308903 -0.149864 0.915519 0.160778 -0.327229
6.300000 -1.171177 -2.302981 -0.149179 0.986176 0.169595 -0.245163
6.333333 -1.134447 -2.296667 -0.151863 1.054781 0.174643 -0.167612
6.366667 -1.097355 -2.289979 -0.134273 1.121132 0.176518 -0.109451
6.400000 -1.059926 -2.282937 -0.128154 1.184460 0.175603 -0.075968
6.433333 -1.022183 -2.275559 -0.127550 1.243524 0.172283 -0.064819
6.466667 -0.981177 -2.268997 -0.129726 1.297801 0.166873 -0.077660
6.500000 -0.936060 -2.263268 -0.130384 1.347330 0.159518 -0.108317
6.533333 -0.887602 -2.258416 -0.125492 1.391736 0.150238 -0.154607
6.566667 -0.836351 -2.254725 -0.143365 1.430145 0.138853 -0.207723
6.600000 -0.784950 -2.250781 -0.138478 1.461685 0.124939 -0.265565
6.633333 -0.733437 -2.246598 -0.159913 1.485787 0.108428 -0.331145
6.666667 -0.681853 -2.242191 -0.171391 1.501834 0.089414 -0.396076
6.700000 -0.630235 -2.237573 -0.190021 1.509168 0.068090 -0.460647
6.733333 -0.578624 -2.232757 -0.197645 1.507661 0.044457 -0.521566
6.766667 -0.527513 -2.230581 -0.200461 1.497622 0.018775 -0.580377
6.800000 -0.475950 -2.230341 -0.237427 1.479850 -0.008223 -0.636154
6.833333 -0.424670 -2.232113 -0.266735 1.454757 -0.035876 -0.679238
6.866667 -0.373554 -2.233728 -0.289778 1.422557 -0.063604 -0.711626
6.900000 -0.325068 -2.237434 -0.315083 1.383890 -0.090490 -0.732029
6.933333 -0.279971 -2.242778 -0.328473 1.339093 -0.115309 -0.741381
6.966667 -0.235147 -2.247978 -0.393850 1.288604 -0.137093 -0.737959
7.000000 -0.190628 -2.253034 -0.390399 1.232394 -0.155296 -0.723232
7.033333 -0.149744 -2.259367 -0.447656 1.171157 -0.169512 -0.702920
7.066667 -0.109226 -2.265558 -0.462862 1.105361 -0.179285 -0.682360
7.100000 -0.074446 -2.273003 -0.462862 1.035078 -0.184489 -0.660680
7.133333 -0.040080 -2.280306 -0.511509 0.960425 -0.185422 -0.633253
7.166667 -0.010622 -2.287709 -0.509385 0.882089 -0.182348 -0.605790
7.200000 0.018383 -2.294967 -0.491752 0.801319 -0.175523 -0.576344
7.233333 0.046921 -2.302077 -0.550166 0.719203 -0.165486 -0.541414
7.266667 0.071222 -2.308271 -0.562015 0.637610 -0.152960 -0.497847
7.300000 0.091398 -2.313687 -0.593644 0.558393 -0.138899 -0.441868
7.333333 0.107477 -2.317995 -0.612909 0.483778 -0.124148 -0.382373
7.366667 0.119748 -2.321344 -0.632007 0.415153 -0.109644 -0.313054
7.400000 0.128701 -2.323862 -0.644824 0.353736 -0.096337 -0.234954
7.433333 0.135211 -2.325680 -0.661950 0.300513 -0.084893 -0.156776
7.466667 0.140454 -2.327226 -0.644410 0.255568 -0.075859 -0.079089
7.500000 0.145219 -2.328633 -0.646145 0.218570 -0.069429 -0.010476
7.533333 0.149515 -2.329904 -0.638896 0.188516 -0.065624 0.051827
7.566667 0.155696 -2.331897 -0.610412 0.164158 -0.064191 0.097506
7.600000 0.161425 -2.333760 -0.620317 0.143962 -0.064680 0.130716
7.633333 0.167224 -2.335981 -0.607783 0.126216 -0.066579 0.152284
7.666667 0.172586 -2.338075 -0.602989 0.109576 -0.069309 0.163881
7.700000 0.176751 -2.340437 -0.587844 0.093199 -0.072370 0.167852
7.733333 0.179372 -2.343134 -0.611223 0.076745 -0.075332 0.164812
7.766667 0.181582 -2.345709 -0.597155 0.060449 -0.077972 0.163041
7.800000 0.182277 -2.348814 -0.584939 0.044892 -0.080105 0.154857
7.833333 0.182583 -2.351795 -0.584239 0.030903 -0.081674 0.144644
7.866667 0.182512 -2.354654 -0.561864 0.019370 -0.082703 0.128238
7.900000 0.182222 -2.357608 -0.584815 0.011003 -0.083279 0.108312
7.933333 0.181579 -2.360438 -0.555608 0.006111 -0.083509 0.082873
