t x y theta dxdt dydt dthetadt
0.000000 0.000000 0.000000 1.298885 0.004643 0.000345 -0.016424
0.033333 0.000060 -0.000020 1.309892 0.008595 -0.001241 -0.015256
0.066667 0.000012 0.000119 1.301618 0.013918 -0.003482 -0.006400
0.100000 -0.000059 0.000262 1.313573 0.020877 -0.006519 0.015469
0.133333 0.000407 0.000158 1.309325 0.029807 -0.010460 0.053939
0.166667 0.000946 0.000058 1.309215 0.041127 -0.015411 0.115340
0.200000 0.002058 -0.000307 1.298864 0.055251 -0.021479 0.205835
0.233333 0.003373 -0.000809 1.305861 0.072556 -0.028722 0.333610
0.266667 0.005134 -0.001510 1.306466 0.093511 -0.037173 0.492761
0.300000 0.007523 -0.002504 1.306652 0.118458 -0.046809 0.676438
0.333333 0.010868 -0.003920 1.313370 0.147470 -0.057577 0.876959
0.366667 0.015488 -0.005932 1.312808 0.180263 -0.069337 1.082619
0.400000 0.020787 -0.008262 1.370998 0.216577 -0.081962 1.274910
0.433333 0.026783 -0.010919 1.448950 0.255899 -0.095305 1.435605
0.466667 0.035126 -0.014178 1.507977 0.297340 -0.109190 1.556636
0.500000 0.046103 -0.018138 1.590068 0.339905 -0.123440 1.633511
0.533333 0.057820 -0.022447 1.678769 0.382778 -0.137923 1.663586
0.566667 0.072047 -0.027400 1.762888 0.425194 -0.152537 1.647693
0.600000 0.088584 -0.032859 1.837662 0.466257 -0.167154 1.598061
0.633333 0.105888 -0.038687 1.882045 0.505242 -0.181652 1.530164
0.666667 0.123969 -0.044892 1.916520 0.541881 -0.195961 1.452148
0.700000 0.143439 -0.051751 1.935727 0.576164 -0.210030 1.373782
0.733333 0.163699 -0.058998 1.955891 0.608153 -0.223821 1.304697
0.766667 0.184793 -0.066799 1.980926 0.638205 -0.237330 1.252112
0.800000 0.206688 -0.074999 2.025039 0.666948 -0.250609 1.213630
0.833333 0.229473 -0.083704 2.075585 0.695010 -0.263714 1.182031
0.866667 0.252992 -0.092854 2.124828 0.722810 -0.276705 1.154351
0.900000 0.277327 -0.102418 2.176260 0.750779 -0.289758 1.120457
0.933333 0.302399 -0.112215 2.222666 0.779230 -0.303112 1.071446
0.966667 0.328295 -0.122435 2.269789 0.808369 -0.317095 0.999445
1.000000 0.355499 -0.132911 2.298032 0.838227 -0.332020 0.906619
1.033333 0.383535 -0.143819 2.327166 0.868904 -0.348325 0.794898
1.066667 0.413421 -0.155508 2.356224 0.900509 -0.366495 0.665564
1.100000 0.444144 -0.167638 2.382751 0.933025 -0.386875 0.528580
1.133333 0.475706 -0.180211 2.379387 0.966398 -0.409601 0.393589
1.166667 0.508107 -0.193232 2.401702 1.000505 -0.434620 0.267787
1.200000 0.541348 -0.206704 2.417809 1.035301 -0.461849 0.150012
1.233333 0.576167 -0.221734 2.399066 1.070576 -0.490875 0.044743
1.266667 0.612461 -0.238438 2.395859 1.106121 -0.521046 -0.043698
1.300000 0.649981 -0.256638 2.384183 1.141740 -0.551576 -0.115946
1.333333 0.688336 -0.275292 2.371826 1.177362 -0.581792 -0.176890
1.366667 0.728234 -0.295687 2.364921 1.212958 -0.610969 -0.225694
1.400000 0.769740 -0.317567 2.349312 1.248392 -0.638312 -0.255883
1.433333 0.812656 -0.340714 2.345130 1.283622 -0.663276 -0.271444
1.466667 0.856389 -0.364301 2.349356 1.318675 -0.685562 -0.273950
1.500000 0.900933 -0.388322 2.338930 1.353525 -0.705070 -0.264443
1.533333 0.946281 -0.412772 2.307385 1.388012 -0.721709 -0.241012
1.566667 0.992660 -0.437502 2.298516 1.421941 -0.735680 -0.203891
1.600000 1.039995 -0.462448 2.291003 1.455284 -0.747367 -0.160377
1.633333 1.089050 -0.487786 2.280446 1.488004 -0.757229 -0.110467
1.666667 1.139686 -0.513471 2.274211 1.519938 -0.765738 -0.055543
1.700000 1.191880 -0.539199 2.270672 1.550915 -0.773413 0.000961
1.733333 1.244824 -0.565319 2.278052 1.580785 -0.780806 0.053102
1.766667 1.298506 -0.591825 2.281800 1.609444 -0.788311 0.094161
1.800000 1.353006 -0.618138 2.303224 1.636577 -0.796294 0.123057
1.833333 1.408123 -0.644196 2.313233 1.661949 -0.805028 0.138001
1.866667 1.463940 -0.670621 2.309263 1.685495 -0.814739 0.135826
1.900000 1.520444 -0.697410 2.337075 1.707277 -0.825540 0.116366
1.933333 1.578179 -0.724488 2.335630 1.727397 -0.837516 0.085579
1.966667 1.636798 -0.752342 2.331080 1.745920 -0.850730 0.049382
2.000000 1.695943 -0.780893 2.346974 1.763116 -0.865061 0.012529
2.033333 1.755718 -0.809782 2.341963 1.779162 -0.880330 -0.020642
2.066667 1.815504 -0.839466 2.327081 1.794191 -0.896215 -0.042447
2.100000 1.875891 -0.869474 2.320177 1.808201 -0.912395 -0.046369
2.133333 1.935976 -0.900190 2.317795 1.821341 -0.928453 -0.030891
2.166667 1.996635 -0.931214 2.310397 1.833797 -0.944041 0.002378
2.200000 2.057929 -0.963351 2.295503 1.845640 -0.958858 0.052566
2.233333 2.119767 -0.995779 2.297925 1.857108 -0.972692 0.117875
2.266667 2.181932 -1.029042 2.295892 1.868321 -0.985389 0.190277
2.300000 2.244610 -1.062576 2.304347 1.879514 -0.996771 0.262529
2.333333 2.307789 -1.096369 2.323625 1.890662 -1.006705 0.327325
2.366667 2.371176 -1.130514 2.329829 1.901798 -1.015004 0.384171
2.400000 2.435034 -1.164898 2.363201 1.912990 -1.021634 0.430092
2.433333 2.498474 -1.199180 2.385181 1.924294 -1.026512 0.461857
2.466667 2.562356 -1.233679 2.422088 1.935881 -1.029654 0.481326
2.500000 2.626664 -1.268386 2.432041 1.947924 -1.031172 0.492953
2.533333 2.691300 -1.303006 2.437269 1.960774 -1.031284 0.503547
2.566667 2.757667 -1.338438 2.457934 1.974500 -1.030188 0.510151
2.600000 2.823951 -1.373525 2.467022 1.989179 -1.028031 0.513716
2.633333 2.890207 -1.407839 2.471696 2.004522 -1.025011 0.517177
2.666667 2.956258 -1.441422 2.482488 2.020172 -1.021411 0.521115
2.700000 3.023276 -1.474996 2.504444 2.035596 -1.017523 0.521632
2.733333 3.090613 -1.508709 2.538982 2.050197 -1.013585 0.510189
2.766667 3.160152 -1.542735 2.547457 2.063547 -1.009933 0.491586
2.800000 3.230255 -1.576378 2.580677 2.075157 -1.006856 0.463753
2.833333 3.300759 -1.609716 2.607639 2.084770 -1.004585 0.426084
2.866667 3.371535 -1.642763 2.638293 2.092147 -1.003161 0.377074
2.900000 3.442354 -1.675717 2.637648 2.097298 -1.002578 0.319947
2.933333 3.513167 -1.708777 2.640342 2.100246 -1.002803 0.263069
2.966667 3.583638 -1.741924 2.634994 2.101239 -1.003749 0.205561
3.000000 3.653720 -1.775376 2.634256 2.100616 -1.005242 0.152869
3.033333 3.723155 -1.808943 2.647254 2.098822 -1.007071 0.104762
3.066667 3.792729 -1.842569 2.638635 2.096383 -1.009047 0.067112
3.100000 3.862425 -1.876247 2.646357 2.093783 -1.010973 0.037199
3.133333 3.932227 -1.909969 2.640773 2.091504 -1.012676 0.013876
3.166667 4.001972 -1.943998 2.653928 2.089846 -1.013985 -0.006174
3.200000 4.071722 -1.978151 2.647151 2.089057 -1.014861 -0.024692
3.233333 4.141321 -2.012358 2.650258 2.089239 -1.015328 -0.038511
3.266667 4.210712 -2.046442 2.641624 2.090361 -1.015430 -0.049674
3.300000 4.280043 -2.080316 2.645506 2.092213 -1.015241 -0.055771
3.333333 4.349067 -2.113882 2.638927 2.094675 -1.014916 -0.058018
3.366667 4.418078 -2.147436 2.631558 2.097564 -1.014630 -0.052571
3.400000 4.487923 -2.181164 2.630057 2.100617 -1.014495 -0.040834
3.433333 4.558529 -2.214980 2.621618 2.103560 -1.014683 -0.025876
3.466667 4.629071 -2.248760 2.622751 2.106174 -1.015427 -0.012621
3.500000 4.699954 -2.282549 2.615338 2.108374 -1.016944 -0.001307
3.533333 4.770870 -2.316373 2.614778 2.109878 -1.019292 0.007009
3.566667 4.841604 -2.350153 2.628970 2.110444 -1.022524 0.009094
3.600000 4.912200 -2.383862 2.647481 2.109989 -1.026727 0.002876
3.633333 4.982049 -2.417653 2.644211 2.108677 -1.031894 -0.012890
3.666667 5.052511 -2.452175 2.647801 2.106652 -1.037872 -0.034367
3.700000 5.122780 -2.486600 2.636204 2.104087 -1.044490 -0.061723
3.733333 5.192836 -2.520920 2.636104 2.101279 -1.051610 -0.092911
3.766667 5.262849 -2.555959 2.633400 2.098573 -1.058974 -0.123783
3.800000 5.332900 -2.591681 2.622600 2.096269 -1.066212 -0.146927
3.833333 5.402898 -2.627756 2.614198 2.094336 -1.072903 -0.156901
3.866667 5.472563 -2.664137 2.614566 2.092802 -1.078647 -0.151274
3.900000 5.541761 -2.700549 2.602091 2.091631 -1.082933 -0.128500
3.933333 5.610632 -2.736788 2.592297 2.090771 -1.085281 -0.087107
3.966667 5.680121 -2.773394 2.574501 2.090130 -1.085298 -0.026045
4.000000 5.750123 -2.810320 2.573097 2.089624 -1.082693 0.047915
4.033333 5.820192 -2.847362 2.564677 2.089296 -1.077261 0.129607
4.066667 5.889849 -2.884177 2.580827 2.089197 -1.068916 0.212849
4.100000 5.959696 -2.920528 2.578783 2.089387 -1.057778 0.294273
4.133333 6.029673 -2.956250 2.598930 2.089949 -1.043970 0.366004
4.166667 6.099172 -2.991704 2.621025 2.090962 -1.027731 0.418500
4.200000 6.168745 -3.026143 2.652534 2.092367 -1.009461 0.450829
4.233333 6.237994 -3.059364 2.665928 2.094145 -0.989656 0.461284
4.266667 6.306695 -3.092283 2.705387 2.096198 -0.968931 0.449440
4.300000 6.376295 -3.124173 2.728179 2.098309 -0.947984 0.412394
4.333333 6.446856 -3.155055 2.735703 2.100069 -0.927668 0.352597
4.366667 6.516797 -3.185604 2.740834 2.101006 -0.908852 0.277635
4.400000 6.587366 -3.215084 2.750067 2.100607 -0.892328 0.190507
4.433333 6.658200 -3.243870 2.756168 2.098155 -0.878802 0.095029
4.466667 6.729261 -3.271957 2.764072 2.092801 -0.868755 -0.000708
4.500000 6.800081 -3.299506 2.752174 2.083673 -0.862357 -0.089680
4.533333 6.870141 -3.326683 2.759422 2.070068 -0.859500 -0.164312
4.566667 6.939413 -3.353479 2.748914 2.051385 -0.859862 -0.223396
4.600000 7.008839 -3.381046 2.738328 2.027271 -0.862796 -0.263858
4.633333 7.077763 -3.409382 2.716675 1.997459 -0.867342 -0.282477
4.666667 7.145768 -3.438540 2.679888 1.961925 -0.872474 -0.280440
4.700000 7.212549 -3.468444 2.667478 1.921061 -0.877189 -0.259043
4.733333 7.277406 -3.498919 2.655240 1.875472 -0.880482 -0.222402
4.766667 7.339794 -3.529844 2.645776 1.825465 -0.881121 -0.173181
4.800000 7.401198 -3.560317 2.657619 1.770888 -0.877907 -0.119826
4.833333 7.459230 -3.590380 2.632954 1.712216 -0.870109 -0.067957
4.866667 7.514665 -3.620429 2.654733 1.649974 -0.857193 -0.026680
4.900000 7.569051 -3.649988 2.657630 1.583931 -0.838518 0.002397
4.933333 7.622368 -3.679042 2.665245 1.513563 -0.813651 0.015799
4.966667 7.671152 -3.706552 2.675020 1.439194 -0.782906 0.010412
5.000000 7.718837 -3.733533 2.681910 1.361946 -0.747116 -0.007256
5.033333 7.765408 -3.759974 2.672869 1.281772 -0.706641 -0.038628
5.066667 7.810852 -3.785863 2.684598 1.197951 -0.661544 -0.077734
5.100000 7.850308 -3.808175 2.687532 1.111140 -0.612700 -0.125961
5.133333 7.883364 -3.826240 2.655884 1.022520 -0.561214 -0.179155
5.166667 7.915274 -3.843732 2.642204 0.932422 -0.507695 -0.230785
5.200000 7.946040 -3.860647 2.638132 0.840739 -0.452449 -0.281199
5.233333 7.970002 -3.873059 2.641234 0.748854 -0.396695 -0.325763
5.266667 7.992829 -3.884894 2.640545 0.659114 -0.342172 -0.361430
5.300000 8.014528 -3.896155 2.624347 0.572609 -0.289856 -0.383391
5.333333 8.035109 -3.906843 2.604142 0.489632 -0.240191 -0.391514
5.366667 8.048982 -3.913295 2.568589 0.411228 -0.194009 -0.389711
5.400000 8.056764 -3.915840 2.556570 0.338851 -0.152418 -0.375092
5.433333 8.063474 -3.917833 2.539879 0.272914 -0.115682 -0.347886
5.466667 8.069135 -3.919286 2.517531 0.213529 -0.083861 -0.309729
5.500000 8.073771 -3.920210 2.517876 0.161152 -0.057124 -0.265723
5.533333 8.077403 -3.920618 2.498919 0.116622 -0.035854 -0.216888
5.566667 8.078686 -3.920256 2.493621 0.080073 -0.019898 -0.163282
5.600000 8.079014 -3.919402 2.507854 0.050798 -0.008542 -0.112470
5.633333 8.078724 -3.918885 2.509904 0.028121 -0.001143 -0.066212
5.666667 8.078535 -3.918896 2.518202 0.011145 0.003121 -0.030005
5.700000 8.077468 -3.918449 2.489716 -0.001010 0.005008 0.000511
5.733333 8.075549 -3.917553 2.509709 -0.009260 0.005294 0.020207
5.766667 8.074549 -3.917168 2.499962 -0.014582 0.004637 0.031330
5.800000 8.074213 -3.917305 2.511605 -0.017561 0.003428 0.036256
5.833333 8.073096 -3.917024 2.506824 -0.018583 0.001846 0.037829
