t x y theta dxdt dydt dthetadt
0.000000 0.000000 0.000000 2.193395 0.034147 -0.011388 -0.039054
0.033333 0.001044 -0.000440 2.193980 0.038692 -0.012890 -0.047444
0.066667 0.002318 -0.000909 2.187361 0.043963 -0.014428 -0.055251
0.100000 0.003598 -0.001458 2.179488 0.050254 -0.015994 -0.064139
0.133333 0.005116 -0.002034 2.179520 0.057849 -0.017590 -0.075219
0.166667 0.006877 -0.002636 2.176901 0.066952 -0.019207 -0.087182
0.200000 0.008885 -0.003263 2.165187 0.077904 -0.020843 -0.095317
0.233333 0.011142 -0.003914 2.179952 0.091287 -0.022522 -0.097033
0.266667 0.013654 -0.004589 2.179275 0.107515 -0.024265 -0.088404
0.300000 0.016747 -0.005429 2.165672 0.126686 -0.026086 -0.062790
0.333333 0.020551 -0.006404 2.166273 0.148877 -0.027988 -0.012601
0.366667 0.024616 -0.007397 2.159244 0.174466 -0.030015 0.064406
0.400000 0.029947 -0.008449 2.144412 0.203596 -0.032213 0.164935
0.433333 0.037004 -0.009521 2.132603 0.236066 -0.034625 0.289815
0.466667 0.044321 -0.010608 2.121391 0.271756 -0.037293 0.435733
0.500000 0.051897 -0.011706 2.140703 0.310736 -0.040282 0.594191
0.533333 0.062533 -0.013002 2.170673 0.353175 -0.043719 0.753197
0.566667 0.076464 -0.014567 2.209200 0.398695 -0.047719 0.901152
0.600000 0.090636 -0.016136 2.242986 0.446784 -0.052351 1.031052
0.633333 0.105039 -0.017707 2.287107 0.497093 -0.057717 1.129560
0.666667 0.119664 -0.019278 2.357461 0.549273 -0.063917 1.186652
0.700000 0.137717 -0.021230 2.426241 0.602677 -0.071008 1.198786
0.733333 0.159174 -0.023590 2.464759 0.656300 -0.078909 1.166052
0.766667 0.184155 -0.026425 2.518060 0.709318 -0.087561 1.091057
0.800000 0.209294 -0.029245 2.544210 0.761087 -0.096936 0.976788
0.833333 0.234566 -0.032043 2.580941 0.810794 -0.107009 0.830887
0.866667 0.263053 -0.035554 2.617758 0.857465 -0.117854 0.662373
0.900000 0.294627 -0.039925 2.646778 0.900418 -0.129528 0.478630
0.933333 0.326258 -0.044258 2.661538 0.939598 -0.142360 0.282347
0.966667 0.360670 -0.049665 2.652059 0.974912 -0.156441 0.080557
1.000000 0.395077 -0.055021 2.642405 1.006229 -0.171974 -0.121999
1.033333 0.429445 -0.060315 2.645780 1.033393 -0.188947 -0.318174
1.066667 0.463741 -0.065540 2.629328 1.056521 -0.207257 -0.505293
1.100000 0.500109 -0.072323 2.619095 1.075657 -0.226830 -0.682324
1.133333 0.536337 -0.079019 2.589665 1.090273 -0.247259 -0.841518
1.166667 0.573914 -0.087442 2.545817 1.100079 -0.268273 -0.980049
1.200000 0.612484 -0.097645 2.493461 1.104484 -0.289174 -1.095906
1.233333 0.650801 -0.107724 2.462881 1.103034 -0.309419 -1.190318
1.266667 0.689585 -0.119491 2.393104 1.095154 -0.328201 -1.250093
1.300000 0.728038 -0.131102 2.350466 1.080239 -0.344787 -1.262883
1.333333 0.765562 -0.143862 2.305574 1.057758 -0.358464 -1.213403
1.366667 0.802678 -0.156432 2.287156 1.026780 -0.368778 -1.089975
1.400000 0.838757 -0.170040 2.204460 0.987179 -0.375686 -0.865437
1.433333 0.872836 -0.183974 2.152811 0.938964 -0.379105 -0.513013
1.466667 0.904179 -0.197829 2.102276 0.882305 -0.378852 -0.023565
1.500000 0.934970 -0.211418 2.089553 0.817882 -0.374733 0.611292
1.533333 0.961613 -0.224205 2.046428 0.747227 -0.366822 1.387832
1.566667 0.987643 -0.236687 2.038099 0.672620 -0.354957 2.297249
1.600000 1.013034 -0.248847 2.083317 0.595699 -0.338711 3.289754
1.633333 1.032901 -0.260249 2.165597 0.518254 -0.317787 4.314568
1.666667 1.047133 -0.271336 2.346487 0.442124 -0.292536 5.312917
1.700000 1.055447 -0.282592 2.563587 0.369178 -0.263229 6.222722
1.733333 1.063048 -0.293453 2.860548 0.300319 -0.229953 6.976584
1.766667 1.069927 -0.303901 -3.086686 0.235871 -0.192684 7.517624
1.800000 1.074732 -0.307996 -2.731330 0.176489 -0.152207 7.827728
1.833333 1.078801 -0.311649 -2.352169 0.122021 -0.109074 7.886638
1.866667 1.082127 -0.314849 -1.967351 0.071868 -0.063776 7.696239
1.900000 1.084706 -0.317586 -1.641429 0.024465 -0.016787 7.275835
1.933333 1.084708 -0.316540 -1.443617 -0.021402 0.031218 6.671613
1.966667 1.083955 -0.315015 -1.217713 -0.066742 0.079359 5.929723
2.000000 1.080578 -0.310375 -1.045335 -0.112528 0.127527 5.092964
2.033333 1.076444 -0.305247 -0.914319 -0.159150 0.175440 4.213584
2.066667 1.071555 -0.299629 -0.796062 -0.206741 0.223043 3.342121
2.100000 1.064216 -0.291624 -0.709677 -0.254713 0.270042 2.511781
2.133333 1.054581 -0.281476 -0.646132 -0.302469 0.316325 1.738567
2.166667 1.042783 -0.269375 -0.610440 -0.349319 0.361688 1.040160
2.200000 1.030250 -0.256791 -0.625915 -0.394905 0.406012 0.427712
2.233333 1.015858 -0.242367 -0.632396 -0.438772 0.448968 -0.094065
2.266667 0.999651 -0.226060 -0.665684 -0.480380 0.490113 -0.525642
2.300000 0.981797 -0.207920 -0.719375 -0.519440 0.529135 -0.859776
2.333333 0.963251 -0.189327 -0.769606 -0.555911 0.565843 -1.094608
2.366667 0.943318 -0.168981 -0.842201 -0.589929 0.600090 -1.228297
2.400000 0.922722 -0.148206 -0.909542 -0.621546 0.631461 -1.268144
2.433333 0.900956 -0.125773 -1.003407 -0.651100 0.659706 -1.216402
2.466667 0.878560 -0.102937 -1.031336 -0.679172 0.684706 -1.087803
2.500000 0.855040 -0.078498 -1.093083 -0.706336 0.706258 -0.895501
2.533333 0.830925 -0.053687 -1.128161 -0.732946 0.724033 -0.651350
2.566667 0.806233 -0.028520 -1.141820 -0.759396 0.737903 -0.372846
2.600000 0.780983 -0.003015 -1.151686 -0.785935 0.747851 -0.071997
2.633333 0.754701 0.023103 -1.146563 -0.812679 0.754018 0.227162
2.666667 0.727321 0.049486 -1.126316 -0.839549 0.756611 0.514389
2.700000 0.699441 0.076156 -1.092104 -0.866395 0.756176 0.765621
2.733333 0.670200 0.102443 -1.063675 -0.893039 0.753313 0.962155
2.766667 0.639590 0.128143 -0.995292 -0.919169 0.748587 1.081173
2.800000 0.607853 0.152788 -0.967577 -0.944489 0.742616 1.104586
2.833333 0.574989 0.176326 -0.889298 -0.968619 0.736126 1.017462
2.866667 0.541742 0.200071 -0.834185 -0.991215 0.729799 0.807937
2.900000 0.508138 0.224011 -0.746748 -1.011952 0.724103 0.472291
2.933333 0.474202 0.248131 -0.689563 -1.030652 0.719399 0.011990
2.966667 0.439130 0.271701 -0.641189 -1.047025 0.716281 -0.558362
3.000000 0.403057 0.295003 -0.655978 -1.060601 0.715503 -1.223575
3.033333 0.366733 0.318447 -0.689293 -1.071060 0.717511 -1.950643
3.066667 0.330186 0.342018 -0.775392 -1.078097 0.722715 -2.710050
3.100000 0.293444 0.365705 -0.885434 -1.081411 0.731522 -3.460867
3.133333 0.256536 0.389495 -1.036451 -1.080305 0.744819 -4.163096
3.166667 0.219488 0.413374 -1.213109 -1.074544 0.762806 -4.781520
3.200000 0.182330 0.437330 -1.426085 -1.064424 0.784756 -5.281955
3.233333 0.145089 0.461351 -1.658371 -1.050144 0.809777 -5.646062
3.266667 0.107793 0.485422 -1.902820 -1.031837 0.836688 -5.850625
3.300000 0.072858 0.513332 -2.137154 -1.009764 0.863690 -5.889294
3.333333 0.040772 0.545353 -2.394197 -0.984981 0.887477 -5.766010
3.366667 0.008707 0.577373 -2.584538 -0.958279 0.905119 -5.500288
3.400000 -0.023316 0.609371 -2.817597 -0.930078 0.914319 -5.122302
3.433333 -0.055274 0.641326 -3.008403 -0.900770 0.913037 -4.672328
3.466667 -0.083219 0.678385 3.114981 -0.871208 0.899383 -4.210101
3.500000 -0.111061 0.715353 2.973951 -0.842004 0.872710 -3.786096
3.533333 -0.138608 0.748883 2.865391 -0.813054 0.834196 -3.450043
3.566667 -0.165534 0.778998 2.794093 -0.784294 0.785305 -3.229957
3.600000 -0.191484 0.805554 2.802371 -0.755916 0.728128 -3.150142
3.633333 -0.216337 0.828339 2.802443 -0.728379 0.665380 -3.211129
3.666667 -0.239808 0.847250 2.782182 -0.701516 0.600672 -3.391258
3.700000 -0.263085 0.865964 2.711606 -0.675282 0.536996 -3.663242
3.733333 -0.284934 0.880812 2.567570 -0.650094 0.476840 -3.975869
3.766667 -0.305195 0.891920 2.372429 -0.626259 0.422606 -4.281552
3.800000 -0.325230 0.902824 2.148249 -0.603710 0.376027 -4.516466
3.833333 -0.345031 0.913525 1.951068 -0.582111 0.337936 -4.632446
3.866667 -0.363062 0.921695 1.728113 -0.561380 0.308301 -4.591415
3.900000 -0.380844 0.929668 1.524529 -0.541433 0.287084 -4.372042
3.933333 -0.398372 0.937450 1.314786 -0.521858 0.273931 -3.987941
3.966667 -0.415640 0.945046 1.138846 -0.502359 0.268031 -3.460773
4.000000 -0.432642 0.952460 0.996991 -0.482964 0.268438 -2.831926
4.033333 -0.449373 0.959697 0.907178 -0.463782 0.274496 -2.144265
4.066667 -0.465828 0.966763 0.912109 -0.444816 0.285614 -1.450806
4.100000 -0.480244 0.975744 0.903667 -0.426215 0.301024 -0.796002
4.133333 -0.492825 0.987045 0.920321 -0.408438 0.319698 -0.206092
4.166667 -0.505122 0.998184 0.953438 -0.391941 0.340694 0.291697
4.200000 -0.517133 1.009161 1.008604 -0.377050 0.363277 0.683113
4.233333 -0.528859 1.019976 1.078646 -0.364090 0.386709 0.965117
4.266667 -0.540171 1.033294 1.117881 -0.353439 0.409908 1.154770
4.300000 -0.551333 1.049073 1.187696 -0.345194 0.431898 1.266811
4.333333 -0.562208 1.064683 1.248861 -0.339070 0.452106 1.316556
4.366667 -0.572798 1.080120 1.281293 -0.334666 0.469971 1.330009
4.400000 -0.583725 1.097214 1.327846 -0.331504 0.484675 1.324641
4.433333 -0.594367 1.114123 1.352482 -0.329103 0.495403 1.315328
4.466667 -0.605414 1.131945 1.403231 -0.326907 0.501866 1.303362
4.500000 -0.616823 1.150291 1.414461 -0.324427 0.504031 1.296850
4.533333 -0.627945 1.168427 1.463786 -0.321352 0.501852 1.294112
4.566667 -0.638779 1.186345 1.511562 -0.317405 0.495398 1.286289
4.600000 -0.649614 1.203943 1.560667 -0.312388 0.485143 1.269694
4.633333 -0.660433 1.221009 1.599850 -0.306079 0.471593 1.234544
4.666667 -0.671033 1.237257 1.664041 -0.298343 0.455146 1.177375
4.700000 -0.681157 1.252189 1.718974 -0.289180 0.436166 1.090174
4.733333 -0.690681 1.265589 1.760495 -0.278621 0.415082 0.976986
4.766667 -0.699914 1.278730 1.796854 -0.266785 0.392492 0.843529
4.800000 -0.708854 1.291606 1.841238 -0.253823 0.368887 0.691418
4.833333 -0.717504 1.304214 1.855394 -0.239933 0.344711 0.532136
4.866667 -0.725862 1.316549 1.856532 -0.225359 0.320389 0.374720
4.900000 -0.733334 1.327064 1.864883 -0.210313 0.296240 0.230654
4.933333 -0.739868 1.335826 1.865509 -0.195008 0.272490 0.105014
4.966667 -0.746115 1.344311 1.833029 -0.179609 0.249239 -0.001460
5.000000 -0.751340 1.351153 1.833029 -0.164355 0.226730 -0.077053
5.033333 -0.756284 1.357718 1.828307 -0.149466 0.205219 -0.125880
5.066667 -0.760951 1.364009 1.818969 -0.135155 0.185007 -0.148706
5.100000 -0.765343 1.370028 1.822581 -0.121560 0.166224 -0.154547
5.133333 -0.768893 1.374822 1.794434 -0.108793 0.148942 -0.145256
5.166667 -0.772178 1.379348 1.791315 -0.096970 0.133233 -0.121434
5.200000 -0.774834 1.382937 1.778895 -0.086068 0.118940 -0.094090
5.233333 -0.777234 1.386267 1.802820 -0.076061 0.105928 -0.067280
5.266667 -0.779383 1.389343 1.810826 -0.066913 0.094027 -0.046395
5.300000 -0.781288 1.392168 1.761147 -0.058639 0.083220 -0.022246
5.333333 -0.782915 1.394602 1.805159 -0.051192 0.073452 -0.005639
5.366667 -0.784331 1.396662 1.788148 -0.044522 0.064676 0.003646
5.400000 -0.785520 1.398487 1.806740 -0.038573 0.056835 0.004051
5.433333 -0.786599 1.400041 1.792929 -0.033283 0.049863 0.005905
5.466667 -0.787609 1.401450 1.808183 -0.028566 0.043660 0.008361
5.500000 -0.788408 1.402641 1.796192 -0.024302 0.038086 0.002750
5.533333 -0.789002 1.403619 1.812221 -0.020447 0.033083 -0.001946
5.566667 -0.789397 1.404390 1.780169 -0.016964 0.028573 -0.004428
5.600000 -0.789852 1.405241 1.792909 -0.013825 0.024507 -0.001085
5.633333 -0.790393 1.406118 1.803079 -0.011027 0.020841 -0.002899
