t x y theta dxdt dydt dthetadt
0.000000 0.000000 0.000000 0.365674 0.003690 0.024264 -0.014845
0.033333 0.000026 0.000626 0.365859 0.004517 0.029981 -0.027435
0.066667 -0.000060 0.001246 0.362612 0.005065 0.036270 -0.053155
0.100000 0.000057 0.002340 0.366038 0.004823 0.042994 -0.096514
0.133333 0.000352 0.003980 0.362191 0.003139 0.049969 -0.156071
0.166667 0.000525 0.005612 0.355491 -0.000611 0.057051 -0.226351
0.200000 0.001211 0.008189 0.366805 -0.007058 0.064119 -0.303847
0.233333 0.001768 0.010757 0.368957 -0.016952 0.070817 -0.370884
0.266667 0.002193 0.013314 0.364592 -0.030871 0.076815 -0.416954
0.300000 0.002483 0.015858 0.361865 -0.049013 0.081867 -0.430832
0.333333 0.002635 0.018387 0.333262 -0.071429 0.085818 -0.413454
0.366667 0.002025 0.022007 0.240747 -0.098263 0.088387 -0.363936
0.400000 -0.000791 0.025647 0.207556 -0.129391 0.089421 -0.286186
0.433333 -0.005667 0.029225 0.155341 -0.164145 0.088960 -0.191936
0.466667 -0.012526 0.032588 0.170027 -0.201439 0.087139 -0.096087
0.500000 -0.019522 0.035923 0.191300 -0.240520 0.084007 -0.011654
0.533333 -0.026650 0.039227 0.223525 -0.280614 0.079525 0.054121
0.566667 -0.036502 0.041923 0.257695 -0.320536 0.073957 0.087570
0.600000 -0.049067 0.044138 0.302796 -0.359278 0.067530 0.086386
0.633333 -0.061741 0.046317 0.326246 -0.396372 0.060418 0.050024
0.666667 -0.076778 0.048155 0.326450 -0.431704 0.052601 -0.008172
0.700000 -0.093695 0.049555 0.314104 -0.464742 0.044045 -0.075064
0.733333 -0.110680 0.050915 0.292187 -0.494747 0.034672 -0.136921
0.766667 -0.127719 0.052235 0.255922 -0.521514 0.024186 -0.177569
0.800000 -0.144795 0.053514 0.220683 -0.545008 0.012074 -0.189695
0.833333 -0.163688 0.054223 0.193772 -0.564679 -0.002264 -0.168709
0.866667 -0.184761 0.053965 0.178172 -0.579990 -0.019076 -0.119084
0.900000 -0.205817 0.053667 0.180682 -0.590794 -0.038449 -0.051954
0.933333 -0.226836 0.053331 0.199742 -0.597204 -0.060198 0.019320
0.966667 -0.247797 0.052957 0.216537 -0.598893 -0.084076 0.081087
1.000000 -0.268911 0.050717 0.227552 -0.595280 -0.109333 0.125082
1.033333 -0.290279 0.046821 0.250316 -0.586473 -0.134896 0.144546
1.066667 -0.311095 0.040825 0.268700 -0.572648 -0.159700 0.136737
1.100000 -0.331770 0.034809 0.283064 -0.553722 -0.182677 0.106817
1.133333 -0.351161 0.027122 0.272207 -0.529590 -0.202710 0.065514
1.166667 -0.367890 0.017792 0.271108 -0.500817 -0.218571 0.023295
1.200000 -0.384422 0.008470 0.273387 -0.468338 -0.229550 -0.012955
1.233333 -0.400741 -0.000831 0.260697 -0.432792 -0.235306 -0.035499
1.266667 -0.416831 -0.010101 0.247844 -0.394953 -0.236011 -0.039234
1.300000 -0.429923 -0.019190 0.233757 -0.356147 -0.232099 -0.024380
1.333333 -0.440249 -0.027802 0.220392 -0.317940 -0.224539 0.003004
1.366667 -0.450306 -0.036350 0.220315 -0.281288 -0.214584 0.037886
1.400000 -0.458062 -0.043619 0.230762 -0.247083 -0.203399 0.075964
1.433333 -0.463821 -0.049537 0.241548 -0.216331 -0.192122 0.110494
1.466667 -0.468261 -0.054322 0.255296 -0.189884 -0.181590 0.134492
1.500000 -0.472407 -0.059009 0.267426 -0.167912 -0.172448 0.145174
1.533333 -0.476253 -0.063592 0.279160 -0.150083 -0.164947 0.142109
1.566667 -0.479797 -0.068066 0.287827 -0.136181 -0.159092 0.127888
1.600000 -0.483578 -0.072891 0.302467 -0.125597 -0.154585 0.103293
1.633333 -0.487503 -0.077969 0.293781 -0.117402 -0.150842 0.073742
1.666667 -0.491646 -0.083496 0.288830 -0.110532 -0.147151 0.045670
1.700000 -0.495866 -0.089054 0.285692 -0.104156 -0.142832 0.022677
1.733333 -0.499763 -0.094468 0.287833 -0.097694 -0.137288 0.008271
1.766667 -0.503330 -0.099729 0.283232 -0.090642 -0.130095 0.000211
1.800000 -0.506446 -0.104397 0.276104 -0.082817 -0.121182 0.002302
1.833333 -0.509225 -0.108898 0.269188 -0.074273 -0.110774 0.012357
1.866667 -0.511662 -0.113226 0.267987 -0.065222 -0.099284 0.027676
1.900000 -0.513521 -0.116433 0.288388 -0.055987 -0.087216 0.045839
1.933333 -0.514970 -0.118701 0.286341 -0.046918 -0.075143 0.065718
1.966667 -0.516128 -0.120273 0.290565 -0.038342 -0.063601 0.087966
2.000000 -0.517167 -0.121494 0.293550 -0.030403 -0.052907 0.106976
2.033333 -0.517848 -0.122518 0.290158 -0.023121 -0.043169 0.121237
2.066667 -0.518168 -0.123342 0.300076 -0.016402 -0.034349 0.130439
2.100000 -0.518125 -0.123964 0.295138 -0.010028 -0.026267 0.136234
2.133333 -0.518248 -0.124532 0.308594 -0.003684 -0.018593 0.135517
2.166667 -0.518348 -0.125385 0.316632 0.002967 -0.010874 0.133548
2.200000 -0.518439 -0.126155 0.319788 0.010194 -0.002732 0.141151
2.233333 -0.518455 -0.126540 0.329695 0.018341 0.006240 0.171030
2.266667 -0.518367 -0.126750 0.342588 0.027688 0.016311 0.229677
2.300000 -0.517899 -0.126741 0.342245 0.038603 0.027917 0.323180
2.333333 -0.517026 -0.126136 0.335810 0.051474 0.041612 0.465128
2.366667 -0.515353 -0.124663 0.331257 0.066726 0.057991 0.652584
2.400000 -0.512953 -0.122221 0.338263 0.084890 0.077853 0.877673
2.433333 -0.510163 -0.119554 0.332397 0.106182 0.101700 1.125953
2.466667 -0.506983 -0.116664 0.330694 0.130796 0.130083 1.389499
2.500000 -0.503412 -0.113550 0.393075 0.158657 0.163097 1.658560
2.533333 -0.499450 -0.110214 0.486676 0.189447 0.200411 1.910627
2.566667 -0.493300 -0.104401 0.631763 0.222552 0.241212 2.132993
2.600000 -0.486760 -0.098371 0.712376 0.257223 0.284587 2.319165
2.633333 -0.478233 -0.089405 0.793728 0.292754 0.329568 2.463862
2.666667 -0.467615 -0.077284 0.905096 0.328438 0.375250 2.569460
2.700000 -0.455154 -0.062316 0.978564 0.363580 0.420730 2.636559
2.733333 -0.440162 -0.043898 1.081376 0.397446 0.465049 2.683556
2.766667 -0.424812 -0.025315 1.173727 0.429691 0.507828 2.724337
2.800000 -0.409116 -0.006587 1.215274 0.459832 0.548266 2.767496
2.833333 -0.393086 0.012269 1.324950 0.487771 0.586123 2.822795
2.866667 -0.376733 0.031235 1.399234 0.513535 0.621051 2.884170
2.900000 -0.360070 0.050293 1.493518 0.537397 0.653142 2.952464
2.933333 -0.341365 0.073227 1.597387 0.559963 0.682713 3.015061
2.966667 -0.322376 0.096212 1.676615 0.581783 0.709767 3.073680
3.000000 -0.301647 0.122890 1.835284 0.603489 0.734143 3.116439
3.033333 -0.280667 0.149569 1.928842 0.625345 0.755241 3.141940
3.066667 -0.259451 0.176220 2.095990 0.647434 0.772251 3.147650
3.100000 -0.238009 0.203245 2.175327 0.669820 0.783884 3.132305
3.133333 -0.216367 0.230189 2.270730 0.692426 0.788945 3.096450
3.166667 -0.193138 0.258301 2.395066 0.714874 0.786289 3.022858
3.200000 -0.168767 0.286342 2.447934 0.736833 0.775739 2.922118
3.233333 -0.144255 0.314216 2.545244 0.757607 0.756608 2.787108
3.266667 -0.118206 0.341770 2.645685 0.776459 0.728764 2.633510
3.300000 -0.090950 0.368430 2.770321 0.792827 0.692690 2.460541
3.333333 -0.062916 0.392700 2.870872 0.806092 0.649314 2.276979
3.366667 -0.034832 0.416691 2.979095 0.816228 0.599526 2.101736
3.400000 -0.006683 0.437206 3.025708 0.823304 0.544015 1.942801
3.433333 0.022692 0.454673 3.075833 0.828258 0.484955 1.813554
3.466667 0.051882 0.468300 3.106602 0.832278 0.424528 1.709815
3.500000 0.081020 0.481568 3.128025 0.835901 0.364489 1.641122
3.533333 0.110078 0.494462 3.137876 0.839547 0.305715 1.604266
3.566667 0.133249 0.499461 -3.118784 0.843474 0.250002 1.589526
3.600000 0.156293 0.504067 -3.049826 0.847504 0.198384 1.576248
3.633333 0.184830 0.508612 -2.996026 0.850708 0.150781 1.553327
3.666667 0.213195 0.512754 -2.915984 0.852016 0.106537 1.500809
3.700000 0.244496 0.514063 -2.832047 0.850078 0.065052 1.405463
3.733333 0.275569 0.514960 -2.717500 0.843939 0.026361 1.257952
3.766667 0.306384 0.515444 -2.663026 0.831943 -0.010955 1.061563
3.800000 0.336913 0.515512 -2.624856 0.813165 -0.047601 0.830271
3.833333 0.367125 0.515162 -2.601430 0.787527 -0.083998 0.571451
3.866667 0.394313 0.511629 -2.606491 0.755192 -0.120047 0.315962
3.900000 0.421130 0.507679 -2.642262 0.717226 -0.155672 0.080940
3.933333 0.443178 0.500589 -2.642262 0.674841 -0.190806 -0.114629
3.966667 0.464807 0.493091 -2.642262 0.629733 -0.224752 -0.265795
4.000000 0.485998 0.485191 -2.755359 0.583240 -0.257045 -0.343620
4.033333 0.501989 0.474177 -2.755359 0.536625 -0.287023 -0.348683
4.066667 0.517505 0.462775 -2.762173 0.490704 -0.314487 -0.287670
4.100000 0.532531 0.450995 -2.768554 0.446068 -0.339184 -0.173808
4.133333 0.547055 0.438846 -2.768554 0.402578 -0.361319 -0.017209
4.166667 0.561060 0.426337 -2.768554 0.360093 -0.381100 0.177055
4.200000 0.574534 0.413478 -2.797001 0.318472 -0.398737 0.351528
4.233333 0.582431 0.399384 -2.797001 0.277200 -0.414821 0.498199
4.266667 0.589776 0.384961 -2.797001 0.235985 -0.429713 0.604097
4.300000 0.596559 0.370220 -2.797001 0.194929 -0.443715 0.672728
4.333333 0.602774 0.355174 -2.570227 0.154310 -0.456681 0.685537
4.366667 0.608414 0.339832 -2.570227 0.114348 -0.468098 0.641850
4.400000 0.613471 0.324207 -2.510914 0.075263 -0.477450 0.564004
4.433333 0.613064 0.307491 -2.520523 0.037234 -0.484081 0.467980
4.466667 0.612067 0.290515 -2.520523 0.000484 -0.486898 0.359253
4.500000 0.610480 0.273293 -2.520523 -0.035176 -0.484879 0.238814
4.533333 0.608303 0.255837 -2.520523 -0.069559 -0.477447 0.144622
4.566667 0.605535 0.238160 -2.593243 -0.102366 -0.464775 0.084037
4.600000 0.602177 0.220274 -2.593243 -0.133300 -0.447042 0.060244
4.633333 0.598229 0.202192 -2.593415 -0.162460 -0.424493 0.058230
4.666667 0.591444 0.186562 -2.589285 -0.189874 -0.398253 0.077728
4.700000 0.583387 0.175221 -2.597373 -0.215513 -0.369826 0.117334
4.733333 0.574749 0.163711 -2.553015 -0.239639 -0.340395 0.154198
4.766667 0.565535 0.152037 -2.516253 -0.262651 -0.310727 0.171706
4.800000 0.556239 0.145485 -2.516712 -0.285031 -0.281994 0.172006
4.833333 0.546377 0.138772 -2.501932 -0.306855 -0.255298 0.160309
4.866667 0.535953 0.131898 -2.491698 -0.328501 -0.231325 0.134914
4.900000 0.524971 0.124861 -2.492285 -0.350367 -0.210025 0.094955
4.933333 0.513438 0.117660 -2.512417 -0.372651 -0.191546 0.047474
4.966667 0.501359 0.110294 -2.527279 -0.395393 -0.176128 0.007233
5.000000 0.488347 0.105467 -2.527279 -0.418252 -0.163437 -0.026678
5.033333 0.474801 0.100469 -2.522490 -0.440888 -0.153140 -0.054530
5.066667 0.459539 0.096488 -2.509206 -0.462366 -0.144941 -0.073228
5.100000 0.442799 0.092895 -2.519459 -0.481550 -0.138909 -0.084886
5.133333 0.425068 0.089534 -2.519459 -0.497049 -0.134987 -0.095546
5.166667 0.406835 0.085979 -2.517892 -0.507198 -0.132995 -0.107737
5.200000 0.387718 0.082073 -2.535887 -0.510825 -0.132654 -0.111483
5.233333 0.369269 0.077795 -2.535870 -0.506856 -0.133673 -0.093744
5.266667 0.350346 0.073303 -2.543879 -0.495011 -0.135626 -0.044069
5.300000 0.330959 0.068591 -2.547780 -0.475596 -0.138054 0.051924
5.333333 0.313336 0.063440 -2.537633 -0.449824 -0.140528 0.205154
5.366667 0.295265 0.058056 -2.547834 -0.419630 -0.142900 0.418889
5.400000 0.280059 0.052762 -2.549746 -0.387081 -0.145317 0.675907
5.433333 0.267511 0.047503 -2.597022 -0.354371 -0.148122 0.964705
5.466667 0.258321 0.042717 -2.614228 -0.323664 -0.151913 1.271693
5.500000 0.252960 0.038567 -2.574055 -0.297157 -0.157489 1.582623
5.533333 0.247148 0.034147 -2.452500 -0.276306 -0.165760 1.881170
5.566667 0.240878 0.029449 -2.312794 -0.262192 -0.177301 2.151943
5.600000 0.234139 0.024464 -2.197530 -0.255303 -0.192616 2.396591
5.633333 0.226924 0.019185 -2.103504 -0.255580 -0.211849 2.603540
5.666667 0.219224 0.013604 -2.008872 -0.262269 -0.234781 2.769076
5.700000 0.210963 0.006159 -1.913608 -0.273795 -0.260693 2.892273
5.733333 0.202200 -0.001602 -1.853207 -0.288764 -0.288618 2.986286
5.766667 0.192199 -0.011443 -1.744173 -0.305724 -0.317571 3.060910
5.800000 0.181349 -0.023051 -1.662709 -0.323473 -0.346423 3.119061
5.833333 0.169766 -0.036274 -1.560641 -0.341223 -0.374127 3.168206
5.866667 0.157808 -0.051059 -1.448790 -0.358538 -0.399716 3.211815
5.900000 0.145314 -0.066173 -1.321480 -0.375594 -0.422664 3.248565
5.933333 0.132279 -0.081615 -1.201335 -0.392610 -0.442593 3.265565
5.966667 0.118696 -0.097385 -1.073264 -0.410051 -0.459432 3.257627
6.000000 0.104561 -0.113482 -0.949137 -0.428541 -0.473463 3.223010
6.033333 0.090552 -0.129872 -0.839135 -0.448734 -0.485169 3.157811
6.066667 0.076310 -0.146336 -0.724750 -0.471284 -0.495262 3.058686
6.100000 0.061498 -0.163123 -0.628432 -0.496739 -0.504408 2.929483
6.133333 0.046003 -0.179632 -0.564552 -0.525755 -0.513372 2.778265
6.166667 0.028627 -0.196696 -0.461066 -0.558608 -0.522747 2.609622
6.200000 0.010665 -0.214079 -0.347274 -0.595508 -0.533057 2.425811
6.233333 -0.009208 -0.231707 -0.268268 -0.636371 -0.544815 2.235277
6.266667 -0.029672 -0.249650 -0.185120 -0.681219 -0.558509 2.044322
6.300000 -0.052254 -0.268050 -0.132351 -0.729691 -0.574460 1.856397
6.333333 -0.076853 -0.286857 -0.069166 -0.781062 -0.592798 1.670389
6.366667 -0.103932 -0.306245 -0.037206 -0.834694 -0.613644 1.492654
6.400000 -0.131597 -0.325939 0.011424 -0.889673 -0.636942 1.328232
6.433333 -0.161996 -0.346798 0.042594 -0.945021 -0.662324 1.177437
6.466667 -0.194737 -0.368788 0.075234 -0.999370 -0.689209 1.042484
6.500000 -0.228615 -0.391273 0.095913 -1.051737 -0.717094 0.923464
6.533333 -0.265385 -0.415464 0.132509 -1.101459 -0.745565 0.821096
6.566667 -0.304601 -0.441418 0.155328 -1.147971 -0.774131 0.729126
6.600000 -0.346156 -0.469054 0.180660 -1.190755 -0.802196 0.643647
6.633333 -0.388216 -0.496953 0.192850 -1.229708 -0.829436 0.563750
6.666667 -0.431170 -0.525776 0.217199 -1.265079 -0.855590 0.485438
6.700000 -0.474592 -0.554838 0.235111 -1.297089 -0.880417 0.406941
6.733333 -0.518446 -0.584744 0.250775 -1.325863 -0.903534 0.330303
6.766667 -0.562730 -0.614865 0.251384 -1.351576 -0.924784 0.258290
6.800000 -0.607804 -0.646034 0.260727 -1.374646 -0.944303 0.193699
6.833333 -0.653270 -0.677392 0.266485 -1.395379 -0.962289 0.137586
6.866667 -0.701534 -0.711195 0.265273 -1.413831 -0.978867 0.094523
6.900000 -0.750146 -0.745156 0.267764 -1.430011 -0.994148 0.066342
6.933333 -0.799082 -0.779260 0.257467 -1.443936 -1.008414 0.053775
6.966667 -0.848319 -0.813488 0.253817 -1.455699 -1.021824 0.054339
7.000000 -0.897834 -0.847826 0.241434 -1.465260 -1.034400 0.067320
7.033333 -0.947602 -0.882256 0.248815 -1.472351 -1.045840 0.087317
7.066667 -0.997601 -0.916761 0.252258 -1.476924 -1.056063 0.110358
7.100000 -1.046418 -0.951348 0.259450 -1.479081 -1.065030 0.131371
7.133333 -1.095107 -0.986862 0.264041 -1.478907 -1.072565 0.144004
7.166667 -1.144691 -1.024007 0.281359 -1.476198 -1.078294 0.145542
7.200000 -1.194414 -1.061157 0.284862 -1.470884 -1.081874 0.132049
7.233333 -1.244255 -1.098293 0.303177 -1.463179 -1.083214 0.107407
7.266667 -1.294189 -1.135395 0.315031 -1.453409 -1.082237 0.071080
7.300000 -1.344195 -1.172444 0.315093 -1.441597 -1.078786 0.027654
7.333333 -1.393096 -1.209266 0.320256 -1.427912 -1.072901 -0.016996
7.366667 -1.440708 -1.245305 0.301798 -1.412987 -1.065078 -0.056022
7.400000 -1.486470 -1.280042 0.303724 -1.397125 -1.055651 -0.086062
7.433333 -1.532639 -1.315139 0.292238 -1.380486 -1.044860 -0.105938
7.466667 -1.578200 -1.349919 0.277121 -1.362897 -1.032611 -0.111702
7.500000 -1.622321 -1.383761 0.262708 -1.344454 -1.018914 -0.104484
7.533333 -1.666381 -1.417428 0.258818 -1.325039 -1.003667 -0.087641
7.566667 -1.710363 -1.450904 0.260475 -1.304113 -0.986228 -0.067438
7.600000 -1.754253 -1.484173 0.258161 -1.281608 -0.966253 -0.046180
7.633333 -1.798035 -1.517221 0.260073 -1.257530 -0.943482 -0.027107
7.666667 -1.841694 -1.550033 0.274159 -1.232236 -0.918130 -0.017539
7.700000 -1.885214 -1.582593 0.270695 -1.205936 -0.890124 -0.019950
7.733333 -1.923897 -1.611905 0.280659 -1.179412 -0.859523 -0.033717
7.766667 -1.962417 -1.640940 0.275825 -1.153704 -0.826792 -0.054661
7.800000 -1.998065 -1.666694 0.281249 -1.129839 -0.792499 -0.082148
7.833333 -2.033534 -1.692154 0.275664 -1.108806 -0.757172 -0.113313
7.866667 -2.068818 -1.717312 0.269044 -1.091479 -0.720991 -0.140433
7.900000 -2.103609 -1.739410 0.257247 -1.078706 -0.684747 -0.158967
7.933333 -2.138203 -1.761196 0.250725 -1.070484 -0.648922 -0.166793
7.966667 -2.172596 -1.782668 0.243737 -1.066587 -0.613995 -0.165704
8.000000 -2.206782 -1.803820 0.225225 -1.066452 -0.579887 -0.152204
8.033333 -2.241713 -1.822760 0.207884 -1.069432 -0.546676 -0.126779
8.066667 -2.277494 -1.839765 0.210922 -1.074662 -0.514804 -0.092962
8.100000 -2.314190 -1.855106 0.214356 -1.081333 -0.484125 -0.054558
8.133333 -2.350653 -1.870130 0.210932 -1.088894 -0.454766 -0.012932
8.166667 -2.386875 -1.884841 0.215257 -1.096887 -0.426737 0.030385
8.200000 -2.423589 -1.897867 0.215590 -1.104657 -0.400387 0.070459
8.233333 -2.460047 -1.910589 0.221707 -1.111710 -0.375745 0.103331
8.266667 -2.497564 -1.922071 0.229513 -1.117682 -0.352535 0.128569
8.300000 -2.534806 -1.933262 0.231014 -1.122074 -0.330576 0.147099
8.333333 -2.573152 -1.943496 0.240960 -1.124384 -0.309664 0.156170
8.366667 -2.611204 -1.953456 0.246503 -1.124035 -0.289558 0.158297
8.400000 -2.648951 -1.963149 0.253643 -1.120841 -0.269997 0.154627
8.433333 -2.687865 -1.971622 0.261142 -1.114415 -0.250956 0.148195
8.466667 -2.726452 -1.979847 0.276914 -1.104362 -0.232377 0.138829
8.500000 -2.764701 -1.987835 0.271568 -1.090521 -0.214367 0.127766
8.533333 -2.801073 -1.993921 0.278458 -1.072951 -0.197056 0.117986
8.566667 -2.837085 -1.999793 0.272920 -1.051683 -0.180619 0.108362
8.600000 -2.872729 -2.005463 0.276820 -1.026566 -0.165169 0.099275
8.633333 -2.906762 -2.010131 0.279609 -0.997805 -0.150725 0.090486
8.666667 -2.940410 -2.014624 0.280648 -0.965788 -0.137412 0.082965
8.700000 -2.972732 -2.018519 0.288515 -0.930630 -0.125251 0.073971
8.733333 -3.003405 -2.022118 0.294070 -0.892274 -0.114016 0.060811
8.766667 -3.033676 -2.025584 0.291809 -0.850956 -0.103502 0.043198
8.800000 -3.061790 -2.028784 0.293610 -0.807268 -0.093664 0.021086
8.833333 -3.089497 -2.031881 0.301598 -0.761475 -0.084402 -0.005114
8.866667 -3.115030 -2.034864 0.307238 -0.713965 -0.075779 -0.035037
8.900000 -3.137939 -2.037402 0.302514 -0.665660 -0.067945 -0.064947
8.933333 -3.157973 -2.039188 0.301250 -0.617871 -0.061315 -0.089823
8.966667 -3.177608 -2.040936 0.293315 -0.571727 -0.056268 -0.108581
9.000000 -3.196852 -2.042660 0.281935 -0.528055 -0.053013 -0.119053
9.033333 -3.212684 -2.043583 0.282300 -0.488038 -0.051889 -0.121852
9.066667 -3.225679 -2.043974 0.261954 -0.452526 -0.052929 -0.115424
9.100000 -3.238313 -2.044394 0.255560 -0.421822 -0.056071 -0.102605
9.133333 -3.249382 -2.045384 0.248041 -0.395812 -0.061057 -0.087189
9.166667 -3.260118 -2.046439 0.249302 -0.374375 -0.067629 -0.070105
9.200000 -3.271967 -2.049656 0.248426 -0.357312 -0.075409 -0.052850
9.233333 -3.283512 -2.052969 0.260229 -0.344240 -0.084112 -0.035792
9.266667 -3.294768 -2.056393 0.268629 -0.334926 -0.093750 -0.023290
9.300000 -3.305748 -2.059943 0.264645 -0.329316 -0.104365 -0.014409
9.333333 -3.316467 -2.063633 0.265809 -0.327356 -0.116147 -0.006877
9.366667 -3.326938 -2.067476 0.256062 -0.329153 -0.129466 0.000758
9.400000 -3.337177 -2.071489 0.253785 -0.335141 -0.145199 0.006477
9.433333 -3.347198 -2.075683 0.253888 -0.345347 -0.163831 0.013793
9.466667 -3.357015 -2.080074 0.246073 -0.359414 -0.185608 0.026672
9.500000 -3.366643 -2.084675 0.248232 -0.377018 -0.210938 0.043998
9.533333 -3.376096 -2.089499 0.263793 -0.397929 -0.240181 0.061269
9.566667 -3.389296 -2.097266 0.257689 -0.421223 -0.273238 0.076414
9.600000 -3.405916 -2.107853 0.256419 -0.445349 -0.309454 0.092174
9.633333 -3.422394 -2.118693 0.260143 -0.469077 -0.348397 0.104772
9.666667 -3.438735 -2.129792 0.278310 -0.491459 -0.389560 0.111882
9.700000 -3.456945 -2.143399 0.283819 -0.511312 -0.431909 0.114986
9.733333 -3.476099 -2.159156 0.277656 -0.527252 -0.474332 0.119662
9.766667 -3.495130 -2.175185 0.294209 -0.538782 -0.516073 0.125747
9.800000 -3.514158 -2.193209 0.296578 -0.546051 -0.556599 0.132728
9.833333 -3.533480 -2.213518 0.294267 -0.549176 -0.595212 0.141448
9.866667 -3.552688 -2.234095 0.290095 -0.548289 -0.631361 0.153996
9.900000 -3.571388 -2.256635 0.288772 -0.543927 -0.664895 0.166867
9.933333 -3.589602 -2.281255 0.296174 -0.537069 -0.695674 0.172284
9.966667 -3.607710 -2.306124 0.305369 -0.528387 -0.723655 0.164293
10.000000 -3.625715 -2.331234 0.325679 -0.518459 -0.748915 0.136364
10.033333 -3.643620 -2.356577 0.332327 -0.507935 -0.771868 0.082288
10.066667 -3.660056 -2.383082 0.336619 -0.497595 -0.792860 -0.001303
10.100000 -3.676400 -2.409801 0.345523 -0.487989 -0.812336 -0.109666
10.133333 -3.691468 -2.437770 0.362964 -0.479494 -0.830881 -0.231031
10.166667 -3.706454 -2.465931 0.365283 -0.472395 -0.848718 -0.348375
10.200000 -3.721363 -2.494271 0.380245 -0.466878 -0.865888 -0.449735
10.233333 -3.736201 -2.522778 0.343642 -0.463093 -0.882267 -0.516501
10.266667 -3.750974 -2.551441 0.298345 -0.460928 -0.897871 -0.539704
10.300000 -3.766261 -2.582415 0.216027 -0.460255 -0.912395 -0.511998
10.333333 -3.781705 -2.614296 0.179429 -0.460855 -0.925535 -0.439290
10.366667 -3.797099 -2.646289 0.115372 -0.462601 -0.937123 -0.329988
10.400000 -3.812640 -2.678465 0.115372 -0.465268 -0.947045 -0.190666
10.433333 -3.828140 -2.710719 0.109494 -0.468751 -0.955259 -0.041404
10.466667 -3.843603 -2.743037 0.152309 -0.473126 -0.961626 0.099473
10.500000 -3.859032 -2.775400 0.183541 -0.478567 -0.966369 0.212260
10.533333 -3.875015 -2.807838 0.213177 -0.485136 -0.969671 0.291343
10.566667 -3.890972 -2.840288 0.253835 -0.492851 -0.971834 0.326586
10.600000 -3.906907 -2.872733 0.288448 -0.501783 -0.973149 0.315599
10.633333 -3.922822 -2.905158 0.300026 -0.511767 -0.973765 0.266708
10.666667 -3.939888 -2.938019 0.295958 -0.522361 -0.973779 0.196005
10.700000 -3.957458 -2.970319 0.280361 -0.533029 -0.973150 0.119589
10.733333 -3.975013 -3.002545 0.287725 -0.543118 -0.971429 0.045523
10.766667 -3.993983 -3.035540 0.266120 -0.551553 -0.967618 -0.011932
10.800000 -4.013599 -3.068069 0.253144 -0.557240 -0.960801 -0.046524
10.833333 -4.033199 -3.100473 0.250484 -0.559208 -0.950139 -0.058846
10.866667 -4.052782 -3.132734 0.252430 -0.556874 -0.934990 -0.055732
10.900000 -4.072861 -3.165208 0.239485 -0.549507 -0.914170 -0.043923
10.933333 -4.092618 -3.197151 0.245469 -0.536854 -0.886967 -0.026726
10.966667 -4.112352 -3.228898 0.248226 -0.519465 -0.853595 -0.014708
11.000000 -4.131258 -3.259567 0.245781 -0.498108 -0.814072 -0.013445
11.033333 -4.150137 -3.290008 0.261696 -0.473553 -0.768425 -0.023212
11.066667 -4.165404 -3.315511 0.277905 -0.446945 -0.716924 -0.040591
11.100000 -4.177552 -3.336266 0.271764 -0.420118 -0.661184 -0.065046
11.133333 -4.189679 -3.356761 0.269186 -0.395056 -0.603211 -0.095831
11.166667 -4.201790 -3.376989 0.257490 -0.373700 -0.544778 -0.122584
11.200000 -4.213891 -3.396945 0.236486 -0.357677 -0.487919 -0.138972
11.233333 -4.223662 -3.411473 0.239550 -0.348799 -0.435096 -0.143905
11.266667 -4.232208 -3.421577 0.251235 -0.347911 -0.388407 -0.138510
11.300000 -4.240764 -3.431411 0.211714 -0.355096 -0.348734 -0.119251
11.333333 -4.250081 -3.438732 0.191776 -0.369700 -0.316536 -0.085709
11.366667 -4.259427 -3.445795 0.195153 -0.390389 -0.291837 -0.045990
11.400000 -4.271614 -3.452143 0.204849 -0.415721 -0.274575 -0.008997
11.433333 -4.283842 -3.458249 0.205641 -0.443856 -0.263825 0.025022
11.466667 -4.299647 -3.465840 0.214583 -0.473503 -0.258698 0.054524
11.500000 -4.319525 -3.475768 0.227212 -0.503290 -0.258463 0.072325
11.533333 -4.339444 -3.485473 0.236804 -0.532261 -0.262151 0.074354
11.566667 -4.359402 -3.494962 0.236920 -0.559797 -0.269002 0.062345
11.600000 -4.379393 -3.504237 0.245014 -0.585750 -0.278175 0.042575
11.633333 -4.399413 -3.513303 0.245758 -0.610428 -0.289596 0.014368
11.666667 -4.419457 -3.522165 0.248212 -0.633802 -0.302758 -0.019272
11.700000 -4.439519 -3.530826 0.245222 -0.656517 -0.317580 -0.052006
11.733333 -4.459595 -3.539292 0.226783 -0.679395 -0.334457 -0.077388
11.766667 -4.479680 -3.547566 0.231239 -0.703258 -0.353783 -0.092441
11.800000 -4.505947 -3.562013 0.220982 -0.728177 -0.375456 -0.095681
11.833333 -4.532204 -3.576271 0.221026 -0.753817 -0.398885 -0.087297
11.866667 -4.558440 -3.590335 0.215000 -0.780094 -0.423975 -0.067409
11.900000 -4.584641 -3.604205 0.198892 -0.806587 -0.450415 -0.037325
11.933333 -4.610795 -3.617877 0.195424 -0.832378 -0.477349 -0.002903
11.966667 -4.640052 -3.635414 0.198339 -0.856325 -0.503651 0.032406
12.000000 -4.669231 -3.652744 0.202042 -0.878321 -0.529259 0.062683
12.033333 -4.698317 -3.669859 0.209672 -0.898268 -0.554069 0.087310
12.066667 -4.730165 -3.690247 0.214968 -0.915768 -0.577467 0.100782
12.100000 -4.761882 -3.710402 0.229068 -0.930398 -0.598823 0.100147
12.133333 -4.793448 -3.730313 0.241608 -0.941931 -0.617674 0.086308
12.166667 -4.826294 -3.752251 0.240089 -0.950304 -0.633779 0.060727
12.200000 -4.859331 -3.775252 0.254304 -0.954914 -0.646257 0.025453
12.233333 -4.892154 -3.797970 0.256339 -0.955035 -0.654214 -0.019049
12.266667 -4.924509 -3.820841 0.245644 -0.950219 -0.657219 -0.067515
12.300000 -4.957098 -3.844268 0.242669 -0.939705 -0.654540 -0.118830
12.333333 -4.989407 -3.867367 0.232501 -0.922549 -0.645304 -0.171288
12.366667 -5.021274 -3.890142 0.227423 -0.898167 -0.629010 -0.227368
12.400000 -5.052816 -3.912558 0.205880 -0.865731 -0.605073 -0.284039
12.433333 -5.083665 -3.934387 0.210233 -0.824981 -0.573344 -0.339991
12.466667 -5.113133 -3.955233 0.195416 -0.775980 -0.533910 -0.394153
12.500000 -5.140280 -3.974165 0.190011 -0.719690 -0.487662 -0.439712
12.533333 -5.167020 -3.992679 0.178276 -0.657660 -0.435866 -0.470601
12.566667 -5.190109 -4.008308 0.162051 -0.591466 -0.379586 -0.478144
12.600000 -5.209680 -4.021124 0.140587 -0.523537 -0.320607 -0.460459
12.633333 -5.224772 -4.030254 0.113370 -0.456413 -0.260722 -0.413412
12.666667 -5.235357 -4.035564 0.076180 -0.392656 -0.201648 -0.336078
12.700000 -5.245483 -4.040426 0.039477 -0.334129 -0.144509 -0.234173
12.733333 -5.251384 -4.041067 0.016269 -0.282720 -0.090709 -0.117196
12.766667 -5.256830 -4.041269 0.012531 -0.239680 -0.041439 0.003521
12.800000 -5.261825 -4.041037 0.015872 -0.205421 0.002823 0.117689
12.833333 -5.266372 -4.040376 0.053483 -0.179427 0.042084 0.210161
12.866667 -5.270364 -4.037581 0.087862 -0.160404 0.076679 0.268607
12.900000 -5.274560 -4.033155 0.116389 -0.147156 0.106723 0.286658
12.933333 -5.278320 -4.028326 0.140142 -0.137668 0.132919 0.264720
12.966667 -5.282803 -4.022804 0.164583 -0.130145 0.155850 0.208615
13.000000 -5.287983 -4.016628 0.185607 -0.122954 0.175877 0.126626
13.033333 -5.292737 -4.010078 0.190560 -0.115062 0.193113 0.035867
13.066667 -5.297551 -4.002739 0.172643 -0.105809 0.207664 -0.048604
13.100000 -5.301942 -3.995049 0.154022 -0.094644 0.219841 -0.114595
13.133333 -5.305913 -3.987022 0.126003 -0.081565 0.229912 -0.154285
13.166667 -5.308450 -3.978613 0.093261 -0.066846 0.238188 -0.165497
13.200000 -5.310570 -3.969890 0.077951 -0.050955 0.245030 -0.148365
13.233333 -5.312278 -3.960865 0.070339 -0.034288 0.250645 -0.109921
13.266667 -5.312423 -3.952930 0.063442 -0.017433 0.255285 -0.058732
13.300000 -5.312164 -3.944717 0.083218 -0.000925 0.259028 -0.005674
13.333333 -5.311504 -3.936235 0.095706 0.014803 0.261797 0.039811
13.366667 -5.310450 -3.927497 0.113658 0.029580 0.263456 0.070053
13.400000 -5.309007 -3.918512 0.118863 0.043265 0.263779 0.081985
13.433333 -5.307180 -3.909292 0.132579 0.055707 0.262806 0.074158
13.466667 -5.304973 -3.899848 0.131852 0.066986 0.260315 0.050569
13.500000 -5.302394 -3.890191 0.130776 0.077196 0.256238 0.019967
13.533333 -5.299447 -3.880331 0.128155 0.086414 0.250580 -0.009324
13.566667 -5.296330 -3.872185 0.132490 0.094547 0.243514 -0.031629
13.600000 -5.292856 -3.863857 0.118733 0.101528 0.235253 -0.043565
13.633333 -5.289094 -3.856271 0.108816 0.107234 0.225891 -0.043163
13.666667 -5.284878 -3.848959 0.093230 0.111439 0.215674 -0.030256
13.700000 -5.280397 -3.842068 0.087133 0.113918 0.204822 -0.008450
13.733333 -5.276338 -3.835826 0.089445 0.114415 0.193458 0.017105
13.766667 -5.272496 -3.830055 0.096684 0.112909 0.181561 0.046200
13.800000 -5.268330 -3.824144 0.107070 0.109524 0.169239 0.074205
13.833333 -5.263845 -3.818098 0.119252 0.104557 0.156605 0.100301
13.866667 -5.259045 -3.811923 0.133086 0.098284 0.143654 0.119815
13.900000 -5.255288 -3.806635 0.125768 0.091044 0.130324 0.132413
13.933333 -5.252469 -3.802392 0.134112 0.083370 0.116773 0.139015
13.966667 -5.250975 -3.799695 0.122928 0.075728 0.103226 0.140821
14.000000 -5.249176 -3.796880 0.138436 0.068485 0.089814 0.140357
14.033333 -5.247073 -3.793948 0.145283 0.061952 0.076727 0.137892
14.066667 -5.245944 -3.792422 0.146771 0.056601 0.064422 0.136930
14.100000 -5.244509 -3.790778 0.152237 0.052736 0.053336 0.136207
14.133333 -5.242768 -3.789015 0.154171 0.050410 0.043651 0.136834
14.166667 -5.241269 -3.787913 0.160466 0.049519 0.035465 0.133551
14.200000 -5.239965 -3.787279 0.169298 0.050021 0.028995 0.125531
