t x y theta dxdt dydt dthetadt
0.000000 0.000000 0.000000 0.413386 0.044147 0.100027 2.355152
0.033333 0.001470 0.003376 0.566927 0.044448 0.105067 2.671913
0.066667 0.002963 0.006923 0.713156 0.044769 0.110306 2.925528
0.100000 0.004453 0.010630 0.853335 0.045107 0.115763 3.101026
0.133333 0.005942 0.014500 0.994683 0.045460 0.121457 3.183368
0.166667 0.007452 0.018569 1.161176 0.045824 0.127392 3.153108
0.200000 0.008982 0.022846 1.217475 0.046189 0.133566 3.020600
0.233333 0.010531 0.027341 1.339956 0.046543 0.139970 2.801055
0.266667 0.012097 0.032062 1.430987 0.046876 0.146592 2.516308
0.300000 0.013677 0.037015 1.536099 0.047175 0.153406 2.186829
0.333333 0.015270 0.042210 1.618246 0.047423 0.160380 1.836815
0.366667 0.016874 0.047653 1.695041 0.047608 0.167498 1.495171
0.400000 0.018486 0.053347 1.702658 0.047715 0.174745 1.167552
0.433333 0.020103 0.059298 1.716766 0.047735 0.182110 0.869354
0.466667 0.021722 0.065510 1.726647 0.047660 0.189568 0.600702
0.500000 0.023331 0.071895 1.713179 0.047484 0.197129 0.372596
0.533333 0.024934 0.078553 1.716920 0.047206 0.204789 0.184268
0.566667 0.026526 0.085490 1.705771 0.046830 0.212525 0.037719
0.600000 0.028102 0.092712 1.705947 0.046362 0.220298 -0.068177
0.633333 0.029666 0.100106 1.689934 0.045815 0.228063 -0.144766
0.666667 0.031205 0.107799 1.711839 0.045197 0.235801 -0.193402
0.700000 0.032717 0.115796 1.677546 0.044520 0.243447 -0.222349
0.733333 0.034197 0.124103 1.664972 0.043796 0.250947 -0.237890
0.766667 0.035639 0.132726 1.673347 0.043035 0.258271 -0.247254
0.800000 0.037064 0.141516 1.641614 0.042239 0.265413 -0.250174
0.833333 0.038445 0.150633 1.643964 0.041413 0.272360 -0.243323
0.866667 0.039808 0.159914 1.649476 0.040562 0.279092 -0.227742
0.900000 0.041153 0.169358 1.620135 0.039683 0.285627 -0.205099
0.933333 0.042478 0.178962 1.618961 0.038770 0.292010 -0.170106
0.966667 0.043785 0.188725 1.588972 0.037818 0.298271 -0.117350
1.000000 0.045029 0.198826 1.602237 0.036829 0.304418 -0.048595
1.033333 0.046253 0.209081 1.621556 0.035792 0.310498 0.031388
1.066667 0.047455 0.219488 1.597367 0.034707 0.316535 0.124159
1.100000 0.048588 0.230210 1.593692 0.033575 0.322531 0.222990
1.133333 0.049699 0.241079 1.582663 0.032409 0.328452 0.322417
1.166667 0.050787 0.252091 1.602698 0.031220 0.334267 0.409687
1.200000 0.051800 0.263390 1.620079 0.030011 0.339973 0.482650
1.233333 0.052790 0.274826 1.662104 0.028793 0.345540 0.541418
1.266667 0.053706 0.286533 1.699403 0.027574 0.350951 0.574648
1.300000 0.054597 0.298372 1.728447 0.026352 0.356216 0.584848
1.333333 0.055464 0.310339 1.763304 0.025122 0.361357 0.567251
1.366667 0.056257 0.322561 1.774737 0.023880 0.366392 0.530150
1.400000 0.057026 0.334905 1.801615 0.022620 0.371338 0.473998
1.433333 0.057769 0.347366 1.806349 0.021337 0.376208 0.405438
1.466667 0.058487 0.359941 1.818291 0.020024 0.381021 0.336224
1.500000 0.059180 0.372626 1.815436 0.018679 0.385779 0.269462
1.533333 0.059801 0.385537 1.829469 0.017303 0.390475 0.211085
1.566667 0.060353 0.398671 1.839391 0.015901 0.395099 0.157679
1.600000 0.060835 0.412020 1.830845 0.014484 0.399613 0.111760
1.633333 0.061290 0.425464 1.835425 0.013066 0.403977 0.066204
1.666667 0.061720 0.438996 1.820566 0.011659 0.408154 0.018587
1.700000 0.062082 0.452716 1.826677 0.010278 0.412096 -0.029785
1.733333 0.062379 0.466613 1.830726 0.008933 0.415771 -0.073258
1.766667 0.062611 0.480673 1.858838 0.007628 0.419156 -0.110106
1.800000 0.062818 0.494804 1.869091 0.006363 0.422247 -0.139878
1.833333 0.063000 0.509000 1.846151 0.005138 0.425046 -0.156901
1.866667 0.063156 0.523256 1.809001 0.003953 0.427547 -0.160360
1.900000 0.063288 0.537568 1.790170 0.002809 0.429760 -0.150770
1.933333 0.063369 0.551968 1.769523 0.001701 0.431694 -0.133073
1.966667 0.063402 0.566443 1.767473 0.000626 0.433359 -0.103863
2.000000 0.063389 0.580980 1.765985 -0.000416 0.434751 -0.063815
2.033333 0.063333 0.595566 1.772073 -0.001423 0.435862 -0.019625
2.066667 0.063253 0.610182 1.791321 -0.002395 0.436693 0.022495
2.100000 0.063151 0.624823 1.787944 -0.003329 0.437235 0.060723
2.133333 0.063012 0.639474 1.802261 -0.004222 0.437481 0.091500
2.166667 0.062851 0.654139 1.810734 -0.005069 0.437429 0.110623
2.200000 0.062658 0.668788 1.811811 -0.005869 0.437082 0.116311
2.233333 0.062444 0.683440 1.806837 -0.006625 0.436450 0.114083
2.266667 0.062203 0.698050 1.808466 -0.007335 0.435537 0.109065
2.300000 0.061937 0.712605 1.813054 -0.008002 0.434350 0.100796
2.333333 0.061648 0.727094 1.823712 -0.008627 0.432904 0.092086
2.366667 0.061339 0.741505 1.818906 -0.009209 0.431216 0.084887
2.400000 0.061012 0.755894 1.826672 -0.009750 0.429305 0.079721
2.433333 0.060666 0.770256 1.829174 -0.010251 0.427191 0.073448
2.466667 0.060306 0.784510 1.830146 -0.010713 0.424898 0.065301
2.500000 0.059929 0.798729 1.832938 -0.011139 0.422446 0.057132
2.533333 0.059543 0.812817 1.832884 -0.011530 0.419843 0.049577
2.566667 0.059149 0.826764 1.840915 -0.011891 0.417099 0.040490
2.600000 0.058751 0.840562 1.842880 -0.012222 0.414225 0.031374
2.633333 0.058337 0.854305 1.839841 -0.012530 0.411244 0.023344
2.666667 0.057909 0.867989 1.835236 -0.012818 0.408169 0.016216
2.700000 0.057466 0.881610 1.835869 -0.013086 0.405008 0.008761
2.733333 0.057009 0.895163 1.835490 -0.013335 0.401758 0.002000
2.766667 0.056556 0.908525 1.837213 -0.013563 0.398412 -0.002787
2.800000 0.056110 0.921689 1.841127 -0.013769 0.394962 -0.006585
2.833333 0.055651 0.934773 1.845025 -0.013952 0.391385 -0.009912
2.866667 0.055180 0.947773 1.835419 -0.014109 0.387669 -0.012644
2.900000 0.054697 0.960685 1.834255 -0.014240 0.383812 -0.016875
2.933333 0.054204 0.973506 1.839081 -0.014346 0.379819 -0.040795
2.966667 0.053700 0.986232 1.834891 -0.014422 0.375672 -0.105569
3.000000 0.053212 0.998718 1.833596 -0.014463 0.371341 -0.241895
3.033333 0.052741 1.010962 1.829346 -0.014463 0.366794 -0.480677
3.066667 0.052261 1.023100 1.837358 -0.014418 0.361998 -0.852817
3.100000 0.051773 1.035129 1.830614 -0.014330 0.356918 -1.377373
3.133333 0.051276 1.047045 1.836579 -0.014197 0.351522 -2.036730
3.166667 0.050771 1.058846 1.832734 -0.014026 0.345809 -2.795695
3.200000 0.050291 1.070382 1.828299 -0.013827 0.339803 -3.594644
3.233333 0.049837 1.081652 1.791144 -0.013612 0.333528 -4.366432
3.266667 0.049376 1.092797 1.604000 -0.013393 0.327024 -5.034074
3.300000 0.048938 1.103672 1.338115 -0.013180 0.320360 -5.528838
3.333333 0.048518 1.114272 0.969669 -0.012988 0.313616 -5.802937
3.366667 0.048111 1.124586 0.580239 -0.012830 0.306874 -5.822675
3.400000 0.047709 1.134602 0.224464 -0.012714 0.300194 -5.578165
3.433333 0.047307 1.144312 -0.078078 -0.012643 0.293643 -5.076201
3.466667 0.046900 1.153885 -0.253057 -0.012621 0.287264 -4.361238
3.500000 0.046489 1.163320 -0.349519 -0.012644 0.281055 -3.494208
3.533333 0.046072 1.172616 -0.374805 -0.012704 0.274988 -2.556497
3.566667 0.045647 1.181602 -0.368861 -0.012792 0.269024 -1.636347
3.600000 0.045217 1.190446 -0.364907 -0.012897 0.263129 -0.810087
3.633333 0.044783 1.199148 -0.361630 -0.013011 0.257259 -0.139709
3.666667 0.044346 1.207706 -0.326540 -0.013126 0.251382 0.352146
3.700000 0.043905 1.216119 -0.235153 -0.013236 0.245495 0.663693
3.733333 0.043459 1.224258 -0.146840 -0.013338 0.239616 0.819567
3.766667 0.043009 1.232133 -0.059539 -0.013431 0.233755 0.853580
3.800000 0.042557 1.239752 -0.021988 -0.013513 0.227932 0.800336
3.833333 0.042104 1.247124 -0.015506 -0.013585 0.222182 0.692519
3.866667 0.041648 1.254349 -0.029420 -0.013649 0.216540 0.555402
3.900000 0.041191 1.261426 -0.028125 -0.013703 0.211032 0.411573
3.933333 0.040731 1.268357 -0.031102 -0.013749 0.205661 0.276713
3.966667 0.040270 1.275141 -0.035118 -0.013787 0.200432 0.164754
4.000000 0.039809 1.281705 -0.037771 -0.013818 0.195335 0.081884
4.033333 0.039346 1.288123 -0.031083 -0.013841 0.190346 0.029507
4.066667 0.038882 1.294394 -0.027934 -0.013858 0.185430 0.001382
4.100000 0.038419 1.300460 -0.025017 -0.013869 0.180565 -0.009309
4.133333 0.037956 1.306381 -0.030147 -0.013873 0.175741 -0.010881
4.166667 0.037492 1.312156 -0.035894 -0.013871 0.170954 -0.009594
4.200000 0.037028 1.317788 -0.034552 -0.013862 0.166198 -0.008583
4.233333 0.036564 1.323234 -0.034542 -0.013847 0.161483 -0.009094
4.266667 0.036101 1.328537 -0.031043 -0.013827 0.156817 -0.008344
4.300000 0.035640 1.333666 -0.032010 -0.013800 0.152201 -0.006739
4.333333 0.035179 1.338653 -0.038817 -0.013767 0.147634 -0.002287
