t x y theta dxdt dydt dthetadt
0.000000 0.000000 0.000000 2.905932 0.114165 0.097947 -1.774826
0.033333 0.003860 0.003260 2.820634 0.118457 0.098454 -1.811565
0.066667 0.007863 0.006543 2.746114 0.122833 0.098977 -1.809695
0.100000 0.012012 0.009850 2.679048 0.127291 0.099513 -1.770457
0.133333 0.016310 0.013180 2.619454 0.131830 0.100056 -1.696036
0.166667 0.020760 0.016523 2.553960 0.136448 0.100605 -1.591062
0.200000 0.025367 0.019889 2.485212 0.141143 0.101153 -1.459712
0.233333 0.030134 0.023278 2.429101 0.145915 0.101694 -1.313416
0.266667 0.035060 0.026680 2.397685 0.150761 0.102224 -1.160566
0.300000 0.040147 0.030096 2.368294 0.155677 0.102740 -1.005280
0.333333 0.045405 0.033534 2.341143 0.160660 0.103241 -0.853650
0.366667 0.050828 0.036985 2.329142 0.165706 0.103726 -0.711372
0.400000 0.056428 0.040458 2.314738 0.170811 0.104193 -0.585903
0.433333 0.062197 0.043944 2.292848 0.175973 0.104647 -0.476706
0.466667 0.068139 0.047443 2.279041 0.181191 0.105087 -0.385493
0.500000 0.074254 0.050956 2.272615 0.186465 0.105516 -0.315425
0.533333 0.080546 0.054481 2.268033 0.191798 0.105933 -0.263094
0.566667 0.087015 0.058021 2.255268 0.197195 0.106342 -0.225373
0.600000 0.093664 0.061573 2.263047 0.202665 0.106744 -0.198780
0.633333 0.100495 0.065138 2.272624 0.208216 0.107140 -0.185322
0.666667 0.107509 0.068717 2.250670 0.213853 0.107531 -0.179069
0.700000 0.114708 0.072308 2.252653 0.219583 0.107918 -0.177179
0.733333 0.122094 0.075912 2.243467 0.225408 0.108301 -0.179834
0.766667 0.129669 0.079528 2.241400 0.231326 0.108680 -0.187179
0.800000 0.137456 0.083159 2.225341 0.237328 0.109055 -0.196488
0.833333 0.145436 0.086802 2.213733 0.243407 0.109424 -0.200133
0.866667 0.153633 0.090457 2.214655 0.249558 0.109787 -0.201904
0.900000 0.162052 0.094125 2.208310 0.255775 0.110143 -0.198605
0.933333 0.170694 0.097804 2.204160 0.262047 0.110491 -0.189778
0.966667 0.179533 0.101495 2.185939 0.268370 0.110829 -0.172799
1.000000 0.188570 0.105197 2.191440 0.274742 0.111157 -0.151641
1.033333 0.197838 0.108910 2.178217 0.281155 0.111475 -0.134824
1.066667 0.207307 0.112634 2.172638 0.287602 0.111783 -0.126631
1.100000 0.216978 0.116368 2.167685 0.294077 0.112081 -0.134911
1.133333 0.226851 0.120113 2.155282 0.300578 0.112370 -0.164533
1.166667 0.236962 0.123866 2.159768 0.307104 0.112650 -0.225679
1.200000 0.247314 0.127627 2.172385 0.313650 0.112922 -0.321040
1.233333 0.257908 0.131395 2.179151 0.320219 0.113188 -0.451028
1.266667 0.268707 0.135173 2.182234 0.326813 0.113448 -0.614063
1.300000 0.279713 0.138959 2.183277 0.333437 0.113703 -0.809968
1.333333 0.290925 0.142755 2.160367 0.340099 0.113954 -1.038031
1.366667 0.302344 0.146558 2.104877 0.346809 0.114203 -1.290044
1.400000 0.314014 0.150370 2.043839 0.353583 0.114449 -1.561112
1.433333 0.325892 0.154190 1.986124 0.360438 0.114694 -1.841907
1.466667 0.337978 0.158017 1.926162 0.367385 0.114938 -2.126389
1.500000 0.350318 0.161852 1.849870 0.374426 0.115180 -2.403873
1.533333 0.362867 0.165695 1.769709 0.381563 0.115420 -2.664903
1.566667 0.375672 0.169545 1.670923 0.388783 0.115655 -2.901949
1.600000 0.388732 0.173405 1.570342 0.396070 0.115884 -3.103381
1.633333 0.402050 0.177273 1.454875 0.403402 0.116105 -3.266445
1.666667 0.415623 0.181150 1.338148 0.410761 0.116315 -3.386515
1.700000 0.429453 0.185035 1.200348 0.418132 0.116511 -3.467633
1.733333 0.443538 0.188927 1.040895 0.425496 0.116690 -3.515331
1.766667 0.457878 0.192826 0.926289 0.432843 0.116847 -3.540198
1.800000 0.472423 0.196728 0.786932 0.440166 0.116980 -3.560799
1.833333 0.487222 0.200636 0.658603 0.447456 0.117086 -3.592399
1.866667 0.502275 0.204549 0.551840 0.454706 0.117161 -3.650121
1.900000 0.517529 0.208462 0.459574 0.461909 0.117204 -3.741894
1.933333 0.533037 0.212378 0.394491 0.469064 0.117212 -3.875102
1.966667 0.548796 0.216295 0.303857 0.476171 0.117184 -4.045607
2.000000 0.564807 0.220210 0.187500 0.483223 0.117119 -4.240418
2.033333 0.581067 0.224122 0.013645 0.490217 0.117018 -4.434008
2.066667 0.597575 0.228028 -0.171580 0.497155 0.116882 -4.591396
2.100000 0.614275 0.231931 -0.317921 0.504031 0.116715 -4.678274
2.133333 0.631216 0.235825 -0.510626 0.510840 0.116521 -4.651999
2.166667 0.648345 0.239715 -0.715594 0.517575 0.116307 -4.484615
2.200000 0.665708 0.243592 -0.923677 0.524236 0.116077 -4.156036
2.233333 0.683301 0.247458 -1.131189 0.530818 0.115840 -3.667426
2.266667 0.701120 0.251313 -1.309812 0.537316 0.115602 -3.041134
2.300000 0.719160 0.255157 -1.420762 0.543724 0.115369 -2.305775
2.333333 0.737419 0.258992 -1.523451 0.550036 0.115147 -1.505434
2.366667 0.755891 0.262819 -1.569073 0.556245 0.114941 -0.684798
2.400000 0.774573 0.266641 -1.537530 0.562342 0.114752 0.108055
2.433333 0.793460 0.270459 -1.466639 0.568315 0.114580 0.831974
2.466667 0.812548 0.274275 -1.348917 0.574154 0.114421 1.457274
2.500000 0.831797 0.278079 -1.227302 0.579853 0.114269 1.963124
2.533333 0.851239 0.281882 -1.113696 0.585405 0.114118 2.336948
2.566667 0.870869 0.285683 -1.002055 0.590808 0.113958 2.576823
2.600000 0.890683 0.289484 -0.914014 0.596062 0.113784 2.698150
2.633333 0.910677 0.293283 -0.818630 0.601173 0.113594 2.719186
2.666667 0.930848 0.297081 -0.715945 0.606146 0.113385 2.664391
2.700000 0.951193 0.300877 -0.624324 0.610985 0.113155 2.554942
2.733333 0.971674 0.304653 -0.540020 0.615692 0.112906 2.412087
2.766667 0.992289 0.308408 -0.452867 0.620273 0.112636 2.253445
2.800000 1.013064 0.312160 -0.374793 0.624726 0.112342 2.083463
2.833333 1.033965 0.315890 -0.307712 0.629049 0.112024 1.910207
2.866667 1.055019 0.319615 -0.244712 0.633239 0.111678 1.734429
2.900000 1.076220 0.323335 -0.208238 0.637297 0.111302 1.560747
2.933333 1.097566 0.327049 -0.151543 0.641217 0.110894 1.389310
2.966667 1.119051 0.330757 -0.123720 0.644993 0.110449 1.223760
3.000000 1.140670 0.334457 -0.073462 0.648622 0.109970 1.068337
3.033333 1.162390 0.338126 -0.043117 0.652099 0.109455 0.925185
3.066667 1.184234 0.341786 -0.010442 0.655419 0.108904 0.795842
3.100000 1.206169 0.345412 0.000581 0.658578 0.108317 0.676931
3.133333 1.228192 0.349003 0.016557 0.661578 0.107699 0.570437
3.166667 1.250322 0.352582 0.029051 0.664419 0.107049 0.475151
3.200000 1.272553 0.356148 0.035851 0.667102 0.106366 0.392061
3.233333 1.294858 0.359674 0.059750 0.669624 0.105645 0.317106
3.266667 1.317252 0.363185 0.065565 0.671987 0.104883 0.253296
3.300000 1.339730 0.366680 0.060008 0.674186 0.104072 0.200105
3.333333 1.362285 0.370159 0.068291 0.676212 0.103203 0.157321
3.366667 1.384911 0.373619 0.082742 0.678063 0.102272 0.122208
3.400000 1.407587 0.377030 0.073918 0.679733 0.101272 0.092990
3.433333 1.430321 0.380421 0.080535 0.681219 0.100199 0.072737
3.466667 1.453094 0.383760 0.070194 0.682518 0.099056 0.057159
3.500000 1.475902 0.387046 0.077556 0.683633 0.097847 0.045603
3.533333 1.498748 0.390307 0.074355 0.684564 0.096580 0.037254
3.566667 1.521620 0.393510 0.072332 0.685315 0.095261 0.032772
3.600000 1.544511 0.396654 0.087461 0.685888 0.093900 0.030565
3.633333 1.567421 0.399768 0.079355 0.686288 0.092502 0.028325
3.666667 1.590344 0.402851 0.083337 0.686516 0.091062 0.024504
3.700000 1.613271 0.405868 0.088074 0.686576 0.089571 0.019610
3.733333 1.636198 0.408819 0.079916 0.686469 0.088021 0.012443
3.766667 1.659117 0.411731 0.087425 0.686196 0.086401 0.002441
3.800000 1.682022 0.414604 0.085712 0.685758 0.084699 -0.009328
3.833333 1.704907 0.417436 0.084580 0.685153 0.082904 -0.022432
3.866667 1.727767 0.420223 0.089278 0.684384 0.081012 -0.035018
3.900000 1.750600 0.422932 0.080904 0.683449 0.079022 -0.046820
3.933333 1.773402 0.425561 0.088256 0.682351 0.076927 -0.058575
3.966667 1.796167 0.428108 0.080157 0.681091 0.074728 -0.068508
4.000000 1.818890 0.430570 0.073497 0.679670 0.072425 -0.076569
4.033333 1.841566 0.432945 0.069895 0.678087 0.070026 -0.082657
4.066667 1.864176 0.435259 0.067450 0.676340 0.067539 -0.085884
4.100000 1.886729 0.437481 0.065209 0.674423 0.064973 -0.085767
4.133333 1.909204 0.439636 0.060108 0.672331 0.062340 -0.081883
4.166667 1.931611 0.441696 0.063277 0.670058 0.059649 -0.078175
4.200000 1.953946 0.443656 0.060287 0.667599 0.056905 -0.075141
4.233333 1.976204 0.445516 0.046929 0.664953 0.054109 -0.073324
4.266667 1.998379 0.447273 0.048975 0.662121 0.051261 -0.076293
4.300000 2.020466 0.448925 0.049001 0.659109 0.048357 -0.087071
4.333333 2.042437 0.450490 0.043970 0.655918 0.045396 -0.104512
4.366667 2.064286 0.451965 0.050163 0.652554 0.042374 -0.124709
4.400000 2.086010 0.453349 0.053637 0.649028 0.039285 -0.149631
4.433333 2.107603 0.454636 0.055576 0.645347 0.036124 -0.179906
4.466667 2.129084 0.455807 0.039208 0.641517 0.032884 -0.209981
4.500000 2.150426 0.456876 0.021070 0.637546 0.029560 -0.233847
4.533333 2.171624 0.457839 0.018735 0.633442 0.026143 -0.251655
4.566667 2.192696 0.458678 0.014182 0.629214 0.022630 -0.263712
4.600000 2.213637 0.459391 -0.007102 0.624861 0.019020 -0.263612
4.633333 2.234442 0.459973 -0.029987 0.620381 0.015318 -0.249550
4.666667 2.255081 0.460438 -0.038512 0.615776 0.011526 -0.225050
4.700000 2.275549 0.460782 -0.036169 0.611045 0.007647 -0.196269
4.733333 2.295867 0.460990 -0.056639 0.606183 0.003690 -0.161546
4.766667 2.316005 0.461070 -0.054414 0.601189 -0.000342 -0.123771
4.800000 2.335984 0.461010 -0.056746 0.596066 -0.004446 -0.090103
4.833333 2.355801 0.460805 -0.052756 0.590820 -0.008624 -0.063274
4.866667 2.375451 0.460455 -0.052636 0.585452 -0.012872 -0.044805
4.900000 2.394909 0.459967 -0.047262 0.579965 -0.017191 -0.031526
4.933333 2.414172 0.459339 -0.040220 0.574363 -0.021581 -0.029524
4.966667 2.433237 0.458569 -0.049681 0.568649 -0.026042 -0.035958
5.000000 2.452119 0.457643 -0.049080 0.562826 -0.030578 -0.047989
5.033333 2.470813 0.456560 -0.053464 0.556894 -0.035186 -0.062749
5.066667 2.489301 0.455326 -0.045586 0.550858 -0.039870 -0.078291
5.100000 2.507581 0.453938 -0.054358 0.544719 -0.044632 -0.095350
5.133333 2.525649 0.452395 -0.061984 0.538478 -0.049472 -0.108418
5.166667 2.543514 0.450685 -0.064223 0.532135 -0.054391 -0.118716
5.200000 2.561172 0.448806 -0.078141 0.525690 -0.059389 -0.124900
5.233333 2.578620 0.446756 -0.070302 0.519138 -0.064465 -0.129299
5.266667 2.595841 0.444539 -0.082061 0.512478 -0.069620 -0.129534
5.300000 2.612832 0.442152 -0.089375 0.505704 -0.074852 -0.124869
5.333333 2.629601 0.439587 -0.093590 0.498817 -0.080161 -0.116125
5.366667 2.646146 0.436842 -0.089450 0.491812 -0.085545 -0.103374
5.400000 2.662446 0.433918 -0.095410 0.484686 -0.091005 -0.088728
5.433333 2.678514 0.430810 -0.101348 0.477443 -0.096539 -0.068661
5.466667 2.694328 0.427516 -0.108841 0.470083 -0.102147 -0.046493
5.500000 2.709904 0.424035 -0.110407 0.462609 -0.107826 -0.022749
5.533333 2.725239 0.420363 -0.112573 0.455021 -0.113576 0.000905
5.566667 2.740304 0.416497 -0.109374 0.447329 -0.119394 0.025172
5.600000 2.755094 0.412432 -0.106244 0.439536 -0.125279 0.051377
5.633333 2.769634 0.408172 -0.101519 0.431638 -0.131231 0.075508
5.666667 2.783922 0.403715 -0.096505 0.423637 -0.137248 0.097733
5.700000 2.797917 0.399050 -0.094049 0.415530 -0.143330 0.116831
5.733333 2.811655 0.394184 -0.097011 0.407310 -0.149480 0.135254
5.766667 2.825131 0.389117 -0.078468 0.398957 -0.155704 0.151552
5.800000 2.838299 0.383832 -0.082157 0.390460 -0.162003 0.164807
5.833333 2.851202 0.378343 -0.068804 0.381812 -0.168379 0.175832
5.866667 2.863836 0.372646 -0.072621 0.373005 -0.174834 0.187434
5.900000 2.876201 0.366742 -0.065030 0.364034 -0.181368 0.199266
5.933333 2.888236 0.360609 -0.051760 0.354905 -0.187979 0.205580
5.966667 2.899937 0.354246 -0.041583 0.345635 -0.194659 0.203354
6.000000 2.911362 0.347670 -0.041814 0.336224 -0.201409 0.188281
6.033333 2.922443 0.340859 -0.036224 0.326676 -0.208226 0.160705
6.066667 2.933174 0.333809 -0.022295 0.317003 -0.215107 0.115699
6.100000 2.943552 0.326519 -0.010679 0.307220 -0.222044 0.052973
6.133333 2.953648 0.319012 -0.008104 0.297334 -0.229038 -0.025597
6.166667 2.963381 0.311261 0.001422 0.287357 -0.236082 -0.117618
6.200000 2.972830 0.303291 0.017003 0.277321 -0.243166 -0.222260
6.233333 2.981992 0.295102 0.011786 0.267248 -0.250282 -0.343854
6.266667 2.990780 0.286662 -0.008509 0.257159 -0.257422 -0.484362
6.300000 2.999190 0.277969 -0.052825 0.247066 -0.264583 -0.644234
6.333333 3.007219 0.269020 -0.102352 0.237005 -0.271751 -0.819719
6.366667 3.014865 0.259814 -0.105756 0.226996 -0.278919 -1.011676
6.400000 3.022221 0.250387 -0.106884 0.217047 -0.286088 -1.214791
6.433333 3.029288 0.240738 -0.127523 0.207170 -0.293257 -1.424388
6.466667 3.035977 0.230826 -0.186447 0.197372 -0.300429 -1.633261
6.500000 3.042375 0.220693 -0.250249 0.187650 -0.307613 -1.836234
6.533333 3.048485 0.210337 -0.329587 0.177977 -0.314825 -2.030608
6.566667 3.054224 0.199714 -0.400921 0.168339 -0.322071 -2.206714
6.600000 3.059674 0.188869 -0.494284 0.158729 -0.329350 -2.359256
6.633333 3.064836 0.177803 -0.595702 0.149144 -0.336662 -2.481497
6.666667 3.069710 0.166514 -0.689635 0.139576 -0.344004 -2.573757
6.700000 3.074227 0.154953 -0.795524 0.130029 -0.351375 -2.636899
6.733333 3.078389 0.143117 -0.873418 0.120516 -0.358771 -2.680125
6.766667 3.082199 0.131006 -0.961194 0.111044 -0.366191 -2.710496
6.800000 3.085661 0.118617 -1.064725 0.101615 -0.373643 -2.733389
6.833333 3.088841 0.106009 -1.148359 0.092232 -0.381132 -2.754987
6.866667 3.091740 0.093183 -1.222615 0.082906 -0.388654 -2.771731
6.900000 3.094359 0.080141 -1.309573 0.073643 -0.396208 -2.782161
6.933333 3.096699 0.066883 -1.398002 0.064445 -0.403788 -2.770170
6.966667 3.098712 0.053342 -1.486707 0.055311 -0.411397 -2.727073
7.000000 3.100399 0.039518 -1.600655 0.046239 -0.419027 -2.646612
7.033333 3.101766 0.025411 -1.699442 0.037233 -0.426664 -2.522840
7.066667 3.102815 0.011020 -1.833205 0.028295 -0.434299 -2.353198
7.100000 3.103595 -0.003580 -1.934474 0.019432 -0.441919 -2.137475
7.133333 3.104064 -0.018463 -2.015879 0.010656 -0.449510 -1.884286
7.166667 3.104227 -0.033627 -2.081177 0.001981 -0.457054 -1.604985
7.200000 3.104127 -0.048994 -2.108119 -0.006584 -0.464543 -1.314667
7.233333 3.103729 -0.064638 -2.143529 -0.015035 -0.471976 -1.023901
7.266667 3.103073 -0.080481 -2.155490 -0.023373 -0.479357 -0.750912
7.300000 3.102129 -0.096597 -2.151356 -0.031595 -0.486676 -0.507021
7.333333 3.100933 -0.112907 -2.150875 -0.039705 -0.493931 -0.302790
7.366667 3.099458 -0.129482 -2.154342 -0.047703 -0.501116 -0.140092
7.400000 3.097712 -0.146318 -2.142752 -0.055587 -0.508215 -0.013259
7.433333 3.095697 -0.163411 -2.145488 -0.063354 -0.515213 0.078580
7.466667 3.093419 -0.180755 -2.121485 -0.070996 -0.522078 0.142023
7.500000 3.090884 -0.198346 -2.123844 -0.078509 -0.528794 0.184815
7.533333 3.088114 -0.216113 -2.125208 -0.085888 -0.535336 0.215589
7.566667 3.085096 -0.234115 -2.115130 -0.093128 -0.541682 0.240977
7.600000 3.081834 -0.252347 -2.102403 -0.100225 -0.547813 0.262598
7.633333 3.078347 -0.270744 -2.088615 -0.107177 -0.553720 0.284988
7.666667 3.074626 -0.289360 -2.080508 -0.113988 -0.559405 0.314241
7.700000 3.070687 -0.308134 -2.073424 -0.120660 -0.564873 0.349967
7.733333 3.066521 -0.327113 -2.057086 -0.127197 -0.570135 0.390024
7.766667 3.062145 -0.346242 -2.053726 -0.133603 -0.575210 0.428980
7.800000 3.057552 -0.365563 -2.046502 -0.139884 -0.580119 0.466580
7.833333 3.052755 -0.385025 -2.035176 -0.146042 -0.584878 0.499394
7.866667 3.047759 -0.404627 -2.023080 -0.152080 -0.589503 0.521771
7.900000 3.042567 -0.424362 -1.975257 -0.158000 -0.593999 0.528390
7.933333 3.037183 -0.444227 -1.959191 -0.163802 -0.598377 0.519467
7.966667 3.031603 -0.464251 -1.924255 -0.169487 -0.602637 0.495971
8.000000 3.025834 -0.484429 -1.901276 -0.175051 -0.606771 0.455196
8.033333 3.019878 -0.504754 -1.881154 -0.180495 -0.610769 0.397806
8.066667 3.013742 -0.525220 -1.871224 -0.185814 -0.614620 0.327504
8.100000 3.007428 -0.545821 -1.868115 -0.191005 -0.618312 0.253071
8.133333 3.000943 -0.566550 -1.862014 -0.196066 -0.621826 0.176822
8.166667 2.994289 -0.587402 -1.855643 -0.200993 -0.625149 0.102130
8.200000 2.987476 -0.608347 -1.864841 -0.205783 -0.628275 0.035064
8.233333 2.980507 -0.629380 -1.868491 -0.210436 -0.631204 -0.021514
8.266667 2.973384 -0.650517 -1.876099 -0.214952 -0.633938 -0.067002
8.300000 2.966114 -0.671733 -1.867775 -0.219330 -0.636480 -0.106079
8.333333 2.958701 -0.693021 -1.882860 -0.223570 -0.638839 -0.137526
8.366667 2.951149 -0.714378 -1.885823 -0.227675 -0.641028 -0.162783
8.400000 2.943462 -0.735815 -1.888929 -0.231643 -0.643053 -0.185117
8.433333 2.935643 -0.757327 -1.896430 -0.235474 -0.644913 -0.205948
8.466667 2.927699 -0.778891 -1.903479 -0.239167 -0.646613 -0.226520
8.500000 2.919635 -0.800503 -1.909615 -0.242722 -0.648153 -0.243160
8.533333 2.911453 -0.822171 -1.920976 -0.246137 -0.649532 -0.259340
8.566667 2.903161 -0.843890 -1.931517 -0.249409 -0.650743 -0.272785
8.600000 2.894760 -0.865641 -1.936668 -0.252539 -0.651784 -0.282912
8.633333 2.886256 -0.887417 -1.954232 -0.255525 -0.652654 -0.289167
8.666667 2.877656 -0.909225 -1.957329 -0.258365 -0.653352 -0.290765
8.700000 2.868966 -0.931058 -1.975957 -0.261061 -0.653873 -0.289159
8.733333 2.860185 -0.952900 -1.984544 -0.263611 -0.654216 -0.282536
8.766667 2.851324 -0.974754 -1.999772 -0.266015 -0.654381 -0.271368
8.800000 2.842382 -0.996607 -2.003811 -0.268272 -0.654368 -0.255599
8.833333 2.833370 -1.018460 -2.007030 -0.270381 -0.654172 -0.235016
8.866667 2.824293 -1.040304 -2.022919 -0.272343 -0.653793 -0.209799
8.900000 2.815148 -1.062132 -2.024998 -0.274157 -0.653231 -0.181976
8.933333 2.805948 -1.083939 -2.031943 -0.275824 -0.652486 -0.150437
8.966667 2.796690 -1.105718 -2.051437 -0.277344 -0.651556 -0.117327
9.000000 2.787388 -1.127463 -2.041533 -0.278721 -0.650443 -0.084827
9.033333 2.778036 -1.149168 -2.045877 -0.279956 -0.649146 -0.052579
9.066667 2.768651 -1.170826 -2.053769 -0.281047 -0.647666 -0.022102
9.100000 2.759237 -1.192428 -2.042049 -0.281996 -0.646003 0.006439
9.133333 2.749800 -1.213970 -2.043545 -0.282804 -0.644156 0.030804
9.166667 2.740331 -1.235450 -2.040325 -0.283472 -0.642127 0.048828
9.200000 2.730835 -1.256865 -2.035381 -0.283997 -0.639913 0.063173
9.233333 2.721330 -1.278198 -2.036162 -0.284381 -0.637516 0.072551
9.266667 2.711807 -1.299453 -2.023849 -0.284623 -0.634934 0.076904
9.300000 2.702286 -1.320614 -2.023673 -0.284721 -0.632165 0.078461
9.333333 2.692754 -1.341687 -2.033035 -0.284673 -0.629209 0.077141
9.366667 2.683234 -1.362652 -2.018281 -0.284477 -0.626064 0.075614
9.400000 2.673729 -1.383504 -2.015751 -0.284138 -0.622734 0.073316
9.433333 2.664228 -1.404251 -2.017685 -0.283658 -0.619224 0.070866
9.466667 2.654752 -1.424872 -2.008248 -0.283045 -0.615542 0.068809
9.500000 2.645287 -1.445378 -2.018610 -0.282306 -0.611697 0.067654
9.533333 2.635858 -1.465744 -2.022786 -0.281451 -0.607698 0.069222
9.566667 2.626469 -1.485963 -2.007297 -0.280487 -0.603554 0.073111
9.600000 2.617125 -1.506029 -1.995644 -0.279420 -0.599273 0.078754
9.633333 2.607809 -1.525960 -1.997331 -0.278255 -0.594860 0.084902
9.666667 2.598548 -1.545726 -2.005062 -0.276992 -0.590315 0.093439
9.700000 2.589323 -1.565346 -2.005093 -0.275629 -0.585636 0.100927
9.733333 2.580137 -1.584817 -2.008315 -0.274162 -0.580818 0.105474
9.766667 2.570995 -1.604134 -1.989370 -0.272582 -0.575851 0.107095
9.800000 2.561900 -1.623291 -1.985145 -0.270881 -0.570724 0.107599
9.833333 2.552857 -1.642283 -1.979468 -0.269050 -0.565428 0.105375
9.866667 2.543895 -1.661073 -1.969457 -0.267082 -0.559953 0.097045
9.900000 2.534993 -1.679689 -1.974784 -0.264975 -0.554298 0.085796
9.933333 2.526153 -1.698126 -1.972321 -0.262729 -0.548465 0.071437
9.966667 2.517379 -1.716380 -1.963510 -0.260346 -0.542455 0.056309
10.000000 2.508706 -1.734408 -1.958385 -0.257829 -0.536272 0.037544
10.033333 2.500137 -1.752201 -1.965740 -0.255185 -0.529925 0.018694
10.066667 2.491677 -1.769756 -1.964925 -0.252423 -0.523424 0.002903
10.100000 2.483298 -1.787110 -1.972646 -0.249550 -0.516780 -0.011739
10.133333 2.475001 -1.804259 -1.959333 -0.246572 -0.510001 -0.024319
10.166667 2.466792 -1.821199 -1.972878 -0.243494 -0.503093 -0.035938
10.200000 2.458709 -1.837877 -1.972485 -0.240320 -0.496062 -0.045955
10.233333 2.450718 -1.854338 -1.970242 -0.237047 -0.488905 -0.055364
10.266667 2.442860 -1.870527 -1.976190 -0.233668 -0.481613 -0.066037
10.300000 2.435102 -1.886492 -1.971812 -0.230172 -0.474174 -0.077865
10.333333 2.427483 -1.902178 -1.973719 -0.226553 -0.466580 -0.090417
10.366667 2.419969 -1.917632 -1.987401 -0.222806 -0.458827 -0.103780
10.400000 2.412564 -1.932848 -1.980956 -0.218928 -0.450909 -0.116725
10.433333 2.405270 -1.947825 -1.989119 -0.214923 -0.442835 -0.128947
10.466667 2.398128 -1.962508 -1.985721 -0.210794 -0.434607 -0.140589
10.500000 2.391140 -1.976895 -1.994675 -0.206547 -0.426235 -0.151017
10.533333 2.384310 -1.990981 -2.009741 -0.202187 -0.417728 -0.159668
10.566667 2.377641 -2.004764 -2.012865 -0.197726 -0.409101 -0.171427
10.600000 2.371096 -2.018291 -2.020379 -0.193173 -0.400365 -0.191492
10.633333 2.364718 -2.031507 -2.023163 -0.188529 -0.391527 -0.225741
10.666667 2.358508 -2.044410 -2.031316 -0.183803 -0.382597 -0.278447
10.700000 2.352471 -2.056999 -2.032426 -0.179003 -0.373588 -0.357299
10.733333 2.346568 -2.069319 -2.035123 -0.174137 -0.364510 -0.471771
10.766667 2.340800 -2.081368 -2.044028 -0.169199 -0.355357 -0.622219
10.800000 2.335212 -2.093094 -2.051102 -0.164191 -0.346131 -0.804701
10.833333 2.329806 -2.104495 -2.066332 -0.159116 -0.336837 -1.014005
10.866667 2.324586 -2.115568 -2.077233 -0.153980 -0.327480 -1.244827
10.900000 2.319508 -2.126360 -2.118404 -0.148781 -0.318056 -1.483433
10.933333 2.314622 -2.136819 -2.191128 -0.143512 -0.308561 -1.711607
10.966667 2.309929 -2.146943 -2.260570 -0.138181 -0.299002 -1.911426
11.000000 2.305432 -2.156727 -2.339382 -0.132796 -0.289391 -2.067471
11.033333 2.301084 -2.166224 -2.438122 -0.127366 -0.279735 -2.160433
11.066667 2.296887 -2.175430 -2.539963 -0.121888 -0.270032 -2.171228
11.100000 2.292891 -2.184294 -2.641786 -0.116373 -0.260295 -2.091241
11.133333 2.289098 -2.192814 -2.722843 -0.110839 -0.250541 -1.917571
11.166667 2.285507 -2.200989 -2.808104 -0.105302 -0.240786 -1.656379
11.200000 2.282071 -2.208870 -2.886192 -0.099772 -0.231038 -1.319361
11.233333 2.278839 -2.216407 -2.951563 -0.094259 -0.221307 -0.932700
11.266667 2.275812 -2.223599 -3.008118 -0.088792 -0.211620 -0.526270
11.300000 2.272990 -2.230447 -3.010294 -0.083385 -0.201990 -0.131409
11.333333 2.270325 -2.236996 -2.986826 -0.078046 -0.192424 0.219222
11.366667 2.267818 -2.243246 -2.927263 -0.072768 -0.182916 0.497297
11.400000 2.265517 -2.249151 -2.863815 -0.067556 -0.173470 0.677764
11.433333 2.263375 -2.254756 -2.813021 -0.062402 -0.164079 0.752687
11.466667 2.261391 -2.260060 -2.727796 -0.057287 -0.154724 0.718539
11.500000 2.259566 -2.265063 -2.659518 -0.052191 -0.145389 0.590064
11.533333 2.257899 -2.269764 -2.599429 -0.047102 -0.136060 0.388567
11.566667 2.256392 -2.274163 -2.592366 -0.042018 -0.126737 0.139500
11.600000 2.255043 -2.278260 -2.609620 -0.036927 -0.117408 -0.128098
11.633333 2.253899 -2.282017 -2.658438 -0.031828 -0.108072 -0.390420
11.666667 2.252913 -2.285472 -2.710511 -0.026729 -0.098735 -0.621684
11.700000 2.252129 -2.288588 -2.751021 -0.021639 -0.089407 -0.814687
11.733333 2.251504 -2.291403 -2.814156 -0.016567 -0.080095 -0.963617
11.766667 2.251037 -2.293917 -2.872007 -0.011517 -0.070802 -1.067824
11.800000 2.250769 -2.296095 -2.915798 -0.006495 -0.061535 -1.130238
11.833333 2.250657 -2.297974 -2.916496 -0.001501 -0.052292 -1.160997
11.866667 2.250703 -2.299552 -2.918114 0.003468 -0.043072 -1.175416
11.900000 2.250904 -2.300831 -2.959313 0.008418 -0.033866 -1.176189
11.933333 2.251261 -2.301811 -3.019428 0.013361 -0.024666 -1.170070
11.966667 2.251773 -2.302493 -3.072296 0.018301 -0.015466 -1.159939
12.000000 2.252438 -2.302877 -3.112311 0.023248 -0.006256 -1.150273
12.033333 2.253294 -2.302937 3.125478 0.028207 0.002969 -1.135111
12.066667 2.254303 -2.302702 3.084213 0.033183 0.012217 -1.107470
12.100000 2.255497 -2.302138 3.037723 0.038177 0.021486 -1.068551
12.133333 2.256875 -2.301248 2.999634 0.043177 0.030769 -1.018531
12.166667 2.258402 -2.300065 2.977811 0.048174 0.040055 -0.961825
12.200000 2.260077 -2.298592 2.945549 0.053155 0.049332 -0.897157
12.233333 2.261929 -2.296799 2.931245 0.058105 0.058586 -0.832505
12.266667 2.263955 -2.294687 2.895496 0.063008 0.067798 -0.772190
12.300000 2.266152 -2.292259 2.879078 0.067853 0.076957 -0.723818
12.333333 2.268518 -2.289518 2.839593 0.072634 0.086059 -0.690428
12.366667 2.271049 -2.286465 2.827537 0.077347 0.095098 -0.673588
12.400000 2.273743 -2.283104 2.796722 0.081986 0.104068 -0.677004
12.433333 2.276575 -2.279464 2.794485 0.086545 0.112965 -0.702117
12.466667 2.279545 -2.275546 2.781135 0.091024 0.121788 -0.752477
12.500000 2.282669 -2.271326 2.767881 0.095422 0.130532 -0.822918
12.533333 2.285927 -2.266833 2.746286 0.099734 0.139192 -0.914577
12.566667 2.289334 -2.262042 2.724043 0.103964 0.147769 -1.023814
12.600000 2.292887 -2.256957 2.688003 0.108113 0.156261 -1.146528
12.633333 2.296582 -2.251579 2.641896 0.112182 0.164667 -1.268670
12.666667 2.300417 -2.245912 2.591089 0.116168 0.172979 -1.374204
12.700000 2.304377 -2.239984 2.540879 0.120072 0.181193 -1.449937
12.733333 2.308469 -2.233771 2.486404 0.123890 0.189299 -1.476696
12.766667 2.312682 -2.227302 2.417664 0.127621 0.197290 -1.439998
12.800000 2.317014 -2.220579 2.350677 0.131262 0.205163 -1.329864
12.833333 2.321469 -2.213580 2.295774 0.134817 0.212917 -1.150547
12.866667 2.326038 -2.206334 2.213163 0.138288 0.220557 -0.908817
12.900000 2.330725 -2.198817 2.149723 0.141679 0.228086 -0.619413
12.933333 2.335521 -2.191058 2.104906 0.144992 0.235511 -0.300884
12.966667 2.340426 -2.183060 2.102327 0.148232 0.242836 0.025065
13.000000 2.345436 -2.174825 2.136955 0.151399 0.250061 0.335493
13.033333 2.350550 -2.166358 2.191456 0.154495 0.257188 0.614209
13.066667 2.355764 -2.157661 2.256361 0.157519 0.264214 0.839669
13.100000 2.361080 -2.148718 2.317153 0.160474 0.271139 1.004802
13.133333 2.366495 -2.139533 2.376036 0.163357 0.277960 1.102683
13.166667 2.372004 -2.130128 2.423664 0.166169 0.284675 1.135950
13.200000 2.377607 -2.120493 2.484301 0.168910 0.291281 1.114019
13.233333 2.383300 -2.110644 2.495067 0.171579 0.297771 1.051506
13.266667 2.389080 -2.100586 2.527444 0.174173 0.304140 0.968680
13.300000 2.394945 -2.090315 2.564675 0.176691 0.310386 0.876351
13.333333 2.400894 -2.079836 2.584506 0.179133 0.316506 0.788214
13.366667 2.406923 -2.069154 2.606273 0.181495 0.322499 0.709507
13.400000 2.413030 -2.058275 2.613690 0.183777 0.328368 0.644008
13.433333 2.419212 -2.047204 2.633346 0.185977 0.334113 0.587453
13.466667 2.425467 -2.035945 2.644130 0.188096 0.339736 0.535199
13.500000 2.431792 -2.024501 2.673499 0.190132 0.345240 0.485051
13.533333 2.438184 -2.012876 2.691670 0.192085 0.350625 0.432079
13.566667 2.444639 -2.001073 2.709832 0.193956 0.355892 0.377056
13.600000 2.451154 -1.989097 2.727200 0.195744 0.361043 0.321019
13.633333 2.457725 -1.976951 2.737688 0.197446 0.366076 0.267172
13.666667 2.464353 -1.964639 2.748465 0.199060 0.370995 0.220641
13.700000 2.471030 -1.952164 2.756745 0.200587 0.375798 0.187370
13.733333 2.477761 -1.939532 2.739368 0.202023 0.380485 0.171499
13.766667 2.484541 -1.926745 2.755399 0.203363 0.385057 0.167208
13.800000 2.491368 -1.913809 2.737913 0.204605 0.389513 0.167394
13.833333 2.498229 -1.900724 2.728614 0.205747 0.393851 0.161724
13.866667 2.505133 -1.887498 2.717591 0.206785 0.398071 0.138878
13.900000 2.512076 -1.874133 2.736336 0.207715 0.402170 0.083505
13.933333 2.519040 -1.860632 2.759032 0.208536 0.406149 -0.015960
13.966667 2.526018 -1.846999 2.793293 0.209254 0.410005 -0.161005
14.000000 2.533029 -1.833239 2.824075 0.209872 0.413737 -0.351230
14.033333 2.540070 -1.819358 2.853087 0.210392 0.417344 -0.582292
14.066667 2.547115 -1.805358 2.836044 0.210819 0.420826 -0.847205
14.100000 2.554160 -1.791243 2.796897 0.211161 0.424183 -1.130141
14.133333 2.561228 -1.777019 2.729619 0.211422 0.427414 -1.413331
14.166667 2.568289 -1.762690 2.647496 0.211600 0.430522 -1.678280
14.200000 2.575342 -1.748260 2.568928 0.211700 0.433508 -1.909985
14.233333 2.582411 -1.733734 2.483573 0.211730 0.436372 -2.090121
14.266667 2.589493 -1.719115 2.397359 0.211698 0.439115 -2.210833
14.300000 2.596588 -1.704408 2.302824 0.211605 0.441739 -2.272068
14.333333 2.603662 -1.689614 2.233501 0.211455 0.444246 -2.283246
14.366667 2.610715 -1.674738 2.145200 0.211252 0.446638 -2.256431
14.400000 2.617743 -1.659782 2.056889 0.210999 0.448917 -2.202363
14.433333 2.624774 -1.644755 1.978762 0.210690 0.451086 -2.138312
14.466667 2.631806 -1.629660 1.906551 0.210322 0.453149 -2.071641
14.500000 2.638810 -1.614493 1.843946 0.209894 0.455109 -2.008457
14.533333 2.645811 -1.599267 1.794998 0.209404 0.456968 -1.944658
14.566667 2.652807 -1.583986 1.767752 0.208848 0.458727 -1.883449
14.600000 2.659796 -1.568655 1.700802 0.208219 0.460388 -1.824967
14.633333 2.666752 -1.553263 1.633037 0.207512 0.461951 -1.765651
14.666667 2.673674 -1.537815 1.549719 0.206728 0.463413 -1.701414
14.700000 2.680561 -1.522314 1.484489 0.205867 0.464768 -1.630754
14.733333 2.687433 -1.506780 1.426639 0.204930 0.466013 -1.554558
14.766667 2.694266 -1.491201 1.374798 0.203923 0.467139 -1.466869
14.800000 2.701060 -1.475582 1.324040 0.202854 0.468138 -1.365960
14.833333 2.707811 -1.459927 1.280656 0.201729 0.469003 -1.254491
14.866667 2.714519 -1.444242 1.257876 0.200553 0.469726 -1.139939
14.900000 2.721183 -1.428532 1.218813 0.199328 0.470303 -1.022408
14.933333 2.727822 -1.412814 1.181498 0.198059 0.470727 -0.905014
14.966667 2.734413 -1.397081 1.150944 0.196749 0.470996 -0.790739
15.000000 2.740955 -1.381338 1.140314 0.195404 0.471106 -0.683662
15.033333 2.747467 -1.365600 1.104759 0.194026 0.471056 -0.580504
15.066667 2.753927 -1.349864 1.102621 0.192618 0.470844 -0.479747
15.100000 2.760332 -1.334137 1.075544 0.191185 0.470467 -0.383585
15.133333 2.766682 -1.318424 1.074321 0.189727 0.469924 -0.294333
15.166667 2.772974 -1.302732 1.047145 0.188243 0.469209 -0.211146
15.200000 2.779209 -1.287067 1.058583 0.186732 0.468319 -0.134639
15.233333 2.785407 -1.271433 1.058383 0.185195 0.467253 -0.067729
15.266667 2.791566 -1.255833 1.068948 0.183635 0.466011 -0.010596
15.300000 2.797687 -1.240271 1.063944 0.182050 0.464591 0.037139
15.333333 2.803745 -1.224764 1.073808 0.180437 0.462993 0.075735
15.366667 2.809740 -1.209318 1.072792 0.178798 0.461217 0.102235
15.400000 2.815672 -1.193942 1.084628 0.177133 0.459269 0.119829
15.433333 2.821561 -1.178620 1.079285 0.175440 0.457150 0.128605
15.466667 2.827385 -1.163380 1.090309 0.173717 0.454855 0.130258
15.500000 2.833144 -1.148228 1.099624 0.171968 0.452384 0.124223
15.533333 2.838838 -1.133172 1.095128 0.170195 0.449737 0.115416
15.566667 2.844485 -1.118186 1.112805 0.168400 0.446912 0.103389
15.600000 2.850085 -1.103273 1.114920 0.166577 0.443897 0.087947
15.633333 2.855618 -1.088475 1.119078 0.164728 0.440691 0.069688
15.666667 2.861084 -1.073799 1.108683 0.162854 0.437301 0.048966
15.700000 2.866483 -1.059250 1.119584 0.160956 0.433734 0.025721
15.733333 2.871831 -1.044789 1.117351 0.159030 0.429993 -0.002712
15.766667 2.877111 -1.030467 1.114274 0.157078 0.426089 -0.034506
15.800000 2.882321 -1.016291 1.114784 0.155109 0.422046 -0.069013
15.833333 2.887461 -1.002265 1.113890 0.153127 0.417880 -0.105833
15.866667 2.892530 -0.988395 1.115626 0.151132 0.413601 -0.144304
15.900000 2.897527 -0.974686 1.115269 0.149131 0.409225 -0.179830
15.933333 2.902450 -0.961144 1.102832 0.147132 0.404778 -0.211957
15.966667 2.907321 -0.947710 1.100844 0.145140 0.400279 -0.236831
16.000000 2.912139 -0.934388 1.082106 0.143156 0.395733 -0.253139
16.033333 2.916882 -0.921244 1.062691 0.141185 0.391149 -0.258232
16.066667 2.921550 -0.908282 1.061236 0.139228 0.386539 -0.252994
16.100000 2.926144 -0.895502 1.032072 0.137288 0.381906 -0.237885
16.133333 2.930684 -0.882844 1.025325 0.135362 0.377244 -0.212380
16.166667 2.935152 -0.870369 1.014677 0.133453 0.372559 -0.180102
16.200000 2.939566 -0.858020 1.018179 0.131562 0.367859 -0.145057
16.233333 2.943926 -0.845798 1.022566 0.129690 0.363144 -0.110659
16.266667 2.948216 -0.833761 1.010887 0.127837 0.358414 -0.076218
16.300000 2.952437 -0.821910 1.021020 0.126000 0.353663 -0.047836
16.333333 2.956603 -0.810191 1.018063 0.124181 0.348891 -0.026432
16.366667 2.960702 -0.798659 1.017078 0.122375 0.344086 -0.012644
16.400000 2.964748 -0.787263 1.016889 0.120582 0.339242 -0.002868
16.433333 2.968741 -0.776005 1.022016 0.118800 0.334360 0.002854
16.466667 2.972669 -0.764933 1.022302 0.117031 0.329442 0.002949
16.500000 2.976544 -0.754002 1.018508 0.115276 0.324490 0.002181
16.533333 2.980355 -0.743257 1.012754 0.113536 0.319508 0.001749
16.566667 2.984103 -0.732698 1.022778 0.111813 0.314503 0.002146
16.600000 2.987800 -0.722284 1.020169 0.110108 0.309479 0.001345
16.633333 2.991435 -0.712055 1.020891 0.108423 0.304441 0.000917
16.666667 2.995011 -0.702012 1.020243 0.106760 0.299395 0.001803
16.700000 2.998536 -0.692116 1.013154 0.105122 0.294353 0.003675
16.733333 3.002003 -0.682405 1.021948 0.103511 0.289322 0.003506
16.766667 3.005422 -0.672843 1.019404 0.101928 0.284308 0.002963
16.800000 3.008792 -0.663432 1.017680 0.100374 0.279315 0.002720
16.833333 3.012106 -0.654204 1.017960 0.098850 0.274341 0.003086
16.866667 3.015367 -0.645159 1.024174 0.097355 0.269385 0.003204
16.900000 3.018581 -0.636265 1.021030 0.095888 0.264443 0.001047
16.933333 3.021743 -0.627553 1.021351 0.094447 0.259506 0.000531
16.966667 3.024860 -0.618994 1.019934 0.093033 0.254573 0.000238
17.000000 3.027932 -0.610589 1.017477 0.091645 0.249642 0.000695
17.033333 3.030960 -0.602337 1.024010 0.090282 0.244714 -0.000389
17.066667 3.033945 -0.594240 1.018134 0.088945 0.239785 -0.000918
17.100000 3.036884 -0.586321 1.015331 0.087634 0.234856 0.000942
17.133333 3.039777 -0.578578 1.018589 0.086349 0.229927 0.003020
17.166667 3.042626 -0.571010 1.025972 0.085090 0.225005 0.004346
17.200000 3.045434 -0.563598 1.020273 0.083857 0.220090 0.004149
17.233333 3.048203 -0.556340 1.016002 0.082652 0.215186 0.004903
17.266667 3.050931 -0.549256 1.021992 0.081476 0.210303 0.005086
17.300000 3.053620 -0.542342 1.016218 0.080329 0.205446 0.003494
17.333333 3.056271 -0.535584 1.027109 0.079212 0.200620 -0.000079
17.366667 3.058887 -0.528980 1.022497 0.078126 0.195825 -0.002176
17.400000 3.061466 -0.522544 1.019768 0.077069 0.191062 -0.003216
17.433333 3.064011 -0.516262 1.023080 0.076042 0.186333 -0.005022
17.466667 3.066522 -0.510134 1.026300 0.075043 0.181636 -0.006972
17.500000 3.069001 -0.504159 1.013591 0.074074 0.176967 -0.007866
17.533333 3.071448 -0.498348 1.020351 0.073133 0.172325 -0.006642
17.566667 3.073864 -0.492689 1.016367 0.072221 0.167712 -0.006140
17.600000 3.076250 -0.487182 1.022314 0.071338 0.163124 -0.006219
17.633333 3.078607 -0.481826 1.015447 0.070485 0.158559 -0.004290
17.666667 3.080936 -0.476621 1.018113 0.069662 0.154016 -0.001801
17.700000 3.083237 -0.471566 1.019168 0.068869 0.149496 -0.000609
17.733333 3.085512 -0.466661 1.022969 0.068107 0.144998 -0.000336
17.766667 3.087761 -0.461905 1.016137 0.067378 0.140522 0.001018
17.800000 3.089989 -0.457302 1.023581 0.066680 0.136067 0.002540
17.833333 3.092193 -0.452847 1.016976 0.066013 0.131636 0.002176
