t x y theta dxdt dydt dthetadt
0.000000 0.000000 0.000000 3.043020 -0.152415 -0.010831 1.479428
0.033333 -0.005100 -0.000330 3.104566 -0.156044 -0.007914 1.273062
0.066667 -0.010351 -0.000606 3.124084 -0.159631 -0.004648 1.060676
0.100000 -0.015754 -0.000824 -3.119738 -0.163173 -0.001021 0.848902
0.133333 -0.021308 -0.000983 -3.094936 -0.166671 0.002952 0.638292
0.166667 -0.027014 -0.001078 -3.087949 -0.170145 0.007225 0.430646
0.200000 -0.032787 -0.000910 -3.069749 -0.173609 0.011745 0.225768
0.233333 -0.038630 -0.000477 -3.069093 -0.177078 0.016453 0.026672
0.266667 -0.044547 0.000222 -3.067800 -0.180577 0.021261 -0.167525
0.300000 -0.050540 0.001188 -3.074494 -0.184133 0.026079 -0.354682
0.333333 -0.056688 0.002227 -3.092455 -0.187776 0.030824 -0.533051
0.366667 -0.062993 0.003339 -3.109624 -0.191531 0.035428 -0.702932
0.400000 -0.069383 0.004722 3.136926 -0.195420 0.039832 -0.856901
0.433333 -0.075932 0.006181 3.092857 -0.199457 0.044003 -0.993357
0.466667 -0.082623 0.007751 3.051335 -0.203640 0.047947 -1.105827
0.500000 -0.089459 0.009432 3.019365 -0.207955 0.051698 -1.191444
0.533333 -0.096443 0.011228 2.964809 -0.212391 0.055291 -1.250087
0.566667 -0.103577 0.013140 2.924927 -0.216935 0.058762 -1.282589
0.600000 -0.110865 0.015169 2.865507 -0.221570 0.062158 -1.296657
0.633333 -0.118308 0.017318 2.803363 -0.226289 0.065512 -1.298789
0.666667 -0.125916 0.019548 2.752147 -0.231085 0.068852 -1.300049
0.700000 -0.133684 0.021903 2.712740 -0.235958 0.072189 -1.309782
0.733333 -0.141615 0.024384 2.682909 -0.240905 0.075535 -1.337003
0.766667 -0.149712 0.026946 2.655691 -0.245920 0.078907 -1.388132
0.800000 -0.157977 0.029590 2.626577 -0.251004 0.082311 -1.465547
0.833333 -0.166412 0.032361 2.601517 -0.256156 0.085752 -1.572862
0.866667 -0.175022 0.035260 2.548248 -0.261377 0.089231 -1.704338
0.900000 -0.183809 0.038288 2.492847 -0.266668 0.092743 -1.852545
0.933333 -0.192774 0.041446 2.427316 -0.272026 0.096280 -2.005801
0.966667 -0.201921 0.044734 2.361422 -0.277449 0.099824 -2.151960
1.000000 -0.211238 0.048102 2.262962 -0.282937 0.103355 -2.283043
1.033333 -0.220741 0.051602 2.180702 -0.288486 0.106845 -2.388804
1.066667 -0.230431 0.055233 2.078518 -0.294091 0.110271 -2.465408
1.100000 -0.240312 0.058990 1.965465 -0.299754 0.113611 -2.510634
1.133333 -0.250390 0.062869 1.888768 -0.305481 0.116855 -2.528825
1.166667 -0.260667 0.066867 1.796003 -0.311278 0.119998 -2.522019
1.200000 -0.271148 0.070977 1.704705 -0.317148 0.123030 -2.491661
1.233333 -0.281802 0.075160 1.645848 -0.323103 0.125955 -2.441675
1.266667 -0.292629 0.079412 1.574510 -0.329157 0.128783 -2.377076
1.300000 -0.303672 0.083764 1.498222 -0.335313 0.131521 -2.308082
1.333333 -0.314935 0.088213 1.406433 -0.341570 0.134175 -2.232308
1.366667 -0.326372 0.092726 1.315486 -0.347927 0.136756 -2.154077
1.400000 -0.338035 0.097329 1.230504 -0.354384 0.139280 -2.075268
1.433333 -0.349928 0.102020 1.180044 -0.360925 0.141752 -1.995931
1.466667 -0.362053 0.106796 1.111954 -0.367520 0.144168 -1.915120
1.500000 -0.374411 0.111656 1.059806 -0.374145 0.146524 -1.828578
1.533333 -0.387004 0.116598 1.012074 -0.380767 0.148813 -1.743651
1.566667 -0.399834 0.121620 0.956462 -0.387349 0.151023 -1.660910
1.600000 -0.412900 0.126720 0.897382 -0.393847 0.153134 -1.580931
1.633333 -0.426135 0.131869 0.827118 -0.400237 0.155140 -1.498476
1.666667 -0.439607 0.137095 0.786964 -0.406505 0.157036 -1.409644
1.700000 -0.453315 0.142398 0.735785 -0.412645 0.158822 -1.306620
1.733333 -0.467258 0.147776 0.708706 -0.418657 0.160498 -1.181023
1.766667 -0.481366 0.153192 0.672820 -0.424547 0.162067 -1.027289
1.800000 -0.495638 0.158642 0.623410 -0.430335 0.163538 -0.842316
1.833333 -0.510071 0.164124 0.571788 -0.436028 0.164914 -0.631125
1.866667 -0.524665 0.169635 0.530560 -0.441644 0.166201 -0.397200
1.900000 -0.539491 0.175214 0.507032 -0.447193 0.167406 -0.150986
1.933333 -0.554474 0.180816 0.513279 -0.452692 0.168537 0.099079
1.966667 -0.569685 0.186482 0.531767 -0.458157 0.169604 0.338965
2.000000 -0.585050 0.192164 0.563528 -0.463590 0.170613 0.551756
2.033333 -0.600636 0.197905 0.601151 -0.468995 0.171569 0.721238
2.066667 -0.616372 0.203656 0.636019 -0.474363 0.172474 0.833775
2.100000 -0.632258 0.209413 0.691321 -0.479691 0.173331 0.878102
2.133333 -0.648353 0.215219 0.751857 -0.484964 0.174140 0.844579
2.166667 -0.664594 0.221025 0.802930 -0.490174 0.174898 0.732069
2.200000 -0.681034 0.226875 0.845036 -0.495303 0.175591 0.546493
2.233333 -0.697669 0.232767 0.873254 -0.500342 0.176211 0.297465
2.266667 -0.714442 0.238648 0.895632 -0.505279 0.176740 -0.008886
2.300000 -0.731398 0.244569 0.896049 -0.510093 0.177149 -0.356383
2.333333 -0.748530 0.250528 0.879393 -0.514770 0.177416 -0.728617
2.366667 -0.765793 0.256466 0.839069 -0.519295 0.177527 -1.109009
2.400000 -0.783223 0.262440 0.805064 -0.523667 0.177484 -1.481542
2.433333 -0.800813 0.268449 0.739883 -0.527881 0.177287 -1.827935
2.466667 -0.818526 0.274424 0.655049 -0.531941 0.176941 -2.126277
2.500000 -0.836360 0.280360 0.565146 -0.535857 0.176472 -2.364916
2.533333 -0.854312 0.286254 0.471526 -0.539643 0.175898 -2.528984
2.566667 -0.872379 0.292100 0.356528 -0.543308 0.175221 -2.606559
2.600000 -0.890558 0.297896 0.231376 -0.546859 0.174439 -2.587723
2.633333 -0.908847 0.303637 0.133192 -0.550305 0.173555 -2.469409
2.666667 -0.927261 0.309401 0.006579 -0.553658 0.172567 -2.247916
2.700000 -0.945797 0.315185 -0.098681 -0.556921 0.171451 -1.919371
2.733333 -0.964448 0.320981 -0.163507 -0.560098 0.170174 -1.489830
2.766667 -0.983197 0.326705 -0.217798 -0.563193 0.168715 -0.967487
2.800000 -1.002041 0.332352 -0.265901 -0.566209 0.167051 -0.363826
2.833333 -1.020993 0.337982 -0.292696 -0.569146 0.165150 0.302141
2.866667 -1.040034 0.343526 -0.282440 -0.572003 0.162985 1.009341
2.900000 -1.059160 0.348979 -0.243276 -0.574779 0.160552 1.734045
2.933333 -1.078369 0.354337 -0.175326 -0.577474 0.157855 2.458888
2.966667 -1.097657 0.359594 -0.071703 -0.580086 0.154892 3.157272
3.000000 -1.117047 0.364760 0.067083 -0.582614 0.151657 3.801815
3.033333 -1.136537 0.369814 0.233117 -0.585056 0.148146 4.377117
3.066667 -1.156124 0.374741 0.413327 -0.587404 0.144361 4.857886
3.100000 -1.175778 0.379548 0.633960 -0.589650 0.140291 5.220441
3.133333 -1.195495 0.384233 0.865091 -0.591785 0.135931 5.435698
3.166667 -1.215271 0.388791 1.002862 -0.593796 0.131286 5.501014
3.200000 -1.235130 0.393160 1.254308 -0.595674 0.126374 5.409381
3.233333 -1.255041 0.397393 1.488217 -0.597407 0.121218 5.160477
3.266667 -1.275019 0.401415 1.733972 -0.598986 0.115832 4.763664
3.300000 -1.295051 0.405222 1.914124 -0.600405 0.110249 4.241365
3.333333 -1.315131 0.408805 2.089667 -0.601659 0.104501 3.626745
3.366667 -1.335249 0.412163 2.198235 -0.602740 0.098618 2.933860
3.400000 -1.355402 0.415363 2.291916 -0.603641 0.092615 2.197745
3.433333 -1.375576 0.418334 2.346597 -0.604363 0.086518 1.447586
3.466667 -1.395779 0.421140 2.339265 -0.604910 0.080355 0.716571
3.500000 -1.416008 0.423777 2.323470 -0.605287 0.074133 0.023864
3.533333 -1.436233 0.426179 2.285087 -0.605500 0.067848 -0.615040
3.566667 -1.456447 0.428344 2.235652 -0.605558 0.061492 -1.181067
3.600000 -1.476642 0.430270 2.179493 -0.605478 0.055073 -1.664830
3.633333 -1.496849 0.432013 2.102072 -0.605270 0.048582 -2.058042
3.666667 -1.517064 0.433570 2.020865 -0.604944 0.042012 -2.356970
3.700000 -1.537243 0.434874 1.914438 -0.604508 0.035365 -2.549581
3.733333 -1.557380 0.435920 1.812143 -0.603976 0.028652 -2.627822
3.766667 -1.577516 0.436770 1.707808 -0.603361 0.021884 -2.583292
3.800000 -1.597648 0.437422 1.581444 -0.602662 0.015052 -2.413642
3.833333 -1.617773 0.437872 1.446436 -0.601877 0.008142 -2.118852
3.866667 -1.637839 0.438043 1.318941 -0.601006 0.001148 -1.703324
3.900000 -1.657844 0.437931 1.221983 -0.600046 -0.005940 -1.183329
3.933333 -1.677832 0.437609 1.176320 -0.598991 -0.013137 -0.580033
3.966667 -1.697800 0.437074 1.163687 -0.597826 -0.020467 0.079234
4.000000 -1.717745 0.436324 1.191097 -0.596545 -0.027939 0.764357
4.033333 -1.737665 0.435357 1.248243 -0.595146 -0.035555 1.435520
4.066667 -1.757508 0.434080 1.321082 -0.593619 -0.043324 2.056837
4.100000 -1.777320 0.432581 1.437507 -0.591946 -0.051273 2.597963
4.133333 -1.797049 0.430765 1.556327 -0.590119 -0.059405 3.036830
4.166667 -1.816694 0.428629 1.710122 -0.588142 -0.067707 3.353168
4.200000 -1.836299 0.426264 1.866088 -0.586020 -0.076158 3.533212
4.233333 -1.855861 0.423670 2.020229 -0.583764 -0.084734 3.578589
4.266667 -1.875328 0.420754 2.159965 -0.581388 -0.093402 3.492475
4.300000 -1.894699 0.417517 2.308398 -0.578923 -0.102104 3.281143
4.333333 -1.913970 0.413963 2.454302 -0.576392 -0.110796 2.952005
4.366667 -1.933140 0.410096 2.546496 -0.573815 -0.119445 2.523294
4.400000 -1.952209 0.405914 2.646988 -0.571211 -0.128016 2.015062
4.433333 -1.971174 0.401426 2.737903 -0.568597 -0.136483 1.445052
4.466667 -1.990078 0.396698 2.787566 -0.565984 -0.144827 0.832866
4.500000 -2.008878 0.391670 2.799507 -0.563373 -0.153048 0.203346
4.533333 -2.027612 0.386402 2.782083 -0.560764 -0.161154 -0.415649
4.566667 -2.046278 0.380892 2.737034 -0.558143 -0.169165 -1.002367
4.600000 -2.064835 0.375100 2.686750 -0.555501 -0.177105 -1.535643
4.633333 -2.083321 0.369065 2.608313 -0.552822 -0.185007 -1.992415
4.666667 -2.101731 0.362788 2.519476 -0.550097 -0.192895 -2.354800
4.700000 -2.120065 0.356268 2.385667 -0.547315 -0.200790 -2.610496
4.733333 -2.138289 0.349470 2.261529 -0.544473 -0.208702 -2.756044
4.766667 -2.156403 0.342392 2.131919 -0.541578 -0.216629 -2.790310
4.800000 -2.174407 0.335032 2.009112 -0.538630 -0.224570 -2.713056
4.833333 -2.192303 0.327388 1.890948 -0.535634 -0.232512 -2.532769
4.866667 -2.210112 0.319503 1.807486 -0.532598 -0.240441 -2.260323
4.900000 -2.227813 0.311334 1.713319 -0.529528 -0.248339 -1.908706
4.933333 -2.245424 0.302924 1.641127 -0.526425 -0.256195 -1.491379
4.966667 -2.262925 0.294238 1.597611 -0.523287 -0.263999 -1.022509
5.000000 -2.280318 0.285276 1.568409 -0.520116 -0.271740 -0.520513
5.033333 -2.297615 0.276074 1.548911 -0.516910 -0.279412 -0.002580
5.066667 -2.314815 0.266633 1.568939 -0.513665 -0.287013 0.515314
5.100000 -2.331900 0.256929 1.580696 -0.510379 -0.294543 1.014491
5.133333 -2.348868 0.246966 1.641576 -0.507057 -0.301994 1.473953
5.166667 -2.365718 0.236750 1.711909 -0.503700 -0.309361 1.874002
5.200000 -2.382462 0.226298 1.789715 -0.500308 -0.316642 2.193779
5.233333 -2.399085 0.215600 1.898425 -0.496881 -0.323830 2.412449
5.266667 -2.415582 0.204658 2.019067 -0.493424 -0.330917 2.514067
5.300000 -2.431971 0.193485 2.137382 -0.489935 -0.337896 2.486662
5.333333 -2.448250 0.182082 2.276486 -0.486413 -0.344763 2.326675
5.366667 -2.464416 0.170451 2.392771 -0.482855 -0.351519 2.036109
5.400000 -2.480469 0.158592 2.483989 -0.479264 -0.358161 1.627557
5.433333 -2.496407 0.146507 2.563073 -0.475638 -0.364692 1.123470
5.466667 -2.512216 0.134212 2.613457 -0.471975 -0.371119 0.553574
5.500000 -2.527894 0.121713 2.629723 -0.468278 -0.377449 -0.049433
5.533333 -2.543444 0.109011 2.610135 -0.464550 -0.383695 -0.649769
5.566667 -2.558865 0.096110 2.551911 -0.460795 -0.389867 -1.210605
5.600000 -2.574165 0.082992 2.462303 -0.457017 -0.395980 -1.701438
5.633333 -2.589337 0.069679 2.368761 -0.453223 -0.402049 -2.096981
5.666667 -2.604382 0.056172 2.251321 -0.449420 -0.408088 -2.382105
5.700000 -2.619299 0.042470 2.121687 -0.445612 -0.414110 -2.545711
5.733333 -2.634090 0.028574 2.000913 -0.441804 -0.420123 -2.584408
5.766667 -2.648756 0.014480 1.879776 -0.437998 -0.426135 -2.505876
5.800000 -2.663293 0.000180 1.795161 -0.434200 -0.432153 -2.321368
5.833333 -2.677699 -0.014324 1.712772 -0.430410 -0.438177 -2.045393
5.866667 -2.691985 -0.029032 1.619978 -0.426627 -0.444204 -1.695344
5.900000 -2.706138 -0.043940 1.565934 -0.422851 -0.450232 -1.291240
5.933333 -2.720157 -0.059045 1.515764 -0.419079 -0.456254 -0.852914
5.966667 -2.734057 -0.074356 1.492156 -0.415307 -0.462260 -0.397883
6.000000 -2.747837 -0.089870 1.496514 -0.411526 -0.468239 0.057957
6.033333 -2.761496 -0.105587 1.514628 -0.407728 -0.474179 0.496952
6.066667 -2.775034 -0.121505 1.544676 -0.403905 -0.480071 0.902068
6.100000 -2.788449 -0.137624 1.585662 -0.400047 -0.485900 1.260523
6.133333 -2.801740 -0.153942 1.656856 -0.396144 -0.491653 1.559380
6.166667 -2.814889 -0.170439 1.740461 -0.392186 -0.497321 1.788173
6.200000 -2.827909 -0.187132 1.817557 -0.388170 -0.502895 1.940438
6.233333 -2.840799 -0.204016 1.917428 -0.384091 -0.508366 2.011320
6.266667 -2.853557 -0.221090 2.004102 -0.379945 -0.513727 2.001727
6.300000 -2.866167 -0.238332 2.090377 -0.375735 -0.518973 1.911597
6.333333 -2.878630 -0.255740 2.176148 -0.371463 -0.524103 1.745336
6.366667 -2.890956 -0.273325 2.244473 -0.367132 -0.529115 1.512219
6.400000 -2.903131 -0.291071 2.288090 -0.362746 -0.534009 1.220204
6.433333 -2.915155 -0.308972 2.335778 -0.358313 -0.538789 0.882772
6.466667 -2.927040 -0.327042 2.374588 -0.353843 -0.543463 0.512442
6.500000 -2.938772 -0.345263 2.390257 -0.349343 -0.548034 0.124010
6.533333 -2.950349 -0.363630 2.396795 -0.344820 -0.552508 -0.266850
6.566667 -2.961770 -0.382141 2.372819 -0.340283 -0.556891 -0.646938
6.600000 -2.973035 -0.400793 2.327663 -0.335737 -0.561188 -1.003685
6.633333 -2.984141 -0.419581 2.272670 -0.331187 -0.565402 -1.324733
6.666667 -2.995089 -0.438504 2.209696 -0.326640 -0.569538 -1.597885
6.700000 -3.005897 -0.457572 2.143573 -0.322099 -0.573597 -1.812405
6.733333 -3.016568 -0.476785 2.060155 -0.317567 -0.577582 -1.961166
6.766667 -3.027076 -0.496122 1.971723 -0.313046 -0.581495 -2.039493
6.800000 -3.037447 -0.515597 1.883500 -0.308533 -0.585333 -2.042107
6.833333 -3.047653 -0.535188 1.787523 -0.304022 -0.589091 -1.969814
6.866667 -3.057694 -0.554891 1.717011 -0.299503 -0.592761 -1.826799
6.900000 -3.067596 -0.574723 1.650493 -0.294970 -0.596339 -1.621458
6.933333 -3.077357 -0.594683 1.572648 -0.290412 -0.599816 -1.361580
6.966667 -3.086976 -0.614765 1.517543 -0.285817 -0.603181 -1.058378
7.000000 -3.096451 -0.634965 1.478731 -0.281175 -0.606426 -0.728005
7.033333 -3.105755 -0.655256 1.459380 -0.276478 -0.609542 -0.383403
7.066667 -3.114912 -0.675660 1.456150 -0.271715 -0.612523 -0.038546
7.100000 -3.123918 -0.696170 1.473184 -0.266878 -0.615360 0.294578
7.133333 -3.132750 -0.716760 1.509949 -0.261961 -0.618048 0.597181
7.166667 -3.141425 -0.737448 1.540223 -0.256963 -0.620589 0.856330
7.200000 -3.149923 -0.758207 1.594824 -0.251885 -0.622988 1.062543
7.233333 -3.158255 -0.779056 1.632760 -0.246729 -0.625248 1.206295
7.266667 -3.166409 -0.799966 1.698865 -0.241498 -0.627372 1.283213
7.300000 -3.174384 -0.820933 1.762674 -0.236200 -0.629368 1.293710
7.333333 -3.182177 -0.841953 1.812703 -0.230839 -0.631246 1.249436
7.366667 -3.189793 -0.863049 1.890653 -0.225420 -0.633015 1.163315
7.400000 -3.197229 -0.884216 1.945802 -0.219946 -0.634673 1.053652
7.433333 -3.204481 -0.905423 1.981114 -0.214421 -0.636224 0.939158
7.466667 -3.211548 -0.926664 2.000124 -0.208852 -0.637668 0.841239
7.500000 -3.218427 -0.947965 2.007590 -0.203239 -0.639004 0.781935
7.533333 -3.225116 -0.969324 2.001090 -0.197588 -0.640224 0.775688
7.566667 -3.231617 -0.990703 1.993055 -0.191901 -0.641319 0.829780
7.600000 -3.237924 -1.012134 1.998359 -0.186183 -0.642291 0.946086
7.633333 -3.244041 -1.033575 1.999222 -0.180437 -0.643141 1.124936
7.666667 -3.249964 -1.055065 2.009580 -0.174667 -0.643873 1.352292
7.700000 -3.255692 -1.076600 2.078078 -0.168878 -0.644488 1.599286
7.733333 -3.261227 -1.098130 2.141878 -0.163074 -0.644985 1.841226
7.766667 -3.266569 -1.119649 2.212452 -0.157258 -0.645367 2.053734
7.800000 -3.271716 -1.141154 2.308355 -0.151431 -0.645631 2.208993
7.833333 -3.276668 -1.162693 2.436142 -0.145594 -0.645756 2.273601
7.866667 -3.281425 -1.184260 2.541343 -0.139748 -0.645734 2.228997
7.900000 -3.285984 -1.205796 2.624619 -0.133895 -0.645554 2.076263
7.933333 -3.290350 -1.227353 2.730807 -0.128032 -0.645201 1.811687
7.966667 -3.294524 -1.248930 2.852138 -0.122160 -0.644656 1.436209
8.000000 -3.298499 -1.270459 2.908605 -0.116280 -0.643909 0.965750
8.033333 -3.302287 -1.292000 2.934301 -0.110398 -0.642961 0.429250
8.066667 -3.305874 -1.313482 2.964866 -0.104518 -0.641816 -0.148857
8.100000 -3.309259 -1.334901 2.934957 -0.098646 -0.640483 -0.744691
8.133333 -3.312443 -1.356250 2.890190 -0.092796 -0.638986 -1.328187
8.166667 -3.315424 -1.377524 2.822823 -0.086980 -0.637366 -1.860229
8.200000 -3.318229 -1.398789 2.720629 -0.081208 -0.635648 -2.315888
8.233333 -3.320830 -1.419966 2.610944 -0.075486 -0.633854 -2.676716
8.266667 -3.323227 -1.441052 2.494431 -0.069817 -0.631999 -2.921859
8.300000 -3.325419 -1.462040 2.334756 -0.064199 -0.630092 -3.044229
8.333333 -3.327440 -1.482995 2.200050 -0.058623 -0.628118 -3.040382
8.366667 -3.329288 -1.503909 2.062268 -0.053070 -0.626048 -2.919755
8.400000 -3.330965 -1.524776 1.925122 -0.047522 -0.623856 -2.689573
8.433333 -3.332468 -1.545586 1.838653 -0.041961 -0.621512 -2.363786
8.466667 -3.333796 -1.566333 1.742512 -0.036364 -0.618979 -1.959275
8.500000 -3.334946 -1.587006 1.683006 -0.030707 -0.616213 -1.493724
8.533333 -3.335914 -1.607596 1.638268 -0.024971 -0.613183 -0.984233
8.566667 -3.336672 -1.628041 1.618181 -0.019144 -0.609870 -0.448724
8.600000 -3.337238 -1.648382 1.623865 -0.013216 -0.606258 0.092383
8.633333 -3.337608 -1.668608 1.629111 -0.007183 -0.602336 0.626361
8.666667 -3.337766 -1.688670 1.655666 -0.001046 -0.598108 1.135152
8.700000 -3.337717 -1.708601 1.701380 0.005190 -0.593593 1.605705
8.733333 -3.337458 -1.728394 1.783612 0.011513 -0.588801 2.021517
8.766667 -3.336985 -1.748004 1.872431 0.017916 -0.583744 2.369483
8.800000 -3.336298 -1.767426 1.985798 0.024389 -0.578434 2.635304
8.833333 -3.335396 -1.786653 2.100518 0.030918 -0.572885 2.804788
8.866667 -3.334264 -1.805707 2.224437 0.037497 -0.567102 2.868036
8.900000 -3.332917 -1.824553 2.348451 0.044119 -0.561091 2.818437
8.933333 -3.331332 -1.843211 2.490382 0.050777 -0.554859 2.654530
8.966667 -3.329531 -1.861650 2.603875 0.057469 -0.548411 2.380426
9.000000 -3.327514 -1.879865 2.710567 0.064197 -0.541749 2.012005
9.033333 -3.325253 -1.897866 2.783191 0.070958 -0.534874 1.566898
9.066667 -3.322775 -1.915630 2.843438 0.077755 -0.527786 1.069457
9.100000 -3.320080 -1.933153 2.879717 0.084590 -0.520481 0.546458
9.133333 -3.317169 -1.950427 2.874588 0.091471 -0.512953 0.029452
9.166667 -3.314040 -1.967447 2.860232 0.098409 -0.505196 -0.454631
9.200000 -3.310660 -1.984207 2.816124 0.105413 -0.497198 -0.882706
9.233333 -3.307028 -2.000697 2.740393 0.112502 -0.488946 -1.231326
9.266667 -3.303178 -2.016916 2.652166 0.119686 -0.480429 -1.478120
9.300000 -3.299069 -2.032842 2.565813 0.126973 -0.471638 -1.604391
9.333333 -3.294744 -2.048486 2.489828 0.134365 -0.462562 -1.597020
9.366667 -3.290203 -2.063843 2.407620 0.141857 -0.453199 -1.442538
9.400000 -3.285395 -2.078876 2.343895 0.149444 -0.443550 -1.133843
9.433333 -3.280319 -2.093576 2.275105 0.157105 -0.433630 -0.671420
9.466667 -3.274972 -2.107931 2.210248 0.164831 -0.423435 -0.068683
9.500000 -3.269350 -2.121928 2.171894 0.172605 -0.412969 0.655085
9.533333 -3.263451 -2.135556 2.157948 0.180409 -0.402235 1.474680
9.566667 -3.257271 -2.148804 2.183004 0.188230 -0.391218 2.356708
9.600000 -3.250880 -2.161730 2.283308 0.196054 -0.379903 3.256694
9.633333 -3.244204 -2.174256 2.410919 0.203873 -0.368276 4.133158
9.666667 -3.237242 -2.186375 2.603069 0.211669 -0.356342 4.947013
9.700000 -3.230073 -2.198161 2.834337 0.219434 -0.344095 5.661373
9.733333 -3.222621 -2.209531 3.098845 0.227155 -0.331557 6.237520
9.766667 -3.214963 -2.220559 -2.902559 0.234817 -0.318766 6.641719
9.800000 -3.206979 -2.231002 -2.627344 0.242400 -0.305760 6.861845
9.833333 -3.198793 -2.241097 -2.364097 0.249898 -0.292558 6.881578
9.866667 -3.190296 -2.250611 -2.084490 0.257302 -0.279192 6.690626
9.900000 -3.181495 -2.259550 -1.809204 0.264591 -0.265713 6.287819
9.933333 -3.172498 -2.268133 -1.616323 0.271761 -0.252137 5.688241
9.966667 -3.163308 -2.276355 -1.386084 0.278804 -0.238492 4.908971
10.000000 -3.153842 -2.284024 -1.171376 0.285717 -0.224795 3.963797
10.033333 -3.144187 -2.291329 -0.993512 0.292485 -0.211083 2.880272
10.066667 -3.134344 -2.298268 -0.874646 0.299109 -0.197353 1.696307
10.100000 -3.124256 -2.304682 -0.810700 0.305601 -0.183580 0.448624
10.133333 -3.113931 -2.310580 -0.824056 0.311960 -0.169765 -0.828228
10.166667 -3.103380 -2.315970 -0.901969 0.318185 -0.155908 -2.086672
10.200000 -3.092611 -2.320856 -1.040825 0.324274 -0.142017 -3.268684
10.233333 -3.081667 -2.325370 -1.187984 0.330224 -0.128108 -4.331417
10.266667 -3.070518 -2.329383 -1.398933 0.336015 -0.114239 -5.237621
10.300000 -3.059200 -2.333024 -1.649641 0.341627 -0.100455 -5.954129
10.333333 -3.047689 -2.336160 -1.939217 0.347046 -0.086802 -6.456164
10.366667 -3.035990 -2.338787 -2.215639 0.352260 -0.073312 -6.735390
10.400000 -3.024107 -2.340898 -2.501337 0.357264 -0.060011 -6.808147
10.433333 -3.012066 -2.342636 -2.788223 0.362053 -0.046910 -6.678511
10.466667 -2.999846 -2.343843 -3.048981 0.366630 -0.034005 -6.365755
10.500000 -2.987475 -2.344679 2.983120 0.370995 -0.021306 -5.894263
10.533333 -2.974982 -2.345135 2.820581 0.375152 -0.008806 -5.301025
10.566667 -2.962368 -2.345204 2.620171 0.379106 0.003511 -4.617882
10.600000 -2.949636 -2.344876 2.465562 0.382866 0.015665 -3.871143
10.633333 -2.936788 -2.344143 2.333619 0.386440 0.027670 -3.097108
10.666667 -2.923827 -2.343001 2.250400 0.389842 0.039544 -2.323573
10.700000 -2.910733 -2.341494 2.208624 0.393092 0.051306 -1.577195
10.733333 -2.897536 -2.339580 2.183761 0.396211 0.062960 -0.867564
10.766667 -2.884241 -2.337260 2.195753 0.399213 0.074497 -0.208999
10.800000 -2.870856 -2.334542 2.220948 0.402118 0.085901 0.391675
10.833333 -2.857388 -2.331435 2.265621 0.404945 0.097158 0.932163
10.866667 -2.843842 -2.327946 2.319313 0.407708 0.108249 1.415342
10.900000 -2.830181 -2.324106 2.379296 0.410415 0.119167 1.848856
10.933333 -2.816456 -2.319906 2.454310 0.413073 0.129919 2.240602
10.966667 -2.802674 -2.315357 2.537785 0.415691 0.140521 2.600819
11.000000 -2.788786 -2.310465 2.636585 0.418269 0.150997 2.935048
11.033333 -2.774795 -2.305233 2.747655 0.420805 0.161390 3.245861
11.066667 -2.760705 -2.299662 2.833838 0.423297 0.171749 3.535643
11.100000 -2.746517 -2.293757 2.960132 0.425741 0.182108 3.803304
11.133333 -2.732234 -2.287519 3.101839 0.428131 0.192486 4.040824
11.166667 -2.717925 -2.281006 -3.032264 0.430459 0.202909 4.241150
11.200000 -2.703527 -2.274166 -2.865948 0.432722 0.213387 4.398934
11.233333 -2.689057 -2.266908 -2.704298 0.434916 0.223905 4.513682
11.266667 -2.674517 -2.259243 -2.528674 0.437044 0.234432 4.574253
11.300000 -2.659897 -2.251262 -2.354123 0.439106 0.244945 4.572528
11.333333 -2.645213 -2.242895 -2.185419 0.441107 0.255412 4.506017
11.366667 -2.630465 -2.234153 -2.050082 0.443046 0.265784 4.375432
11.400000 -2.615654 -2.225043 -1.892066 0.444922 0.276008 4.180149
11.433333 -2.600775 -2.215633 -1.728346 0.446730 0.286051 3.915245
11.466667 -2.585837 -2.205874 -1.592714 0.448467 0.295890 3.587427
11.500000 -2.570841 -2.195777 -1.460426 0.450130 0.305493 3.202333
11.533333 -2.555786 -2.185392 -1.334974 0.451715 0.314847 2.763515
11.566667 -2.540679 -2.174690 -1.235126 0.453221 0.323948 2.270382
11.600000 -2.525526 -2.163684 -1.162167 0.454649 0.332800 1.728511
11.633333 -2.510329 -2.152384 -1.111845 0.455999 0.341400 1.153593
11.666667 -2.495092 -2.140802 -1.085803 0.457272 0.349748 0.554287
11.700000 -2.479817 -2.128947 -1.066557 0.458469 0.357851 -0.058033
11.733333 -2.464506 -2.116829 -1.067668 0.459589 0.365711 -0.668496
11.766667 -2.449155 -2.104456 -1.110914 0.460634 0.373334 -1.258874
11.800000 -2.433765 -2.091832 -1.171945 0.461603 0.380725 -1.811134
11.833333 -2.418339 -2.078963 -1.257891 0.462496 0.387896 -2.319342
11.866667 -2.402881 -2.065854 -1.369067 0.463309 0.394854 -2.769953
11.900000 -2.387405 -2.052536 -1.491684 0.464039 0.401600 -3.147325
11.933333 -2.371914 -2.039017 -1.629217 0.464679 0.408145 -3.438148
11.966667 -2.356398 -2.025272 -1.742706 0.465227 0.414493 -3.636167
12.000000 -2.340859 -2.011307 -1.903435 0.465677 0.420648 -3.740420
12.033333 -2.325301 -1.997126 -2.059926 0.466024 0.426610 -3.744600
12.066667 -2.309739 -1.982769 -2.213197 0.466267 0.432383 -3.649199
12.100000 -2.294163 -1.968207 -2.366524 0.466403 0.437969 -3.464524
12.133333 -2.278591 -1.953479 -2.473038 0.466430 0.443367 -3.208322
12.166667 -2.263010 -1.938557 -2.608404 0.466346 0.448578 -2.888197
12.200000 -2.247439 -1.923474 -2.733953 0.466154 0.453605 -2.514977
12.233333 -2.231884 -1.908238 -2.802078 0.465857 0.458457 -2.106841
12.266667 -2.216346 -1.892852 -2.847587 0.465461 0.463139 -1.680751
12.300000 -2.200808 -1.877291 -2.883728 0.464975 0.467662 -1.249467
12.333333 -2.185293 -1.861587 -2.913381 0.464409 0.472037 -0.816244
12.366667 -2.169804 -1.845745 -2.929213 0.463775 0.476277 -0.393746
12.400000 -2.154345 -1.829773 -2.930355 0.463082 0.480389 0.007840
12.433333 -2.138919 -1.813676 -2.922661 0.462339 0.484381 0.390525
12.466667 -2.123528 -1.797457 -2.905929 0.461556 0.488259 0.757744
12.500000 -2.108151 -1.781094 -2.867765 0.460742 0.492029 1.111021
12.533333 -2.092791 -1.764592 -2.815617 0.459899 0.495689 1.448576
12.566667 -2.077470 -1.747986 -2.771133 0.459029 0.499236 1.771952
12.600000 -2.062188 -1.731274 -2.701585 0.458136 0.502667 2.084035
12.633333 -2.046929 -1.714439 -2.623264 0.457219 0.505974 2.378604
12.666667 -2.031695 -1.697485 -2.537533 0.456274 0.509149 2.647034
12.700000 -2.016489 -1.680417 -2.435617 0.455295 0.512185 2.882172
12.733333 -2.001321 -1.663261 -2.334674 0.454284 0.515079 3.075992
12.766667 -1.986185 -1.646000 -2.218304 0.453235 0.517830 3.217882
12.800000 -1.971086 -1.628660 -2.082349 0.452144 0.520435 3.296203
12.833333 -1.956023 -1.611226 -1.958007 0.451008 0.522893 3.304295
12.866667 -1.940998 -1.593721 -1.819703 0.449825 0.525200 3.236221
12.900000 -1.926013 -1.576153 -1.694724 0.448593 0.527350 3.091625
12.933333 -1.911068 -1.558526 -1.564068 0.447309 0.529331 2.868471
12.966667 -1.896167 -1.540823 -1.455667 0.445971 0.531136 2.572994
13.000000 -1.881310 -1.523050 -1.350040 0.444578 0.532756 2.214868
13.033333 -1.866501 -1.505211 -1.276068 0.443129 0.534188 1.802817
13.066667 -1.851739 -1.487311 -1.214518 0.441623 0.535435 1.351365
13.100000 -1.837031 -1.469390 -1.182234 0.440060 0.536501 0.867816
13.133333 -1.822374 -1.451418 -1.165827 0.438442 0.537391 0.367084
13.166667 -1.807775 -1.433440 -1.169908 0.436767 0.538108 -0.141046
13.200000 -1.793232 -1.415461 -1.182299 0.435037 0.538658 -0.648600
13.233333 -1.778749 -1.397489 -1.203652 0.433252 0.539044 -1.147808
13.266667 -1.764327 -1.379533 -1.262357 0.431413 0.539272 -1.633760
13.300000 -1.749966 -1.361546 -1.327819 0.429519 0.539348 -2.095536
13.333333 -1.735669 -1.343535 -1.406306 0.427572 0.539286 -2.528285
13.366667 -1.721436 -1.325502 -1.514559 0.425572 0.539102 -2.919206
13.400000 -1.707269 -1.307452 -1.600018 0.423519 0.538803 -3.258119
13.433333 -1.693172 -1.289445 -1.744791 0.421414 0.538399 -3.530048
13.466667 -1.679148 -1.271486 -1.888769 0.419256 0.537902 -3.725055
13.500000 -1.665199 -1.253579 -2.039058 0.417047 0.537321 -3.835426
13.533333 -1.651322 -1.235671 -2.204443 0.414788 0.536664 -3.848678
13.566667 -1.637527 -1.217820 -2.368566 0.412479 0.535943 -3.768337
13.600000 -1.623807 -1.199976 -2.511712 0.410123 0.535173 -3.593997
13.633333 -1.610165 -1.182142 -2.653873 0.407717 0.534361 -3.335602
13.666667 -1.596601 -1.164322 -2.805587 0.405259 0.533504 -3.000972
13.700000 -1.583118 -1.146519 -2.878775 0.402745 0.532590 -2.603556
13.733333 -1.569729 -1.128777 -2.963937 0.400170 0.531607 -2.163909
13.766667 -1.556424 -1.111059 -3.032318 0.397527 0.530532 -1.695146
13.800000 -1.543203 -1.093369 -3.078919 0.394810 0.529343 -1.211330
13.833333 -1.530068 -1.075710 -3.112975 0.392013 0.528024 -0.723045
13.866667 -1.517020 -1.058086 -3.114635 0.389136 0.526568 -0.244024
13.900000 -1.504061 -1.040500 -3.104741 0.386177 0.524973 0.220248
13.933333 -1.491213 -1.022986 -3.089405 0.383139 0.523236 0.666062
13.966667 -1.478477 -1.005547 -3.055355 0.380028 0.521365 1.088763
14.000000 -1.465857 -0.988185 -3.021719 0.376856 0.519375 1.485961
14.033333 -1.453331 -0.970874 -2.947119 0.373635 0.517279 1.852823
14.066667 -1.440921 -0.953644 -2.878265 0.370376 0.515089 2.193512
14.100000 -1.428627 -0.936499 -2.791067 0.367095 0.512824 2.505205
14.133333 -1.416451 -0.919440 -2.689744 0.363805 0.510500 2.787462
14.166667 -1.404394 -0.902470 -2.574787 0.360517 0.508126 3.040606
14.200000 -1.392436 -0.885565 -2.467924 0.357234 0.505702 3.261403
14.233333 -1.380596 -0.868755 -2.344481 0.353965 0.503233 3.453273
14.266667 -1.368856 -0.852014 -2.229382 0.350712 0.500717 3.609845
14.300000 -1.357218 -0.835345 -2.114025 0.347478 0.498149 3.732767
14.333333 -1.345683 -0.818750 -1.971715 0.344260 0.495520 3.818279
14.366667 -1.334262 -0.802256 -1.833290 0.341058 0.492823 3.865646
14.400000 -1.322952 -0.785864 -1.682792 0.337872 0.490058 3.868539
14.433333 -1.311747 -0.769553 -1.550148 0.334701 0.487221 3.817449
14.466667 -1.300649 -0.753346 -1.408610 0.331542 0.484312 3.707758
14.500000 -1.289657 -0.737224 -1.282733 0.328396 0.481330 3.528435
14.533333 -1.278768 -0.721212 -1.145250 0.325263 0.478285 3.274894
14.566667 -1.267981 -0.705312 -1.002141 0.322145 0.475182 2.937589
14.600000 -1.257293 -0.689528 -0.908723 0.319042 0.472022 2.520706
14.633333 -1.246714 -0.673835 -0.796236 0.315950 0.468813 2.027380
14.666667 -1.236230 -0.658262 -0.718406 0.312868 0.465561 1.464071
14.700000 -1.225857 -0.642784 -0.648241 0.309794 0.462268 0.838966
14.733333 -1.215594 -0.627403 -0.621142 0.306730 0.458931 0.163164
14.766667 -1.205422 -0.612151 -0.627097 0.303674 0.455551 -0.542865
14.800000 -1.195338 -0.597030 -0.665965 0.300629 0.452124 -1.266253
14.833333 -1.185367 -0.582011 -0.723661 0.297597 0.448644 -1.989093
14.866667 -1.175509 -0.567093 -0.810386 0.294581 0.445108 -2.689897
14.900000 -1.165734 -0.552312 -0.929264 0.291576 0.441516 -3.347499
14.933333 -1.156073 -0.537636 -1.063025 0.288578 0.437873 -3.945687
14.966667 -1.146528 -0.523064 -1.209803 0.285581 0.434182 -4.473967
15.000000 -1.137063 -0.508637 -1.393561 0.282574 0.430437 -4.917542
15.033333 -1.127680 -0.494353 -1.589446 0.279539 0.426637 -5.265559
15.066667 -1.118413 -0.480176 -1.813079 0.276463 0.422777 -5.516778
15.100000 -1.109230 -0.466148 -2.029122 0.273334 0.418855 -5.667257
15.133333 -1.100134 -0.452269 -2.244519 0.270135 0.414872 -5.713115
15.166667 -1.091157 -0.438500 -2.467278 0.266849 0.410813 -5.651897
15.200000 -1.082298 -0.424839 -2.638912 0.263465 0.406677 -5.494285
15.233333 -1.073535 -0.411327 -2.852319 0.259975 0.402457 -5.245386
15.266667 -1.064892 -0.397924 -3.068791 0.256368 0.398136 -4.911492
15.300000 -1.056369 -0.384631 3.035355 0.252632 0.393675 -4.503401
15.333333 -1.048008 -0.371648 2.903268 0.248763 0.389048 -4.036175
15.366667 -1.039768 -0.358774 2.766783 0.244763 0.384245 -3.526438
15.400000 -1.031650 -0.346009 2.649775 0.240635 0.379272 -2.982607
15.433333 -1.023653 -0.333352 2.558031 0.236384 0.374133 -2.425978
15.466667 -1.015780 -0.320804 2.474534 0.232022 0.368846 -1.874741
15.500000 -1.008086 -0.308542 2.426779 0.227571 0.363473 -1.345932
15.533333 -1.000574 -0.296558 2.406851 0.223050 0.358061 -0.851822
15.566667 -0.993185 -0.284679 2.416011 0.218478 0.352655 -0.405774
15.600000 -0.985982 -0.273061 2.422200 0.213869 0.347291 -0.019372
15.633333 -0.978965 -0.261695 2.456718 0.209243 0.342020 0.301980
15.666667 -0.972072 -0.250430 2.490380 0.204621 0.336901 0.553552
15.700000 -0.965369 -0.239402 2.536690 0.200015 0.331952 0.733069
15.733333 -0.958788 -0.228471 2.570416 0.195423 0.327174 0.841589
15.766667 -0.952331 -0.217638 2.608843 0.190850 0.322576 0.885731
15.800000 -0.946065 -0.207019 2.645781 0.186306 0.318165 0.872230
15.833333 -0.939921 -0.196493 2.696402 0.181788 0.313919 0.810776
15.866667 -0.933899 -0.186058 2.728813 0.177284 0.309801 0.714717
15.900000 -0.928065 -0.175817 2.768209 0.172789 0.305790 0.595416
15.933333 -0.922419 -0.165765 2.785158 0.168321 0.301900 0.462892
15.966667 -0.916893 -0.155797 2.792586 0.163886 0.298135 0.326056
16.000000 -0.911487 -0.145910 2.787719 0.159478 0.294478 0.193107
16.033333 -0.906259 -0.136189 2.789909 0.155108 0.290944 0.071738
16.066667 -0.901204 -0.126627 2.775263 0.150798 0.287561 -0.035084
16.100000 -0.896266 -0.117138 2.770799 0.146555 0.284344 -0.124031
16.133333 -0.891446 -0.107718 2.759347 0.142372 0.281281 -0.194197
16.166667 -0.886786 -0.098431 2.741879 0.138251 0.278375 -0.246182
16.200000 -0.882281 -0.089267 2.736988 0.134207 0.275648 -0.281665
16.233333 -0.877891 -0.080163 2.726121 0.130239 0.273103 -0.302822
16.266667 -0.873615 -0.071117 2.714224 0.126339 0.270727 -0.313207
16.300000 -0.869481 -0.062167 2.712541 0.122510 0.268524 -0.314088
16.333333 -0.865486 -0.053305 2.698544 0.118760 0.266512 -0.306428
16.366667 -0.861602 -0.044491 2.683957 0.115092 0.264695 -0.293229
16.400000 -0.857848 -0.035745 2.668828 0.111499 0.263068 -0.276223
16.433333 -0.854220 -0.027058 2.647913 0.107985 0.261640 -0.255166
16.466667 -0.850699 -0.018408 2.638000 0.104557 0.260422 -0.228695
16.500000 -0.847283 -0.009792 2.637995 0.101212 0.259415 -0.199628
16.533333 -0.843982 -0.001208 2.643106 0.097949 0.258614 -0.170668
16.566667 -0.840792 0.007351 2.640654 0.094767 0.258017 -0.141284
16.600000 -0.837704 0.015888 2.622441 0.091665 0.257616 -0.112191
16.633333 -0.834719 0.024419 2.622907 0.088636 0.257395 -0.088419
16.666667 -0.831832 0.032952 2.629269 0.085674 0.257336 -0.071421
16.700000 -0.829040 0.041496 2.622716 0.082776 0.257428 -0.058911
16.733333 -0.826341 0.050059 2.615907 0.079939 0.257662 -0.050984
16.766667 -0.823730 0.058650 2.631555 0.077161 0.258027 -0.048987
16.800000 -0.821214 0.067239 2.625826 0.074442 0.258526 -0.051446
16.833333 -0.818792 0.075830 2.612773 0.071788 0.259173 -0.053794
16.866667 -0.816448 0.084475 2.624616 0.069207 0.259992 -0.057085
16.900000 -0.814195 0.093129 2.627143 0.066707 0.261004 -0.062634
16.933333 -0.812032 0.101795 2.606990 0.064296 0.262239 -0.067660
16.966667 -0.809959 0.110477 2.611805 0.061988 0.263737 -0.069222
17.000000 -0.807975 0.119177 2.615406 0.059794 0.265527 -0.068527
17.033333 -0.806050 0.127973 2.608063 0.057712 0.267613 -0.069318
17.066667 -0.804182 0.136872 2.593212 0.055739 0.269982 -0.067646
17.100000 -0.802400 0.145799 2.594599 0.053868 0.272620 -0.062682
17.133333 -0.800667 0.154846 2.594380 0.052085 0.275491 -0.057142
17.166667 -0.798982 0.164022 2.608268 0.050371 0.278541 -0.053254
17.200000 -0.797341 0.173333 2.597745 0.048709 0.281729 -0.049645
17.233333 -0.795741 0.182790 2.595960 0.047092 0.285036 -0.045437
17.266667 -0.794179 0.192398 2.586363 0.045524 0.288468 -0.041678
17.300000 -0.792651 0.202166 2.592980 0.044001 0.292019 -0.036048
17.333333 -0.791201 0.211982 2.595035 0.042531 0.295708 -0.029778
17.366667 -0.789828 0.221847 2.592340 0.041126 0.299569 -0.021847
17.400000 -0.788531 0.231764 2.582873 0.039804 0.303643 -0.012908
17.433333 -0.787257 0.241871 2.586393 0.038567 0.307945 -0.001684
17.466667 -0.786059 0.252034 2.582739 0.037416 0.312472 0.009155
17.500000 -0.784877 0.262403 2.587750 0.036345 0.317211 0.013298
17.533333 -0.783711 0.272984 2.585095 0.035342 0.322130 0.016044
17.566667 -0.782556 0.283786 2.576216 0.034379 0.327157 0.018615
17.600000 -0.781410 0.294816 2.587158 0.033413 0.332177 0.019177
17.633333 -0.780271 0.306081 2.630206 0.032404 0.337091 0.014138
17.666667 -0.779203 0.317410 2.600067 0.031318 0.341802 0.007112
17.700000 -0.778137 0.328987 2.590048 0.030122 0.346230 0.002806
17.733333 -0.777069 0.340819 2.590048 0.028790 0.350303 -0.001907
17.766667 -0.776073 0.352717 2.590048 0.027311 0.353994 -0.009116
17.800000 -0.775148 0.364681 2.590048 0.025691 0.357316 -0.016209
17.833333 -0.774294 0.376711 2.590048 0.023943 0.360304 -0.016304
17.866667 -0.773511 0.388807 2.590048 0.022079 0.362990 -0.014120
17.900000 -0.772799 0.400970 2.590048 0.020120 0.365426 -0.018175
17.933333 -0.772158 0.413200 2.590048 0.018098 0.367700 -0.031706
17.966667 -0.771588 0.425496 2.590048 0.016047 0.369903 -0.054880
18.000000 -0.771089 0.437859 2.590048 0.013997 0.372112 -0.088985
18.033333 -0.770660 0.450289 2.590048 0.011972 0.374402 -0.137610
18.066667 -0.770303 0.462785 2.590048 0.010001 0.376849 -0.198242
18.100000 -0.770016 0.475349 2.590048 0.008104 0.379514 -0.257185
18.133333 -0.769799 0.487979 2.590048 0.006284 0.382405 -0.307525
18.166667 -0.769654 0.500676 2.590048 0.004533 0.385503 -0.347444
18.200000 -0.769580 0.513439 2.590048 0.002843 0.388784 -0.376191
18.233333 -0.769576 0.526269 2.512884 0.001199 0.392201 -0.387335
18.266667 -0.769573 0.539366 2.471391 -0.000423 0.395689 -0.377419
18.300000 -0.769575 0.552721 2.460492 -0.002048 0.399166 -0.351965
18.333333 -0.769648 0.566141 2.455980 -0.003700 0.402569 -0.314054
18.366667 -0.769745 0.579780 2.455980 -0.005398 0.405837 -0.264594
18.400000 -0.769914 0.593483 2.455980 -0.007163 0.408909 -0.203963
18.433333 -0.770155 0.607248 2.455980 -0.009010 0.411737 -0.145019
18.466667 -0.770468 0.621075 2.455980 -0.010943 0.414307 -0.094679
18.500000 -0.770854 0.634963 2.455980 -0.012956 0.416638 -0.037084
18.533333 -0.771313 0.648910 2.455980 -0.015041 0.418748 0.023577
18.566667 -0.771846 0.662916 2.455980 -0.017184 0.420682 0.085650
18.600000 -0.772451 0.676979 2.455980 -0.019381 0.422450 0.145791
18.633333 -0.773131 0.691099 2.455980 -0.021628 0.424061 0.210431
18.666667 -0.773885 0.705275 2.455980 -0.023927 0.425508 0.271912
18.700000 -0.774714 0.719505 2.455980 -0.026286 0.426769 0.295790
18.733333 -0.775618 0.733789 2.455980 -0.028712 0.427820 0.278081
18.766667 -0.776597 0.748124 2.455980 -0.030962 0.426451 0.223285
18.800000 -0.777651 0.762511 2.455980 -0.032867 0.421605 0.138091
18.833333 -0.778782 0.776948 2.668090 -0.034254 0.412222 0.006428
18.866667 -0.779989 0.791434 2.626844 -0.034945 0.397240 -0.146347
18.900000 -0.781273 0.805968 2.606988 -0.034753 0.375594 -0.301057
18.933333 -0.782771 0.820122 2.566864 -0.033590 0.347320 -0.438666
18.966667 -0.784346 0.834322 2.566864 -0.031878 0.316807 -0.563212
19.000000 -0.785999 0.848568 2.433486 -0.029851 0.286243 -0.678040
19.033333 -0.787730 0.862858 2.433486 -0.027755 0.257821 -0.751011
19.066667 -0.789538 0.877192 2.298658 -0.025848 0.233743 -0.799489
