t x y theta dxdt dydt dthetadt
0.000000 0.000000 0.000000 -0.217110 0.022946 -0.006981 -0.053891
0.033333 0.000587 -0.000232 -0.213200 0.027359 -0.007553 -0.055514
0.066667 0.001229 -0.000524 -0.212786 0.032762 -0.008114 -0.055853
0.100000 0.001968 -0.000907 -0.222740 0.039350 -0.008688 -0.054787
0.133333 0.002801 -0.001369 -0.218273 0.047330 -0.009297 -0.053392
0.166667 0.004081 -0.001746 -0.229061 0.056859 -0.010023 -0.047305
0.200000 0.005820 -0.002035 -0.229668 0.068083 -0.010958 -0.036176
0.233333 0.008033 -0.002234 -0.225897 0.081068 -0.012172 -0.019011
0.266667 0.010600 -0.002548 -0.229415 0.095842 -0.013693 0.000867
0.300000 0.013666 -0.002765 -0.240372 0.112434 -0.015576 0.020945
0.333333 0.017252 -0.003132 -0.245121 0.130787 -0.017841 0.044682
0.366667 0.021452 -0.003640 -0.246356 0.150889 -0.020461 0.067929
0.400000 0.026347 -0.004273 -0.219964 0.172645 -0.023335 0.085547
0.433333 0.031985 -0.005052 -0.207413 0.196090 -0.026385 0.092499
0.466667 0.038489 -0.006011 -0.219094 0.221251 -0.029551 0.089683
0.500000 0.046045 -0.007192 -0.213416 0.248095 -0.032677 0.077244
0.533333 0.054805 -0.008640 -0.207259 0.276715 -0.035639 0.050528
0.566667 0.064153 -0.009953 -0.190609 0.307179 -0.038292 0.008827
0.600000 0.074100 -0.011128 -0.192971 0.339633 -0.040565 -0.039095
0.633333 0.085746 -0.012683 -0.196800 0.374077 -0.042294 -0.086905
0.666667 0.098004 -0.014087 -0.193813 0.410577 -0.043350 -0.133718
0.700000 0.112145 -0.015825 -0.194615 0.449144 -0.043577 -0.178276
0.733333 0.126911 -0.017401 -0.214683 0.489637 -0.042848 -0.212467
0.766667 0.143625 -0.019193 -0.231666 0.531750 -0.040947 -0.230577
0.800000 0.160971 -0.020809 -0.256247 0.575159 -0.037642 -0.234450
0.833333 0.180371 -0.022413 -0.257073 0.619524 -0.032722 -0.224996
0.866667 0.201943 -0.023932 -0.275148 0.664349 -0.025945 -0.195739
0.900000 0.225709 -0.025172 -0.282585 0.709050 -0.017266 -0.140779
0.933333 0.250106 -0.026209 -0.279473 0.753178 -0.006468 -0.062220
0.966667 0.276804 -0.026726 -0.279257 0.796313 0.006554 0.042777
1.000000 0.304122 -0.027029 -0.292591 0.838048 0.022072 0.169893
1.033333 0.333533 -0.026403 -0.298445 0.877933 0.040107 0.332885
1.066667 0.363550 -0.025553 -0.277351 0.915773 0.060664 0.531822
1.100000 0.395470 -0.023386 -0.274404 0.951495 0.083937 0.765043
1.133333 0.427977 -0.020987 -0.263680 0.984858 0.109991 1.034215
1.166667 0.462316 -0.016984 -0.237809 1.015668 0.138794 1.335079
1.200000 0.497220 -0.012744 -0.197911 1.043707 0.169974 1.672557
1.233333 0.532676 -0.008266 -0.138156 1.068990 0.203399 2.013905
1.266667 0.569371 -0.001796 -0.053726 1.091350 0.238802 2.339261
1.300000 0.607013 0.006790 0.044487 1.110686 0.275685 2.627113
1.333333 0.645337 0.017640 0.044487 1.126970 0.313294 2.860430
1.366667 0.684156 0.028718 0.253036 1.140400 0.350913 3.005094
1.400000 0.723457 0.040020 0.407240 1.151129 0.388048 3.034476
1.433333 0.762594 0.053594 0.529701 1.159244 0.423974 2.943065
1.466667 0.801561 0.069367 0.681884 1.165001 0.458092 2.720903
1.500000 0.840260 0.087233 0.832733 1.168815 0.489842 2.365298
1.533333 0.879380 0.105283 0.923035 1.171226 0.518964 1.866070
1.566667 0.918908 0.123504 0.991989 1.172610 0.545250 1.258673
1.600000 0.958830 0.141882 1.046302 1.173476 0.568359 0.570178
1.633333 0.998009 0.161618 1.058231 1.174329 0.588155 -0.168013
1.666667 1.036618 0.182636 1.055453 1.175592 0.604596 -0.915986
1.700000 1.075580 0.203766 1.006530 1.177440 0.617904 -1.630248
1.733333 1.114157 0.225594 0.928676 1.180034 0.628197 -2.266474
1.766667 1.153062 0.247500 0.789001 1.183560 0.635535 -2.803994
1.800000 1.192283 0.269466 0.628329 1.188126 0.640092 -3.220611
1.833333 1.231809 0.291475 0.454793 1.193699 0.642071 -3.499655
1.866667 1.271517 0.313402 0.275935 1.200147 0.641714 -3.633723
1.900000 1.311505 0.335337 0.130411 1.207398 0.639106 -3.636419
1.933333 1.351839 0.356884 -0.004951 1.215257 0.634312 -3.525140
1.966667 1.392559 0.377910 -0.149663 1.223473 0.627574 -3.321019
2.000000 1.433519 0.398893 -0.269075 1.231796 0.619099 -3.055766
2.033333 1.474708 0.419818 -0.358556 1.240093 0.608945 -2.770022
2.066667 1.516110 0.440669 -0.440060 1.248288 0.597057 -2.509449
2.100000 1.558003 0.460649 -0.503181 1.256281 0.583447 -2.302659
2.133333 1.600084 0.480523 -0.544766 1.264012 0.568306 -2.175837
2.166667 1.642515 0.499218 -0.569429 1.271530 0.551537 -2.162400
2.200000 1.685106 0.517779 -0.579854 1.278885 0.533042 -2.285455
2.233333 1.727842 0.536191 -0.645358 1.286064 0.513016 -2.541981
2.266667 1.770920 0.552695 -0.727610 1.293045 0.491809 -2.919163
2.300000 1.814113 0.569026 -0.758355 1.300010 0.469440 -3.407762
2.333333 1.857407 0.585173 -0.830435 1.307153 0.445817 -3.985840
2.366667 1.901251 0.598868 -0.953198 1.314488 0.421364 -4.613132
2.400000 1.945165 0.612359 -1.129172 1.321907 0.396142 -5.239106
2.433333 1.989133 0.625639 -1.335039 1.329342 0.370025 -5.837419
2.466667 2.033141 0.638698 -1.580951 1.336671 0.342300 -6.374437
2.500000 2.078129 0.648756 -1.855256 1.343356 0.312950 -6.804762
2.533333 2.123123 0.658583 -2.167384 1.348859 0.281964 -7.093100
2.566667 2.168107 0.668172 -2.412071 1.352785 0.248811 -7.221465
2.600000 2.213064 0.677522 -2.697925 1.354955 0.213537 -7.184106
2.633333 2.259851 0.684215 -2.983296 1.355037 0.176393 -6.965591
2.666667 2.306575 0.690663 3.029291 1.352848 0.138295 -6.566878
2.700000 2.353217 0.696865 2.776457 1.348522 0.099499 -6.007652
2.733333 2.398324 0.698461 2.556139 1.342295 0.060603 -5.312487
2.766667 2.443313 0.699815 2.341275 1.334336 0.022384 -4.497926
2.800000 2.487105 0.697351 2.186268 1.324833 -0.014139 -3.588522
2.833333 2.530744 0.694659 2.090221 1.314232 -0.048345 -2.623882
2.866667 2.574216 0.691748 2.008923 1.302856 -0.079763 -1.638731
2.900000 2.617503 0.688628 1.969548 1.290872 -0.107704 -0.662818
2.933333 2.660303 0.683473 1.965716 1.278274 -0.132010 0.275530
2.966667 2.702886 0.678129 2.026753 1.265317 -0.152319 1.143881
3.000000 2.745100 0.671703 2.130032 1.252070 -0.168950 1.914397
3.033333 2.787067 0.665113 2.252150 1.238729 -0.181889 2.578414
3.066667 2.828532 0.658093 2.397097 1.225612 -0.191182 3.124297
3.100000 2.869360 0.650856 2.524427 1.213359 -0.196748 3.545121
3.133333 2.909896 0.643498 2.683176 1.202780 -0.198397 3.836626
3.166667 2.949447 0.636111 2.813650 1.194300 -0.196346 4.006307
3.200000 2.988007 0.628637 2.972503 1.188564 -0.190614 4.069799
3.233333 3.025299 0.620949 -3.135403 1.185963 -0.181463 4.031724
3.266667 3.062247 0.613194 -2.979453 1.186787 -0.169204 3.904959
3.300000 3.101287 0.607714 -2.828520 1.190707 -0.154572 3.696003
3.333333 3.139957 0.602192 -2.713820 1.197172 -0.138310 3.419454
3.366667 3.180313 0.598400 -2.589033 1.205551 -0.121101 3.078766
3.400000 3.220269 0.594587 -2.477277 1.214911 -0.103660 2.675693
3.433333 3.261474 0.591973 -2.378682 1.224045 -0.086706 2.223206
3.466667 3.303665 0.590307 -2.316764 1.231648 -0.071015 1.730747
3.500000 3.345402 0.588646 -2.258748 1.237001 -0.056777 1.213408
3.533333 3.387843 0.587639 -2.203196 1.239407 -0.044155 0.679792
3.566667 3.430702 0.587099 -2.193638 1.238497 -0.033064 0.146767
3.600000 3.473046 0.586585 -2.189681 1.234062 -0.023361 -0.369284
3.633333 3.514855 0.586100 -2.232886 1.226326 -0.014745 -0.857143
3.666667 3.556107 0.585653 -2.296482 1.215785 -0.006485 -1.303996
3.700000 3.596781 0.585247 -2.365028 1.202722 0.001783 -1.696304
3.733333 3.636858 0.584889 -2.450248 1.187375 0.010592 -2.017696
3.766667 3.676324 0.585138 -2.530139 1.169751 0.020433 -2.261807
3.800000 3.715152 0.585446 -2.625681 1.149671 0.031865 -2.424423
3.833333 3.753419 0.586863 -2.746132 1.126813 0.045308 -2.502861
3.866667 3.791010 0.588348 -2.847082 1.100523 0.060613 -2.503425
3.900000 3.827904 0.589901 -2.949319 1.070036 0.077764 -2.436113
3.933333 3.864083 0.591528 -3.039424 1.034864 0.096597 -2.321427
3.966667 3.899528 0.593232 -3.139267 0.994875 0.116852 -2.170391
4.000000 3.934639 0.598270 3.071175 0.950180 0.137849 -1.997104
4.033333 3.968979 0.603388 3.002296 0.900907 0.159085 -1.816045
4.066667 3.999632 0.609346 2.978825 0.847648 0.180112 -1.635057
4.100000 4.026935 0.616266 2.945035 0.791459 0.200321 -1.456322
4.133333 4.051166 0.624138 2.908942 0.733423 0.218942 -1.269833
4.166667 4.074575 0.632080 2.885882 0.674411 0.235236 -1.071786
4.200000 4.095408 0.640797 2.848454 0.615348 0.248878 -0.850427
4.233333 4.113906 0.650121 2.804027 0.557057 0.259225 -0.593718
4.266667 4.130250 0.659908 2.747920 0.500064 0.265854 -0.286167
4.300000 4.145754 0.669745 2.719781 0.444346 0.268539 0.078708
4.333333 4.159145 0.679627 2.690794 0.389783 0.267402 0.497106
4.366667 4.171694 0.689548 2.699612 0.336252 0.262569 0.965463
4.400000 4.182055 0.699130 2.718191 0.283705 0.254238 1.476054
4.433333 4.191579 0.708741 2.774181 0.232279 0.242967 2.010556
4.466667 4.198563 0.717387 2.864430 0.182168 0.229374 2.541507
4.500000 4.204718 0.726051 2.984320 0.133773 0.214004 3.040321
4.533333 4.207787 0.732987 3.115991 0.087517 0.197396 3.481689
4.566667 4.207436 0.737696 -3.009152 0.044037 0.180274 3.839261
4.600000 4.206283 0.742414 -2.858781 0.003690 0.163276 4.084064
4.633333 4.204342 0.747143 -2.687393 -0.033279 0.147019 4.200958
4.666667 4.201626 0.751881 -2.543296 -0.066750 0.131949 4.186037
4.700000 4.198147 0.756628 -2.363047 -0.096612 0.118511 4.039841
4.733333 4.194098 0.760174 -2.142738 -0.123040 0.106957 3.762944
4.766667 4.189395 0.762454 -1.979382 -0.146655 0.097275 3.367225
4.800000 4.183972 0.764747 -1.847764 -0.167945 0.089507 2.870216
4.833333 4.177842 0.767055 -1.761620 -0.187345 0.083678 2.293871
4.866667 4.171019 0.769380 -1.713848 -0.205194 0.079933 1.658245
4.900000 4.163519 0.771725 -1.672096 -0.221775 0.078503 0.994517
4.933333 4.155579 0.773794 -1.635019 -0.237171 0.079585 0.342504
4.966667 4.146992 0.775887 -1.633074 -0.251174 0.083433 -0.270712
5.000000 4.138370 0.778338 -1.659568 -0.263639 0.090155 -0.823112
5.033333 4.129130 0.780818 -1.739864 -0.274517 0.099677 -1.300619
5.066667 4.119288 0.783330 -1.853561 -0.283760 0.111805 -1.695125
5.100000 4.108860 0.785877 -1.951666 -0.291432 0.126162 -2.009643
5.133333 4.098417 0.789440 -2.037963 -0.297594 0.142358 -2.251787
5.166667 4.088007 0.794105 -2.134648 -0.302487 0.159846 -2.423911
5.200000 4.077711 0.799934 -2.228763 -0.306397 0.177976 -2.528327
5.233333 4.067583 0.806882 -2.300188 -0.309624 0.196094 -2.569164
5.266667 4.056940 0.813863 -2.369429 -0.312586 0.213532 -2.548083
5.300000 4.046548 0.821892 -2.449142 -0.315772 0.229595 -2.465986
5.333333 4.036433 0.830824 -2.533935 -0.319725 0.243669 -2.328483
5.366667 4.025842 0.839776 -2.641522 -0.324825 0.255401 -2.144061
5.400000 4.015567 0.849259 -2.771109 -0.331377 0.264637 -1.916932
5.433333 4.004839 0.858752 -2.871165 -0.339635 0.271354 -1.651911
5.466667 3.994078 0.868479 -2.927484 -0.349719 0.275605 -1.358494
5.500000 3.982886 0.878204 -2.954246 -0.361503 0.277676 -1.047224
5.533333 3.971175 0.887914 -2.974806 -0.374782 0.277899 -0.728067
5.566667 3.959056 0.897609 -2.967533 -0.389396 0.276518 -0.413190
5.600000 3.945966 0.906998 -2.946593 -0.405084 0.273757 -0.122645
5.633333 3.931766 0.915992 -2.927861 -0.421441 0.269840 0.129333
5.666667 3.917196 0.924955 -2.913686 -0.438047 0.265009 0.337471
5.700000 3.902269 0.933882 -2.901623 -0.454599 0.259388 0.500815
5.733333 3.887000 0.942766 -2.876349 -0.470764 0.253078 0.622366
5.766667 3.870622 0.951023 -2.849491 -0.486142 0.246228 0.708950
5.800000 3.853928 0.959228 -2.823522 -0.500467 0.238974 0.775270
5.833333 3.836934 0.967377 -2.777939 -0.513666 0.231397 0.831146
5.866667 3.819108 0.974958 -2.750146 -0.525644 0.223589 0.879670
5.900000 3.801011 0.982475 -2.719492 -0.536310 0.215643 0.918240
5.933333 3.782492 0.989467 -2.703027 -0.545649 0.207713 0.942705
5.966667 3.763809 0.995940 -2.679962 -0.553781 0.199896 0.950608
6.000000 3.744901 1.002338 -2.654668 -0.560795 0.192274 0.935094
6.033333 3.725784 1.008658 -2.607833 -0.566749 0.184958 0.891575
6.066667 3.706755 1.014457 -2.548788 -0.571831 0.178037 0.818617
6.100000 3.687548 1.020173 -2.512913 -0.576255 0.171589 0.720511
6.133333 3.668176 1.025803 -2.474311 -0.580246 0.165577 0.602055
6.166667 3.648757 1.031126 -2.429154 -0.583960 0.159954 0.467234
6.200000 3.629308 1.036205 -2.424292 -0.587582 0.154668 0.324744
6.233333 3.609739 1.041191 -2.427664 -0.591256 0.149646 0.183829
6.266667 3.590005 1.046007 -2.441835 -0.595017 0.144777 0.056364
6.300000 3.570181 1.050728 -2.453576 -0.598857 0.139976 -0.052053
6.333333 3.550283 1.055353 -2.480835 -0.602719 0.135216 -0.134981
6.366667 3.530116 1.059884 -2.494209 -0.606507 0.130439 -0.189369
6.400000 3.509904 1.064316 -2.509366 -0.610049 0.125575 -0.215887
6.433333 3.489393 1.068498 -2.524824 -0.613147 0.120539 -0.216556
6.466667 3.468647 1.072416 -2.523691 -0.615616 0.115279 -0.200903
6.500000 3.447900 1.076232 -2.509336 -0.617296 0.109735 -0.174821
6.533333 3.426916 1.079697 -2.517865 -0.618024 0.103851 -0.146235
6.566667 3.405963 1.083060 -2.530305 -0.617709 0.097655 -0.119008
6.600000 3.385055 1.086319 -2.527439 -0.616318 0.091221 -0.097246
6.633333 3.364207 1.089476 -2.540648 -0.613912 0.084659 -0.082886
6.666667 3.343436 1.092529 -2.534922 -0.610584 0.078058 -0.074580
6.700000 3.322923 1.095106 -2.538485 -0.606380 0.071526 -0.068520
6.733333 3.302682 1.097250 -2.535901 -0.601337 0.065147 -0.063488
6.766667 3.282844 1.098929 -2.533544 -0.595411 0.058996 -0.060347
6.800000 3.263138 1.100507 -2.538460 -0.588466 0.053116 -0.056822
6.833333 3.243579 1.101985 -2.546412 -0.580235 0.047525 -0.054044
6.866667 3.224179 1.103366 -2.546619 -0.570435 0.042254 -0.049965
6.900000 3.204952 1.104649 -2.554977 -0.558772 0.037293 -0.047444
6.933333 3.185911 1.105838 -2.552521 -0.545039 0.032619 -0.046809
6.966667 3.167068 1.106933 -2.544274 -0.529022 0.028156 -0.050363
7.000000 3.148436 1.107936 -2.551506 -0.510568 0.023834 -0.061648
7.033333 3.130755 1.108690 -2.552509 -0.489670 0.019611 -0.082270
7.066667 3.114124 1.109243 -2.551663 -0.466320 0.015450 -0.114833
7.100000 3.098616 1.109628 -2.561297 -0.440696 0.011351 -0.156444
7.133333 3.084306 1.109861 -2.557487 -0.412964 0.007337 -0.203338
7.166667 3.071275 1.109933 -2.553904 -0.383547 0.003473 -0.246124
7.200000 3.058513 1.109925 -2.549406 -0.352970 -0.000172 -0.279000
7.233333 3.047301 1.109794 -2.564643 -0.321821 -0.003555 -0.293919
7.266667 3.036368 1.109590 -2.577922 -0.290696 -0.006641 -0.285892
7.300000 3.027030 1.109268 -2.625377 -0.260154 -0.009411 -0.252279
7.333333 3.019165 1.108828 -2.657252 -0.230774 -0.011864 -0.193047
7.366667 3.012606 1.108318 -2.675911 -0.202943 -0.014021 -0.115041
7.400000 3.007220 1.107704 -2.683943 -0.177058 -0.015910 -0.022293
7.433333 3.002772 1.107062 -2.675191 -0.153360 -0.017572 0.075315
7.466667 2.999071 1.106407 -2.655908 -0.132144 -0.019059 0.169035
7.500000 2.995649 1.105699 -2.639069 -0.113508 -0.020427 0.247557
7.533333 2.992725 1.104977 -2.622954 -0.097419 -0.021743 0.302547
7.566667 2.990168 1.104253 -2.588473 -0.083774 -0.023076 0.331468
7.600000 2.987937 1.103521 -2.564338 -0.072306 -0.024501 0.334487
7.633333 2.985997 1.102771 -2.536468 -0.062710 -0.026068 0.313771
7.666667 2.984294 1.101972 -2.521266 -0.054568 -0.027798 0.275907
7.700000 2.982806 1.101070 -2.539846 -0.047563 -0.029701 0.230554
7.733333 2.981564 1.100136 -2.548387 -0.041408 -0.031755 0.187095
7.766667 2.980413 1.099077 -2.541139 -0.035855 -0.033931 0.151729
7.800000 2.979327 1.097900 -2.543103 -0.030713 -0.036216 0.125239
7.833333 2.978472 1.096701 -2.529749 -0.025852 -0.038608 0.111759
7.866667 2.977641 1.095346 -2.534932 -0.021181 -0.041105 0.109926
7.900000 2.976864 1.093789 -2.544014 -0.016603 -0.043699 0.115345
7.933333 2.976300 1.092221 -2.530501 -0.012053 -0.046456 0.121071
7.966667 2.975944 1.090647 -2.529348 -0.007500 -0.049408 0.125510
8.000000 2.975791 1.089069 -2.515014 -0.002927 -0.052533 0.127728
8.033333 2.975835 1.087493 -2.499992 0.001682 -0.055882 0.122862
8.066667 2.976070 1.085920 -2.485594 0.006312 -0.059532 0.108331
8.100000 2.976380 1.083944 -2.491177 0.010941 -0.063625 0.083386
8.133333 2.976781 1.081542 -2.504468 0.015555 -0.068151 0.052656
8.166667 2.977354 1.079157 -2.493440 0.020145 -0.073129 0.013055
8.200000 2.978095 1.076796 -2.495471 0.024707 -0.078601 -0.034306
8.233333 2.978996 1.074461 -2.486593 0.029238 -0.084509 -0.084837
8.266667 2.980041 1.071464 -2.489264 0.033751 -0.090728 -0.135263
8.300000 2.981234 1.068504 -2.489322 0.038238 -0.097034 -0.184507
8.333333 2.982569 1.065587 -2.498247 0.042672 -0.103341 -0.235108
8.366667 2.984086 1.061828 -2.519481 0.047023 -0.109482 -0.282938
8.400000 2.985732 1.058124 -2.528927 0.051260 -0.115232 -0.324800
8.433333 2.987598 1.053545 -2.541141 0.055343 -0.120183 -0.360137
