t x y theta dxdt dydt dthetadt
0.000000 0.000000 0.000000 -0.492595 -0.001317 0.010085 0.050286
0.033333 -0.000090 -0.000051 -0.497971 -0.002340 0.013611 0.053784
0.066667 -0.000148 0.000066 -0.471699 -0.003779 0.018688 0.056695
0.100000 -0.000176 0.000353 -0.475647 -0.005764 0.025873 0.065316
0.133333 -0.000173 0.000807 -0.480812 -0.008407 0.035836 0.088416
0.166667 -0.000220 0.001412 -0.470979 -0.011746 0.049302 0.133309
0.200000 -0.000410 0.002522 -0.487895 -0.015447 0.066734 0.205519
0.233333 -0.000571 0.003801 -0.497881 -0.019190 0.088560 0.307132
0.266667 -0.001237 0.006158 -0.472623 -0.022628 0.115152 0.439752
0.300000 -0.001873 0.008682 -0.489216 -0.024594 0.146129 0.589515
0.333333 -0.003230 0.013315 -0.483535 -0.023816 0.180471 0.737959
0.366667 -0.004556 0.018109 -0.457303 -0.019224 0.216869 0.864716
0.400000 -0.005848 0.023060 -0.451042 -0.010310 0.254132 0.955912
0.433333 -0.008216 0.032092 -0.375057 0.003530 0.290758 0.995458
0.466667 -0.011003 0.044574 -0.272579 0.023270 0.325085 0.972970
0.500000 -0.012532 0.059352 -0.205790 0.048419 0.355795 0.887970
0.533333 -0.011253 0.074825 -0.141485 0.078343 0.382165 0.747683
0.566667 -0.009930 0.090403 -0.095045 0.112509 0.403659 0.572231
0.600000 -0.008566 0.106068 -0.085045 0.150716 0.419763 0.370366
0.633333 0.000429 0.120660 -0.095168 0.191954 0.430684 0.166193
0.666667 0.009457 0.135311 -0.109277 0.234323 0.437175 -0.015244
0.700000 0.018507 0.150008 -0.196946 0.276753 0.440261 -0.153184
0.733333 0.027570 0.164737 -0.194028 0.317974 0.440616 -0.237414
0.766667 0.036639 0.179486 -0.229843 0.356715 0.438914 -0.266352
0.800000 0.050842 0.193824 -0.262488 0.390789 0.435659 -0.239646
0.833333 0.065026 0.208155 -0.268440 0.419001 0.430671 -0.166526
0.866667 0.082241 0.222968 -0.264637 0.440031 0.423204 -0.067627
0.900000 0.099405 0.237747 -0.261490 0.452070 0.412086 0.031031
0.933333 0.117614 0.252450 -0.234398 0.453303 0.396381 0.116111
0.966667 0.135876 0.266636 -0.235272 0.441915 0.375195 0.172313
1.000000 0.154032 0.280750 -0.203824 0.417255 0.347803 0.191099
1.033333 0.172063 0.294781 -0.194344 0.378764 0.314023 0.168446
1.066667 0.187357 0.306243 -0.170068 0.327304 0.274413 0.111735
1.100000 0.202491 0.317601 -0.159581 0.264545 0.230022 0.037977
1.133333 0.213780 0.326262 -0.150489 0.192940 0.181991 -0.038616
1.166667 0.220716 0.331933 -0.136885 0.115323 0.131629 -0.104445
1.200000 0.223367 0.334834 -0.154477 0.034731 0.080398 -0.146158
1.233333 0.221071 0.334687 -0.196530 -0.045749 0.029766 -0.155066
1.266667 0.214018 0.332273 -0.226258 -0.123952 -0.019618 -0.131113
1.300000 0.206785 0.329748 -0.274841 -0.198111 -0.067351 -0.077437
1.333333 0.194478 0.324777 -0.279469 -0.266609 -0.112891 -0.004439
1.366667 0.182014 0.319711 -0.288393 -0.328670 -0.156367 0.082626
1.400000 0.169411 0.314562 -0.263897 -0.384159 -0.197993 0.169903
1.433333 0.156682 0.309338 -0.236822 -0.433741 -0.238469 0.243615
1.466667 0.140652 0.300728 -0.192195 -0.477952 -0.277918 0.298501
1.500000 0.124533 0.292067 -0.157123 -0.517338 -0.316463 0.323824
1.533333 0.105609 0.280023 -0.128370 -0.552996 -0.354398 0.321635
1.566667 0.086638 0.267958 -0.122523 -0.585426 -0.391320 0.288617
1.600000 0.064329 0.252016 -0.129739 -0.614743 -0.426559 0.238868
1.633333 0.042023 0.236094 -0.137617 -0.640666 -0.459205 0.189136
1.666667 0.019744 0.220214 -0.139149 -0.662288 -0.488415 0.144256
1.700000 -0.004012 0.201623 -0.120492 -0.678581 -0.513119 0.121957
1.733333 -0.027685 0.183122 -0.133512 -0.687875 -0.532359 0.125948
1.766667 -0.051246 0.164735 -0.157520 -0.688641 -0.545414 0.163107
1.800000 -0.076343 0.144225 -0.131247 -0.679766 -0.552029 0.223637
1.833333 -0.101271 0.123883 -0.160200 -0.659483 -0.551183 0.297268
1.866667 -0.125999 0.103735 -0.136157 -0.627467 -0.542283 0.383642
1.900000 -0.150496 0.083811 -0.136433 -0.583663 -0.525210 0.473887
1.933333 -0.174734 0.064136 -0.095844 -0.529180 -0.500081 0.558974
1.966667 -0.198682 0.044739 -0.052822 -0.464578 -0.466302 0.632174
2.000000 -0.212956 0.028697 -0.055554 -0.391214 -0.423593 0.694232
2.033333 -0.226891 0.012983 0.007116 -0.311789 -0.373228 0.735779
2.066667 -0.232196 0.000677 0.026071 -0.228924 -0.316490 0.750630
2.100000 -0.237135 -0.011259 0.044770 -0.144651 -0.254140 0.729409
2.133333 -0.241698 -0.022805 0.086621 -0.060312 -0.186695 0.673231
2.166667 -0.237848 -0.024691 0.087291 0.021246 -0.116644 0.578998
2.200000 -0.233614 -0.026158 0.123002 0.099068 -0.045607 0.444522
2.233333 -0.228995 -0.027198 0.168314 0.172873 0.025565 0.284547
2.266667 -0.223993 -0.027802 0.169221 0.243762 0.096531 0.106810
2.300000 -0.211907 -0.019290 0.223016 0.311354 0.165641 -0.079472
2.333333 -0.199447 -0.010336 0.212582 0.375271 0.231249 -0.259302
2.366667 -0.186621 -0.000939 0.171176 0.436469 0.293482 -0.416871
2.400000 -0.173440 0.008897 0.140430 0.494531 0.351765 -0.540065
2.433333 -0.154346 0.022690 0.093799 0.548275 0.405043 -0.620155
2.466667 -0.134922 0.036915 0.037680 0.595652 0.451910 -0.653438
2.500000 -0.111782 0.054513 -0.019984 0.635793 0.492368 -0.629177
2.533333 -0.086070 0.074632 -0.041503 0.667530 0.526133 -0.557069
2.566667 -0.060086 0.095153 -0.057047 0.689232 0.552305 -0.450689
2.600000 -0.033853 0.116064 -0.074376 0.699899 0.570378 -0.319626
2.633333 -0.007395 0.137352 -0.086197 0.699995 0.580689 -0.180314
2.666667 0.019264 0.159005 -0.072958 0.690350 0.583791 -0.043711
2.700000 0.046103 0.181008 -0.052062 0.671946 0.580075 0.074624
2.733333 0.070516 0.202104 -0.044232 0.646623 0.570560 0.171890
2.766667 0.091372 0.221257 -0.003722 0.616709 0.556651 0.247334
2.800000 0.110209 0.239500 -0.002196 0.584498 0.539756 0.299474
2.833333 0.127620 0.256937 0.003096 0.552074 0.521258 0.327301
2.866667 0.143723 0.273269 0.010526 0.521459 0.502557 0.333271
2.900000 0.158876 0.288737 0.015008 0.494900 0.485324 0.319865
2.933333 0.174097 0.304493 0.017002 0.473861 0.470869 0.288018
2.966667 0.188272 0.319002 0.043106 0.459191 0.460154 0.240827
3.000000 0.202495 0.333789 0.058384 0.451462 0.454147 0.181708
3.033333 0.215292 0.347408 0.084105 0.450519 0.453410 0.116386
3.066667 0.228371 0.360444 0.092525 0.455836 0.458450 0.048009
3.100000 0.241473 0.373749 0.101763 0.465976 0.468912 -0.018216
3.133333 0.254591 0.387321 0.085581 0.479553 0.484512 -0.077253
3.166667 0.270678 0.402438 0.067463 0.495059 0.504788 -0.123084
3.200000 0.286762 0.417814 0.050805 0.510830 0.529002 -0.153603
3.233333 0.306524 0.436722 0.031738 0.524835 0.556151 -0.165316
3.266667 0.326257 0.455877 0.017201 0.535416 0.584967 -0.157623
3.300000 0.345947 0.475271 -0.002103 0.541086 0.614565 -0.132941
3.333333 0.366593 0.497518 -0.000587 0.540625 0.643748 -0.097359
3.366667 0.387165 0.519984 0.009104 0.533406 0.671663 -0.055319
3.400000 0.406354 0.544084 0.005082 0.519105 0.697415 -0.010434
3.433333 0.425438 0.568380 0.024886 0.498342 0.720657 0.030552
3.466667 0.442316 0.593405 0.035476 0.471585 0.741160 0.066498
3.500000 0.459064 0.618598 0.030027 0.439766 0.758664 0.097550
3.533333 0.473761 0.644700 0.028837 0.403979 0.773334 0.128063
3.566667 0.486013 0.671597 0.043047 0.365213 0.785188 0.156157
3.600000 0.498106 0.698617 0.034899 0.324455 0.794571 0.184675
3.633333 0.507293 0.725929 0.031274 0.282818 0.801659 0.218275
3.666667 0.516312 0.753332 0.029817 0.241487 0.806766 0.257111
3.700000 0.525159 0.780810 0.056932 0.201455 0.810168 0.295828
3.733333 0.531284 0.808171 0.054259 0.163527 0.812066 0.332754
3.766667 0.534986 0.835435 0.075708 0.128446 0.812777 0.366613
3.800000 0.536105 0.862365 0.097840 0.097166 0.812523 0.393087
3.833333 0.537055 0.889306 0.114925 0.069980 0.811472 0.406186
3.866667 0.537843 0.916242 0.133297 0.047144 0.809772 0.402218
3.900000 0.537878 0.943294 0.147103 0.028919 0.807676 0.389720
3.933333 0.537070 0.970252 0.160302 0.015351 0.805349 0.366008
3.966667 0.536344 0.997619 0.182596 0.006191 0.802773 0.336392
4.000000 0.535703 1.024739 0.199687 0.000706 0.799878 0.303290
4.033333 0.535399 1.051119 0.191921 -0.001689 0.796672 0.273655
4.066667 0.534970 1.077395 0.211284 -0.001550 0.793075 0.250036
4.100000 0.534893 1.103751 0.199177 0.000390 0.788954 0.228185
4.133333 0.534702 1.129970 0.210858 0.003492 0.784178 0.208782
4.166667 0.534745 1.156060 0.206250 0.007288 0.778834 0.189531
4.200000 0.535039 1.182316 0.205856 0.011521 0.772994 0.169160
4.233333 0.535691 1.208451 0.229833 0.015985 0.766638 0.142049
4.266667 0.536253 1.234385 0.235320 0.020358 0.759796 0.110185
4.300000 0.537184 1.259558 0.254622 0.024426 0.752568 0.072318
4.333333 0.538033 1.284498 0.258497 0.027983 0.745144 0.034029
4.366667 0.538806 1.309189 0.264850 0.030856 0.737646 -0.005237
4.400000 0.540382 1.333462 0.258729 0.032785 0.730247 -0.040239
4.433333 0.541889 1.357456 0.250867 0.033584 0.723147 -0.064812
4.466667 0.543331 1.381154 0.233241 0.033119 0.716493 -0.076890
4.500000 0.544841 1.404811 0.228654 0.031285 0.710224 -0.070662
4.533333 0.546346 1.428277 0.197031 0.028073 0.704095 -0.047282
4.566667 0.547591 1.451633 0.203472 0.023515 0.697571 -0.005568
4.600000 0.548785 1.474632 0.200623 0.017910 0.689887 0.048219
4.633333 0.549705 1.497171 0.203236 0.011520 0.680296 0.109810
4.666667 0.549979 1.520378 0.223174 0.004699 0.668048 0.172580
4.700000 0.549945 1.543866 0.225911 -0.002134 0.652599 0.229930
4.733333 0.549342 1.566819 0.233444 -0.008558 0.633531 0.276754
4.766667 0.548711 1.589336 0.250356 -0.014132 0.610480 0.312602
4.800000 0.547827 1.610924 0.266348 -0.018626 0.583554 0.340602
4.833333 0.546456 1.630963 0.293861 -0.021809 0.552939 0.360784
4.866667 0.545072 1.650520 0.309814 -0.023572 0.518961 0.374413
4.900000 0.543619 1.667508 0.323212 -0.023913 0.481967 0.383610
4.933333 0.542827 1.681450 0.303745 -0.022967 0.442394 0.390529
4.966667 0.542041 1.694877 0.322231 -0.020988 0.401264 0.392372
5.000000 0.541265 1.707781 0.338224 -0.018174 0.359327 0.388162
5.033333 0.540504 1.720154 0.342681 -0.014739 0.317195 0.377545
5.066667 0.539764 1.731988 0.368013 -0.010850 0.275393 0.362929
5.100000 0.539823 1.738618 0.397068 -0.006626 0.234795 0.342661
5.133333 0.539912 1.744699 0.403696 -0.002057 0.196044 0.314956
5.166667 0.540033 1.750229 0.438549 0.002932 0.159395 0.281968
5.200000 0.540191 1.755208 0.428176 0.008553 0.125166 0.244976
5.233333 0.540191 1.757736 0.438363 0.015325 0.093935 0.205742
5.266667 0.540388 1.758588 0.432759 0.023754 0.066375 0.165293
5.300000 0.540633 1.758889 0.435004 0.034328 0.042296 0.123454
5.333333 0.541417 1.758822 0.437165 0.047449 0.021610 0.074819
5.366667 0.542765 1.758646 0.436174 0.063473 0.004188 0.012690
5.400000 0.544169 1.757928 0.441690 0.082394 -0.010198 -0.072756
5.433333 0.546432 1.757222 0.442793 0.104222 -0.022128 -0.188978
5.466667 0.548755 1.755977 0.437893 0.128992 -0.032370 -0.344726
5.500000 0.551138 1.754196 0.453996 0.157458 -0.041071 -0.539845
5.533333 0.555995 1.752547 0.440648 0.190251 -0.048401 -0.765690
5.566667 0.564951 1.751446 0.453774 0.227745 -0.054553 -1.015522
5.600000 0.573960 1.749813 0.447158 0.270511 -0.059662 -1.278389
5.633333 0.583013 1.747649 0.394632 0.318091 -0.063844 -1.545952
5.666667 0.592105 1.744957 0.294996 0.370012 -0.067121 -1.804474
5.700000 0.601228 1.741738 0.192366 0.424350 -0.069897 -2.045193
5.733333 0.610376 1.737993 0.087897 0.479733 -0.072377 -2.259324
5.766667 0.628584 1.735625 0.010804 0.534666 -0.074779 -2.438124
5.800000 0.646792 1.732734 -0.081299 0.587655 -0.077322 -2.574846
5.833333 0.673645 1.731619 -0.144923 0.637172 -0.080302 -2.667699
5.866667 0.700454 1.729977 -0.246606 0.681636 -0.083937 -2.719374
5.900000 0.727189 1.727808 -0.337128 0.720049 -0.088167 -2.733755
5.933333 0.753826 1.725109 -0.429311 0.750602 -0.093068 -2.720587
5.966667 0.780335 1.721878 -0.541123 0.772664 -0.098490 -2.682771
6.000000 0.806690 1.718115 -0.649292 0.785145 -0.104314 -2.622347
6.033333 0.832863 1.713819 -0.751473 0.788409 -0.110040 -2.530548
6.066667 0.861152 1.710275 -0.825376 0.782748 -0.115434 -2.405970
6.100000 0.889202 1.706195 -0.903218 0.768219 -0.120763 -2.244415
6.133333 0.916984 1.701576 -0.975521 0.745544 -0.126458 -2.042287
6.166667 0.944469 1.696419 -1.057998 0.714696 -0.133105 -1.803782
6.200000 0.970952 1.691684 -1.121871 0.676424 -0.141603 -1.541345
6.233333 0.995343 1.687404 -1.178352 0.630904 -0.153126 -1.273406
6.266667 1.016596 1.684183 -1.238008 0.578884 -0.168683 -1.009674
6.300000 1.037445 1.680413 -1.282499 0.522039 -0.188522 -0.766403
6.333333 1.052235 1.675672 -1.289967 0.462283 -0.212755 -0.555271
6.366667 1.066581 1.670375 -1.265372 0.401472 -0.241511 -0.388786
6.400000 1.080467 1.664517 -1.238260 0.341343 -0.274181 -0.268539
6.433333 1.087467 1.654071 -1.198105 0.283679 -0.309794 -0.196843
6.466667 1.093983 1.643063 -1.192772 0.229381 -0.347404 -0.175631
6.500000 1.100006 1.631497 -1.190202 0.178816 -0.386399 -0.198077
6.533333 1.102749 1.615733 -1.221808 0.131463 -0.426041 -0.254939
6.566667 1.104988 1.599419 -1.227061 0.086747 -0.465717 -0.329993
6.600000 1.106717 1.582562 -1.238991 0.043754 -0.505346 -0.412430
6.633333 1.107933 1.565169 -1.276570 0.001046 -0.545322 -0.487463
6.666667 1.108531 1.546855 -1.301452 -0.042337 -0.586006 -0.545367
6.700000 1.107878 1.527721 -1.324165 -0.087470 -0.627963 -0.582096
6.733333 1.106704 1.508075 -1.352314 -0.135050 -0.672013 -0.598173
6.766667 1.102608 1.486244 -1.364233 -0.185278 -0.718504 -0.599358
6.800000 1.095315 1.461615 -1.387673 -0.237936 -0.767474 -0.587406
6.833333 1.087504 1.436508 -1.407352 -0.292464 -0.818762 -0.569213
6.866667 1.076899 1.408851 -1.440518 -0.348015 -0.871878 -0.544531
6.900000 1.063680 1.378625 -1.430743 -0.403323 -0.925742 -0.514859
6.933333 1.048073 1.346186 -1.455761 -0.456847 -0.979009 -0.477930
6.966667 1.031985 1.313341 -1.471264 -0.507600 -1.030954 -0.428508
7.000000 1.012979 1.277084 -1.484734 -0.554652 -1.080900 -0.364357
7.033333 0.991382 1.237714 -1.510285 -0.596735 -1.128004 -0.278828
7.066667 0.969352 1.198015 -1.530429 -0.632754 -1.171827 -0.177672
7.100000 0.946910 1.158013 -1.534094 -0.662087 -1.212493 -0.061310
7.133333 0.922644 1.115556 -1.549523 -0.684047 -1.249989 0.063783
7.166667 0.898006 1.072857 -1.555708 -0.697791 -1.283841 0.186935
7.200000 0.872210 1.028828 -1.534327 -0.702943 -1.313722 0.295735
7.233333 0.846086 0.984622 -1.525944 -0.699815 -1.339642 0.374985
7.266667 0.820637 0.940109 -1.506200 -0.689239 -1.361479 0.419822
7.300000 0.795144 0.893539 -1.457380 -0.671581 -1.378316 0.423904
7.333333 0.770700 0.845336 -1.414917 -0.648197 -1.389791 0.384630
7.366667 0.747958 0.796341 -1.355779 -0.620434 -1.395001 0.303442
7.400000 0.728301 0.747107 -1.347229 -0.589741 -1.393095 0.195223
7.433333 0.708438 0.697907 -1.355913 -0.557158 -1.382527 0.077289
7.466667 0.693612 0.651501 -1.367514 -0.523738 -1.361671 -0.031477
7.500000 0.678605 0.605203 -1.381363 -0.491202 -1.329970 -0.111383
7.533333 0.663429 0.559046 -1.405072 -0.460600 -1.286647 -0.144520
7.566667 0.648093 0.513067 -1.423180 -0.433176 -1.232422 -0.114425
7.600000 0.632607 0.467298 -1.458951 -0.409549 -1.167971 -0.024935
7.633333 0.620767 0.427339 -1.494864 -0.391066 -1.095700 0.114133
7.666667 0.608794 0.387654 -1.520743 -0.378248 -1.018279 0.284363
7.700000 0.598545 0.356007 -1.523932 -0.371320 -0.938791 0.465362
7.733333 0.588174 0.324682 -1.482915 -0.370669 -0.860380 0.634182
7.766667 0.578550 0.300109 -1.421464 -0.376338 -0.785882 0.763614
7.800000 0.568647 0.280250 -1.346193 -0.388976 -0.718538 0.836911
7.833333 0.557724 0.263050 -1.288212 -0.407901 -0.659943 0.842821
7.866667 0.545434 0.247196 -1.237494 -0.432879 -0.611574 0.776781
7.900000 0.530542 0.230881 -1.175035 -0.463224 -0.573348 0.636149
7.933333 0.515563 0.214936 -1.146856 -0.497807 -0.545027 0.429534
7.966667 0.497265 0.197151 -1.133785 -0.535284 -0.525179 0.172959
8.000000 0.478903 0.179745 -1.151413 -0.573640 -0.511498 -0.116269
8.033333 0.460491 0.162722 -1.170925 -0.611668 -0.501934 -0.421373
8.066667 0.438762 0.145726 -1.188070 -0.647885 -0.494342 -0.722224
8.100000 0.417014 0.129124 -1.229677 -0.681433 -0.487405 -0.998613
8.133333 0.391072 0.112102 -1.259940 -0.711393 -0.479837 -1.241173
8.166667 0.365151 0.095487 -1.309146 -0.737610 -0.471404 -1.441823
8.200000 0.337990 0.079911 -1.383557 -0.760161 -0.462355 -1.593448
8.233333 0.310896 0.064750 -1.457262 -0.778901 -0.453135 -1.692610
8.266667 0.283892 0.050010 -1.516548 -0.794239 -0.444281 -1.744516
8.300000 0.257004 0.035695 -1.597879 -0.806333 -0.436314 -1.758310
8.333333 0.230254 0.021809 -1.682836 -0.815942 -0.429738 -1.735199
8.366667 0.202781 0.008383 -1.764388 -0.823193 -0.424578 -1.683488
8.400000 0.175496 -0.004607 -1.798486 -0.828299 -0.420649 -1.619214
8.433333 0.147806 -0.017708 -1.853594 -0.831493 -0.417716 -1.548238
8.466667 0.120196 -0.031230 -1.888221 -0.832658 -0.415313 -1.478465
8.500000 0.091086 -0.046051 -1.926204 -0.831470 -0.412581 -1.411437
8.533333 0.062269 -0.060417 -1.944362 -0.827409 -0.408687 -1.356153
8.566667 0.033771 -0.074323 -1.993692 -0.820041 -0.402657 -1.303252
8.600000 0.005621 -0.087762 -2.024244 -0.809090 -0.393784 -1.235258
8.633333 -0.022817 -0.102485 -2.106136 -0.794009 -0.381073 -1.142200
8.666667 -0.050021 -0.116605 -2.126853 -0.774493 -0.363937 -1.011101
8.700000 -0.076795 -0.130239 -2.191220 -0.750415 -0.342106 -0.829991
8.733333 -0.101543 -0.142101 -2.237906 -0.721615 -0.315413 -0.587677
8.766667 -0.125809 -0.153465 -2.252557 -0.688184 -0.284361 -0.302053
8.800000 -0.148723 -0.162804 -2.307646 -0.650157 -0.249478 0.010827
8.833333 -0.171106 -0.171637 -2.351737 -0.608278 -0.212023 0.335873
8.866667 -0.192935 -0.179961 -2.345046 -0.563071 -0.173037 0.665081
8.900000 -0.211636 -0.184395 -2.258894 -0.515249 -0.134167 0.973782
8.933333 -0.229739 -0.188318 -2.161159 -0.465470 -0.096841 1.239892
8.966667 -0.243364 -0.188855 -2.066866 -0.414604 -0.062476 1.459556
9.000000 -0.256354 -0.188888 -2.001517 -0.363380 -0.032229 1.622906
9.033333 -0.266629 -0.186889 -1.933891 -0.312556 -0.007049 1.720228
9.066667 -0.275005 -0.184427 -1.860812 -0.263399 0.012109 1.743810
9.100000 -0.281474 -0.182678 -1.836414 -0.217499 0.025474 1.714815
9.133333 -0.287261 -0.180452 -1.814977 -0.176848 0.033054 1.655846
9.166667 -0.292356 -0.177753 -1.728245 -0.142897 0.035710 1.587690
9.200000 -0.296751 -0.174588 -1.625011 -0.117489 0.034017 1.528581
9.233333 -0.297723 -0.173500 -1.564777 -0.101869 0.029124 1.493475
9.266667 -0.297980 -0.171955 -1.517388 -0.096536 0.022042 1.487378
9.300000 -0.296239 -0.172732 -1.526719 -0.101125 0.013394 1.500328
9.333333 -0.293776 -0.173059 -1.555045 -0.114552 0.003915 1.521830
9.366667 -0.293385 -0.173544 -1.518508 -0.135638 -0.006105 1.536153
9.400000 -0.296299 -0.173665 -1.430949 -0.162208 -0.016046 1.529278
9.433333 -0.302903 -0.173768 -1.336440 -0.191400 -0.025848 1.485458
9.466667 -0.313266 -0.174803 -1.264227 -0.219826 -0.035010 1.393965
9.500000 -0.322855 -0.175388 -1.174326 -0.244071 -0.043385 1.240336
9.533333 -0.335559 -0.177469 -1.116172 -0.260436 -0.050407 1.013673
9.566667 -0.347447 -0.179096 -1.069461 -0.265831 -0.055566 0.720028
9.600000 -0.360192 -0.182076 -1.029600 -0.257790 -0.058131 0.375792
9.633333 -0.372077 -0.184595 -0.992318 -0.235065 -0.056976 0.006829
9.666667 -0.383600 -0.188090 -0.994688 -0.197883 -0.051303 -0.363968
9.700000 -0.393417 -0.191433 -1.036973 -0.147229 -0.040152 -0.708612
9.733333 -0.402303 -0.194300 -1.114119 -0.085303 -0.023272 -1.001130
9.766667 -0.407059 -0.196644 -1.204537 -0.013979 -0.000195 -1.228537
9.800000 -0.407199 -0.198133 -1.290579 0.064117 0.028725 -1.383091
9.833333 -0.402928 -0.198562 -1.351139 0.146420 0.062685 -1.471585
9.866667 -0.394649 -0.196963 -1.422612 0.230699 0.100653 -1.495512
9.900000 -0.385374 -0.194867 -1.464085 0.315143 0.141586 -1.464571
9.933333 -0.372156 -0.189346 -1.511887 0.398270 0.184487 -1.391653
9.966667 -0.354458 -0.180118 -1.520544 0.478493 0.227790 -1.296233
10.000000 -0.335762 -0.170398 -1.557182 0.555460 0.270450 -1.198568
10.033333 -0.316071 -0.160192 -1.611182 0.629089 0.311589 -1.101176
10.066667 -0.295389 -0.149507 -1.661824 0.700220 0.350855 -1.019504
10.100000 -0.270108 -0.135942 -1.694000 0.769329 0.387726 -0.954973
10.133333 -0.243851 -0.121911 -1.697743 0.837307 0.422090 -0.911316
10.166667 -0.213059 -0.106256 -1.746770 0.904850 0.454281 -0.876859
10.200000 -0.181317 -0.090155 -1.746453 0.971877 0.484475 -0.849220
10.233333 -0.148640 -0.073619 -1.777268 1.038553 0.513020 -0.832340
10.266667 -0.115044 -0.056659 -1.797123 1.104043 0.539843 -0.818538
10.300000 -0.077470 -0.038116 -1.834842 1.167859 0.565175 -0.806029
10.333333 -0.036173 -0.018406 -1.862267 1.229187 0.589094 -0.791132
10.366667 0.005983 0.001692 -1.877508 1.288032 0.611734 -0.778994
10.400000 0.053466 0.023949 -1.935637 1.344265 0.633148 -0.760844
10.433333 0.101754 0.046563 -1.951867 1.397628 0.653244 -0.736631
10.466667 0.149878 0.068600 -1.970989 1.448370 0.672060 -0.708485
10.500000 0.198746 0.090962 -1.996293 1.496952 0.689630 -0.682142
10.533333 0.248327 0.113637 -2.031286 1.544506 0.706034 -0.655198
10.566667 0.301388 0.138068 -2.043404 1.591387 0.721117 -0.629898
10.600000 0.355099 0.162778 -2.057838 1.638696 0.735020 -0.615499
10.633333 0.409423 0.187750 -2.052897 1.687088 0.747719 -0.612991
10.666667 0.464328 0.212967 -2.094883 1.736947 0.759163 -0.619198
10.700000 0.522816 0.238788 -2.095351 1.788069 0.769079 -0.634581
10.733333 0.581810 0.264818 -2.128085 1.839464 0.777136 -0.662542
10.766667 0.645321 0.292245 -2.145041 1.890010 0.783096 -0.699266
10.800000 0.709850 0.318657 -2.171427 1.938160 0.786674 -0.737864
10.833333 0.774758 0.345223 -2.196158 1.982672 0.787807 -0.775101
10.866667 0.843271 0.371898 -2.216077 2.022039 0.786476 -0.814601
10.900000 0.915160 0.399182 -2.249286 2.055166 0.782878 -0.850197
10.933333 0.987281 0.426565 -2.288706 2.080964 0.777154 -0.881380
10.966667 1.059525 0.452974 -2.315808 2.098710 0.769621 -0.909246
11.000000 1.131739 0.478594 -2.339621 2.107800 0.760468 -0.937903
11.033333 1.203096 0.503108 -2.387148 2.107802 0.750009 -0.966056
11.066667 1.274479 0.527653 -2.415984 2.098428 0.738681 -0.991491
11.100000 1.345836 0.552215 -2.444112 2.079585 0.726875 -1.015749
11.133333 1.417118 0.576780 -2.463207 2.051729 0.715097 -1.041100
11.166667 1.487738 0.600652 -2.512477 2.015719 0.703701 -1.065142
11.200000 1.556392 0.623524 -2.532265 1.971279 0.693606 -1.087604
11.233333 1.624821 0.646355 -2.586170 1.917941 0.685482 -1.111807
11.266667 1.689732 0.668470 -2.626751 1.856485 0.679897 -1.140174
11.300000 1.750155 0.690082 -2.668270 1.787789 0.677415 -1.172446
11.333333 1.810223 0.711617 -2.701794 1.712469 0.678537 -1.205408
11.366667 1.869897 0.733064 -2.750833 1.630715 0.683701 -1.241316
11.400000 1.920801 0.754849 -2.771009 1.545567 0.692162 -1.278144
11.433333 1.971244 0.776523 -2.811959 1.460147 0.703263 -1.315864
11.466667 2.021198 0.798073 -2.864516 1.376339 0.716274 -1.351599
11.500000 2.070635 0.819489 -2.902609 1.295330 0.730387 -1.388213
11.533333 2.104928 0.847066 -2.945883 1.219522 0.744268 -1.424777
11.566667 2.138666 0.874480 -3.018112 1.151352 0.756637 -1.460253
11.600000 2.171838 0.901712 -3.070587 1.090794 0.766899 -1.494176
11.633333 2.204433 0.928745 -3.113931 1.037825 0.773732 -1.523734
11.666667 2.236443 0.955559 3.108530 0.992643 0.775342 -1.550562
11.700000 2.267856 0.982137 3.069204 0.955788 0.769976 -1.571693
11.733333 2.298665 1.008460 3.036067 0.925353 0.756940 -1.590665
11.766667 2.328861 1.034512 2.960328 0.899427 0.735549 -1.607618
11.800000 2.358435 1.060274 2.909852 0.876598 0.704860 -1.624492
11.833333 2.387380 1.085731 2.846537 0.855421 0.665392 -1.638647
11.866667 2.415689 1.110865 2.793496 0.834316 0.618626 -1.648380
11.900000 2.443354 1.135659 2.741971 0.811701 0.566051 -1.652449
11.933333 2.470368 1.160098 2.692625 0.787068 0.508566 -1.644807
11.966667 2.496884 1.175456 2.631778 0.759754 0.447774 -1.626846
12.000000 2.522266 1.184041 2.567495 0.729357 0.386288 -1.595412
12.033333 2.546979 1.192248 2.515150 0.695491 0.325992 -1.554327
12.066667 2.571020 1.200078 2.447231 0.658163 0.268465 -1.502703
12.100000 2.594382 1.207534 2.401488 0.617220 0.215313 -1.440249
12.133333 2.614784 1.211858 2.346968 0.572990 0.168508 -1.369070
12.166667 2.634503 1.215814 2.315111 0.526063 0.128674 -1.287405
12.200000 2.650957 1.218051 2.273302 0.477305 0.095279 -1.196654
12.233333 2.666731 1.219930 2.235881 0.427617 0.067841 -1.096831
12.266667 2.680101 1.220613 2.199292 0.377827 0.045827 -0.989392
12.300000 2.691074 1.220645 2.161018 0.329244 0.028664 -0.877961
12.333333 2.699432 1.220483 2.123384 0.282809 0.015228 -0.763951
12.366667 2.707137 1.219997 2.105587 0.239514 0.005028 -0.650607
12.400000 2.714199 1.219195 2.074346 0.199790 -0.002233 -0.539765
12.433333 2.718631 1.218462 2.073318 0.164169 -0.006994 -0.433626
12.466667 2.722445 1.217432 2.053845 0.132998 -0.009778 -0.334737
12.500000 2.725009 1.216819 2.058252 0.106220 -0.011189 -0.246583
12.533333 2.726967 1.216629 2.056998 0.083641 -0.011639 -0.171573
12.566667 2.728754 1.216825 2.057056 0.064779 -0.011634 -0.109360
12.600000 2.729981 1.216756 2.065092 0.049443 -0.011475 -0.061966
12.633333 2.730664 1.216430 2.058679 0.037197 -0.011317 -0.026961
12.666667 2.730818 1.215853 2.061428 0.027518 -0.011370 -0.005515
12.700000 2.731620 1.215636 2.054617 0.019898 -0.011709 0.008281
12.733333 2.731923 1.215183 2.055837 0.013985 -0.012303 0.015238
12.766667 2.731743 1.214501 2.068796 0.009619 -0.012933 0.017005
12.800000 2.732430 1.214326 2.071324 0.006409 -0.013518 0.016280
