t x y theta dxdt dydt dthetadt
0.000000 0.000000 0.000000 0.181269 0.150099 0.030707 0.235596
0.033333 0.005218 0.001035 0.172792 0.153566 0.031130 0.256436
0.066667 0.010683 0.002111 0.188820 0.156211 0.031441 0.293351
0.100000 0.016350 0.003225 0.179960 0.157711 0.031553 0.365602
0.133333 0.021976 0.004319 0.205858 0.157773 0.031377 0.502497
0.166667 0.027556 0.005393 0.221161 0.156247 0.030849 0.733348
0.200000 0.033136 0.006512 0.219513 0.153024 0.029861 1.079359
0.233333 0.038660 0.007607 0.235512 0.147944 0.028253 1.554732
0.266667 0.044062 0.008717 0.236138 0.140916 0.025839 2.163506
0.300000 0.049225 0.009786 0.251243 0.132031 0.022493 2.887334
0.333333 0.054023 0.010774 0.271739 0.121307 0.018011 3.695180
0.366667 0.058316 0.011616 0.344697 0.108739 0.012186 4.537848
0.400000 0.061937 0.012222 0.503156 0.094482 0.004947 5.372148
0.433333 0.064731 0.012484 0.764193 0.078881 -0.003629 6.136202
0.466667 0.067435 0.012717 1.104228 0.062314 -0.013301 6.762084
0.500000 0.070049 0.012919 1.461114 0.044989 -0.023832 7.193220
0.533333 0.071611 0.012411 1.707981 0.027285 -0.034722 7.392243
0.566667 0.072088 0.011087 2.042504 0.009590 -0.045423 7.342476
0.600000 0.071443 0.008834 2.378257 -0.007802 -0.055411 7.042327
0.633333 0.070706 0.006554 2.695395 -0.024806 -0.064279 6.522619
0.666667 0.068755 0.003149 2.983138 -0.041218 -0.071621 5.835412
0.700000 0.066715 -0.000277 -3.120334 -0.056709 -0.077090 5.047416
0.733333 0.064587 -0.003720 -2.993975 -0.071076 -0.080561 4.207391
0.766667 0.062374 -0.007176 -2.919878 -0.084248 -0.082032 3.370917
0.800000 0.059336 -0.010317 -2.867111 -0.096198 -0.081619 2.585882
0.833333 0.055543 -0.013114 -2.854955 -0.106756 -0.079398 1.887581
0.866667 0.051061 -0.015538 -2.836127 -0.115913 -0.075715 1.296591
0.900000 0.046511 -0.017963 -2.829807 -0.123679 -0.070846 0.816229
0.933333 0.041896 -0.020387 -2.825872 -0.130034 -0.065061 0.449265
0.966667 0.037223 -0.022807 -2.831273 -0.134875 -0.058571 0.184545
1.000000 0.032278 -0.024725 -2.828447 -0.138094 -0.051539 0.002770
1.033333 0.027284 -0.026636 -2.839718 -0.139684 -0.044115 -0.104255
1.066667 0.022238 -0.028017 -2.851585 -0.139603 -0.036249 -0.128761
1.100000 0.017155 -0.029387 -2.873659 -0.137834 -0.027949 -0.056933
1.133333 0.012257 -0.030207 -2.877787 -0.134383 -0.019223 0.147855
1.166667 0.007643 -0.030472 -2.900226 -0.129229 -0.010102 0.527908
1.200000 0.003008 -0.030724 -2.917043 -0.122441 -0.000609 1.125200
1.233333 -0.001145 -0.030398 -2.908162 -0.114132 0.009111 1.944963
1.266667 -0.005310 -0.030059 -2.919379 -0.104494 0.018878 2.439020
1.300000 -0.009482 -0.029710 -2.922789 -0.093754 0.028472 2.571194
1.333333 -0.012875 -0.028781 -2.933527 -0.082130 0.037704 2.271476
1.366667 -0.015476 -0.027276 -2.789765 -0.069923 0.046362 1.443081
1.400000 -0.017339 -0.025220 -2.494791 -0.057378 0.054172 -0.017989
1.433333 -0.018479 -0.022686 -2.154980 -0.044709 0.060927 -2.186316
1.466667 -0.019614 -0.020152 -1.611668 -0.032072 0.066424 -3.568075
1.500000 -0.020113 -0.017316 -1.026304 -0.019695 0.070487 -4.233624
1.533333 -0.020604 -0.014486 -0.509649 -0.007750 0.072970 -4.237880
1.566667 -0.020530 -0.011596 -0.093338 0.003628 0.073830 -3.587786
1.600000 -0.020450 -0.008719 0.249854 0.014358 0.073158 -2.252670
1.633333 -0.019870 -0.005946 0.533495 0.024384 0.071093 -0.190147
1.666667 -0.018808 -0.003342 0.792709 0.033615 0.067734 1.114251
1.700000 -0.017285 -0.000959 0.988654 0.042064 0.063240 1.765204
1.733333 -0.015347 0.001144 1.116160 0.049605 0.057783 1.874572
1.766667 -0.013017 0.002901 1.220820 0.056094 0.051458 1.517260
1.800000 -0.010692 0.004625 1.242450 0.061361 0.044296 0.746624
1.833333 -0.008376 0.006314 1.195732 0.065276 0.036355 -0.407295
1.866667 -0.005780 0.007379 1.045844 0.067767 0.027822 -1.412897
1.900000 -0.003198 0.008405 0.875417 0.068785 0.018827 -2.285489
1.933333 -0.000635 0.009390 0.718244 0.068448 0.009510 -3.046346
1.966667 0.002003 0.009705 0.632801 0.066987 0.000104 -3.708550
2.000000 0.004619 0.009338 0.517377 0.064526 -0.009119 -4.295238
2.033333 0.007205 0.008928 0.418302 0.061050 -0.017947 -4.823950
2.066667 0.009341 0.007865 0.285073 0.056587 -0.026254 -5.310138
2.100000 0.010829 0.006175 0.062924 0.051078 -0.033860 -5.747809
2.133333 0.012279 0.004443 -0.108412 0.044395 -0.040614 -6.133015
2.166667 0.013689 0.002669 -0.297671 0.036344 -0.046494 -6.444742
2.200000 0.015056 0.000855 -0.579137 0.026948 -0.051557 -6.652781
2.233333 0.016377 -0.000997 -0.891198 0.016448 -0.055833 -6.725829
2.266667 0.017651 -0.002886 -1.158595 0.004932 -0.059418 -6.643303
2.300000 0.018875 -0.004811 -1.467928 -0.007409 -0.062484 -6.406186
2.333333 0.018749 -0.006952 -1.746537 -0.020316 -0.065197 -6.017380
2.366667 0.017276 -0.009265 -1.972091 -0.033426 -0.067660 -5.499543
2.400000 0.015751 -0.011608 -2.179282 -0.046513 -0.069944 -4.887090
2.433333 0.012937 -0.014098 -2.317742 -0.059353 -0.072121 -4.223377
2.466667 0.010074 -0.016614 -2.401412 -0.071571 -0.074199 -3.544935
2.500000 0.007164 -0.019156 -2.459498 -0.082843 -0.076146 -2.887770
2.533333 0.004210 -0.021721 -2.511846 -0.092983 -0.077946 -2.281243
2.566667 0.001213 -0.024308 -2.558684 -0.102009 -0.079601 -1.744343
2.600000 -0.002567 -0.027010 -2.595440 -0.109814 -0.081090 -1.288134
2.633333 -0.006384 -0.029729 -2.607562 -0.116481 -0.082401 -0.910489
2.666667 -0.010728 -0.032558 -2.635413 -0.122074 -0.083511 -0.603470
