t x y theta dxdt dydt dthetadt
0.000000 0.000000 0.000000 -0.473322 0.003875 0.005116 -0.024541
0.033333 0.000403 -0.000333 -0.480338 0.004899 0.007933 -0.043192
0.066667 0.000377 -0.000922 -0.481172 0.006236 0.012600 -0.070523
0.100000 0.000360 -0.001210 -0.476797 0.007930 0.019798 -0.110610
0.133333 0.000469 -0.001008 -0.486651 0.009971 0.030029 -0.168042
0.166667 0.000701 -0.000590 -0.485979 0.012345 0.043864 -0.240001
0.200000 0.001067 0.000345 -0.492175 0.014956 0.062268 -0.322481
0.233333 0.001572 0.001809 -0.496501 0.017701 0.086487 -0.406826
0.266667 0.002199 0.003761 -0.479789 0.020430 0.117153 -0.490180
0.300000 0.002974 0.006267 -0.500263 0.022976 0.154868 -0.565403
0.333333 0.003901 0.009339 -0.531622 0.025184 0.200283 -0.625514
0.366667 0.004983 0.012990 -0.586716 0.026996 0.254369 -0.665610
0.400000 0.006014 0.022702 -0.635096 0.028609 0.317022 -0.682170
0.433333 0.007206 0.033008 -0.667357 0.030256 0.387352 -0.677461
0.466667 0.008566 0.043915 -0.686812 0.032248 0.464199 -0.648762
0.500000 0.010096 0.055426 -0.707436 0.034903 0.546411 -0.603186
0.533333 0.010889 0.073701 -0.721180 0.038882 0.632502 -0.549051
0.566667 0.011544 0.097721 -0.734816 0.044673 0.719840 -0.496460
0.600000 0.012069 0.126966 -0.757910 0.052521 0.806111 -0.458864
0.633333 0.012778 0.156796 -0.764322 0.062940 0.889709 -0.439799
0.666667 0.013677 0.187197 -0.752412 0.076417 0.969422 -0.447238
0.700000 0.015944 0.222611 -0.768361 0.093340 1.043669 -0.477912
0.733333 0.019363 0.262868 -0.752372 0.113541 1.111423 -0.531927
0.766667 0.022982 0.303640 -0.782373 0.136891 1.172894 -0.604956
0.800000 0.026802 0.344904 -0.801263 0.163308 1.228967 -0.686769
0.833333 0.030826 0.386635 -0.842458 0.192157 1.280224 -0.772058
0.866667 0.038221 0.431061 -0.859895 0.222537 1.327063 -0.849651
0.900000 0.045822 0.475903 -0.895174 0.253742 1.370627 -0.917829
0.933333 0.053628 0.521135 -0.943404 0.285164 1.412281 -0.964147
0.966667 0.065204 0.570074 -0.978414 0.315941 1.452931 -0.984181
1.000000 0.076980 0.619344 -1.021233 0.345257 1.493296 -0.978101
1.033333 0.088950 0.668912 -1.053164 0.372499 1.533884 -0.946605
1.066667 0.103576 0.721825 -1.089120 0.397375 1.575319 -0.896567
1.100000 0.118383 0.774969 -1.149601 0.419502 1.617854 -0.826257
1.133333 0.133364 0.828311 -1.160380 0.438583 1.661074 -0.747636
1.166667 0.149087 0.884766 -1.197342 0.454790 1.704082 -0.663922
1.200000 0.164967 0.941343 -1.190740 0.468247 1.745473 -0.583369
1.233333 0.180997 0.998004 -1.216774 0.479087 1.783761 -0.509834
1.266667 0.197332 1.058769 -1.215855 0.487585 1.817446 -0.444829
1.300000 0.213989 1.122493 -1.237110 0.493788 1.844137 -0.394757
1.333333 0.231013 1.188577 -1.240611 0.497762 1.861360 -0.356047
1.366667 0.248150 1.254566 -1.243844 0.499495 1.867708 -0.330409
1.400000 0.265389 1.320413 -1.259482 0.498673 1.861408 -0.307033
1.433333 0.282723 1.386070 -1.264736 0.495064 1.841361 -0.280259
1.466667 0.300016 1.452834 -1.268794 0.488270 1.806788 -0.246092
1.500000 0.316773 1.515740 -1.286405 0.478140 1.758495 -0.196541
1.533333 0.333457 1.577003 -1.308302 0.464402 1.697432 -0.123674
1.566667 0.349747 1.633931 -1.327461 0.446666 1.623920 -0.020620
1.600000 0.366096 1.690440 -1.328096 0.425262 1.539456 0.108972
1.633333 0.379959 1.738657 -1.324980 0.400698 1.445875 0.256711
1.666667 0.393872 1.786382 -1.321339 0.373412 1.344957 0.414872
1.700000 0.407834 1.833586 -1.320136 0.344046 1.238049 0.568685
1.733333 0.417680 1.870730 -1.302363 0.313879 1.127861 0.696848
1.766667 0.427574 1.907301 -1.254661 0.284228 1.017306 0.781481
1.800000 0.437519 1.943276 -1.234201 0.255999 0.909120 0.811929
1.833333 0.444338 1.972328 -1.162404 0.229714 0.805443 0.782628
1.866667 0.449219 1.994855 -1.081542 0.206137 0.708681 0.692800
1.900000 0.453459 2.011599 -1.028742 0.185878 0.621436 0.547036
1.933333 0.458178 2.024002 -0.977833 0.168657 0.544640 0.357938
1.966667 0.462983 2.035773 -0.976385 0.154173 0.479114 0.142214
2.000000 0.467457 2.047560 -1.014845 0.142189 0.425308 -0.084357
2.033333 0.472033 2.058723 -1.036439 0.132592 0.382891 -0.299926
2.066667 0.476719 2.069268 -1.075926 0.125090 0.349779 -0.485475
2.100000 0.481523 2.079198 -1.103281 0.119274 0.323019 -0.631412
2.133333 0.486452 2.088520 -1.141015 0.115148 0.299826 -0.731111
2.166667 0.488852 2.099438 -1.192272 0.113202 0.276662 -0.786727
2.200000 0.491397 2.109756 -1.229482 0.114085 0.249675 -0.805725
2.233333 0.494097 2.119478 -1.256586 0.118486 0.215727 -0.800878
2.266667 0.496963 2.128609 -1.271712 0.126869 0.173807 -0.788958
2.300000 0.500007 2.137152 -1.291869 0.139756 0.123341 -0.773520
2.333333 0.503240 2.145115 -1.308900 0.157632 0.064074 -0.759662
2.366667 0.506673 2.152502 -1.312729 0.180037 -0.002810 -0.750844
2.400000 0.512640 2.149550 -1.318073 0.205808 -0.074459 -0.747809
2.433333 0.518832 2.146045 -1.367318 0.233645 -0.147768 -0.744838
2.466667 0.525257 2.142004 -1.400356 0.262249 -0.220078 -0.734423
2.500000 0.535125 2.130641 -1.445626 0.290053 -0.288167 -0.713367
2.533333 0.547969 2.113750 -1.471353 0.315262 -0.348395 -0.682396
2.566667 0.561067 2.096395 -1.493164 0.336265 -0.397384 -0.638504
2.600000 0.574423 2.078608 -1.523188 0.352077 -0.433571 -0.578655
2.633333 0.588039 2.060418 -1.549883 0.361928 -0.455620 -0.513539
2.666667 0.601918 2.041856 -1.552660 0.365425 -0.462682 -0.451310
2.700000 0.616552 2.022120 -1.564438 0.362704 -0.454760 -0.399226
2.733333 0.630392 2.002809 -1.577153 0.354595 -0.432605 -0.357789
2.766667 0.642924 1.986184 -1.564955 0.342744 -0.397800 -0.331087
2.800000 0.653462 1.973701 -1.571832 0.329045 -0.352159 -0.320990
2.833333 0.664277 1.960987 -1.569926 0.315369 -0.297819 -0.319964
2.866667 0.675379 1.948066 -1.580557 0.303522 -0.236928 -0.317507
2.900000 0.684082 1.939307 -1.588170 0.295284 -0.172016 -0.310818
2.933333 0.691066 1.934762 -1.607995 0.292108 -0.105696 -0.296987
2.966667 0.697723 1.933420 -1.645384 0.294677 -0.040457 -0.266915
3.000000 0.704607 1.935111 -1.678765 0.303129 0.022041 -0.214962
3.033333 0.712220 1.939342 -1.676774 0.317645 0.079941 -0.141460
3.066667 0.721877 1.945495 -1.679566 0.338035 0.131161 -0.054014
3.100000 0.734169 1.954198 -1.680066 0.363524 0.174110 0.045282
3.133333 0.746818 1.962778 -1.681637 0.392806 0.207553 0.145372
3.166667 0.759830 1.971235 -1.672135 0.424693 0.230819 0.225743
3.200000 0.774509 1.981502 -1.644124 0.458060 0.243250 0.266260
3.233333 0.789562 1.991645 -1.637749 0.491335 0.245132 0.254234
3.266667 0.807374 2.002727 -1.617919 0.522802 0.237256 0.183139
3.300000 0.826135 2.013547 -1.585715 0.550994 0.221262 0.046308
3.333333 0.845280 2.024236 -1.550981 0.574886 0.199335 -0.149770
3.366667 0.866411 2.031656 -1.527119 0.593421 0.173639 -0.387822
3.400000 0.887930 2.038942 -1.513254 0.605771 0.146396 -0.648558
3.433333 0.910647 2.042413 -1.524700 0.611640 0.119720 -0.911097
3.466667 0.933464 2.041944 -1.589533 0.611893 0.095965 -1.157883
3.500000 0.956670 2.041353 -1.674321 0.607795 0.076718 -1.365530
3.533333 0.980264 2.040648 -1.757002 0.600617 0.062932 -1.519512
3.566667 1.001287 2.039449 -1.866741 0.591958 0.055163 -1.609371
3.600000 1.018644 2.039081 -1.930546 0.583649 0.053723 -1.627991
3.633333 1.034321 2.040219 -2.014248 0.577580 0.058136 -1.574616
3.666667 1.050653 2.043416 -2.067806 0.574050 0.066919 -1.452763
3.700000 1.067395 2.046528 -2.094865 0.572481 0.078545 -1.276114
3.733333 1.084553 2.049557 -2.138982 0.571898 0.091493 -1.057671
3.766667 1.102136 2.052505 -2.153987 0.571029 0.104145 -0.822248
3.800000 1.122568 2.056246 -2.192054 0.567722 0.114965 -0.586761
3.833333 1.144337 2.060586 -2.217101 0.559522 0.122928 -0.371070
3.866667 1.167415 2.065381 -2.238760 0.545539 0.127854 -0.187222
3.900000 1.188649 2.071277 -2.230581 0.526391 0.129712 -0.043527
3.933333 1.210327 2.077101 -2.214254 0.503560 0.128728 0.054340
3.966667 1.232454 2.082852 -2.179890 0.478957 0.125448 0.114201
4.000000 1.248051 2.088100 -2.138473 0.455998 0.120493 0.133959
4.033333 1.258081 2.092431 -2.094347 0.438722 0.114579 0.118453
4.066667 1.265319 2.095716 -2.084151 0.430753 0.108332 0.071704
4.100000 1.272430 2.097734 -2.110149 0.434411 0.102506 0.004453
4.133333 1.280066 2.099679 -2.132982 0.451251 0.097682 -0.073293
4.166667 1.290395 2.101486 -2.156655 0.482404 0.094384 -0.153514
4.200000 1.303707 2.103998 -2.159679 0.527058 0.092984 -0.222556
4.233333 1.320376 2.107041 -2.168604 0.583179 0.093543 -0.271621
4.266667 1.340511 2.110576 -2.172778 0.647705 0.095760 -0.296509
4.300000 1.364413 2.113922 -2.184436 0.717617 0.099099 -0.302348
4.333333 1.391100 2.116861 -2.217866 0.790079 0.103077 -0.292272
4.366667 1.420262 2.120084 -2.230972 0.862016 0.107130 -0.271412
4.400000 1.452189 2.124274 -2.230237 0.931303 0.110720 -0.245619
4.433333 1.484719 2.128410 -2.232752 0.996698 0.113509 -0.217580
4.466667 1.517848 2.132493 -2.230793 1.058044 0.115412 -0.190991
4.500000 1.555786 2.136704 -2.239282 1.115549 0.116427 -0.164009
4.533333 1.594312 2.140862 -2.243391 1.169529 0.116530 -0.141032
4.566667 1.636280 2.144950 -2.262574 1.220552 0.115778 -0.121483
4.600000 1.678815 2.148985 -2.253897 1.269452 0.114388 -0.106741
4.633333 1.721905 2.152966 -2.263052 1.316690 0.112526 -0.098645
4.666667 1.767080 2.156685 -2.263969 1.362054 0.110341 -0.094527
4.700000 1.812782 2.160350 -2.262274 1.405517 0.107982 -0.094844
4.733333 1.858554 2.163680 -2.259070 1.447036 0.105635 -0.095746
4.766667 1.907632 2.166967 -2.257126 1.486921 0.103401 -0.101758
4.800000 1.959008 2.170124 -2.264342 1.525044 0.101256 -0.110819
4.833333 2.012387 2.173466 -2.269186 1.561338 0.099146 -0.122734
4.866667 2.066200 2.176754 -2.285857 1.596240 0.096953 -0.138543
4.900000 2.120425 2.179986 -2.283678 1.629968 0.094562 -0.160408
4.933333 2.175475 2.183292 -2.285542 1.662644 0.091784 -0.187827
4.966667 2.231878 2.186503 -2.297586 1.694029 0.088486 -0.216947
5.000000 2.288619 2.189655 -2.297674 1.724168 0.084542 -0.248043
5.033333 2.345672 2.192749 -2.296686 1.753206 0.079897 -0.280028
5.066667 2.403012 2.195783 -2.304928 1.781256 0.074541 -0.312314
5.100000 2.463803 2.198121 -2.329344 1.808162 0.068521 -0.339312
5.133333 2.524824 2.200399 -2.335392 1.834029 0.061957 -0.361268
5.166667 2.587464 2.202419 -2.348116 1.858992 0.055048 -0.374264
5.200000 2.651420 2.204058 -2.366464 1.883060 0.048006 -0.378345
5.233333 2.715511 2.205638 -2.395259 1.906317 0.041051 -0.371319
5.266667 2.779874 2.206972 -2.401433 1.928362 0.034441 -0.353750
5.300000 2.844601 2.207535 -2.441342 1.949301 0.028388 -0.325840
5.333333 2.908625 2.208146 -2.431838 1.969201 0.023058 -0.290060
5.366667 2.972651 2.208702 -2.430681 1.988568 0.018562 -0.252376
5.400000 3.040044 2.208899 -2.436047 2.007756 0.014989 -0.213603
5.433333 3.107367 2.209043 -2.454644 2.026948 0.012345 -0.177665
5.466667 3.176699 2.209137 -2.460811 2.046462 0.010575 -0.144603
5.500000 3.245883 2.209181 -2.455889 2.066398 0.009561 -0.120895
5.533333 3.314878 2.209176 -2.456758 2.086222 0.009176 -0.101767
5.566667 3.384659 2.209632 -2.451026 2.104676 0.009200 -0.084835
5.600000 3.454171 2.210041 -2.456565 2.121004 0.009319 -0.071786
5.633333 3.523371 2.210404 -2.456261 2.134537 0.009259 -0.064009
5.666667 3.595511 2.210628 -2.472342 2.144672 0.008771 -0.060557
5.700000 3.670377 2.211199 -2.479621 2.150524 0.007633 -0.059215
5.733333 3.744800 2.211728 -2.469410 2.151828 0.005685 -0.065437
5.766667 3.818731 2.212215 -2.466207 2.148175 0.002812 -0.081757
5.800000 3.892123 2.212659 -2.474454 2.138818 -0.000928 -0.106846
5.833333 3.964930 2.213061 -2.472683 2.123014 -0.005479 -0.138114
5.866667 4.035430 2.212943 -2.467308 2.100539 -0.010760 -0.179168
5.900000 4.105253 2.212784 -2.467490 2.071317 -0.016626 -0.225784
5.933333 4.174712 2.211716 -2.479585 2.034619 -0.022876 -0.272676
5.966667 4.243405 2.210609 -2.486885 1.990788 -0.029209 -0.313643
6.000000 4.311286 2.209464 -2.496398 1.940206 -0.035392 -0.346742
6.033333 4.378313 2.208282 -2.523609 1.883260 -0.041195 -0.367040
6.066667 4.444440 2.207064 -2.540777 1.819287 -0.046418 -0.365300
6.100000 4.502707 2.204932 -2.571368 1.748063 -0.050754 -0.341669
6.133333 4.559996 2.202766 -2.592369 1.669875 -0.054056 -0.296218
6.166667 4.616272 2.200568 -2.596501 1.583925 -0.056179 -0.232820
6.200000 4.671502 2.198340 -2.619219 1.489421 -0.056979 -0.149521
6.233333 4.721125 2.196058 -2.605421 1.385957 -0.056313 -0.055106
6.266667 4.763715 2.193996 -2.615068 1.274776 -0.054100 0.042121
6.300000 4.805172 2.191907 -2.609644 1.156500 -0.050534 0.134296
6.333333 4.845475 2.189793 -2.614797 1.032231 -0.045754 0.215693
6.366667 4.884602 2.187656 -2.587012 0.904189 -0.040065 0.280560
6.400000 4.916487 2.185985 -2.556078 0.775276 -0.033825 0.318261
6.433333 4.939490 2.185039 -2.540552 0.648476 -0.027497 0.329609
6.466667 4.954804 2.184394 -2.530137 0.526020 -0.021459 0.310005
6.500000 4.962683 2.184592 -2.521479 0.411322 -0.015935 0.264509
6.533333 4.969359 2.184760 -2.499294 0.307407 -0.011157 0.196772
6.566667 4.974841 2.184899 -2.475024 0.216393 -0.007136 0.119230
6.600000 4.979141 2.185009 -2.460016 0.139027 -0.003775 0.049233
6.633333 4.977712 2.185078 -2.470702 0.074785 -0.000751 0.001046
6.666667 4.974186 2.185340 -2.484183 0.021968 0.002159 -0.006452
6.700000 4.970373 2.185312 -2.512574 -0.022744 0.005111 0.037501
6.733333 4.967566 2.185115 -2.523819 -0.062947 0.008197 0.137416
6.766667 4.965987 2.184398 -2.532586 -0.101902 0.011311 0.288597
6.800000 4.965737 2.184022 -2.576165 -0.142392 0.014267 0.478329
6.833333 4.964081 2.184660 -2.585104 -0.186091 0.016651 0.685207
6.866667 4.961359 2.185267 -2.567204 -0.232994 0.018170 0.885706
6.900000 4.954798 2.187115 -2.518811 -0.281331 0.018585 1.055668
6.933333 4.947198 2.188927 -2.424895 -0.328346 0.017922 1.174005
6.966667 4.934499 2.190899 -2.323445 -0.370064 0.016314 1.222138
7.000000 4.917709 2.192225 -2.243030 -0.401856 0.014002 1.189420
7.033333 4.897894 2.192783 -2.161350 -0.419597 0.011486 1.078031
7.066667 4.876959 2.192179 -2.118695 -0.420497 0.009328 0.898677
7.100000 4.855104 2.191525 -2.079421 -0.403594 0.008136 0.668897
7.133333 4.832356 2.190820 -2.075570 -0.369536 0.008258 0.416714
7.166667 4.812652 2.190075 -2.092805 -0.321632 0.009929 0.177770
7.200000 4.799025 2.189038 -2.115407 -0.265107 0.013137 -0.017677
7.233333 4.791226 2.188727 -2.119190 -0.205736 0.017596 -0.148322
7.266667 4.789854 2.189630 -2.166237 -0.149355 0.022703 -0.201412
7.300000 4.796339 2.191576 -2.215782 -0.101729 0.027723 -0.171577
7.333333 4.802008 2.193478 -2.247161 -0.067878 0.031822 -0.067530
7.366667 4.806855 2.195331 -2.268065 -0.051403 0.034185 0.093653
