t x y theta dxdt dydt dthetadt
0.000000 0.000000 0.000000 -0.350342 0.013689 0.033303 -0.002213
0.033333 0.000535 0.000920 -0.353493 0.015052 0.037963 -0.002089
0.066667 0.001150 0.001959 -0.355653 0.016535 0.043557 0.000895
0.100000 0.001719 0.003267 -0.347426 0.018165 0.050244 0.020224
0.133333 0.002379 0.004745 -0.347243 0.019977 0.058186 0.080846
0.166667 0.002989 0.006506 -0.343958 0.021979 0.067501 0.212088
0.200000 0.003546 0.008557 -0.353400 0.024179 0.078337 0.440628
0.233333 0.004218 0.010959 -0.343036 0.026546 0.090738 0.791397
0.266667 0.005011 0.013769 -0.356532 0.029004 0.104636 1.284119
0.300000 0.005960 0.017065 -0.356793 0.031460 0.120162 1.908067
0.333333 0.007070 0.020922 -0.344604 0.033771 0.137518 2.628069
0.366667 0.008363 0.025481 -0.348306 0.035787 0.156913 3.397734
0.400000 0.009878 0.030843 -0.331028 0.037327 0.178328 4.166181
0.433333 0.011314 0.036535 -0.142610 0.038254 0.201802 4.873907
0.466667 0.012923 0.043325 0.150273 0.038451 0.227374 5.448535
0.500000 0.014445 0.050452 0.485377 0.037890 0.255010 5.834562
0.533333 0.015946 0.059215 0.825507 0.036608 0.284247 5.988456
0.566667 0.017348 0.068321 1.128653 0.034683 0.314687 5.882816
0.600000 0.018648 0.077769 1.399811 0.032252 0.346115 5.501146
0.633333 0.019743 0.089759 1.625080 0.029506 0.378356 4.862307
0.666667 0.020583 0.104668 1.805313 0.026734 0.411359 4.020992
0.700000 0.021306 0.119914 1.916169 0.024191 0.444937 3.045830
0.733333 0.021906 0.135492 2.006419 0.022111 0.479315 2.017593
0.766667 0.022380 0.151396 2.066935 0.020710 0.514686 1.007965
0.800000 0.022722 0.167622 2.041163 0.020175 0.551198 0.089066
0.833333 0.023316 0.187334 1.981084 0.020553 0.588843 -0.694289
0.866667 0.023768 0.207352 1.842246 0.021731 0.627536 -1.314600
0.900000 0.024074 0.227666 1.713842 0.023512 0.666998 -1.763950
0.933333 0.024229 0.248267 1.583444 0.025692 0.706842 -2.047162
0.966667 0.024967 0.271880 1.486457 0.028007 0.746454 -2.174294
1.000000 0.026228 0.298395 1.401032 0.030133 0.784997 -2.171066
1.033333 0.028005 0.327894 1.319546 0.031766 0.821716 -2.062075
1.066667 0.029607 0.357620 1.253083 0.032672 0.855863 -1.883812
1.100000 0.031025 0.387554 1.196152 0.032671 0.887004 -1.665941
1.133333 0.032253 0.417677 1.159723 0.031583 0.914710 -1.437184
1.166667 0.033656 0.450305 1.120821 0.029324 0.938814 -1.218703
1.200000 0.034853 0.483080 1.099318 0.025922 0.959594 -1.022488
1.233333 0.035839 0.515978 1.076426 0.021515 0.977473 -0.857110
1.266667 0.036604 0.548977 1.053691 0.016240 0.992877 -0.721242
1.300000 0.037142 0.582054 1.032654 0.010244 1.006063 -0.614482
1.333333 0.037445 0.615186 1.018839 0.003644 1.017264 -0.531716
1.366667 0.037549 0.649830 1.006808 -0.003475 1.026698 -0.470362
1.400000 0.037405 0.684483 1.002768 -0.011123 1.034294 -0.427792
1.433333 0.036967 0.720129 0.993240 -0.019398 1.039702 -0.400872
1.466667 0.036266 0.755736 0.984185 -0.028454 1.042456 -0.388181
1.500000 0.035296 0.791277 0.960693 -0.038445 1.042178 -0.384187
1.533333 0.034051 0.826728 0.949180 -0.049468 1.038554 -0.388176
1.566667 0.032523 0.862064 0.941169 -0.061665 1.031221 -0.398079
1.600000 0.030707 0.897260 0.941868 -0.075194 1.019734 -0.410371
1.633333 0.028596 0.932293 0.914941 -0.090243 1.003734 -0.422591
1.666667 0.025854 0.966764 0.909589 -0.106869 0.983136 -0.432017
1.700000 0.022427 1.000398 0.883425 -0.125094 0.957906 -0.439198
1.733333 0.018246 1.032940 0.859260 -0.144928 0.928060 -0.438628
1.766667 0.013249 1.064101 0.847661 -0.166372 0.893542 -0.425905
1.800000 0.007310 1.093592 0.840113 -0.189393 0.854384 -0.397666
1.833333 0.001048 1.122791 0.823819 -0.213779 0.810985 -0.353688
1.866667 -0.005538 1.151679 0.810415 -0.239423 0.763571 -0.295175
1.900000 -0.013445 1.177722 0.783560 -0.266195 0.712479 -0.221889
1.933333 -0.022794 1.200669 0.776328 -0.294100 0.657753 -0.144200
1.966667 -0.033773 1.220012 0.759902 -0.322868 0.600140 -0.067602
2.000000 -0.045077 1.238997 0.766801 -0.352089 0.540774 -0.002448
2.033333 -0.056704 1.257617 0.754324 -0.381567 0.480231 0.047447
2.066667 -0.068653 1.275868 0.783993 -0.411174 0.418853 0.078394
2.100000 -0.082885 1.288792 0.801662 -0.440837 0.356777 0.085993
2.133333 -0.099463 1.296264 0.838747 -0.470242 0.294699 0.071872
2.166667 -0.116348 1.303369 0.848170 -0.499417 0.232453 0.034717
2.200000 -0.133531 1.310113 0.843346 -0.528506 0.169567 -0.018122
2.233333 -0.151006 1.316505 0.839499 -0.557437 0.106149 -0.084934
2.266667 -0.170586 1.317963 0.817393 -0.585800 0.043223 -0.158441
2.300000 -0.190439 1.319090 0.812430 -0.613257 -0.018302 -0.232568
2.333333 -0.210555 1.319902 0.792280 -0.639710 -0.078209 -0.296810
2.366667 -0.232215 1.316929 0.774954 -0.664844 -0.135886 -0.344891
2.400000 -0.255258 1.310480 0.765269 -0.688248 -0.190458 -0.376547
2.433333 -0.279540 1.300769 0.762463 -0.709494 -0.241212 -0.388993
2.466667 -0.305061 1.287896 0.735494 -0.728408 -0.288313 -0.383865
2.500000 -0.330780 1.274818 0.722826 -0.744738 -0.331771 -0.363395
2.533333 -0.356681 1.261565 0.707457 -0.758131 -0.371062 -0.334040
2.566667 -0.382750 1.248169 0.688740 -0.768353 -0.405933 -0.298912
2.600000 -0.408969 1.234660 0.666658 -0.775360 -0.436664 -0.259113
2.633333 -0.435324 1.221069 0.670671 -0.779372 -0.463810 -0.218256
2.666667 -0.461914 1.205298 0.663315 -0.780742 -0.487675 -0.179572
2.700000 -0.488577 1.187505 0.665678 -0.779828 -0.508400 -0.145056
2.733333 -0.515328 1.169730 0.665113 -0.777002 -0.526307 -0.116165
2.766667 -0.541619 1.150612 0.670834 -0.772590 -0.541222 -0.097495
2.800000 -0.567232 1.130504 0.663634 -0.766681 -0.552352 -0.096667
2.833333 -0.592886 1.110527 0.662622 -0.759240 -0.558771 -0.117910
2.866667 -0.618567 1.090721 0.659390 -0.749885 -0.559441 -0.165752
2.900000 -0.642979 1.070925 0.664803 -0.738340 -0.553644 -0.246787
2.933333 -0.667391 1.051377 0.658301 -0.724112 -0.540328 -0.368457
2.966667 -0.691791 1.032118 0.650854 -0.706901 -0.519148 -0.532960
3.000000 -0.716167 1.013187 0.644271 -0.686699 -0.490484 -0.733400
3.033333 -0.740505 0.994621 0.636998 -0.663499 -0.454721 -0.967206
3.066667 -0.764794 0.976460 0.630450 -0.637723 -0.412724 -1.234410
3.100000 -0.786678 0.961448 0.609583 -0.609613 -0.365168 -1.529283
3.133333 -0.806049 0.950119 0.532971 -0.579911 -0.313430 -1.836994
3.166667 -0.825343 0.939300 0.449758 -0.549214 -0.258546 -2.140666
3.200000 -0.841943 0.932889 0.373980 -0.518190 -0.201522 -2.426480
3.233333 -0.858456 0.927044 0.269338 -0.487444 -0.143157 -2.664177
3.266667 -0.872222 0.925915 0.149413 -0.457538 -0.084088 -2.813428
3.300000 -0.885898 0.925400 0.038293 -0.429086 -0.025045 -2.838661
3.333333 -0.899483 0.925518 -0.039939 -0.402352 0.033759 -2.721266
3.366667 -0.912978 0.926289 -0.169312 -0.377590 0.092284 -2.447333
3.400000 -0.926384 0.927733 -0.322093 -0.354616 0.151131 -2.012784
3.433333 -0.937690 0.933264 -0.484699 -0.333538 0.210375 -1.436308
3.466667 -0.947155 0.942661 -0.604189 -0.314231 0.270313 -0.758339
3.500000 -0.956539 0.952775 -0.665661 -0.296569 0.331477 -0.025404
3.533333 -0.965847 0.963617 -0.649469 -0.280504 0.394047 0.716112
3.566667 -0.974274 0.977687 -0.553020 -0.266071 0.457663 1.405545
3.600000 -0.982112 0.994760 -0.408900 -0.253515 0.521610 1.985557
3.633333 -0.989893 1.012580 -0.266600 -0.242698 0.585605 2.406433
3.666667 -0.997476 1.033213 -0.093839 -0.233418 0.649213 2.638978
3.700000 -1.004926 1.056597 0.090879 -0.225533 0.711481 2.667725
3.733333 -1.012341 1.080727 0.242603 -0.218857 0.771728 2.498506
3.766667 -1.019591 1.107650 0.380027 -0.213069 0.829685 2.162337
3.800000 -1.026605 1.137408 0.449637 -0.207864 0.885022 1.703943
3.833333 -1.033252 1.170020 0.478430 -0.203124 0.937146 1.178652
3.866667 -1.039898 1.203346 0.482863 -0.198853 0.985732 0.642169
3.900000 -1.046551 1.237375 0.457774 -0.195047 1.030957 0.148756
3.933333 -1.052642 1.273993 0.430899 -0.191861 1.072639 -0.263364
3.966667 -1.058760 1.311283 0.375581 -0.189498 1.110736 -0.565363
4.000000 -1.064913 1.349231 0.312148 -0.188206 1.145403 -0.744343
4.033333 -1.071110 1.387818 0.238390 -0.188167 1.177104 -0.800049
4.066667 -1.076951 1.428230 0.185567 -0.189570 1.206019 -0.740375
4.100000 -1.082856 1.469246 0.138016 -0.192616 1.232159 -0.580094
4.133333 -1.088697 1.511436 0.097848 -0.197367 1.255898 -0.332686
4.166667 -1.094666 1.554489 0.095301 -0.203892 1.277415 -0.023496
4.200000 -1.100957 1.598174 0.106696 -0.212180 1.296838 0.325478
4.233333 -1.107779 1.642240 0.125553 -0.222276 1.314197 0.687987
4.266667 -1.115267 1.686763 0.160012 -0.234184 1.329786 1.032858
4.300000 -1.122877 1.731761 0.202220 -0.247831 1.344003 1.325127
4.333333 -1.131423 1.776896 0.245004 -0.263041 1.357298 1.532620
4.366667 -1.140107 1.822460 0.309220 -0.279643 1.370175 1.637324
4.400000 -1.148937 1.868429 0.411818 -0.297475 1.383118 1.622115
4.433333 -1.158844 1.914459 0.533354 -0.316299 1.396571 1.483450
4.466667 -1.169800 1.960659 0.658623 -0.335816 1.410778 1.229771
4.500000 -1.180920 2.007193 0.731982 -0.355791 1.425869 0.883213
4.533333 -1.193037 2.054349 0.801589 -0.376149 1.441728 0.465030
4.566667 -1.206058 2.102280 0.812776 -0.396751 1.458170 0.003673
4.600000 -1.219914 2.151098 0.777026 -0.417364 1.474883 -0.463727
4.633333 -1.234500 2.200852 0.693888 -0.437786 1.491424 -0.898909
4.666667 -1.249760 2.251518 0.620132 -0.458096 1.507274 -1.268813
4.700000 -1.265201 2.302361 0.522469 -0.478257 1.521914 -1.550490
4.733333 -1.281354 2.353920 0.429798 -0.498119 1.534882 -1.721552
4.766667 -1.298300 2.406006 0.355493 -0.517600 1.545767 -1.780750
4.800000 -1.315426 2.458182 0.286233 -0.536773 1.554311 -1.738148
4.833333 -1.333670 2.510773 0.205428 -0.555699 1.560406 -1.617521
4.866667 -1.353209 2.563579 0.131582 -0.574031 1.564149 -1.443103
4.900000 -1.372921 2.616381 0.084502 -0.591500 1.565669 -1.241770
4.933333 -1.392802 2.669148 0.045564 -0.607950 1.565183 -1.040955
4.966667 -1.412849 2.721849 0.037576 -0.623269 1.562934 -0.858194
5.000000 -1.435001 2.773939 0.041671 -0.637127 1.559159 -0.708555
5.033333 -1.457308 2.825900 0.036407 -0.649308 1.554096 -0.597537
5.066667 -1.479763 2.877701 0.042040 -0.659904 1.547914 -0.532512
5.100000 -1.502360 2.929310 0.028061 -0.669136 1.540773 -0.510120
5.133333 -1.525092 2.980697 0.026941 -0.677184 1.532786 -0.526825
5.166667 -1.547951 3.031830 0.006953 -0.684175 1.524033 -0.573276
5.200000 -1.570932 3.082678 -0.007451 -0.690657 1.514485 -0.637929
5.233333 -1.594026 3.133211 -0.038084 -0.697098 1.504086 -0.711498
5.266667 -1.617227 3.183396 -0.066171 -0.703947 1.492732 -0.779822
5.300000 -1.640527 3.233204 -0.105650 -0.711451 1.480299 -0.836024
5.333333 -1.663919 3.282603 -0.142925 -0.719859 1.466663 -0.869993
5.366667 -1.687395 3.331563 -0.167683 -0.729420 1.451702 -0.881046
5.400000 -1.710948 3.380053 -0.209480 -0.740030 1.435381 -0.867884
5.433333 -1.736100 3.427922 -0.242633 -0.751480 1.417621 -0.831439
5.466667 -1.761311 3.475260 -0.277954 -0.763419 1.398407 -0.776509
5.500000 -1.786573 3.522037 -0.309005 -0.775502 1.377736 -0.707050
5.533333 -1.812991 3.567961 -0.335782 -0.787295 1.355625 -0.631037
5.566667 -1.839438 3.613265 -0.354780 -0.798341 1.332020 -0.552174
5.600000 -1.866752 3.657540 -0.367239 -0.808207 1.306880 -0.475998
5.633333 -1.894772 3.700648 -0.378983 -0.816575 1.280207 -0.406468
5.666667 -1.922787 3.743051 -0.374195 -0.823161 1.251903 -0.347165
5.700000 -1.950783 3.784722 -0.381366 -0.827694 1.221878 -0.300444
5.733333 -1.978746 3.825634 -0.390979 -0.830092 1.189999 -0.266473
5.766667 -2.006918 3.865098 -0.392538 -0.830232 1.156250 -0.244563
5.800000 -2.035032 3.903751 -0.406749 -0.828067 1.120467 -0.232904
5.833333 -2.063066 3.940817 -0.410617 -0.823572 1.082499 -0.229322
5.866667 -2.091017 3.977023 -0.414799 -0.816729 1.042258 -0.229692
5.900000 -2.118629 4.011457 -0.431972 -0.807635 0.999824 -0.230254
5.933333 -2.146132 4.044984 -0.434161 -0.796232 0.955222 -0.229214
5.966667 -2.173019 4.076557 -0.441844 -0.782653 0.908559 -0.224629
6.000000 -2.199311 4.106318 -0.453438 -0.767080 0.860154 -0.216017
6.033333 -2.224892 4.134181 -0.462250 -0.749735 0.810361 -0.202929
6.066667 -2.250317 4.161059 -0.470734 -0.730897 0.759578 -0.185998
6.100000 -2.274824 4.185893 -0.477972 -0.710822 0.708067 -0.167871
6.133333 -2.298325 4.208636 -0.482102 -0.689920 0.656286 -0.148425
6.166667 -2.320781 4.229251 -0.483359 -0.668456 0.604539 -0.130429
6.200000 -2.342164 4.247788 -0.491921 -0.646742 0.553120 -0.114856
6.233333 -2.363348 4.265269 -0.494428 -0.624980 0.502224 -0.102417
6.266667 -2.383541 4.280775 -0.495430 -0.603467 0.452146 -0.094468
6.300000 -2.403524 4.295208 -0.492985 -0.582346 0.403055 -0.091009
6.333333 -2.422596 4.307751 -0.488893 -0.561709 0.355024 -0.094400
6.366667 -2.440805 4.318475 -0.491158 -0.541697 0.308168 -0.102738
6.400000 -2.458170 4.327447 -0.499626 -0.522335 0.262490 -0.118874
6.433333 -2.475309 4.335321 -0.507640 -0.503753 0.218035 -0.151309
6.466667 -2.491640 4.341549 -0.509059 -0.485962 0.174637 -0.211877
6.500000 -2.507155 4.346175 -0.517614 -0.469211 0.132262 -0.311862
6.533333 -2.522437 4.349695 -0.516547 -0.453682 0.090735 -0.456706
6.566667 -2.536880 4.351702 -0.517114 -0.439561 0.049783 -0.660614
6.600000 -2.551090 4.352602 -0.529974 -0.427041 0.009050 -0.928486
6.633333 -2.564475 4.352101 -0.543735 -0.416294 -0.031749 -1.252093
6.666667 -2.577627 4.350493 -0.563755 -0.407455 -0.072893 -1.610759
6.700000 -2.590548 4.347782 -0.567879 -0.400459 -0.114678 -1.983751
6.733333 -2.603239 4.343969 -0.606994 -0.395262 -0.157311 -2.354901
6.766667 -2.615809 4.338562 -0.719700 -0.391706 -0.200924 -2.690484
6.800000 -2.628388 4.331498 -0.886861 -0.389607 -0.245511 -2.959530
6.833333 -2.641047 4.322813 -1.062431 -0.388663 -0.291109 -3.137483
6.866667 -2.653849 4.312435 -1.177635 -0.388538 -0.337559 -3.216012
6.900000 -2.666889 4.300299 -1.345070 -0.388929 -0.384647 -3.183410
6.933333 -2.680166 4.286361 -1.487641 -0.389488 -0.432050 -3.035312
6.966667 -2.693217 4.271361 -1.613990 -0.389937 -0.479441 -2.788845
7.000000 -2.706470 4.254431 -1.705533 -0.390002 -0.526407 -2.471214
7.033333 -2.719497 4.236460 -1.778669 -0.389504 -0.572622 -2.115762
7.066667 -2.732620 4.216541 -1.832194 -0.388320 -0.617869 -1.743614
7.100000 -2.745776 4.194684 -1.872103 -0.386368 -0.661986 -1.385878
7.133333 -2.758951 4.170813 -1.896376 -0.383598 -0.704822 -1.066156
7.166667 -2.771896 4.145958 -1.897766 -0.379955 -0.746174 -0.796559
7.200000 -2.784611 4.120135 -1.890305 -0.375456 -0.786023 -0.580596
7.233333 -2.797093 4.093362 -1.888251 -0.370105 -0.824258 -0.414030
7.266667 -2.809520 4.064989 -1.891010 -0.363899 -0.860773 -0.295534
7.300000 -2.821834 4.035145 -1.910416 -0.356863 -0.895480 -0.214442
7.333333 -2.833914 4.004406 -1.912917 -0.349086 -0.928438 -0.158834
7.366667 -2.845691 3.972499 -1.925231 -0.340624 -0.959689 -0.116955
7.400000 -2.857066 3.939614 -1.915407 -0.331467 -0.989167 -0.078035
7.433333 -2.868022 3.905704 -1.920628 -0.321617 -1.016819 -0.034716
7.466667 -2.878470 3.870856 -1.934069 -0.311126 -1.042646 0.018060
7.500000 -2.888682 3.835217 -1.939721 -0.300030 -1.066683 0.079746
7.533333 -2.898660 3.798810 -1.939162 -0.288324 -1.088893 0.149399
7.566667 -2.908405 3.761656 -1.938816 -0.276048 -1.109333 0.224232
7.600000 -2.917399 3.724084 -1.921597 -0.263348 -1.128157 0.299062
7.633333 -2.926161 3.685811 -1.913129 -0.250308 -1.145515 0.370904
7.666667 -2.934694 3.646860 -1.890750 -0.236968 -1.161517 0.433295
7.700000 -2.942432 3.607716 -1.877462 -0.223376 -1.176239 0.486245
7.733333 -2.949389 3.568251 -1.841243 -0.209625 -1.189784 0.525368
7.766667 -2.956125 3.528176 -1.822410 -0.195822 -1.202235 0.548106
7.800000 -2.962090 3.487874 -1.798546 -0.181978 -1.213594 0.554852
7.833333 -2.967840 3.447007 -1.789704 -0.168167 -1.223899 0.546028
7.866667 -2.973381 3.405597 -1.761527 -0.154502 -1.233230 0.527496
7.900000 -2.978249 3.364079 -1.739166 -0.141082 -1.241648 0.499194
7.933333 -2.982917 3.322064 -1.724438 -0.127914 -1.249163 0.466591
7.966667 -2.986971 3.280057 -1.701998 -0.115030 -1.255811 0.431290
8.000000 -2.990460 3.238075 -1.702518 -0.102489 -1.261682 0.398736
8.033333 -2.993391 3.195991 -1.688008 -0.090393 -1.266912 0.368045
8.066667 -2.996147 3.153498 -1.674063 -0.078812 -1.271596 0.338592
8.100000 -2.998448 3.110933 -1.667509 -0.067802 -1.275861 0.313475
8.133333 -3.000315 3.068301 -1.670288 -0.057473 -1.279868 0.292168
8.166667 -3.001751 3.025665 -1.652495 -0.047885 -1.283753 0.275410
8.200000 -3.003041 2.982706 -1.637087 -0.039059 -1.287575 0.257785
8.233333 -3.003953 2.939794 -1.627519 -0.030948 -1.291339 0.241948
8.266667 -3.004736 2.896599 -1.619317 -0.023494 -1.295053 0.228341
8.300000 -3.005178 2.853555 -1.624227 -0.016643 -1.298680 0.216212
8.333333 -3.005510 2.810268 -1.610195 -0.010320 -1.302162 0.203075
8.366667 -3.005740 2.766760 -1.602369 -0.004446 -1.305428 0.191808
8.400000 -3.005877 2.723049 -1.598558 0.001025 -1.308445 0.185329
8.433333 -3.005754 2.679119 -1.581648 0.006134 -1.311145 0.180146
8.466667 -3.005368 2.635215 -1.581486 0.010890 -1.313468 0.177265
8.500000 -3.004736 2.591378 -1.597287 0.015292 -1.315372 0.174436
8.533333 -3.004051 2.547419 -1.591093 0.019316 -1.316823 0.173748
8.566667 -3.003321 2.503357 -1.571982 0.022933 -1.317795 0.171222
8.600000 -3.002421 2.459205 -1.566009 0.026099 -1.318266 0.164965
8.633333 -3.001334 2.415263 -1.546395 0.028773 -1.318275 0.158798
8.666667 -3.000117 2.371287 -1.549827 0.030938 -1.317852 0.146886
8.700000 -2.998897 2.327285 -1.547269 0.032600 -1.317019 0.127729
8.733333 -2.997684 2.283277 -1.541446 0.033768 -1.315800 0.101693
8.766667 -2.996488 2.239282 -1.540659 0.034456 -1.314217 0.072911
8.800000 -2.995246 2.195391 -1.522755 0.034698 -1.312297 0.042125
8.833333 -2.993991 2.151635 -1.526852 0.034527 -1.310010 0.008770
8.866667 -2.992739 2.107987 -1.533464 0.033972 -1.307329 -0.020654
8.900000 -2.991547 2.064428 -1.539047 0.033049 -1.304231 -0.041147
8.933333 -2.990425 2.020974 -1.542550 0.031776 -1.300681 -0.051843
8.966667 -2.989343 1.977554 -1.518881 0.030159 -1.296636 -0.058580
9.000000 -2.988293 1.934221 -1.554606 0.028199 -1.292011 -0.058548
9.033333 -2.987284 1.891026 -1.571174 0.025889 -1.286737 -0.054689
9.066667 -2.986388 1.848010 -1.569101 0.023228 -1.280745 -0.049176
9.100000 -2.985533 1.805271 -1.562849 0.020202 -1.273935 -0.045197
9.133333 -2.984810 1.762746 -1.556990 0.016790 -1.266228 -0.046508
9.166667 -2.984231 1.720454 -1.543639 0.012987 -1.257581 -0.048231
9.200000 -2.983806 1.678412 -1.554597 0.008789 -1.248015 -0.054089
9.233333 -2.983501 1.636657 -1.550109 0.004182 -1.237520 -0.061614
9.266667 -2.983330 1.595295 -1.537928 -0.000854 -1.226100 -0.071831
9.300000 -2.983341 1.554409 -1.548685 -0.006316 -1.213843 -0.082509
9.333333 -2.983541 1.514116 -1.565313 -0.012221 -1.200798 -0.090401
9.366667 -2.983945 1.474157 -1.586343 -0.018588 -1.186996 -0.094524
9.400000 -2.984562 1.434548 -1.586732 -0.025442 -1.172439 -0.094135
9.433333 -2.985435 1.395796 -1.579479 -0.032776 -1.157250 -0.091069
9.466667 -2.986540 1.357425 -1.583560 -0.040577 -1.141531 -0.084061
9.500000 -2.987885 1.319450 -1.586006 -0.048883 -1.125283 -0.076743
9.533333 -2.989480 1.281884 -1.591401 -0.057686 -1.108558 -0.071505
9.566667 -2.991485 1.245243 -1.583658 -0.066964 -1.091449 -0.074626
9.600000 -2.993757 1.209040 -1.584352 -0.076697 -1.074051 -0.086753
9.633333 -2.996304 1.173288 -1.576427 -0.086941 -1.056293 -0.108057
9.666667 -2.999410 1.138597 -1.589638 -0.097795 -1.038117 -0.138772
9.700000 -3.002807 1.104382 -1.596046 -0.109336 -1.019514 -0.176461
9.733333 -3.006502 1.070657 -1.595491 -0.121665 -1.000455 -0.220293
9.766667 -3.010502 1.037432 -1.599285 -0.134907 -0.980822 -0.266046
9.800000 -3.014813 1.004718 -1.611477 -0.149273 -0.960457 -0.313126
9.833333 -3.019972 0.973041 -1.621129 -0.164906 -0.939329 -0.360997
9.866667 -3.025455 0.941897 -1.638457 -0.181971 -0.917362 -0.411354
9.900000 -3.031267 0.911297 -1.660996 -0.200536 -0.894530 -0.465988
9.933333 -3.037414 0.881251 -1.673143 -0.220673 -0.870807 -0.526031
9.966667 -3.044584 0.852290 -1.692606 -0.242379 -0.846254 -0.592943
10.000000 -3.052847 0.824470 -1.711981 -0.265413 -0.821068 -0.667660
10.033333 -3.062268 0.797788 -1.722244 -0.289557 -0.795428 -0.749478
10.066667 -3.072037 0.771693 -1.738994 -0.314571 -0.769584 -0.838332
10.100000 -3.082157 0.746193 -1.767296 -0.340284 -0.743742 -0.932862
10.133333 -3.093675 0.721821 -1.796234 -0.366587 -0.718147 -1.028911
10.166667 -3.106676 0.698560 -1.843176 -0.393549 -0.692999 -1.120486
10.200000 -3.121226 0.676421 -1.885063 -0.421349 -0.668402 -1.200569
10.233333 -3.136123 0.654899 -1.929579 -0.450080 -0.644404 -1.265704
10.266667 -3.151362 0.633996 -1.978007 -0.479654 -0.621041 -1.307952
10.300000 -3.166939 0.613717 -2.033726 -0.510119 -0.598340 -1.322551
10.333333 -3.182850 0.594064 -2.086351 -0.541395 -0.576245 -1.307762
10.366667 -3.200715 0.575281 -2.135383 -0.573079 -0.554679 -1.267166
10.400000 -3.220592 0.557308 -2.194287 -0.604890 -0.533539 -1.205214
10.433333 -3.240784 0.539970 -2.246370 -0.636613 -0.512749 -1.122168
10.466667 -3.263120 0.523305 -2.280693 -0.668023 -0.492219 -1.026647
10.500000 -3.287635 0.507288 -2.303722 -0.698452 -0.471879 -0.923040
10.533333 -3.312430 0.491910 -2.311128 -0.727375 -0.451693 -0.819900
10.566667 -3.337490 0.477171 -2.354445 -0.754655 -0.431623 -0.718151
10.600000 -3.362803 0.463074 -2.367349 -0.780095 -0.411651 -0.620725
10.633333 -3.390046 0.449727 -2.391497 -0.803401 -0.391777 -0.530314
10.666667 -3.417511 0.437022 -2.397751 -0.824621 -0.372003 -0.442465
10.700000 -3.445179 0.424958 -2.405668 -0.844289 -0.352329 -0.356737
10.733333 -3.474518 0.413573 -2.415779 -0.862683 -0.332781 -0.265835
10.766667 -3.504024 0.402828 -2.429825 -0.879835 -0.313411 -0.167693
10.800000 -3.533681 0.392722 -2.454396 -0.895759 -0.294281 -0.059425
10.833333 -3.563468 0.383255 -2.443143 -0.910650 -0.275425 0.057586
10.866667 -3.594216 0.374494 -2.455091 -0.924386 -0.256875 0.183987
10.900000 -3.625755 0.366398 -2.451144 -0.936583 -0.238645 0.317296
10.933333 -3.657363 0.358937 -2.436144 -0.947151 -0.220714 0.456250
10.966667 -3.689547 0.352001 -2.417735 -0.955982 -0.203039 0.595403
11.000000 -3.722173 0.345587 -2.386546 -0.962899 -0.185546 0.732392
11.033333 -3.755094 0.339679 -2.352198 -0.967591 -0.168120 0.869402
11.066667 -3.788159 0.334265 -2.330215 -0.969915 -0.150580 1.000567
11.100000 -3.821181 0.329473 -2.266066 -0.969818 -0.132688 1.125779
11.133333 -3.854137 0.325299 -2.248967 -0.967142 -0.114226 1.241459
11.166667 -3.886825 0.321653 -2.207259 -0.961894 -0.095006 1.346147
11.200000 -3.919126 0.318541 -2.146296 -0.954256 -0.074898 1.436473
11.233333 -3.951292 0.316038 -2.121890 -0.944529 -0.053863 1.509953
11.266667 -3.983302 0.314142 -2.053309 -0.933039 -0.031984 1.562412
11.300000 -4.014760 0.312998 -1.991133 -0.920189 -0.009475 1.593012
11.333333 -4.045551 0.312699 -1.932865 -0.906423 0.013429 1.596854
11.366667 -4.075612 0.313385 -1.853931 -0.892120 0.036466 1.574815
11.400000 -4.104893 0.315174 -1.793974 -0.877489 0.059479 1.528454
11.433333 -4.133297 0.318237 -1.732463 -0.862610 0.082428 1.453389
11.466667 -4.161419 0.321876 -1.683251 -0.847381 0.105459 1.357410
11.500000 -4.189240 0.326083 -1.649709 -0.831448 0.128925 1.244439
11.533333 -4.216740 0.330852 -1.616719 -0.814378 0.153223 1.125983
11.566667 -4.243902 0.336174 -1.563381 -0.795671 0.178819 1.008282
11.600000 -4.270707 0.342042 -1.541872 -0.774811 0.206061 0.899399
11.633333 -4.297136 0.348448 -1.515499 -0.751247 0.235162 0.802909
11.666667 -4.323171 0.355383 -1.505357 -0.724684 0.266075 0.718558
11.700000 -4.348795 0.362841 -1.476000 -0.695138 0.298478 0.648243
11.733333 -4.372804 0.372400 -1.480375 -0.662591 0.331846 0.594247
11.766667 -4.395030 0.384041 -1.458154 -0.627000 0.365412 0.565110
11.800000 -4.415292 0.397742 -1.447586 -0.588697 0.398262 0.566957
11.833333 -4.433417 0.413451 -1.435940 -0.548212 0.429315 0.623248
11.866667 -4.451061 0.429619 -1.393256 -0.505952 0.457622 0.750674
11.900000 -4.468214 0.446231 -1.355992 -0.462188 0.482367 0.960644
11.933333 -4.483068 0.463930 -1.338445 -0.417300 0.502977 1.256769
11.966667 -4.495552 0.482241 -1.376674 -0.371967 0.519276 1.636949
12.000000 -4.507524 0.500944 -1.399803 -0.326286 0.531345 2.093549
12.033333 -4.518978 0.520022 -1.355652 -0.280305 0.539701 2.593582
12.066667 -4.527812 0.538812 -1.265136 -0.234250 0.544917 3.104081
12.100000 -4.533945 0.557090 -1.122994 -0.188527 0.547641 3.587025
12.133333 -4.539556 0.575692 -0.982528 -0.143417 0.548534 4.003796
12.166667 -4.542334 0.593666 -0.779271 -0.099013 0.548168 4.310987
12.200000 -4.544597 0.611931 -0.564188 -0.055896 0.547103 4.472805
12.233333 -4.546348 0.630473 -0.338539 -0.014589 0.545697 4.477885
12.266667 -4.545287 0.648381 -0.097573 0.024607 0.544204 4.323278
12.300000 -4.543728 0.666535 0.094916 0.061759 0.542738 4.025260
12.333333 -4.539507 0.684208 0.243922 0.096571 0.541413 3.608903
12.366667 -4.534806 0.702100 0.340065 0.128983 0.540173 3.115806
12.400000 -4.529637 0.720198 0.413037 0.159128 0.538854 2.590560
12.433333 -4.524011 0.738487 0.460902 0.187145 0.537296 2.071366
12.466667 -4.516345 0.756208 0.489904 0.213119 0.535440 1.596181
12.500000 -4.508247 0.774095 0.513794 0.236929 0.533262 1.185609
12.533333 -4.499732 0.792134 0.513726 0.258834 0.530629 0.854307
12.566667 -4.490813 0.810314 0.515365 0.278897 0.527485 0.604823
12.600000 -4.480725 0.827800 0.513455 0.297098 0.523932 0.432024
12.633333 -4.470263 0.845403 0.524334 0.313353 0.520049 0.325134
12.666667 -4.458936 0.862488 0.527844 0.327621 0.515841 0.266443
12.700000 -4.447266 0.879668 0.533728 0.339913 0.511388 0.245623
12.733333 -4.435118 0.896405 0.539346 0.350089 0.506873 0.251221
12.766667 -4.422661 0.913216 0.545607 0.358012 0.502480 0.270845
12.800000 -4.409910 0.930089 0.561906 0.363603 0.498206 0.295076
12.833333 -4.397208 0.946570 0.564095 0.366935 0.494129 0.320069
12.866667 -4.384680 0.962715 0.560371 0.368192 0.490335 0.344591
12.900000 -4.371908 0.978895 0.591441 0.367533 0.486868 0.362253
12.933333 -4.358909 0.995101 0.608373 0.365258 0.483677 0.371391
12.966667 -4.346434 1.011060 0.630759 0.361613 0.480723 0.373291
13.000000 -4.334488 1.026931 0.639205 0.356881 0.478043 0.370469
13.033333 -4.322360 1.042804 0.659364 0.351088 0.475559 0.356983
13.066667 -4.310970 1.058547 0.665743 0.344164 0.473185 0.330458
13.100000 -4.299427 1.074275 0.672388 0.335864 0.470809 0.293026
13.133333 -4.288783 1.089914 0.680736 0.325750 0.468331 0.235528
13.166667 -4.278011 1.105525 0.701367 0.313502 0.465621 0.139401
13.200000 -4.267122 1.121099 0.705447 0.298656 0.462528 -0.019717
13.233333 -4.256130 1.136629 0.710090 0.280859 0.458959 -0.255356
13.266667 -4.245046 1.152109 0.712239 0.259651 0.454830 -0.592488
13.300000 -4.235321 1.167445 0.721378 0.235041 0.450114 -1.052429
13.333333 -4.227098 1.182565 0.725300 0.207391 0.444842 -1.632615
13.366667 -4.220515 1.197413 0.699497 0.177145 0.439077 -2.306881
13.400000 -4.213877 1.212185 0.688077 0.144932 0.432933 -3.038784
13.433333 -4.209288 1.226587 0.653161 0.111813 0.426560 -3.793967
13.466667 -4.206976 1.240566 0.521275 0.078979 0.420111 -4.514926
13.500000 -4.204619 1.254453 0.292276 0.047204 0.413698 -5.142065
13.533333 -4.204658 1.267945 0.002914 0.016972 0.407313 -5.628705
13.566667 -4.207034 1.281170 -0.265156 -0.011323 0.400930 -5.948261
13.600000 -4.209360 1.294288 -0.606097 -0.037285 0.394325 -6.074773
13.633333 -4.211632 1.307295 -0.909418 -0.061067 0.387215 -5.991541
13.666667 -4.213843 1.320189 -1.140446 -0.082934 0.379335 -5.709606
13.700000 -4.215990 1.332965 -1.338253 -0.103031 0.370426 -5.257389
13.733333 -4.219940 1.345701 -1.494721 -0.121374 0.360382 -4.674696
13.766667 -4.223813 1.358313 -1.616840 -0.138236 0.349092 -3.997995
13.800000 -4.229286 1.370361 -1.727027 -0.153693 0.336795 -3.276365
13.833333 -4.234666 1.382279 -1.824256 -0.167618 0.323539 -2.553565
13.866667 -4.241452 1.392884 -1.883132 -0.179660 0.309264 -1.860872
13.900000 -4.248123 1.403355 -1.926559 -0.189396 0.293746 -1.218502
13.933333 -4.255946 1.411821 -1.952621 -0.196536 0.276863 -0.639325
13.966667 -4.263630 1.420151 -1.957261 -0.200594 0.258503 -0.137260
14.000000 -4.271164 1.428349 -1.934273 -0.201352 0.238297 0.279228
14.033333 -4.278535 1.436416 -1.897129 -0.198531 0.216323 0.607342
14.066667 -4.285730 1.444352 -1.835371 -0.192200 0.192861 0.856370
14.100000 -4.292737 1.452160 -1.773781 -0.182575 0.168518 1.042794
14.133333 -4.299544 1.459842 -1.698136 -0.169803 0.143684 1.185446
14.166667 -4.305756 1.464753 -1.635912 -0.153937 0.119083 1.320970
14.200000 -4.311177 1.467172 -1.583749 -0.135063 0.095859 1.487234
14.233333 -4.315501 1.467531 -1.531671 -0.113573 0.075084 1.712440
14.266667 -4.319579 1.467787 -1.506179 -0.089570 0.057844 2.001733
14.300000 -4.323401 1.467953 -1.535095 -0.062978 0.045178 2.348961
14.333333 -4.325503 1.467617 -1.556880 -0.033892 0.038210 2.748669
14.366667 -4.325761 1.467295 -1.533093 -0.002630 0.037482 3.167437
14.400000 -4.325739 1.466913 -1.391808 0.030559 0.042946 3.563452
14.433333 -4.325431 1.466482 -1.176382 0.065694 0.054230 3.894856
14.466667 -4.323244 1.467236 -0.989866 0.102510 0.070690 4.138834
14.500000 -4.319251 1.469301 -0.720181 0.140456 0.091394 4.266675
14.533333 -4.313505 1.472755 -0.488961 0.179019 0.115114 4.253338
14.566667 -4.307462 1.476195 -0.284647 0.217886 0.140822 4.095823
14.600000 -4.299726 1.481055 -0.149386 0.256514 0.167519 3.816248
14.633333 -4.290331 1.487302 -0.039956 0.294211 0.194282 3.449501
14.666667 -4.279356 1.494809 0.042963 0.330397 0.220260 3.021950
14.700000 -4.266854 1.503469 0.104929 0.364646 0.244739 2.578332
14.733333 -4.252946 1.513122 0.147339 0.396666 0.267297 2.158544
14.766667 -4.238766 1.522774 0.178293 0.426055 0.287516 1.790829
14.800000 -4.223357 1.533308 0.231047 0.452659 0.305229 1.482990
14.833333 -4.206857 1.544623 0.279064 0.476422 0.320379 1.232503
14.866667 -4.190113 1.555933 0.308313 0.497462 0.333090 1.036315
14.900000 -4.172503 1.567850 0.345525 0.515940 0.343531 0.880492
14.933333 -4.154673 1.579755 0.369416 0.532087 0.351914 0.753045
14.966667 -4.136218 1.592019 0.376284 0.546119 0.358442 0.650211
15.000000 -4.117567 1.604262 0.398367 0.558300 0.363349 0.565413
15.033333 -4.098389 1.616766 0.415463 0.568912 0.366870 0.497552
15.066667 -4.079042 1.629241 0.428007 0.578118 0.369136 0.444250
15.100000 -4.059330 1.641851 0.425497 0.586102 0.370290 0.409113
15.133333 -4.039475 1.654421 0.448011 0.592953 0.370406 0.389687
15.166667 -4.019379 1.667003 0.445085 0.598838 0.369634 0.374782
15.200000 -3.999099 1.679506 0.449803 0.603847 0.368024 0.364685
15.233333 -3.978709 1.691888 0.451720 0.608062 0.365650 0.354902
15.266667 -3.958230 1.704107 0.473995 0.611576 0.362567 0.343516
15.300000 -3.937680 1.716261 0.535873 0.614459 0.358844 0.317594
15.333333 -3.917072 1.728346 0.529932 0.616797 0.354526 0.274618
15.366667 -3.896380 1.740159 0.534512 0.618673 0.349645 0.209290
15.400000 -3.875660 1.751893 0.530283 0.620180 0.344294 0.117795
15.433333 -3.854877 1.763269 0.545345 0.621389 0.338550 -0.001021
15.466667 -3.834095 1.774558 0.565016 0.622361 0.332553 -0.146524
15.500000 -3.813329 1.785756 0.571331 0.623138 0.326433 -0.304283
15.533333 -3.792497 1.796495 0.553651 0.623725 0.320386 -0.469534
15.566667 -3.771710 1.807135 0.527563 0.624092 0.314588 -0.622585
15.600000 -3.750886 1.817317 0.517826 0.624160 0.309244 -0.757451
15.633333 -3.730137 1.827391 0.494941 0.623843 0.304495 -0.868134
15.666667 -3.709297 1.837134 0.454714 0.623044 0.300437 -0.948777
15.700000 -3.688365 1.846660 0.359192 0.621605 0.297128 -0.997564
15.733333 -3.667385 1.856139 0.292411 0.619389 0.294542 -1.007951
15.766667 -3.646453 1.865666 0.250132 0.616175 0.292603 -0.977396
15.800000 -3.625640 1.875293 0.230158 0.611687 0.291016 -0.885031
15.833333 -3.605031 1.885116 0.222545 0.605522 0.289417 -0.706628
15.866667 -3.584604 1.894808 0.196312 0.597313 0.287422 -0.428432
15.900000 -3.564374 1.904367 0.197080 0.586821 0.284646 -0.034828
15.933333 -3.544526 1.914285 0.156437 0.573682 0.280615 0.491300
15.966667 -3.524904 1.924061 0.118879 0.557558 0.274884 1.154869
16.000000 -3.505525 1.933691 0.101646 0.538147 0.267171 1.944147
16.033333 -3.486978 1.943246 0.084826 0.515270 0.257337 2.833585
16.066667 -3.468701 1.952647 0.113746 0.488544 0.245200 3.805898
16.100000 -3.451772 1.961390 0.255790 0.457416 0.230578 4.817061
16.133333 -3.436489 1.969209 0.486968 0.421727 0.213608 5.803732
16.166667 -3.423109 1.975908 0.798086 0.381699 0.194626 6.697245
16.200000 -3.410043 1.982441 1.022565 0.337820 0.173926 7.445219
16.233333 -3.397301 1.988807 1.382020 0.290729 0.151844 7.993258
16.266667 -3.386815 1.993930 1.746744 0.241619 0.128933 8.292328
16.300000 -3.378691 1.997874 2.109958 0.192133 0.105888 8.330043
16.333333 -3.373031 2.000775 2.485174 0.143797 0.083288 8.120310
16.366667 -3.369954 2.002708 2.813886 0.097891 0.061532 7.706874
16.400000 -3.369537 2.003723 3.113810 0.055760 0.041359 7.118330
16.433333 -3.371845 2.003853 -2.916934 0.018805 0.023490 6.410323
16.466667 -3.374480 2.003829 -2.730850 -0.011993 0.008545 5.640175
16.500000 -3.377435 2.003657 -2.626493 -0.036230 -0.003084 4.848929
16.533333 -3.380417 2.002075 -2.496843 -0.053851 -0.011025 4.065848
16.566667 -3.383704 2.000355 -2.417801 -0.064969 -0.014885 3.310528
16.600000 -3.387286 1.998503 -2.350203 -0.070185 -0.014720 2.621717
16.633333 -3.390431 1.996755 -2.273499 -0.070488 -0.010672 2.028229
