t x y theta dxdt dydt dthetadt
0.000000 0.000000 0.000000 -1.032958 0.002037 -0.005356 0.163951
0.033333 0.000445 -0.000345 -1.021126 0.004004 -0.007910 0.139829
0.066667 0.000623 -0.000852 -1.007050 0.007168 -0.010644 0.118993
0.100000 0.000539 -0.001522 -1.004277 0.012373 -0.013821 0.108368
0.133333 0.001154 -0.002027 -1.007947 0.020409 -0.017904 0.112695
0.166667 0.001109 -0.002421 -1.007947 0.032323 -0.023433 0.133324
0.200000 0.000415 -0.003147 -1.028850 0.049392 -0.030700 0.170082
0.233333 0.000483 -0.003693 -1.031626 0.073014 -0.039836 0.224223
0.266667 0.001335 -0.004052 -1.037115 0.104106 -0.050848 0.291381
0.300000 0.002992 -0.004220 -1.025825 0.143211 -0.063517 0.364111
0.333333 0.006034 -0.005454 -1.004441 0.190847 -0.077181 0.436103
0.366667 0.010600 -0.008004 -0.987864 0.247041 -0.090719 0.503117
0.400000 0.017246 -0.011623 -0.954826 0.311098 -0.103075 0.559521
0.433333 0.026450 -0.016480 -0.912256 0.381801 -0.112762 0.603128
0.466667 0.038796 -0.022041 -0.881218 0.457916 -0.118299 0.633734
0.500000 0.054717 -0.028018 -0.857956 0.538394 -0.117856 0.654187
0.533333 0.074117 -0.033843 -0.841008 0.621594 -0.110155 0.668098
0.566667 0.098656 -0.039570 -0.830802 0.705685 -0.094248 0.678594
0.600000 0.124132 -0.045005 -0.818396 0.789361 -0.069379 0.690603
0.633333 0.150545 -0.050137 -0.799316 0.871541 -0.035783 0.705315
0.666667 0.181786 -0.053374 -0.776273 0.951191 0.006011 0.722440
0.700000 0.216919 -0.053546 -0.763012 1.027091 0.054340 0.741452
0.733333 0.252976 -0.053382 -0.734984 1.098731 0.107751 0.758657
0.766667 0.292395 -0.048549 -0.697424 1.166128 0.164215 0.771223
0.800000 0.332717 -0.043370 -0.652032 1.229207 0.221806 0.774399
0.833333 0.376250 -0.033140 -0.618787 1.287768 0.278688 0.767860
0.866667 0.420658 -0.022565 -0.589896 1.342208 0.333580 0.750128
0.900000 0.468370 -0.006593 -0.572084 1.393193 0.385686 0.721475
0.933333 0.516922 0.009713 -0.548395 1.441177 0.434221 0.685440
0.966667 0.566297 0.026343 -0.538040 1.486387 0.478953 0.645768
1.000000 0.616476 0.043289 -0.507651 1.529056 0.519651 0.606633
1.033333 0.667441 0.060539 -0.488558 1.569800 0.556872 0.570234
1.066667 0.719172 0.078084 -0.482603 1.608656 0.590621 0.540186
1.100000 0.774598 0.099582 -0.460499 1.645575 0.621214 0.515777
1.133333 0.830745 0.121352 -0.444569 1.680510 0.648968 0.496794
1.166667 0.887590 0.143379 -0.427635 1.713622 0.674273 0.481314
1.200000 0.946676 0.168208 -0.416152 1.744943 0.697377 0.470724
1.233333 1.006410 0.193264 -0.393408 1.774316 0.718138 0.461515
1.266667 1.066764 0.218527 -0.383318 1.801713 0.736631 0.454510
1.300000 1.127712 0.243980 -0.366553 1.827400 0.753124 0.451796
1.333333 1.189228 0.269605 -0.356285 1.851459 0.767804 0.452285
1.366667 1.251285 0.295384 -0.334692 1.873507 0.780516 0.455538
1.400000 1.313856 0.321299 -0.327539 1.893415 0.791388 0.457844
1.433333 1.376913 0.347331 -0.309920 1.910824 0.800355 0.460452
1.466667 1.440429 0.373462 -0.301696 1.925378 0.807353 0.457863
1.500000 1.506332 0.401122 -0.279537 1.936313 0.811894 0.445588
1.533333 1.572668 0.429705 -0.262214 1.943297 0.813445 0.424244
1.566667 1.639373 0.458328 -0.260253 1.946454 0.811809 0.395689
1.600000 1.706416 0.486971 -0.220478 1.945799 0.806525 0.359470
1.633333 1.773768 0.515612 -0.192591 1.941746 0.797444 0.316490
1.666667 1.839232 0.543260 -0.197171 1.934835 0.784434 0.272310
1.700000 1.903211 0.569613 -0.176815 1.925925 0.767631 0.231267
1.733333 1.967413 0.595903 -0.182399 1.915682 0.747457 0.196179
1.766667 2.029010 0.619753 -0.193859 1.904903 0.724375 0.165551
1.800000 2.090782 0.643504 -0.193425 1.894355 0.699101 0.146105
1.833333 2.152705 0.667141 -0.198436 1.884725 0.672260 0.140994
1.866667 2.215578 0.689041 -0.195684 1.876388 0.644589 0.146368
1.900000 2.278554 0.710796 -0.179134 1.869562 0.616597 0.161702
1.933333 2.341799 0.730895 -0.176111 1.864203 0.588747 0.182694
1.966667 2.404229 0.749835 -0.174741 1.859729 0.561216 0.208122
2.000000 2.465991 0.767758 -0.157872 1.855553 0.534024 0.230506
2.033333 2.525903 0.784500 -0.150938 1.851147 0.507320 0.245010
2.066667 2.587234 0.800464 -0.136988 1.846124 0.481042 0.250258
2.100000 2.649023 0.815566 -0.135980 1.840193 0.455238 0.244797
2.133333 2.710753 0.830453 -0.115638 1.833365 0.429780 0.229282
2.166667 2.772554 0.844356 -0.106778 1.825887 0.404754 0.204338
2.200000 2.834248 0.858029 -0.099546 1.818036 0.380299 0.172674
2.233333 2.895709 0.870700 -0.088952 1.809740 0.356335 0.135270
2.266667 2.956137 0.882397 -0.083920 1.801333 0.332850 0.097536
2.300000 3.015678 0.892806 -0.086884 1.793015 0.309932 0.060856
2.333333 3.074138 0.901806 -0.083179 1.784970 0.287831 0.026478
2.366667 3.132384 0.910557 -0.080042 1.777421 0.266665 -0.003565
2.400000 3.190397 0.919057 -0.095089 1.770572 0.246521 -0.025534
2.433333 3.249757 0.926177 -0.109991 1.764758 0.227650 -0.037583
2.466667 3.308842 0.933047 -0.097324 1.759652 0.210269 -0.044103
2.500000 3.367631 0.939667 -0.102085 1.754845 0.194343 -0.044286
2.533333 3.426103 0.946037 -0.108585 1.749663 0.179603 -0.038147
2.566667 3.483478 0.951484 -0.107706 1.743358 0.165849 -0.025831
2.600000 3.542459 0.956333 -0.100213 1.734823 0.152852 -0.014364
2.633333 3.601060 0.960938 -0.112431 1.723166 0.140205 -0.004986
2.666667 3.659259 0.965299 -0.111127 1.707866 0.127556 0.005288
2.700000 3.717035 0.969421 -0.106494 1.688535 0.114691 0.015645
2.733333 3.774366 0.973305 -0.090963 1.665100 0.101564 0.024248
2.766667 3.831230 0.976954 -0.099370 1.637569 0.088133 0.029091
2.800000 3.886820 0.980207 -0.105441 1.606658 0.074471 0.035461
2.833333 3.941248 0.982770 -0.103143 1.573002 0.060784 0.043199
2.866667 3.993759 0.984675 -0.106928 1.537174 0.047426 0.052238
2.900000 4.044228 0.985723 -0.091169 1.499893 0.034823 0.059689
2.933333 4.091783 0.985917 -0.093115 1.461955 0.023418 0.068572
2.966667 4.138768 0.985897 -0.097509 1.424181 0.013632 0.080110
3.000000 4.185169 0.985669 -0.100323 1.387069 0.005727 0.091030
3.033333 4.230534 0.984900 -0.082059 1.351047 -0.000081 0.098977
3.066667 4.275291 0.983934 -0.080747 1.316489 -0.003817 0.101640
3.100000 4.318939 0.982925 -0.084959 1.283423 -0.005598 0.103203
3.133333 4.360922 0.982356 -0.077050 1.251569 -0.005699 0.101279
3.166667 4.402267 0.981609 -0.067509 1.220605 -0.004388 0.093479
3.200000 4.441539 0.982209 -0.061587 1.190115 -0.001956 0.081138
3.233333 4.480156 0.982640 -0.060293 1.159662 0.001283 0.068047
3.266667 4.518110 0.982908 -0.057157 1.128931 0.005045 0.055322
3.300000 4.555396 0.983017 -0.053369 1.097845 0.009039 0.039921
3.333333 4.592006 0.982971 -0.058048 1.066331 0.013192 0.023311
3.366667 4.627934 0.982775 -0.061395 1.034338 0.017515 0.009487
3.400000 4.662505 0.983496 -0.064272 1.001910 0.022202 -0.000238
3.433333 4.695200 0.984746 -0.060847 0.969147 0.027465 -0.006654
3.466667 4.727199 0.985857 -0.057194 0.936009 0.033592 -0.009407
3.500000 4.758498 0.986832 -0.064155 0.902330 0.040908 -0.007446
3.533333 4.786793 0.988104 -0.059909 0.868260 0.049534 -0.001927
3.566667 4.814384 0.989245 -0.063609 0.833899 0.059411 0.004434
3.600000 4.841430 0.990770 -0.065155 0.799360 0.070363 0.008531
3.633333 4.867721 0.992539 -0.068133 0.764718 0.082179 0.010052
3.666667 4.893086 0.994874 -0.068799 0.730186 0.094489 0.008945
3.700000 4.918036 0.998155 -0.065393 0.696112 0.106749 0.004780
3.733333 4.940957 1.002347 -0.054011 0.662521 0.118401 -0.001492
3.766667 4.962220 1.006993 -0.048430 0.629542 0.128927 -0.009218
3.800000 4.982138 1.012385 -0.045712 0.597302 0.137724 -0.016281
3.833333 5.000400 1.018324 -0.061216 0.566063 0.144100 -0.021422
3.866667 5.017974 1.024129 -0.058584 0.536036 0.147411 -0.025484
3.900000 5.034867 1.029797 -0.064851 0.507452 0.147038 -0.026448
3.933333 5.050947 1.035473 -0.073478 0.480583 0.142610 -0.025156
3.966667 5.066291 1.040803 -0.070892 0.455544 0.133876 -0.020958
4.000000 5.080974 1.045986 -0.069377 0.432617 0.120534 -0.014237
4.033333 5.095002 1.051021 -0.081448 0.411848 0.102592 -0.007939
4.066667 5.108036 1.055192 -0.065886 0.393253 0.080360 -0.000635
4.100000 5.120432 1.059208 -0.064370 0.376897 0.054330 0.006238
4.133333 5.131580 1.062189 -0.064662 0.363051 0.024849 0.012895
4.166667 5.142541 1.063567 -0.056092 0.352003 -0.007707 0.018644
4.200000 5.153346 1.063030 -0.058273 0.343606 -0.042329 0.023324
4.233333 5.164219 1.059833 -0.062720 0.337713 -0.077950 0.027599
4.266667 5.174498 1.056488 -0.071480 0.334157 -0.113772 0.030797
4.300000 5.184191 1.052999 -0.066663 0.332386 -0.148904 0.033361
4.333333 5.195689 1.045590 -0.068682 0.331289 -0.182072 0.035764
4.366667 5.206615 1.038053 -0.073515 0.329780 -0.212135 0.037652
4.400000 5.216977 1.030399 -0.052599 0.327045 -0.238565 0.038698
4.433333 5.229039 1.020841 -0.049237 0.322295 -0.261008 0.039313
4.466667 5.241723 1.009956 -0.051386 0.314657 -0.278735 0.038623
4.500000 5.253707 0.998840 -0.042579 0.303576 -0.291154 0.034539
4.533333 5.265141 0.987654 -0.050759 0.289195 -0.298103 0.027199
4.566667 5.275361 0.976652 -0.056846 0.271819 -0.299468 0.018647
4.600000 5.285037 0.965605 -0.058133 0.251719 -0.294991 0.010297
4.633333 5.293483 0.954491 -0.046147 0.229561 -0.284598 0.001298
4.666667 5.300515 0.943694 -0.046053 0.206311 -0.268884 -0.006319
4.700000 5.306094 0.933662 -0.056909 0.182894 -0.248486 -0.009433
4.733333 5.311147 0.923630 -0.048366 0.159906 -0.224241 -0.010084
4.766667 5.315526 0.915298 -0.050590 0.137667 -0.196940 -0.010829
4.800000 5.319204 0.909577 -0.053644 0.116511 -0.167594 -0.011149
4.833333 5.322373 0.903882 -0.057396 0.096189 -0.137130 -0.008190
4.866667 5.325042 0.901730 -0.057857 0.076091 -0.106264 -0.004394
4.900000 5.327214 0.899615 -0.051691 0.055527 -0.075622 -0.002269
4.933333 5.328897 0.897538 -0.054763 0.033928 -0.045564 0.000757
4.966667 5.330611 0.897585 -0.062512 0.010919 -0.016528 0.006062
5.000000 5.331848 0.897675 -0.047321 -0.013652 0.011341 0.009154
5.033333 5.332127 0.898448 -0.053033 -0.039424 0.037729 0.009774
5.066667 5.331267 0.899851 -0.055641 -0.065712 0.062568 0.009565
5.100000 5.328738 0.902286 -0.058001 -0.091310 0.085346 0.009894
5.133333 5.325758 0.904758 -0.046039 -0.115088 0.105464 0.008958
5.166667 5.320143 0.909022 -0.049428 -0.135569 0.122355 0.005485
5.200000 5.312917 0.914893 -0.048095 -0.151587 0.135338 0.004417
5.233333 5.305020 0.921455 -0.049165 -0.162138 0.143887 0.002635
5.266667 5.296830 0.928895 -0.051405 -0.166440 0.147349 -0.001113
5.300000 5.288244 0.936340 -0.055147 -0.164554 0.145761 -0.006843
5.333333 5.282367 0.942102 -0.062038 -0.156748 0.139376 -0.012515
5.366667 5.276115 0.947858 -0.050384 -0.144050 0.128785 -0.017329
5.400000 5.269499 0.953601 -0.044806 -0.127562 0.114839 -0.023405
5.433333 5.266593 0.956467 -0.050372 -0.108858 0.098763 -0.028391
5.466667 5.263338 0.959312 -0.047228 -0.089442 0.081878 -0.032485
5.500000 5.261775 0.960830 -0.057721 -0.070627 0.065324 -0.034691
5.533333 5.260943 0.961664 -0.056284 -0.053345 0.050012 -0.037184
5.566667 5.260840 0.961937 -0.060401 -0.038264 0.036640 -0.038275
5.600000 5.260396 0.962183 -0.063092 -0.025952 0.025677 -0.037061
5.633333 5.260420 0.962266 -0.066197 -0.016288 0.017054 -0.034778
5.666667 5.260616 0.962276 -0.067076 -0.009156 0.010636 -0.029621
5.700000 5.260468 0.962258 -0.064034 -0.004048 0.006063 -0.024057
5.733333 5.260504 0.962456 -0.061614 -0.000618 0.002997 -0.017013
5.766667 5.260827 0.962457 -0.062413 0.001609 0.001029 -0.010868
5.800000 5.260797 0.962426 -0.070739 0.003153 -0.000235 -0.005485
