t x y theta dxdt dydt dthetadt
0.000000 0.000000 0.000000 -2.810250 -0.150220 -0.027889 0.000628
0.033333 -0.005064 -0.000944 -2.819691 -0.154305 -0.028949 0.003192
0.066667 -0.010264 -0.001922 -2.820428 -0.158437 -0.030024 0.007550
0.100000 -0.015603 -0.002937 -2.808552 -0.162615 -0.031116 0.008818
0.133333 -0.021084 -0.003989 -2.808671 -0.166840 -0.032222 0.007724
0.166667 -0.026708 -0.005079 -2.820002 -0.171112 -0.033345 0.008066
0.200000 -0.032477 -0.006207 -2.813017 -0.175431 -0.034484 0.008963
0.233333 -0.038388 -0.007373 -2.804622 -0.179796 -0.035638 0.007606
0.266667 -0.044441 -0.008576 -2.819937 -0.184210 -0.036809 0.004243
0.300000 -0.050638 -0.009817 -2.816502 -0.188672 -0.037996 0.003537
0.333333 -0.056988 -0.011099 -2.812274 -0.193182 -0.039199 0.004350
0.366667 -0.063492 -0.012422 -2.816224 -0.197738 -0.040419 0.005479
0.400000 -0.070152 -0.013787 -2.802042 -0.202341 -0.041654 0.005264
0.433333 -0.076960 -0.015191 -2.812209 -0.206987 -0.042905 0.006477
0.466667 -0.083929 -0.016639 -2.816223 -0.211675 -0.044171 0.007136
0.500000 -0.091058 -0.018131 -2.817403 -0.216403 -0.045452 0.006048
0.533333 -0.098339 -0.019663 -2.812925 -0.221168 -0.046746 0.003572
0.566667 -0.105784 -0.021240 -2.809141 -0.225971 -0.048054 -0.000109
0.600000 -0.113396 -0.022863 -2.812366 -0.230813 -0.049377 -0.000631
0.633333 -0.121161 -0.024527 -2.805282 -0.235697 -0.050716 -0.003207
0.666667 -0.129096 -0.026239 -2.810897 -0.240626 -0.052071 -0.003158
0.700000 -0.137187 -0.027992 -2.807191 -0.245603 -0.053444 -0.003117
0.733333 -0.145432 -0.029789 -2.815965 -0.250633 -0.054836 -0.002089
0.766667 -0.153853 -0.031634 -2.807583 -0.255723 -0.056248 -0.001706
0.800000 -0.162450 -0.033528 -2.826113 -0.260875 -0.057683 -0.003852
0.833333 -0.171226 -0.035472 -2.812259 -0.266088 -0.059140 -0.007391
0.866667 -0.180159 -0.037460 -2.819290 -0.271361 -0.060618 -0.019071
0.900000 -0.189273 -0.039499 -2.808127 -0.276685 -0.062115 -0.043677
0.933333 -0.198571 -0.041589 -2.802402 -0.282047 -0.063628 -0.087605
0.966667 -0.208052 -0.043732 -2.816157 -0.287428 -0.065151 -0.154368
1.000000 -0.217719 -0.045927 -2.806747 -0.292808 -0.066678 -0.256112
1.033333 -0.227573 -0.048174 -2.808224 -0.298173 -0.068205 -0.395388
1.066667 -0.237614 -0.050476 -2.818227 -0.303507 -0.069725 -0.573094
1.100000 -0.247846 -0.052832 -2.822328 -0.308797 -0.071233 -0.783387
1.133333 -0.258268 -0.055243 -2.822606 -0.314039 -0.072727 -1.023493
1.166667 -0.268850 -0.057700 -2.855360 -0.319231 -0.074202 -1.287786
1.200000 -0.279593 -0.060203 -2.898787 -0.324380 -0.075659 -1.556760
1.233333 -0.290497 -0.062753 -2.970442 -0.329491 -0.077097 -1.810726
1.266667 -0.301560 -0.065350 -3.032425 -0.334572 -0.078520 -2.029202
1.300000 -0.312784 -0.067993 -3.120689 -0.339635 -0.079930 -2.194026
1.333333 -0.324169 -0.070683 3.053728 -0.344691 -0.081331 -2.279852
1.366667 -0.335748 -0.073415 2.949247 -0.349747 -0.082728 -2.267505
1.400000 -0.347488 -0.076195 2.840643 -0.354803 -0.084124 -2.149552
1.433333 -0.359387 -0.079022 2.746225 -0.359858 -0.085524 -1.930182
1.466667 -0.371477 -0.081893 2.645036 -0.364909 -0.086929 -1.614084
1.500000 -0.383727 -0.084811 2.543265 -0.369953 -0.088342 -1.210582
1.533333 -0.396165 -0.087777 2.479301 -0.374977 -0.089762 -0.744566
1.566667 -0.408761 -0.090790 2.484501 -0.379982 -0.091189 -0.246985
1.600000 -0.421514 -0.093852 2.507519 -0.384966 -0.092621 0.252660
1.633333 -0.434425 -0.096961 2.539357 -0.389935 -0.094060 0.723984
1.666667 -0.447519 -0.100121 2.600655 -0.394887 -0.095505 1.131647
1.700000 -0.460768 -0.103328 2.662722 -0.399827 -0.096954 1.441729
1.733333 -0.474173 -0.106585 2.720436 -0.404757 -0.098409 1.636927
1.766667 -0.487733 -0.109890 2.832470 -0.409675 -0.099869 1.714245
1.800000 -0.501471 -0.113243 2.943587 -0.414576 -0.101337 1.673919
1.833333 -0.515363 -0.116644 3.060483 -0.419453 -0.102809 1.523912
1.866667 -0.529433 -0.120093 3.138858 -0.424300 -0.104285 1.286077
1.900000 -0.543681 -0.123586 -3.108399 -0.429112 -0.105765 0.985364
1.933333 -0.558080 -0.127129 -3.086210 -0.433882 -0.107246 0.641092
1.966667 -0.572651 -0.130733 -3.082943 -0.438606 -0.108726 0.273942
2.000000 -0.587371 -0.134386 -3.106135 -0.443284 -0.110202 -0.092107
2.033333 -0.602238 -0.138088 -3.133843 -0.447916 -0.111674 -0.431387
2.066667 -0.617251 -0.141839 3.114004 -0.452508 -0.113138 -0.725573
2.100000 -0.632410 -0.145639 3.085011 -0.457064 -0.114593 -0.960079
2.133333 -0.647713 -0.149488 3.030970 -0.461591 -0.116039 -1.117940
2.166667 -0.663180 -0.153381 2.979844 -0.466098 -0.117476 -1.190841
2.200000 -0.678789 -0.157323 2.939167 -0.470586 -0.118906 -1.176244
2.233333 -0.694557 -0.161309 2.876273 -0.475057 -0.120331 -1.077414
2.266667 -0.710465 -0.165344 2.801839 -0.479508 -0.121754 -0.905670
2.300000 -0.726527 -0.169425 2.740506 -0.483934 -0.123177 -0.672962
2.333333 -0.742741 -0.173552 2.675577 -0.488322 -0.124604 -0.399296
2.366667 -0.759104 -0.177727 2.648402 -0.492665 -0.126035 -0.107060
2.400000 -0.775613 -0.181950 2.679349 -0.496953 -0.127470 0.176011
2.433333 -0.792267 -0.186222 2.717528 -0.501179 -0.128909 0.423831
2.466667 -0.809064 -0.190542 2.766879 -0.505335 -0.130352 0.614691
2.500000 -0.826002 -0.194911 2.827337 -0.509416 -0.131799 0.730764
2.533333 -0.843067 -0.199329 2.898818 -0.513424 -0.133246 0.759403
2.566667 -0.860270 -0.203794 2.965825 -0.517358 -0.134693 0.696373
2.600000 -0.877598 -0.208309 3.007195 -0.521219 -0.136139 0.556233
2.633333 -0.895049 -0.212872 3.035614 -0.525010 -0.137583 0.352807
2.666667 -0.912620 -0.217485 3.034024 -0.528738 -0.139022 0.111282
2.700000 -0.930322 -0.222142 3.025966 -0.532407 -0.140457 -0.140579
2.733333 -0.948142 -0.226849 2.990147 -0.536017 -0.141889 -0.369051
2.766667 -0.966078 -0.231604 2.974560 -0.539571 -0.143318 -0.545119
2.800000 -0.984128 -0.236408 2.928736 -0.543071 -0.144744 -0.652492
2.833333 -1.002299 -0.241257 2.887583 -0.546514 -0.146169 -0.673755
2.866667 -1.020589 -0.246153 2.830592 -0.549898 -0.147594 -0.605926
2.900000 -1.038994 -0.251094 2.773439 -0.553222 -0.149019 -0.454849
2.933333 -1.057506 -0.256084 2.743815 -0.556484 -0.150445 -0.239533
2.966667 -1.076127 -0.261121 2.700705 -0.559682 -0.151872 0.020018
3.000000 -1.094851 -0.266206 2.695184 -0.562814 -0.153305 0.297346
3.033333 -1.113680 -0.271340 2.727320 -0.565879 -0.154743 0.563076
3.066667 -1.132608 -0.276522 2.775921 -0.568876 -0.156188 0.789707
3.100000 -1.151632 -0.281752 2.841066 -0.571807 -0.157641 0.955216
3.133333 -1.170756 -0.287030 2.915512 -0.574671 -0.159102 1.045966
3.166667 -1.189972 -0.292355 2.994061 -0.577471 -0.160572 1.051002
3.200000 -1.209284 -0.297727 3.060155 -0.580205 -0.162045 0.972249
3.233333 -1.228685 -0.303147 3.114880 -0.582874 -0.163518 0.816936
3.266667 -1.248171 -0.308613 -3.128725 -0.585477 -0.164990 0.600862
3.300000 -1.267745 -0.314140 -3.126266 -0.588013 -0.166454 0.341218
3.333333 -1.287403 -0.319726 -3.137746 -0.590480 -0.167908 0.058313
3.366667 -1.307142 -0.325359 3.136006 -0.592878 -0.169345 -0.223320
3.400000 -1.326962 -0.331034 3.104704 -0.595205 -0.170763 -0.481011
3.433333 -1.346858 -0.336754 3.089125 -0.597461 -0.172160 -0.693951
3.466667 -1.366828 -0.342522 3.053913 -0.599644 -0.173533 -0.845346
3.500000 -1.386868 -0.348335 3.011436 -0.601754 -0.174883 -0.919889
3.533333 -1.406977 -0.354194 2.968405 -0.603791 -0.176214 -0.909303
3.566667 -1.427154 -0.360094 2.907065 -0.605754 -0.177529 -0.811912
3.600000 -1.447396 -0.366034 2.853329 -0.607644 -0.178832 -0.638098
3.633333 -1.467699 -0.372016 2.788751 -0.609461 -0.180127 -0.400816
3.666667 -1.488061 -0.378040 2.732462 -0.611206 -0.181419 -0.118838
3.700000 -1.508479 -0.384106 2.729820 -0.612879 -0.182711 0.179456
3.733333 -1.528952 -0.390217 2.758245 -0.614480 -0.184006 0.465165
3.766667 -1.549476 -0.396372 2.801815 -0.616011 -0.185307 0.706208
3.800000 -1.570050 -0.402570 2.861406 -0.617471 -0.186615 0.882749
3.833333 -1.590673 -0.408812 2.949274 -0.618861 -0.187929 0.974154
3.866667 -1.611341 -0.415096 3.025591 -0.620182 -0.189247 0.968429
3.900000 -1.632051 -0.421420 3.118988 -0.621435 -0.190568 0.864307
3.933333 -1.652802 -0.427787 -3.113960 -0.622621 -0.191886 0.671600
3.966667 -1.673590 -0.434210 -3.099619 -0.623738 -0.193198 0.409982
4.000000 -1.694414 -0.440676 -3.098253 -0.624789 -0.194499 0.097358
4.033333 -1.715273 -0.447184 -3.113734 -0.625771 -0.195786 -0.234948
4.066667 -1.736161 -0.453746 3.134583 -0.626684 -0.197059 -0.556267
4.100000 -1.757081 -0.460345 3.095854 -0.627527 -0.198313 -0.831120
4.133333 -1.778029 -0.466980 3.065626 -0.628298 -0.199548 -1.033505
4.166667 -1.799002 -0.473657 3.004597 -0.628995 -0.200767 -1.145937
4.200000 -1.819997 -0.480370 2.957472 -0.629616 -0.201969 -1.153116
4.233333 -1.841013 -0.487125 2.879639 -0.630160 -0.203158 -1.052419
4.266667 -1.862046 -0.493916 2.801703 -0.630624 -0.204336 -0.851215
4.300000 -1.883094 -0.500747 2.732792 -0.631007 -0.205507 -0.570007
4.333333 -1.904153 -0.507616 2.665398 -0.631309 -0.206673 -0.233709
4.366667 -1.925219 -0.514525 2.649109 -0.631533 -0.207835 0.130547
4.400000 -1.946294 -0.521472 2.677703 -0.631677 -0.208995 0.491311
4.433333 -1.967370 -0.528459 2.735122 -0.631745 -0.210156 0.811254
4.466667 -1.988445 -0.535485 2.823866 -0.631739 -0.211320 1.057124
4.500000 -2.009518 -0.542550 2.888432 -0.631660 -0.212488 1.208901
4.533333 -2.030585 -0.549653 2.977221 -0.631511 -0.213663 1.254277
4.566667 -2.051646 -0.556794 3.078157 -0.631292 -0.214844 1.189138
4.600000 -2.072699 -0.563970 -3.121055 -0.631006 -0.216029 1.019630
4.633333 -2.093743 -0.571183 -3.072453 -0.630655 -0.217213 0.766910
4.666667 -2.114777 -0.578431 -3.072704 -0.630239 -0.218391 0.462114
4.700000 -2.135793 -0.585729 -3.080132 -0.629758 -0.219558 0.128507
4.733333 -2.156791 -0.593076 -3.088357 -0.629213 -0.220709 -0.204306
4.766667 -2.177767 -0.600471 -3.120543 -0.628604 -0.221838 -0.504466
4.800000 -2.198723 -0.607899 3.112735 -0.627931 -0.222939 -0.742903
4.833333 -2.219657 -0.615362 3.075924 -0.627195 -0.224011 -0.901381
4.866667 -2.240567 -0.622857 3.032335 -0.626397 -0.225050 -0.970368
4.900000 -2.261449 -0.630382 2.976030 -0.625536 -0.226055 -0.939613
4.933333 -2.282298 -0.637937 2.924208 -0.624612 -0.227028 -0.813613
4.966667 -2.303116 -0.645524 2.868706 -0.623625 -0.227973 -0.609090
5.000000 -2.323900 -0.653141 2.802878 -0.622574 -0.228893 -0.350352
5.033333 -2.344650 -0.660789 2.754372 -0.621459 -0.229793 -0.058347
5.066667 -2.365361 -0.668467 2.769496 -0.620278 -0.230676 0.237897
5.100000 -2.386033 -0.676174 2.796284 -0.619032 -0.231545 0.505827
5.133333 -2.406662 -0.683910 2.860435 -0.617719 -0.232402 0.716515
5.166667 -2.427247 -0.691674 2.923858 -0.616339 -0.233247 0.853776
5.200000 -2.447786 -0.699466 3.002162 -0.614891 -0.234081 0.903009
5.233333 -2.468270 -0.707286 3.088065 -0.613374 -0.234903 0.850033
5.266667 -2.488705 -0.715133 -3.121809 -0.611788 -0.235714 0.698457
5.300000 -2.509086 -0.723005 -3.102789 -0.610133 -0.236512 0.463351
5.333333 -2.529412 -0.730903 -3.096401 -0.608408 -0.237296 0.173240
5.366667 -2.549680 -0.738825 -3.091725 -0.606612 -0.238064 -0.149379
5.400000 -2.569890 -0.746772 -3.115552 -0.604747 -0.238816 -0.467903
5.433333 -2.590033 -0.754757 3.129261 -0.602811 -0.239550 -0.742416
5.466667 -2.610109 -0.762764 3.073197 -0.600804 -0.240265 -0.941555
5.500000 -2.630116 -0.770791 3.032469 -0.598727 -0.240961 -1.045954
5.533333 -2.650052 -0.778840 2.965953 -0.596580 -0.241637 -1.048583
5.566667 -2.669918 -0.786909 2.887791 -0.594364 -0.242292 -0.942052
5.600000 -2.689713 -0.794999 2.804614 -0.592084 -0.242927 -0.737861
5.633333 -2.709428 -0.803109 2.731969 -0.589740 -0.243540 -0.456640
5.666667 -2.729061 -0.811240 2.715075 -0.587336 -0.244135 -0.125698
5.700000 -2.748609 -0.819392 2.706894 -0.584874 -0.244714 0.227290
5.733333 -2.768070 -0.827565 2.760447 -0.582356 -0.245278 0.567543
5.766667 -2.787451 -0.835754 2.819757 -0.579784 -0.245830 0.858027
5.800000 -2.806748 -0.843960 2.866028 -0.577158 -0.246376 1.071339
5.833333 -2.825953 -0.852185 2.939519 -0.574479 -0.246919 1.186926
5.866667 -2.845066 -0.860427 3.030997 -0.571746 -0.247458 1.192785
5.900000 -2.864089 -0.868682 3.119986 -0.568959 -0.247993 1.086613
5.933333 -2.883023 -0.876952 -3.084826 -0.566117 -0.248524 0.881760
5.966667 -2.901864 -0.885233 -3.045581 -0.563218 -0.249046 0.597832
6.000000 -2.920604 -0.893543 -3.029042 -0.560264 -0.249554 0.256076
6.033333 -2.939241 -0.901879 -3.049207 -0.557257 -0.250039 -0.111030
6.066667 -2.957782 -0.910226 -3.073760 -0.554196 -0.250496 -0.465781
6.100000 -2.976215 -0.918597 -3.111696 -0.551082 -0.250919 -0.774155
6.133333 -2.994541 -0.926992 3.134643 -0.547918 -0.251302 -1.006442
6.166667 -3.012761 -0.935394 3.087588 -0.544704 -0.251640 -1.139303
6.200000 -3.030871 -0.943801 2.999557 -0.541441 -0.251931 -1.152516
6.233333 -3.048871 -0.952213 2.922748 -0.538128 -0.252176 -1.048306
6.266667 -3.066763 -0.960630 2.847084 -0.534768 -0.252376 -0.839875
6.300000 -3.084548 -0.969051 2.759982 -0.531362 -0.252533 -0.543548
6.333333 -3.102223 -0.977475 2.703693 -0.527911 -0.252653 -0.188158
6.366667 -3.119776 -0.985903 2.720280 -0.524415 -0.252741 0.191854
6.400000 -3.137206 -0.994335 2.755733 -0.520876 -0.252801 0.555432
6.433333 -3.154511 -1.002770 2.806461 -0.517299 -0.252837 0.869768
6.466667 -3.171702 -1.011205 2.896143 -0.513685 -0.252851 1.102989
6.500000 -3.188775 -1.019638 2.973735 -0.510035 -0.252846 1.225245
6.533333 -3.205721 -1.028071 3.065811 -0.506353 -0.252824 1.221670
6.566667 -3.222538 -1.036503 -3.126823 -0.502639 -0.252783 1.093553
6.600000 -3.239234 -1.044930 -3.061392 -0.498894 -0.252723 0.852847
6.633333 -3.255810 -1.053353 -3.001270 -0.495117 -0.252645 0.517554
6.666667 -3.272263 -1.061770 -2.996456 -0.491307 -0.252545 0.120818
6.700000 -3.288582 -1.070196 -3.017539 -0.487462 -0.252421 -0.297116
6.733333 -3.304777 -1.078614 -3.041690 -0.483582 -0.252270 -0.696602
6.766667 -3.320846 -1.087024 -3.086700 -0.479665 -0.252091 -1.042274
6.800000 -3.336779 -1.095440 3.125864 -0.475709 -0.251881 -1.302542
6.833333 -3.352577 -1.103845 3.051057 -0.471713 -0.251639 -1.450884
6.866667 -3.368240 -1.112239 2.960412 -0.467678 -0.251362 -1.475482
6.900000 -3.383765 -1.120621 2.866447 -0.463603 -0.251053 -1.383530
6.933333 -3.399159 -1.128990 2.775982 -0.459490 -0.250711 -1.187164
6.966667 -3.414422 -1.137344 2.693318 -0.455339 -0.250337 -0.904711
7.000000 -3.429542 -1.145686 2.634148 -0.451152 -0.249933 -0.559791
7.033333 -3.444518 -1.154015 2.643976 -0.446931 -0.249499 -0.182157
7.066667 -3.459349 -1.162332 2.669037 -0.442680 -0.249037 0.190501
7.100000 -3.474045 -1.170630 2.717048 -0.438398 -0.248548 0.533688
7.133333 -3.488593 -1.178914 2.773333 -0.434088 -0.248036 0.818774
7.166667 -3.502993 -1.187181 2.826951 -0.429755 -0.247498 1.017957
7.200000 -3.517244 -1.195431 2.910466 -0.425404 -0.246936 1.105458
7.233333 -3.531358 -1.203658 2.944366 -0.421036 -0.246350 1.073351
7.266667 -3.545322 -1.211865 2.989444 -0.416655 -0.245738 0.931086
7.300000 -3.559137 -1.220050 3.057405 -0.412266 -0.245096 0.686135
7.333333 -3.572813 -1.228210 3.124488 -0.407872 -0.244420 0.356690
7.366667 -3.586339 -1.236342 -3.106248 -0.403473 -0.243708 -0.031484
7.400000 -3.599712 -1.244464 -3.121165 -0.399068 -0.242957 -0.438113
7.433333 -3.612931 -1.252572 3.140898 -0.394659 -0.242161 -0.835617
7.466667 -3.626010 -1.260649 3.075503 -0.390248 -0.241318 -1.198958
7.500000 -3.638949 -1.268695 3.003727 -0.385831 -0.240427 -1.497128
7.533333 -3.651747 -1.276708 2.903494 -0.381408 -0.239486 -1.704289
7.566667 -3.664391 -1.284686 2.799089 -0.376981 -0.238494 -1.799109
7.600000 -3.676881 -1.292628 2.703471 -0.372550 -0.237452 -1.786190
7.633333 -3.689229 -1.300533 2.594956 -0.368114 -0.236363 -1.669972
7.666667 -3.701420 -1.308401 2.501430 -0.363673 -0.235231 -1.464225
7.700000 -3.713469 -1.316230 2.461666 -0.359231 -0.234058 -1.195055
7.733333 -3.725378 -1.324021 2.436266 -0.354791 -0.232848 -0.875073
7.766667 -3.737126 -1.331769 2.426888 -0.350354 -0.231603 -0.531609
7.800000 -3.748732 -1.339477 2.420523 -0.345921 -0.230322 -0.179101
7.833333 -3.760177 -1.347140 2.437037 -0.341495 -0.229006 0.167857
7.866667 -3.771480 -1.354759 2.447318 -0.337075 -0.227651 0.497741
7.900000 -3.782643 -1.362334 2.539860 -0.332658 -0.226254 0.820479
7.933333 -3.793666 -1.369863 2.551800 -0.328243 -0.224814 1.105896
7.966667 -3.804524 -1.377340 2.551800 -0.323829 -0.223329 1.355053
8.000000 -3.815243 -1.384770 2.551800 -0.319418 -0.221799 1.572274
8.033333 -3.825823 -1.392151 2.551800 -0.315008 -0.220225 1.759895
8.066667 -3.836263 -1.399483 2.756723 -0.310603 -0.218610 1.910346
8.100000 -3.846540 -1.406753 2.905482 -0.306208 -0.216958 1.996148
8.133333 -3.856680 -1.413972 2.951466 -0.301830 -0.215275 2.027451
8.166667 -3.866659 -1.421124 2.998141 -0.297469 -0.213563 1.984425
8.200000 -3.876479 -1.428207 2.998141 -0.293132 -0.211828 1.863260
8.233333 -3.886163 -1.435236 -3.082129 -0.288824 -0.210073 1.652920
8.266667 -3.895711 -1.442209 -3.082129 -0.284548 -0.208300 1.365288
8.300000 -3.905122 -1.449126 -2.950098 -0.280301 -0.206508 1.023352
8.333333 -3.914381 -1.455983 -2.901061 -0.276084 -0.204696 0.644102
8.366667 -3.923506 -1.462781 -2.921224 -0.271897 -0.202861 0.226082
8.400000 -3.932497 -1.469521 -2.921224 -0.267738 -0.201001 -0.226620
8.433333 -3.941354 -1.476201 -2.921224 -0.263605 -0.199112 -0.709838
8.466667 -3.950080 -1.482820 -3.007666 -0.259493 -0.197188 -1.190616
8.500000 -3.958658 -1.489371 -3.093006 -0.255406 -0.195229 -1.652234
8.533333 -3.967089 -1.495853 -3.093006 -0.251343 -0.193236 -2.128358
8.566667 -3.975390 -1.502271 -3.093006 -0.247305 -0.191208 -2.561070
8.600000 -3.983563 -1.508625 2.933203 -0.243294 -0.189148 -2.939033
8.633333 -3.991590 -1.514891 2.933203 -0.239311 -0.187059 -3.225084
8.666667 -3.999490 -1.521091 2.933203 -0.235363 -0.184947 -3.452241
8.700000 -4.007264 -1.527224 2.499524 -0.231449 -0.182814 -3.609590
8.733333 -4.014913 -1.533290 2.499524 -0.227568 -0.180661 -3.620514
8.766667 -4.022438 -1.539288 2.163853 -0.223716 -0.178488 -3.472790
8.800000 -4.029812 -1.545197 2.163853 -0.219893 -0.176297 -3.189094
8.833333 -4.037065 -1.551036 2.163853 -0.216093 -0.174085 -2.763153
8.866667 -4.044197 -1.556805 1.794211 -0.212314 -0.171849 -2.135604
8.900000 -4.051210 -1.562503 1.794211 -0.208553 -0.169587 -1.347276
8.933333 -4.058104 -1.568129 1.673279 -0.204810 -0.167295 -0.450219
8.966667 -4.064881 -1.573683 1.650801 -0.201089 -0.164977 0.492192
9.000000 -4.071508 -1.579146 1.684451 -0.197392 -0.162628 1.507919
9.033333 -4.078020 -1.584536 1.684451 -0.193720 -0.160250 2.549352
9.066667 -4.084419 -1.589851 1.913611 -0.190075 -0.157844 3.484667
9.100000 -4.090673 -1.595072 2.138116 -0.186464 -0.155412 4.282614
9.133333 -4.096816 -1.600216 2.138116 -0.182892 -0.152959 4.954972
9.166667 -4.102850 -1.605284 2.504107 -0.179362 -0.150485 5.457947
9.200000 -4.108746 -1.610252 2.827655 -0.175878 -0.147995 5.753805
9.233333 -4.114536 -1.615142 3.119745 -0.172450 -0.145493 5.818179
9.266667 -4.120221 -1.619954 -3.081016 -0.169083 -0.142984 5.740161
9.300000 -4.125802 -1.624687 -2.743636 -0.165779 -0.140466 5.553393
9.333333 -4.131258 -1.629330 -2.510496 -0.162539 -0.137941 5.219166
9.366667 -4.136593 -1.633879 -2.327349 -0.159369 -0.135414 4.813205
9.400000 -4.141830 -1.638349 -2.327349 -0.156271 -0.132883 4.362689
9.433333 -4.146969 -1.642738 -2.327349 -0.153244 -0.130350 3.932799
9.466667 -4.152013 -1.647047 -2.008443 -0.150289 -0.127815 3.493422
9.500000 -4.156956 -1.651263 -2.008443 -0.147410 -0.125281 3.081800
9.533333 -4.161806 -1.655398 -1.738722 -0.144608 -0.122748 2.701195
9.566667 -4.166564 -1.659443 -1.738722 -0.141878 -0.120214 2.351009
9.600000 -4.171233 -1.663406 -1.738722 -0.139219 -0.117681 2.019697
9.633333 -4.175815 -1.667286 -1.738722 -0.136631 -0.115147 1.680441
9.666667 -4.180312 -1.671082 -1.535638 -0.134110 -0.112613 1.358957
9.700000 -4.184725 -1.674795 -1.535638 -0.131654 -0.110077 1.027688
9.733333 -4.189056 -1.678425 -1.516634 -0.129259 -0.107538 0.716721
9.766667 -4.193312 -1.681968 -1.501787 -0.126924 -0.104995 0.392094
9.800000 -4.197489 -1.685428 -1.479927 -0.124647 -0.102447 0.054801
9.833333 -4.201595 -1.688801 -1.483269 -0.122426 -0.099893 -0.299599
9.866667 -4.205631 -1.692090 -1.553438 -0.120258 -0.097333 -0.656166
9.900000 -4.209593 -1.695293 -1.560891 -0.118143 -0.094765 -1.014556
9.933333 -4.213485 -1.698410 -1.607634 -0.116079 -0.092189 -1.351088
