t x y theta dxdt dydt dthetadt
0.000000 0.000000 0.000000 2.559686 0.006490 -0.005184 0.011756
0.033333 0.000244 -0.000193 2.556375 0.005997 -0.008328 0.007498
0.066667 0.000208 -0.000335 2.564980 0.005748 -0.012137 0.002656
0.100000 -0.000104 -0.000429 2.563329 0.006006 -0.016933 -0.004401
0.133333 -0.000688 -0.000476 2.548137 0.007183 -0.023103 -0.007720
0.166667 -0.000571 -0.001060 2.565789 0.009693 -0.031104 -0.007630
0.200000 -0.000720 -0.001600 2.558158 0.013890 -0.041381 -0.002396
0.233333 -0.000223 -0.002824 2.567880 0.020042 -0.054256 0.009345
0.266667 0.000011 -0.004003 2.559182 0.028179 -0.069881 0.031404
0.300000 -0.000018 -0.005138 2.560492 0.038388 -0.088552 0.061905
0.333333 0.000795 -0.007346 2.561527 0.050611 -0.110517 0.093698
0.366667 0.002389 -0.010955 2.550861 0.064549 -0.135673 0.126840
0.400000 0.005184 -0.016270 2.541737 0.079616 -0.163511 0.153299
0.433333 0.007712 -0.021527 2.547578 0.095305 -0.193490 0.171832
0.466667 0.009966 -0.026719 2.568564 0.111079 -0.224916 0.173496
0.500000 0.013941 -0.033933 2.591094 0.126145 -0.256670 0.160119
0.533333 0.019163 -0.043159 2.624003 0.139532 -0.287231 0.131262
0.566667 0.025048 -0.053919 2.630030 0.150411 -0.315262 0.081766
0.600000 0.031534 -0.066344 2.642810 0.158251 -0.339750 0.013840
0.633333 0.038245 -0.080147 2.623165 0.162486 -0.359635 -0.073312
0.666667 0.044912 -0.094820 2.619792 0.162386 -0.373686 -0.170215
0.700000 0.051484 -0.109610 2.619072 0.157582 -0.381127 -0.276426
0.733333 0.057707 -0.124222 2.591392 0.148278 -0.382024 -0.381461
0.766667 0.063569 -0.138638 2.582277 0.134774 -0.376625 -0.475951
0.800000 0.069057 -0.152837 2.556631 0.117401 -0.365331 -0.551701
0.833333 0.074159 -0.166798 2.551695 0.096530 -0.348809 -0.604250
0.866667 0.076596 -0.177536 2.534355 0.073206 -0.328628 -0.636335
0.900000 0.078625 -0.188000 2.493481 0.048351 -0.306231 -0.641362
0.933333 0.080237 -0.198173 2.455112 0.022690 -0.282685 -0.625491
0.966667 0.081422 -0.208039 2.399700 -0.002985 -0.258934 -0.588613
1.000000 0.079543 -0.214697 2.395290 -0.027583 -0.236001 -0.535263
1.033333 0.077222 -0.221016 2.365898 -0.049943 -0.214766 -0.464519
1.066667 0.074449 -0.226984 2.367944 -0.069387 -0.195278 -0.378412
1.100000 0.071220 -0.232586 2.367499 -0.085118 -0.177584 -0.287940
1.133333 0.067527 -0.237810 2.356471 -0.096422 -0.161674 -0.195302
1.166667 0.062668 -0.242737 2.348484 -0.102818 -0.147503 -0.110495
1.200000 0.057332 -0.247258 2.342840 -0.104584 -0.134574 -0.035680
1.233333 0.051514 -0.251361 2.351239 -0.102061 -0.122396 0.022215
1.266667 0.046624 -0.255521 2.348627 -0.095705 -0.110758 0.064629
1.300000 0.042971 -0.259402 2.358791 -0.086365 -0.099394 0.096348
1.333333 0.040705 -0.262626 2.380327 -0.075349 -0.088015 0.116758
1.366667 0.037922 -0.265376 2.391665 -0.063933 -0.076365 0.130668
1.400000 0.036287 -0.267519 2.393772 -0.053432 -0.064401 0.138309
1.433333 0.035800 -0.269423 2.388580 -0.045302 -0.052063 0.143174
1.466667 0.036692 -0.271161 2.392929 -0.040978 -0.039227 0.145662
1.500000 0.037012 -0.272373 2.387466 -0.041528 -0.025811 0.150011
1.533333 0.036745 -0.273046 2.393177 -0.047855 -0.011729 0.161358
1.566667 0.035873 -0.273167 2.402944 -0.060798 0.003113 0.182670
1.600000 0.035570 -0.273341 2.406025 -0.080927 0.018904 0.218116
1.633333 0.035029 -0.273002 2.414856 -0.108992 0.035862 0.270401
1.666667 0.032777 -0.271812 2.424025 -0.145343 0.054117 0.339870
1.700000 0.029854 -0.270016 2.432540 -0.190431 0.073804 0.416937
1.733333 0.022964 -0.267412 2.434177 -0.244022 0.095088 0.497502
1.766667 0.015375 -0.264178 2.432908 -0.305874 0.118132 0.577736
1.800000 0.007077 -0.260300 2.453379 -0.375017 0.142887 0.649388
1.833333 -0.001943 -0.255767 2.500841 -0.449676 0.169176 0.701142
1.866667 -0.017602 -0.250070 2.528089 -0.527915 0.196848 0.725460
1.900000 -0.033997 -0.243695 2.565296 -0.607966 0.225958 0.721015
1.933333 -0.056721 -0.235960 2.606106 -0.688077 0.256526 0.682335
1.966667 -0.085411 -0.226691 2.653876 -0.766058 0.288506 0.603839
2.000000 -0.114827 -0.216713 2.693736 -0.840437 0.322164 0.485152
2.033333 -0.144960 -0.206019 2.694390 -0.910213 0.357841 0.338348
2.066667 -0.179846 -0.193112 2.702297 -0.974950 0.395813 0.170409
2.100000 -0.215424 -0.179475 2.712750 -1.033871 0.435942 -0.006882
2.133333 -0.251677 -0.165103 2.710162 -1.086964 0.477903 -0.180949
2.166667 -0.288591 -0.149991 2.695771 -1.135159 0.521607 -0.337996
2.200000 -0.326149 -0.134135 2.677837 -1.179151 0.566602 -0.463270
2.233333 -0.366422 -0.115063 2.630457 -1.219464 0.612228 -0.554619
2.266667 -0.408709 -0.092819 2.596619 -1.256692 0.657829 -0.606216
2.300000 -0.451584 -0.069828 2.573406 -1.291718 0.703005 -0.619566
2.333333 -0.496812 -0.043556 2.524942 -1.324927 0.747288 -0.595543
2.366667 -0.542583 -0.016545 2.507822 -1.356207 0.789967 -0.541318
2.400000 -0.588873 0.011200 2.478453 -1.385529 0.830438 -0.463644
2.433333 -0.635658 0.039671 2.469003 -1.413206 0.868523 -0.370479
2.466667 -0.682914 0.068861 2.461764 -1.439448 0.904325 -0.269606
2.500000 -0.731360 0.099951 2.459222 -1.464147 0.937765 -0.164440
2.533333 -0.780921 0.132470 2.464745 -1.487435 0.969129 -0.062786
2.566667 -0.830877 0.165682 2.469492 -1.509260 0.998797 0.035794
2.600000 -0.881202 0.199577 2.476201 -1.529463 1.027283 0.123661
2.633333 -0.933193 0.234718 2.479720 -1.547480 1.054922 0.200727
2.666667 -0.985498 0.270520 2.486118 -1.562632 1.081850 0.265488
2.700000 -1.038813 0.307238 2.477600 -1.574496 1.108406 0.314887
2.733333 -1.092931 0.344747 2.502462 -1.582363 1.134944 0.346393
2.766667 -1.147197 0.383046 2.519523 -1.585616 1.161843 0.355179
2.800000 -1.201661 0.421952 2.537275 -1.583594 1.189402 0.343414
2.833333 -1.255823 0.461559 2.567111 -1.576161 1.217812 0.308044
2.866667 -1.310123 0.501744 2.593354 -1.563189 1.247266 0.250490
2.900000 -1.363015 0.542959 2.608709 -1.544556 1.278002 0.168782
2.933333 -1.415079 0.585878 2.608746 -1.520559 1.310012 0.069704
2.966667 -1.465586 0.630566 2.612113 -1.491955 1.343061 -0.040192
3.000000 -1.516123 0.675763 2.609902 -1.459862 1.376882 -0.155767
3.033333 -1.566665 0.721450 2.602723 -1.425033 1.411345 -0.266982
3.066667 -1.614686 0.769002 2.583788 -1.388479 1.446328 -0.368182
3.100000 -1.659880 0.818143 2.555544 -1.351461 1.481507 -0.448347
3.133333 -1.702050 0.868924 2.531744 -1.315316 1.516527 -0.503319
3.166667 -1.744144 0.920104 2.498104 -1.280886 1.551317 -0.531628
3.200000 -1.786149 0.971657 2.499220 -1.248891 1.585754 -0.532022
3.233333 -1.826339 1.025158 2.461207 -1.220419 1.619506 -0.504508
3.266667 -1.865004 1.080407 2.434357 -1.196277 1.652143 -0.451346
3.300000 -1.903541 1.135947 2.415111 -1.176796 1.683329 -0.377320
3.333333 -1.941152 1.192680 2.398153 -1.161931 1.712877 -0.287607
3.366667 -1.978085 1.250390 2.384635 -1.151809 1.740433 -0.183830
3.400000 -2.015407 1.309820 2.391918 -1.146442 1.765596 -0.070770
3.433333 -2.053118 1.370696 2.387840 -1.145360 1.788066 0.045273
3.466667 -2.090621 1.431807 2.403944 -1.147959 1.807676 0.159093
3.500000 -2.127937 1.493016 2.388050 -1.153709 1.824229 0.269254
3.533333 -2.165056 1.554286 2.416219 -1.162002 1.837564 0.371639
3.566667 -2.203122 1.616270 2.428946 -1.172102 1.847604 0.464615
3.600000 -2.242386 1.678742 2.452521 -1.183244 1.854489 0.547078
3.633333 -2.282622 1.741455 2.477570 -1.194706 1.858449 0.617099
3.666667 -2.323758 1.804251 2.505192 -1.205668 1.859624 0.676109
3.700000 -2.364637 1.866928 2.530289 -1.215401 1.858185 0.717290
3.733333 -2.405247 1.929449 2.549069 -1.223339 1.854294 0.743281
3.766667 -2.446680 1.991651 2.577200 -1.228936 1.848147 0.747323
3.800000 -2.488839 2.053353 2.605457 -1.231754 1.839924 0.730797
3.833333 -2.530685 2.114791 2.636783 -1.231608 1.829823 0.694666
3.866667 -2.572202 2.175929 2.664764 -1.228498 1.817990 0.639942
3.900000 -2.614114 2.236898 2.717412 -1.222373 1.804552 0.571906
3.933333 -2.655666 2.297496 2.723676 -1.212896 1.789268 0.491866
3.966667 -2.696809 2.357164 2.739229 -1.199881 1.771878 0.410927
4.000000 -2.736800 2.415595 2.757938 -1.182901 1.751737 0.329238
4.033333 -2.776319 2.473603 2.751333 -1.161039 1.727685 0.248562
4.066667 -2.815385 2.531727 2.756847 -1.133677 1.698797 0.165610
4.100000 -2.854019 2.589309 2.745084 -1.099785 1.663614 0.081868
4.133333 -2.892207 2.646315 2.743816 -1.058937 1.621260 -0.003362
4.166667 -2.929938 2.702713 2.735460 -1.010616 1.570794 -0.094109
4.200000 -2.964492 2.756296 2.745635 -0.955058 1.512084 -0.185569
4.233333 -2.998567 2.809207 2.751023 -0.893288 1.445908 -0.270494
4.266667 -3.028554 2.858257 2.746647 -0.826405 1.373239 -0.334061
4.300000 -3.058049 2.906580 2.775731 -0.756530 1.296184 -0.369718
4.333333 -3.082677 2.949752 2.754505 -0.685850 1.216958 -0.366396
4.366667 -3.102045 2.986810 2.699189 -0.616294 1.137912 -0.312904
4.400000 -3.120928 3.023083 2.638526 -0.549038 1.060731 -0.199510
4.433333 -3.132881 3.051704 2.581789 -0.485403 0.987221 -0.021944
4.466667 -3.144372 3.079521 2.564114 -0.425955 0.917743 0.210469
4.500000 -3.155414 3.106530 2.574385 -0.370696 0.851338 0.488827
4.533333 -3.166024 3.132728 2.591852 -0.318896 0.786307 0.786590
4.566667 -3.176216 3.158112 2.626472 -0.270624 0.720085 1.064675
4.600000 -3.186007 3.182680 2.685436 -0.226399 0.650529 1.280997
4.633333 -3.195412 3.206429 2.750455 -0.185960 0.574549 1.390234
4.666667 -3.204449 3.229359 2.839870 -0.149646 0.491043 1.361009
4.700000 -3.205250 3.247175 2.942579 -0.118495 0.400777 1.169990
4.733333 -3.205724 3.264172 3.053229 -0.094226 0.305027 0.816665
4.766667 -3.205898 3.280357 -3.128299 -0.078023 0.206674 0.320753
4.800000 -3.203976 3.285409 -3.065013 -0.071021 0.109119 -0.293740
4.833333 -3.201550 3.280697 -3.044714 -0.074300 0.016695 -0.983368
4.866667 -3.198909 3.275221 -3.108038 -0.088776 -0.067131 -1.696156
4.900000 -3.199492 3.260744 3.038184 -0.113906 -0.139545 -2.377826
4.933333 -3.202623 3.248413 2.927469 -0.148253 -0.198265 -2.986981
4.966667 -3.209230 3.237732 2.736181 -0.189866 -0.241934 -3.487806
5.000000 -3.215716 3.226422 2.547653 -0.236258 -0.270639 -3.853938
5.033333 -3.222097 3.214517 2.354493 -0.285194 -0.285787 -4.076570
5.066667 -3.232316 3.203758 2.186795 -0.334086 -0.288534 -4.173763
5.100000 -3.246037 3.194024 2.023875 -0.380893 -0.281042 -4.177107
5.133333 -3.262820 3.185356 1.864568 -0.424096 -0.264999 -4.114088
5.166667 -3.279543 3.176217 1.735199 -0.462862 -0.241669 -4.021959
5.200000 -3.296210 3.166635 1.658728 -0.496681 -0.211624 -3.928081
5.233333 -3.314891 3.158215 1.571357 -0.524898 -0.174827 -3.856124
5.266667 -3.333525 3.149408 1.481475 -0.547569 -0.131781 -3.810511
5.300000 -3.353430 3.143050 1.362415 -0.565365 -0.082750 -3.783435
5.333333 -3.374134 3.140154 1.214714 -0.579368 -0.028092 -3.761847
5.366667 -3.394793 3.136940 1.084237 -0.590647 0.031281 -3.723406
5.400000 -3.415117 3.138330 0.951424 -0.600430 0.093858 -3.651921
5.433333 -3.434974 3.144491 0.804504 -0.610455 0.158142 -3.532218
5.466667 -3.454785 3.150376 0.635369 -0.622110 0.222900 -3.357488
5.500000 -3.474553 3.160630 0.468000 -0.636426 0.286911 -3.130643
5.533333 -3.494838 3.174730 0.367441 -0.653910 0.348706 -2.869595
5.566667 -3.515076 3.188563 0.271059 -0.674712 0.406838 -2.597193
5.600000 -3.535264 3.202126 0.211041 -0.698710 0.460655 -2.333127
5.633333 -3.557408 3.218331 0.168037 -0.725113 0.509540 -2.093526
5.666667 -3.581645 3.236718 0.136466 -0.752919 0.552468 -1.889302
5.700000 -3.607930 3.257035 0.125838 -0.780819 0.588768 -1.727745
5.733333 -3.636003 3.279244 0.098326 -0.807552 0.618167 -1.597463
5.766667 -3.665554 3.303243 0.052761 -0.831902 0.640407 -1.479348
5.800000 -3.695014 3.326921 -0.009785 -0.852566 0.654461 -1.357488
5.833333 -3.725515 3.351765 -0.076017 -0.868466 0.659094 -1.216407
5.866667 -3.755901 3.376255 -0.149412 -0.878726 0.653430 -1.044043
5.900000 -3.786158 3.400373 -0.242295 -0.882926 0.636712 -0.825051
5.933333 -3.816760 3.424088 -0.303902 -0.880871 0.608217 -0.559091
5.966667 -3.847232 3.446300 -0.328729 -0.872634 0.567677 -0.257844
6.000000 -3.877211 3.465609 -0.307940 -0.858738 0.516157 0.067786
6.033333 -3.907006 3.484483 -0.279813 -0.839778 0.455413 0.401930
6.066667 -3.936606 3.502910 -0.232427 -0.816573 0.387751 0.725912
6.100000 -3.965996 3.520877 -0.161553 -0.789462 0.315143 1.015871
6.133333 -3.992882 3.531683 -0.141640 -0.758904 0.239938 1.257647
6.166667 -4.017412 3.535907 -0.087151 -0.725248 0.164537 1.442502
6.200000 -4.039136 3.533929 -0.017677 -0.688722 0.090774 1.563999
6.233333 -4.060618 3.531483 0.049952 -0.649888 0.020309 1.618264
6.266667 -4.081852 3.528576 0.115065 -0.609094 -0.045678 1.609519
6.300000 -4.102834 3.525216 0.179451 -0.567312 -0.105695 1.543341
6.333333 -4.123557 3.521412 0.235872 -0.525095 -0.159366 1.420088
6.366667 -4.140198 3.514099 0.296862 -0.483465 -0.206704 1.244232
6.400000 -4.156576 3.506362 0.353508 -0.443231 -0.248334 1.024840
6.433333 -4.168968 3.496296 0.420309 -0.405426 -0.284736 0.771476
6.466667 -4.181103 3.485832 0.448846 -0.371209 -0.316245 0.489270
6.500000 -4.190990 3.473741 0.460487 -0.341589 -0.343258 0.189016
6.533333 -4.199528 3.460439 0.441499 -0.317844 -0.365390 -0.110740
6.566667 -4.207400 3.446150 0.407639 -0.300297 -0.382482 -0.386618
6.600000 -4.215042 3.431530 0.399094 -0.289388 -0.393975 -0.618547
6.633333 -4.222463 3.416595 0.361727 -0.284414 -0.399845 -0.786940
6.666667 -4.229671 3.401366 0.312991 -0.284292 -0.400264 -0.875303
6.700000 -4.238815 3.386852 0.252709 -0.287419 -0.395702 -0.874569
6.733333 -4.247761 3.372079 0.205617 -0.291968 -0.387052 -0.785430
6.766667 -4.258494 3.358744 0.151347 -0.296369 -0.375122 -0.621864
6.800000 -4.270561 3.347001 0.084857 -0.298927 -0.360874 -0.403320
6.833333 -4.282444 3.335042 0.026612 -0.298507 -0.345139 -0.148159
6.866667 -4.294030 3.324766 0.011220 -0.294146 -0.328850 0.127066
6.900000 -4.305438 3.314297 0.058232 -0.285209 -0.312486 0.406573
6.933333 -4.316668 3.303647 0.171525 -0.271264 -0.296368 0.671657
6.966667 -4.325965 3.294301 0.228542 -0.252398 -0.280604 0.916071
7.000000 -4.333608 3.286156 0.261358 -0.229079 -0.265114 1.140492
7.033333 -4.341090 3.277854 0.271840 -0.201967 -0.249435 1.348682
7.066667 -4.347709 3.269825 0.328797 -0.171999 -0.232550 1.544288
7.100000 -4.354182 3.261652 0.389808 -0.140341 -0.213903 1.734501
7.133333 -4.360515 3.253341 0.437357 -0.108054 -0.192501 1.935954
7.166667 -4.364176 3.245850 0.468596 -0.075951 -0.167329 2.151091
7.200000 -4.365168 3.239811 0.512717 -0.044683 -0.137429 2.375103
7.233333 -4.363614 3.235905 0.581761 -0.015076 -0.102796 2.594557
7.266667 -4.361967 3.231872 0.675080 0.012182 -0.064027 2.799079
7.300000 -4.360245 3.227712 0.806833 0.036608 -0.021531 2.976242
7.333333 -4.358462 3.223426 0.954001 0.057620 0.023468 3.108822
7.366667 -4.355535 3.224040 1.094233 0.074825 0.069362 3.184946
7.400000 -4.351768 3.229595 1.232403 0.087856 0.114249 3.196583
7.433333 -4.347990 3.235006 1.353032 0.096609 0.156963 3.145756
7.466667 -4.343610 3.245099 1.456164 0.100783 0.195818 3.038793
7.500000 -4.339257 3.255017 1.550915 0.100080 0.229133 2.885237
7.533333 -4.334947 3.264743 1.652020 0.094034 0.255509 2.694382
7.566667 -4.330699 3.274258 1.729851 0.081944 0.274172 2.479162
7.600000 -4.327136 3.286014 1.801619 0.063515 0.284912 2.251221
7.633333 -4.323671 3.297522 1.881444 0.038730 0.287453 2.014796
7.666667 -4.320320 3.308761 1.953066 0.008122 0.282620 1.764018
7.700000 -4.317101 3.319710 2.003099 -0.027735 0.271163 1.489455
7.733333 -4.316563 3.330092 2.044523 -0.067595 0.254122 1.192811
7.766667 -4.319044 3.339449 2.077259 -0.109452 0.232351 0.879010
7.800000 -4.324840 3.347312 2.132003 -0.151162 0.206669 0.554094
7.833333 -4.330816 3.354809 2.177796 -0.190823 0.177839 0.229751
7.866667 -4.339699 3.360370 2.183753 -0.226313 0.146371 -0.073624
7.900000 -4.351265 3.363888 2.172878 -0.255376 0.113074 -0.331589
7.933333 -4.363021 3.366992 2.133913 -0.276330 0.078490 -0.534560
7.966667 -4.374966 3.369669 2.079992 -0.288582 0.043119 -0.686542
8.000000 -4.387487 3.370549 2.005978 -0.292628 0.007279 -0.789286
8.033333 -4.399779 3.370009 1.896828 -0.289010 -0.028630 -0.847157
8.066667 -4.412257 3.369003 1.843954 -0.279558 -0.064521 -0.874560
8.100000 -4.422557 3.366280 1.848560 -0.267038 -0.100772 -0.894561
8.133333 -4.430063 3.361832 1.851093 -0.254415 -0.137445 -0.921217
8.166667 -4.437761 3.356891 1.857538 -0.244223 -0.174646 -0.957639
8.200000 -4.442748 3.350072 1.865352 -0.238500 -0.212392 -1.008032
8.233333 -4.447937 3.342745 1.878380 -0.239650 -0.251146 -1.080182
8.266667 -4.452357 3.333755 1.860966 -0.249061 -0.290916 -1.171273
8.300000 -4.456993 3.324247 1.791447 -0.266812 -0.331348 -1.264261
8.333333 -4.463582 3.312984 1.702711 -0.292251 -0.372286 -1.349529
8.366667 -4.470399 3.301198 1.596235 -0.325048 -0.413726 -1.417143
8.400000 -4.481194 3.286837 1.519854 -0.364481 -0.455846 -1.460273
8.433333 -4.496393 3.269370 1.454665 -0.408621 -0.497960 -1.469381
8.466667 -4.511819 3.251383 1.425908 -0.455684 -0.539746 -1.444938
8.500000 -4.527468 3.232883 1.391964 -0.504701 -0.581123 -1.398135
8.533333 -4.543333 3.213873 1.372056 -0.555502 -0.622229 -1.335656
8.566667 -4.564720 3.190950 1.336383 -0.607047 -0.662729 -1.267223
8.600000 -4.586305 3.167531 1.303876 -0.658564 -0.702244 -1.196718
8.633333 -4.608075 3.143627 1.275379 -0.710414 -0.741109 -1.126111
8.666667 -4.630017 3.119245 1.217940 -0.763226 -0.779618 -1.051313
8.700000 -4.656081 3.092590 1.165470 -0.816925 -0.817701 -0.965628
8.733333 -4.685895 3.063844 1.130339 -0.870609 -0.854818 -0.862945
8.766667 -4.715827 3.034657 1.079539 -0.924338 -0.891000 -0.738636
8.800000 -4.745854 3.005044 1.038427 -0.978159 -0.926248 -0.594801
8.833333 -4.779256 2.973455 1.022051 -1.031705 -0.960265 -0.435464
8.866667 -4.815838 2.940098 1.015804 -1.083980 -0.992534 -0.265511
8.900000 -4.855316 2.905013 1.011878 -1.134328 -1.022772 -0.093777
8.933333 -4.894773 2.869571 1.043015 -1.182669 -1.051081 0.067956
8.966667 -4.934176 2.833793 1.068333 -1.228402 -1.077196 0.210829
9.000000 -4.975674 2.797050 1.050377 -1.270807 -1.100734 0.332864
9.033333 -5.019211 2.759479 1.072338 -1.309144 -1.121330 0.429946
9.066667 -5.064301 2.721626 1.106593 -1.343326 -1.138840 0.497709
9.100000 -5.111875 2.682597 1.120810 -1.373407 -1.153070 0.536691
9.133333 -5.159195 2.643339 1.140521 -1.399291 -1.163697 0.553258
9.166667 -5.208712 2.603267 1.169112 -1.420641 -1.170516 0.551600
9.200000 -5.257882 2.563013 1.195551 -1.437251 -1.173378 0.529726
9.233333 -5.306657 2.522602 1.216902 -1.449005 -1.172148 0.491910
9.266667 -5.354989 2.482058 1.231754 -1.455638 -1.166708 0.443550
9.300000 -5.404386 2.441942 1.249073 -1.456907 -1.157216 0.387890
9.333333 -5.453953 2.402513 1.265367 -1.452513 -1.143901 0.324388
9.366667 -5.503203 2.364242 1.274065 -1.442342 -1.126911 0.255364
9.400000 -5.552864 2.326696 1.281824 -1.426311 -1.106715 0.186365
9.433333 -5.602227 2.290236 1.278621 -1.404002 -1.083887 0.120037
9.466667 -5.650848 2.253771 1.272756 -1.374948 -1.058939 0.060699
9.500000 -5.698676 2.217321 1.270628 -1.338302 -1.031946 0.014438
9.533333 -5.744229 2.183122 1.280839 -1.292954 -1.002805 -0.011463
9.566667 -5.786898 2.151430 1.281999 -1.238499 -0.971846 -0.009498
9.600000 -5.828629 2.119799 1.275933 -1.174087 -0.938906 0.025275
9.633333 -5.869377 2.088245 1.272072 -1.099746 -0.903937 0.100903
9.666667 -5.909098 2.056778 1.247001 -1.014994 -0.866757 0.218881
9.700000 -5.943586 2.028297 1.230085 -0.920485 -0.827836 0.376073
9.733333 -5.976963 1.999926 1.237717 -0.817607 -0.787805 0.568033
9.766667 -6.003382 1.974709 1.239143 -0.707541 -0.747004 0.784071
9.800000 -6.028622 1.949616 1.269761 -0.592411 -0.706204 1.010951
9.833333 -6.047208 1.926839 1.315732 -0.473917 -0.666253 1.226472
9.866667 -6.058437 1.906998 1.356195 -0.355021 -0.628580 1.413019
9.900000 -6.068416 1.887289 1.426918 -0.237215 -0.594068 1.558312
9.933333 -6.070992 1.869934 1.496127 -0.122109 -0.563733 1.652670
9.966667 -6.072297 1.852707 1.618286 -0.010213 -0.538424 1.687228
10.000000 -6.066076 1.837259 1.705016 0.097959 -0.518938 1.665061
10.033333 -6.058581 1.821931 1.767877 0.202076 -0.505596 1.595148
10.066667 -6.049812 1.806720 1.824005 0.302760 -0.497954 1.488218
10.100000 -6.039775 1.791621 1.861887 0.399840 -0.495674 1.355017
10.133333 -6.028472 1.776630 1.884365 0.494341 -0.498152 1.207845
10.166667 -6.011536 1.761115 1.911341 0.585846 -0.504695 1.065236
10.200000 -5.989795 1.744778 1.927520 0.674884 -0.514379 0.935719
10.233333 -5.962949 1.727103 1.962348 0.761787 -0.526486 0.824788
10.266667 -5.934891 1.709522 1.982138 0.846670 -0.540608 0.736011
10.300000 -5.902076 1.690355 2.001249 0.929474 -0.556160 0.669578
10.333333 -5.868096 1.671279 2.033324 1.009502 -0.572585 0.620441
10.366667 -5.832979 1.652295 2.039941 1.087265 -0.589622 0.583950
10.400000 -5.796753 1.633405 2.064428 1.162950 -0.607059 0.555980
10.433333 -5.757079 1.613258 2.079709 1.236779 -0.624613 0.536475
10.466667 -5.714377 1.591932 2.102440 1.308810 -0.641893 0.521157
10.500000 -5.670661 1.570705 2.109285 1.379517 -0.658758 0.510419
10.533333 -5.623572 1.548127 2.126637 1.449217 -0.674996 0.505204
10.566667 -5.573056 1.524471 2.133895 1.517299 -0.690132 0.502632
10.600000 -5.521644 1.500928 2.157505 1.583294 -0.703793 0.499887
10.633333 -5.467098 1.476649 2.169592 1.646825 -0.715741 0.495444
10.666667 -5.409328 1.451831 2.191021 1.707648 -0.725895 0.490630
10.700000 -5.348628 1.426482 2.204621 1.765231 -0.734055 0.481337
10.733333 -5.287222 1.401279 2.236592 1.819076 -0.740209 0.466353
10.766667 -5.225164 1.376230 2.252326 1.869387 -0.744658 0.447182
10.800000 -5.162508 1.351345 2.263003 1.915887 -0.747592 0.426549
10.833333 -5.099307 1.326634 2.283104 1.958486 -0.749231 0.402344
10.866667 -5.032199 1.301459 2.290232 1.997170 -0.749829 0.375139
10.900000 -4.964658 1.276478 2.297022 2.032368 -0.749826 0.349040
10.933333 -4.893846 1.251024 2.300643 2.064409 -0.749608 0.327493
10.966667 -4.822721 1.225783 2.322907 2.093220 -0.749356 0.306203
11.000000 -4.751345 1.200768 2.332315 2.118933 -0.749367 0.286276
11.033333 -4.679780 1.175988 2.330176 2.141498 -0.749866 0.271052
11.066667 -4.608089 1.151455 2.337798 2.161031 -0.751035 0.261454
11.100000 -4.535132 1.126518 2.363645 2.177199 -0.752843 0.254240
11.133333 -4.462174 1.101851 2.359572 2.190052 -0.755227 0.249381
11.166667 -4.389280 1.077465 2.374264 2.199741 -0.758177 0.252128
11.200000 -4.315087 1.052408 2.376244 2.206243 -0.761476 0.260938
11.233333 -4.240145 1.026782 2.387588 2.209291 -0.764813 0.271731
11.266667 -4.164826 1.000609 2.394093 2.208334 -0.767698 0.280990
11.300000 -4.089833 0.974769 2.385489 2.202851 -0.769675 0.292643
11.333333 -4.015632 0.948531 2.398681 2.191846 -0.770152 0.299839
11.366667 -3.941889 0.922657 2.415621 2.173908 -0.768405 0.300544
11.400000 -3.868240 0.896375 2.436025 2.148054 -0.763871 0.292801
11.433333 -3.795321 0.869950 2.447839 2.113256 -0.755965 0.277593
11.466667 -3.723054 0.843938 2.473528 2.068638 -0.744318 0.255664
11.500000 -3.651504 0.818354 2.479383 2.012985 -0.728431 0.221544
11.533333 -3.582239 0.793232 2.485149 1.945807 -0.708121 0.179657
11.566667 -3.515826 0.768844 2.491124 1.867630 -0.683501 0.127108
11.600000 -3.450313 0.744933 2.486134 1.778821 -0.654737 0.064352
11.633333 -3.389036 0.722214 2.492026 1.680059 -0.622092 -0.012153
11.666667 -3.332678 0.701115 2.479672 1.572305 -0.585855 -0.104623
11.700000 -3.282413 0.682144 2.485379 1.457517 -0.546577 -0.215332
11.733333 -3.233250 0.663708 2.486096 1.337117 -0.504657 -0.349503
11.766667 -3.191901 0.647859 2.479882 1.212335 -0.460485 -0.506309
11.800000 -3.151726 0.632566 2.478734 1.083844 -0.414168 -0.686875
11.833333 -3.122130 0.620688 2.461960 0.953190 -0.366139 -0.882925
11.866667 -3.093759 0.609383 2.439980 0.821267 -0.316651 -1.086570
11.900000 -3.066632 0.598655 2.397581 0.688796 -0.266034 -1.283039
11.933333 -3.040768 0.588510 2.354885 0.556269 -0.214592 -1.456805
11.966667 -3.025958 0.582537 2.287577 0.424044 -0.162613 -1.594036
12.000000 -3.012433 0.577153 2.206480 0.293530 -0.110831 -1.678285
12.033333 -3.008867 0.575852 2.125120 0.165457 -0.060055 -1.703844
12.066667 -3.006585 0.575138 2.033219 0.040883 -0.011182 -1.664432
12.100000 -3.005579 0.575008 1.951421 -0.079565 0.034833 -1.563385
12.133333 -3.012127 0.578135 1.881051 -0.194024 0.076760 -1.404101
12.166667 -3.025359 0.583959 1.835204 -0.301289 0.113348 -1.196141
12.200000 -3.039819 0.590346 1.797251 -0.400684 0.143573 -0.953881
12.233333 -3.055485 0.597287 1.780596 -0.492238 0.166936 -0.689101
12.266667 -3.076604 0.605111 1.766736 -0.575575 0.182628 -0.418208
12.300000 -3.098873 0.613468 1.762624 -0.650090 0.190279 -0.151749
12.333333 -3.122261 0.622348 1.778141 -0.716594 0.190002 0.095956
12.366667 -3.149095 0.630012 1.780338 -0.775667 0.182393 0.316948
12.400000 -3.176981 0.638180 1.800600 -0.827902 0.168055 0.504347
12.433333 -3.207303 0.644273 1.817337 -0.873231 0.147723 0.656386
12.466667 -3.238604 0.650854 1.856467 -0.912425 0.122768 0.774063
12.500000 -3.271174 0.654598 1.897881 -0.946232 0.094439 0.857662
12.533333 -3.304645 0.658820 1.949852 -0.974854 0.063607 0.910804
12.566667 -3.338617 0.659982 1.988022 -0.998650 0.031255 0.938609
12.600000 -3.372724 0.658189 2.017590 -1.018008 -0.001400 0.947791
12.633333 -3.407612 0.656875 2.058231 -1.033681 -0.033389 0.941028
12.666667 -3.443239 0.656046 2.092085 -1.046048 -0.064002 0.922971
12.700000 -3.478655 0.652370 2.110070 -1.055931 -0.092312 0.898841
12.733333 -3.514729 0.649191 2.131039 -1.064334 -0.116934 0.875387
12.766667 -3.550487 0.643580 2.152654 -1.072004 -0.136966 0.852380
12.800000 -3.586822 0.638486 2.178434 -1.079637 -0.151970 0.830176
12.833333 -3.622276 0.631650 2.214251 -1.087858 -0.161329 0.809708
12.866667 -3.657910 0.623463 2.236842 -1.097246 -0.164385 0.790593
12.900000 -3.694002 0.615830 2.280769 -1.108134 -0.160997 0.769631
12.933333 -3.730149 0.608088 2.302387 -1.120610 -0.151425 0.744140
12.966667 -3.766626 0.600789 2.330090 -1.134638 -0.136114 0.717276
13.000000 -3.803875 0.594748 2.349648 -1.150236 -0.115143 0.693753
13.033333 -3.842318 0.590704 2.374320 -1.167131 -0.088856 0.676522
13.066667 -3.882508 0.589028 2.399190 -1.184911 -0.058014 0.666350
13.100000 -3.922910 0.587996 2.413776 -1.202898 -0.023359 0.668513
13.133333 -3.963482 0.587620 2.427229 -1.220483 0.014393 0.679950
13.166667 -4.004179 0.587909 2.443483 -1.237121 0.054742 0.696258
13.200000 -4.044959 0.588875 2.446239 -1.252073 0.097170 0.710869
13.233333 -4.088233 0.592760 2.470735 -1.264398 0.141174 0.718097
13.266667 -4.131498 0.597341 2.497350 -1.273437 0.186697 0.714668
13.300000 -4.174708 0.602625 2.543109 -1.278443 0.234111 0.689873
13.333333 -4.218609 0.611055 2.602540 -1.278637 0.283639 0.638249
13.366667 -4.262688 0.623080 2.636421 -1.272894 0.335472 0.551991
13.400000 -4.306571 0.635821 2.645133 -1.260042 0.389548 0.425315
13.433333 -4.350211 0.649278 2.677484 -1.239692 0.445763 0.251279
13.466667 -4.393560 0.663450 2.660285 -1.211338 0.503868 0.028663
13.500000 -4.436573 0.678339 2.666849 -1.174756 0.563229 -0.238245
13.533333 -4.477519 0.697296 2.682863 -1.129998 0.623338 -0.540570
13.566667 -4.515560 0.720170 2.677110 -1.077769 0.683528 -0.862943
13.600000 -4.553131 0.743745 2.651945 -1.019059 0.743083 -1.192164
13.633333 -4.586682 0.770946 2.624185 -0.954752 0.801128 -1.506466
13.666667 -4.619686 0.798827 2.551726 -0.885733 0.856785 -1.788903
13.700000 -4.648137 0.829772 2.454534 -0.813222 0.908780 -2.023811
13.733333 -4.671648 0.863266 2.380479 -0.738453 0.956042 -2.202122
13.766667 -4.694520 0.897394 2.259808 -0.662155 0.997658 -2.323936
13.800000 -4.716727 0.932136 2.140571 -0.585003 1.032576 -2.397010
13.833333 -4.734468 0.968775 2.033788 -0.507403 1.060131 -2.440424
13.866667 -4.751499 1.005990 1.923184 -0.429760 1.079666 -2.480387
13.900000 -4.764395 1.044090 1.849385 -0.352273 1.091137 -2.545018
13.933333 -4.772971 1.082604 1.803844 -0.274693 1.094251 -2.653350
13.966667 -4.780793 1.121631 1.761480 -0.197305 1.089051 -2.816601
14.000000 -4.787853 1.161149 1.740096 -0.120569 1.076033 -3.030865
14.033333 -4.790037 1.198387 1.677674 -0.044843 1.055822 -3.278232
14.066667 -4.791446 1.236076 1.591090 0.029550 1.029068 -3.527300
14.100000 -4.788392 1.270793 1.464212 0.102164 0.997001 -3.735197
14.133333 -4.781082 1.302029 1.293906 0.172170 0.961620 -3.862580
14.166667 -4.773001 1.333671 1.081980 0.239049 0.924642 -3.871913
14.200000 -4.764157 1.365710 0.861041 0.302358 0.887850 -3.737169
14.233333 -4.752171 1.394126 0.632709 0.361490 0.853267 -3.445390
14.266667 -4.737462 1.419241 0.460344 0.415492 0.823513 -3.003177
14.300000 -4.722021 1.444732 0.338980 0.463947 0.800274 -2.437791
14.333333 -4.704542 1.468264 0.282708 0.506691 0.784897 -1.788792
14.366667 -4.685107 1.491189 0.239523 0.543461 0.778804 -1.103525
14.400000 -4.664587 1.514660 0.258036 0.574079 0.783197 -0.431340
14.433333 -4.643400 1.538504 0.301767 0.598743 0.798473 0.179160
14.466667 -4.621564 1.562722 0.362458 0.618216 0.824089 0.696101
14.500000 -4.599099 1.587315 0.449179 0.632959 0.859772 1.104150
14.533333 -4.576024 1.612281 0.521855 0.643550 0.904330 1.401499
14.566667 -4.553906 1.641342 0.592633 0.650910 0.956088 1.593484
14.600000 -4.532642 1.674635 0.661585 0.656090 1.013153 1.697161
14.633333 -4.510823 1.708290 0.708847 0.659975 1.073783 1.739844
14.666667 -4.489551 1.747368 0.766670 0.663339 1.135809 1.739046
14.700000 -4.467757 1.786783 0.831630 0.667037 1.197176 1.709769
14.733333 -4.445457 1.826520 0.880071 0.671802 1.256533 1.664281
14.766667 -4.423251 1.870724 0.919538 0.678053 1.312884 1.611594
14.800000 -4.401078 1.918997 0.975294 0.686172 1.365444 1.555631
14.833333 -4.378449 1.967531 1.044652 0.696476 1.413396 1.484983
14.866667 -4.355383 2.016302 1.092820 0.709059 1.457086 1.400857
14.900000 -4.331895 2.065285 1.145288 0.723931 1.496633 1.301642
14.933333 -4.308660 2.115459 1.185142 0.740996 1.531907 1.183598
14.966667 -4.284340 2.168301 1.252542 0.760247 1.563010 1.043866
15.000000 -4.259651 2.221275 1.269329 0.781566 1.590343 0.884185
15.033333 -4.233648 2.275753 1.310958 0.804607 1.614337 0.716825
15.066667 -4.206354 2.331332 1.343509 0.829083 1.634903 0.543623
15.100000 -4.178749 2.386949 1.346355 0.854633 1.652027 0.369509
15.133333 -4.149829 2.443296 1.361068 0.880743 1.665825 0.198928
15.166667 -4.119404 2.500029 1.338038 0.906756 1.676335 0.044550
15.200000 -4.088734 2.556702 1.323570 0.931985 1.683257 -0.089919
15.233333 -4.056851 2.613302 1.327399 0.955925 1.686558 -0.203984
15.266667 -4.024773 2.669775 1.315118 0.978049 1.686304 -0.291844
15.300000 -3.991124 2.726751 1.293245 0.997661 1.682449 -0.353632
15.333333 -3.956315 2.783821 1.277946 1.014273 1.675096 -0.386422
15.366667 -3.921392 2.840661 1.261880 1.027613 1.664280 -0.396438
15.400000 -3.885718 2.897092 1.232242 1.037224 1.649902 -0.387350
15.433333 -3.849895 2.952703 1.220310 1.042730 1.631796 -0.358659
15.466667 -3.814425 3.007205 1.199980 1.043913 1.609972 -0.313171
15.500000 -3.778645 3.061255 1.187059 1.040819 1.584512 -0.252368
15.533333 -3.742719 3.114428 1.193945 1.033301 1.555111 -0.179484
15.566667 -3.706851 3.167177 1.180698 1.021139 1.521428 -0.096293
15.600000 -3.671944 3.218230 1.176303 1.004384 1.483243 -0.003043
15.633333 -3.638599 3.267041 1.171899 0.983147 1.440401 0.095424
15.666667 -3.605394 3.315343 1.173772 0.956983 1.391962 0.194186
15.700000 -3.572355 3.363110 1.192508 0.925660 1.337384 0.291797
15.733333 -3.541774 3.407248 1.193629 0.889555 1.276984 0.385576
15.766667 -3.511408 3.450803 1.211214 0.849047 1.211084 0.473509
15.800000 -3.481281 3.493755 1.235192 0.804753 1.140424 0.551391
15.833333 -3.453780 3.532437 1.254177 0.757238 1.065805 0.616086
15.866667 -3.429371 3.566274 1.291674 0.708182 0.989550 0.663301
15.900000 -3.405260 3.599458 1.316599 0.658649 0.913531 0.689031
15.933333 -3.385175 3.626798 1.349425 0.609069 0.839190 0.688696
15.966667 -3.365417 3.653470 1.363005 0.559878 0.767970 0.658118
16.000000 -3.351062 3.672831 1.386552 0.511515 0.701618 0.596883
16.033333 -3.337051 3.691523 1.434282 0.464045 0.641523 0.505010
16.066667 -3.323390 3.709550 1.447266 0.416602 0.587927 0.388822
16.100000 -3.310084 3.726915 1.482252 0.369106 0.541480 0.247366
16.133333 -3.297136 3.743622 1.499423 0.321673 0.502284 0.086164
16.166667 -3.284551 3.759677 1.487238 0.274417 0.470434 -0.088384
16.200000 -3.272333 3.775083 1.472268 0.226965 0.444740 -0.271351
16.233333 -3.265259 3.787920 1.475217 0.179852 0.424320 -0.456662
16.266667 -3.262302 3.799702 1.446178 0.134242 0.408432 -0.640335
16.300000 -3.259707 3.810861 1.406263 0.090999 0.396041 -0.810589
16.333333 -3.259598 3.822418 1.374015 0.051159 0.386422 -0.960942
16.366667 -3.261055 3.834644 1.341649 0.015908 0.378707 -1.089665
16.400000 -3.263330 3.847681 1.303876 -0.013282 0.372414 -1.196671
16.433333 -3.266022 3.861206 1.254509 -0.036060 0.366636 -1.281757
16.466667 -3.269023 3.874144 1.202339 -0.052746 0.360511 -1.351443
16.500000 -3.272322 3.886497 1.142558 -0.063847 0.353166 -1.414505
16.533333 -3.275905 3.898273 1.081948 -0.070234 0.343899 -1.479716
16.566667 -3.278419 3.910193 1.028751 -0.073197 0.332223 -1.548962
16.600000 -3.281194 3.921545 0.998468 -0.074128 0.318154 -1.620416
16.633333 -3.283179 3.932957 0.953181 -0.074011 0.302060 -1.689272
16.666667 -3.285402 3.943811 0.921911 -0.073662 0.284016 -1.748971
16.700000 -3.287242 3.953737 0.868592 -0.073950 0.263928 -1.791003
16.733333 -3.289212 3.961541 0.796380 -0.075572 0.241750 -1.804370
16.766667 -3.291388 3.968807 0.717244 -0.078845 0.217322 -1.782593
16.800000 -3.293759 3.975543 0.635106 -0.083974 0.190205 -1.722286
16.833333 -3.296316 3.981758 0.543620 -0.090980 0.159978 -1.628292
16.866667 -3.299048 3.987460 0.449050 -0.099434 0.126990 -1.498238
16.900000 -3.301943 3.992659 0.378896 -0.108628 0.092037 -1.335799
16.933333 -3.304991 3.997363 0.347292 -0.117586 0.055858 -1.151177
16.966667 -3.308182 4.001581 0.356285 -0.125181 0.019542 -0.954095
17.000000 -3.313202 4.001370 0.345059 -0.130277 -0.015433 -0.750374
17.033333 -3.319399 3.997633 0.335793 -0.131488 -0.047174 -0.543335
17.066667 -3.325701 3.993452 0.326663 -0.127669 -0.074149 -0.343622
17.100000 -3.332068 3.987632 0.312321 -0.117823 -0.094956 -0.157655
17.133333 -3.337740 3.981058 0.302603 -0.101535 -0.108440 0.014775
17.166667 -3.343477 3.974098 0.291351 -0.078779 -0.113939 0.173282
17.200000 -3.347289 3.968031 0.295288 -0.049916 -0.111594 0.308004
17.233333 -3.351141 3.961615 0.300866 -0.015992 -0.102490 0.412012
17.266667 -3.351990 3.957274 0.306941 0.021451 -0.088199 0.481676
17.300000 -3.349672 3.955127 0.345825 0.060621 -0.070727 0.512476
17.333333 -3.347372 3.952679 0.410894 0.100118 -0.051954 0.497516
17.366667 -3.342098 3.952498 0.467964 0.138255 -0.033816 0.434516
17.400000 -3.334031 3.954216 0.508080 0.173583 -0.017887 0.331399
17.433333 -3.325980 3.955665 0.524116 0.204993 -0.005273 0.197954
17.466667 -3.317947 3.956850 0.529167 0.232044 0.003612 0.044666
17.500000 -3.308149 3.958181 0.508272 0.254640 0.008882 -0.112168
17.533333 -3.298377 3.959266 0.474053 0.272634 0.010752 -0.253875
17.566667 -3.288637 3.960112 0.448905 0.286524 0.009911 -0.365607
17.600000 -3.278190 3.960486 0.411401 0.296985 0.007362 -0.437906
17.633333 -3.267568 3.960396 0.381087 0.304680 0.004132 -0.467744
17.666667 -3.256868 3.959962 0.355240 0.309855 0.000923 -0.454293
17.700000 -3.246274 3.959510 0.335796 0.312684 -0.001733 -0.403830
17.733333 -3.235742 3.958861 0.318375 0.313301 -0.003407 -0.325895
17.766667 -3.225280 3.958022 0.324084 0.311495 -0.003946 -0.230697
17.800000 -3.214337 3.957752 0.318549 0.306935 -0.003544 -0.127399
17.833333 -3.203477 3.957308 0.324455 0.299251 -0.002421 -0.024693
17.866667 -3.192394 3.957250 0.317696 0.288311 -0.000822 0.071829
17.900000 -3.181569 3.957514 0.327364 0.274066 0.000965 0.155819
17.933333 -3.171663 3.958048 0.326406 0.256566 0.002661 0.224198
17.966667 -3.161868 3.958435 0.342526 0.236097 0.004023 0.274482
18.000000 -3.153682 3.958811 0.349009 0.213233 0.004958 0.305449
18.033333 -3.147188 3.959131 0.377043 0.188826 0.005361 0.320220
18.066667 -3.140817 3.959322 0.390980 0.163755 0.005245 0.317679
18.100000 -3.136055 3.959435 0.420320 0.138946 0.004679 0.300857
18.133333 -3.132623 3.959529 0.435474 0.115293 0.003804 0.271214
18.166667 -3.130263 3.959681 0.440248 0.093643 0.002751 0.233907
18.200000 -3.128702 3.959754 0.441653 0.074501 0.001630 0.192358
18.233333 -3.127723 3.959880 0.443293 0.058080 0.000575 0.147906
18.266667 -3.126865 3.959908 0.440629 0.044505 -0.000350 0.106325
18.300000 -3.126124 3.959841 0.439403 0.033647 -0.001113 0.070851
18.333333 -3.125499 3.959685 0.436057 0.025251 -0.001715 0.045061
18.366667 -3.124986 3.959443 0.452837 0.018908 -0.002129 0.025605
18.400000 -3.124593 3.959265 0.437375 0.014209 -0.002369 0.012537
18.433333 -3.124291 3.959141 0.439573 0.010800 -0.002462 0.005678
