t x y theta dxdt dydt dthetadt
0.000000 0.000000 0.000000 1.759068 -0.150591 -0.017650 -0.035547
0.033333 -0.005074 -0.000605 1.761478 -0.154309 -0.019873 -0.040857
0.066667 -0.010269 -0.001295 1.731337 -0.158069 -0.022152 -0.040265
0.100000 -0.015588 -0.002070 1.753345 -0.161870 -0.024488 -0.035114
0.133333 -0.021038 -0.002915 1.755046 -0.165714 -0.026876 -0.029871
0.166667 -0.026612 -0.003849 1.744977 -0.169602 -0.029314 -0.024627
0.200000 -0.032322 -0.004856 1.743130 -0.173533 -0.031799 -0.017755
0.233333 -0.038167 -0.005938 1.743466 -0.177507 -0.034330 -0.009554
0.266667 -0.044139 -0.007115 1.750187 -0.181526 -0.036907 -0.005564
0.300000 -0.050251 -0.008371 1.757919 -0.185586 -0.039533 -0.001945
0.333333 -0.056492 -0.009725 1.746171 -0.189685 -0.042210 0.001747
0.366667 -0.062876 -0.011163 1.744080 -0.193819 -0.044945 0.004369
0.400000 -0.069390 -0.012703 1.750411 -0.197988 -0.047737 0.004966
0.433333 -0.076050 -0.014330 1.745826 -0.202189 -0.050589 0.003491
0.466667 -0.082856 -0.016047 1.744324 -0.206421 -0.053503 0.003421
0.500000 -0.089811 -0.017856 1.751594 -0.210686 -0.056477 0.003243
0.533333 -0.096899 -0.019773 1.745965 -0.214986 -0.059509 0.004474
0.566667 -0.104139 -0.021787 1.747803 -0.219322 -0.062600 0.006568
0.600000 -0.111512 -0.023913 1.761807 -0.223694 -0.065749 0.008209
0.633333 -0.119020 -0.026154 1.756179 -0.228099 -0.068956 0.009058
0.666667 -0.126684 -0.028497 1.738681 -0.232534 -0.072223 0.008117
0.700000 -0.134504 -0.030944 1.743137 -0.236991 -0.075549 0.007817
0.733333 -0.142460 -0.033512 1.744683 -0.241466 -0.078939 0.006600
0.766667 -0.150576 -0.036188 1.747031 -0.245956 -0.082390 0.008070
0.800000 -0.158851 -0.038976 1.765348 -0.250460 -0.085905 0.013742
0.833333 -0.167289 -0.041877 1.754334 -0.254977 -0.089483 0.023581
0.866667 -0.175889 -0.044893 1.758623 -0.259509 -0.093127 0.035838
0.900000 -0.184625 -0.048038 1.749652 -0.264063 -0.096834 0.051579
0.933333 -0.193498 -0.051314 1.742072 -0.268638 -0.100605 0.074194
0.966667 -0.202508 -0.054721 1.744755 -0.273237 -0.104440 0.104121
1.000000 -0.211653 -0.058263 1.747632 -0.277862 -0.108337 0.145534
1.033333 -0.220967 -0.061931 1.758042 -0.282516 -0.112296 0.200525
1.066667 -0.230450 -0.065729 1.766485 -0.287200 -0.116316 0.274713
1.100000 -0.240104 -0.069658 1.783927 -0.291909 -0.120400 0.364079
1.133333 -0.249929 -0.073722 1.782017 -0.296639 -0.124550 0.467373
1.166667 -0.259888 -0.077927 1.780304 -0.301383 -0.128773 0.584241
1.200000 -0.270020 -0.082271 1.784506 -0.306129 -0.133075 0.716140
1.233333 -0.280321 -0.086757 1.818524 -0.310871 -0.137466 0.863000
1.266667 -0.290756 -0.091390 1.855513 -0.315605 -0.141959 1.021556
1.300000 -0.301359 -0.096173 1.904441 -0.320327 -0.146559 1.195135
1.333333 -0.312130 -0.101111 1.938546 -0.325038 -0.151276 1.378868
1.366667 -0.323031 -0.106199 1.984324 -0.329743 -0.156120 1.566568
1.400000 -0.334100 -0.111453 2.039676 -0.334440 -0.161093 1.743467
1.433333 -0.345335 -0.116878 2.088886 -0.339126 -0.166192 1.902939
1.466667 -0.356699 -0.122458 2.154244 -0.343790 -0.171410 2.038194
1.500000 -0.368231 -0.128220 2.225665 -0.348430 -0.176749 2.140226
1.533333 -0.379930 -0.134173 2.330034 -0.353035 -0.182200 2.204015
1.566667 -0.391796 -0.140321 2.424648 -0.357591 -0.187747 2.227809
1.600000 -0.403827 -0.146672 2.516370 -0.362087 -0.193386 2.217631
1.633333 -0.415980 -0.153184 2.625762 -0.366521 -0.199115 2.171870
1.666667 -0.428296 -0.159911 2.691407 -0.370884 -0.204922 2.097779
1.700000 -0.440772 -0.166856 2.762977 -0.375163 -0.210785 2.001942
1.733333 -0.453366 -0.173965 2.810198 -0.379352 -0.216694 1.895786
1.766667 -0.466076 -0.181236 2.865730 -0.383454 -0.222644 1.786578
1.800000 -0.478938 -0.188738 2.912162 -0.387470 -0.228619 1.680777
1.833333 -0.491950 -0.196472 2.964677 -0.391393 -0.234603 1.586555
1.866667 -0.505072 -0.204371 3.004607 -0.395229 -0.240590 1.500513
1.900000 -0.518337 -0.212508 3.056653 -0.398989 -0.246591 1.420609
1.933333 -0.531738 -0.220884 3.104214 -0.402671 -0.252595 1.340866
1.966667 -0.545245 -0.229426 -3.136849 -0.406269 -0.258582 1.259336
2.000000 -0.558855 -0.238133 -3.076760 -0.409781 -0.264545 1.169651
2.033333 -0.572566 -0.247006 -3.024458 -0.413208 -0.270481 1.070136
2.066667 -0.586410 -0.256112 -3.000539 -0.416545 -0.276378 0.967287
2.100000 -0.600382 -0.265451 -2.968708 -0.419781 -0.282215 0.866103
2.133333 -0.614448 -0.274954 -2.924991 -0.422917 -0.287997 0.772476
2.166667 -0.628632 -0.284690 -2.915244 -0.425951 -0.293730 0.689753
2.200000 -0.642907 -0.294589 -2.908295 -0.428877 -0.299417 0.624239
2.233333 -0.657287 -0.304718 -2.900393 -0.431690 -0.305053 0.577929
2.266667 -0.671754 -0.315010 -2.906717 -0.434385 -0.310640 0.546263
2.300000 -0.686304 -0.325465 -2.892786 -0.436964 -0.316191 0.524230
2.333333 -0.700935 -0.336082 -2.870415 -0.439426 -0.321702 0.507751
2.366667 -0.715645 -0.346860 -2.856462 -0.441776 -0.327173 0.491675
2.400000 -0.730433 -0.357858 -2.814994 -0.444019 -0.332598 0.468589
2.433333 -0.745296 -0.369015 -2.792197 -0.446163 -0.337983 0.434360
2.466667 -0.760224 -0.380387 -2.762255 -0.448216 -0.343318 0.382443
2.500000 -0.775215 -0.391969 -2.745022 -0.450183 -0.348588 0.314501
2.533333 -0.790272 -0.403709 -2.735124 -0.452071 -0.353778 0.230245
2.566667 -0.805393 -0.415603 -2.737216 -0.453881 -0.358877 0.133263
2.600000 -0.820561 -0.427698 -2.730186 -0.455616 -0.363878 0.036686
2.633333 -0.835788 -0.439946 -2.750303 -0.457275 -0.368771 -0.037458
2.666667 -0.851071 -0.452346 -2.750565 -0.458856 -0.373561 -0.057954
2.700000 -0.866408 -0.464897 -2.755233 -0.460353 -0.378260 -0.002087
2.733333 -0.881797 -0.477596 -2.759108 -0.461759 -0.382883 0.155124
2.766667 -0.897235 -0.490443 -2.767570 -0.463069 -0.387445 0.433492
2.800000 -0.912719 -0.503436 -2.806979 -0.464274 -0.391960 0.841911
2.833333 -0.928247 -0.516574 -2.828866 -0.465373 -0.396442 1.359488
2.866667 -0.943816 -0.529855 -2.853933 -0.466358 -0.400900 1.962570
2.900000 -0.959400 -0.543300 -2.857698 -0.467231 -0.405333 2.627698
2.933333 -0.975020 -0.556884 -2.786720 -0.467994 -0.409741 3.321235
2.966667 -0.990652 -0.570626 -2.595018 -0.468652 -0.414119 4.001406
3.000000 -1.006314 -0.584505 -2.372785 -0.469211 -0.418459 4.623877
3.033333 -1.021982 -0.598538 -2.149039 -0.469675 -0.422755 5.168263
3.066667 -1.037656 -0.612722 -1.900454 -0.470053 -0.426994 5.606874
3.100000 -1.053332 -0.627054 -1.655878 -0.470352 -0.431167 5.915305
3.133333 -1.069028 -0.641515 -1.415323 -0.470581 -0.435264 6.080642
3.166667 -1.084743 -0.656103 -1.233027 -0.470743 -0.439279 6.119155
3.200000 -1.100456 -0.670830 -1.027598 -0.470844 -0.443202 6.049632
3.233333 -1.116167 -0.685691 -0.816905 -0.470893 -0.447027 5.884324
3.266667 -1.131875 -0.700680 -0.609695 -0.470891 -0.450748 5.639343
3.300000 -1.147579 -0.715794 -0.411547 -0.470842 -0.454360 5.325551
3.333333 -1.163279 -0.731027 -0.225345 -0.470750 -0.457861 4.954135
3.366667 -1.178972 -0.746376 -0.049653 -0.470620 -0.461244 4.507332
3.400000 -1.194665 -0.761836 0.105129 -0.470457 -0.464507 3.978455
3.433333 -1.210350 -0.777402 0.257356 -0.470262 -0.467649 3.368016
3.466667 -1.226027 -0.793069 0.362944 -0.470040 -0.470668 2.696080
3.500000 -1.241697 -0.808841 0.500341 -0.469791 -0.473568 1.984291
3.533333 -1.257357 -0.824703 0.579191 -0.469514 -0.476350 1.255436
3.566667 -1.273009 -0.840652 0.636611 -0.469205 -0.479023 0.549917
3.600000 -1.288652 -0.856684 0.619061 -0.468858 -0.481594 -0.097507
3.633333 -1.304285 -0.872795 0.548400 -0.468469 -0.484076 -0.658909
3.666667 -1.319900 -0.888999 0.462669 -0.468029 -0.486480 -1.133300
3.700000 -1.335503 -0.905275 0.328968 -0.467533 -0.488819 -1.508235
3.733333 -1.351095 -0.921620 0.186384 -0.466975 -0.491104 -1.777028
3.766667 -1.366674 -0.938029 0.086241 -0.466349 -0.493343 -1.948707
3.800000 -1.382238 -0.954502 0.076927 -0.465650 -0.495545 -2.044623
3.833333 -1.397769 -0.971055 0.028757 -0.464871 -0.497713 -2.082882
3.866667 -1.413268 -0.987686 -0.027845 -0.464008 -0.499850 -2.073632
3.900000 -1.428729 -1.004393 -0.059470 -0.463057 -0.501962 -2.039021
3.933333 -1.444165 -1.021167 -0.128090 -0.462016 -0.504054 -1.998667
3.966667 -1.459571 -1.038013 -0.215086 -0.460883 -0.506134 -1.954578
4.000000 -1.474943 -1.054931 -0.293974 -0.459661 -0.508210 -1.891263
4.033333 -1.490270 -1.071915 -0.380682 -0.458349 -0.510296 -1.800500
4.066667 -1.505548 -1.088961 -0.441997 -0.456951 -0.512405 -1.674904
4.100000 -1.520775 -1.106068 -0.519166 -0.455466 -0.514544 -1.504075
4.133333 -1.535948 -1.123232 -0.589482 -0.453896 -0.516713 -1.283893
4.166667 -1.551066 -1.140451 -0.635224 -0.452243 -0.518913 -1.025586
4.200000 -1.566129 -1.157757 -0.684990 -0.450509 -0.521134 -0.749144
4.233333 -1.581134 -1.175150 -0.702871 -0.448695 -0.523360 -0.472368
4.266667 -1.596077 -1.192633 -0.708886 -0.446804 -0.525570 -0.209556
4.300000 -1.610957 -1.210205 -0.685008 -0.444838 -0.527743 0.021541
4.333333 -1.625769 -1.227864 -0.648931 -0.442796 -0.529858 0.208295
4.366667 -1.640512 -1.245610 -0.615776 -0.440680 -0.531884 0.347625
4.400000 -1.655183 -1.263440 -0.581657 -0.438488 -0.533796 0.438385
4.433333 -1.669779 -1.281302 -0.553510 -0.436221 -0.535574 0.486764
4.466667 -1.684299 -1.299192 -0.530459 -0.433879 -0.537207 0.498787
4.500000 -1.698739 -1.317159 -0.512167 -0.431461 -0.538686 0.484703
4.533333 -1.713098 -1.335148 -0.510867 -0.428966 -0.540012 0.458778
4.566667 -1.727372 -1.353207 -0.505064 -0.426391 -0.541200 0.429958
4.600000 -1.741557 -1.371332 -0.498636 -0.423734 -0.542266 0.407841
4.633333 -1.755653 -1.389469 -0.490873 -0.420993 -0.543222 0.395363
4.666667 -1.769660 -1.407615 -0.482207 -0.418165 -0.544073 0.394716
4.700000 -1.783575 -1.425767 -0.468824 -0.415248 -0.544831 0.408148
4.733333 -1.797395 -1.443920 -0.461296 -0.412241 -0.545498 0.432689
4.766667 -1.811110 -1.462121 -0.431389 -0.409143 -0.546071 0.466929
4.800000 -1.824714 -1.480363 -0.406557 -0.405956 -0.546548 0.508369
4.833333 -1.838218 -1.498597 -0.402837 -0.402679 -0.546925 0.559320
4.866667 -1.851605 -1.516864 -0.378548 -0.399313 -0.547199 0.617971
4.900000 -1.864869 -1.535159 -0.368949 -0.395862 -0.547356 0.683137
4.933333 -1.878028 -1.553435 -0.351596 -0.392328 -0.547385 0.752273
4.966667 -1.891058 -1.571729 -0.328775 -0.388713 -0.547273 0.826699
5.000000 -1.903978 -1.589996 -0.302670 -0.385013 -0.547013 0.905883
5.033333 -1.916762 -1.608269 -0.275359 -0.381229 -0.546594 0.982920
5.066667 -1.929433 -1.626508 -0.230073 -0.377358 -0.546013 1.057688
5.100000 -1.941958 -1.644741 -0.189718 -0.373395 -0.545271 1.126757
5.133333 -1.954368 -1.662933 -0.146442 -0.369335 -0.544366 1.191194
5.166667 -1.966624 -1.681104 -0.086639 -0.365170 -0.543298 1.244639
5.200000 -1.978762 -1.699226 -0.050969 -0.360902 -0.542061 1.286888
5.233333 -1.990740 -1.717315 -0.013172 -0.356538 -0.540656 1.322708
5.266667 -2.002595 -1.735348 0.026179 -0.352080 -0.539077 1.354312
5.300000 -2.014285 -1.753332 0.081923 -0.347536 -0.537322 1.385911
5.333333 -2.025806 -1.771257 0.127622 -0.342922 -0.535388 1.421318
5.366667 -2.037155 -1.789117 0.169164 -0.338253 -0.533270 1.473227
5.400000 -2.048377 -1.806906 0.218336 -0.333544 -0.530966 1.547606
5.433333 -2.059422 -1.824611 0.259967 -0.328801 -0.528475 1.649942
5.466667 -2.070290 -1.842222 0.322311 -0.324047 -0.525804 1.781648
5.500000 -2.080977 -1.859730 0.361184 -0.319294 -0.522952 1.948378
5.533333 -2.091533 -1.877154 0.415144 -0.314547 -0.519924 2.150244
5.566667 -2.101958 -1.894488 0.482533 -0.309813 -0.516727 2.379604
5.600000 -2.112201 -1.911693 0.544822 -0.305096 -0.513368 2.630082
5.633333 -2.122311 -1.928803 0.625460 -0.300397 -0.509848 2.892977
5.666667 -2.132239 -1.945764 0.733042 -0.295708 -0.506170 3.163673
5.700000 -2.141985 -1.962571 0.852141 -0.291029 -0.502345 3.427412
5.733333 -2.151596 -1.979272 0.989903 -0.286361 -0.498386 3.671868
5.766667 -2.161073 -1.995864 1.142350 -0.281708 -0.494300 3.886326
5.800000 -2.170415 -2.012344 1.263614 -0.277066 -0.490097 4.064464
5.833333 -2.179577 -2.028643 1.418871 -0.272443 -0.485789 4.199870
5.866667 -2.188560 -2.044756 1.578867 -0.267840 -0.481383 4.289033
5.900000 -2.197407 -2.060749 1.730576 -0.263253 -0.476873 4.331013
5.933333 -2.206077 -2.076545 1.875268 -0.258682 -0.472266 4.331996
5.966667 -2.214610 -2.092215 2.043519 -0.254128 -0.467562 4.299296
6.000000 -2.223008 -2.107756 2.190627 -0.249596 -0.462763 4.234120
6.033333 -2.231270 -2.123164 2.340484 -0.245082 -0.457856 4.142441
6.066667 -2.239358 -2.138361 2.480545 -0.240589 -0.452836 4.024470
6.100000 -2.247311 -2.153420 2.595471 -0.236122 -0.447701 3.889786
6.133333 -2.255093 -2.168262 2.717104 -0.231679 -0.442431 3.737749
6.166667 -2.262740 -2.182963 2.859820 -0.227259 -0.437020 3.568242
6.200000 -2.270219 -2.197441 2.997826 -0.222866 -0.431472 3.385816
6.233333 -2.277564 -2.211773 3.083378 -0.218505 -0.425807 3.191364
6.266667 -2.284774 -2.225956 -3.082322 -0.214179 -0.420025 2.987915
6.300000 -2.291835 -2.239902 -2.985666 -0.209890 -0.414141 2.770626
6.333333 -2.298750 -2.253611 -2.905725 -0.205642 -0.408171 2.541950
6.366667 -2.305519 -2.267082 -2.796905 -0.201437 -0.402142 2.303486
6.400000 -2.312155 -2.280397 -2.737819 -0.197273 -0.396058 2.057612
6.433333 -2.318650 -2.293474 -2.671008 -0.193145 -0.389927 1.804838
6.466667 -2.325014 -2.306393 -2.613767 -0.189056 -0.383772 1.550870
6.500000 -2.331239 -2.319075 -2.578121 -0.185004 -0.377610 1.303535
6.533333 -2.337334 -2.331596 -2.520212 -0.180989 -0.371445 1.064776
6.566667 -2.343294 -2.343884 -2.493483 -0.177009 -0.365267 0.844210
6.600000 -2.349119 -2.355939 -2.479596 -0.173065 -0.359087 0.645213
6.633333 -2.354811 -2.367764 -2.471146 -0.169156 -0.352910 0.473137
6.666667 -2.360376 -2.379423 -2.463324 -0.165282 -0.346747 0.328211
6.700000 -2.365815 -2.390917 -2.477878 -0.161443 -0.340604 0.210296
6.733333 -2.371126 -2.402183 -2.483276 -0.157640 -0.334501 0.122823
6.766667 -2.376309 -2.413225 -2.486960 -0.153873 -0.328463 0.060203
6.800000 -2.381367 -2.424044 -2.487458 -0.150144 -0.322499 0.018614
6.833333 -2.386300 -2.434642 -2.486194 -0.146452 -0.316612 -0.005376
6.866667 -2.391112 -2.445071 -2.484811 -0.142799 -0.310798 -0.014280
6.900000 -2.395802 -2.455282 -2.482360 -0.139185 -0.305060 -0.014126
6.933333 -2.400373 -2.465324 -2.476829 -0.135609 -0.299392 -0.010033
6.966667 -2.404825 -2.475197 -2.486314 -0.132073 -0.293783 -0.005448
7.000000 -2.409160 -2.484901 -2.487636 -0.128578 -0.288223 -0.000272
7.033333 -2.413378 -2.494436 -2.484422 -0.125121 -0.282703 0.004885
7.066667 -2.417480 -2.503802 -2.489557 -0.121705 -0.277213 0.007257
7.100000 -2.421471 -2.512962 -2.485516 -0.118329 -0.271738 0.009272
7.133333 -2.425351 -2.521918 -2.484081 -0.114993 -0.266270 0.011058
7.166667 -2.429122 -2.530671 -2.489407 -0.111698 -0.260807 0.014047
7.200000 -2.432783 -2.539256 -2.478697 -0.108443 -0.255356 0.015167
7.233333 -2.436333 -2.547674 -2.478682 -0.105227 -0.249924 0.014165
7.266667 -2.439775 -2.555924 -2.477531 -0.102051 -0.244523 0.012839
7.300000 -2.443114 -2.563981 -2.488642 -0.098914 -0.239160 0.011103
7.333333 -2.446352 -2.571846 -2.476562 -0.095815 -0.233847 0.008371
7.366667 -2.449485 -2.579546 -2.475901 -0.092754 -0.228582 0.003807
7.400000 -2.452519 -2.587058 -2.486439 -0.089732 -0.223366 0.000035
7.433333 -2.455451 -2.594406 -2.475897 -0.086749 -0.218198 -0.002766
7.466667 -2.458288 -2.601571 -2.481956 -0.083806 -0.213079 -0.004131
7.500000 -2.461025 -2.608574 -2.481066 -0.080903 -0.208010 -0.006238
7.533333 -2.463662 -2.615416 -2.482362 -0.078040 -0.202989 -0.006681
7.566667 -2.466203 -2.622097 -2.483890 -0.075219 -0.198016 -0.006073
7.600000 -2.468654 -2.628605 -2.481287 -0.072438 -0.193092 -0.004386
7.633333 -2.471010 -2.634954 -2.478013 -0.069699 -0.188217 -0.001674
7.666667 -2.473281 -2.641133 -2.483555 -0.067003 -0.183386 -0.000250
7.700000 -2.475459 -2.647157 -2.478883 -0.064350 -0.178600 0.001170
7.733333 -2.477554 -2.653015 -2.495325 -0.061739 -0.173860 0.002653
7.766667 -2.479559 -2.658720 -2.483193 -0.059168 -0.169168 0.004227
7.800000 -2.481476 -2.664272 -2.475354 -0.056638 -0.164525 0.004646
7.833333 -2.483315 -2.669666 -2.478327 -0.054149 -0.159933 0.003469
7.866667 -2.485067 -2.674910 -2.478509 -0.051700 -0.155393 0.001688
7.900000 -2.486745 -2.680001 -2.485587 -0.049291 -0.150908 0.001210
7.933333 -2.488339 -2.684944 -2.482434 -0.046924 -0.146476 -0.001306
7.966667 -2.489852 -2.689742 -2.475112 -0.044601 -0.142098 -0.004297
