t x y theta dxdt dydt dthetadt
0.000000 0.000000 0.000000 -0.357672 -0.004662 -0.013416 -0.268591
0.033333 -0.000200 -0.000993 -0.354083 -0.004361 -0.017837 -0.252331
0.066667 -0.000346 -0.002075 -0.367945 -0.002999 -0.023278 -0.236307
0.100000 -0.000438 -0.003250 -0.374591 -0.000510 -0.029881 -0.219517
0.133333 -0.000474 -0.004520 -0.397133 0.003315 -0.038225 -0.198102
0.166667 -0.000451 -0.005887 -0.407586 0.008711 -0.049138 -0.172125
0.200000 -0.000611 -0.006717 -0.409304 0.015935 -0.063589 -0.141027
0.233333 -0.000386 -0.007685 -0.408568 0.025495 -0.082545 -0.106086
0.266667 0.000100 -0.009160 -0.420897 0.038151 -0.106682 -0.068793
0.300000 0.000650 -0.010742 -0.413627 0.054684 -0.136675 -0.033897
0.333333 0.001264 -0.012431 -0.420353 0.075430 -0.172226 -0.009081
0.366667 0.002586 -0.016225 -0.414670 0.100638 -0.212757 0.000924
0.400000 0.005432 -0.023766 -0.419714 0.130692 -0.257399 -0.005874
0.433333 0.008351 -0.031409 -0.405997 0.165522 -0.304848 -0.030311
0.466667 0.014199 -0.044904 -0.396072 0.204221 -0.353181 -0.070993
0.500000 0.020120 -0.058482 -0.385394 0.245879 -0.400474 -0.122740
0.533333 0.026110 -0.072133 -0.378476 0.289764 -0.445211 -0.178974
0.566667 0.036619 -0.089197 -0.384416 0.334755 -0.485832 -0.232452
0.600000 0.051652 -0.109360 -0.405407 0.378827 -0.520768 -0.279485
0.633333 0.066735 -0.129541 -0.432028 0.419907 -0.548756 -0.313747
0.666667 0.081851 -0.149720 -0.463413 0.456756 -0.569724 -0.331655
0.700000 0.096988 -0.169880 -0.486805 0.487853 -0.583379 -0.328481
0.733333 0.115768 -0.191484 -0.497018 0.511485 -0.589464 -0.306502
0.766667 0.136883 -0.212894 -0.508771 0.526250 -0.587906 -0.269274
0.800000 0.157967 -0.234220 -0.508270 0.531618 -0.578942 -0.221571
0.833333 0.178998 -0.255441 -0.523569 0.526870 -0.562473 -0.170501
0.866667 0.199332 -0.275656 -0.519495 0.511107 -0.538002 -0.128455
0.900000 0.218130 -0.294522 -0.517805 0.483745 -0.505196 -0.109544
0.933333 0.234576 -0.311157 -0.513512 0.444953 -0.464078 -0.119992
0.966667 0.250891 -0.327624 -0.508470 0.395397 -0.414877 -0.166119
1.000000 0.267058 -0.343910 -0.507048 0.335827 -0.357948 -0.250115
1.033333 0.279639 -0.357251 -0.491772 0.268083 -0.294549 -0.376596
1.066667 0.292041 -0.370389 -0.510339 0.193911 -0.225795 -0.531126
1.100000 0.299094 -0.378175 -0.520426 0.115748 -0.153614 -0.699397
1.133333 0.300724 -0.381230 -0.521480 0.035636 -0.079980 -0.866346
1.166667 0.297371 -0.380059 -0.533266 -0.044233 -0.007454 -1.016308
1.200000 0.293810 -0.378694 -0.602853 -0.121699 0.061104 -1.131398
1.233333 0.285368 -0.372283 -0.667195 -0.195176 0.123226 -1.187889
1.266667 0.276726 -0.365698 -0.751435 -0.263031 0.176384 -1.178463
1.300000 0.264649 -0.355881 -0.826533 -0.324428 0.218645 -1.098046
1.333333 0.249476 -0.343384 -0.879797 -0.378501 0.248523 -0.946490
1.366667 0.234137 -0.330760 -0.944541 -0.424942 0.265611 -0.726084
1.400000 0.218651 -0.318026 -0.970020 -0.463338 0.270115 -0.453007
1.433333 0.203035 -0.305197 -0.979117 -0.493498 0.262769 -0.150787
1.466667 0.185362 -0.293975 -0.968148 -0.515084 0.244459 0.156852
1.500000 0.165590 -0.284582 -0.953888 -0.527609 0.216950 0.449423
1.533333 0.144736 -0.278258 -0.916687 -0.530815 0.182646 0.708123
1.566667 0.123844 -0.271900 -0.859840 -0.524584 0.143815 0.914196
1.600000 0.102938 -0.265519 -0.796437 -0.509059 0.102801 1.061037
1.633333 0.082795 -0.262914 -0.742638 -0.484471 0.062031 1.149337
1.666667 0.064488 -0.262936 -0.681538 -0.451485 0.023953 1.185555
1.700000 0.048393 -0.265033 -0.641521 -0.411405 -0.009683 1.176239
1.733333 0.034640 -0.268682 -0.592893 -0.365941 -0.038010 1.128918
1.766667 0.024304 -0.273124 -0.561909 -0.316850 -0.060247 1.057326
1.800000 0.014078 -0.277542 -0.533452 -0.266130 -0.075887 0.970649
1.833333 0.006658 -0.282025 -0.508224 -0.215662 -0.085330 0.875280
1.866667 0.001955 -0.286151 -0.479957 -0.166779 -0.089717 0.776490
1.900000 -0.002610 -0.290238 -0.464690 -0.120063 -0.090397 0.676304
1.933333 -0.004490 -0.293475 -0.439140 -0.075623 -0.088763 0.574114
1.966667 -0.004390 -0.296223 -0.418077 -0.033279 -0.086437 0.461101
2.000000 -0.003513 -0.297933 -0.392120 0.007316 -0.085057 0.331071
2.033333 -0.002491 -0.299594 -0.380494 0.046558 -0.085659 0.178714
2.066667 -0.001323 -0.301205 -0.373757 0.084369 -0.088434 -0.002475
2.100000 0.000661 -0.302446 -0.365884 0.120676 -0.093594 -0.210613
2.133333 0.002789 -0.303636 -0.376998 0.155761 -0.101057 -0.432419
2.166667 0.007994 -0.306343 -0.380615 0.189789 -0.110249 -0.648629
2.200000 0.018210 -0.311917 -0.376870 0.222571 -0.119919 -0.839681
2.233333 0.028562 -0.317425 -0.405048 0.253936 -0.128936 -0.986770
2.266667 0.039040 -0.322863 -0.461649 0.283730 -0.136219 -1.069296
2.300000 0.049635 -0.328226 -0.551045 0.311268 -0.140057 -1.075790
2.333333 0.060338 -0.333509 -0.640718 0.335417 -0.138865 -1.008643
2.366667 0.071137 -0.338710 -0.717762 0.355087 -0.131600 -0.874799
2.400000 0.082024 -0.343823 -0.802979 0.370068 -0.118331 -0.680810
2.433333 0.095833 -0.350876 -0.831021 0.379914 -0.098967 -0.442650
2.466667 0.111140 -0.357526 -0.805174 0.384243 -0.073959 -0.181886
2.500000 0.127016 -0.361776 -0.775412 0.382965 -0.044737 0.079873
2.533333 0.142240 -0.362701 -0.728632 0.376173 -0.012976 0.324185
2.566667 0.157480 -0.363512 -0.679631 0.364180 0.019685 0.534590
2.600000 0.170617 -0.361519 -0.648437 0.346850 0.051882 0.692769
2.633333 0.181743 -0.356574 -0.628573 0.324567 0.081627 0.795177
2.666667 0.192841 -0.351530 -0.590855 0.298077 0.107284 0.844583
2.700000 0.201420 -0.344693 -0.574042 0.268632 0.127916 0.849789
2.733333 0.209951 -0.337773 -0.536157 0.237374 0.143125 0.820199
2.766667 0.218426 -0.330780 -0.512863 0.205270 0.152530 0.768622
2.800000 0.224746 -0.324512 -0.478287 0.173472 0.156181 0.705426
2.833333 0.228773 -0.319468 -0.453381 0.143004 0.154932 0.635164
2.866667 0.232731 -0.314378 -0.410101 0.114715 0.149659 0.561463
2.900000 0.236619 -0.309247 -0.404287 0.088808 0.141226 0.485506
2.933333 0.238388 -0.304207 -0.389736 0.065744 0.130226 0.409934
2.966667 0.238569 -0.299725 -0.386923 0.046046 0.117564 0.335518
3.000000 0.238002 -0.295888 -0.386311 0.029913 0.104094 0.265030
3.033333 0.237367 -0.292039 -0.382866 0.017188 0.090257 0.202650
3.066667 0.236667 -0.288181 -0.366507 0.007665 0.076432 0.150088
3.100000 0.236267 -0.285910 -0.369732 0.001313 0.062990 0.108728
3.133333 0.236032 -0.284996 -0.367139 -0.002334 0.050438 0.076433
3.166667 0.235798 -0.284656 -0.373031 -0.003972 0.039096 0.052427
3.200000 0.235593 -0.284404 -0.369172 -0.004236 0.029080 0.036472
3.233333 0.235335 -0.284154 -0.371031 -0.003552 0.020579 0.024045
3.266667 0.235445 -0.284168 -0.364341 -0.002428 0.013824 0.015670
3.300000 0.235507 -0.284184 -0.362145 -0.001314 0.008777 0.007941
3.333333 0.235587 -0.283868 -0.375564 -0.000401 0.005147 0.005003
