t x y theta dxdt dydt dthetadt
0.000000 0.000000 0.000000 -0.510582 0.026183 -0.033223 0.009017
0.033333 0.000757 -0.001070 -0.506889 0.028239 -0.038352 0.008755
0.066667 0.001652 -0.002371 -0.499381 0.030578 -0.043689 0.006439
0.100000 0.002686 -0.003905 -0.512116 0.033137 -0.049178 0.004226
0.133333 0.003866 -0.005674 -0.509334 0.035853 -0.054767 0.001895
0.166667 0.005195 -0.007681 -0.511178 0.038673 -0.060411 -0.000892
0.200000 0.006546 -0.009810 -0.511335 0.041554 -0.066072 -0.004390
0.233333 0.008055 -0.012181 -0.503944 0.044464 -0.071726 -0.007319
0.266667 0.009598 -0.014685 -0.507363 0.047400 -0.077370 -0.008065
0.300000 0.011187 -0.017330 -0.504838 0.050381 -0.083024 -0.008561
0.333333 0.012835 -0.020125 -0.508870 0.053456 -0.088732 -0.008536
0.366667 0.014656 -0.023170 -0.514207 0.056671 -0.094538 -0.007524
0.400000 0.016552 -0.026377 -0.509394 0.060079 -0.100487 -0.005627
0.433333 0.018526 -0.029758 -0.509711 0.063739 -0.106631 -0.003715
0.466667 0.020593 -0.033318 -0.511777 0.067700 -0.113011 -0.001510
0.500000 0.022852 -0.037139 -0.515854 0.071981 -0.119644 0.000634
0.533333 0.025222 -0.041160 -0.512467 0.076584 -0.126527 0.003155
0.566667 0.027792 -0.045447 -0.508134 0.081515 -0.133663 0.004884
0.600000 0.030499 -0.049953 -0.510158 0.086778 -0.141050 0.005249
0.633333 0.033415 -0.054730 -0.501965 0.092356 -0.148675 0.004855
0.666667 0.036544 -0.059781 -0.512630 0.098223 -0.156514 0.003511
0.700000 0.039849 -0.065085 -0.513387 0.104373 -0.164563 0.002313
0.733333 0.043374 -0.070668 -0.502760 0.110800 -0.172822 0.001427
0.766667 0.047125 -0.076532 -0.510584 0.117507 -0.181303 0.001258
0.800000 0.051106 -0.082681 -0.503847 0.124497 -0.190018 0.001253
0.833333 0.055320 -0.089115 -0.513230 0.131781 -0.198984 0.002176
0.866667 0.059772 -0.095837 -0.513035 0.139379 -0.208227 0.002453
0.900000 0.064464 -0.102849 -0.511311 0.147304 -0.217768 0.002568
0.933333 0.069440 -0.110208 -0.512133 0.155561 -0.227610 0.001207
0.966667 0.074663 -0.117860 -0.508632 0.164133 -0.237733 -0.000895
1.000000 0.080138 -0.125809 -0.505377 0.172990 -0.248105 -0.001635
1.033333 0.085945 -0.134150 -0.509256 0.182095 -0.258682 -0.002068
1.066667 0.092101 -0.142900 -0.496395 0.191403 -0.269413 -0.002677
1.100000 0.098631 -0.152079 -0.509147 0.200838 -0.280213 -0.003584
1.133333 0.105557 -0.161700 -0.512468 0.210354 -0.291031 -0.003248
1.166667 0.112747 -0.171624 -0.514550 0.219920 -0.301826 -0.001710
1.200000 0.120204 -0.181849 -0.514209 0.229546 -0.312603 -0.000709
1.233333 0.128127 -0.192575 -0.507629 0.239282 -0.323400 -0.000439
1.266667 0.136319 -0.203603 -0.516529 0.249190 -0.334274 0.002351
1.300000 0.144783 -0.214935 -0.511483 0.259368 -0.345319 0.006274
1.333333 0.153519 -0.226569 -0.504298 0.269871 -0.356591 0.010436
1.366667 0.162529 -0.238507 -0.501548 0.280754 -0.368148 0.014796
1.400000 0.171813 -0.250747 -0.508104 0.292048 -0.380023 0.020056
1.433333 0.181372 -0.263289 -0.509490 0.303734 -0.392206 0.025437
1.466667 0.191579 -0.276473 -0.512712 0.315805 -0.404692 0.029178
1.500000 0.202061 -0.289957 -0.507269 0.328299 -0.417512 0.031496
1.533333 0.213251 -0.304132 -0.509869 0.341235 -0.430680 0.032053
1.566667 0.225178 -0.319021 -0.499671 0.354596 -0.444173 0.028474
1.600000 0.237377 -0.334205 -0.508522 0.368354 -0.457961 0.021212
1.633333 0.249847 -0.349683 -0.502271 0.382561 -0.472074 0.011464
1.666667 0.262586 -0.365451 -0.497507 0.397278 -0.486553 -0.000216
1.700000 0.275591 -0.381507 -0.481761 0.412463 -0.501348 -0.013397
1.733333 0.289460 -0.398370 -0.489710 0.428092 -0.516430 -0.025865
1.766667 0.303590 -0.415515 -0.499826 0.444218 -0.531839 -0.035789
1.800000 0.318606 -0.433475 -0.504669 0.460835 -0.547564 -0.044363
1.833333 0.334519 -0.452250 -0.505582 0.477824 -0.563496 -0.052215
1.866667 0.350679 -0.471292 -0.517170 0.494976 -0.579456 -0.057773
1.900000 0.367080 -0.490598 -0.517003 0.512131 -0.595311 -0.061035
1.933333 0.384392 -0.510703 -0.520284 0.529192 -0.610969 -0.063364
1.966667 0.402608 -0.531591 -0.520719 0.546009 -0.626291 -0.062074
2.000000 0.421720 -0.553245 -0.512625 0.562477 -0.641176 -0.056138
2.033333 0.441047 -0.575135 -0.505604 0.578586 -0.655608 -0.044938
2.066667 0.460577 -0.597255 -0.502553 0.594426 -0.669643 -0.031296
2.100000 0.480303 -0.619596 -0.523749 0.610088 -0.683334 -0.012556
2.133333 0.500882 -0.642629 -0.530377 0.625605 -0.696699 0.012346
2.166667 0.522289 -0.666327 -0.543486 0.641006 -0.709760 0.042725
2.200000 0.543861 -0.690220 -0.527926 0.656375 -0.722584 0.077972
2.233333 0.565587 -0.714300 -0.538813 0.671734 -0.735188 0.122167
2.266667 0.588051 -0.738949 -0.527475 0.686996 -0.747518 0.176328
2.300000 0.611221 -0.764133 -0.507798 0.702041 -0.759500 0.235012
2.333333 0.635059 -0.789814 -0.496537 0.716754 -0.771060 0.294331
2.366667 0.659521 -0.815960 -0.499789 0.731022 -0.782134 0.350549
2.400000 0.684582 -0.842543 -0.479655 0.744630 -0.792587 0.402757
2.433333 0.709717 -0.869248 -0.482338 0.757361 -0.802286 0.443045
2.466667 0.735347 -0.896315 -0.457979 0.769059 -0.811146 0.465181
2.500000 0.761416 -0.923695 -0.427995 0.779592 -0.819107 0.469497
2.533333 0.787871 -0.951349 -0.411623 0.788843 -0.826117 0.456026
2.566667 0.814653 -0.979236 -0.381921 0.796707 -0.832136 0.419658
2.600000 0.841699 -1.007317 -0.351309 0.803143 -0.837164 0.358840
2.633333 0.868951 -1.035549 -0.348909 0.808093 -0.841197 0.276584
2.666667 0.896339 -1.063888 -0.336923 0.811527 -0.844246 0.181658
2.700000 0.923826 -1.092312 -0.318937 0.813430 -0.846323 0.077199
2.733333 0.951350 -1.120778 -0.311248 0.813787 -0.847438 -0.034334
2.766667 0.978842 -1.149252 -0.317425 0.812584 -0.847586 -0.141798
2.800000 1.006242 -1.177697 -0.346353 0.809822 -0.846764 -0.238413
2.833333 1.033490 -1.206076 -0.365480 0.805572 -0.845010 -0.323569
2.866667 1.060579 -1.234407 -0.378226 0.799903 -0.842353 -0.399004
2.900000 1.087491 -1.262676 -0.410484 0.792908 -0.838837 -0.462331
2.933333 1.114084 -1.290776 -0.424194 0.784714 -0.834531 -0.512067
2.966667 1.140309 -1.318673 -0.433233 0.775460 -0.829506 -0.553197
3.000000 1.166298 -1.346469 -0.441872 0.765295 -0.823848 -0.590459
3.033333 1.191854 -1.374010 -0.467186 0.754351 -0.817633 -0.621554
3.066667 1.216937 -1.401261 -0.488970 0.742736 -0.810905 -0.641822
3.100000 1.241505 -1.428185 -0.506572 0.730524 -0.803665 -0.649503
3.133333 1.265527 -1.454740 -0.530334 0.717737 -0.795859 -0.636394
3.166667 1.289222 -1.481133 -0.561545 0.704376 -0.787410 -0.588172
3.200000 1.312572 -1.507350 -0.583084 0.690420 -0.778225 -0.493763
3.233333 1.335562 -1.533380 -0.624212 0.675819 -0.768192 -0.343549
3.266667 1.358172 -1.559212 -0.649933 0.660521 -0.757201 -0.135488
3.300000 1.380070 -1.584469 -0.679701 0.644511 -0.745222 0.131544
3.333333 1.401555 -1.609505 -0.690531 0.627774 -0.732240 0.448251
3.366667 1.422611 -1.634309 -0.700992 0.610312 -0.718260 0.799750
3.400000 1.442913 -1.658407 -0.663802 0.592152 -0.703331 1.170270
3.433333 1.462451 -1.681760 -0.634742 0.573360 -0.687551 1.540839
3.466667 1.481214 -1.704327 -0.554606 0.554065 -0.671137 1.891245
3.500000 1.499193 -1.726080 -0.443972 0.534342 -0.654220 2.205063
3.533333 1.516664 -1.747554 -0.342188 0.514279 -0.636956 2.472551
3.566667 1.533612 -1.768741 -0.226097 0.493962 -0.619510 2.682239
3.600000 1.549755 -1.789055 -0.100578 0.473425 -0.601975 2.830480
3.633333 1.565348 -1.809067 -0.014651 0.452632 -0.584322 2.917398
3.666667 1.580129 -1.828200 0.082754 0.431492 -0.566434 2.953920
3.700000 1.594086 -1.846446 0.198127 0.409958 -0.548273 2.948493
3.733333 1.607454 -1.864375 0.294905 0.388000 -0.529839 2.908496
3.766667 1.620221 -1.881980 0.395868 0.365614 -0.511173 2.847199
3.800000 1.632374 -1.899257 0.476994 0.342794 -0.492309 2.776146
3.833333 1.643655 -1.915663 0.575241 0.319627 -0.473447 2.701674
3.866667 1.654048 -1.931200 0.672681 0.296205 -0.454780 2.621791
3.900000 1.663540 -1.945881 0.760980 0.272601 -0.436449 2.537804
3.933333 1.672114 -1.959720 0.838572 0.248871 -0.418566 2.451540
3.966667 1.679753 -1.972731 0.912579 0.225049 -0.401213 2.358708
4.000000 1.686715 -1.985399 0.991855 0.201219 -0.384547 2.254286
4.033333 1.692992 -1.997724 1.068113 0.177375 -0.368571 2.133223
4.066667 1.698574 -2.009705 1.136508 0.153494 -0.353245 1.999091
4.100000 1.703454 -2.021342 1.215313 0.129505 -0.338472 1.850661
4.133333 1.707352 -2.032241 1.279517 0.105334 -0.324139 1.685083
4.166667 1.710533 -2.042796 1.358069 0.080879 -0.310082 1.505436
4.200000 1.712988 -2.053010 1.394340 0.056012 -0.296104 1.315419
4.233333 1.714712 -2.062882 1.432491 0.030644 -0.282083 1.124993
4.266667 1.715454 -2.072101 1.479586 0.004693 -0.267952 0.935463
4.300000 1.715201 -2.080689 1.485585 -0.021835 -0.253750 0.753707
4.333333 1.714199 -2.088940 1.518661 -0.048963 -0.239490 0.586403
4.366667 1.712186 -2.096601 1.506839 -0.076641 -0.225255 0.441171
4.400000 1.709414 -2.103930 1.513910 -0.104817 -0.211128 0.319052
4.433333 1.705602 -2.110706 1.516763 -0.133380 -0.197220 0.217927
4.466667 1.700729 -2.116946 1.514167 -0.162168 -0.183632 0.135204
4.500000 1.694776 -2.122664 1.515808 -0.191060 -0.170415 0.054227
4.533333 1.688051 -2.128065 1.521001 -0.219862 -0.157657 -0.041452
4.566667 1.680200 -2.132980 1.522189 -0.248481 -0.145392 -0.172069
4.600000 1.671193 -2.137424 1.523497 -0.276792 -0.133670 -0.352364
4.633333 1.661412 -2.141565 1.510261 -0.304819 -0.122477 -0.593123
4.666667 1.650407 -2.145270 1.520360 -0.332678 -0.111782 -0.900458
4.700000 1.638627 -2.148681 1.514187 -0.360520 -0.101543 -1.256866
4.733333 1.626075 -2.151804 1.517783 -0.388531 -0.091707 -1.641756
4.766667 1.612752 -2.154644 1.509349 -0.416809 -0.082227 -2.034513
4.800000 1.598659 -2.157207 1.445428 -0.445515 -0.073031 -2.411752
4.833333 1.583800 -2.159499 1.284652 -0.474725 -0.064072 -2.748052
4.866667 1.568177 -2.161525 1.113327 -0.504504 -0.055309 -3.014772
4.900000 1.551034 -2.163200 0.959883 -0.534822 -0.046723 -3.200429
4.933333 1.533135 -2.164622 0.808456 -0.565652 -0.038296 -3.297727
4.966667 1.513648 -2.165697 0.680151 -0.596928 -0.030025 -3.302662
5.000000 1.492531 -2.166440 0.540072 -0.628562 -0.021925 -3.215089
5.033333 1.470676 -2.166947 0.438323 -0.660455 -0.014017 -3.051795
5.066667 1.448089 -2.167227 0.358951 -0.692382 -0.006341 -2.835538
5.100000 1.424779 -2.167286 0.282977 -0.724243 0.001081 -2.584446
5.133333 1.400753 -2.167130 0.197699 -0.755937 0.008225 -2.311985
5.166667 1.375056 -2.166679 0.123105 -0.787507 0.015072 -2.024626
5.200000 1.347685 -2.165949 0.056458 -0.818973 0.021596 -1.734128
5.233333 1.319628 -2.165025 0.012073 -0.850354 0.027764 -1.438796
5.266667 1.290899 -2.163915 -0.041240 -0.881748 0.033555 -1.136146
5.300000 1.261509 -2.162626 -0.101918 -0.913269 0.038920 -0.824119
5.333333 1.230484 -2.161143 -0.130252 -0.944947 0.043809 -0.509084
5.366667 1.197840 -2.159490 -0.146019 -0.976658 0.048196 -0.202066
5.400000 1.164577 -2.157680 -0.138934 -1.008364 0.052059 0.091476
5.433333 1.130711 -2.155720 -0.118750 -1.040018 0.055379 0.363222
5.466667 1.096259 -2.153617 -0.086443 -1.071575 0.058139 0.603715
5.500000 1.060256 -2.151472 -0.035892 -1.102820 0.060337 0.800269
5.533333 1.022737 -2.149315 0.001213 -1.133623 0.061984 0.951057
5.566667 0.983727 -2.147183 0.062941 -1.163937 0.063091 1.052867
5.600000 0.944203 -2.144937 0.107677 -1.193622 0.063669 1.105194
5.633333 0.903259 -2.142781 0.154953 -1.222400 0.063777 1.107385
5.666667 0.861845 -2.140526 0.187268 -1.249990 0.063478 1.064107
5.700000 0.819982 -2.138176 0.221839 -1.276270 0.062821 0.985530
5.733333 0.776802 -2.135995 0.259197 -1.301125 0.061857 0.874590
5.766667 0.732359 -2.134003 0.305779 -1.324445 0.060637 0.739150
5.800000 0.687538 -2.131936 0.334241 -1.346113 0.059214 0.585993
5.833333 0.641567 -2.130098 0.352296 -1.366201 0.057583 0.422714
5.866667 0.595270 -2.128198 0.371219 -1.384781 0.055741 0.255235
5.900000 0.548674 -2.126240 0.369918 -1.401811 0.053721 0.086468
5.933333 0.501137 -2.124553 0.365377 -1.417264 0.051551 -0.076014
5.966667 0.453353 -2.122818 0.351522 -1.431178 0.049229 -0.224954
6.000000 0.405352 -2.121043 0.334078 -1.443586 0.046777 -0.358173
6.033333 0.356566 -2.119564 0.317764 -1.454483 0.044271 -0.472219
6.066667 0.307617 -2.118053 0.293333 -1.463863 0.041787 -0.567590
6.100000 0.258535 -2.116515 0.257879 -1.471770 0.039372 -0.640693
6.133333 0.208989 -2.115287 0.238892 -1.478257 0.037069 -0.694884
6.166667 0.159072 -2.114378 0.199459 -1.483237 0.034937 -0.732252
6.200000 0.109108 -2.113455 0.193735 -1.486601 0.032974 -0.751651
6.233333 0.059128 -2.112519 0.158137 -1.488299 0.031116 -0.751579
6.266667 0.009160 -2.111576 0.139067 -1.488283 0.029300 -0.729696
6.300000 -0.040767 -2.110628 0.111241 -1.486505 0.027465 -0.685829
6.333333 -0.090623 -2.109679 0.074329 -1.482844 0.025480 -0.615318
6.366667 -0.140378 -2.108732 0.045607 -1.477229 0.023189 -0.519356
6.400000 -0.190004 -2.107790 0.015656 -1.469602 0.020465 -0.398388
6.433333 -0.239472 -2.106857 0.005601 -1.459857 0.017212 -0.257035
6.466667 -0.288751 -2.105935 -0.020918 -1.447887 0.013333 -0.099035
6.500000 -0.337250 -2.105427 -0.031327 -1.433637 0.008766 0.070722
6.533333 -0.384899 -2.105359 -0.014782 -1.417238 0.003588 0.241744
6.566667 -0.432275 -2.105309 0.000310 -1.398811 -0.002088 0.412998
6.600000 -0.479352 -2.105280 0.022918 -1.378615 -0.008106 0.577921
6.633333 -0.526103 -2.105273 0.082280 -1.356909 -0.014310 0.731409
6.666667 -0.571512 -2.105746 0.100755 -1.333911 -0.020539 0.873894
6.700000 -0.615465 -2.106704 0.129722 -1.309833 -0.026660 1.000903
6.733333 -0.657898 -2.108149 0.158437 -1.284674 -0.032638 1.121587
6.766667 -0.699905 -2.109619 0.206733 -1.258462 -0.038432 1.231341
6.800000 -0.741464 -2.111114 0.224215 -1.231131 -0.044043 1.336318
6.833333 -0.782554 -2.112633 0.304126 -1.202618 -0.049467 1.438417
6.866667 -0.823151 -2.114175 0.313053 -1.172837 -0.054737 1.534477
6.900000 -0.861791 -2.116177 0.402102 -1.141588 -0.059912 1.617933
6.933333 -0.899898 -2.118200 0.441034 -1.108688 -0.065055 1.676033
6.966667 -0.937452 -2.120244 0.505147 -1.074080 -0.070206 1.699314
7.000000 -0.972913 -2.122697 0.575141 -1.037754 -0.075387 1.671730
7.033333 -1.007784 -2.125167 0.643875 -0.999621 -0.080630 1.586156
7.066667 -1.040545 -2.128006 0.711783 -0.959824 -0.085891 1.432682
7.100000 -1.071209 -2.131186 0.795038 -0.918692 -0.091093 1.218023
7.133333 -1.101241 -2.134378 0.860345 -0.876658 -0.096115 0.947510
7.166667 -1.130628 -2.137578 0.914190 -0.833978 -0.100864 0.634810
7.200000 -1.158030 -2.141051 0.944228 -0.790885 -0.105255 0.295745
7.233333 -1.183504 -2.144768 0.943698 -0.747832 -0.109163 -0.052530
7.266667 -1.207124 -2.148694 0.915632 -0.705111 -0.112503 -0.386159
7.300000 -1.230061 -2.152614 0.862132 -0.662784 -0.115231 -0.687514
7.333333 -1.251296 -2.156672 0.818898 -0.621017 -0.117307 -0.942180
7.366667 -1.270897 -2.160821 0.745253 -0.580142 -0.118670 -1.139870
7.400000 -1.288943 -2.165022 0.684956 -0.540459 -0.119272 -1.273598
7.433333 -1.306289 -2.169200 0.629849 -0.502054 -0.119111 -1.342095
7.466667 -1.322218 -2.173357 0.585961 -0.464995 -0.118194 -1.356958
7.500000 -1.336790 -2.177460 0.533601 -0.429522 -0.116483 -1.329422
7.533333 -1.350072 -2.181458 0.479230 -0.395690 -0.113970 -1.272178
7.566667 -1.362127 -2.185325 0.425878 -0.363436 -0.110687 -1.193867
7.600000 -1.373029 -2.189038 0.406544 -0.332689 -0.106672 -1.104090
7.633333 -1.383235 -2.192701 0.377455 -0.303466 -0.101975 -1.016252
7.666667 -1.392752 -2.196311 0.355799 -0.275742 -0.096663 -0.929362
7.700000 -1.401305 -2.199662 0.310799 -0.249420 -0.090840 -0.846576
7.733333 -1.408952 -2.202733 0.278754 -0.224414 -0.084584 -0.763438
7.766667 -1.415763 -2.205500 0.275599 -0.200615 -0.077994 -0.687423
7.800000 -1.421786 -2.207955 0.238219 -0.177907 -0.071175 -0.619139
7.833333 -1.427078 -2.210090 0.238219 -0.156165 -0.064230 -0.553734
7.866667 -1.431710 -2.212149 0.183925 -0.135310 -0.057243 -0.488838
7.900000 -1.435705 -2.213872 0.190367 -0.115256 -0.050304 -0.427557
7.933333 -1.439097 -2.215263 0.196713 -0.095929 -0.043517 -0.374002
7.966667 -1.441847 -2.216570 0.163516 -0.077275 -0.036933 -0.320239
8.000000 -1.443965 -2.217791 0.158024 -0.059232 -0.030586 -0.264789
8.033333 -1.445530 -2.218693 0.155464 -0.041720 -0.024489 -0.203951
8.066667 -1.446570 -2.219273 0.155464 -0.024649 -0.018673 -0.146558
8.100000 -1.446999 -2.219762 0.153551 -0.007964 -0.013123 -0.086112
8.133333 -1.447002 -2.219937 0.132000 0.008423 -0.007829 -0.020599
8.166667 -1.446410 -2.220016 0.130024 0.024587 -0.002803 0.043535
8.200000 -1.445229 -2.219999 0.130024 0.040537 0.001953 0.104800
8.233333 -1.443467 -2.219883 0.131680 0.056229 0.006461 0.155430
8.266667 -1.441425 -2.219483 0.152739 0.071626 0.010771 0.200456
8.300000 -1.438819 -2.218981 0.157433 0.086694 0.014907 0.234762
8.333333 -1.435657 -2.218378 0.175658 0.101348 0.018927 0.254462
8.366667 -1.431947 -2.217671 0.217667 0.115504 0.022889 0.254928
8.400000 -1.427698 -2.216860 0.204101 0.129123 0.026844 0.235938
8.433333 -1.422918 -2.215943 0.228145 0.142210 0.030815 0.199547
8.466667 -1.417617 -2.214919 0.228145 0.154729 0.034840 0.148878
8.500000 -1.411802 -2.213787 0.223366 0.166605 0.038964 0.090069
8.533333 -1.405958 -2.212440 0.237076 0.177816 0.043209 0.031165
8.566667 -1.400072 -2.210874 0.236665 0.188332 0.047593 -0.011520
8.600000 -1.393699 -2.209198 0.236665 0.198156 0.052126 -0.037814
8.633333 -1.386846 -2.207411 0.236665 0.207280 0.056809 -0.043882
8.666667 -1.379522 -2.205512 0.236665 0.215721 0.061631 -0.032066
8.700000 -1.371734 -2.203501 0.179604 0.223532 0.066565 -0.004387
8.733333 -1.363911 -2.201244 0.167109 0.230717 0.071591 0.032251
8.766667 -1.356099 -2.198743 0.167109 0.237342 0.076676 0.069522
8.800000 -1.347849 -2.196129 0.176015 0.243435 0.081799 0.101275
8.833333 -1.339662 -2.193265 0.209543 0.249088 0.086927 0.120589
8.866667 -1.331050 -2.190288 0.261820 0.254392 0.092031 0.122056
8.900000 -1.322585 -2.187079 0.261820 0.259546 0.097064 0.091657
8.933333 -1.313708 -2.183757 0.252321 0.264718 0.101994 0.029351
8.966667 -1.305002 -2.180209 0.252321 0.270007 0.106815 -0.064827
9.000000 -1.295896 -2.176549 0.263087 0.275512 0.111522 -0.176917
9.033333 -1.287006 -2.172681 0.263087 0.281330 0.116113 -0.295170
9.066667 -1.277728 -2.168703 0.263087 0.287517 0.120600 -0.410084
9.100000 -1.268067 -2.164614 0.263087 0.293952 0.125038 -0.503200
9.133333 -1.258027 -2.160415 0.178096 0.300546 0.129470 -0.561674
9.166667 -1.248076 -2.155987 0.152629 0.307253 0.133912 -0.582291
9.200000 -1.237757 -2.151452 0.152629 0.314029 0.138379 -0.568546
9.233333 -1.227074 -2.146809 0.060212 0.320731 0.142900 -0.520372
9.266667 -1.216031 -2.142060 0.036651 0.327238 0.147488 -0.439273
9.300000 -1.205015 -2.137050 0.036651 0.333581 0.152104 -0.327068
9.333333 -1.193649 -2.131936 0.036651 0.339792 0.156706 -0.204645
9.366667 -1.181936 -2.126719 0.059651 0.345840 0.161278 -0.077466
9.400000 -1.170323 -2.121238 0.058351 0.351673 0.165793 0.048936
9.433333 -1.158806 -2.115485 0.037968 0.357265 0.170203 0.160775
9.466667 -1.146954 -2.109633 0.066483 0.362591 0.174454 0.250707
9.500000 -1.134769 -2.103684 0.079593 0.367527 0.178533 0.310623
9.533333 -1.122255 -2.097640 0.110031 0.371948 0.182430 0.345922
9.566667 -1.109414 -2.091503 0.123393 0.375712 0.186120 0.352071
9.600000 -1.096853 -2.085166 0.131466 0.378718 0.189597 0.323503
9.633333 -1.083972 -2.078740 0.161300 0.380917 0.192876 0.256543
9.666667 -1.070772 -2.072226 0.151707 0.382333 0.195985 0.150823
9.700000 -1.057255 -2.065627 0.186327 0.383025 0.198937 0.001624
9.733333 -1.044146 -2.058916 0.190256 0.383111 0.201745 -0.183151
9.766667 -1.031450 -2.052103 0.193006 0.382888 0.204420 -0.392511
9.800000 -1.019194 -2.045213 0.197972 0.382700 0.206979 -0.615092
9.833333 -1.006626 -2.038246 0.193820 0.382864 0.209427 -0.831095
9.866667 -0.993746 -2.031203 0.156354 0.383622 0.211771 -1.026446
9.900000 -0.981252 -2.024092 0.099972 0.385262 0.214018 -1.178458
9.933333 -0.969090 -2.016905 0.021280 0.387991 0.216182 -1.279367
9.966667 -0.956613 -2.009648 -0.052517 0.391837 0.218279 -1.324393
10.000000 -0.943819 -2.002324 -0.145241 0.396689 0.220313 -1.302159
10.033333 -0.930706 -1.994936 -0.231609 0.402424 0.222286 -1.211914
10.066667 -0.917272 -1.987484 -0.259076 0.408940 0.224191 -1.057265
10.100000 -0.903517 -1.979973 -0.275530 0.416045 0.226017 -0.851132
10.133333 -0.889437 -1.972402 -0.312966 0.423513 0.227747 -0.606090
10.166667 -0.875031 -1.964776 -0.309913 0.431176 0.229352 -0.335230
10.200000 -0.860465 -1.957072 -0.321209 0.438965 0.230806 -0.061779
10.233333 -0.845722 -1.949302 -0.330048 0.446835 0.232091 0.196945
10.266667 -0.830778 -1.941479 -0.310483 0.454758 0.233199 0.428045
10.300000 -0.815501 -1.933607 -0.295577 0.462752 0.234113 0.626787
10.333333 -0.800006 -1.925715 -0.249804 0.470903 0.234832 0.785920
10.366667 -0.784270 -1.917822 -0.209128 0.479317 0.235365 0.903274
10.400000 -0.768283 -1.909942 -0.144396 0.488085 0.235715 0.980036
10.433333 -0.751953 -1.902023 -0.099839 0.497265 0.235885 1.016985
10.466667 -0.735331 -1.894145 -0.060239 0.506908 0.235867 1.017338
10.500000 -0.718389 -1.886323 -0.017676 0.517070 0.235669 0.979953
10.533333 -0.701098 -1.878466 0.011686 0.527806 0.235275 0.912137
10.566667 -0.683457 -1.870577 0.041923 0.539125 0.234672 0.818641
10.600000 -0.665465 -1.862658 0.064954 0.551007 0.233862 0.706933
10.633333 -0.647030 -1.854823 0.097525 0.563458 0.232839 0.582453
10.666667 -0.628239 -1.846960 0.112103 0.576470 0.231595 0.452394
10.700000 -0.608938 -1.839194 0.117065 0.590009 0.230121 0.322988
10.733333 -0.589107 -1.831533 0.138846 0.604016 0.228433 0.196620
10.766667 -0.568916 -1.823849 0.143871 0.618482 0.226524 0.077830
10.800000 -0.548146 -1.816293 0.136792 0.633425 0.224386 -0.031689
10.833333 -0.526773 -1.808867 0.139997 0.648816 0.222026 -0.126973
10.866667 -0.504786 -1.801577 0.117596 0.664614 0.219477 -0.209227
10.900000 -0.482438 -1.794268 0.093904 0.680784 0.216772 -0.274448
10.933333 -0.459730 -1.786939 0.080009 0.697328 0.213924 -0.319587
10.966667 -0.436395 -1.779755 0.059702 0.714172 0.210988 -0.344769
11.000000 -0.412440 -1.772719 0.063784 0.731244 0.208022 -0.353326
11.033333 -0.387860 -1.765833 0.047157 0.748554 0.205059 -0.345356
11.066667 -0.362624 -1.759089 0.025200 0.766131 0.202127 -0.321266
11.100000 -0.336716 -1.752489 0.012579 0.784039 0.199254 -0.289118
11.133333 -0.310117 -1.746032 -0.005092 0.802296 0.196500 -0.250346
11.166667 -0.283172 -1.739555 -0.008530 0.821043 0.193875 -0.211473
11.200000 -0.255476 -1.733224 -0.019720 0.840402 0.191393 -0.170583
11.233333 -0.227443 -1.726871 0.000809 0.860424 0.189072 -0.141237
11.266667 -0.198593 -1.720652 -0.012205 0.881082 0.186928 -0.132216
11.300000 -0.169414 -1.714411 -0.015384 0.902297 0.184970 -0.149737
11.333333 -0.139374 -1.708276 -0.035533 0.923937 0.183188 -0.206402
11.366667 -0.108439 -1.702230 -0.013744 0.945748 0.181605 -0.307980
11.400000 -0.076597 -1.696256 -0.007679 0.967412 0.180239 -0.471026
11.433333 -0.043831 -1.690345 -0.007015 0.988583 0.179120 -0.693539
11.466667 -0.010139 -1.684484 0.003616 1.008969 0.178262 -0.984177
11.500000 0.024464 -1.678667 -0.026192 1.028253 0.177692 -1.345658
11.533333 0.059977 -1.672881 -0.052268 1.046231 0.177426 -1.780496
11.566667 0.095754 -1.667059 -0.110994 1.062744 0.177460 -2.285765
11.600000 0.131781 -1.661199 -0.184545 1.077751 0.177781 -2.845449
11.633333 0.168048 -1.655298 -0.279977 1.091366 0.178362 -3.449414
11.666667 0.204543 -1.649356 -0.395643 1.103818 0.179181 -4.070925
11.700000 0.241906 -1.643406 -0.512927 1.115385 0.180203 -4.687087
11.733333 0.279472 -1.637411 -0.711075 1.126299 0.181398 -5.260728
11.766667 0.317230 -1.631367 -0.883321 1.136798 0.182741 -5.767911
11.800000 0.355165 -1.625273 -1.125701 1.147071 0.184216 -6.185827
11.833333 0.393266 -1.619127 -1.385887 1.157202 0.185798 -6.492950
11.866667 0.432175 -1.612943 -1.661480 1.167115 0.187454 -6.675319
11.900000 0.471223 -1.606704 -1.936881 1.176829 0.189149 -6.719125
11.933333 0.510394 -1.600407 -2.211754 1.186364 0.190848 -6.632632
11.966667 0.550273 -1.594024 -2.452171 1.195721 0.192521 -6.412818
12.000000 0.590813 -1.587540 -2.692481 1.204854 0.194132 -6.066871
12.033333 0.631432 -1.580993 -2.903542 1.213695 0.195681 -5.608799
12.066667 0.672115 -1.574381 -3.059133 1.222268 0.197198 -5.059150
12.100000 0.712846 -1.567702 3.044781 1.230467 0.198725 -4.438641
12.133333 0.753610 -1.560954 2.877647 1.238186 0.200306 -3.761326
12.166667 0.794948 -1.554277 2.758744 1.245314 0.202011 -3.049697
12.200000 0.836795 -1.547629 2.654390 1.251795 0.203950 -2.324924
12.233333 0.879083 -1.540964 2.587528 1.257535 0.206203 -1.605014
12.266667 0.921335 -1.534222 2.548123 1.262365 0.208868 -0.901779
12.300000 0.963903 -1.527370 2.546571 1.266126 0.212035 -0.231049
12.333333 1.006399 -1.520438 2.571844 1.268623 0.215844 0.389782
12.366667 1.049071 -1.513310 2.620218 1.269708 0.220360 0.947826
12.400000 1.091873 -1.505950 2.685200 1.269251 0.225575 1.431988
12.433333 1.134549 -1.498508 2.768147 1.267171 0.231527 1.834385
12.466667 1.177080 -1.490981 2.860765 1.263401 0.238213 2.148024
12.500000 1.219511 -1.483133 2.956714 1.257932 0.245616 2.367573
12.533333 1.261751 -1.474947 3.054236 1.250820 0.253599 2.496628
12.566667 1.303791 -1.466674 -3.134319 1.242130 0.262074 2.539959
12.600000 1.345316 -1.457728 -3.045554 1.231945 0.270957 2.508362
12.633333 1.386605 -1.448695 -2.921155 1.220417 0.280076 2.413488
12.666667 1.427246 -1.438982 -2.820592 1.207732 0.289200 2.271101
12.700000 1.467615 -1.429184 -2.736029 1.194055 0.298137 2.104226
12.733333 1.507695 -1.419303 -2.666012 1.179429 0.306820 1.933365
12.766667 1.546852 -1.408772 -2.614114 1.163928 0.315124 1.779689
12.800000 1.585002 -1.397609 -2.569659 1.147612 0.322964 1.658381
12.833333 1.622815 -1.386369 -2.547992 1.130413 0.330333 1.584872
12.866667 1.660274 -1.375054 -2.516496 1.112240 0.337322 1.562475
12.900000 1.697366 -1.363667 -2.507097 1.092936 0.344033 1.582751
12.933333 1.734074 -1.352212 -2.480581 1.072462 0.350503 1.629713
12.966667 1.770385 -1.340691 -2.439981 1.050679 0.356869 1.681068
13.000000 1.805218 -1.328663 -2.374738 1.027400 0.363294 1.711921
13.033333 1.839625 -1.316575 -2.288375 1.002563 0.369909 1.695239
13.066667 1.872512 -1.304029 -2.179691 0.976251 0.376759 1.610481
13.100000 1.904950 -1.291431 -2.080389 0.948683 0.383835 1.447490
13.133333 1.936926 -1.278787 -1.983263 0.920110 0.391107 1.202404
13.166667 1.967462 -1.265752 -1.912991 0.890890 0.398476 0.880884
13.200000 1.996627 -1.252343 -1.864196 0.861406 0.405805 0.497236
13.233333 2.024497 -1.238563 -1.878202 0.832110 0.412910 0.075462
13.266667 2.051147 -1.224431 -1.900150 0.803310 0.419637 -0.358163
13.300000 2.077292 -1.210278 -1.947047 0.775232 0.425860 -0.777877
13.333333 2.102366 -1.195816 -2.012936 0.748070 0.431448 -1.157106
13.366667 2.126432 -1.181075 -2.069964 0.721947 0.436284 -1.476844
13.400000 2.149546 -1.166095 -2.137864 0.696960 0.440263 -1.720788
13.433333 2.172135 -1.151120 -2.209051 0.673014 0.443343 -1.890418
13.466667 2.194194 -1.136159 -2.293855 0.649984 0.445523 -1.984929
13.500000 2.215417 -1.121088 -2.378053 0.627791 0.446775 -2.009588
13.533333 2.235832 -1.105960 -2.472533 0.606301 0.447103 -1.971412
13.566667 2.255710 -1.090867 -2.533890 0.585357 0.446540 -1.876740
13.600000 2.274827 -1.075801 -2.611014 0.564796 0.445137 -1.734912
13.633333 2.293195 -1.060817 -2.666324 0.544569 0.442949 -1.547660
13.666667 2.310819 -1.045965 -2.728736 0.524686 0.440015 -1.323852
13.700000 2.327899 -1.031178 -2.779133 0.505108 0.436400 -1.072032
13.733333 2.344435 -1.016463 -2.806812 0.485808 0.432201 -0.803565
13.766667 2.360248 -1.002008 -2.847066 0.466813 0.427509 -0.528724
13.800000 2.375517 -0.987640 -2.855987 0.448150 0.422396 -0.260323
13.833333 2.390073 -0.973615 -2.849719 0.429810 0.416936 -0.011007
13.866667 2.403922 -0.959970 -2.839519 0.411765 0.411215 0.206967
13.900000 2.417229 -0.946431 -2.809219 0.394009 0.405320 0.382915
13.933333 2.429995 -0.933006 -2.774694 0.376542 0.399282 0.509470
13.966667 2.442221 -0.919700 -2.741578 0.359329 0.393071 0.581396
14.000000 2.453909 -0.906520 -2.703470 0.342337 0.386629 0.598477
14.033333 2.464968 -0.893860 -2.667035 0.325520 0.379863 0.566032
14.066667 2.475493 -0.881337 -2.625231 0.308800 0.372612 0.492409
14.100000 2.485487 -0.868958 -2.612060 0.292075 0.364714 0.391682
14.133333 2.494952 -0.856728 -2.591678 0.275226 0.356039 0.277077
14.166667 2.503890 -0.844653 -2.591227 0.258163 0.346527 0.162233
14.200000 2.512306 -0.832738 -2.602973 0.240782 0.336149 0.060844
14.233333 2.520186 -0.821344 -2.617659 0.222969 0.324892 -0.016420
14.266667 2.527501 -0.810469 -2.637267 0.204661 0.312849 -0.059654
14.300000 2.534210 -0.800110 -2.651788 0.185842 0.300175 -0.067558
14.333333 2.540278 -0.790265 -2.669301 0.166558 0.287074 -0.039620
14.366667 2.545664 -0.780938 -2.669118 0.146803 0.273731 0.016001
14.400000 2.550341 -0.772137 -2.671541 0.126594 0.260359 0.087881
14.433333 2.554274 -0.763863 -2.666285 0.106047 0.247200 0.160060
14.466667 2.557410 -0.756116 -2.664938 0.085275 0.234440 0.219543
14.500000 2.560063 -0.748560 -2.649523 0.064357 0.222175 0.258596
14.533333 2.561805 -0.741530 -2.637483 0.043361 0.210449 0.271804
14.566667 2.562567 -0.735024 -2.590811 0.022480 0.199323 0.262459
14.600000 2.562865 -0.728714 -2.558082 0.001949 0.188823 0.240578
14.633333 2.562706 -0.722599 -2.527831 -0.018077 0.178919 0.219100
14.666667 2.562099 -0.716680 -2.523150 -0.037495 0.169553 0.205651
14.700000 2.560370 -0.711261 -2.543295 -0.056157 0.160706 0.209244
14.733333 2.557532 -0.706322 -2.579631 -0.073939 0.152339 0.238153
14.766667 2.554271 -0.701579 -2.606919 -0.090844 0.144361 0.298495
14.800000 2.550596 -0.697031 -2.612606 -0.106921 0.136672 0.386486
14.833333 2.546518 -0.692678 -2.592540 -0.122203 0.129202 0.496617
14.866667 2.542045 -0.688520 -2.582069 -0.136694 0.121905 0.626730
14.900000 2.537189 -0.684554 -2.551512 -0.150464 0.114706 0.765669
14.933333 2.531958 -0.680781 -2.490175 -0.163619 0.107529 0.900034
14.966667 2.526364 -0.677199 -2.431109 -0.176221 0.100325 1.016264
15.000000 2.520415 -0.673807 -2.401330 -0.188318 0.093069 1.109760
15.033333 2.513854 -0.670786 -2.348777 -0.199939 0.085755 1.178997
15.066667 2.506756 -0.668123 -2.311162 -0.211070 0.078381 1.221069
15.100000 2.499335 -0.665647 -2.276940 -0.221652 0.070975 1.239786
15.133333 2.491513 -0.663508 -2.236920 -0.231568 0.063604 1.242725
15.166667 2.483391 -0.661551 -2.192784 -0.240673 0.056335 1.237561
15.200000 2.474979 -0.659774 -2.150967 -0.248828 0.049220 1.225549
15.233333 2.466347 -0.658305 -2.113550 -0.255908 0.042296 1.206039
15.266667 2.457553 -0.657132 -2.063552 -0.261877 0.035592 1.178152
15.300000 2.448502 -0.656133 -2.028057 -0.266702 0.029139 1.143711
15.333333 2.439205 -0.655305 -1.990670 -0.270412 0.022941 1.101883
15.366667 2.429673 -0.654645 -1.937100 -0.273056 0.017010 1.050417
15.400000 2.420174 -0.654217 -1.896765 -0.274659 0.011373 0.989979
15.433333 2.410755 -0.654005 -1.875790 -0.275266 0.006060 0.924410
15.466667 2.401465 -0.653985 -1.841488 -0.274894 0.001094 0.857014
15.500000 2.392347 -0.654136 -1.813892 -0.273649 -0.003520 0.786843
15.533333 2.383044 -0.654440 -1.787508 -0.271601 -0.007765 0.712832
15.566667 2.374003 -0.654862 -1.779921 -0.268869 -0.011632 0.640331
15.600000 2.364795 -0.655430 -1.766394 -0.265619 -0.015143 0.570273
15.633333 2.355917 -0.656073 -1.742364 -0.262024 -0.018325 0.499718
15.666667 2.346889 -0.656857 -1.715068 -0.258212 -0.021206 0.428886
15.700000 2.338240 -0.657680 -1.698023 -0.254206 -0.023798 0.357843
15.733333 2.330004 -0.658521 -1.688173 -0.250030 -0.026111 0.288647
15.766667 2.322204 -0.659363 -1.681777 -0.245733 -0.028178 0.215360
15.800000 2.314280 -0.660332 -1.683492 -0.241343 -0.030018 0.140692
15.833333 2.306237 -0.661427 -1.676960 -0.236836 -0.031639 0.068719
15.866667 2.298081 -0.662643 -1.677815 -0.232215 -0.033046 0.001897
15.900000 2.290396 -0.663810 -1.662549 -0.227571 -0.034273 -0.057351
15.933333 2.282609 -0.665092 -1.683340 -0.222989 -0.035365 -0.106962
15.966667 2.275292 -0.666303 -1.693939 -0.218500 -0.036352 -0.141560
16.000000 2.267881 -0.667625 -1.699553 -0.214101 -0.037247 -0.161990
16.033333 2.260932 -0.668864 -1.712381 -0.209881 -0.038090 -0.170318
16.066667 2.254441 -0.670018 -1.722235 -0.205974 -0.038936 -0.168077
16.100000 2.247864 -0.671275 -1.735205 -0.202388 -0.039791 -0.154632
16.133333 2.241204 -0.672633 -1.742545 -0.199131 -0.040656 -0.133719
16.166667 2.234944 -0.673900 -1.741781 -0.196204 -0.041526 -0.109411
16.200000 2.228604 -0.675264 -1.742963 -0.193668 -0.042424 -0.084555
16.233333 2.222185 -0.676721 -1.737308 -0.191511 -0.043352 -0.059827
16.266667 2.215687 -0.678270 -1.745523 -0.189627 -0.044280 -0.037273
16.300000 2.209113 -0.679908 -1.738002 -0.188012 -0.045219 -0.021299
16.333333 2.202830 -0.681468 -1.730692 -0.186692 -0.046192 -0.011499
16.366667 2.196825 -0.682957 -1.745234 -0.185677 -0.047210 -0.006197
16.400000 2.190743 -0.684529 -1.741213 -0.184936 -0.048263 -0.003512
16.433333 2.184895 -0.686026 -1.735925 -0.184483 -0.049355 -0.003722
16.466667 2.178970 -0.687604 -1.743223 -0.184372 -0.050507 -0.005628
16.500000 2.172968 -0.689259 -1.735742 -0.184632 -0.051719 -0.007133
16.533333 2.166886 -0.690990 -1.739616 -0.185226 -0.052964 -0.007234
16.566667 2.160725 -0.692795 -1.739719 -0.186122 -0.054216 -0.007269
16.600000 2.154482 -0.694673 -1.744436 -0.187308 -0.055466 -0.007059
16.633333 2.148157 -0.696622 -1.743636 -0.188722 -0.056675 -0.005504
16.666667 2.141748 -0.698639 -1.743947 -0.190306 -0.057797 -0.003558
16.700000 2.135390 -0.700616 -1.743074 -0.192023 -0.058812 -0.000996
16.733333 2.129062 -0.702553 -1.734785 -0.193878 -0.059722 0.000593
16.766667 2.122645 -0.704554 -1.742638 -0.195891 -0.060544 -0.004703
16.800000 2.116137 -0.706618 -1.742416 -0.198089 -0.061284 -0.028454
16.833333 2.109587 -0.708656 -1.741475 -0.200536 -0.061978 -0.081339
16.866667 2.102941 -0.710754 -1.748600 -0.203287 -0.062666 -0.173219
16.900000 2.096203 -0.712835 -1.740656 -0.206368 -0.063375 -0.314975
16.933333 2.089365 -0.714973 -1.731980 -0.209786 -0.064111 -0.514157
16.966667 2.082387 -0.717104 -1.738518 -0.213545 -0.064879 -0.767176
17.000000 2.075237 -0.719232 -1.738721 -0.217614 -0.065694 -1.064305
17.033333 2.067980 -0.721412 -1.741510 -0.221927 -0.066560 -1.393652
17.066667 2.060612 -0.723643 -1.751184 -0.226422 -0.067475 -1.740255
17.100000 2.053131 -0.725923 -1.829285 -0.231051 -0.068423 -2.084166
17.133333 2.045369 -0.728218 -1.945393 -0.235760 -0.069403 -2.404943
17.166667 2.037302 -0.730523 -2.074123 -0.240483 -0.070396 -2.686338
17.200000 2.029113 -0.732874 -2.206904 -0.245180 -0.071370 -2.910776
17.233333 2.020801 -0.735270 -2.330317 -0.249828 -0.072300 -3.063659
17.266667 2.012362 -0.737708 -2.444898 -0.254379 -0.073174 -3.136692
17.300000 2.003793 -0.740189 -2.556918 -0.258781 -0.074004 -3.130692
17.333333 1.995093 -0.742709 -2.686448 -0.262982 -0.074812 -3.049435
17.366667 1.986257 -0.745269 -2.798546 -0.266934 -0.075652 -2.903061
17.400000 1.977284 -0.747867 -2.880092 -0.270556 -0.076595 -2.708706
17.433333 1.968136 -0.750405 -2.977861 -0.273737 -0.077737 -2.482583
17.466667 1.958844 -0.752978 -3.077228 -0.276415 -0.079138 -2.235627
17.500000 1.949456 -0.755479 3.131485 -0.278538 -0.080862 -1.976193
17.533333 1.939917 -0.758012 3.067297 -0.280069 -0.082953 -1.713781
17.566667 1.930226 -0.760577 3.030109 -0.281012 -0.085424 -1.453492
17.600000 1.920689 -0.763369 2.996973 -0.281429 -0.088252 -1.196313
17.633333 1.910992 -0.766190 2.967171 -0.281445 -0.091372 -0.944551
17.666667 1.901471 -0.769228 2.949078 -0.281160 -0.094734 -0.705107
17.700000 1.892137 -0.772472 2.929279 -0.280694 -0.098254 -0.482199
17.733333 1.882988 -0.775913 2.908630 -0.280195 -0.101836 -0.279943
17.766667 1.874014 -0.779544 2.898049 -0.279808 -0.105383 -0.100289
17.800000 1.864857 -0.783193 2.902240 -0.279624 -0.108834 0.054898
17.833333 1.855511 -0.786860 2.911594 -0.279702 -0.112146 0.182117
17.866667 1.846299 -0.790710 2.939565 -0.280096 -0.115280 0.280263
17.900000 1.836887 -0.794572 2.971475 -0.280775 -0.118246 0.346645
17.933333 1.827614 -0.798617 2.979717 -0.281675 -0.121064 0.382014
17.966667 1.818128 -0.802668 3.010381 -0.282678 -0.123783 0.383973
18.000000 1.808784 -0.806897 3.035134 -0.283727 -0.126419 0.354094
18.033333 1.799214 -0.811126 3.050175 -0.284746 -0.128999 0.297528
18.066667 1.789782 -0.815528 3.052985 -0.285700 -0.131537 0.222421
18.100000 1.780110 -0.819924 3.064927 -0.286637 -0.134021 0.138525
18.133333 1.770565 -0.824478 3.068584 -0.287634 -0.136439 0.053943
18.166667 1.760765 -0.829020 3.069674 -0.288788 -0.138775 -0.020373
18.200000 1.751108 -0.833691 3.066521 -0.290189 -0.141022 -0.079382
18.233333 1.741581 -0.838478 3.051975 -0.292003 -0.143136 -0.120113
18.266667 1.732152 -0.843378 3.024017 -0.294358 -0.145094 -0.142109
18.300000 1.722435 -0.848249 3.001845 -0.297375 -0.146859 -0.144154
18.333333 1.712718 -0.853222 3.003030 -0.301152 -0.148394 -0.129276
18.366667 1.702949 -0.858293 3.002877 -0.305831 -0.149632 -0.101920
18.400000 1.692866 -0.863322 2.998347 -0.311491 -0.150530 -0.065818
18.433333 1.682613 -0.868430 2.999555 -0.318148 -0.151071 -0.023612
18.466667 1.672142 -0.873599 3.004613 -0.325815 -0.151234 0.020269
18.500000 1.661397 -0.878817 3.008914 -0.334512 -0.151000 0.058548
18.533333 1.650300 -0.883976 3.019641 -0.344232 -0.150369 0.090873
18.566667 1.638842 -0.889072 3.018648 -0.354921 -0.149362 0.117497
18.600000 1.627014 -0.894098 3.012595 -0.366556 -0.147989 0.139114
18.633333 1.614807 -0.899051 3.030016 -0.379091 -0.146268 0.155296
18.666667 1.602212 -0.903926 3.033871 -0.392459 -0.144224 0.168818
18.700000 1.589084 -0.908754 3.039621 -0.406528 -0.141902 0.183446
18.733333 1.575550 -0.913495 3.041645 -0.421229 -0.139327 0.200970
18.766667 1.561425 -0.918154 3.053442 -0.436460 -0.136523 0.219662
18.800000 1.546677 -0.922713 3.056519 -0.452154 -0.133482 0.237615
18.833333 1.531270 -0.927155 3.063389 -0.468306 -0.130159 0.256321
18.866667 1.515426 -0.931492 3.073855 -0.484933 -0.126497 0.272971
18.900000 1.498859 -0.935687 3.084487 -0.502081 -0.122439 0.285801
18.933333 1.481842 -0.939768 3.085990 -0.519779 -0.117909 0.292472
18.966667 1.464368 -0.943729 3.105883 -0.538112 -0.112829 0.293561
19.000000 1.446433 -0.947567 3.117189 -0.557095 -0.107184 0.290799
19.033333 1.428030 -0.951278 3.133677 -0.576675 -0.101019 0.279889
19.066667 1.408734 -0.954794 -3.129192 -0.596831 -0.094355 0.260830
19.100000 1.388960 -0.958174 -3.120808 -0.617648 -0.087177 0.232459
19.133333 1.368086 -0.961042 -3.132041 -0.639136 -0.079552 0.195114
19.166667 1.346097 -0.963392 -3.112916 -0.661297 -0.071579 0.146625
19.200000 1.323617 -0.965596 -3.119262 -0.684169 -0.063325 0.087820
19.233333 1.300646 -0.967650 -3.110912 -0.707885 -0.054823 0.021980
19.266667 1.276470 -0.969181 -3.100613 -0.732449 -0.046189 -0.047726
19.300000 1.251799 -0.970556 -3.092262 -0.757769 -0.037598 -0.119466
19.333333 1.226630 -0.971775 -3.096344 -0.783790 -0.029138 -0.192601
19.366667 1.200963 -0.972834 -3.109398 -0.810505 -0.020839 -0.262950
19.400000 1.173977 -0.973375 -3.130161 -0.837837 -0.012760 -0.329198
19.433333 1.145654 -0.973398 3.132152 -0.865511 -0.004996 -0.389168
19.466667 1.116113 -0.973221 3.124269 -0.893408 0.002444 -0.442031
19.500000 1.085339 -0.972844 3.097697 -0.921286 0.009573 -0.486462
19.533333 1.054076 -0.972300 3.084802 -0.948978 0.016375 -0.523213
19.566667 1.021564 -0.971561 3.061207 -0.976186 0.022801 -0.551944
19.600000 0.988574 -0.970652 3.044164 -1.002812 0.028859 -0.576738
19.633333 0.954340 -0.969556 3.018279 -1.028954 0.034613 -0.597711
19.666667 0.919639 -0.968289 3.019761 -1.054703 0.040102 -0.618784
19.700000 0.883691 -0.966843 2.977047 -1.080270 0.045370 -0.637800
19.733333 0.847292 -0.965225 2.974331 -1.105745 0.050464 -0.654357
19.766667 0.810451 -0.963434 2.945243 -1.131339 0.055439 -0.667924
19.800000 0.772407 -0.961479 2.933718 -1.157069 0.060319 -0.675630
19.833333 0.733940 -0.959350 2.883806 -1.182889 0.065106 -0.676807
19.866667 0.694319 -0.957068 2.869685 -1.208627 0.069806 -0.666131
19.900000 0.653573 -0.954638 2.836525 -1.234166 0.074414 -0.645485
19.933333 0.611731 -0.952067 2.813160 -1.259435 0.078925 -0.612835
19.966667 0.568819 -0.949359 2.801370 -1.284234 0.083332 -0.571088
20.000000 0.524848 -0.946521 2.775872 -1.308431 0.087638 -0.519815
20.033333 0.480531 -0.943508 2.746585 -1.331888 0.091837 -0.464437
20.066667 0.435884 -0.940319 2.740703 -1.354590 0.095924 -0.411140
20.100000 0.390293 -0.937017 2.728490 -1.376466 0.099904 -0.365441
20.133333 0.343793 -0.933607 2.720726 -1.397451 0.103789 -0.330642
20.166667 0.297015 -0.930021 2.715262 -1.417599 0.107587 -0.310972
20.200000 0.249422 -0.926335 2.714682 -1.436964 0.111312 -0.311998
20.233333 0.201038 -0.922552 2.709141 -1.455575 0.114984 -0.335156
20.266667 0.151921 -0.918667 2.705058 -1.473350 0.118637 -0.379546
20.300000 0.102135 -0.914679 2.701710 -1.490213 0.122308 -0.444900
20.333333 0.051686 -0.910590 2.695207 -1.506079 0.126036 -0.539140
20.366667 0.001078 -0.906326 2.675666 -1.520791 0.129872 -0.660797
20.400000 -0.050069 -0.901956 2.649618 -1.534185 0.133873 -0.810010
20.433333 -0.101690 -0.897470 2.613005 -1.546111 0.138105 -0.987794
20.466667 -0.153728 -0.892859 2.607345 -1.556480 0.142617 -1.202242
20.500000 -0.206151 -0.888115 2.551149 -1.565211 0.147440 -1.452979
20.533333 -0.258896 -0.883220 2.517995 -1.572258 0.152601 -1.732193
20.566667 -0.311889 -0.878157 2.470265 -1.577560 0.158127 -2.037449
20.600000 -0.365061 -0.872907 2.423103 -1.581063 0.164045 -2.366941
20.633333 -0.418348 -0.867446 2.346552 -1.582722 0.170376 -2.709159
20.666667 -0.471581 -0.861813 2.229931 -1.582482 0.177174 -3.039776
20.700000 -0.524732 -0.855898 2.118080 -1.580269 0.184525 -3.347268
20.733333 -0.577722 -0.849671 2.006248 -1.575974 0.192541 -3.617809
20.766667 -0.630469 -0.843095 1.863321 -1.569526 0.201318 -3.836392
20.800000 -0.683064 -0.836352 1.694539 -1.560909 0.210908 -3.986705
20.833333 -0.735482 -0.829443 1.520856 -1.550090 0.221370 -4.064624
20.866667 -0.787699 -0.822371 1.359104 -1.537086 0.232693 -4.079540
20.900000 -0.839393 -0.814819 1.206693 -1.522001 0.244789 -4.033721
20.933333 -0.890471 -0.806753 1.042227 -1.504956 0.257527 -3.940932
20.966667 -0.940846 -0.798136 0.933341 -1.486068 0.270756 -3.823739
21.000000 -0.990475 -0.788947 0.825490 -1.465445 0.284320 -3.703699
21.033333 -1.039248 -0.779164 0.690151 -1.443248 0.298003 -3.600907
21.066667 -1.087070 -0.768763 0.597145 -1.419650 0.311583 -3.532743
21.100000 -1.133830 -0.757728 0.517273 -1.394791 0.324879 -3.515256
21.133333 -1.180210 -0.746558 0.395394 -1.368879 0.337712 -3.547768
21.166667 -1.225275 -0.734743 0.312843 -1.342268 0.349873 -3.623232
21.200000 -1.269921 -0.722806 0.219068 -1.315142 0.361237 -3.731202
21.233333 -1.314131 -0.710753 0.109949 -1.287723 0.371727 -3.855787
21.266667 -1.356843 -0.698085 -0.053447 -1.260126 0.381314 -3.965583
21.300000 -1.397940 -0.684837 -0.202343 -1.232473 0.389981 -4.029766
21.333333 -1.438552 -0.671496 -0.357753 -1.204744 0.397728 -4.030262
21.366667 -1.477437 -0.657651 -0.519634 -1.176736 0.404606 -3.943845
21.400000 -1.515809 -0.643729 -0.694031 -1.148475 0.410607 -3.751521
21.433333 -1.553656 -0.629738 -0.856405 -1.119866 0.415710 -3.443531
21.466667 -1.590966 -0.615686 -0.986853 -1.090868 0.419926 -3.032995
21.500000 -1.627725 -0.601583 -1.127888 -1.061252 0.423293 -2.535724
21.533333 -1.662746 -0.587259 -1.238349 -1.031047 0.425836 -1.968803
21.566667 -1.697194 -0.572902 -1.300988 -1.000259 0.427598 -1.359290
21.600000 -1.729978 -0.558435 -1.318293 -0.968840 0.428611 -0.739757
21.633333 -1.762171 -0.543953 -1.305612 -0.936835 0.428907 -0.140267
21.666667 -1.792790 -0.529472 -1.262318 -0.904366 0.428481 0.419037
21.700000 -1.821879 -0.515041 -1.222450 -0.871847 0.427323 0.920436
21.733333 -1.850357 -0.500622 -1.154746 -0.839414 0.425449 1.346729
21.766667 -1.877408 -0.486327 -1.080504 -0.807368 0.422858 1.691870
21.800000 -1.903838 -0.472061 -0.994814 -0.775899 0.419572 1.955884
21.833333 -1.928935 -0.457994 -0.919926 -0.745272 0.415662 2.146354
21.866667 -1.953404 -0.443974 -0.829436 -0.715567 0.411170 2.270653
21.900000 -1.976635 -0.430215 -0.754775 -0.686684 0.406107 2.335620
21.933333 -1.998676 -0.416747 -0.662082 -0.658669 0.400489 2.355782
21.966667 -2.019572 -0.403596 -0.583372 -0.631476 0.394369 2.337534
22.000000 -2.039835 -0.390525 -0.495637 -0.605158 0.387826 2.289641
22.033333 -2.059468 -0.377543 -0.398105 -0.579590 0.380867 2.214474
22.066667 -2.078470 -0.364655 -0.333645 -0.554766 0.373528 2.119224
22.100000 -2.096500 -0.352176 -0.259076 -0.530709 0.365872 2.007266
22.133333 -2.113602 -0.340120 -0.195197 -0.507373 0.357947 1.879745
22.166667 -2.130079 -0.328181 -0.133873 -0.484667 0.349747 1.742198
22.200000 -2.145694 -0.316693 -0.082176 -0.462490 0.341242 1.597492
22.233333 -2.160476 -0.305659 -0.026021 -0.440838 0.332479 1.451589
22.266667 -2.174642 -0.294762 0.033538 -0.419703 0.323524 1.302373
22.300000 -2.188197 -0.284008 0.052356 -0.399068 0.314417 1.155565
22.333333 -2.201146 -0.273404 0.091640 -0.378913 0.305162 1.013332
22.366667 -2.213379 -0.263266 0.124475 -0.359277 0.295797 0.877154
22.400000 -2.224921 -0.253593 0.153195 -0.340167 0.286371 0.747831
22.433333 -2.235794 -0.244379 0.173595 -0.321562 0.276905 0.624999
22.466667 -2.246081 -0.235335 0.188186 -0.303445 0.267382 0.514068
22.500000 -2.255786 -0.226467 0.195841 -0.285811 0.257821 0.413756
22.533333 -2.264903 -0.218035 0.206861 -0.268681 0.248290 0.325556
22.566667 -2.273460 -0.210030 0.218708 -0.252041 0.238857 0.248801
22.600000 -2.281455 -0.202211 0.220212 -0.235878 0.229543 0.183661
22.633333 -2.288948 -0.194801 0.217850 -0.220177 0.220365 0.131003
22.666667 -2.295891 -0.187585 0.217668 -0.204896 0.211366 0.089111
22.700000 -2.302388 -0.180757 0.220843 -0.189991 0.202587 0.056481
22.733333 -2.308348 -0.174130 0.226255 -0.175413 0.194025 0.030858
22.766667 -2.313914 -0.167875 0.218356 -0.161144 0.185654 0.013432
22.800000 -2.319110 -0.161982 0.217517 -0.147156 0.177485 0.002501
22.833333 -2.323791 -0.156297 0.221578 -0.133416 0.169523 -0.004156
22.866667 -2.327967 -0.150822 0.220878 -0.119921 0.161755 -0.009449
22.900000 -2.331643 -0.145560 0.219071 -0.106686 0.154133 -0.011713
22.933333 -2.334828 -0.140512 0.216676 -0.093745 0.146629 -0.010589
22.966667 -2.337743 -0.135786 0.212428 -0.081096 0.139228 -0.009190
23.000000 -2.340182 -0.131279 0.218852 -0.068783 0.131887 -0.007845
23.033333 -2.342154 -0.126991 0.217965 -0.056883 0.124568 -0.005982
23.066667 -2.343665 -0.122924 0.212334 -0.045448 0.117242 -0.001511
23.100000 -2.344962 -0.119155 0.221092 -0.034524 0.109898 0.001733
23.133333 -2.345815 -0.115610 0.215316 -0.024114 0.102534 0.004653
23.166667 -2.346232 -0.112290 0.217259 -0.014283 0.095137 0.007130
23.200000 -2.346466 -0.109249 0.210290 -0.005025 0.087716 0.010618
23.233333 -2.346281 -0.106436 0.223923 0.003708 0.080283 0.013210
23.266667 -2.345926 -0.103892 0.215479 0.012002 0.072855 0.014221
23.300000 -2.345168 -0.101576 0.220831 0.019924 0.065438 0.016154
23.333333 -2.344253 -0.099522 0.217339 0.027528 0.058037 0.016588
23.366667 -2.343184 -0.097723 0.220964 0.034942 0.050669 0.017059
23.400000 -2.341964 -0.096176 0.221278 0.042250 0.043342 0.015031
23.433333 -2.340596 -0.094879 0.218937 0.049526 0.036064 0.013354
23.466667 -2.338865 -0.093813 0.222961 0.056784 0.028834 0.010487
23.500000 -2.336989 -0.092991 0.226013 0.064086 0.021656 0.006551
23.533333 -2.334766 -0.092401 0.221604 0.071476 0.014532 0.003247
23.566667 -2.332201 -0.092041 0.223477 0.078933 0.007454 -0.001371
23.600000 -2.329303 -0.091912 0.224987 0.086418 0.000417 -0.004724
23.633333 -2.326258 -0.092020 0.222729 0.093888 -0.006586 -0.008331
23.666667 -2.323066 -0.092363 0.215852 0.101336 -0.013563 -0.009541
23.700000 -2.319563 -0.092936 0.230496 0.108701 -0.020519 -0.010768
23.733333 -2.315757 -0.093738 0.215441 0.115946 -0.027463 -0.011310
23.766667 -2.311791 -0.094771 0.219255 0.123081 -0.034398 -0.009742
23.800000 -2.307537 -0.096033 0.218756 0.130133 -0.041328 -0.006977
23.833333 -2.303004 -0.097522 0.219130 0.137115 -0.048253 -0.003686
23.866667 -2.298292 -0.099244 0.218569 0.144021 -0.055173 -0.002706
23.900000 -2.293399 -0.101203 0.218026 0.150868 -0.062086 0.000758
23.933333 -2.288250 -0.103386 0.217178 0.157675 -0.068992 0.003152
23.966667 -2.282901 -0.105808 0.220750 0.164444 -0.075890 0.004102
24.000000 -2.277311 -0.108452 0.226708 0.171193 -0.082787 0.002801
24.033333 -2.271488 -0.111316 0.214631 0.177949 -0.089688 0.001709
24.066667 -2.265433 -0.114426 0.219064 0.184756 -0.096606 0.001812
24.100000 -2.259138 -0.117783 0.224157 0.191643 -0.103552 -0.001077
24.133333 -2.252633 -0.121357 0.223337 0.198615 -0.110532 -0.003415
24.166667 -2.245927 -0.125144 0.221165 0.205687 -0.117553 -0.004863
24.200000 -2.239028 -0.129144 0.216746 0.212839 -0.124610 -0.004209
24.233333 -2.231943 -0.133354 0.222996 0.220055 -0.131699 -0.004658
24.266667 -2.224555 -0.137831 0.214612 0.227309 -0.138813 0.005034
24.300000 -2.216846 -0.142578 0.218694 0.234611 -0.145955 0.049614
24.333333 -2.208802 -0.147602 0.216645 0.242003 -0.153142 0.151557
24.366667 -2.200608 -0.152828 0.223203 0.249494 -0.160379 0.332104
24.400000 -2.192045 -0.158341 0.218895 0.257132 -0.167685 0.618605
24.433333 -2.183349 -0.164050 0.214059 0.265012 -0.175106 1.037277
24.466667 -2.174530 -0.169954 0.221194 0.273250 -0.182697 1.588709
24.500000 -2.165288 -0.176163 0.222823 0.281939 -0.190513 2.246233
24.533333 -2.155942 -0.182560 0.217269 0.291124 -0.198590 2.977115
24.566667 -2.146502 -0.189142 0.224882 0.300874 -0.206971 3.754136
24.600000 -2.136581 -0.196049 0.337771 0.311224 -0.215691 4.528530
24.633333 -2.126156 -0.203296 0.612193 0.322082 -0.224728 5.238153
24.666667 -2.115202 -0.210903 0.903282 0.333237 -0.234002 5.832159
24.700000 -2.104196 -0.218681 1.171817 0.344497 -0.243444 6.277929
24.733333 -2.092618 -0.226866 1.501460 0.355696 -0.253001 6.546902
24.766667 -2.080449 -0.235477 1.795299 0.366619 -0.262601 6.607524
24.800000 -2.067671 -0.244528 2.060811 0.376988 -0.272126 6.452198
24.833333 -2.054279 -0.254034 2.293025 0.386614 -0.281488 6.112660
24.866667 -2.040899 -0.263687 2.472969 0.395434 -0.290653 5.631740
24.900000 -2.027543 -0.273483 2.674135 0.403332 -0.299545 5.041956
24.933333 -2.013600 -0.283756 2.870847 0.410138 -0.308036 4.384533
24.966667 -1.999712 -0.294161 2.995533 0.415781 -0.316043 3.705264
25.000000 -1.985891 -0.304690 3.071952 0.420301 -0.323545 3.045039
25.033333 -1.971598 -0.315705 3.139899 0.423710 -0.330515 2.419435
25.066667 -1.956873 -0.327208 -3.078532 0.425934 -0.336899 1.831504
25.100000 -1.942261 -0.338817 -3.038214 0.426924 -0.342668 1.300206
25.133333 -1.927780 -0.350524 -3.030150 0.426718 -0.347873 0.837121
25.166667 -1.913211 -0.362379 -3.015266 0.425292 -0.352544 0.441060
25.200000 -1.898803 -0.374318 -3.009081 0.422558 -0.356695 0.105644
25.233333 -1.884426 -0.386376 -3.049463 0.418470 -0.360392 -0.170200
25.266667 -1.870242 -0.398505 -3.073310 0.413080 -0.363725 -0.385400
25.300000 -1.856262 -0.410695 -3.099716 0.406453 -0.366786 -0.551826
25.333333 -1.842564 -0.422918 -3.131342 0.398637 -0.369614 -0.681853
25.366667 -1.829236 -0.435144 3.121815 0.389683 -0.372249 -0.777060
25.400000 -1.816207 -0.447651 3.090321 0.379689 -0.374695 -0.838610
25.433333 -1.803446 -0.460192 3.075652 0.368726 -0.376900 -0.876133
25.466667 -1.791146 -0.472928 3.046469 0.356829 -0.378787 -0.894768
25.500000 -1.779144 -0.485684 2.998403 0.344038 -0.380280 -0.894014
25.533333 -1.767741 -0.498546 2.969406 0.330391 -0.381304 -0.872692
25.566667 -1.757016 -0.511467 2.937522 0.315946 -0.381759 -0.834661
25.600000 -1.746629 -0.524384 2.907804 0.300658 -0.381559 -0.781883
25.633333 -1.736594 -0.537290 2.870528 0.284486 -0.380621 -0.711058
25.666667 -1.726922 -0.550177 2.836474 0.267354 -0.378888 -0.622105
25.700000 -1.718209 -0.562908 2.812693 0.249241 -0.376317 -0.519950
25.733333 -1.709883 -0.575606 2.804905 0.230079 -0.372883 -0.410649
25.766667 -1.702628 -0.588042 2.789665 0.209821 -0.368598 -0.296279
25.800000 -1.695783 -0.600430 2.783315 0.188561 -0.363523 -0.183856
25.833333 -1.689358 -0.612764 2.774508 0.166409 -0.357727 -0.075291
25.866667 -1.683362 -0.625037 2.792035 0.143489 -0.351267 0.019802
25.900000 -1.678614 -0.636862 2.789313 0.119898 -0.344210 0.101231
25.933333 -1.675141 -0.648212 2.818636 0.095823 -0.336648 0.167060
25.966667 -1.672995 -0.659034 2.811321 0.071465 -0.328686 0.219477
26.000000 -1.671310 -0.669771 2.829766 0.046956 -0.320395 0.260231
26.033333 -1.670092 -0.680418 2.836280 0.022444 -0.311857 0.285599
26.066667 -1.669346 -0.690970 2.851274 -0.001920 -0.303156 0.306522
26.100000 -1.670006 -0.700860 2.863204 -0.025998 -0.294370 0.319990
26.133333 -1.671146 -0.710646 2.867023 -0.049845 -0.285467 0.335107
26.166667 -1.673687 -0.719754 2.895788 -0.073477 -0.276454 0.345080
26.200000 -1.676716 -0.728751 2.880113 -0.096961 -0.267301 0.355268
26.233333 -1.680234 -0.737633 2.896407 -0.120320 -0.258020 0.368092
26.266667 -1.684242 -0.746399 2.901555 -0.143627 -0.248587 0.378335
26.300000 -1.689546 -0.754472 2.945655 -0.167026 -0.238931 0.388098
26.333333 -1.695343 -0.762422 2.946403 -0.190527 -0.229065 0.389477
26.366667 -1.702377 -0.769697 2.953400 -0.214274 -0.218911 0.387282
26.400000 -1.709902 -0.776847 2.980815 -0.238302 -0.208470 0.375308
26.433333 -1.717916 -0.783869 2.964336 -0.262708 -0.197699 0.357133
26.466667 -1.727126 -0.790248 3.006276 -0.287481 -0.186642 0.330352
26.500000 -1.736822 -0.796498 3.029194 -0.312622 -0.175338 0.298464
26.533333 -1.747654 -0.802149 3.032257 -0.338035 -0.163889 0.264587
26.566667 -1.758964 -0.807671 3.041001 -0.363627 -0.152393 0.229170
26.600000 -1.771373 -0.812623 3.041594 -0.389368 -0.140920 0.197287
26.633333 -1.784859 -0.817031 3.035058 -0.415179 -0.129576 0.163648
26.666667 -1.799419 -0.820916 3.041389 -0.441048 -0.118411 0.133007
26.700000 -1.815047 -0.824296 3.042982 -0.466781 -0.107575 0.105227
26.733333 -1.831120 -0.827555 3.051115 -0.492343 -0.097102 0.077036
26.766667 -1.847629 -0.830697 3.061993 -0.517631 -0.087076 0.044362
26.800000 -1.865238 -0.833389 3.053551 -0.542467 -0.077579 0.003881
26.833333 -1.883956 -0.835648 3.045568 -0.566717 -0.068652 -0.042779
26.866667 -1.903080 -0.837800 3.059124 -0.590279 -0.060310 -0.096122
26.900000 -1.923320 -0.839551 3.068262 -0.613149 -0.052504 -0.158835
26.933333 -1.944669 -0.840920 3.072465 -0.635210 -0.045248 -0.227857
26.966667 -1.966387 -0.842195 3.064707 -0.656286 -0.038563 -0.296219
27.000000 -1.989207 -0.843125 3.031876 -0.676303 -0.032445 -0.359343
27.033333 -2.012369 -0.843971 3.020671 -0.695293 -0.026862 -0.416538
27.066667 -2.035856 -0.844737 3.004914 -0.713194 -0.021822 -0.465258
27.100000 -2.060373 -0.845217 2.973141 -0.729983 -0.017332 -0.499402
27.133333 -2.085186 -0.845628 2.951325 -0.745790 -0.013354 -0.516035
27.166667 -2.110277 -0.845975 2.933044 -0.760829 -0.009836 -0.516549
27.200000 -2.136280 -0.846107 2.912629 -0.775259 -0.006747 -0.505511
27.233333 -2.162529 -0.846187 2.894837 -0.789118 -0.004103 -0.481320
27.266667 -2.189006 -0.846222 2.877478 -0.802506 -0.001917 -0.446300
27.300000 -2.215693 -0.846216 2.867667 -0.815522 -0.000210 -0.406925
27.333333 -2.243102 -0.846095 2.859398 -0.828106 0.000973 -0.367086
27.366667 -2.271167 -0.845889 2.837124 -0.840109 0.001595 -0.328568
27.400000 -2.299387 -0.845661 2.823148 -0.851433 0.001647 -0.290465
27.433333 -2.328135 -0.845414 2.823501 -0.861960 0.001144 -0.255202
27.466667 -2.357338 -0.845187 2.817685 -0.871501 0.000108 -0.222162
27.500000 -2.386926 -0.845023 2.821253 -0.879773 -0.001446 -0.190613
27.533333 -2.416819 -0.844957 2.808517 -0.886549 -0.003514 -0.157169
27.566667 -2.446944 -0.845028 2.798106 -0.891650 -0.006104 -0.121078
27.600000 -2.477218 -0.845271 2.790395 -0.894850 -0.009230 -0.078293
27.633333 -2.507553 -0.845720 2.794057 -0.895940 -0.012935 -0.025487
27.666667 -2.537880 -0.846194 2.792686 -0.894761 -0.017256 0.034518
27.700000 -2.568179 -0.846700 2.794731 -0.891199 -0.022237 0.101694
27.733333 -2.598430 -0.847241 2.782416 -0.885220 -0.027886 0.172238
27.766667 -2.628610 -0.847824 2.779501 -0.876786 -0.034213 0.243708
27.800000 -2.658389 -0.848756 2.798615 -0.865909 -0.041224 0.306634
27.833333 -2.687652 -0.850060 2.805784 -0.852640 -0.048903 0.356567
27.866667 -2.716285 -0.851755 2.831477 -0.837065 -0.057194 0.390957
27.900000 -2.744205 -0.853860 2.856868 -0.819313 -0.066002 0.407588
27.933333 -2.771956 -0.856028 2.893371 -0.799455 -0.075251 0.401480
27.966667 -2.798770 -0.858632 2.923039 -0.777743 -0.084788 0.368078
28.000000 -2.824543 -0.861684 2.928023 -0.754435 -0.094467 0.311911
28.033333 -2.849176 -0.865186 2.923451 -0.729928 -0.104114 0.227745
28.066667 -2.873574 -0.868763 2.935471 -0.704659 -0.113581 0.115088
28.100000 -2.896670 -0.872799 2.950524 -0.679179 -0.122714 -0.029425
28.133333 -2.919503 -0.876912 2.942765 -0.653959 -0.131388 -0.201006
28.166667 -2.940912 -0.881482 2.951836 -0.629276 -0.139572 -0.395738
28.200000 -2.960875 -0.886512 2.934705 -0.605318 -0.147268 -0.610844
28.233333 -2.979351 -0.891999 2.916667 -0.582092 -0.154540 -0.831991
28.266667 -2.997518 -0.897566 2.903649 -0.559485 -0.161485 -1.046294
28.300000 -3.015368 -0.903211 2.878801 -0.537100 -0.168286 -1.232594
28.333333 -3.032893 -0.908936 2.840173 -0.514705 -0.175068 -1.379466
28.366667 -3.050086 -0.914740 2.750577 -0.492043 -0.181950 -1.469295
28.400000 -3.066937 -0.920621 2.664695 -0.468826 -0.189044 -1.492144
28.433333 -3.083440 -0.926580 2.559134 -0.444741 -0.196456 -1.443842
28.466667 -3.098605 -0.932968 2.485448 -0.419636 -0.204223 -1.324701
28.500000 -3.112494 -0.939781 2.414530 -0.393606 -0.212289 -1.145971
28.533333 -3.125167 -0.947000 2.370360 -0.366702 -0.220605 -0.916467
28.566667 -3.136679 -0.954609 2.352376 -0.339131 -0.229066 -0.657225
28.600000 -3.147085 -0.962586 2.340998 -0.311255 -0.237506 -0.385587
28.633333 -3.156436 -0.970906 2.372263 -0.283588 -0.245706 -0.124312
28.666667 -3.165413 -0.979290 2.388403 -0.256497 -0.253502 0.111250
28.700000 -3.173432 -0.987959 2.404714 -0.230257 -0.260775 0.310191
28.733333 -3.180529 -0.996891 2.427616 -0.205109 -0.267421 0.466508
28.766667 -3.186754 -1.006054 2.457230 -0.181203 -0.273380 0.583412
28.800000 -3.192148 -1.015419 2.481006 -0.158601 -0.278629 0.665607
28.833333 -3.196754 -1.024966 2.507896 -0.137284 -0.283185 0.725369
28.866667 -3.200617 -1.034664 2.533429 -0.117307 -0.287032 0.771859
28.900000 -3.203790 -1.044482 2.554819 -0.098697 -0.290169 0.813555
28.933333 -3.206318 -1.054387 2.579927 -0.081448 -0.292605 0.856828
28.966667 -3.208250 -1.064354 2.608383 -0.065546 -0.294365 0.903618
29.000000 -3.209839 -1.074341 2.633628 -0.050953 -0.295481 0.954993
29.033333 -3.211093 -1.084342 2.658520 -0.037597 -0.296001 1.011526
29.066667 -3.212017 -1.094353 2.694034 -0.025340 -0.296006 1.068526
29.100000 -3.212529 -1.104326 2.735036 -0.014059 -0.295570 1.121638
29.133333 -3.212672 -1.114240 2.779434 -0.003655 -0.294730 1.165243
29.166667 -3.212486 -1.124075 2.812831 0.005976 -0.293516 1.197627
29.200000 -3.212011 -1.133813 2.869074 0.014892 -0.291934 1.214193
29.233333 -3.211243 -1.143534 2.911537 0.023123 -0.289972 1.209088
29.266667 -3.210187 -1.153235 2.968613 0.030633 -0.287571 1.182171
29.300000 -3.208852 -1.162910 3.003751 0.037401 -0.284676 1.135813
29.333333 -3.207354 -1.172453 3.046583 0.043427 -0.281262 1.072157
29.366667 -3.205593 -1.181960 3.094170 0.048658 -0.277265 0.991294
29.400000 -3.203576 -1.191427 3.125696 0.053065 -0.272636 0.898693
29.433333 -3.201471 -1.200751 -3.135174 0.056628 -0.267333 0.799107
29.466667 -3.199453 -1.209620 -3.106885 0.059419 -0.261412 0.696494
29.500000 -3.197203 -1.218434 -3.092077 0.061490 -0.254925 0.593156
29.533333 -3.195080 -1.226799 -3.076443 0.062935 -0.247968 0.492486
29.566667 -3.192741 -1.235102 -3.065332 0.063908 -0.240700 0.399325
29.600000 -3.190559 -1.242970 -3.048643 0.064626 -0.233338 0.314520
29.633333 -3.188176 -1.250769 -3.043486 0.065281 -0.226085 0.239472
29.666667 -3.185970 -1.258150 -3.039140 0.065985 -0.219054 0.175084
29.700000 -3.183946 -1.265122 -3.034310 0.066880 -0.212386 0.120734
29.733333 -3.182103 -1.271695 -3.035965 0.068034 -0.206148 0.077142
29.766667 -3.180086 -1.278189 -3.042016 0.069459 -0.200362 0.041431
29.800000 -3.177900 -1.284601 -3.043005 0.071053 -0.194946 0.014824
29.833333 -3.175552 -1.290930 -3.041863 0.072727 -0.189828 -0.003868
29.866667 -3.173048 -1.297174 -3.046366 0.074385 -0.184934 -0.014763
29.900000 -3.170395 -1.303331 -3.044093 0.075870 -0.180133 -0.019268
29.933333 -3.167598 -1.309399 -3.042977 0.077044 -0.175306 -0.020096
29.966667 -3.164665 -1.315377 -3.046413 0.077813 -0.170365 -0.015997
30.000000 -3.161907 -1.321044 -3.049379 0.078172 -0.165290 -0.010777
30.033333 -3.159026 -1.326617 -3.049383 0.078091 -0.160051 -0.004230
30.066667 -3.156318 -1.331903 -3.044176 0.077621 -0.154672 -0.000088
30.100000 -3.153784 -1.336907 -3.059672 0.076863 -0.149219 0.004472
30.133333 -3.151422 -1.341641 -3.043950 0.075950 -0.143784 0.009341
30.166667 -3.148958 -1.346278 -3.045890 0.074991 -0.138443 0.012669
30.200000 -3.146664 -1.350661 -3.037156 0.074080 -0.133254 0.014711
30.233333 -3.144278 -1.354945 -3.047782 0.073352 -0.128295 0.015001
