t x y theta dxdt dydt dthetadt
0.000000 0.000000 0.000000 -2.956110 -0.153201 0.014457 -0.024269
0.033333 -0.005186 0.000514 -2.955514 -0.157622 0.014854 -0.022682
0.066667 -0.010514 0.001034 -2.957831 -0.162099 0.015238 -0.039559
0.100000 -0.015985 0.001558 -2.950806 -0.166637 0.015615 -0.083327
0.133333 -0.021600 0.002085 -2.943074 -0.171242 0.015986 -0.164587
0.166667 -0.027361 0.002614 -2.933553 -0.175916 0.016352 -0.286777
0.200000 -0.033267 0.003146 -2.943147 -0.180662 0.016712 -0.442459
0.233333 -0.039348 0.003705 -2.948959 -0.185485 0.017065 -0.613256
0.266667 -0.045576 0.004265 -2.945067 -0.190390 0.017408 -0.794882
0.300000 -0.051984 0.004851 -2.947088 -0.195382 0.017736 -0.975470
0.333333 -0.058572 0.005462 -3.009598 -0.200465 0.018040 -1.129705
0.366667 -0.065345 0.006097 -3.114631 -0.205640 0.018311 -1.235423
0.400000 -0.072268 0.006728 3.136830 -0.210908 0.018536 -1.278860
0.433333 -0.079372 0.007370 3.080539 -0.216271 0.018706 -1.256573
0.466667 -0.086629 0.008007 2.998432 -0.221723 0.018808 -1.158290
0.500000 -0.094074 0.008649 2.934876 -0.227251 0.018834 -0.984401
0.533333 -0.101712 0.009294 2.851677 -0.232851 0.018781 -0.747083
0.566667 -0.109549 0.009938 2.820985 -0.238518 0.018646 -0.469004
0.600000 -0.117591 0.010578 2.828926 -0.244242 0.018429 -0.170860
0.633333 -0.125842 0.011210 2.840403 -0.250009 0.018132 0.130585
0.666667 -0.134246 0.011831 2.872448 -0.255813 0.017753 0.408420
0.700000 -0.142866 0.012435 2.898158 -0.261652 0.017292 0.649363
0.733333 -0.151702 0.013020 2.960975 -0.267517 0.016751 0.834716
0.766667 -0.160756 0.013579 3.001863 -0.273396 0.016131 0.963276
0.800000 -0.169963 0.014124 3.080509 -0.279283 0.015436 1.034174
0.833333 -0.179323 0.014653 3.102615 -0.285176 0.014668 1.053327
0.866667 -0.188896 0.015145 -3.130963 -0.291055 0.013838 1.033755
0.900000 -0.198688 0.015607 -3.099106 -0.296905 0.012953 0.981360
0.933333 -0.208696 0.016033 -3.076836 -0.302709 0.012022 0.917394
0.966667 -0.218917 0.016423 -3.047273 -0.308456 0.011051 0.848866
1.000000 -0.229347 0.016774 -3.020707 -0.314121 0.010052 0.788319
1.033333 -0.239926 0.017103 -2.996573 -0.319681 0.009035 0.731823
1.066667 -0.250705 0.017390 -2.987043 -0.325127 0.008003 0.682182
1.100000 -0.261679 0.017634 -2.966266 -0.330457 0.006960 0.641029
1.133333 -0.272842 0.017834 -2.963916 -0.335672 0.005907 0.602968
1.166667 -0.284152 0.018009 -2.931817 -0.340781 0.004846 0.568563
1.200000 -0.295606 0.018159 -2.897673 -0.345810 0.003770 0.533417
1.233333 -0.307204 0.018283 -2.883811 -0.350784 0.002673 0.505390
1.266667 -0.318978 0.018362 -2.845901 -0.355726 0.001552 0.480788
1.300000 -0.330929 0.018395 -2.834997 -0.360649 0.000405 0.460185
1.333333 -0.343020 0.018400 -2.824847 -0.365567 -0.000770 0.441247
1.366667 -0.355249 0.018377 -2.845958 -0.370482 -0.001974 0.424851
1.400000 -0.367661 0.018304 -2.828236 -0.375383 -0.003199 0.410048
1.433333 -0.380253 0.018182 -2.822272 -0.380252 -0.004439 0.390747
1.466667 -0.393027 0.018011 -2.800112 -0.385070 -0.005684 0.365170
1.500000 -0.405979 0.017792 -2.778452 -0.389817 -0.006927 0.327983
1.533333 -0.419107 0.017525 -2.753597 -0.394467 -0.008161 0.275481
1.566667 -0.432365 0.017226 -2.745915 -0.398995 -0.009375 0.198659
1.600000 -0.445789 0.016882 -2.720474 -0.403388 -0.010566 0.086955
1.633333 -0.459339 0.016505 -2.714321 -0.407636 -0.011734 -0.060686
1.666667 -0.473042 0.016086 -2.708184 -0.411733 -0.012878 -0.241263
1.700000 -0.486867 0.015634 -2.720996 -0.415681 -0.014001 -0.447156
1.733333 -0.500814 0.015147 -2.716841 -0.419485 -0.015111 -0.668168
1.766667 -0.514879 0.014627 -2.751062 -0.423152 -0.016213 -0.886298
1.800000 -0.529071 0.014069 -2.783380 -0.426691 -0.017317 -1.074239
1.833333 -0.543377 0.013476 -2.820406 -0.430106 -0.018430 -1.215305
1.866667 -0.557796 0.012847 -2.867866 -0.433400 -0.019561 -1.297927
1.900000 -0.572326 0.012182 -2.941198 -0.436574 -0.020715 -1.315170
1.933333 -0.586955 0.011479 -3.060338 -0.439629 -0.021897 -1.257275
1.966667 -0.601693 0.010740 -3.141041 -0.442559 -0.023115 -1.131015
2.000000 -0.616519 0.009959 3.087803 -0.445360 -0.024371 -0.950460
2.033333 -0.631449 0.009142 3.053819 -0.448022 -0.025671 -0.731717
2.066667 -0.646448 0.008272 3.039710 -0.450535 -0.027018 -0.487649
2.100000 -0.661548 0.007364 3.051182 -0.452892 -0.028415 -0.235703
2.133333 -0.676707 0.006399 3.070946 -0.455090 -0.029859 -0.002181
2.166667 -0.691962 0.005396 3.100631 -0.457130 -0.031347 0.201291
2.200000 -0.707264 0.004331 3.125517 -0.459011 -0.032874 0.367771
2.233333 -0.722659 0.003227 -3.131429 -0.460742 -0.034432 0.502398
2.266667 -0.738098 0.002065 -3.097684 -0.462332 -0.036012 0.610403
2.300000 -0.753571 0.000843 -3.087262 -0.463794 -0.037604 0.706225
2.333333 -0.769073 -0.000441 -3.061696 -0.465127 -0.039200 0.809024
2.366667 -0.784595 -0.001787 -3.068689 -0.466343 -0.040792 0.939073
2.400000 -0.800131 -0.003195 -3.031978 -0.467461 -0.042370 1.109749
2.433333 -0.815752 -0.004641 -3.009557 -0.468489 -0.043926 1.324926
2.466667 -0.831455 -0.006124 -2.981393 -0.469443 -0.045453 1.579265
2.500000 -0.847148 -0.007669 -2.954649 -0.470341 -0.046948 1.860730
2.533333 -0.862823 -0.009274 -2.905336 -0.471208 -0.048403 2.151544
2.566667 -0.878578 -0.010916 -2.830179 -0.472042 -0.049817 2.422265
2.600000 -0.894303 -0.012615 -2.704336 -0.472855 -0.051190 2.638970
2.633333 -0.910106 -0.014350 -2.598343 -0.473657 -0.052521 2.772972
2.666667 -0.925868 -0.016138 -2.478922 -0.474465 -0.053808 2.800905
2.700000 -0.941706 -0.017961 -2.339672 -0.475275 -0.055050 2.699561
2.733333 -0.957500 -0.019832 -2.173470 -0.476081 -0.056246 2.451609
2.766667 -0.973368 -0.021738 -2.033726 -0.476904 -0.057392 2.045493
2.800000 -0.989310 -0.023679 -1.936245 -0.477742 -0.058490 1.490125
2.833333 -1.005325 -0.025655 -1.873742 -0.478592 -0.059538 0.791001
2.866667 -1.021296 -0.027667 -1.858456 -0.479443 -0.060538 -0.032561
2.900000 -1.037224 -0.029711 -1.841156 -0.480319 -0.061494 -0.950990
2.933333 -1.053224 -0.031788 -1.887851 -0.481230 -0.062411 -1.916151
2.966667 -1.069296 -0.033898 -1.940370 -0.482170 -0.063293 -2.878346
3.000000 -1.085439 -0.036040 -2.054800 -0.483139 -0.064143 -3.791143
3.033333 -1.101544 -0.038198 -2.218095 -0.484141 -0.064963 -4.595923
3.066667 -1.117611 -0.040367 -2.421791 -0.485168 -0.065756 -5.245826
3.100000 -1.133749 -0.042567 -2.682656 -0.486186 -0.066524 -5.697963
3.133333 -1.149959 -0.044797 -2.952801 -0.487180 -0.067267 -5.939104
3.166667 -1.166240 -0.047058 3.024478 -0.488153 -0.067989 -5.951221
3.200000 -1.182592 -0.049348 2.734567 -0.489099 -0.068696 -5.735116
3.233333 -1.199016 -0.051667 2.465889 -0.490004 -0.069390 -5.312786
3.266667 -1.215401 -0.053998 2.291015 -0.490872 -0.070076 -4.720125
3.300000 -1.231751 -0.056342 2.091523 -0.491716 -0.070760 -3.998130
3.333333 -1.248174 -0.058713 1.971570 -0.492542 -0.071445 -3.186644
3.366667 -1.264569 -0.061099 1.933383 -0.493353 -0.072137 -2.343253
3.400000 -1.280943 -0.063504 1.915479 -0.494171 -0.072841 -1.520908
3.433333 -1.297390 -0.065934 1.899863 -0.495032 -0.073561 -0.762672
3.466667 -1.313912 -0.068389 1.902013 -0.495949 -0.074299 -0.089298
3.500000 -1.330508 -0.070870 1.919111 -0.496926 -0.075057 0.478168
3.533333 -1.347093 -0.073380 1.976166 -0.497972 -0.075836 0.930275
3.566667 -1.363666 -0.075923 2.062126 -0.499083 -0.076632 1.275632
3.600000 -1.380317 -0.078489 2.133326 -0.500247 -0.077442 1.532196
3.633333 -1.396959 -0.081090 2.218343 -0.501448 -0.078262 1.716083
3.666667 -1.413681 -0.083713 2.293034 -0.502688 -0.079085 1.836541
3.700000 -1.430482 -0.086357 2.356801 -0.503982 -0.079908 1.903981
3.733333 -1.447288 -0.089036 2.402938 -0.505347 -0.080723 1.935011
3.766667 -1.464176 -0.091734 2.454738 -0.506789 -0.081525 1.941578
3.800000 -1.481083 -0.094466 2.514207 -0.508323 -0.082313 1.932523
3.833333 -1.498012 -0.097232 2.602516 -0.509960 -0.083080 1.919193
3.866667 -1.514970 -0.100031 2.663167 -0.511712 -0.083826 1.910639
3.900000 -1.532013 -0.102847 2.733329 -0.513586 -0.084548 1.916320
3.933333 -1.549144 -0.105680 2.801120 -0.515580 -0.085250 1.932101
3.966667 -1.566317 -0.108547 2.859740 -0.517709 -0.085929 1.950992
4.000000 -1.583580 -0.111429 2.913953 -0.519978 -0.086586 1.962471
4.033333 -1.600933 -0.114325 2.960579 -0.522394 -0.087224 1.954508
4.066667 -1.618378 -0.117235 3.018562 -0.524952 -0.087848 1.917105
4.100000 -1.635887 -0.120178 3.080173 -0.527650 -0.088459 1.838598
4.133333 -1.653490 -0.123133 -3.108328 -0.530493 -0.089056 1.713588
4.166667 -1.671184 -0.126114 -3.004033 -0.533478 -0.089642 1.538799
4.200000 -1.688979 -0.129121 -2.933075 -0.536608 -0.090214 1.318133
4.233333 -1.706871 -0.132138 -2.854891 -0.539889 -0.090767 1.058443
4.266667 -1.724887 -0.135182 -2.816609 -0.543341 -0.091296 0.767839
4.300000 -1.743001 -0.138233 -2.806451 -0.546980 -0.091799 0.459896
4.333333 -1.761262 -0.141311 -2.804683 -0.550815 -0.092271 0.151865
4.366667 -1.779681 -0.144415 -2.844027 -0.554854 -0.092707 -0.133796
4.400000 -1.798201 -0.147524 -2.864940 -0.559092 -0.093104 -0.385786
4.433333 -1.816823 -0.150636 -2.910100 -0.563523 -0.093457 -0.589777
4.466667 -1.835634 -0.153769 -2.951074 -0.568114 -0.093764 -0.734720
4.500000 -1.854548 -0.156903 -2.992835 -0.572848 -0.094020 -0.815604
4.533333 -1.873670 -0.160052 -3.015148 -0.577692 -0.094222 -0.830887
4.566667 -1.893011 -0.163212 -3.042650 -0.582610 -0.094370 -0.791720
4.600000 -1.912578 -0.166381 -3.075164 -0.587568 -0.094462 -0.698084
4.633333 -1.932249 -0.169546 -3.123653 -0.592514 -0.094497 -0.558643
4.666667 -1.952161 -0.172712 3.126495 -0.597423 -0.094473 -0.385136
4.700000 -1.972177 -0.175873 3.112993 -0.602244 -0.094391 -0.187721
4.733333 -1.992295 -0.179028 3.093607 -0.606950 -0.094251 0.020863
4.766667 -2.012657 -0.182179 3.094978 -0.611531 -0.094052 0.232619
4.800000 -2.033120 -0.185322 3.123892 -0.616008 -0.093794 0.428158
4.833333 -2.053827 -0.188455 3.131738 -0.620400 -0.093476 0.594644
4.866667 -2.074635 -0.191577 -3.089202 -0.624721 -0.093100 0.717863
4.900000 -2.095541 -0.194688 -3.052779 -0.629004 -0.092666 0.787420
4.933333 -2.116545 -0.197786 -2.988731 -0.633277 -0.092174 0.791974
4.966667 -2.137645 -0.200870 -2.942457 -0.637557 -0.091625 0.729947
5.000000 -2.158989 -0.203923 -2.905782 -0.641814 -0.091024 0.613059
5.033333 -2.180426 -0.206961 -2.883310 -0.646054 -0.090377 0.450131
5.066667 -2.201955 -0.209981 -2.851655 -0.650296 -0.089685 0.264017
5.100000 -2.223716 -0.212966 -2.844237 -0.654534 -0.088956 0.078458
5.133333 -2.245704 -0.215914 -2.856395 -0.658750 -0.088198 -0.080063
5.166667 -2.267780 -0.218842 -2.859575 -0.662927 -0.087416 -0.195007
5.200000 -2.289940 -0.221749 -2.898386 -0.667084 -0.086614 -0.258056
5.233333 -2.312317 -0.224619 -2.964334 -0.671204 -0.085796 -0.259299
5.266667 -2.334774 -0.227465 -3.018874 -0.675258 -0.084967 -0.200957
5.300000 -2.357310 -0.230287 -3.043360 -0.679238 -0.084129 -0.094293
5.333333 -2.379922 -0.233084 -3.044749 -0.683170 -0.083280 0.050490
5.366667 -2.402738 -0.235849 -3.033235 -0.687074 -0.082421 0.221343
5.400000 -2.425755 -0.238584 -2.999164 -0.690958 -0.081552 0.405692
5.433333 -2.448967 -0.241290 -2.947581 -0.694837 -0.080669 0.584703
5.466667 -2.472244 -0.243967 -2.930141 -0.698721 -0.079769 0.748024
5.500000 -2.495582 -0.246613 -2.882432 -0.702607 -0.078850 0.889809
5.533333 -2.518980 -0.249229 -2.856467 -0.706465 -0.077907 1.005205
5.566667 -2.542546 -0.251816 -2.814394 -0.710264 -0.076939 1.092118
5.600000 -2.566274 -0.254372 -2.789684 -0.713973 -0.075941 1.152617
5.633333 -2.590156 -0.256897 -2.758627 -0.717555 -0.074910 1.193945
5.666667 -2.614184 -0.259388 -2.704667 -0.720980 -0.073843 1.213032
5.700000 -2.638351 -0.261843 -2.665213 -0.724209 -0.072736 1.211748
5.733333 -2.662646 -0.264260 -2.614406 -0.727211 -0.071587 1.187526
5.766667 -2.687062 -0.266636 -2.561828 -0.729949 -0.070393 1.140010
5.800000 -2.711506 -0.268974 -2.512538 -0.732406 -0.069154 1.067428
5.833333 -2.736053 -0.271266 -2.468051 -0.734574 -0.067869 0.963747
5.866667 -2.760618 -0.273518 -2.419228 -0.736456 -0.066538 0.838661
5.900000 -2.785270 -0.275720 -2.397275 -0.738062 -0.065164 0.689435
5.933333 -2.809931 -0.277880 -2.379073 -0.739411 -0.063753 0.519530
5.966667 -2.834597 -0.279998 -2.367105 -0.740536 -0.062305 0.341135
6.000000 -2.859323 -0.282061 -2.365551 -0.741449 -0.060828 0.163126
6.033333 -2.884102 -0.284068 -2.365630 -0.742163 -0.059326 0.005921
6.066667 -2.908924 -0.286017 -2.355263 -0.742677 -0.057807 -0.132319
6.100000 -2.933730 -0.287921 -2.375136 -0.742995 -0.056274 -0.229944
6.133333 -2.958565 -0.289768 -2.376878 -0.743110 -0.054732 -0.277488
6.166667 -2.983373 -0.291568 -2.443938 -0.743006 -0.053186 -0.270778
6.200000 -3.008196 -0.293311 -2.415460 -0.742671 -0.051639 -0.214674
6.233333 -3.032983 -0.295006 -2.502165 -0.742097 -0.050093 -0.113538
6.266667 -3.057773 -0.296648 -2.546184 -0.741287 -0.048546 0.036327
6.300000 -3.082514 -0.298240 -2.512712 -0.740239 -0.046998 0.215017
6.333333 -3.107246 -0.299783 -2.500221 -0.738959 -0.045445 0.416057
6.366667 -3.131919 -0.301275 -2.459276 -0.737453 -0.043884 0.615911
6.400000 -3.156527 -0.302716 -2.459262 -0.735736 -0.042307 0.814378
6.433333 -3.181066 -0.304104 -2.397114 -0.733815 -0.040711 0.989948
6.466667 -3.205529 -0.305440 -2.369279 -0.731700 -0.039086 1.132271
6.500000 -3.229910 -0.306722 -2.270795 -0.729402 -0.037421 1.234589
6.533333 -3.254205 -0.307950 -2.227724 -0.726931 -0.035709 1.288303
6.566667 -3.278439 -0.309124 -2.173198 -0.724298 -0.033939 1.296917
6.600000 -3.302574 -0.310242 -2.173198 -0.721505 -0.032102 1.256665
6.633333 -3.326605 -0.311305 -2.105875 -0.718555 -0.030192 1.174026
6.666667 -3.350547 -0.312299 -2.049702 -0.715442 -0.028206 1.051161
6.700000 -3.374373 -0.313238 -1.981628 -0.712161 -0.026148 0.899358
6.733333 -3.398094 -0.314101 -1.965767 -0.708700 -0.024022 0.726979
6.766667 -3.421705 -0.314885 -1.920281 -0.705053 -0.021834 0.542591
6.800000 -3.445196 -0.315587 -1.918279 -0.701213 -0.019595 0.351829
6.833333 -3.468557 -0.316203 -1.915208 -0.697175 -0.017321 0.167349
6.866667 -3.491782 -0.316731 -1.917533 -0.692936 -0.015025 0.003783
6.900000 -3.514856 -0.317201 -1.932234 -0.688496 -0.012717 -0.128000
6.933333 -3.537778 -0.317579 -1.960350 -0.683857 -0.010409 -0.220617
6.966667 -3.560539 -0.317864 -1.989810 -0.679024 -0.008116 -0.261153
7.000000 -3.583132 -0.318091 -2.003396 -0.674003 -0.005846 -0.244979
7.033333 -3.605553 -0.318260 -2.024558 -0.668801 -0.003603 -0.169345
7.066667 -3.627795 -0.318339 -2.042810 -0.663427 -0.001394 -0.043402
7.100000 -3.649854 -0.318332 -2.060118 -0.657887 0.000775 0.125483
7.133333 -3.671723 -0.318266 -2.062562 -0.652187 0.002901 0.326579
7.166667 -3.693400 -0.318120 -2.084525 -0.646331 0.004984 0.544389
7.200000 -3.714880 -0.317900 -2.024962 -0.640320 0.007019 0.765051
7.233333 -3.736154 -0.317622 -1.992285 -0.634154 0.009004 0.972977
7.266667 -3.757224 -0.317275 -1.954633 -0.627829 0.010936 1.158127
7.300000 -3.778085 -0.316862 -1.885466 -0.621341 0.012817 1.306406
7.333333 -3.798723 -0.316393 -1.824291 -0.614687 0.014649 1.413328
7.366667 -3.819140 -0.315863 -1.765740 -0.607863 0.016434 1.469181
7.400000 -3.839329 -0.315277 -1.700269 -0.600866 0.018178 1.475805
7.433333 -3.859286 -0.314636 -1.621984 -0.593693 0.019886 1.432841
7.466667 -3.879000 -0.313941 -1.587546 -0.586346 0.021565 1.344392
7.500000 -3.898464 -0.313190 -1.535433 -0.578825 0.023219 1.217787
7.533333 -3.917674 -0.312383 -1.488248 -0.571135 0.024855 1.057765
7.566667 -3.936619 -0.311526 -1.458170 -0.563278 0.026475 0.877694
7.600000 -3.955295 -0.310617 -1.435422 -0.555257 0.028082 0.687699
7.633333 -3.973701 -0.309653 -1.391612 -0.547072 0.029681 0.497100
7.666667 -3.991831 -0.308636 -1.376254 -0.538718 0.031272 0.313705
7.700000 -4.009682 -0.307566 -1.384734 -0.530186 0.032856 0.145759
7.733333 -4.027248 -0.306442 -1.396679 -0.521469 0.034436 0.004177
7.766667 -4.044524 -0.305266 -1.407640 -0.512554 0.036011 -0.107186
7.800000 -4.061507 -0.304038 -1.437491 -0.503434 0.037581 -0.188890
7.833333 -4.078191 -0.302759 -1.443723 -0.494102 0.039145 -0.235599
7.866667 -4.094571 -0.301428 -1.468188 -0.484563 0.040701 -0.246573
7.900000 -4.110645 -0.300047 -1.485847 -0.474826 0.042248 -0.223674
7.933333 -4.126370 -0.298611 -1.484046 -0.464907 0.043781 -0.176389
7.966667 -4.141741 -0.297122 -1.504281 -0.454815 0.045300 -0.107045
8.000000 -4.156750 -0.295581 -1.508916 -0.444574 0.046802 -0.018889
8.033333 -4.171388 -0.293988 -1.509764 -0.434196 0.048285 0.080704
8.066667 -4.185698 -0.292347 -1.488244 -0.423688 0.049746 0.186302
8.100000 -4.199676 -0.290659 -1.481356 -0.413039 0.051186 0.291333
8.133333 -4.213260 -0.288922 -1.482434 -0.402242 0.052604 0.394551
8.166667 -4.226505 -0.287140 -1.463458 -0.391285 0.054000 0.486827
8.200000 -4.239408 -0.285312 -1.454755 -0.380134 0.055376 0.563521
8.233333 -4.251966 -0.283440 -1.421131 -0.368767 0.056737 0.618470
8.266667 -4.264176 -0.281524 -1.394603 -0.357171 0.058082 0.648099
8.300000 -4.275954 -0.279563 -1.359333 -0.345353 0.059414 0.651191
8.333333 -4.287377 -0.277561 -1.324423 -0.333307 0.060735 0.625629
8.366667 -4.298353 -0.275514 -1.299333 -0.321042 0.062047 0.577424
8.400000 -4.308876 -0.273423 -1.256655 -0.308582 0.063350 0.507885
8.433333 -4.318937 -0.271286 -1.233700 -0.295945 0.064644 0.426320
8.466667 -4.328634 -0.269110 -1.233727 -0.283140 0.065933 0.340455
8.500000 -4.337856 -0.266887 -1.231168 -0.270184 0.067214 0.256582
8.533333 -4.346597 -0.264618 -1.227799 -0.257098 0.068489 0.184125
8.566667 -4.354969 -0.262312 -1.241487 -0.243884 0.069757 0.125739
8.600000 -4.362970 -0.259969 -1.248690 -0.230529 0.071018 0.088285
8.633333 -4.370469 -0.257580 -1.247179 -0.217025 0.072273 0.070565
8.666667 -4.377596 -0.255155 -1.260303 -0.203364 0.073520 0.070978
8.700000 -4.384206 -0.252683 -1.251419 -0.189510 0.074762 0.087341
8.733333 -4.390291 -0.250164 -1.243235 -0.175432 0.075999 0.110593
8.766667 -4.395845 -0.247599 -1.229162 -0.161139 0.077230 0.133215
8.800000 -4.401025 -0.245002 -1.225080 -0.146650 0.078451 0.145047
8.833333 -4.405832 -0.242375 -1.230617 -0.131991 0.079660 0.138321
8.866667 -4.410089 -0.239702 -1.211280 -0.117202 0.080852 0.102074
8.900000 -4.413789 -0.236984 -1.209092 -0.102358 0.082020 0.027439
8.933333 -4.416926 -0.234221 -1.197617 -0.087556 0.083155 -0.086250
8.966667 -4.419495 -0.231414 -1.180950 -0.072850 0.084253 -0.234340
9.000000 -4.421696 -0.228583 -1.171321 -0.058314 0.085307 -0.409267
9.033333 -4.423321 -0.225708 -1.171068 -0.044034 0.086309 -0.598206
9.066667 -4.424370 -0.222792 -1.191658 -0.030083 0.087254 -0.777282
9.100000 -4.425058 -0.219854 -1.219840 -0.016498 0.088138 -0.916240
9.133333 -4.425172 -0.216877 -1.265842 -0.003281 0.088964 -0.990983
9.166667 -4.424929 -0.213881 -1.325384 0.009553 0.089730 -0.982246
9.200000 -4.424334 -0.210866 -1.396217 0.022020 0.090438 -0.872959
9.233333 -4.423388 -0.207835 -1.509595 0.034174 0.091096 -0.654389
9.266667 -4.422096 -0.204787 -1.579635 0.046088 0.091711 -0.334796
9.300000 -4.420254 -0.201705 -1.607502 0.057803 0.092287 0.064496
9.333333 -4.418073 -0.198609 -1.625970 0.069350 0.092827 0.517612
9.366667 -4.415557 -0.195501 -1.594966 0.080771 0.093335 0.992133
9.400000 -4.412710 -0.192382 -1.532165 0.092096 0.093809 1.448957
9.433333 -4.409536 -0.189253 -1.419787 0.103336 0.094251 1.845219
9.466667 -4.405847 -0.186092 -1.310857 0.114467 0.094653 2.151575
9.500000 -4.401841 -0.182923 -1.186070 0.125502 0.095016 2.343652
9.533333 -4.397336 -0.179726 -1.058143 0.136449 0.095335 2.407819
9.566667 -4.392523 -0.176525 -0.951227 0.147286 0.095607 2.342129
9.600000 -4.387407 -0.173320 -0.863439 0.157978 0.095826 2.159641
9.633333 -4.381993 -0.170113 -0.750509 0.168504 0.095988 1.884665
9.666667 -4.376288 -0.166905 -0.688086 0.178883 0.096089 1.543213
9.700000 -4.370119 -0.163688 -0.632930 0.189105 0.096125 1.167148
9.733333 -4.363494 -0.160465 -0.613741 0.199159 0.096094 0.786201
9.766667 -4.356595 -0.157245 -0.605882 0.209060 0.095993 0.427946
9.800000 -4.349427 -0.154030 -0.616840 0.218847 0.095817 0.112008
9.833333 -4.341997 -0.150820 -0.643478 0.228540 0.095564 -0.143107
9.866667 -4.334148 -0.147623 -0.672288 0.238112 0.095232 -0.327607
9.900000 -4.326049 -0.144434 -0.724752 0.247567 0.094817 -0.435026
9.933333 -4.317708 -0.141255 -0.766238 0.256920 0.094320 -0.464791
9.966667 -4.308985 -0.138100 -0.790929 0.266158 0.093742 -0.426085
10.000000 -4.299890 -0.134971 -0.813953 0.275244 0.093087 -0.332054
10.033333 -4.290573 -0.131855 -0.820092 0.284135 0.092361 -0.203847
10.066667 -4.280914 -0.128771 -0.838505 0.292823 0.091567 -0.059796
10.100000 -4.270927 -0.125721 -0.842666 0.301258 0.090711 0.073259
10.133333 -4.260626 -0.122706 -0.833052 0.309379 0.089800 0.174389
10.166667 -4.250026 -0.119729 -0.808353 0.317137 0.088842 0.233524
10.200000 -4.239244 -0.116771 -0.770658 0.324506 0.087842 0.245031
10.233333 -4.228190 -0.113855 -0.716691 0.331460 0.086809 0.210779
10.266667 -4.216970 -0.110959 -0.669769 0.337971 0.085748 0.129766
10.300000 -4.205506 -0.108112 -0.669325 0.344035 0.084667 0.018441
10.333333 -4.193812 -0.105314 -0.679682 0.349659 0.083567 -0.110257
10.366667 -4.181977 -0.102541 -0.699303 0.354854 0.082454 -0.244696
10.400000 -4.169941 -0.099822 -0.719259 0.359623 0.081333 -0.370723
10.433333 -4.157783 -0.097129 -0.771329 0.363984 0.080206 -0.475813
10.466667 -4.145511 -0.094463 -0.798445 0.367944 0.079076 -0.543671
10.500000 -4.133084 -0.091855 -0.832313 0.371512 0.077948 -0.574738
10.533333 -4.120561 -0.089275 -0.857433 0.374696 0.076821 -0.568359
10.566667 -4.107952 -0.086725 -0.859348 0.377501 0.075692 -0.528544
10.600000 -4.095234 -0.084232 -0.894033 0.379936 0.074558 -0.463129
10.633333 -4.082448 -0.081769 -0.898456 0.381999 0.073417 -0.384456
10.666667 -4.069602 -0.079339 -0.915422 0.383689 0.072267 -0.301853
10.700000 -4.056706 -0.076941 -0.937705 0.385006 0.071103 -0.218390
10.733333 -4.043770 -0.074577 -0.926150 0.385943 0.069925 -0.139843
10.766667 -4.030804 -0.072262 -0.926185 0.386494 0.068737 -0.065411
10.800000 -4.017815 -0.069982 -0.919430 0.386650 0.067540 0.003960
10.833333 -4.004826 -0.067748 -0.920423 0.386412 0.066335 0.073078
10.866667 -3.991852 -0.065559 -0.914167 0.385782 0.065126 0.141608
10.900000 -3.978911 -0.063413 -0.910961 0.384762 0.063917 0.209773
10.933333 -3.966017 -0.061308 -0.913842 0.383357 0.062712 0.283877
10.966667 -3.953185 -0.059244 -0.906401 0.381577 0.061513 0.362570
11.000000 -3.940432 -0.057218 -0.885980 0.379441 0.060322 0.443222
11.033333 -3.927719 -0.055231 -0.874483 0.376965 0.059137 0.517912
11.066667 -3.915115 -0.053281 -0.862860 0.374167 0.057958 0.579134
11.100000 -3.902633 -0.051367 -0.840386 0.371068 0.056778 0.615216
11.133333 -3.890285 -0.049490 -0.812902 0.367694 0.055593 0.609576
11.166667 -3.878013 -0.047653 -0.784474 0.364077 0.054397 0.551266
11.200000 -3.865901 -0.045853 -0.741365 0.360231 0.053184 0.436735
11.233333 -3.853881 -0.044096 -0.700787 0.356173 0.051951 0.267690
11.266667 -3.842040 -0.042377 -0.659260 0.351914 0.050692 0.048994
11.300000 -3.830389 -0.040701 -0.628128 0.347459 0.049403 -0.204520
11.333333 -3.818853 -0.039068 -0.629597 0.342781 0.048080 -0.472979
11.366667 -3.807439 -0.037478 -0.666197 0.337845 0.046717 -0.736731
11.400000 -3.796243 -0.035938 -0.708296 0.332626 0.045311 -0.978143
11.433333 -3.785185 -0.034443 -0.784952 0.327103 0.043861 -1.179768
11.466667 -3.774273 -0.032993 -0.867694 0.321255 0.042367 -1.325995
11.500000 -3.763514 -0.031588 -0.945757 0.315075 0.040832 -1.408832
11.533333 -3.753016 -0.030241 -1.009795 0.308576 0.039261 -1.431845
11.566667 -3.742686 -0.028941 -1.074317 0.301794 0.037661 -1.398419
11.600000 -3.732642 -0.027703 -1.118748 0.294756 0.036041 -1.317036
11.633333 -3.722896 -0.026527 -1.145251 0.287488 0.034405 -1.204678
11.666667 -3.713461 -0.025416 -1.173105 0.280006 0.032757 -1.077555
11.700000 -3.704349 -0.024371 -1.210537 0.272335 0.031100 -0.952566
11.733333 -3.695438 -0.023372 -1.233471 0.264499 0.029437 -0.834308
11.766667 -3.686733 -0.022420 -1.262851 0.256495 0.027768 -0.731758
11.800000 -3.678241 -0.021515 -1.276466 0.248292 0.026087 -0.649929
11.833333 -3.669966 -0.020658 -1.274745 0.239851 0.024385 -0.588247
11.866667 -3.662071 -0.019870 -1.324137 0.231155 0.022660 -0.542225
11.900000 -3.654406 -0.019129 -1.324457 0.222147 0.020904 -0.511895
11.933333 -3.646975 -0.018436 -1.325174 0.212768 0.019105 -0.500788
11.966667 -3.639956 -0.017820 -1.355819 0.203004 0.017263 -0.512448
12.000000 -3.633360 -0.017282 -1.353988 0.192898 0.015385 -0.553762
12.033333 -3.627013 -0.016790 -1.376987 0.182527 0.013485 -0.621759
12.066667 -3.620920 -0.016346 -1.399433 0.171914 0.011569 -0.727240
12.100000 -3.615280 -0.015983 -1.407269 0.161131 0.009649 -0.866766
12.133333 -3.610101 -0.015702 -1.412816 0.150264 0.007740 -1.035716
12.166667 -3.605397 -0.015504 -1.459733 0.139373 0.005853 -1.218406
12.200000 -3.600961 -0.015352 -1.465041 0.128451 0.003986 -1.395629
12.233333 -3.597016 -0.015284 -1.516685 0.117495 0.002140 -1.554291
12.266667 -3.593346 -0.015260 -1.573429 0.106550 0.000321 -1.670637
12.300000 -3.589953 -0.015281 -1.667720 0.095632 -0.001469 -1.724821
12.333333 -3.586840 -0.015345 -1.776111 0.084706 -0.003236 -1.695992
12.366667 -3.584008 -0.015454 -1.856587 0.073718 -0.004994 -1.583018
12.400000 -3.581689 -0.015646 -1.950180 0.062681 -0.006738 -1.384705
12.433333 -3.579885 -0.015922 -2.033804 0.051580 -0.008473 -1.109998
12.466667 -3.578367 -0.016241 -2.096451 0.040376 -0.010206 -0.775105
12.500000 -3.577138 -0.016600 -2.103996 0.029066 -0.011939 -0.407486
12.533333 -3.576421 -0.017043 -2.107345 0.017700 -0.013659 -0.041076
12.566667 -3.575994 -0.017526 -2.068147 0.006335 -0.015356 0.298150
12.600000 -3.575858 -0.018049 -2.026241 -0.005033 -0.017028 0.582034
12.633333 -3.576227 -0.018652 -1.982617 -0.016388 -0.018670 0.790355
12.666667 -3.577093 -0.019335 -1.898956 -0.027699 -0.020273 0.907898
12.700000 -3.578251 -0.020055 -1.823488 -0.038963 -0.021835 0.934919
12.733333 -3.579701 -0.020810 -1.788590 -0.050214 -0.023358 0.875249
12.766667 -3.581630 -0.021636 -1.740392 -0.061445 -0.024840 0.740167
12.800000 -3.583849 -0.022496 -1.729105 -0.072637 -0.026275 0.550383
12.833333 -3.586357 -0.023389 -1.714551 -0.083780 -0.027661 0.323350
12.866667 -3.589323 -0.024342 -1.683894 -0.094882 -0.029001 0.084229
12.900000 -3.592742 -0.025351 -1.683894 -0.105916 -0.030292 -0.150154
12.933333 -3.596446 -0.026389 -1.724872 -0.116836 -0.031529 -0.357498
12.966667 -3.600588 -0.027479 -1.751087 -0.127637 -0.032715 -0.518424
13.000000 -3.605011 -0.028596 -1.800778 -0.138292 -0.033852 -0.621923
13.033333 -3.609852 -0.029757 -1.815975 -0.148759 -0.034935 -0.657809
13.066667 -3.615105 -0.030959 -1.859130 -0.158996 -0.035963 -0.623555
13.100000 -3.620632 -0.032186 -1.909924 -0.169001 -0.036939 -0.517891
13.133333 -3.626554 -0.033452 -1.944391 -0.178761 -0.037861 -0.351831
13.166667 -3.632742 -0.034740 -1.991897 -0.188256 -0.038729 -0.139810
13.200000 -3.639193 -0.036049 -1.999926 -0.197478 -0.039542 0.097943
13.233333 -3.645905 -0.037378 -2.001460 -0.206448 -0.040300 0.347173
13.266667 -3.652981 -0.038745 -1.964935 -0.215185 -0.041004 0.588472
13.300000 -3.660410 -0.040147 -1.917385 -0.223694 -0.041648 0.798537
13.333333 -3.668087 -0.041566 -1.843597 -0.232000 -0.042228 0.957871
13.366667 -3.676009 -0.043000 -1.790842 -0.240124 -0.042740 1.054163
13.400000 -3.684170 -0.044447 -1.747692 -0.248088 -0.043178 1.081268
13.433333 -3.692567 -0.045906 -1.695645 -0.255888 -0.043539 1.032048
13.466667 -3.701274 -0.047384 -1.629226 -0.263528 -0.043816 0.907820
13.500000 -3.710208 -0.048871 -1.603424 -0.271020 -0.044007 0.720417
13.533333 -3.719364 -0.050367 -1.561507 -0.278366 -0.044108 0.488535
13.566667 -3.728804 -0.051861 -1.536125 -0.285563 -0.044118 0.224193
13.600000 -3.738456 -0.053360 -1.521194 -0.292608 -0.044035 -0.059508
13.633333 -3.748377 -0.054844 -1.546071 -0.299498 -0.043859 -0.344626
13.666667 -3.758558 -0.056305 -1.581971 -0.306222 -0.043596 -0.612563
13.700000 -3.768935 -0.057769 -1.604105 -0.312761 -0.043257 -0.849335
13.733333 -3.779503 -0.059234 -1.658284 -0.319096 -0.042853 -1.042114
13.766667 -3.790256 -0.060699 -1.705998 -0.325217 -0.042396 -1.177914
13.800000 -3.801234 -0.062124 -1.753281 -0.331114 -0.041900 -1.242337
13.833333 -3.812430 -0.063505 -1.833179 -0.336786 -0.041374 -1.232572
13.866667 -3.823835 -0.064842 -1.887167 -0.342236 -0.040823 -1.151853
13.900000 -3.835402 -0.066174 -1.940638 -0.347470 -0.040249 -1.001898
13.933333 -3.847124 -0.067502 -2.013108 -0.352494 -0.039654 -0.791962
13.966667 -3.858997 -0.068824 -2.049111 -0.357310 -0.039037 -0.532350
14.000000 -3.871012 -0.070138 -2.067662 -0.361924 -0.038397 -0.240320
14.033333 -3.883200 -0.071411 -2.060943 -0.366336 -0.037732 0.069964
14.066667 -3.895518 -0.072674 -2.043314 -0.370546 -0.037037 0.383500
14.100000 -3.907961 -0.073928 -2.018015 -0.374553 -0.036311 0.679795
14.133333 -3.920550 -0.075142 -1.969988 -0.378354 -0.035556 0.941123
14.166667 -3.933277 -0.076319 -1.938658 -0.381943 -0.034773 1.154438
14.200000 -3.946131 -0.077457 -1.883035 -0.385312 -0.033973 1.310648
14.233333 -3.959103 -0.078558 -1.793727 -0.388453 -0.033167 1.400029
14.266667 -3.972166 -0.079645 -1.737748 -0.391354 -0.032367 1.421690
14.300000 -3.985313 -0.080719 -1.672507 -0.394005 -0.031581 1.378898
14.333333 -3.998547 -0.081752 -1.620150 -0.396400 -0.030810 1.281833
14.366667 -4.011857 -0.082746 -1.549823 -0.398531 -0.030054 1.138259
14.400000 -4.025231 -0.083723 -1.510324 -0.400396 -0.029304 0.959269
14.433333 -4.038663 -0.084684 -1.474255 -0.401990 -0.028545 0.762484
14.466667 -4.052145 -0.085628 -1.453836 -0.403308 -0.027765 0.562822
14.500000 -4.065671 -0.086554 -1.449598 -0.404345 -0.026955 0.373759
14.533333 -4.079234 -0.087462 -1.456566 -0.405101 -0.026104 0.205234
14.566667 -4.092827 -0.088351 -1.467946 -0.405575 -0.025208 0.067689
14.600000 -4.106419 -0.089190 -1.488545 -0.405760 -0.024263 -0.029406
14.633333 -4.120027 -0.090009 -1.505327 -0.405652 -0.023269 -0.082501
14.666667 -4.133612 -0.090776 -1.514483 -0.405252 -0.022233 -0.095002
14.700000 -4.147164 -0.091491 -1.506418 -0.404568 -0.021163 -0.069505
14.733333 -4.160711 -0.092186 -1.529894 -0.403595 -0.020068 -0.011517
14.766667 -4.174203 -0.092831 -1.547345 -0.402334 -0.018956 0.074272
14.800000 -4.187627 -0.093425 -1.522944 -0.400796 -0.017839 0.175072
14.833333 -4.201026 -0.093999 -1.531801 -0.398992 -0.016730 0.284267
14.866667 -4.214394 -0.094551 -1.514948 -0.396916 -0.015628 0.394486
14.900000 -4.227661 -0.095057 -1.498418 -0.394561 -0.014533 0.500684
14.933333 -4.240818 -0.095516 -1.468771 -0.391940 -0.013448 0.592335
14.966667 -4.253853 -0.095930 -1.449276 -0.389064 -0.012372 0.660066
15.000000 -4.266831 -0.096323 -1.414776 -0.385933 -0.011303 0.702381
15.033333 -4.279744 -0.096694 -1.382040 -0.382556 -0.010238 0.710334
15.066667 -4.292505 -0.097021 -1.362419 -0.378969 -0.009184 0.686220
15.100000 -4.305103 -0.097303 -1.318087 -0.375196 -0.008147 0.627322
15.133333 -4.317618 -0.097563 -1.283686 -0.371234 -0.007121 0.544354
15.166667 -4.329948 -0.097777 -1.245876 -0.367089 -0.006107 0.443193
15.200000 -4.342086 -0.097944 -1.234137 -0.362770 -0.005106 0.332816
15.233333 -4.354123 -0.098090 -1.215722 -0.358262 -0.004115 0.224988
15.266667 -4.366053 -0.098215 -1.249995 -0.353533 -0.003123 0.126888
15.300000 -4.377760 -0.098290 -1.247324 -0.348569 -0.002127 0.048630
15.333333 -4.389349 -0.098344 -1.261037 -0.343374 -0.001128 -0.008873
15.366667 -4.400814 -0.098380 -1.278576 -0.337919 -0.000122 -0.045220
15.400000 -4.412149 -0.098396 -1.285311 -0.332170 0.000901 -0.068784
15.433333 -4.423221 -0.098360 -1.294485 -0.326118 0.001942 -0.084078
15.466667 -4.434018 -0.098271 -1.302432 -0.319773 0.002998 -0.100194
15.500000 -4.444671 -0.098164 -1.289563 -0.313120 0.004072 -0.125594
15.533333 -4.455030 -0.098005 -1.276502 -0.306173 0.005161 -0.163220
15.566667 -4.465088 -0.097794 -1.264128 -0.298979 0.006253 -0.208428
15.600000 -4.474986 -0.097567 -1.259859 -0.291608 0.007333 -0.246736
15.633333 -4.484721 -0.097325 -1.244713 -0.284117 0.008388 -0.271281
15.666667 -4.494136 -0.097033 -1.268239 -0.276556 0.009406 -0.268190
15.700000 -4.503230 -0.096692 -1.314037 -0.268995 0.010371 -0.221816
15.733333 -4.512001 -0.096303 -1.370380 -0.261481 0.011274 -0.118307
15.766667 -4.520448 -0.095867 -1.395512 -0.254048 0.012106 0.044726
15.800000 -4.528711 -0.095419 -1.409147 -0.246710 0.012866 0.255136
15.833333 -4.536788 -0.094962 -1.419342 -0.239473 0.013551 0.507561
15.866667 -4.544674 -0.094495 -1.418887 -0.232329 0.014164 0.783961
15.900000 -4.552240 -0.093985 -1.382336 -0.225250 0.014711 1.057457
15.933333 -4.559609 -0.093468 -1.304825 -0.218193 0.015202 1.294321
15.966667 -4.566779 -0.092945 -1.233212 -0.211106 0.015648 1.471821
16.000000 -4.573746 -0.092416 -1.140178 -0.203950 0.016057 1.577756
16.033333 -4.580507 -0.091882 -1.056809 -0.196698 0.016433 1.597181
16.066667 -4.587060 -0.091345 -0.962331 -0.189333 0.016778 1.527023
16.100000 -4.593306 -0.090781 -0.882173 -0.181846 0.017093 1.376469
16.133333 -4.599250 -0.090193 -0.845482 -0.174252 0.017374 1.169402
16.166667 -4.604892 -0.089584 -0.791136 -0.166585 0.017610 0.924433
16.200000 -4.610316 -0.088977 -0.768351 -0.158870 0.017796 0.662354
16.233333 -4.615447 -0.088358 -0.772939 -0.151142 0.017925 0.407109
16.266667 -4.620355 -0.087742 -0.785933 -0.143442 0.017987 0.181144
16.300000 -4.624980 -0.087122 -0.800695 -0.135804 0.017976 0.000782
16.333333 -4.629378 -0.086508 -0.826660 -0.128247 0.017890 -0.131950
16.366667 -4.633505 -0.085898 -0.850027 -0.120776 0.017730 -0.214643
16.400000 -4.637366 -0.085294 -0.864306 -0.113398 0.017499 -0.252321
16.433333 -4.640995 -0.084700 -0.885357 -0.106105 0.017200 -0.257427
16.466667 -4.644391 -0.084117 -0.893911 -0.098885 0.016842 -0.248570
16.500000 -4.647552 -0.083546 -0.894269 -0.091727 0.016428 -0.245817
16.533333 -4.650478 -0.082993 -0.910288 -0.084632 0.015962 -0.262324
16.566667 -4.653177 -0.082461 -0.905586 -0.077606 0.015443 -0.312734
16.600000 -4.655657 -0.081952 -0.889045 -0.070649 0.014873 -0.406585
16.633333 -4.657897 -0.081460 -0.869239 -0.063760 0.014252 -0.545418
16.666667 -4.659896 -0.080986 -0.870842 -0.056944 0.013576 -0.723409
16.700000 -4.661653 -0.080531 -0.888341 -0.050205 0.012844 -0.927307
16.733333 -4.663166 -0.080096 -0.921520 -0.043540 0.012053 -1.143550
16.766667 -4.664486 -0.079692 -0.966564 -0.036940 0.011200 -1.351997
16.800000 -4.665561 -0.079311 -1.030607 -0.030391 0.010286 -1.529958
16.833333 -4.666444 -0.078966 -1.101426 -0.023884 0.009308 -1.658659
16.866667 -4.667134 -0.078657 -1.181347 -0.017396 0.008267 -1.720759
16.900000 -4.667629 -0.078388 -1.285905 -0.010897 0.007165 -1.706656
16.933333 -4.667924 -0.078160 -1.382842 -0.004352 0.006011 -1.610907
16.966667 -4.667970 -0.077961 -1.438770 0.002259 0.004808 -1.434960
17.000000 -4.667810 -0.077810 -1.511028 0.008962 0.003562 -1.186807
17.033333 -4.667440 -0.077709 -1.545000 0.015779 0.002281 -0.880414
17.066667 -4.666853 -0.077661 -1.567592 0.022724 0.000970 -0.534857
17.100000 -4.666014 -0.077646 -1.595333 0.029802 -0.000368 -0.169314
17.133333 -4.664920 -0.077665 -1.595156 0.037006 -0.001730 0.197488
17.166667 -4.663594 -0.077746 -1.568162 0.044340 -0.003117 0.544801
17.200000 -4.662013 -0.077863 -1.525811 0.051801 -0.004529 0.851234
17.233333 -4.660186 -0.078046 -1.477624 0.059380 -0.005966 1.101711
17.266667 -4.658103 -0.078266 -1.424177 0.067066 -0.007424 1.285140
17.300000 -4.655763 -0.078525 -1.353620 0.074853 -0.008904 1.390969
17.333333 -4.653166 -0.078823 -1.279844 0.082734 -0.010400 1.413652
17.366667 -4.650299 -0.079188 -1.210066 0.090698 -0.011907 1.359252
17.400000 -4.647157 -0.079618 -1.146375 0.098735 -0.013417 1.237671
17.433333 -4.643756 -0.080089 -1.082277 0.106845 -0.014925 1.060070
17.466667 -4.640068 -0.080620 -1.016646 0.115028 -0.016426 0.837813
17.500000 -4.636086 -0.081208 -1.002957 0.123291 -0.017910 0.589547
17.533333 -4.631846 -0.081839 -0.989461 0.131648 -0.019371 0.331015
17.566667 -4.627349 -0.082515 -1.012486 0.140117 -0.020803 0.073472
17.600000 -4.622540 -0.083238 -1.041867 0.148715 -0.022204 -0.174581
17.633333 -4.617475 -0.084008 -1.066977 0.157452 -0.023574 -0.401737
17.666667 -4.612153 -0.084824 -1.079242 0.166341 -0.024911 -0.597924
17.700000 -4.606501 -0.085682 -1.089808 0.175379 -0.026223 -0.760572
17.733333 -4.600593 -0.086587 -1.111032 0.184547 -0.027516 -0.886589
17.766667 -4.594346 -0.087532 -1.159167 0.193809 -0.028798 -0.973424
17.800000 -4.587755 -0.088515 -1.209117 0.203134 -0.030076 -1.013348
17.833333 -4.580819 -0.089537 -1.254839 0.212484 -0.031356 -1.003613
17.866667 -4.573538 -0.090596 -1.289957 0.221809 -0.032646 -0.938322
17.900000 -4.565912 -0.091695 -1.325300 0.231073 -0.033950 -0.812659
17.933333 -4.558037 -0.092844 -1.393657 0.240255 -0.035271 -0.622251
17.966667 -4.549821 -0.094033 -1.435126 0.249354 -0.036611 -0.371153
18.000000 -4.541267 -0.095263 -1.474874 0.258365 -0.037971 -0.068775
18.033333 -4.532469 -0.096545 -1.477736 0.267289 -0.039353 0.270656
18.066667 -4.523429 -0.097880 -1.473057 0.276147 -0.040756 0.624917
18.100000 -4.514149 -0.099269 -1.434879 0.284958 -0.042181 0.968941
18.133333 -4.504545 -0.100700 -1.385093 0.293723 -0.043631 1.274464
18.166667 -4.494623 -0.102175 -1.318350 0.302432 -0.045109 1.518577
18.200000 -4.484388 -0.103695 -1.222072 0.311073 -0.046615 1.676551
18.233333 -4.473845 -0.105262 -1.124811 0.319625 -0.048153 1.736473
18.266667 -4.462998 -0.106879 -1.040283 0.328055 -0.049727 1.695637
18.300000 -4.451854 -0.108548 -0.945440 0.336311 -0.051341 1.563302
18.333333 -4.440417 -0.110272 -0.859682 0.344359 -0.052999 1.353635
18.366667 -4.428760 -0.112054 -0.791982 0.352179 -0.054702 1.087987
18.400000 -4.416822 -0.113897 -0.763682 0.359759 -0.056457 0.798648
18.433333 -4.404607 -0.115805 -0.768830 0.367094 -0.058263 0.511020
18.466667 -4.392183 -0.117772 -0.778325 0.374192 -0.060122 0.249218
18.500000 -4.379552 -0.119797 -0.800186 0.381072 -0.062032 0.030733
18.533333 -4.366719 -0.121880 -0.849380 0.387757 -0.063992 -0.125844
18.566667 -4.353686 -0.124022 -0.866418 0.394261 -0.066000 -0.213769
18.600000 -4.340414 -0.126242 -0.898505 0.400592 -0.068048 -0.234598
18.633333 -4.326914 -0.128541 -0.911826 0.406760 -0.070130 -0.193337
18.666667 -4.313224 -0.130899 -0.927505 0.412770 -0.072242 -0.102063
18.700000 -4.299322 -0.133339 -0.917104 0.418621 -0.074370 0.025966
18.733333 -4.285216 -0.135861 -0.917795 0.424304 -0.076507 0.168667
18.766667 -4.270933 -0.138443 -0.917249 0.429807 -0.078646 0.313965
18.800000 -4.256468 -0.141109 -0.894249 0.435119 -0.080790 0.446169
18.833333 -4.241831 -0.143860 -0.879187 0.440232 -0.082939 0.554171
18.866667 -4.227029 -0.146669 -0.848907 0.445130 -0.085100 0.632289
18.900000 -4.212064 -0.149537 -0.810998 0.449807 -0.087286 0.674057
18.933333 -4.196942 -0.152464 -0.774281 0.454259 -0.089512 0.681073
18.966667 -4.181684 -0.155479 -0.721967 0.458484 -0.091788 0.647941
19.000000 -4.166276 -0.158551 -0.700976 0.462485 -0.094120 0.579590
19.033333 -4.150722 -0.161681 -0.667676 0.466264 -0.096518 0.476307
19.066667 -4.135055 -0.164905 -0.672944 0.469830 -0.098979 0.342387
19.100000 -4.119283 -0.168224 -0.650137 0.473194 -0.101495 0.185018
19.133333 -4.103412 -0.171642 -0.648799 0.476368 -0.104053 0.011204
19.166667 -4.087452 -0.175160 -0.641489 0.479372 -0.106633 -0.170371
19.200000 -4.071410 -0.178781 -0.638525 0.482218 -0.109220 -0.356765
19.233333 -4.055245 -0.182456 -0.669343 0.484920 -0.111794 -0.535245
19.266667 -4.039013 -0.186238 -0.702076 0.487483 -0.114347 -0.701876
19.300000 -4.022721 -0.190130 -0.724934 0.489909 -0.116871 -0.849904
19.333333 -4.006318 -0.194073 -0.756941 0.492197 -0.119365 -0.976172
19.366667 -3.989871 -0.198129 -0.801308 0.494336 -0.121838 -1.072663
19.400000 -3.973319 -0.202232 -0.846360 0.496321 -0.124294 -1.134708
19.433333 -3.956668 -0.206384 -0.897629 0.498146 -0.126739 -1.166259
19.466667 -3.939993 -0.210647 -0.946597 0.499820 -0.129165 -1.167496
19.500000 -3.923224 -0.214955 -1.007666 0.501340 -0.131579 -1.139881
19.533333 -3.906441 -0.219372 -1.053728 0.502712 -0.133975 -1.085830
19.566667 -3.889644 -0.223895 -1.079336 0.503951 -0.136344 -1.016230
19.600000 -3.872838 -0.228522 -1.117103 0.505073 -0.138671 -0.933931
19.633333 -3.855953 -0.233188 -1.138335 0.506100 -0.140941 -0.843670
19.666667 -3.839061 -0.237951 -1.163628 0.507043 -0.143141 -0.749414
19.700000 -3.822164 -0.242807 -1.173371 0.507934 -0.145248 -0.658049
19.733333 -3.805197 -0.247697 -1.207449 0.508788 -0.147245 -0.572114
19.766667 -3.788226 -0.252671 -1.218048 0.509622 -0.149118 -0.490215
19.800000 -3.771192 -0.257675 -1.239481 0.510439 -0.150863 -0.414609
19.833333 -3.754153 -0.262755 -1.240737 0.511236 -0.152480 -0.345032
19.866667 -3.737111 -0.267908 -1.252081 0.512012 -0.153969 -0.279683
19.900000 -3.720065 -0.273127 -1.270700 0.512757 -0.155334 -0.218225
19.933333 -3.702967 -0.278367 -1.271683 0.513471 -0.156576 -0.163262
19.966667 -3.685819 -0.283625 -1.273641 0.514144 -0.157700 -0.113116
20.000000 -3.668624 -0.288899 -1.286435 0.514775 -0.158705 -0.069528
20.033333 -3.651430 -0.294221 -1.260791 0.515363 -0.159592 -0.033476
20.066667 -3.634238 -0.299587 -1.262632 0.515901 -0.160363 -0.007261
20.100000 -3.617006 -0.304960 -1.277143 0.516376 -0.161024 0.010345
20.133333 -3.599779 -0.310368 -1.263059 0.516779 -0.161582 0.019848
20.166667 -3.582559 -0.315803 -1.263296 0.517108 -0.162034 0.021055
20.200000 -3.565306 -0.321240 -1.255527 0.517359 -0.162382 0.013169
20.233333 -3.548024 -0.326675 -1.259175 0.517527 -0.162625 0.001704
20.266667 -3.530752 -0.332124 -1.261634 0.517612 -0.162765 -0.012162
20.300000 -3.513455 -0.337566 -1.258272 0.517622 -0.162795 -0.030544
20.333333 -3.496172 -0.343012 -1.257706 0.517557 -0.162715 -0.047585
20.366667 -3.478903 -0.348459 -1.261032 0.517417 -0.162527 -0.066035
20.400000 -3.461651 -0.353901 -1.264768 0.517204 -0.162232 -0.082196
20.433333 -3.444418 -0.359333 -1.269977 0.516928 -0.161826 -0.099047
20.466667 -3.427170 -0.364745 -1.285017 0.516589 -0.161309 -0.114033
20.500000 -3.409945 -0.370138 -1.273012 0.516194 -0.160680 -0.123591
20.533333 -3.392742 -0.375510 -1.283607 0.515748 -0.159935 -0.133968
20.566667 -3.375565 -0.380856 -1.280050 0.515260 -0.159074 -0.144711
20.600000 -3.358380 -0.386170 -1.291262 0.514732 -0.158098 -0.153157
20.633333 -3.341225 -0.391449 -1.309665 0.514167 -0.157011 -0.155852
20.666667 -3.324066 -0.396692 -1.295564 0.513571 -0.155812 -0.159532
20.700000 -3.306939 -0.401890 -1.312764 0.512943 -0.154505 -0.164958
20.733333 -3.289846 -0.407041 -1.322178 0.512281 -0.153091 -0.165708
20.766667 -3.272788 -0.412140 -1.319760 0.511588 -0.151572 -0.159102
20.800000 -3.255768 -0.417184 -1.319760 0.510866 -0.149948 -0.156608
20.833333 -3.238751 -0.422177 -1.317837 0.510117 -0.148223 -0.165460
20.866667 -3.221738 -0.427116 -1.347186 0.509346 -0.146398 -0.174951
20.900000 -3.204766 -0.431988 -1.378198 0.508562 -0.144478 -0.182920
20.933333 -3.187801 -0.436801 -1.350440 0.507770 -0.142465 -0.199512
20.966667 -3.170879 -0.441539 -1.319332 0.506974 -0.140363 -0.230559
21.000000 -3.154001 -0.446199 -1.347255 0.506178 -0.138176 -0.259440
21.033333 -3.137167 -0.450775 -1.371964 0.505388 -0.135908 -0.280669
21.066667 -3.120344 -0.455282 -1.355366 0.504607 -0.133562 -0.307757
21.100000 -3.103534 -0.459717 -1.376051 0.503833 -0.131137 -0.345699
21.133333 -3.086766 -0.464056 -1.430048 0.503069 -0.128638 -0.377629
21.166667 -3.070013 -0.468318 -1.423546 0.502318 -0.126065 -0.394594
21.200000 -3.053274 -0.472501 -1.423481 0.501574 -0.123416 -0.410865
21.233333 -3.036573 -0.476579 -1.433528 0.500830 -0.120687 -0.430543
21.266667 -3.019889 -0.480573 -1.456691 0.500079 -0.117879 -0.437847
21.300000 -3.003223 -0.484480 -1.507244 0.499320 -0.114994 -0.426323
21.333333 -2.986575 -0.488297 -1.482647 0.498547 -0.112031 -0.416157
21.366667 -2.969961 -0.492003 -1.481896 0.497756 -0.108992 -0.407081
21.400000 -2.953381 -0.495598 -1.526579 0.496949 -0.105881 -0.389935
21.433333 -2.936835 -0.499079 -1.557753 0.496131 -0.102701 -0.360579
21.466667 -2.920311 -0.502461 -1.537221 0.495302 -0.099453 -0.332728
21.500000 -2.903808 -0.505742 -1.563498 0.494464 -0.096134 -0.311901
21.533333 -2.887340 -0.508903 -1.575656 0.493619 -0.092744 -0.284694
21.566667 -2.870908 -0.511940 -1.588556 0.492770 -0.089278 -0.255440
21.600000 -2.854500 -0.514870 -1.574343 0.491917 -0.085731 -0.228716
21.633333 -2.838115 -0.517690 -1.589386 0.491059 -0.082102 -0.204538
21.666667 -2.821755 -0.520398 -1.607028 0.490197 -0.078389 -0.172276
21.700000 -2.805420 -0.522992 -1.586970 0.489332 -0.074596 -0.133166
21.733333 -2.789121 -0.525442 -1.598701 0.488462 -0.070723 -0.091615
21.766667 -2.772855 -0.527743 -1.611345 0.487588 -0.066778 -0.050763
21.800000 -2.756615 -0.529925 -1.619377 0.486711 -0.062769 -0.012879
21.833333 -2.740409 -0.531948 -1.630370 0.485832 -0.058702 0.017211
21.866667 -2.724230 -0.533849 -1.640697 0.484953 -0.054576 0.030237
21.900000 -2.708083 -0.535582 -1.634175 0.484076 -0.050394 0.027453
21.933333 -2.691963 -0.537189 -1.596766 0.483202 -0.046163 0.005245
21.966667 -2.675872 -0.538668 -1.572106 0.482331 -0.041874 -0.033191
22.000000 -2.659809 -0.540018 -1.556681 0.481464 -0.037525 -0.085997
22.033333 -2.643775 -0.541236 -1.556387 0.480600 -0.033105 -0.150554
22.066667 -2.627769 -0.542275 -1.575118 0.479738 -0.028618 -0.221233
22.100000 -2.611792 -0.543181 -1.605888 0.478876 -0.024063 -0.290930
22.133333 -2.595845 -0.543951 -1.627727 0.478012 -0.019434 -0.349195
22.166667 -2.579925 -0.544535 -1.635740 0.477146 -0.014737 -0.393325
22.200000 -2.564031 -0.544931 -1.662615 0.476276 -0.009978 -0.419447
22.233333 -2.548169 -0.545188 -1.695861 0.475403 -0.005165 -0.424464
22.266667 -2.532336 -0.545306 -1.717647 0.474526 -0.000295 -0.407960
22.300000 -2.516531 -0.545228 -1.710297 0.473646 0.004628 -0.379727
22.333333 -2.500757 -0.545008 -1.723409 0.472763 0.009605 -0.346203
22.366667 -2.485011 -0.544588 -1.725412 0.471879 0.014639 -0.311879
22.400000 -2.469296 -0.544025 -1.742769 0.470993 0.019739 -0.279350
22.433333 -2.453612 -0.543318 -1.748065 0.470108 0.024906 -0.254761
22.466667 -2.437961 -0.542466 -1.755881 0.469223 0.030137 -0.241702
22.500000 -2.422336 -0.541407 -1.747959 0.468338 0.035440 -0.231876
22.533333 -2.406739 -0.540138 -1.771628 0.467455 0.040804 -0.215594
22.566667 -2.391169 -0.538659 -1.775275 0.466572 0.046221 -0.179571
22.600000 -2.375631 -0.537034 -1.772784 0.465688 0.051676 -0.111277
22.633333 -2.360126 -0.535262 -1.792208 0.464804 0.057159 0.009734
22.666667 -2.344648 -0.533277 -1.795363 0.463918 0.062657 0.199694
22.700000 -2.329196 -0.531078 -1.802037 0.463027 0.068143 0.467581
22.733333 -2.313771 -0.528666 -1.815623 0.462132 0.073607 0.806813
22.766667 -2.298380 -0.526106 -1.833147 0.461233 0.079039 1.210781
22.800000 -2.283022 -0.523401 -1.836866 0.460330 0.084427 1.666792
22.833333 -2.267691 -0.520482 -1.808393 0.459422 0.089755 2.154143
22.866667 -2.252395 -0.517417 -1.709909 0.458514 0.095020 2.644618
22.900000 -2.237125 -0.514141 -1.579418 0.457613 0.100232 3.109657
22.933333 -2.221881 -0.510653 -1.422229 0.456725 0.105394 3.527735
22.966667 -2.206672 -0.507022 -1.250355 0.455858 0.110507 3.870447
23.000000 -2.191498 -0.503249 -1.074811 0.455021 0.115577 4.117092
23.033333 -2.176361 -0.499333 -0.905861 0.454223 0.120621 4.252081
23.066667 -2.161243 -0.495220 -0.764100 0.453474 0.125641 4.281504
23.100000 -2.146162 -0.490966 -0.587969 0.452780 0.130641 4.212009
23.133333 -2.131094 -0.486521 -0.438380 0.452140 0.135624 4.058960
23.166667 -2.116064 -0.481938 -0.263540 0.451560 0.140592 3.843555
23.200000 -2.101040 -0.477170 -0.150314 0.451038 0.145548 3.588959
23.233333 -2.086020 -0.472220 -0.031870 0.450567 0.150478 3.315092
23.266667 -2.071004 -0.467091 0.055558 0.450137 0.155372 3.031635
23.300000 -2.056026 -0.461830 0.139758 0.449731 0.160214 2.752661
23.333333 -2.041050 -0.456398 0.218810 0.449338 0.164989 2.484902
23.366667 -2.026075 -0.450798 0.302105 0.448937 0.169678 2.233880
23.400000 -2.011103 -0.445033 0.367755 0.448509 0.174265 1.998209
23.433333 -1.996134 -0.439108 0.423938 0.448034 0.178735 1.778781
23.466667 -1.981206 -0.433059 0.463014 0.447500 0.183084 1.573925
23.500000 -1.966284 -0.426857 0.523234 0.446899 0.187305 1.377518
23.533333 -1.951368 -0.420505 0.568159 0.446223 0.191395 1.188165
23.566667 -1.936459 -0.414007 0.607948 0.445468 0.195353 1.003849
23.600000 -1.921595 -0.407394 0.644597 0.444638 0.199182 0.823893
23.633333 -1.906777 -0.400667 0.669824 0.443745 0.202893 0.647457
23.666667 -1.892005 -0.393830 0.678391 0.442795 0.206490 0.476214
23.700000 -1.877245 -0.386862 0.686379 0.441795 0.209978 0.316689
23.733333 -1.862534 -0.379787 0.695297 0.440752 0.213365 0.169222
23.766667 -1.847871 -0.372609 0.690520 0.439679 0.216662 0.037198
23.800000 -1.833225 -0.365312 0.684106 0.438582 0.219871 -0.076022
23.833333 -1.818630 -0.357915 0.672840 0.437458 0.222994 -0.166153
23.866667 -1.804055 -0.350408 0.670574 0.436309 0.226032 -0.234256
23.900000 -1.789533 -0.342807 0.650177 0.435140 0.228985 -0.284968
23.933333 -1.775034 -0.335103 0.633517 0.433954 0.231855 -0.318659
23.966667 -1.760559 -0.327299 0.605412 0.432745 0.234635 -0.338297
24.000000 -1.746141 -0.319409 0.593853 0.431513 0.237324 -0.347180
24.033333 -1.731780 -0.311435 0.596140 0.430258 0.239921 -0.352896
24.066667 -1.717477 -0.303379 0.585239 0.428982 0.242424 -0.356968
24.100000 -1.703206 -0.295238 0.576035 0.427682 0.244831 -0.362397
24.133333 -1.688969 -0.287016 0.560042 0.426358 0.247138 -0.370966
24.166667 -1.674768 -0.278716 0.554497 0.425011 0.249346 -0.387127
24.200000 -1.660604 -0.270342 0.544752 0.423636 0.251451 -0.412734
24.233333 -1.646504 -0.261901 0.528770 0.422234 0.253449 -0.443448
24.266667 -1.632445 -0.253395 0.515248 0.420797 0.255339 -0.478379
24.300000 -1.618428 -0.244826 0.502855 0.419318 0.257118 -0.514194
24.333333 -1.604456 -0.236200 0.485859 0.417790 0.258785 -0.552210
24.366667 -1.590553 -0.227518 0.461868 0.416207 0.260340 -0.587900
24.400000 -1.576699 -0.218786 0.437862 0.414563 0.261786 -0.617688
24.433333 -1.562895 -0.210011 0.407176 0.412852 0.263124 -0.642041
24.466667 -1.549144 -0.201195 0.395880 0.411070 0.264357 -0.661087
24.500000 -1.535449 -0.192343 0.372772 0.409216 0.265485 -0.675207
24.533333 -1.521811 -0.183459 0.339469 0.407288 0.266511 -0.680439
24.566667 -1.508250 -0.174535 0.317279 0.405283 0.267435 -0.678963
24.600000 -1.494752 -0.165587 0.295721 0.403200 0.268258 -0.672526
24.633333 -1.481334 -0.156606 0.275939 0.401039 0.268979 -0.663761
24.666667 -1.467983 -0.147607 0.249390 0.398802 0.269599 -0.651355
24.700000 -1.454716 -0.138582 0.228885 0.396490 0.270116 -0.636258
24.733333 -1.441523 -0.129547 0.206114 0.394105 0.270530 -0.621619
24.766667 -1.428416 -0.120490 0.183700 0.391648 0.270837 -0.606035
24.800000 -1.415387 -0.111432 0.167864 0.389120 0.271033 -0.589376
24.833333 -1.402441 -0.102376 0.146931 0.386520 0.271116 -0.567903
24.866667 -1.389581 -0.093327 0.137335 0.383849 0.271088 -0.545345
24.900000 -1.376813 -0.084266 0.113533 0.381103 0.270948 -0.520292
24.933333 -1.364138 -0.075198 0.097045 0.378281 0.270695 -0.494069
24.966667 -1.351558 -0.066146 0.068422 0.375383 0.270334 -0.467915
25.000000 -1.339075 -0.057113 0.056557 0.372409 0.269874 -0.443381
25.033333 -1.326693 -0.048103 0.036428 0.369360 0.269317 -0.423142
25.066667 -1.314415 -0.039118 0.032811 0.366240 0.268668 -0.405641
25.100000 -1.302244 -0.030161 0.020529 0.363053 0.267937 -0.392366
25.133333 -1.290184 -0.021237 0.015164 0.359805 0.267138 -0.382840
25.166667 -1.278228 -0.012323 0.013143 0.356502 0.266279 -0.377914
25.200000 -1.266387 -0.003447 -0.007296 0.353146 0.265364 -0.375948
25.233333 -1.254665 0.005388 -0.015606 0.349743 0.264401 -0.378272
25.266667 -1.243063 0.014178 -0.033385 0.346291 0.263392 -0.381571
25.300000 -1.231571 0.022947 -0.054991 0.342789 0.262331 -0.386674
25.333333 -1.220189 0.031693 -0.069623 0.339226 0.261203 -0.389664
25.366667 -1.208937 0.040384 -0.075158 0.335595 0.260001 -0.389015
25.400000 -1.197799 0.049047 -0.096480 0.331886 0.258709 -0.384354
25.433333 -1.186774 0.057678 -0.096004 0.328086 0.257317 -0.374576
25.466667 -1.175864 0.066276 -0.117381 0.324190 0.255813 -0.363051
25.500000 -1.165097 0.074809 -0.125716 0.320199 0.254198 -0.348131
25.533333 -1.154446 0.083303 -0.142467 0.316118 0.252476 -0.332258
25.566667 -1.143943 0.091727 -0.156475 0.311955 0.250651 -0.315011
25.600000 -1.133591 0.100076 -0.159037 0.307727 0.248740 -0.300356
25.633333 -1.123393 0.108349 -0.180568 0.303450 0.246755 -0.285224
25.666667 -1.113353 0.116542 -0.178920 0.299140 0.244715 -0.269784
25.700000 -1.103473 0.124654 -0.185800 0.294805 0.242629 -0.256034
25.733333 -1.093755 0.132681 -0.192494 0.290457 0.240509 -0.245862
25.766667 -1.084162 0.140655 -0.204745 0.286103 0.238361 -0.240086
25.800000 -1.074693 0.148573 -0.218434 0.281738 0.236186 -0.234068
25.833333 -1.065349 0.156434 -0.219610 0.277360 0.233979 -0.231681
25.866667 -1.056179 0.164201 -0.217069 0.272963 0.231736 -0.232089
25.900000 -1.047135 0.171907 -0.222411 0.268542 0.229451 -0.232329
25.933333 -1.038219 0.179549 -0.247008 0.264092 0.227116 -0.229434
25.966667 -1.029483 0.187093 -0.251446 0.259610 0.224726 -0.223540
26.000000 -1.020876 0.194570 -0.251682 0.255092 0.222277 -0.216933
26.033333 -1.012451 0.201945 -0.268298 0.250544 0.219770 -0.206931
26.066667 -1.004208 0.209220 -0.275334 0.245970 0.217207 -0.192541
26.100000 -0.996095 0.216421 -0.278724 0.241376 0.214590 -0.176251
26.133333 -0.988110 0.223549 -0.295461 0.236769 0.211924 -0.159359
26.166667 -0.980303 0.230574 -0.296199 0.232157 0.209212 -0.142140
26.200000 -0.972625 0.237521 -0.295075 0.227552 0.206462 -0.122361
26.233333 -0.965121 0.244364 -0.291495 0.222960 0.203677 -0.103011
26.266667 -0.957747 0.251127 -0.300466 0.218383 0.200857 -0.086029
26.300000 -0.950542 0.257785 -0.297476 0.213829 0.198006 -0.070012
26.333333 -0.943506 0.264339 -0.309222 0.209304 0.195128 -0.055348
26.366667 -0.936637 0.270788 -0.309848 0.204811 0.192226 -0.041870
26.400000 -0.929896 0.277150 -0.305928 0.200352 0.189301 -0.031906
26.433333 -0.923319 0.283406 -0.311595 0.195931 0.186355 -0.022813
26.466667 -0.916870 0.289573 -0.312317 0.191552 0.183391 -0.013390
26.500000 -0.910549 0.295650 -0.310352 0.187214 0.180409 -0.004662
26.533333 -0.904386 0.301620 -0.302412 0.182913 0.177407 0.001711
26.566667 -0.898378 0.307483 -0.303148 0.178648 0.174384 0.006285
26.600000 -0.892498 0.313253 -0.312076 0.174421 0.171342 0.010877
26.633333 -0.886743 0.318926 -0.305698 0.170231 0.168278 0.013832
26.666667 -0.881139 0.324492 -0.305722 0.166077 0.165193 0.014001
26.700000 -0.875683 0.329951 -0.306351 0.161966 0.162089 0.011810
26.733333 -0.870373 0.335302 -0.305234 0.157902 0.158968 0.011102
26.766667 -0.865207 0.340545 -0.303797 0.153889 0.155832 0.010234
26.800000 -0.860164 0.345687 -0.300983 0.149929 0.152680 0.007751
26.833333 -0.855244 0.350727 -0.302277 0.146027 0.149516 0.004465
26.866667 -0.850446 0.355663 -0.306807 0.142183 0.146339 0.002843
26.900000 -0.845785 0.360491 -0.303593 0.138398 0.143149 0.002229
26.933333 -0.841244 0.365214 -0.303129 0.134667 0.139943 0.000149
26.966667 -0.836823 0.369831 -0.298106 0.130986 0.136722 -0.002199
27.000000 -0.832532 0.374339 -0.304862 0.127350 0.133485 -0.003992
27.033333 -0.828359 0.378739 -0.310320 0.123755 0.130229 -0.004545
27.066667 -0.824303 0.383030 -0.299708 0.120197 0.126956 -0.007314
27.100000 -0.820363 0.387211 -0.310112 0.116672 0.123667 -0.009190
27.133333 -0.816538 0.391282 -0.303162 0.113179 0.120361 -0.011060
27.166667 -0.812827 0.395242 -0.304526 0.109720 0.117042 -0.011452
27.200000 -0.809230 0.399089 -0.296446 0.106292 0.113709 -0.011485
27.233333 -0.805750 0.402826 -0.307506 0.102896 0.110363 -0.013034
27.266667 -0.802386 0.406453 -0.305286 0.099532 0.107006 -0.013322
