t x y theta dxdt dydt dthetadt
0.000000 0.000000 0.000000 -0.002609 -0.006071 0.005795 0.010897
0.033333 -0.000262 -0.000083 -0.004652 -0.008668 0.008445 0.008034
0.066667 -0.000437 0.000026 -0.003222 -0.012158 0.012130 0.004962
0.100000 -0.000521 0.000331 0.003245 -0.017032 0.017207 -0.000063
0.133333 -0.000509 0.000838 0.003895 -0.023500 0.023936 -0.006800
0.166667 -0.001184 0.001269 0.003006 -0.032024 0.032702 -0.011302
0.200000 -0.001755 0.001914 -0.005467 -0.043127 0.043819 -0.012542
0.233333 -0.002216 0.002777 -0.000002 -0.057056 0.057361 -0.013932
0.266667 -0.004245 0.004414 -0.000695 -0.073912 0.073353 -0.016400
0.300000 -0.006153 0.006281 -0.007413 -0.093221 0.091548 -0.017891
0.333333 -0.007933 0.008381 -0.013475 -0.114647 0.111742 -0.014122
0.366667 -0.011611 0.012157 -0.007986 -0.136987 0.133141 -0.001568
0.400000 -0.015146 0.016175 -0.009353 -0.158774 0.154883 0.020001
0.433333 -0.021833 0.022221 -0.005396 -0.178167 0.176010 0.048616
0.466667 -0.028356 0.028512 -0.000614 -0.193612 0.195655 0.075482
0.500000 -0.038236 0.037090 0.006202 -0.203536 0.212931 0.087357
0.533333 -0.047922 0.045913 -0.002057 -0.206158 0.226941 0.065398
0.566667 -0.057397 0.054979 -0.014972 -0.200490 0.237438 -0.009204
0.600000 -0.066644 0.064285 -0.027823 -0.185867 0.244394 -0.142831
0.633333 -0.075649 0.073830 -0.017043 -0.162648 0.248243 -0.331409
0.666667 -0.084394 0.083611 0.034396 -0.130939 0.249430 -0.563702
0.700000 -0.090192 0.092247 0.112818 -0.091656 0.248999 -0.825534
0.733333 -0.092900 0.099911 0.116520 -0.046394 0.248124 -1.091629
0.766667 -0.092131 0.107000 0.052545 0.002772 0.248113 -1.331846
0.800000 -0.091058 0.114320 -0.069719 0.053688 0.250141 -1.519546
0.833333 -0.089676 0.121871 -0.184315 0.104604 0.255112 -1.634134
0.866667 -0.085369 0.129511 -0.307814 0.153312 0.263837 -1.653318
0.900000 -0.078022 0.137182 -0.408268 0.197790 0.276739 -1.558601
0.933333 -0.068532 0.145264 -0.487792 0.236550 0.294011 -1.352594
0.966667 -0.057905 0.153910 -0.545604 0.269106 0.315124 -1.056059
1.000000 -0.045523 0.163401 -0.601269 0.294914 0.339752 -0.699557
1.033333 -0.032697 0.174859 -0.613047 0.313512 0.367601 -0.322434
1.066667 -0.019566 0.186542 -0.594027 0.325091 0.398473 0.030456
1.100000 -0.007968 0.201673 -0.544313 0.331034 0.431577 0.312400
1.133333 0.003927 0.217019 -0.485329 0.332802 0.466246 0.492218
1.166667 0.016113 0.232572 -0.422024 0.331808 0.502093 0.551927
1.200000 0.028587 0.248325 -0.365198 0.330120 0.538171 0.482678
1.233333 0.037637 0.267754 -0.302674 0.330104 0.573226 0.295590
1.266667 0.046971 0.287365 -0.267637 0.333725 0.605869 0.009598
1.300000 0.056591 0.307147 -0.259696 0.341938 0.635241 -0.339935
1.333333 0.065362 0.330001 -0.252918 0.355631 0.660230 -0.715169
1.366667 0.074622 0.354819 -0.312441 0.375011 0.679426 -1.066303
1.400000 0.085239 0.380668 -0.363933 0.399537 0.691889 -1.349952
1.433333 0.098224 0.406979 -0.458617 0.427600 0.696974 -1.531394
1.466667 0.111494 0.433379 -0.559988 0.457678 0.694116 -1.585416
1.500000 0.127809 0.458511 -0.694648 0.487990 0.683142 -1.502492
1.533333 0.147040 0.481591 -0.800390 0.516077 0.664484 -1.285530
1.566667 0.166536 0.504707 -0.877814 0.540009 0.639468 -0.963501
1.600000 0.186289 0.527846 -0.936915 0.558198 0.609426 -0.564248
1.633333 0.208407 0.547942 -0.956393 0.570073 0.576340 -0.127834
1.666667 0.230760 0.568032 -0.930795 0.575145 0.542268 0.304677
1.700000 0.251772 0.583934 -0.854395 0.573851 0.509213 0.687634
1.733333 0.272995 0.599811 -0.772855 0.567699 0.478713 0.981975
1.766667 0.291156 0.612378 -0.683014 0.558564 0.452071 1.163532
1.800000 0.309510 0.624909 -0.599591 0.548351 0.430471 1.213098
1.833333 0.328051 0.637400 -0.530400 0.539174 0.414078 1.129951
1.866667 0.343573 0.649079 -0.473022 0.533253 0.402966 0.921656
1.900000 0.359272 0.660711 -0.428305 0.532253 0.396474 0.613809
1.933333 0.374443 0.672551 -0.392874 0.537587 0.394049 0.239321
1.966667 0.389588 0.685255 -0.384117 0.549778 0.394549 -0.163207
2.000000 0.405851 0.698782 -0.387559 0.569160 0.396883 -0.554947
2.033333 0.424033 0.713128 -0.423840 0.594999 0.400485 -0.903564
2.066667 0.442377 0.727401 -0.503652 0.625727 0.404914 -1.171901
2.100000 0.463681 0.741581 -0.595430 0.659349 0.410149 -1.332784
2.133333 0.485132 0.755675 -0.686497 0.693385 0.416164 -1.370855
2.166667 0.509907 0.769102 -0.753990 0.724798 0.423625 -1.285508
2.200000 0.534809 0.782430 -0.848734 0.750803 0.433135 -1.081485
2.233333 0.562608 0.795651 -0.926063 0.768859 0.445196 -0.775082
2.266667 0.592678 0.809040 -0.981524 0.777273 0.459994 -0.401355
2.300000 0.624194 0.822763 -0.994934 0.774678 0.477776 -0.002599
2.333333 0.655219 0.837609 -0.975968 0.760004 0.498683 0.384136
2.366667 0.684065 0.854449 -0.925819 0.734122 0.521956 0.727626
2.400000 0.708423 0.873271 -0.834944 0.698192 0.546761 0.993317
2.433333 0.732805 0.891935 -0.732055 0.654434 0.572053 1.157604
2.466667 0.757200 0.910430 -0.659262 0.605178 0.597009 1.214702
2.500000 0.775114 0.932266 -0.582197 0.553905 0.620311 1.172901
2.533333 0.793028 0.953905 -0.514518 0.504070 0.640759 1.044398
2.566667 0.805428 0.977202 -0.477887 0.458479 0.657546 0.850115
2.600000 0.817830 1.000268 -0.460498 0.419132 0.670064 0.622880
2.633333 0.826997 1.024338 -0.470075 0.387612 0.677486 0.399132
2.666667 0.836176 1.048140 -0.477106 0.365082 0.678977 0.203593
2.700000 0.845375 1.071652 -0.490352 0.351088 0.674491 0.054623
2.733333 0.854911 1.095777 -0.511693 0.345058 0.663987 -0.037136
2.766667 0.864481 1.119572 -0.550580 0.345498 0.647635 -0.068028
2.800000 0.875487 1.142978 -0.572170 0.351103 0.625270 -0.046919
2.833333 0.887394 1.165206 -0.582652 0.359919 0.597564 0.008921
2.866667 0.900122 1.185984 -0.584455 0.370042 0.565280 0.084748
2.900000 0.913783 1.204494 -0.568104 0.380107 0.528978 0.164536
2.933333 0.927503 1.222581 -0.543640 0.388863 0.489289 0.236657
2.966667 0.941457 1.236923 -0.513447 0.395388 0.447238 0.285110
3.000000 0.955475 1.250814 -0.485441 0.398986 0.404241 0.304397
3.033333 0.969560 1.264243 -0.457300 0.399074 0.361178 0.293553
3.066667 0.983715 1.277197 -0.463888 0.395200 0.318755 0.258890
3.100000 0.997529 1.286759 -0.436083 0.387097 0.277607 0.205540
3.133333 1.010311 1.292952 -0.437698 0.374571 0.238531 0.143389
3.166667 1.023174 1.298647 -0.434088 0.357945 0.201646 0.084144
3.200000 1.036124 1.303839 -0.448387 0.337729 0.166999 0.036569
3.233333 1.049167 1.308525 -0.454003 0.315001 0.134746 0.010378
3.266667 1.062306 1.312699 -0.470098 0.290841 0.105192 0.008565
3.300000 1.072430 1.315659 -0.478256 0.266447 0.078371 0.041021
3.333333 1.080333 1.317096 -0.483344 0.243030 0.053916 0.109777
3.366667 1.084535 1.317759 -0.478384 0.221976 0.031755 0.217426
3.400000 1.088875 1.317904 -0.469230 0.204478 0.011731 0.364113
3.433333 1.093369 1.317530 -0.465180 0.191653 -0.006296 0.541971
3.466667 1.098032 1.316636 -0.444032 0.184786 -0.022578 0.739875
3.500000 1.102880 1.315222 -0.443325 0.184669 -0.037243 0.938430
3.533333 1.107929 1.313288 -0.438636 0.191792 -0.050350 1.114750
3.566667 1.113193 1.310834 -0.388117 0.205726 -0.062120 1.248665
3.600000 1.119438 1.308656 -0.324312 0.226376 -0.073121 1.316973
3.633333 1.125928 1.305958 -0.239330 0.253143 -0.084004 1.303741
3.666667 1.132679 1.302739 -0.133949 0.284889 -0.095402 1.200105
3.700000 1.141344 1.299710 -0.065331 0.321228 -0.108329 1.008273
3.733333 1.150295 1.296161 0.016625 0.361964 -0.123712 0.742712
3.766667 1.162522 1.292594 0.061731 0.407101 -0.142437 0.424787
3.800000 1.178626 1.288784 0.093428 0.455661 -0.164722 0.084721
3.833333 1.195044 1.284449 0.071444 0.506910 -0.190737 -0.242220
3.866667 1.211779 1.279590 -0.000344 0.560410 -0.220627 -0.519047
3.900000 1.228838 1.274205 -0.061632 0.614723 -0.253652 -0.721917
3.933333 1.251062 1.264956 -0.149625 0.668676 -0.288837 -0.834406
3.966667 1.273612 1.255184 -0.229885 0.721590 -0.325119 -0.855052
4.000000 1.296488 1.244893 -0.289667 0.773724 -0.361734 -0.790449
4.033333 1.327289 1.229525 -0.333062 0.824704 -0.397534 -0.661755
4.066667 1.358403 1.213650 -0.340934 0.874157 -0.431374 -0.501650
4.100000 1.389821 1.197275 -0.326720 0.922129 -0.462448 -0.337213
4.133333 1.421533 1.180412 -0.308746 0.968142 -0.490419 -0.193173
4.166667 1.453530 1.163069 -0.279087 1.011474 -0.514991 -0.085714
4.200000 1.485800 1.145257 -0.247857 1.051108 -0.535900 -0.024872
4.233333 1.518335 1.126985 -0.224389 1.087086 -0.553435 -0.009595
4.266667 1.559100 1.107716 -0.218457 1.118791 -0.567844 -0.027436
4.300000 1.600101 1.088006 -0.231160 1.145770 -0.579583 -0.062162
4.333333 1.641317 1.067867 -0.245709 1.167839 -0.588877 -0.100078
4.366667 1.682728 1.047310 -0.274469 1.184818 -0.595953 -0.130040
4.400000 1.724318 1.026347 -0.303324 1.195863 -0.600775 -0.145457
4.433333 1.765089 1.006213 -0.332507 1.200004 -0.603442 -0.144474
4.466667 1.806001 0.985694 -0.333622 1.196814 -0.603848 -0.131964
4.500000 1.847035 0.964801 -0.332161 1.185792 -0.601783 -0.117286
4.533333 1.888172 0.943544 -0.317170 1.165874 -0.596945 -0.111525
4.566667 1.926861 0.924419 -0.303447 1.135774 -0.589245 -0.121119
4.600000 1.965621 0.904950 -0.293149 1.095559 -0.579133 -0.149455
4.633333 2.004437 0.885145 -0.282587 1.044791 -0.566843 -0.194959
4.666667 2.043292 0.865012 -0.264915 0.983975 -0.553172 -0.252219
4.700000 2.082172 0.844561 -0.283900 0.913493 -0.539130 -0.312952
4.733333 2.113015 0.827003 -0.311361 0.835458 -0.526337 -0.363190
4.766667 2.143862 0.809142 -0.352422 0.752349 -0.516136 -0.393851
4.800000 2.165156 0.794613 -0.382281 0.666776 -0.509902 -0.400364
4.833333 2.186453 0.779791 -0.403217 0.581687 -0.509000 -0.383716
4.866667 2.200910 0.765828 -0.437711 0.499805 -0.514583 -0.344087
4.900000 2.210062 0.751523 -0.453501 0.424550 -0.527369 -0.286130
4.933333 2.219252 0.736931 -0.464804 0.357791 -0.547317 -0.218420
4.966667 2.226833 0.719699 -0.449371 0.301504 -0.574104 -0.147724
5.000000 2.234489 0.702185 -0.428619 0.256397 -0.606831 -0.075397
5.033333 2.240695 0.681864 -0.416265 0.223199 -0.644018 0.000963
5.066667 2.245871 0.659435 -0.407288 0.202021 -0.683917 0.079663
5.100000 2.249930 0.634997 -0.408181 0.192052 -0.724850 0.163922
5.133333 2.254151 0.610308 -0.427784 0.192686 -0.765197 0.260575
5.166667 2.258286 0.581989 -0.438932 0.203406 -0.803449 0.372739
5.200000 2.262629 0.553445 -0.440683 0.223812 -0.838321 0.498460
5.233333 2.267206 0.524689 -0.427249 0.253493 -0.869092 0.632707
5.266667 2.274185 0.493563 -0.419077 0.291539 -0.894943 0.770998
5.300000 2.281443 0.462257 -0.374999 0.337268 -0.915348 0.900680
5.333333 2.292997 0.430296 -0.328395 0.389834 -0.929925 1.004647
5.366667 2.304868 0.398188 -0.272523 0.447561 -0.938952 1.070292
5.400000 2.322364 0.364957 -0.221450 0.508830 -0.942748 1.090297
5.433333 2.340204 0.331615 -0.156591 0.571748 -0.941762 1.057805
5.466667 2.358399 0.298181 -0.091695 0.635056 -0.937144 0.969600
5.500000 2.382460 0.266384 -0.048278 0.697141 -0.930047 0.832473
5.533333 2.406891 0.234529 -0.032056 0.757160 -0.921767 0.659825
5.566667 2.435013 0.204353 -0.001738 0.814556 -0.913340 0.464124
5.600000 2.465839 0.176026 0.004099 0.869152 -0.905942 0.258891
5.633333 2.497038 0.147685 -0.001373 0.920742 -0.900508 0.060780
5.666667 2.528605 0.119345 -0.010529 0.969031 -0.897511 -0.115344
5.700000 2.560538 0.091017 -0.025454 1.014794 -0.897133 -0.258833
5.733333 2.594876 0.061783 -0.052097 1.058090 -0.899314 -0.366593
5.766667 2.631440 0.032011 -0.079281 1.099415 -0.903598 -0.435485
5.800000 2.669897 0.001159 -0.099733 1.139353 -0.909124 -0.470430
5.833333 2.708690 -0.029624 -0.139678 1.178645 -0.915080 -0.476634
5.866667 2.749074 -0.061044 -0.158668 1.217745 -0.920554 -0.462029
5.900000 2.790698 -0.092623 -0.174879 1.256282 -0.924760 -0.434346
5.933333 2.833012 -0.123757 -0.180220 1.294304 -0.927157 -0.399322
5.966667 2.875614 -0.154758 -0.186800 1.331588 -0.927499 -0.362704
6.000000 2.920355 -0.186399 -0.185926 1.367529 -0.925881 -0.324839
6.033333 2.967076 -0.217853 -0.190272 1.401642 -0.922329 -0.289713
6.066667 3.014035 -0.249125 -0.194436 1.433993 -0.916936 -0.256622
6.100000 3.063496 -0.280002 -0.206221 1.464873 -0.909749 -0.225652
6.133333 3.115085 -0.310144 -0.230351 1.494308 -0.900730 -0.194704
6.166667 3.166849 -0.340058 -0.242946 1.522357 -0.889778 -0.162017
6.200000 3.218764 -0.369730 -0.251727 1.549425 -0.876786 -0.125676
6.233333 3.270807 -0.399145 -0.256168 1.575689 -0.861789 -0.084420
6.266667 3.322953 -0.428288 -0.250205 1.600923 -0.844844 -0.040057
6.300000 3.375178 -0.457145 -0.248407 1.624978 -0.826158 0.008761
6.333333 3.427457 -0.485702 -0.247877 1.647849 -0.805648 0.059186
6.366667 3.482865 -0.513077 -0.244239 1.669029 -0.783047 0.111387
6.400000 3.540534 -0.538652 -0.229587 1.687671 -0.758145 0.162894
6.433333 3.599524 -0.562656 -0.229433 1.702931 -0.730768 0.217031
6.466667 3.658455 -0.586313 -0.228249 1.714002 -0.700958 0.278484
6.500000 3.717296 -0.609615 -0.218342 1.719440 -0.668425 0.344802
6.533333 3.776014 -0.632552 -0.201175 1.717942 -0.633388 0.418021
6.566667 3.834579 -0.655114 -0.201847 1.708808 -0.596386 0.492786
6.600000 3.893891 -0.675268 -0.190168 1.691173 -0.557847 0.566129
6.633333 3.952987 -0.695034 -0.160090 1.663951 -0.517999 0.627014
6.666667 4.010042 -0.711633 -0.154394 1.626289 -0.477132 0.664274
6.700000 4.063910 -0.724707 -0.112110 1.578719 -0.436294 0.671067
6.733333 4.117472 -0.737384 -0.074861 1.521630 -0.396303 0.639284
6.766667 4.170700 -0.749664 -0.035265 1.455739 -0.357904 0.569376
6.800000 4.223567 -0.761550 0.014764 1.382505 -0.321587 0.460009
6.833333 4.269281 -0.770070 0.039902 1.304761 -0.288183 0.321273
6.866667 4.314589 -0.778200 0.066490 1.225056 -0.257924 0.161642
6.900000 4.354578 -0.785231 0.056350 1.145269 -0.230163 -0.002591
6.933333 4.388518 -0.791467 0.051682 1.067748 -0.204281 -0.155392
6.966667 4.416511 -0.797370 0.024416 0.994784 -0.179429 -0.285402
7.000000 4.444059 -0.802905 -0.011893 0.928277 -0.154961 -0.376207
7.033333 4.471161 -0.808080 -0.049557 0.868274 -0.129635 -0.421541
7.066667 4.497818 -0.812901 -0.095924 0.814621 -0.102673 -0.415711
7.100000 4.524029 -0.817377 -0.108486 0.766646 -0.073779 -0.365213
7.133333 4.547757 -0.820198 -0.129792 0.722902 -0.042697 -0.277350
7.166667 4.571042 -0.822691 -0.137662 0.680908 -0.009630 -0.163339
7.200000 4.593977 -0.823252 -0.142270 0.638131 0.024763 -0.041697
7.233333 4.616115 -0.821483 -0.132020 0.593153 0.059189 0.072326
7.266667 4.637822 -0.819419 -0.120912 0.545330 0.092211 0.165864
7.300000 4.657856 -0.815026 -0.106729 0.494785 0.122137 0.230854
7.333333 4.675296 -0.808619 -0.072404 0.442383 0.147133 0.260642
7.366667 4.689207 -0.800684 -0.043524 0.390252 0.165646 0.254372
7.400000 4.698785 -0.792105 -0.041991 0.341734 0.176626 0.220459
7.433333 4.707977 -0.783318 -0.011759 0.300502 0.179272 0.167819
7.466667 4.716799 -0.774343 -0.005526 0.269672 0.173246 0.108779
7.500000 4.721402 -0.766452 -0.012969 0.251899 0.159053 0.056169
7.533333 4.722868 -0.760129 -0.027166 0.249002 0.137901 0.022640
7.566667 4.724025 -0.753674 -0.033813 0.262480 0.110927 0.018511
7.600000 4.726233 -0.749624 -0.050103 0.291630 0.079613 0.041766
7.633333 4.731539 -0.747802 -0.067485 0.334177 0.045876 0.090412
7.666667 4.741803 -0.748114 -0.073703 0.387506 0.011607 0.153035
7.700000 4.751833 -0.748349 -0.095692 0.448793 -0.021936 0.215764
7.733333 4.768689 -0.750548 -0.082984 0.514764 -0.053948 0.260475
7.766667 4.793185 -0.755103 -0.046102 0.580359 -0.083028 0.272453
7.800000 4.817463 -0.759608 0.005356 0.641659 -0.108405 0.245531
7.833333 4.841519 -0.764067 0.045960 0.695593 -0.129682 0.178181
7.866667 4.865350 -0.768485 0.074929 0.739625 -0.146631 0.078381
7.900000 4.895408 -0.775111 0.089970 0.770897 -0.158607 -0.040673
7.933333 4.925227 -0.781705 0.081410 0.787971 -0.165166 -0.157343
7.966667 4.954798 -0.788270 0.070307 0.791928 -0.166538 -0.253916
8.000000 4.984111 -0.794808 0.044989 0.783755 -0.162752 -0.315640
8.033333 5.013872 -0.802105 -0.015813 0.765065 -0.154026 -0.335864
8.066667 5.043355 -0.809379 -0.093709 0.737728 -0.140813 -0.312985
8.100000 5.068825 -0.815141 -0.139159 0.705334 -0.124339 -0.252536
8.133333 5.093999 -0.820884 -0.157430 0.670891 -0.105669 -0.168198
8.166667 5.114433 -0.824015 -0.129255 0.636958 -0.086422 -0.074580
8.200000 5.130488 -0.824678 -0.087954 0.606578 -0.068733 0.011703
8.233333 5.146241 -0.825336 -0.040261 0.582123 -0.054956 0.075805
8.266667 5.161697 -0.825996 -0.013522 0.565617 -0.047236 0.105494
8.300000 5.177305 -0.824673 0.001574 0.557245 -0.047444 0.092549
8.333333 5.192619 -0.823370 0.006087 0.557179 -0.057445 0.036972
8.366667 5.210234 -0.822270 -0.006043 0.564231 -0.077823 -0.053898
8.400000 5.227558 -0.821210 -0.020919 0.576231 -0.108117 -0.166079
8.433333 5.247773 -0.822716 -0.028656 0.590865 -0.146930 -0.285014
8.466667 5.267692 -0.824280 -0.049914 0.605818 -0.192859 -0.397994
8.500000 5.289919 -0.829849 -0.062296 0.619313 -0.243557 -0.490542
8.533333 5.313607 -0.839233 -0.090989 0.629428 -0.296359 -0.552166
8.566667 5.337149 -0.852659 -0.111685 0.635251 -0.348840 -0.580682
8.600000 5.360363 -0.866144 -0.118003 0.636360 -0.399093 -0.579641
8.633333 5.381961 -0.884744 -0.158808 0.632948 -0.445561 -0.545936
8.666667 5.403214 -0.903386 -0.195524 0.625109 -0.486613 -0.481311
8.700000 5.424117 -0.922057 -0.226918 0.613383 -0.521245 -0.390226
8.733333 5.444660 -0.940745 -0.243814 0.598431 -0.548840 -0.280858
8.766667 5.464838 -0.959439 -0.262320 0.580729 -0.569432 -0.156578
8.800000 5.484644 -0.978126 -0.260212 0.560758 -0.583068 -0.019921
8.833333 5.502788 -0.999641 -0.248377 0.538434 -0.589701 0.116248
8.866667 5.520547 -1.021122 -0.230630 0.513891 -0.589445 0.244829
8.900000 5.537915 -1.042553 -0.223112 0.487062 -0.582631 0.361880
8.933333 5.554887 -1.063919 -0.206068 0.458092 -0.569778 0.466587
8.966667 5.570942 -1.085434 -0.162750 0.427133 -0.550671 0.554670
9.000000 5.585316 -1.105946 -0.140592 0.394446 -0.525176 0.625360
9.033333 5.598560 -1.124538 -0.121182 0.360974 -0.493908 0.681527
9.066667 5.609232 -1.140047 -0.102081 0.327737 -0.457659 0.724616
9.100000 5.619494 -1.155422 -0.085361 0.295694 -0.417077 0.752260
9.133333 5.629346 -1.170654 -0.064921 0.265623 -0.372565 0.762050
9.166667 5.635462 -1.180269 -0.028454 0.238541 -0.325809 0.752915
9.200000 5.641175 -1.189728 -0.001518 0.215408 -0.278264 0.722598
9.233333 5.646488 -1.199028 0.036070 0.196450 -0.231180 0.667184
9.266667 5.651405 -1.208165 0.068925 0.181306 -0.185449 0.585064
9.300000 5.655619 -1.212453 0.103092 0.169379 -0.142639 0.480220
9.333333 5.659447 -1.216577 0.129346 0.160070 -0.104315 0.359555
9.366667 5.665517 -1.215830 0.148326 0.152017 -0.071111 0.232060
9.400000 5.671209 -1.214930 0.144278 0.143655 -0.043885 0.106037
9.433333 5.676525 -1.213883 0.141927 0.133681 -0.023380 -0.003850
9.466667 5.681466 -1.212698 0.129086 0.121422 -0.010304 -0.082627
9.500000 5.686036 -1.211382 0.099168 0.106669 -0.004000 -0.121522
9.533333 5.692119 -1.209005 0.088888 0.089060 -0.003882 -0.120277
9.566667 5.697832 -1.206513 0.053992 0.069035 -0.008900 -0.077551
9.600000 5.700496 -1.205553 0.012061 0.047416 -0.017784 0.003309
9.633333 5.699715 -1.207955 0.025801 0.025459 -0.028579 0.109055
9.666667 5.698574 -1.210259 0.052513 0.004256 -0.039290 0.218614
9.700000 5.697080 -1.212471 0.055768 -0.015333 -0.048606 0.312254
9.733333 5.695240 -1.214593 0.072825 -0.032135 -0.055058 0.381747
9.766667 5.692915 -1.218208 0.101881 -0.045358 -0.057699 0.413642
9.800000 5.690258 -1.221740 0.142319 -0.054765 -0.055700 0.395824
9.833333 5.687274 -1.225188 0.195898 -0.060968 -0.049121 0.328294
9.866667 5.683972 -1.228557 0.222875 -0.064579 -0.038310 0.225129
9.900000 5.681385 -1.230317 0.239036 -0.065991 -0.023722 0.099147
9.933333 5.678493 -1.232002 0.236354 -0.065757 -0.005896 -0.043347
9.966667 5.677102 -1.232034 0.226419 -0.064519 0.014358 -0.190748
10.000000 5.676111 -1.229962 0.181609 -0.062550 0.035881 -0.321305
10.033333 5.674829 -1.227833 0.135483 -0.059670 0.057756 -0.420814
10.066667 5.673259 -1.225654 0.127860 -0.055889 0.079118 -0.490013
10.100000 5.671404 -1.223432 0.113360 -0.051654 0.099312 -0.526549
10.133333 5.668021 -1.219298 0.065797 -0.046885 0.117083 -0.527691
10.166667 5.664094 -1.214065 0.040641 -0.041165 0.131480 -0.495203
10.200000 5.661367 -1.208130 0.040215 -0.034061 0.141643 -0.445420
10.233333 5.662033 -1.201919 0.027926 -0.025468 0.146783 -0.390608
10.266667 5.662431 -1.195718 0.014302 -0.015162 0.146172 -0.334807
10.300000 5.662561 -1.189539 0.005443 -0.002969 0.138726 -0.282881
10.333333 5.662422 -1.183394 0.006393 0.010218 0.124580 -0.242415
10.366667 5.662013 -1.177295 -0.003064 0.023308 0.103919 -0.216030
10.400000 5.661334 -1.171252 -0.002828 0.035142 0.077592 -0.198272
10.433333 5.660383 -1.165279 0.003364 0.044733 0.046398 -0.186628
10.466667 5.664297 -1.164760 -0.008598 0.050670 0.011588 -0.177818
10.500000 5.667932 -1.164328 -0.009238 0.051714 -0.025167 -0.170432
10.533333 5.672836 -1.168242 -0.026158 0.046746 -0.062549 -0.157466
10.566667 5.677445 -1.172250 -0.033563 0.034677 -0.099331 -0.136463
10.600000 5.681751 -1.176354 -0.052546 0.014171 -0.134815 -0.103658
10.633333 5.682511 -1.183639 -0.049932 -0.015463 -0.167993 -0.057827
10.666667 5.682955 -1.191017 -0.057869 -0.054048 -0.198753 -0.000847
10.700000 5.683081 -1.198485 -0.050823 -0.100928 -0.227044 0.066321
10.733333 5.682882 -1.206041 -0.063869 -0.154688 -0.253401 0.140795
10.766667 5.677108 -1.214890 -0.054452 -0.213480 -0.278324 0.218014
10.800000 5.671008 -1.223817 -0.045596 -0.274916 -0.302127 0.291834
10.833333 5.660135 -1.234016 -0.027087 -0.336717 -0.325401 0.359383
10.866667 5.645486 -1.245561 -0.013336 -0.396632 -0.348128 0.416722
10.900000 5.630528 -1.257165 0.017258 -0.452710 -0.370358 0.460898
10.933333 5.612135 -1.270246 0.033363 -0.502991 -0.391602 0.487189
10.966667 5.591020 -1.284848 0.052227 -0.546167 -0.411319 0.496306
11.000000 5.569637 -1.299481 0.068778 -0.581008 -0.428742 0.487577
11.033333 5.548002 -1.314136 0.091114 -0.606926 -0.442858 0.460127
11.066667 5.525087 -1.329841 0.113703 -0.623841 -0.452604 0.416523
11.100000 5.501822 -1.346327 0.127891 -0.631631 -0.456584 0.361360
11.133333 5.478498 -1.363375 0.146479 -0.630673 -0.453373 0.297513
11.166667 5.456052 -1.380481 0.159788 -0.621298 -0.441452 0.226956
11.200000 5.434781 -1.396863 0.154448 -0.604374 -0.419920 0.157498
11.233333 5.414194 -1.412810 0.161013 -0.580785 -0.388154 0.094883
11.266667 5.393470 -1.428692 0.161070 -0.551631 -0.345940 0.044472
11.300000 5.372622 -1.444497 0.159994 -0.518273 -0.293653 0.007801
11.333333 5.354253 -1.457172 0.152878 -0.482132 -0.232347 -0.010326
11.366667 5.338398 -1.466169 0.138052 -0.444724 -0.163888 -0.006250
11.400000 5.325035 -1.471541 0.128770 -0.407131 -0.090082 0.011750
11.433333 5.313740 -1.472779 0.134763 -0.369993 -0.013452 0.039938
11.466667 5.303925 -1.470173 0.120108 -0.333767 0.063152 0.071383
11.500000 5.295555 -1.463810 0.112465 -0.298957 0.136590 0.100909
11.533333 5.287104 -1.457370 0.143756 -0.265792 0.204216 0.120934
11.566667 5.279049 -1.447590 0.150126 -0.234062 0.264031 0.125310
11.600000 5.270852 -1.435417 0.169873 -0.203168 0.313518 0.117318
11.633333 5.263237 -1.420881 0.194858 -0.172928 0.351275 0.096529
11.666667 5.257172 -1.404103 0.194970 -0.143043 0.376546 0.066944
11.700000 5.251014 -1.387338 0.202068 -0.112668 0.389069 0.029606
11.733333 5.247277 -1.370698 0.190362 -0.081075 0.388313 -0.006990
11.766667 5.247598 -1.356421 0.188320 -0.048024 0.374199 -0.038381
11.800000 5.247798 -1.342227 0.161731 -0.014099 0.348309 -0.062082
11.833333 5.247865 -1.328135 0.152296 0.020447 0.311932 -0.073176
11.866667 5.247786 -1.314165 0.140286 0.055447 0.266261 -0.072085
11.900000 5.247548 -1.300338 0.137701 0.090140 0.212843 -0.055419
11.933333 5.252993 -1.297155 0.155342 0.123349 0.154538 -0.027976
11.966667 5.258243 -1.294146 0.159285 0.154556 0.093555 0.006444
12.000000 5.263280 -1.291317 0.163860 0.182715 0.031226 0.042482
12.033333 5.270895 -1.292578 0.153829 0.206385 -0.030654 0.075354
12.066667 5.280334 -1.296709 0.150231 0.223934 -0.089917 0.102208
12.100000 5.289490 -1.301036 0.161924 0.233967 -0.144724 0.117249
12.133333 5.300315 -1.307865 0.163348 0.235875 -0.195011 0.116875
12.166667 5.311467 -1.316863 0.178887 0.228655 -0.240360 0.099343
12.200000 5.321586 -1.328068 0.182660 0.212199 -0.280145 0.063486
12.233333 5.331313 -1.339459 0.188290 0.186389 -0.314699 0.007467
12.266667 5.340624 -1.351028 0.207868 0.151411 -0.344971 -0.068886
12.300000 5.349490 -1.362771 0.202649 0.106953 -0.372047 -0.157904
12.333333 5.349606 -1.376997 0.201049 0.053243 -0.396333 -0.251915
12.366667 5.349233 -1.391378 0.204581 -0.009369 -0.418566 -0.341746
12.400000 5.348356 -1.405904 0.193876 -0.079895 -0.439721 -0.416829
12.433333 5.346957 -1.420564 0.169582 -0.156489 -0.460172 -0.469384
12.466667 5.345021 -1.435350 0.123549 -0.237732 -0.480245 -0.488445
12.500000 5.342531 -1.450251 0.086123 -0.321346 -0.500086 -0.474523
12.533333 5.330878 -1.467032 0.035512 -0.405987 -0.519939 -0.425282
12.566667 5.312152 -1.485545 0.021264 -0.489860 -0.539784 -0.344540
12.600000 5.292851 -1.504134 0.008780 -0.571832 -0.559578 -0.236886
12.633333 5.266893 -1.524351 0.015401 -0.650883 -0.579257 -0.110392
12.666667 5.240368 -1.544613 0.008995 -0.725516 -0.598322 0.022029
12.700000 5.213285 -1.564902 0.025851 -0.794690 -0.616237 0.151222
12.733333 5.185653 -1.585203 0.039373 -0.857899 -0.632471 0.266130
12.766667 5.157481 -1.605500 0.055109 -0.915648 -0.646692 0.360321
12.800000 5.125660 -1.627829 0.083659 -0.968367 -0.658310 0.424609
12.833333 5.091418 -1.651104 0.099760 -1.017203 -0.666977 0.460074
12.866667 5.055384 -1.674920 0.115036 -1.063441 -0.672513 0.464708
12.900000 5.018402 -1.699097 0.134581 -1.107972 -0.674632 0.442552
12.933333 4.980952 -1.723173 0.169859 -1.151079 -0.672953 0.395329
12.966667 4.942169 -1.746745 0.179562 -1.192633 -0.666851 0.326847
13.000000 4.902432 -1.769102 0.199430 -1.232622 -0.656326 0.245774
13.033333 4.859154 -1.791231 0.201638 -1.270624 -0.641135 0.154554
13.066667 4.815488 -1.813183 0.219057 -1.306332 -0.621325 0.060744
13.100000 4.771457 -1.834937 0.211863 -1.339777 -0.597348 -0.030759
13.133333 4.724912 -1.855359 0.201494 -1.370567 -0.569425 -0.111867
13.166667 4.678053 -1.875548 0.196671 -1.397817 -0.537727 -0.177960
13.200000 4.630037 -1.893853 0.165829 -1.420584 -0.502124 -0.225432
13.233333 4.581740 -1.909896 0.151044 -1.438357 -0.463068 -0.251282
13.266667 4.533210 -1.925662 0.148890 -1.450292 -0.420361 -0.253906
13.300000 4.482502 -1.938999 0.124650 -1.455352 -0.373782 -0.233788
13.333333 4.431617 -1.952036 0.122926 -1.453355 -0.323589 -0.196843
13.366667 4.380994 -1.961741 0.109538 -1.444419 -0.270377 -0.147137
13.400000 4.330255 -1.971132 0.099120 -1.428773 -0.214560 -0.092982
13.433333 4.279429 -1.980202 0.096689 -1.406361 -0.155976 -0.039678
13.466667 4.231452 -1.984993 0.104607 -1.377514 -0.095441 0.005887
13.500000 4.187211 -1.985327 0.110276 -1.342730 -0.033529 0.035402
13.533333 4.142961 -1.985338 0.118435 -1.302087 0.029422 0.047230
13.566667 4.098723 -1.985032 0.129402 -1.255740 0.093247 0.036393
13.600000 4.058136 -1.978805 0.136934 -1.204076 0.157177 0.003691
13.633333 4.017601 -1.972275 0.150746 -1.147488 0.220276 -0.053097
13.666667 3.977133 -1.965452 0.152040 -1.086516 0.282159 -0.128226
13.700000 3.942238 -1.952811 0.144788 -1.021947 0.342063 -0.213513
13.733333 3.907439 -1.939907 0.134235 -0.954257 0.399186 -0.301005
13.766667 3.872748 -1.926757 0.135290 -0.884437 0.452440 -0.378577
13.800000 3.843753 -1.909925 0.107752 -0.813171 0.501298 -0.439199
13.833333 3.820690 -1.890086 0.085056 -0.741586 0.544985 -0.470173
13.866667 3.797748 -1.870067 0.061300 -0.670615 0.582624 -0.468500
13.900000 3.780510 -1.846904 0.014323 -0.601495 0.613690 -0.432152
13.933333 3.763381 -1.823614 -0.007821 -0.536305 0.637544 -0.363906
13.966667 3.746351 -1.800226 -0.039443 -0.477019 0.653452 -0.269829
14.000000 3.729410 -1.776768 -0.049808 -0.425312 0.660972 -0.158208
14.033333 3.717269 -1.752794 -0.053648 -0.382366 0.660142 -0.044677
14.066667 3.708938 -1.729320 -0.035601 -0.349502 0.650835 0.058750
14.100000 3.700653 -1.705863 -0.011083 -0.326781 0.632896 0.136651
14.133333 3.694398 -1.683513 -0.013471 -0.313606 0.606208 0.182334
14.166667 3.688698 -1.661491 0.021860 -0.308688 0.571395 0.191075
14.200000 3.682640 -1.640340 0.046209 -0.310997 0.528776 0.168361
14.233333 3.674880 -1.620989 0.058776 -0.319011 0.478640 0.124045
14.266667 3.664431 -1.604249 0.092416 -0.330724 0.421825 0.067924
14.300000 3.649518 -1.591926 0.092865 -0.344585 0.359928 0.016991
14.333333 3.634514 -1.579788 0.063025 -0.359272 0.294933 -0.024765
14.366667 3.619405 -1.567850 0.033071 -0.373938 0.228346 -0.054146
14.400000 3.605447 -1.560266 0.014819 -0.388102 0.161815 -0.075186
14.433333 3.592667 -1.557644 -0.030060 -0.402063 0.097064 -0.089509
14.466667 3.580437 -1.560350 -0.029764 -0.416875 0.035875 -0.097579
14.500000 3.568044 -1.563293 -0.010471 -0.434215 -0.021072 -0.105587
14.533333 3.555470 -1.566471 0.015651 -0.455403 -0.073275 -0.113051
14.566667 3.542701 -1.569886 0.036182 -0.481823 -0.120127 -0.119084
14.600000 3.528161 -1.576022 0.066688 -0.514077 -0.161299 -0.124322
14.633333 3.513395 -1.582391 0.072716 -0.552404 -0.197115 -0.134136
14.666667 3.495642 -1.589994 0.040322 -0.595974 -0.228545 -0.152153
14.700000 3.475179 -1.598866 -0.015395 -0.643383 -0.256120 -0.176141
14.733333 3.452024 -1.608840 -0.059046 -0.693247 -0.280386 -0.204343
14.766667 3.428608 -1.619024 -0.081350 -0.743962 -0.301853 -0.233818
14.800000 3.401169 -1.630193 -0.056621 -0.794561 -0.321157 -0.261016
14.833333 3.373465 -1.641556 -0.031031 -0.844186 -0.338541 -0.280874
14.866667 3.345497 -1.653105 -0.006944 -0.892809 -0.354060 -0.298843
14.900000 3.312117 -1.665906 -0.011254 -0.940660 -0.367819 -0.323757
14.933333 3.278478 -1.678872 -0.040933 -0.988566 -0.379931 -0.360433
14.966667 3.244589 -1.691995 -0.062192 -1.036918 -0.390502 -0.416118
15.000000 3.210455 -1.705263 -0.086086 -1.085834 -0.399468 -0.485585
15.033333 3.176083 -1.718667 -0.108032 -1.135644 -0.406705 -0.567199
15.066667 3.141481 -1.732196 -0.132086 -1.186448 -0.412003 -0.644715
15.100000 3.101453 -1.746459 -0.143039 -1.238225 -0.415134 -0.707849
15.133333 3.056623 -1.761361 -0.170677 -1.289984 -0.416028 -0.747067
15.166667 3.011602 -1.776352 -0.161471 -1.341277 -0.414543 -0.754589
15.200000 2.966408 -1.791419 -0.210239 -1.391728 -0.410517 -0.730949
15.233333 2.917774 -1.806114 -0.259301 -1.440347 -0.403827 -0.673270
15.266667 2.866701 -1.819205 -0.305570 -1.485951 -0.394492 -0.588936
15.300000 2.815523 -1.832338 -0.366235 -1.527656 -0.382781 -0.475161
15.333333 2.764264 -1.845501 -0.371973 -1.565801 -0.368843 -0.341755
15.366667 2.710431 -1.857893 -0.379753 -1.600301 -0.353155 -0.191555
15.400000 2.656571 -1.870295 -0.363097 -1.631073 -0.336190 -0.036374
15.433333 2.600186 -1.881067 -0.373920 -1.658572 -0.318613 0.113534
15.466667 2.543833 -1.891831 -0.339916 -1.683608 -0.300756 0.247812
15.500000 2.486208 -1.901047 -0.327513 -1.706660 -0.282890 0.352408
15.533333 2.428679 -1.910242 -0.294007 -1.726924 -0.265268 0.426028
15.566667 2.370325 -1.917807 -0.263842 -1.744051 -0.248016 0.465194
15.600000 2.312135 -1.925339 -0.244448 -1.757697 -0.231259 0.472790
15.633333 2.254141 -1.932833 -0.226639 -1.767451 -0.214909 0.450486
15.666667 2.193164 -1.939401 -0.210257 -1.771630 -0.199127 0.407442
15.700000 2.132454 -1.945922 -0.206254 -1.768780 -0.183818 0.350725
15.733333 2.072047 -1.952394 -0.184982 -1.758450 -0.169057 0.284790
15.766667 2.010207 -1.957877 -0.174558 -1.739998 -0.154796 0.213188
15.800000 1.949161 -1.962632 -0.174215 -1.712826 -0.141044 0.139636
15.833333 1.888531 -1.967329 -0.173619 -1.675138 -0.127980 0.067223
15.866667 1.832722 -1.970497 -0.173060 -1.626925 -0.115951 -0.004257
15.900000 1.777399 -1.973607 -0.164243 -1.568080 -0.105428 -0.073425
15.933333 1.722594 -1.976657 -0.183287 -1.497537 -0.096889 -0.134470
15.966667 1.668338 -1.979647 -0.182183 -1.414462 -0.090790 -0.183792
16.000000 1.625284 -1.981682 -0.188849 -1.318577 -0.087689 -0.214035
16.033333 1.582829 -1.983661 -0.202146 -1.211904 -0.087914 -0.216193
16.066667 1.540994 -1.985585 -0.215412 -1.096318 -0.091503 -0.185339
16.100000 1.499795 -1.987454 -0.216865 -0.973701 -0.098491 -0.119252
16.133333 1.459251 -1.989269 -0.253421 -0.847251 -0.108794 -0.022296
16.166667 1.433094 -1.992411 -0.270382 -0.721286 -0.122384 0.099763
16.200000 1.417927 -1.996669 -0.284759 -0.599980 -0.138819 0.236957
16.233333 1.403425 -2.000878 -0.282176 -0.486358 -0.157773 0.371980
16.266667 1.396808 -2.006599 -0.267625 -0.383540 -0.178686 0.492291
16.300000 1.390828 -2.012269 -0.225704 -0.294735 -0.200879 0.587453
16.333333 1.388722 -2.019622 -0.179485 -0.222606 -0.223365 0.643826
16.366667 1.387211 -2.026915 -0.103103 -0.167227 -0.244901 0.649492
16.400000 1.386248 -2.036021 -0.064077 -0.127087 -0.264064 0.599600
16.433333 1.385834 -2.045055 -0.034044 -0.100656 -0.279435 0.500231
16.466667 1.384738 -2.055733 -0.021240 -0.085088 -0.289873 0.360016
16.500000 1.382660 -2.067516 -0.013879 -0.077204 -0.294262 0.190627
16.533333 1.378807 -2.080069 -0.005195 -0.073189 -0.291857 0.011751
16.566667 1.375416 -2.092510 -0.013390 -0.070577 -0.282467 -0.150860
16.600000 1.372466 -2.104829 -0.029802 -0.068161 -0.266747 -0.282904
16.633333 1.368720 -2.115549 -0.043915 -0.064632 -0.245485 -0.377934
16.666667 1.365377 -2.126125 -0.096245 -0.059484 -0.219628 -0.432366
16.700000 1.362846 -2.133096 -0.155067 -0.052597 -0.190754 -0.445328
16.733333 1.361708 -2.136410 -0.181008 -0.044614 -0.160773 -0.421622
16.766667 1.360918 -2.139564 -0.189236 -0.036115 -0.131334 -0.372671
16.800000 1.360455 -2.142555 -0.187082 -0.027516 -0.103700 -0.308113
16.833333 1.360188 -2.143897 -0.183214 -0.019461 -0.079028 -0.233328
16.866667 1.360205 -2.145075 -0.184731 -0.012506 -0.058356 -0.158094
16.900000 1.360280 -2.145939 -0.178657 -0.006983 -0.041911 -0.093550
16.933333 1.360160 -2.146261 -0.176413 -0.002756 -0.029214 -0.043714
16.966667 1.360262 -2.146419 -0.178915 0.000289 -0.019807 -0.011548
17.000000 1.360565 -2.146413 -0.178588 0.002234 -0.013196 0.006305
17.033333 1.360892 -2.146369 -0.177874 0.003318 -0.008755 0.011592
17.066667 1.360986 -2.146637 -0.183310 0.003844 -0.005757 0.009387
17.100000 1.361218 -2.146742 -0.164861 0.004038 -0.003748 0.005848
