t x y theta dxdt dydt dthetadt
0.000000 0.000000 0.000000 2.775177 -0.086583 -0.126124 0.001812
0.033333 -0.002926 -0.004254 2.784277 -0.087104 -0.129485 0.000109
0.066667 -0.005891 -0.008623 2.778038 -0.087594 -0.132881 -0.003192
0.100000 -0.008824 -0.013100 2.789703 -0.088038 -0.136307 -0.005875
0.133333 -0.011793 -0.017695 2.779824 -0.088412 -0.139762 -0.008298
0.166667 -0.014723 -0.022398 2.783672 -0.088701 -0.143243 -0.008113
0.200000 -0.017687 -0.027222 2.786009 -0.088890 -0.146745 -0.010247
0.233333 -0.020683 -0.032169 2.774093 -0.088963 -0.150267 -0.010715
0.266667 -0.023709 -0.037240 2.777800 -0.088915 -0.153804 -0.008762
0.300000 -0.026683 -0.042419 2.771897 -0.088744 -0.157354 -0.001824
0.333333 -0.029684 -0.047725 2.781013 -0.088451 -0.160916 0.007775
0.366667 -0.032708 -0.053160 2.785485 -0.088034 -0.164490 0.016095
0.400000 -0.035669 -0.058702 2.769497 -0.087496 -0.168081 0.017819
0.433333 -0.038563 -0.064351 2.779464 -0.086840 -0.171690 -0.004378
0.466667 -0.041474 -0.070132 2.779961 -0.086078 -0.175325 -0.063362
0.500000 -0.044309 -0.076019 2.782012 -0.085220 -0.178995 -0.182876
0.533333 -0.047158 -0.082041 2.778760 -0.084279 -0.182712 -0.376669
0.566667 -0.050016 -0.088199 2.786205 -0.083256 -0.186479 -0.648102
0.600000 -0.052788 -0.094461 2.785654 -0.082140 -0.190294 -0.990909
0.633333 -0.055467 -0.100825 2.816051 -0.080932 -0.194164 -1.384202
0.666667 -0.058146 -0.107333 2.817841 -0.079627 -0.198095 -1.810861
0.700000 -0.060819 -0.113992 2.778367 -0.078228 -0.202102 -2.237125
0.733333 -0.063482 -0.120808 2.670006 -0.076728 -0.206184 -2.625658
0.766667 -0.066035 -0.127722 2.515435 -0.075134 -0.210348 -2.945293
0.800000 -0.068574 -0.134813 2.362768 -0.073455 -0.214599 -3.165111
0.833333 -0.070993 -0.141998 2.154193 -0.071691 -0.218931 -3.251405
0.866667 -0.073399 -0.149380 1.960925 -0.069824 -0.223322 -3.169250
0.900000 -0.075676 -0.156853 1.841955 -0.067838 -0.227743 -2.903948
0.933333 -0.077820 -0.164415 1.737444 -0.065749 -0.232196 -2.462365
0.966667 -0.079965 -0.172199 1.670039 -0.063567 -0.236684 -1.866826
1.000000 -0.082116 -0.180210 1.575213 -0.061306 -0.241210 -1.153675
1.033333 -0.084275 -0.188454 1.483313 -0.058948 -0.245748 -0.377481
1.066667 -0.086280 -0.196777 1.450282 -0.056514 -0.250312 0.398430
1.100000 -0.088127 -0.205178 1.460824 -0.053999 -0.254895 1.125670
1.133333 -0.089809 -0.213653 1.563646 -0.051373 -0.259471 1.762435
1.166667 -0.091489 -0.222366 1.728481 -0.048600 -0.264008 2.284001
1.200000 -0.092995 -0.231148 1.914251 -0.045667 -0.268505 2.673939
1.233333 -0.094483 -0.240162 2.077439 -0.042591 -0.272998 2.927073
1.266667 -0.095944 -0.249405 2.231198 -0.039351 -0.277485 3.056007
1.300000 -0.097370 -0.258872 2.352540 -0.035928 -0.281978 3.076171
1.333333 -0.098598 -0.268393 2.436513 -0.032297 -0.286475 3.021527
1.366667 -0.099623 -0.277963 2.534425 -0.028448 -0.290979 2.920604
1.400000 -0.100574 -0.287743 2.596166 -0.024332 -0.295439 2.806583
1.433333 -0.101311 -0.297563 2.642799 -0.019901 -0.299810 2.707437
1.466667 -0.101939 -0.307582 2.685165 -0.015128 -0.304049 2.638850
1.500000 -0.102441 -0.317792 2.765720 -0.009999 -0.308103 2.606640
1.533333 -0.102794 -0.328188 2.856424 -0.004503 -0.311918 2.597158
1.566667 -0.102977 -0.338760 2.963736 0.001394 -0.315439 2.601578
1.600000 -0.102965 -0.349502 3.079245 0.007695 -0.318642 2.600144
1.633333 -0.102734 -0.360405 -3.107427 0.014428 -0.321466 2.576871
1.666667 -0.102248 -0.371312 -2.995079 0.021623 -0.323891 2.518399
1.700000 -0.101499 -0.382218 -2.912137 0.029304 -0.325921 2.420778
1.733333 -0.100482 -0.393117 -2.821142 0.037482 -0.327585 2.286992
1.766667 -0.099173 -0.404182 -2.740421 0.046134 -0.328901 2.119499
1.800000 -0.097585 -0.415226 -2.681081 0.055266 -0.329906 1.929276
1.833333 -0.095712 -0.426245 -2.616500 0.064882 -0.330659 1.721011
1.866667 -0.093550 -0.437231 -2.572341 0.074963 -0.331187 1.498774
1.900000 -0.090983 -0.448328 -2.516626 0.085520 -0.331498 1.257101
1.933333 -0.088117 -0.459379 -2.484609 0.096606 -0.331589 0.987277
1.966667 -0.084790 -0.470512 -2.455856 0.108277 -0.331477 0.671692
2.000000 -0.080972 -0.481711 -2.431640 0.120527 -0.331140 0.288492
2.033333 -0.076839 -0.492843 -2.403216 0.133351 -0.330544 -0.175176
2.066667 -0.072389 -0.503903 -2.397865 0.146796 -0.329665 -0.723568
2.100000 -0.067616 -0.514883 -2.375890 0.160868 -0.328494 -1.353822
2.133333 -0.062218 -0.525863 -2.381051 0.175477 -0.327005 -2.048986
2.166667 -0.056162 -0.536827 -2.429820 0.190572 -0.325170 -2.777412
2.200000 -0.049774 -0.547690 -2.530083 0.206157 -0.322993 -3.493248
2.233333 -0.042671 -0.558508 -2.632972 0.222154 -0.320477 -4.158568
2.266667 -0.034832 -0.569270 -2.830279 0.238367 -0.317618 -4.735923
2.300000 -0.026654 -0.579908 -3.078757 0.254627 -0.314406 -5.183050
2.333333 -0.018135 -0.590416 2.920886 0.270885 -0.310847 -5.465922
2.366667 -0.008803 -0.600792 2.636150 0.287014 -0.306949 -5.558487
2.400000 0.001357 -0.611028 2.389705 0.302868 -0.302704 -5.455615
2.433333 0.011859 -0.621111 2.183342 0.318446 -0.298106 -5.144071
2.466667 0.022702 -0.631033 2.008602 0.333855 -0.293165 -4.631080
2.500000 0.034390 -0.640783 1.843892 0.349194 -0.287879 -3.944523
2.533333 0.046418 -0.650357 1.742819 0.364495 -0.282245 -3.122508
2.566667 0.058785 -0.659748 1.582091 0.379920 -0.276242 -2.204023
2.600000 0.071491 -0.668948 1.475000 0.395630 -0.269865 -1.226544
2.633333 0.084532 -0.677951 1.435607 0.411676 -0.263115 -0.238730
2.666667 0.098403 -0.686699 1.450544 0.428034 -0.255995 0.716540
2.700000 0.112605 -0.695235 1.523800 0.444723 -0.248513 1.608283
2.733333 0.127618 -0.703482 1.645035 0.461688 -0.240695 2.403473
2.766667 0.143427 -0.711425 1.794974 0.478720 -0.232588 3.061471
2.800000 0.159559 -0.719135 1.965773 0.495642 -0.224231 3.550799
2.833333 0.176459 -0.726516 2.113003 0.512305 -0.215664 3.853691
2.866667 0.194121 -0.733561 2.321158 0.528606 -0.206925 3.961474
2.900000 0.212530 -0.740260 2.524500 0.544361 -0.198061 3.869039
2.933333 0.231240 -0.746700 2.703880 0.559527 -0.189098 3.592088
2.966667 0.250245 -0.752873 2.851002 0.574204 -0.180034 3.160619
3.000000 0.269540 -0.758775 2.952271 0.588431 -0.170873 2.611182
3.033333 0.289528 -0.764316 3.068524 0.602252 -0.161608 1.976379
3.066667 0.309791 -0.769573 3.113413 0.615762 -0.152218 1.298530
3.100000 0.330322 -0.774540 -3.137347 0.629127 -0.142662 0.621777
3.133333 0.351469 -0.779189 -3.139027 0.642391 -0.132919 -0.019947
3.166667 0.373211 -0.783520 3.094928 0.655497 -0.122975 -0.596361
3.200000 0.395197 -0.787543 3.026138 0.668426 -0.112810 -1.087479
3.233333 0.417747 -0.791197 2.942225 0.681151 -0.102411 -1.471468
3.266667 0.440829 -0.794479 2.848092 0.693547 -0.091785 -1.742331
3.300000 0.464415 -0.797387 2.756117 0.705423 -0.080956 -1.900564
3.333333 0.488209 -0.799965 2.664541 0.716672 -0.069932 -1.948507
3.366667 0.512442 -0.802157 2.592590 0.727227 -0.058728 -1.896053
3.400000 0.537082 -0.803955 2.505099 0.736978 -0.047368 -1.753381
3.433333 0.562093 -0.805351 2.449709 0.745835 -0.035861 -1.541376
3.466667 0.587269 -0.806399 2.384557 0.753773 -0.024194 -1.275604
3.500000 0.612751 -0.807027 2.338010 0.760810 -0.012332 -0.973741
3.533333 0.638501 -0.807225 2.295836 0.766922 -0.000264 -0.654020
3.566667 0.664382 -0.807061 2.293989 0.772100 0.012042 -0.334618
3.600000 0.690382 -0.806533 2.283997 0.776384 0.024617 -0.029078
3.633333 0.716491 -0.805636 2.297702 0.779818 0.037488 0.255820
3.666667 0.742712 -0.804260 2.324588 0.782411 0.050660 0.511194
3.700000 0.769018 -0.802508 2.378415 0.784178 0.064133 0.732038
3.733333 0.795367 -0.800253 2.414841 0.785134 0.077936 0.918323
3.766667 0.821725 -0.797486 2.461167 0.785289 0.092068 1.075597
3.800000 0.848054 -0.794194 2.509894 0.784614 0.106539 1.205306
3.833333 0.874320 -0.790368 2.550393 0.783080 0.121336 1.310873
3.866667 0.900613 -0.786152 2.589816 0.780664 0.136464 1.395577
3.900000 0.926773 -0.781384 2.618746 0.777351 0.151902 1.464077
3.933333 0.952938 -0.776221 2.667422 0.773121 0.167627 1.511627
3.966667 0.978904 -0.770492 2.721159 0.767968 0.183614 1.534415
4.000000 1.004651 -0.764192 2.785074 0.761930 0.199816 1.528239
4.033333 1.030150 -0.757315 2.847227 0.755080 0.216184 1.484114
4.066667 1.055376 -0.749860 2.928045 0.747536 0.232625 1.395329
4.100000 1.080308 -0.741826 2.976731 0.739416 0.249061 1.258311
4.133333 1.104925 -0.733213 3.036207 0.730897 0.265378 1.077736
4.166667 1.129205 -0.724023 3.096164 0.722154 0.281476 0.858550
4.200000 1.153131 -0.714260 3.135085 0.713340 0.297270 0.612509
4.233333 1.176690 -0.703926 -3.133652 0.704578 0.312694 0.358109
4.266667 1.199847 -0.693073 -3.134719 0.695956 0.327718 0.116670
4.300000 1.222594 -0.681706 3.130373 0.687560 0.342317 -0.097515
4.333333 1.245231 -0.669946 3.106710 0.679384 0.356516 -0.270706
4.366667 1.267749 -0.657795 3.059933 0.671395 0.370351 -0.389567
4.400000 1.290142 -0.645254 3.022163 0.663505 0.383881 -0.449874
4.433333 1.312110 -0.632181 2.990708 0.655625 0.397167 -0.455143
4.466667 1.333937 -0.618723 2.962406 0.647611 0.410283 -0.416030
4.500000 1.355324 -0.604748 2.935687 0.639317 0.423295 -0.340866
4.533333 1.376558 -0.590394 2.929791 0.630647 0.436242 -0.242966
4.566667 1.397632 -0.575664 2.928876 0.621527 0.449147 -0.139779
4.600000 1.418542 -0.560561 2.946949 0.611955 0.462005 -0.044397
4.633333 1.438995 -0.544975 2.954603 0.601924 0.474808 0.033112
4.666667 1.458990 -0.528917 2.969977 0.591505 0.487523 0.087270
4.700000 1.478530 -0.512397 2.981737 0.580783 0.500115 0.113239
4.733333 1.497615 -0.495426 2.992585 0.569882 0.512544 0.111453
4.766667 1.516509 -0.478100 2.997133 0.558938 0.524765 0.082324
4.800000 1.534957 -0.460347 2.997854 0.548077 0.536737 0.025649
4.833333 1.552965 -0.442178 3.002765 0.537407 0.548417 -0.058225
4.866667 1.570540 -0.423607 3.002975 0.527023 0.559780 -0.172872
4.900000 1.587687 -0.404642 2.996395 0.516986 0.570799 -0.324326
4.933333 1.604625 -0.385346 2.999426 0.507291 0.581474 -0.521030
4.966667 1.621350 -0.365723 2.973636 0.497916 0.591807 -0.759621
5.000000 1.637674 -0.345746 2.962182 0.488830 0.601806 -1.031567
5.033333 1.653780 -0.325454 2.953387 0.479996 0.611481 -1.329003
5.066667 1.669667 -0.304850 2.942625 0.471343 0.620839 -1.634543
5.100000 1.685332 -0.283942 2.882256 0.462802 0.629895 -1.922517
5.133333 1.700635 -0.262735 2.801839 0.454330 0.638649 -2.168052
5.166667 1.715586 -0.241245 2.708015 0.445893 0.647100 -2.357271
5.200000 1.730310 -0.219467 2.582650 0.437443 0.655249 -2.488772
5.233333 1.744700 -0.197432 2.430949 0.428961 0.663098 -2.550384
5.266667 1.758860 -0.175120 2.283319 0.420464 0.670660 -2.540274
5.300000 1.772790 -0.152537 2.173716 0.411975 0.677936 -2.466744
5.333333 1.786402 -0.129738 2.117409 0.403512 0.684942 -2.342831
5.366667 1.799700 -0.106735 2.038982 0.395083 0.691700 -2.178462
5.400000 1.812688 -0.083539 2.012515 0.386718 0.698242 -1.976833
5.433333 1.825443 -0.060096 1.990507 0.378423 0.704588 -1.759500
5.466667 1.837899 -0.036472 1.928856 0.370199 0.710758 -1.543126
5.500000 1.850056 -0.012671 1.898849 0.362052 0.716778 -1.340290
5.533333 1.861920 0.011300 1.781730 0.353993 0.722674 -1.148207
5.566667 1.873549 0.035493 1.735562 0.346028 0.728462 -0.970184
5.600000 1.884945 0.059904 1.704078 0.338152 0.734152 -0.806352
5.633333 1.896108 0.084524 1.716709 0.330374 0.739755 -0.653634
5.666667 1.906993 0.109311 1.692150 0.322695 0.745281 -0.507902
5.700000 1.917609 0.134264 1.706036 0.315114 0.750734 -0.369175
5.733333 1.927960 0.159387 1.702574 0.307626 0.756111 -0.248269
5.766667 1.938047 0.184682 1.702574 0.300236 0.761419 -0.151424
5.800000 1.947904 0.210157 1.688986 0.292952 0.766665 -0.085274
5.833333 1.957514 0.235808 1.714119 0.285782 0.771859 -0.043306
5.866667 1.966885 0.261637 1.675170 0.278735 0.776999 -0.023182
5.900000 1.976029 0.287627 1.710105 0.271815 0.782087 -0.021191
5.933333 1.984946 0.313800 1.714822 0.265023 0.787110 -0.032645
5.966667 1.993639 0.340120 1.702879 0.258353 0.792048 -0.048960
6.000000 2.002116 0.366629 1.707811 0.251802 0.796882 -0.062494
6.033333 2.010371 0.393271 1.709518 0.245355 0.801576 -0.076605
6.066667 2.018421 0.420106 1.700866 0.239000 0.806103 -0.093643
6.100000 2.026270 0.447131 1.695880 0.232727 0.810432 -0.108384
6.133333 2.033903 0.474270 1.652070 0.226532 0.814548 -0.111285
6.166667 2.041354 0.501592 1.684218 0.220409 0.818428 -0.107429
6.200000 2.048592 0.529013 1.684218 0.214351 0.822057 -0.094789
6.233333 2.055619 0.556526 1.684218 0.208360 0.825428 -0.072497
6.266667 2.062435 0.584125 1.656614 0.202440 0.828547 -0.038086
6.300000 2.069085 0.611874 1.656614 0.196590 0.831415 0.005702
6.333333 2.075529 0.639695 1.656614 0.190810 0.834033 0.048278
6.366667 2.081769 0.667579 1.656614 0.185109 0.836414 0.093440
6.400000 2.087808 0.695519 1.668183 0.179494 0.838569 0.133588
6.433333 2.093682 0.723560 1.668183 0.173967 0.840497 0.169072
6.466667 2.099359 0.751643 1.679455 0.168529 0.842193 0.196178
6.500000 2.104879 0.779815 1.679455 0.163187 0.843658 0.213732
6.533333 2.110205 0.808014 1.724143 0.157945 0.844888 0.220474
6.566667 2.115377 0.836273 1.724143 0.152797 0.845871 0.219208
6.600000 2.120359 0.864544 1.727625 0.147735 0.846591 0.212975
6.633333 2.125154 0.892819 1.739639 0.142761 0.847042 0.199668
6.666667 2.129802 0.921119 1.755034 0.137870 0.847215 0.180896
6.700000 2.134306 0.949428 1.724394 0.133057 0.847101 0.158762
6.733333 2.138666 0.977738 1.739068 0.128313 0.846691 0.140154
6.766667 2.142847 1.006024 1.744961 0.123641 0.845983 0.120928
6.800000 2.146890 1.034284 1.753624 0.119041 0.844973 0.100926
6.833333 2.150758 1.062503 1.758571 0.114505 0.843652 0.083161
6.866667 2.154491 1.090671 1.763864 0.110035 0.842011 0.069090
6.900000 2.158055 1.118784 1.768377 0.105633 0.840044 0.054593
6.933333 2.161487 1.146823 1.769860 0.101302 0.837752 0.038272
6.966667 2.164789 1.174774 1.768369 0.097042 0.835132 0.023131
7.000000 2.167928 1.202650 1.766799 0.092853 0.832184 0.010365
7.033333 2.170941 1.230412 1.759251 0.088733 0.828917 -0.000293
7.066667 2.173796 1.258084 1.762396 0.084676 0.825349 -0.008336
7.100000 2.176529 1.285616 1.758233 0.080676 0.821486 -0.009358
7.133333 2.179142 1.312997 1.757892 0.076727 0.817339 -0.003945
7.166667 2.181637 1.340212 1.766108 0.072823 0.812925 0.004764
7.200000 2.184015 1.367251 1.757548 0.068953 0.808268 0.016598
7.233333 2.186246 1.394164 1.753875 0.065115 0.803372 0.029184
7.266667 2.188331 1.420946 1.754896 0.061309 0.798236 0.042923
7.300000 2.190304 1.447515 1.764844 0.057535 0.792865 0.053602
7.333333 2.192167 1.473860 1.761591 0.053792 0.787263 0.061556
7.366667 2.193891 1.500054 1.770901 0.050085 0.781420 0.067661
7.400000 2.195479 1.526091 1.769376 0.046423 0.775330 0.072061
7.433333 2.196959 1.551867 1.778632 0.042808 0.769003 0.075610
7.466667 2.198308 1.577473 1.781844 0.039245 0.762436 0.076121
7.500000 2.199526 1.602905 1.785348 0.035737 0.755631 0.079038
7.533333 2.200643 1.628041 1.780350 0.032291 0.748591 0.086810
7.566667 2.201660 1.652870 1.778662 0.028906 0.741334 0.103542
7.600000 2.202554 1.677506 1.789013 0.025582 0.733871 0.131765
7.633333 2.203351 1.701811 1.783426 0.022320 0.726213 0.174850
7.666667 2.204030 1.725914 1.791752 0.019118 0.718397 0.235417
7.700000 2.204591 1.749809 1.790726 0.015977 0.710441 0.310959
7.733333 2.205037 1.773492 1.799725 0.012904 0.702338 0.396248
7.766667 2.205401 1.796796 1.806345 0.009913 0.694056 0.486830
7.800000 2.205688 1.819709 1.806643 0.007021 0.685567 0.577682
7.833333 2.205865 1.842396 1.830984 0.004246 0.676829 0.663789
7.866667 2.205937 1.864852 1.874987 0.001610 0.667787 0.742991
7.900000 2.205903 1.887073 1.906581 -0.000874 0.658414 0.808585
7.933333 2.205767 1.909055 1.964808 -0.003199 0.648710 0.843287
7.966667 2.205576 1.930618 1.992417 -0.005369 0.638704 0.822532
8.000000 2.205285 1.951933 2.017008 -0.007391 0.628422 0.719452
8.033333 2.204951 1.972822 2.043112 -0.009284 0.617919 0.507303
8.066667 2.204578 1.993283 2.075808 -0.011067 0.607254 0.162179
8.100000 2.204172 2.013314 2.105867 -0.012752 0.596477 -0.330763
8.133333 2.203737 2.032916 2.131134 -0.014364 0.585649 -0.952603
8.166667 2.203281 2.052090 2.164299 -0.015922 0.574817 -1.664920
8.200000 2.202736 2.070999 2.217856 -0.017442 0.564028 -2.418202
8.233333 2.202107 2.089641 2.202417 -0.018936 0.553307 -3.152489
8.266667 2.201465 2.107862 2.051634 -0.020421 0.542684 -3.802173
8.300000 2.200741 2.125812 1.798051 -0.021910 0.532176 -4.295177
8.333333 2.199935 2.143489 1.502298 -0.023403 0.521768 -4.587249
8.366667 2.199108 2.160757 1.191919 -0.024900 0.511445 -4.655929
8.400000 2.198256 2.177619 0.940593 -0.026399 0.501197 -4.478865
8.433333 2.197377 2.194077 0.671335 -0.027902 0.491019 -4.038615
8.466667 2.196472 2.210136 0.481929 -0.029400 0.480898 -3.344876
8.500000 2.195493 2.225916 0.390317 -0.030891 0.470832 -2.434905
8.533333 2.194441 2.241416 0.372375 -0.032377 0.460836 -1.349539
8.566667 2.193318 2.256635 0.394646 -0.033853 0.450913 -0.128090
8.600000 2.192125 2.271573 0.453571 -0.035308 0.441053 1.158677
8.633333 2.190902 2.286136 0.513310 -0.036731 0.431243 2.416303
8.666667 2.189650 2.300327 0.528249 -0.038110 0.421469 3.559837
8.700000 2.188332 2.314237 0.519024 -0.039434 0.411717 4.519476
8.733333 2.186983 2.327786 0.713277 -0.040699 0.401982 5.220520
8.766667 2.185606 2.340981 1.065205 -0.041912 0.392281 5.590120
8.800000 2.184165 2.353894 1.462904 -0.043090 0.382643 5.588860
8.833333 2.182696 2.366470 1.850133 -0.044250 0.373094 5.199830
8.866667 2.181200 2.378715 2.178237 -0.045413 0.363661 4.432326
8.900000 2.179676 2.390637 2.455823 -0.046599 0.354373 3.321597
8.933333 2.178122 2.402247 2.628252 -0.047825 0.345243 1.954627
8.966667 2.176535 2.413552 2.759113 -0.049102 0.336273 0.441907
9.000000 2.174906 2.424565 2.719159 -0.050447 0.327465 -1.097336
9.033333 2.173231 2.435291 2.516659 -0.051870 0.318818 -2.526731
9.066667 2.171501 2.445742 2.195916 -0.053379 0.310330 -3.720304
9.100000 2.169710 2.455919 1.883117 -0.054984 0.301992 -4.579859
9.133333 2.167857 2.465828 1.589272 -0.056694 0.293799 -5.048936
9.166667 2.165950 2.475464 1.294618 -0.058505 0.285739 -5.090613
9.200000 2.163992 2.484830 1.037401 -0.060416 0.277801 -4.709852
9.233333 2.161983 2.493927 0.872580 -0.062422 0.269974 -3.960802
9.266667 2.159924 2.502755 0.712775 -0.064525 0.262253 -2.925440
9.300000 2.157764 2.511345 0.584751 -0.066705 0.254626 -1.695889
9.333333 2.155488 2.519704 0.478940 -0.068939 0.247079 -0.366537
9.366667 2.153166 2.527800 0.478011 -0.071225 0.239614 0.950141
9.400000 2.150797 2.535633 0.553190 -0.073553 0.232230 2.165673
9.433333 2.148267 2.543254 0.727208 -0.075918 0.224932 3.215706
9.466667 2.145694 2.550615 0.961427 -0.078311 0.217725 4.054636
9.500000 2.143078 2.557719 1.256775 -0.080744 0.210621 4.649903
9.533333 2.140280 2.564631 1.499848 -0.083236 0.203642 4.987475
9.566667 2.137443 2.571288 1.770264 -0.085790 0.196801 5.082066
9.600000 2.134567 2.577693 2.003912 -0.088399 0.190103 4.958217
9.633333 2.131653 2.583845 2.186437 -0.091053 0.183547 4.655963
9.666667 2.128703 2.589748 2.336343 -0.093748 0.177137 4.222948
9.700000 2.125577 2.595489 2.424605 -0.096470 0.170878 3.720999
9.733333 2.122281 2.601073 2.504543 -0.099192 0.164758 3.195379
9.766667 2.118823 2.606501 2.575248 -0.101871 0.158749 2.686998
9.800000 2.115335 2.611685 2.653185 -0.104482 0.152840 2.221158
9.833333 2.111819 2.616627 2.692093 -0.106996 0.147019 1.812008
9.866667 2.108167 2.621424 2.750165 -0.109367 0.141254 1.463661
9.900000 2.104389 2.626076 2.785520 -0.111549 0.135502 1.164871
9.933333 2.100588 2.630491 2.822895 -0.113521 0.129743 0.910820
9.966667 2.096767 2.634669 2.843970 -0.115292 0.123989 0.690681
10.000000 2.092851 2.638710 2.859594 -0.116857 0.118236 0.502546
10.033333 2.088850 2.642613 2.866333 -0.118208 0.112476 0.339791
10.066667 2.084835 2.646284 2.863736 -0.119360 0.106729 0.202276
10.100000 2.080810 2.649723 2.866034 -0.120339 0.101028 0.092936
10.133333 2.076728 2.653027 2.850286 -0.121154 0.095385 0.015785
10.166667 2.072640 2.656100 2.839394 -0.121797 0.089799 -0.038098
10.200000 2.068547 2.658946 2.834549 -0.122273 0.084284 -0.099809
10.233333 2.064453 2.661564 2.828349 -0.122600 0.078856 -0.205851
10.266667 2.060337 2.664045 2.827816 -0.122784 0.073518 -0.400078
10.300000 2.056210 2.666389 2.817247 -0.122821 0.068264 -0.728364
10.333333 2.052079 2.668596 2.818845 -0.122715 0.063095 -1.234792
10.366667 2.047952 2.670664 2.807974 -0.122476 0.057999 -1.931118
10.400000 2.043835 2.672510 2.812130 -0.122110 0.052947 -2.787058
10.433333 2.039729 2.674134 2.848056 -0.121619 0.047913 -3.757002
10.466667 2.035652 2.675625 2.887216 -0.121006 0.042884 -4.783100
10.500000 2.031609 2.676989 2.774371 -0.120285 0.037834 -5.784699
10.533333 2.027607 2.678229 2.462013 -0.119469 0.032729 -6.671082
10.566667 2.023626 2.679248 2.032362 -0.118569 0.027565 -7.361170
10.600000 2.019667 2.680049 1.581999 -0.117594 0.022346 -7.803443
10.633333 2.015754 2.680723 1.129760 -0.116555 0.017053 -7.948533
10.666667 2.011888 2.681269 0.750069 -0.115466 0.011667 -7.768558
10.700000 2.008050 2.681598 0.425886 -0.114329 0.006186 -7.284850
10.733333 2.004243 2.681708 0.192441 -0.113144 0.000624 -6.558426
10.766667 2.000486 2.681688 -0.053616 -0.111915 -0.005034 -5.673085
10.800000 1.996765 2.681450 -0.226655 -0.110643 -0.010798 -4.712264
10.833333 1.993080 2.680995 -0.288640 -0.109316 -0.016651 -3.771824
10.866667 1.989434 2.680323 -0.329877 -0.107910 -0.022569 -2.929406
10.900000 1.985861 2.679518 -0.311254 -0.106402 -0.028538 -2.231760
10.933333 1.982331 2.678496 -0.311052 -0.104759 -0.034553 -1.690021
10.966667 1.978845 2.677258 -0.311408 -0.102932 -0.040587 -1.302612
11.000000 1.975405 2.675804 -0.331090 -0.100877 -0.046625 -1.055785
11.033333 1.972012 2.674134 -0.367840 -0.098563 -0.052665 -0.918251
11.066667 1.968669 2.672247 -0.409968 -0.095967 -0.058719 -0.863481
11.100000 1.965376 2.670146 -0.451768 -0.093077 -0.064790 -0.867158
11.133333 1.962208 2.667877 -0.487304 -0.089905 -0.070884 -0.916647
11.166667 1.959175 2.665432 -0.513864 -0.086481 -0.077023 -0.998195
11.200000 1.956285 2.662800 -0.554605 -0.082853 -0.083226 -1.100076
11.233333 1.953551 2.659970 -0.572947 -0.079061 -0.089515 -1.218861
11.266667 1.950981 2.656930 -0.594868 -0.075161 -0.095908 -1.344690
11.300000 1.948585 2.653667 -0.616051 -0.071213 -0.102427 -1.462869
11.333333 1.946370 2.650169 -0.646329 -0.067260 -0.109089 -1.555763
11.366667 1.944215 2.646456 -0.688631 -0.063334 -0.115898 -1.604636
11.400000 1.942239 2.642491 -0.771432 -0.059467 -0.122843 -1.596530
11.433333 1.940324 2.638312 -0.882795 -0.055687 -0.129903 -1.518673
11.466667 1.938471 2.633919 -1.002272 -0.052006 -0.137050 -1.367122
11.500000 1.936775 2.629261 -1.109695 -0.048425 -0.144255 -1.149402
11.533333 1.935229 2.624337 -1.168439 -0.044948 -0.151484 -0.877629
11.566667 1.933828 2.619147 -1.192156 -0.041593 -0.158700 -0.569063
11.600000 1.932569 2.613693 -1.177599 -0.038367 -0.165875 -0.247531
11.633333 1.931372 2.608029 -1.124604 -0.035276 -0.172985 0.058302
11.666667 1.930302 2.602109 -1.089034 -0.032340 -0.180005 0.321780
11.700000 1.929349 2.595940 -1.047394 -0.029578 -0.186912 0.523503
11.733333 1.928457 2.589561 -1.000115 -0.027003 -0.193699 0.651992
11.766667 1.927627 2.582975 -0.963415 -0.024608 -0.200368 0.701835
11.800000 1.926886 2.576150 -0.921936 -0.022390 -0.206927 0.678703
11.833333 1.926205 2.569120 -0.901753 -0.020348 -0.213384 0.599064
11.866667 1.925585 2.561883 -0.890234 -0.018473 -0.219756 0.476829
11.900000 1.925023 2.554442 -0.872343 -0.016757 -0.226061 0.323824
11.933333 1.924520 2.546798 -0.865528 -0.015194 -0.232313 0.148073
11.966667 1.924075 2.538950 -0.855029 -0.013789 -0.238518 -0.049658
12.000000 1.923687 2.530902 -0.853887 -0.012543 -0.244684 -0.274577
12.033333 1.923330 2.522638 -0.864028 -0.011452 -0.250816 -0.545288
12.066667 1.922997 2.514163 -0.879791 -0.010507 -0.256912 -0.875302
12.100000 1.922720 2.505490 -0.908790 -0.009699 -0.262969 -1.273860
12.133333 1.922453 2.496612 -0.944814 -0.009009 -0.268984 -1.743875
12.166667 1.922190 2.487532 -0.960062 -0.008419 -0.274952 -2.278722
12.200000 1.921929 2.478252 -1.011429 -0.007904 -0.280872 -2.859444
12.233333 1.921665 2.468774 -1.082785 -0.007441 -0.286744 -3.449672
12.266667 1.921396 2.459103 -1.176051 -0.007009 -0.292572 -4.010034
12.300000 1.921180 2.449240 -1.329344 -0.006589 -0.298363 -4.500639
12.333333 1.920958 2.439190 -1.537974 -0.006170 -0.304131 -4.886898
12.366667 1.920731 2.428955 -1.799724 -0.005733 -0.309888 -5.133688
12.400000 1.920555 2.418533 -2.068967 -0.005270 -0.315645 -5.220030
12.433333 1.920377 2.407925 -2.335554 -0.004767 -0.321406 -5.140943
12.466667 1.920249 2.397132 -2.543681 -0.004219 -0.327179 -4.901898
12.500000 1.920120 2.386145 -2.741300 -0.003607 -0.332966 -4.515111
12.533333 1.919990 2.374959 -2.907220 -0.002908 -0.338760 -3.998054
12.566667 1.919862 2.363568 -3.009938 -0.002105 -0.344554 -3.382821
12.600000 1.919783 2.352000 -3.074822 -0.001176 -0.350345 -2.700730
12.633333 1.919717 2.340215 -3.135349 -0.000104 -0.356139 -1.979799
12.666667 1.919672 2.328209 3.110156 0.001136 -0.361936 -1.249320
12.700000 1.919680 2.316022 3.068934 0.002547 -0.367739 -0.537222
12.733333 1.919734 2.303665 3.032091 0.004119 -0.373550 0.126771
12.766667 1.919836 2.291139 3.014163 0.005839 -0.379381 0.721058
12.800000 1.920020 2.278417 3.050642 0.007691 -0.385238 1.225147
12.833333 1.920294 2.265497 3.129545 0.009642 -0.391114 1.614418
12.866667 1.920666 2.252380 -3.015225 0.011652 -0.397002 1.874137
12.900000 1.921083 2.239101 -2.879646 0.013689 -0.402898 1.988210
12.933333 1.921584 2.225581 -2.740977 0.015727 -0.408797 1.952385
12.966667 1.922169 2.211824 -2.609061 0.017738 -0.414673 1.772698
13.000000 1.922836 2.197832 -2.537410 0.019692 -0.420492 1.469337
13.033333 1.923546 2.183689 -2.453492 0.021579 -0.426233 1.076574
13.066667 1.924298 2.169396 -2.409314 0.023402 -0.431874 0.633126
13.100000 1.925121 2.154881 -2.430378 0.025161 -0.437389 0.187702
13.133333 1.926010 2.140148 -2.465114 0.026859 -0.442750 -0.217653
13.166667 1.926939 2.125275 -2.545399 0.028509 -0.447949 -0.546870
13.200000 1.927931 2.110198 -2.609756 0.030128 -0.452992 -0.785354
13.233333 1.928959 2.094985 -2.693537 0.031722 -0.457873 -0.930832
13.266667 1.930052 2.079584 -2.748183 0.033286 -0.462580 -0.999719
13.300000 1.931181 2.064053 -2.788410 0.034824 -0.467113 -1.031624
13.333333 1.932343 2.048396 -2.820484 0.036343 -0.471475 -1.070816
13.366667 1.933579 2.032575 -2.836130 0.037848 -0.475654 -1.173444
13.400000 1.934891 2.016598 -2.842209 0.039349 -0.479639 -1.380045
13.433333 1.936233 2.000504 -2.842630 0.040859 -0.483420 -1.720319
13.466667 1.937655 1.984271 -2.840476 0.042396 -0.486996 -2.198277
13.500000 1.939105 1.967927 -2.829085 0.043964 -0.490364 -2.790765
13.533333 1.940582 1.951475 -2.854537 0.045558 -0.493521 -3.448165
13.566667 1.942084 1.934918 -2.950980 0.047164 -0.496479 -4.093414
13.600000 1.943612 1.918260 -3.100349 0.048768 -0.499256 -4.640580
13.633333 1.945219 1.901501 2.927938 0.050353 -0.501867 -4.999761
13.666667 1.946927 1.884693 2.631738 0.051903 -0.504331 -5.101793
13.700000 1.948735 1.867836 2.297808 0.053400 -0.506673 -4.888198
13.733333 1.950640 1.850930 1.986803 0.054825 -0.508913 -4.343477
13.766667 1.952561 1.833937 1.704235 0.056165 -0.511068 -3.489066
13.800000 1.954498 1.816862 1.519065 0.057397 -0.513150 -2.386742
13.833333 1.956448 1.799708 1.358318 0.058500 -0.515175 -1.125259
13.866667 1.958411 1.782478 1.363128 0.059463 -0.517147 0.192172
13.900000 1.960384 1.765176 1.463221 0.060294 -0.519062 1.453665
13.933333 1.962423 1.747822 1.696266 0.061005 -0.520909 2.561315
13.966667 1.964527 1.730421 1.968559 0.061605 -0.522680 3.434863
14.000000 1.966635 1.712956 2.222403 0.062105 -0.524369 4.030786
14.033333 1.968746 1.695431 2.460601 0.062520 -0.525966 4.327370
14.066667 1.970859 1.677850 2.660246 0.062848 -0.527469 4.345299
14.100000 1.972971 1.660215 2.831783 0.063079 -0.528885 4.119768
14.133333 1.975081 1.642530 2.975067 0.063208 -0.530221 3.711521
14.166667 1.977186 1.624798 3.085781 0.063236 -0.531476 3.190704
14.200000 1.979315 1.607046 3.139485 0.063164 -0.532650 2.620765
14.233333 1.981462 1.589279 -3.069864 0.062990 -0.533743 2.057439
14.266667 1.983599 1.571474 -3.020614 0.062715 -0.534754 1.528811
14.300000 1.985714 1.553619 -2.999780 0.062342 -0.535671 1.052226
14.333333 1.987801 1.535722 -2.993711 0.061871 -0.536484 0.617287
14.366667 1.989873 1.517796 -3.000341 0.061303 -0.537182 0.197564
14.400000 1.991926 1.499845 -3.004748 0.060644 -0.537751 -0.241097
14.433333 1.993961 1.481872 -3.035523 0.059907 -0.538175 -0.726689
14.466667 1.995974 1.463882 -3.041532 0.059107 -0.538441 -1.273836
14.500000 1.997943 1.445883 -3.046113 0.058257 -0.538543 -1.889398
14.533333 1.999870 1.427882 -3.055008 0.057369 -0.538478 -2.560053
14.566667 2.001753 1.409887 -3.073495 0.056452 -0.538251 -3.257449
14.600000 2.003607 1.391887 3.138966 0.055513 -0.537873 -3.943387
14.633333 2.005442 1.373952 2.989589 0.054550 -0.537356 -4.573656
14.666667 2.007245 1.356018 2.756100 0.053560 -0.536712 -5.107564
14.700000 2.009029 1.338156 2.453170 0.052535 -0.535960 -5.492111
14.733333 2.010777 1.320300 2.161487 0.051462 -0.535122 -5.681644
14.766667 2.012489 1.302454 1.854991 0.050323 -0.534211 -5.637314
14.800000 2.014162 1.284620 1.637589 0.049100 -0.533244 -5.332794
14.833333 2.015804 1.266849 1.412583 0.047771 -0.532232 -4.757834
14.866667 2.017408 1.249140 1.233721 0.046316 -0.531195 -3.922441
14.900000 2.018969 1.231451 1.078161 0.044709 -0.530140 -2.871331
14.933333 2.020485 1.213785 0.953864 0.042928 -0.529069 -1.665077
14.966667 2.021927 1.196170 0.875910 0.040961 -0.527992 -0.375699
15.000000 2.023284 1.178599 0.827904 0.038788 -0.526919 0.925231
15.033333 2.024591 1.161060 0.890355 0.036394 -0.525855 2.155897
15.066667 2.025848 1.143555 1.046100 0.033779 -0.524794 3.247155
15.100000 2.026975 1.126081 1.227976 0.030950 -0.523733 4.148581
15.133333 2.028049 1.108648 1.506599 0.027908 -0.522672 4.819847
15.166667 2.028983 1.091242 1.823189 0.024665 -0.521600 5.235277
15.200000 2.029773 1.073864 2.106589 0.021250 -0.520500 5.381679
15.233333 2.030417 1.056513 2.365622 0.017711 -0.519355 5.279579
15.266667 2.031004 1.039213 2.579276 0.014077 -0.518158 4.964882
15.300000 2.031437 1.021945 2.750895 0.010372 -0.516903 4.482838
15.333333 2.031712 1.004712 2.889653 0.006637 -0.515584 3.891550
15.366667 2.031823 0.987517 2.982074 0.002894 -0.514204 3.252525
15.400000 2.031873 0.970384 3.047137 -0.000867 -0.512774 2.624491
15.433333 2.031752 0.953296 3.087724 -0.004669 -0.511310 2.045802
15.466667 2.031457 0.936259 3.110893 -0.008502 -0.509818 1.543203
15.500000 2.031102 0.919291 3.130138 -0.012357 -0.508298 1.128965
15.533333 2.030686 0.902395 3.132748 -0.016228 -0.506750 0.806502
15.566667 2.030211 0.885573 -3.126758 -0.020101 -0.505165 0.566436
15.600000 2.029545 0.868776 -3.125864 -0.023924 -0.503522 0.392125
15.633333 2.028692 0.852007 -3.108421 -0.027646 -0.501797 0.271709
15.666667 2.027657 0.835273 -3.121282 -0.031235 -0.499970 0.192815
15.700000 2.026445 0.818578 -3.135041 -0.034653 -0.498018 0.144264
15.733333 2.025062 0.801926 -3.113587 -0.037854 -0.495918 0.111376
15.766667 2.023621 0.785365 -3.113432 -0.040793 -0.493648 0.088233
15.800000 2.022126 0.768897 -3.104158 -0.043462 -0.491201 0.070095
15.833333 2.020576 0.752527 -3.104719 -0.045866 -0.488576 0.048321
15.866667 2.018972 0.736256 -3.108940 -0.048023 -0.485777 0.015924
15.900000 2.017316 0.720087 -3.112807 -0.049969 -0.482818 -0.030263
15.933333 2.015609 0.704022 -3.118028 -0.051762 -0.479715 -0.084003
15.966667 2.013853 0.688066 -3.088433 -0.053458 -0.476487 -0.147323
16.000000 2.012047 0.672219 -3.064805 -0.055096 -0.473145 -0.220383
16.033333 2.010193 0.656486 -3.098123 -0.056698 -0.469698 -0.292901
16.066667 2.008294 0.640867 -3.114897 -0.058278 -0.466153 -0.360941
16.100000 2.006349 0.625367 -3.134665 -0.059838 -0.462512 -0.413581
16.133333 2.004310 0.609967 3.132306 -0.061367 -0.458779 -0.453526
16.166667 2.002202 0.594717 3.092786 -0.062849 -0.454957 -0.475321
16.200000 2.000054 0.579592 3.091587 -0.064273 -0.451050 -0.471852
16.233333 1.997865 0.564595 3.030404 -0.065629 -0.447054 -0.448794
16.266667 1.995630 0.549760 3.030404 -0.066905 -0.442968 -0.408870
16.300000 1.993358 0.535058 3.023374 -0.068089 -0.438791 -0.364708
16.333333 1.991051 0.520490 3.000224 -0.069180 -0.434525 -0.318106
16.366667 1.988710 0.506060 3.000224 -0.070179 -0.430159 -0.273025
16.400000 1.986338 0.491770 3.000224 -0.071087 -0.425693 -0.236437
16.433333 1.983934 0.477621 3.016454 -0.071908 -0.421130 -0.213129
16.466667 1.981502 0.463616 3.016454 -0.072647 -0.416462 -0.199559
16.500000 1.979042 0.449757 2.989053 -0.073302 -0.411678 -0.188214
16.533333 1.976572 0.436092 3.005165 -0.073873 -0.406768 -0.181237
16.566667 1.974095 0.422623 2.981480 -0.074357 -0.401731 -0.174850
16.600000 1.971596 0.409306 2.979314 -0.074752 -0.396565 -0.169902
16.633333 1.969075 0.396143 2.950081 -0.075057 -0.391266 -0.158826
16.666667 1.966535 0.383136 2.932555 -0.075273 -0.385843 -0.144413
16.700000 1.964001 0.370337 2.945881 -0.075409 -0.380317 -0.131284
16.733333 1.961450 0.357697 2.943626 -0.075470 -0.374698 -0.112944
16.766667 1.958913 0.345273 2.944084 -0.075458 -0.368993 -0.098760
16.800000 1.956390 0.333062 2.965485 -0.075375 -0.363208 -0.084669
16.833333 1.953884 0.321073 2.947828 -0.075228 -0.357355 -0.075058
16.866667 1.951368 0.309248 2.933266 -0.075019 -0.351439 -0.068733
16.900000 1.948872 0.297648 2.969445 -0.074745 -0.345453 -0.064550
16.933333 1.946369 0.286216 2.935272 -0.074407 -0.339405 -0.063276
16.966667 1.943891 0.275011 2.927792 -0.074008 -0.333300 -0.059635
17.000000 1.941409 0.263976 2.921766 -0.073551 -0.327148 -0.053092
17.033333 1.938924 0.253112 2.921307 -0.073039 -0.320952 -0.043356
17.066667 1.936470 0.242478 2.930029 -0.072472 -0.314718 -0.033998
17.100000 1.934049 0.232078 2.924489 -0.071857 -0.308456 -0.021420
17.133333 1.931663 0.221913 2.932876 -0.071197 -0.302179 -0.012302
17.166667 1.929315 0.211985 2.921861 -0.070500 -0.295899 -0.005405
17.200000 1.926970 0.202231 2.923231 -0.069769 -0.289624 -0.002582
17.233333 1.924667 0.192715 2.935813 -0.069008 -0.283366 -0.004660
17.266667 1.922370 0.183374 2.945072 -0.068217 -0.277129 -0.008363
17.300000 1.920118 0.174271 2.929046 -0.067398 -0.270922 -0.013876
17.333333 1.917874 0.165343 2.935411 -0.066548 -0.264738 -0.018423
17.366667 1.915640 0.156590 2.929978 -0.065660 -0.258571 -0.023086
17.400000 1.913451 0.148065 2.916211 -0.064737 -0.252424 -0.028698
17.433333 1.911304 0.139765 2.920440 -0.063782 -0.246300 -0.031065
17.466667 1.909171 0.131640 2.924551 -0.062801 -0.240207 -0.029548
17.500000 1.907082 0.123734 2.917308 -0.061799 -0.234152 -0.028568
17.533333 1.905036 0.116044 2.934244 -0.060785 -0.228146 -0.027550
17.566667 1.903036 0.108566 2.920314 -0.059769 -0.222208 -0.025092
17.600000 1.901079 0.101298 2.907971 -0.058754 -0.216343 -0.018245
17.633333 1.899166 0.094236 2.932852 -0.057738 -0.210553 -0.014098
17.666667 1.897272 0.087347 2.920561 -0.056720 -0.204841 -0.011819
17.700000 1.895397 0.080631 2.918221 -0.055698 -0.199205 -0.009010
17.733333 1.893542 0.074086 2.913206 -0.054668 -0.193642 -0.004545
17.766667 1.891708 0.067711 2.919716 -0.053624 -0.188143 -0.001021
17.800000 1.889918 0.061528 2.910763 -0.052563 -0.182702 -0.001936
17.833333 1.888172 0.055532 2.922542 -0.051484 -0.177315 -0.000252
17.866667 1.886468 0.049722 2.913318 -0.050387 -0.171979 0.003358
17.900000 1.884807 0.044095 2.918623 -0.049276 -0.166693 0.005411
17.933333 1.883189 0.038646 2.943626 -0.048155 -0.161463 0.005661
17.966667 1.881614 0.033374 2.914515 -0.047034 -0.156293 0.006973
18.000000 1.880083 0.028275 2.907656 -0.045922 -0.151191 0.009683
18.033333 1.878577 0.023339 2.931243 -0.044825 -0.146160 0.010245
18.066667 1.877098 0.018566 2.906072 -0.043745 -0.141204 0.009889
18.100000 1.875662 0.013956 2.916800 -0.042684 -0.136322 0.010433
