t x y theta dxdt dydt dthetadt
0.000000 0.000000 0.000000 1.061312 0.019763 0.033631 -0.002332
0.033333 0.000677 0.001110 1.049793 0.020455 0.038622 -0.002016
0.066667 0.001418 0.002346 1.062808 0.021140 0.044108 -0.002216
0.100000 0.002098 0.003819 1.054141 0.021819 0.050159 -0.002369
0.133333 0.002839 0.005461 1.061845 0.022503 0.056838 -0.001584
0.166667 0.003647 0.007296 1.047766 0.023199 0.064199 0.000519
0.200000 0.004384 0.009386 1.067642 0.023902 0.072277 0.001713
0.233333 0.005185 0.011745 1.059687 0.024593 0.081079 0.001075
0.266667 0.006051 0.014410 1.058012 0.025235 0.090562 0.000607
0.300000 0.006834 0.017348 1.063611 0.025767 0.100658 -0.002006
0.333333 0.007680 0.020654 1.063287 0.026127 0.111307 -0.006074
0.366667 0.008586 0.024382 1.055808 0.026266 0.122502 -0.017833
0.400000 0.009550 0.028561 1.063001 0.026137 0.134230 -0.040906
0.433333 0.010576 0.033263 1.055997 0.025703 0.146474 -0.084822
0.466667 0.011660 0.038522 1.055802 0.024943 0.159228 -0.156373
0.500000 0.012636 0.044085 1.057909 0.023848 0.172501 -0.262027
0.533333 0.013501 0.049957 1.053436 0.022419 0.186301 -0.409049
0.566667 0.014251 0.056142 1.062945 0.020644 0.200535 -0.600856
0.600000 0.014881 0.062644 1.055760 0.018540 0.215141 -0.834302
0.633333 0.015386 0.069467 1.046033 0.016136 0.230146 -1.105306
0.666667 0.015916 0.077296 1.037658 0.013464 0.245617 -1.412347
0.700000 0.016466 0.086198 0.985242 0.010535 0.261605 -1.748013
0.733333 0.016879 0.095430 0.896856 0.007348 0.278073 -2.104210
0.766667 0.017148 0.104992 0.806378 0.003888 0.295077 -2.467785
0.800000 0.017270 0.114887 0.719478 0.000115 0.312692 -2.833898
0.833333 0.017241 0.125116 0.611672 -0.004028 0.330862 -3.189731
0.866667 0.017143 0.136494 0.511795 -0.008605 0.349480 -3.524926
0.900000 0.016884 0.148207 0.374253 -0.013670 0.368499 -3.833186
0.933333 0.016460 0.160256 0.238016 -0.019266 0.387938 -4.115116
0.966667 0.015873 0.173332 0.092828 -0.025442 0.407700 -4.373250
1.000000 0.015084 0.187379 -0.065170 -0.032213 0.427559 -4.605355
1.033333 0.014044 0.202341 -0.233159 -0.039586 0.447300 -4.819195
1.066667 0.012821 0.217633 -0.407183 -0.047528 0.466769 -5.013605
1.100000 0.011267 0.233725 -0.588958 -0.055964 0.485697 -5.186237
1.133333 0.009338 0.250586 -0.780328 -0.064845 0.503756 -5.321650
1.166667 0.007215 0.267766 -0.921752 -0.074123 0.520693 -5.408581
1.200000 0.004645 0.285680 -1.109892 -0.083748 0.536368 -5.429221
1.233333 0.001588 0.304270 -1.293080 -0.093705 0.550670 -5.362583
1.266667 -0.001672 0.323164 -1.512475 -0.104006 0.563456 -5.188731
1.300000 -0.005482 0.342603 -1.723584 -0.114730 0.574636 -4.891970
1.333333 -0.009500 0.362336 -1.934699 -0.125893 0.584246 -4.465135
1.366667 -0.013727 0.382356 -2.127622 -0.137453 0.592359 -3.899227
1.400000 -0.018167 0.402656 -2.314561 -0.149440 0.599036 -3.202908
1.433333 -0.022819 0.423231 -2.443904 -0.161860 0.604409 -2.389341
1.466667 -0.028218 0.443751 -2.530630 -0.174676 0.608637 -1.484135
1.500000 -0.034376 0.464123 -2.577458 -0.187776 0.611991 -0.522998
1.533333 -0.040751 0.484750 -2.553655 -0.201096 0.614683 0.454534
1.566667 -0.047911 0.505172 -2.501250 -0.214575 0.616942 1.406390
1.600000 -0.055288 0.525838 -2.418963 -0.228064 0.619016 2.293020
1.633333 -0.063417 0.546268 -2.291248 -0.241330 0.621168 3.076603
1.666667 -0.071761 0.566932 -2.123919 -0.254221 0.623642 3.720968
1.700000 -0.080316 0.587824 -1.953742 -0.266655 0.626558 4.208311
1.733333 -0.089497 0.608615 -1.767624 -0.278483 0.630060 4.522874
1.766667 -0.099247 0.629370 -1.558816 -0.289608 0.634205 4.650899
1.800000 -0.109202 0.650337 -1.336544 -0.299944 0.639064 4.587332
1.833333 -0.119586 0.671458 -1.186679 -0.309487 0.644644 4.341676
1.866667 -0.130347 0.692826 -0.985054 -0.318195 0.650906 3.932406
1.900000 -0.141409 0.714555 -0.805892 -0.325975 0.657857 3.376634
1.933333 -0.152664 0.736475 -0.664044 -0.332806 0.665473 2.701673
1.966667 -0.164108 0.758581 -0.549458 -0.338692 0.673741 1.941874
2.000000 -0.175615 0.781279 -0.499878 -0.343685 0.682550 1.137526
2.033333 -0.187304 0.804151 -0.488783 -0.347874 0.691747 0.319560
2.066667 -0.199169 0.827191 -0.514563 -0.351369 0.701225 -0.477169
2.100000 -0.211208 0.850392 -0.580447 -0.354340 0.710848 -1.219685
2.133333 -0.223162 0.874213 -0.672732 -0.356983 0.720425 -1.881747
2.166667 -0.235023 0.898600 -0.773264 -0.359505 0.729744 -2.442821
2.200000 -0.247046 0.923127 -0.894423 -0.362099 0.738661 -2.891261
2.233333 -0.259038 0.948130 -1.024776 -0.364962 0.747028 -3.223172
2.266667 -0.271036 0.973537 -1.156798 -0.368312 0.754652 -3.437871
2.300000 -0.283184 0.999062 -1.306128 -0.372358 0.761321 -3.537296
2.333333 -0.295442 1.024879 -1.461752 -0.377222 0.766911 -3.526178
2.366667 -0.307843 1.050795 -1.567169 -0.382948 0.771377 -3.410067
2.400000 -0.320383 1.076801 -1.702499 -0.389542 0.774677 -3.194629
2.433333 -0.333189 1.102962 -1.832610 -0.396914 0.776850 -2.879827
2.466667 -0.346301 1.129208 -1.945867 -0.404912 0.778008 -2.473390
2.500000 -0.359762 1.155449 -2.053103 -0.413350 0.778312 -1.984569
2.533333 -0.373611 1.181622 -2.130382 -0.422079 0.777923 -1.424716
2.566667 -0.387890 1.207674 -2.196614 -0.430967 0.776977 -0.808805
2.600000 -0.402626 1.233536 -2.216745 -0.439871 0.775618 -0.155051
2.633333 -0.417850 1.259182 -2.208294 -0.448710 0.774000 0.512805
2.666667 -0.433175 1.284847 -2.188749 -0.457396 0.772258 1.173771
2.700000 -0.448593 1.310524 -2.110266 -0.465840 0.770508 1.801546
2.733333 -0.464097 1.336205 -2.020620 -0.473934 0.768832 2.374704
2.766667 -0.479683 1.361880 -1.905524 -0.481630 0.767337 2.874917
2.800000 -0.495787 1.387421 -1.778206 -0.488899 0.766154 3.286401
2.833333 -0.512385 1.412867 -1.616670 -0.495681 0.765332 3.598214
2.866667 -0.529440 1.438250 -1.458854 -0.501903 0.764914 3.801620
2.900000 -0.546547 1.463596 -1.330267 -0.507497 0.765000 3.897549
2.933333 -0.563696 1.488895 -1.162920 -0.512391 0.765757 3.886524
2.966667 -0.581197 1.514372 -1.013058 -0.516428 0.767303 3.773134
3.000000 -0.598725 1.539786 -0.876165 -0.519496 0.769651 3.565481
3.033333 -0.616270 1.565130 -0.733522 -0.521551 0.772839 3.274639
3.066667 -0.633824 1.590394 -0.605967 -0.522614 0.776898 2.913540
3.100000 -0.651462 1.616161 -0.505075 -0.522710 0.781727 2.496960
3.133333 -0.669105 1.642469 -0.417192 -0.521882 0.787090 2.043080
3.166667 -0.686731 1.668671 -0.349325 -0.520269 0.792716 1.569085
3.200000 -0.704333 1.694758 -0.302227 -0.517975 0.798399 1.093564
3.233333 -0.721743 1.721445 -0.302943 -0.515081 0.803878 0.639873
3.266667 -0.738913 1.748683 -0.288600 -0.511652 0.808835 0.226283
3.300000 -0.755820 1.776493 -0.306869 -0.507799 0.812979 -0.133996
3.333333 -0.772669 1.804144 -0.339129 -0.503636 0.816108 -0.429434
3.366667 -0.789450 1.831626 -0.392336 -0.499226 0.818046 -0.648516
3.400000 -0.806158 1.858926 -0.448375 -0.494615 0.818592 -0.785517
3.433333 -0.822576 1.886499 -0.492956 -0.489829 0.817594 -0.847644
3.466667 -0.838725 1.914256 -0.530792 -0.484856 0.814943 -0.837727
3.500000 -0.854777 1.941796 -0.578774 -0.479645 0.810635 -0.759206
3.533333 -0.870724 1.969106 -0.607487 -0.474149 0.804663 -0.624038
3.566667 -0.886560 1.996174 -0.625950 -0.468311 0.796986 -0.450908
3.600000 -0.902278 2.022988 -0.648837 -0.462072 0.787544 -0.257771
3.633333 -0.917754 2.049558 -0.670221 -0.455391 0.776363 -0.055913
3.666667 -0.932982 2.075756 -0.662562 -0.448228 0.763492 0.141617
3.700000 -0.947938 2.101461 -0.641139 -0.440564 0.748939 0.315841
3.733333 -0.962597 2.126557 -0.610962 -0.432347 0.732648 0.460925
3.766667 -0.976925 2.150939 -0.581673 -0.423555 0.714630 0.575257
3.800000 -0.990882 2.174488 -0.544330 -0.414227 0.695057 0.656315
3.833333 -1.004675 2.197706 -0.494358 -0.404389 0.674034 0.700281
3.866667 -1.018299 2.220582 -0.460971 -0.394066 0.651642 0.702428
3.900000 -1.031396 2.242256 -0.438575 -0.383251 0.627903 0.675753
3.933333 -1.043954 2.262728 -0.428672 -0.371968 0.602940 0.623666
3.966667 -1.056330 2.282835 -0.419988 -0.360258 0.576920 0.552465
4.000000 -1.068150 2.301627 -0.381339 -0.348128 0.549935 0.472543
4.033333 -1.079779 2.320041 -0.388624 -0.335593 0.522075 0.400266
4.066667 -1.090811 2.337035 -0.344178 -0.322718 0.493545 0.346636
4.100000 -1.101193 2.352551 -0.327141 -0.309638 0.464709 0.310983
4.133333 -1.111374 2.367678 -0.340703 -0.296489 0.435920 0.294304
4.166667 -1.121353 2.382414 -0.350289 -0.283349 0.407407 0.295762
4.200000 -1.130658 2.395660 -0.386803 -0.270264 0.379325 0.319792
4.233333 -1.139275 2.407351 -0.363832 -0.257319 0.351921 0.353620
4.266667 -1.147195 2.417517 -0.346557 -0.244618 0.325446 0.398072
4.300000 -1.154906 2.427293 -0.327667 -0.232166 0.299924 0.452240
4.333333 -1.162410 2.436681 -0.298913 -0.219949 0.275350 0.512507
4.366667 -1.169705 2.445685 -0.258964 -0.208023 0.251849 0.574686
4.400000 -1.176280 2.453278 -0.253311 -0.196496 0.229652 0.622491
4.433333 -1.182648 2.460493 -0.214432 -0.185400 0.208799 0.656699
4.466667 -1.188809 2.467335 -0.215582 -0.174682 0.189175 0.672309
4.500000 -1.194356 2.473042 -0.202537 -0.164399 0.170894 0.663616
4.533333 -1.199341 2.477738 -0.154709 -0.154653 0.154125 0.632871
4.566667 -1.204124 2.482079 -0.131013 -0.145522 0.139013 0.578674
4.600000 -1.208707 2.486070 -0.111500 -0.137014 0.125553 0.508516
4.633333 -1.212931 2.489512 -0.060388 -0.129189 0.113855 0.420725
4.666667 -1.216867 2.492592 -0.057605 -0.122148 0.104074 0.315052
4.700000 -1.220609 2.495344 -0.032850 -0.115887 0.096138 0.196552
4.733333 -1.224190 2.498041 -0.044023 -0.110330 0.089843 0.067701
4.766667 -1.227583 2.500426 -0.041624 -0.105381 0.084905 -0.064280
4.800000 -1.230900 2.502953 -0.059506 -0.100960 0.081033 -0.192871
4.833333 -1.234170 2.505647 -0.072326 -0.096944 0.077861 -0.304045
4.866667 -1.237261 2.508051 -0.061830 -0.093186 0.075005 -0.390162
4.900000 -1.240311 2.510643 -0.107961 -0.089566 0.072132 -0.443597
4.933333 -1.243318 2.513354 -0.116559 -0.085987 0.068970 -0.462208
4.966667 -1.246154 2.515794 -0.159187 -0.082353 0.065286 -0.440730
5.000000 -1.248943 2.518269 -0.195085 -0.078584 0.060948 -0.383377
5.033333 -1.251566 2.520485 -0.193633 -0.074631 0.055928 -0.300991
5.066667 -1.254026 2.522447 -0.223790 -0.070464 0.050226 -0.198960
5.100000 -1.256358 2.524177 -0.259195 -0.066084 0.043966 -0.085775
5.133333 -1.258531 2.525546 -0.238241 -0.061515 0.037325 0.030541
5.166667 -1.260550 2.526679 -0.233717 -0.056792 0.030491 0.136409
5.200000 -1.262417 2.527583 -0.192174 -0.051972 0.023648 0.222976
5.233333 -1.264065 2.528101 -0.167566 -0.047126 0.016993 0.290238
5.266667 -1.265567 2.528403 -0.151080 -0.042339 0.010768 0.333391
5.300000 -1.266861 2.528458 -0.136317 -0.037690 0.005134 0.342313
5.333333 -1.267967 2.528330 -0.116998 -0.033251 0.000197 0.319506
5.366667 -1.268894 2.528085 -0.117212 -0.029106 -0.003901 0.267943
5.400000 -1.269688 2.527651 -0.111263 -0.025329 -0.007043 0.195883
