t x y theta dxdt dydt dthetadt
0.000000 0.000000 0.000000 -0.025143 0.003401 0.003372 0.005235
0.033333 -0.000384 -0.000095 -0.018131 0.004670 0.003937 0.016664
0.066667 -0.000346 -0.000101 -0.013514 0.007077 0.004825 0.030368
0.100000 0.000125 -0.000013 -0.026613 0.011613 0.006291 0.052745
0.133333 0.000113 0.000147 -0.033594 0.019526 0.008639 0.085651
0.166667 0.000559 0.000404 -0.018558 0.032328 0.012228 0.126249
0.200000 0.000770 0.000509 -0.012970 0.051871 0.017523 0.174093
0.233333 0.001040 0.000727 -0.018336 0.080005 0.024947 0.228129
0.266667 0.001701 0.001154 -0.014513 0.117897 0.034742 0.286689
0.300000 0.003221 0.001810 -0.002711 0.166103 0.046964 0.340317
0.333333 0.005261 0.002577 -0.006193 0.224450 0.061571 0.386714
0.366667 0.007832 0.003456 0.027123 0.292242 0.078410 0.424258
0.400000 0.014696 0.005363 0.046675 0.367523 0.097007 0.450511
0.433333 0.026295 0.008571 0.089678 0.448060 0.116795 0.461885
0.466667 0.043104 0.012925 0.105908 0.531523 0.137210 0.458185
0.500000 0.064359 0.018290 0.114590 0.615733 0.157680 0.442227
0.533333 0.091682 0.025222 0.132252 0.698292 0.177478 0.411008
0.566667 0.119535 0.032251 0.147001 0.776915 0.195886 0.369426
0.600000 0.147906 0.039373 0.147643 0.850647 0.212369 0.318242
0.633333 0.178687 0.046927 0.164118 0.918920 0.226602 0.261819
0.666667 0.211320 0.055264 0.175197 0.982020 0.238270 0.202082
0.700000 0.245681 0.064104 0.170043 1.040124 0.247197 0.141658
0.733333 0.281127 0.073310 0.182692 1.094398 0.253485 0.083575
0.766667 0.318144 0.082349 0.196533 1.146018 0.257294 0.025697
0.800000 0.355568 0.091443 0.189148 1.195332 0.258863 -0.030780
0.833333 0.398100 0.100583 0.184869 1.242361 0.258369 -0.083327
0.866667 0.440988 0.109763 0.172393 1.286581 0.256191 -0.131017
0.900000 0.484205 0.118978 0.175343 1.327581 0.252690 -0.175586
0.933333 0.531161 0.127455 0.159236 1.364060 0.248233 -0.210598
0.966667 0.578386 0.135953 0.149609 1.394568 0.243144 -0.233724
1.000000 0.627969 0.143309 0.139773 1.417769 0.237782 -0.243665
1.033333 0.677753 0.150674 0.135507 1.432524 0.232461 -0.243799
1.066667 0.727706 0.158041 0.109688 1.437377 0.227369 -0.232100
1.100000 0.777792 0.165408 0.112760 1.430811 0.222669 -0.208083
1.133333 0.827978 0.172768 0.093118 1.412344 0.218346 -0.177728
1.166667 0.878227 0.180116 0.096160 1.382102 0.214414 -0.145185
1.200000 0.928106 0.187126 0.076583 1.340161 0.210636 -0.110201
1.233333 0.975966 0.193947 0.073449 1.287263 0.206826 -0.072681
1.266667 1.020772 0.200898 0.087772 1.224935 0.202708 -0.042366
1.300000 1.061355 0.207767 0.096352 1.155203 0.197989 -0.019206
1.333333 1.101848 0.214606 0.094334 1.079413 0.192412 -0.005873
1.366667 1.136954 0.221197 0.090284 0.999012 0.185732 0.000367
1.400000 1.166478 0.227472 0.095492 0.916701 0.177962 -0.005752
1.433333 1.192218 0.233480 0.091331 0.834714 0.169090 -0.022951
1.466667 1.217801 0.239449 0.099232 0.755026 0.159292 -0.041262
1.500000 1.243218 0.245376 0.099689 0.679506 0.148862 -0.060393
1.533333 1.263074 0.250244 0.111015 0.610981 0.138302 -0.078947
1.566667 1.282751 0.255067 0.102159 0.551548 0.128146 -0.099272
1.600000 1.298047 0.258715 0.068715 0.502034 0.118877 -0.115124
1.633333 1.309583 0.261723 0.069535 0.463332 0.111048 -0.127368
1.666667 1.319191 0.264221 0.060097 0.436374 0.105141 -0.137591
1.700000 1.328628 0.266675 0.065494 0.421780 0.101581 -0.145952
1.733333 1.339628 0.269340 0.061483 0.418538 0.100480 -0.148266
1.766667 1.350469 0.271961 0.061015 0.425741 0.101814 -0.142659
1.800000 1.361156 0.274536 0.061969 0.442651 0.105522 -0.133360
1.833333 1.375277 0.277646 0.057644 0.467490 0.111316 -0.120494
1.866667 1.391871 0.281221 0.043349 0.498137 0.118850 -0.105985
1.900000 1.410214 0.285623 0.027796 0.532291 0.127617 -0.089475
1.933333 1.428406 0.289974 0.019950 0.568601 0.137283 -0.073269
1.966667 1.449055 0.294837 0.023481 0.605652 0.147537 -0.057961
2.000000 1.469544 0.299642 0.028877 0.642107 0.158004 -0.043218
2.033333 1.492901 0.305437 0.030568 0.677691 0.168432 -0.028808
2.066667 1.516083 0.311167 0.032953 0.712356 0.178573 -0.015250
2.100000 1.539080 0.316828 0.032135 0.746409 0.188308 -0.003422
2.133333 1.565197 0.323671 0.042755 0.779733 0.197396 0.005735
2.166667 1.591108 0.330435 0.038654 0.812705 0.205599 0.012759
2.200000 1.618930 0.337840 0.037881 0.845207 0.212495 0.018699
2.233333 1.648781 0.345684 0.024003 0.876737 0.217707 0.024549
2.266667 1.678382 0.353431 0.026915 0.906754 0.220881 0.029298
2.300000 1.707716 0.361074 0.029300 0.934450 0.221472 0.033527
2.333333 1.740113 0.369209 0.032443 0.959238 0.218874 0.037134
2.366667 1.774636 0.377433 0.034631 0.980003 0.212595 0.038884
2.400000 1.808830 0.385530 0.043023 0.996148 0.202291 0.037746
2.433333 1.844585 0.393329 0.038715 1.007248 0.187649 0.031245
2.466667 1.879962 0.400987 0.053158 1.012882 0.168366 0.019660
2.500000 1.915578 0.407434 0.053570 1.012695 0.144595 0.003753
2.533333 1.950397 0.412140 0.051235 1.006672 0.116765 -0.015399
2.566667 1.984762 0.416689 0.050034 0.995265 0.085253 -0.036725
2.600000 2.018648 0.421078 0.039302 0.979089 0.050841 -0.057818
2.633333 2.052321 0.423023 0.040026 0.958795 0.014305 -0.075275
2.666667 2.084758 0.422110 0.038812 0.935101 -0.023355 -0.084848
2.700000 2.116639 0.421034 0.036372 0.908769 -0.061502 -0.088281
2.733333 2.145757 0.416246 0.031489 0.880534 -0.099128 -0.084975
2.766667 2.174272 0.411303 0.022373 0.850927 -0.135242 -0.074537
2.800000 2.202166 0.406213 0.006850 0.820157 -0.168993 -0.056758
2.833333 2.229415 0.400980 0.016574 0.788443 -0.199547 -0.035454
2.866667 2.254898 0.391912 0.014636 0.755915 -0.226094 -0.012399
2.900000 2.279697 0.382718 0.012512 0.722827 -0.247739 0.012164
2.933333 2.303791 0.373408 0.005674 0.689004 -0.264361 0.037757
2.966667 2.326311 0.362471 0.024937 0.654290 -0.275624 0.061345
3.000000 2.348091 0.351440 0.028417 0.618880 -0.281474 0.077765
3.033333 2.368065 0.340325 0.025338 0.583045 -0.281977 0.088376
3.066667 2.387266 0.329140 0.032795 0.547055 -0.277781 0.089660
3.100000 2.405680 0.317897 0.031157 0.510947 -0.269428 0.082813
3.133333 2.421556 0.308523 0.039232 0.475089 -0.257331 0.065846
3.166667 2.436391 0.300267 0.045044 0.439633 -0.242220 0.044362
3.200000 2.449601 0.293430 0.061159 0.404069 -0.224536 0.024619
3.233333 2.461974 0.286572 0.045534 0.367600 -0.204659 0.011964
3.266667 2.473500 0.279701 0.057237 0.329042 -0.182228 0.011696
3.300000 2.483500 0.273939 0.055983 0.287554 -0.157195 0.029362
3.333333 2.493369 0.268684 0.040792 0.241944 -0.129239 0.070546
3.366667 2.502936 0.263620 0.027653 0.191005 -0.097645 0.134589
3.400000 2.511466 0.259237 0.024305 0.134157 -0.061782 0.220335
3.433333 2.517409 0.256186 0.010672 0.071106 -0.021115 0.320648
3.466667 2.522453 0.253150 0.019619 0.002327 0.024396 0.428648
3.500000 2.524180 0.252780 0.044132 -0.071753 0.074864 0.530030
3.533333 2.519480 0.256477 0.074430 -0.150071 0.130166 0.611078
3.566667 2.513876 0.260189 0.106748 -0.231072 0.189555 0.659673
3.600000 2.502139 0.269035 0.142383 -0.312715 0.251449 0.664887
3.633333 2.489511 0.277882 0.197187 -0.393241 0.314480 0.620257
3.666667 2.476003 0.286721 0.232228 -0.471231 0.376835 0.524077
3.700000 2.457358 0.300836 0.269092 -0.545211 0.436241 0.384143
3.733333 2.435051 0.319324 0.298902 -0.614265 0.490329 0.211504
3.766667 2.411909 0.337759 0.305591 -0.677681 0.536459 0.019191
3.800000 2.386784 0.359857 0.290642 -0.735749 0.572855 -0.175955
3.833333 2.360866 0.381858 0.267610 -0.788624 0.597641 -0.356183
3.866667 2.333003 0.405929 0.232915 -0.836179 0.609002 -0.503911
3.900000 2.302725 0.431159 0.201092 -0.878758 0.606423 -0.610322
3.933333 2.271721 0.456212 0.157747 -0.916745 0.589545 -0.668286
3.966667 2.240015 0.481061 0.127674 -0.950794 0.558700 -0.677358
4.000000 2.206467 0.502687 0.070525 -0.981446 0.514331 -0.641943
4.033333 2.172832 0.519664 0.049798 -1.009582 0.456900 -0.572655
4.066667 2.138570 0.536366 0.031978 -1.036563 0.388153 -0.486622
4.100000 2.102845 0.546996 0.016756 -1.063554 0.309741 -0.394268
4.133333 2.066543 0.557317 0.012772 -1.091629 0.223836 -0.309489
4.166667 2.029692 0.567315 0.012680 -1.121389 0.132924 -0.240075
4.200000 1.993441 0.570060 0.028478 -1.153180 0.039967 -0.195876
4.233333 1.956693 0.572463 0.034843 -1.186669 -0.052085 -0.175073
4.266667 1.920343 0.569249 0.046777 -1.221685 -0.140774 -0.173263
4.300000 1.880292 0.560969 0.042351 -1.257887 -0.224446 -0.187340
4.333333 1.837164 0.548130 0.033272 -1.294658 -0.301618 -0.210106
4.366667 1.790178 0.530657 0.015927 -1.331317 -0.370913 -0.232537
4.400000 1.742840 0.512873 -0.014244 -1.367003 -0.432244 -0.243303
4.433333 1.695188 0.494793 -0.020607 -1.401192 -0.485524 -0.241554
4.466667 1.647258 0.476435 -0.033138 -1.432651 -0.531215 -0.222592
4.500000 1.599088 0.457813 -0.053509 -1.460143 -0.569715 -0.187359
4.533333 1.550716 0.438945 -0.070742 -1.482841 -0.601985 -0.138061
4.566667 1.502178 0.419846 -0.058718 -1.500584 -0.629572 -0.084543
4.600000 1.450116 0.398494 -0.069145 -1.513265 -0.653235 -0.032095
4.633333 1.396774 0.375450 -0.056771 -1.520681 -0.673613 0.016765
4.666667 1.343157 0.351350 -0.051836 -1.522843 -0.690800 0.054388
4.700000 1.290030 0.326259 -0.027128 -1.520037 -0.704572 0.077068
4.733333 1.238364 0.300768 -0.035435 -1.512223 -0.714126 0.083646
4.766667 1.186775 0.275171 -0.023684 -1.499038 -0.718374 0.078978
4.800000 1.135301 0.249492 -0.012216 -1.480568 -0.716598 0.061740
4.833333 1.087312 0.225276 -0.019127 -1.457097 -0.708162 0.034537
4.866667 1.039514 0.201022 -0.026271 -1.429212 -0.692995 0.001872
4.900000 0.991945 0.176751 -0.028008 -1.397520 -0.671346 -0.027815
4.933333 0.944639 0.152484 -0.025137 -1.362888 -0.644076 -0.051049
4.966667 0.897632 0.128243 -0.012417 -1.325905 -0.611882 -0.067715
5.000000 0.852523 0.106502 -0.028921 -1.287008 -0.575503 -0.072034
5.033333 0.809615 0.087693 -0.038556 -1.246105 -0.536049 -0.064708
5.066667 0.770053 0.072322 -0.054609 -1.203204 -0.494636 -0.044802
5.100000 0.730918 0.057044 -0.054158 -1.158058 -0.452425 -0.018978
5.133333 0.692239 0.041869 -0.053841 -1.109119 -0.410167 0.011297
5.166667 0.657456 0.030398 -0.046921 -1.055689 -0.369251 0.044039
5.200000 0.623179 0.019049 -0.066920 -0.995828 -0.330545 0.074887
5.233333 0.588564 0.009940 -0.049501 -0.927424 -0.294442 0.103109
5.266667 0.554499 0.000967 -0.030523 -0.847885 -0.260769 0.129228
5.300000 0.524374 -0.005840 -0.025257 -0.754982 -0.229348 0.159999
5.333333 0.494840 -0.012503 -0.008018 -0.648854 -0.200211 0.195841
5.366667 0.473109 -0.017959 0.001235 -0.528754 -0.172514 0.241230
5.400000 0.451997 -0.023268 -0.007858 -0.395613 -0.145704 0.298041
5.433333 0.431510 -0.028430 -0.014692 -0.252057 -0.119382 0.365658
5.466667 0.425786 -0.032160 0.007967 -0.101668 -0.093509 0.438099
5.500000 0.420690 -0.035746 -0.012523 0.052523 -0.067711 0.506605
5.533333 0.428053 -0.037865 -0.006229 0.207853 -0.041815 0.566129
5.566667 0.447913 -0.037703 0.026380 0.360345 -0.016714 0.607424
5.600000 0.468343 -0.037412 0.078383 0.506110 0.006058 0.615847
5.633333 0.489308 -0.036995 0.130997 0.642147 0.024381 0.582852
5.666667 0.510775 -0.036459 0.181842 0.766873 0.036307 0.503562
5.700000 0.540500 -0.033446 0.197427 0.877787 0.039529 0.376898
5.733333 0.575915 -0.028729 0.229687 0.973574 0.032244 0.204665
5.766667 0.611708 -0.023917 0.226944 1.054842 0.013869 -0.001892
5.800000 0.653514 -0.018730 0.236932 1.121576 -0.015433 -0.222878
5.833333 0.695594 -0.013468 0.213288 1.174136 -0.054297 -0.441367
5.866667 0.740047 -0.010579 0.203900 1.211167 -0.101236 -0.643152
5.900000 0.785406 -0.012074 0.165615 1.231803 -0.153848 -0.820186
5.933333 0.830571 -0.019368 0.098322 1.234502 -0.209005 -0.969621
5.966667 0.873628 -0.033713 0.041370 1.216155 -0.263066 -1.098216
6.000000 0.916663 -0.047986 -0.024675 1.174759 -0.311515 -1.214532
6.033333 0.959619 -0.062178 -0.075693 1.108156 -0.350435 -1.331829
6.066667 1.002442 -0.076276 -0.086734 1.016266 -0.376316 -1.463774
6.100000 1.045075 -0.090269 -0.102676 0.900040 -0.386875 -1.620528
6.133333 1.079655 -0.108288 -0.133882 0.762194 -0.381174 -1.804226
6.166667 1.113941 -0.126173 -0.177629 0.606783 -0.360404 -2.012979
6.200000 1.137742 -0.143957 -0.237668 0.439887 -0.327386 -2.239415
6.233333 1.151997 -0.159903 -0.309410 0.267527 -0.284598 -2.468719
6.266667 1.156391 -0.172278 -0.413460 0.094834 -0.234276 -2.676142
6.300000 1.150325 -0.178891 -0.507038 -0.073048 -0.178621 -2.838812
6.333333 1.130121 -0.177812 -0.638892 -0.232228 -0.120276 -2.942273
6.366667 1.109510 -0.176524 -0.779662 -0.379483 -0.060835 -2.974040
6.400000 1.088501 -0.175029 -0.939137 -0.514885 -0.001288 -2.927491
6.433333 1.067104 -0.173333 -1.077308 -0.638380 0.056658 -2.799978
6.466667 1.045330 -0.171439 -1.164350 -0.750317 0.111007 -2.601047
6.500000 1.023190 -0.169352 -1.245498 -0.852723 0.160410 -2.337549
6.533333 1.000695 -0.167076 -1.307472 -0.948463 0.204535 -2.016787
6.566667 0.967856 -0.158644 -1.360852 -1.039579 0.242561 -1.649930
6.600000 0.926831 -0.145999 -1.414133 -1.125303 0.272852 -1.250922
6.633333 0.885519 -0.133189 -1.444225 -1.204944 0.294138 -0.836362
6.666667 0.840075 -0.118937 -1.477547 -1.277109 0.305471 -0.417920
6.700000 0.794410 -0.104549 -1.506666 -1.339599 0.306015 -0.012064
6.733333 0.743186 -0.090167 -1.524727 -1.389273 0.295168 0.367282
6.766667 0.691817 -0.075680 -1.504657 -1.424182 0.273092 0.710432
6.800000 0.638842 -0.063294 -1.456286 -1.444366 0.241695 1.008777
6.833333 0.585934 -0.054243 -1.370422 -1.449889 0.203181 1.254803
6.866667 0.534906 -0.049502 -1.267162 -1.441760 0.160158 1.441661
6.900000 0.483899 -0.044705 -1.193841 -1.420428 0.115105 1.569770
6.933333 0.437947 -0.045975 -1.129693 -1.386774 0.070873 1.638397
6.966667 0.392090 -0.047198 -1.060864 -1.341833 0.030301 1.650313
7.000000 0.346364 -0.048372 -1.014157 -1.286815 -0.004734 1.617344
7.033333 0.300807 -0.049498 -0.970363 -1.222916 -0.032927 1.554111
7.066667 0.255452 -0.050574 -0.923585 -1.150704 -0.053818 1.474129
7.100000 0.216176 -0.054536 -0.877967 -1.071556 -0.066595 1.382268
7.133333 0.183088 -0.059954 -0.839487 -0.987036 -0.071521 1.288983
7.166667 0.150291 -0.065320 -0.804167 -0.898223 -0.069115 1.203020
7.200000 0.117807 -0.070628 -0.758473 -0.805317 -0.059611 1.121683
7.233333 0.092386 -0.074067 -0.701300 -0.709002 -0.043016 1.045276
7.266667 0.076119 -0.074524 -0.681498 -0.610966 -0.019221 0.978069
7.300000 0.060214 -0.074923 -0.655018 -0.513131 0.010584 0.928160
7.333333 0.044676 -0.075263 -0.603636 -0.417352 0.044930 0.894744
7.366667 0.029512 -0.075545 -0.584374 -0.325776 0.082026 0.876407
7.400000 0.014726 -0.075769 -0.570581 -0.241087 0.119620 0.877180
7.433333 0.009975 -0.070939 -0.571739 -0.166071 0.154733 0.897811
7.466667 0.011643 -0.062444 -0.561315 -0.102326 0.184574 0.929660
7.500000 0.013684 -0.053913 -0.531319 -0.050949 0.206956 0.965510
7.533333 0.019307 -0.042589 -0.498701 -0.012840 0.219982 1.006466
7.566667 0.026349 -0.029985 -0.436435 0.011616 0.222288 1.046681
7.600000 0.032410 -0.017390 -0.373763 0.022425 0.212749 1.079263
7.633333 0.036919 -0.006236 -0.327528 0.021514 0.191943 1.095041
7.666667 0.038951 0.002782 -0.297581 0.011249 0.161043 1.092636
7.700000 0.037724 0.008002 -0.263572 -0.005529 0.122135 1.071236
7.733333 0.036777 0.013183 -0.232240 -0.025566 0.078269 1.028721
7.766667 0.033111 0.013491 -0.189701 -0.045486 0.032953 0.967094
7.800000 0.029712 0.013753 -0.164234 -0.062127 -0.010231 0.892504
7.833333 0.024874 0.010363 -0.134553 -0.073831 -0.048372 0.810816
7.866667 0.020081 0.003723 -0.103492 -0.079966 -0.079053 0.725899
7.900000 0.015543 -0.002952 -0.076567 -0.080711 -0.101008 0.640300
7.933333 0.011257 -0.009657 -0.048452 -0.076666 -0.113751 0.552782
7.966667 0.008573 -0.016670 -0.029963 -0.069112 -0.117997 0.468305
8.000000 0.006559 -0.023082 -0.029357 -0.059309 -0.114658 0.385438
