t x y theta dxdt dydt dthetadt
0.000000 0.000000 0.000000 -0.328366 0.125303 -0.083145 -0.178747
0.033333 0.004174 -0.002818 -0.327323 0.124117 -0.088018 -0.240904
0.066667 0.008335 -0.005867 -0.323238 0.122798 -0.092969 -0.320501
0.100000 0.012443 -0.009061 -0.318673 0.121345 -0.098032 -0.414191
0.133333 0.016494 -0.012403 -0.327716 0.119761 -0.103255 -0.514045
0.166667 0.020486 -0.015893 -0.349854 0.118044 -0.108672 -0.614595
0.200000 0.024416 -0.019533 -0.371484 0.116188 -0.114308 -0.714083
0.233333 0.028281 -0.023324 -0.408670 0.114187 -0.120166 -0.806495
0.266667 0.032078 -0.027267 -0.455935 0.112040 -0.126256 -0.883945
0.300000 0.035812 -0.031477 -0.500472 0.109739 -0.132558 -0.940542
0.333333 0.039474 -0.035953 -0.519532 0.107275 -0.139043 -0.978841
0.366667 0.043054 -0.040693 -0.561051 0.104636 -0.145667 -0.995959
0.400000 0.046543 -0.045697 -0.606472 0.101815 -0.152379 -0.992337
0.433333 0.049930 -0.050960 -0.645142 0.098798 -0.159132 -0.971847
0.466667 0.053231 -0.056381 -0.667984 0.095569 -0.165874 -0.938899
0.500000 0.056412 -0.062053 -0.709420 0.092118 -0.172560 -0.899826
0.533333 0.059460 -0.067971 -0.722183 0.088436 -0.179161 -0.853542
0.566667 0.062416 -0.074047 -0.756620 0.084518 -0.185664 -0.806771
0.600000 0.065221 -0.080360 -0.783799 0.080362 -0.192068 -0.764735
0.633333 0.067868 -0.086907 -0.812778 0.075974 -0.198377 -0.726837
0.666667 0.070415 -0.093610 -0.839190 0.071369 -0.204594 -0.699277
0.700000 0.072786 -0.100534 -0.842416 0.066574 -0.210719 -0.688284
0.733333 0.074971 -0.107676 -0.867823 0.061615 -0.216753 -0.703276
0.766667 0.076966 -0.115029 -0.904914 0.056527 -0.222685 -0.747972
0.800000 0.078764 -0.122592 -0.890963 0.051354 -0.228500 -0.821025
0.833333 0.080360 -0.130358 -0.934073 0.046153 -0.234185 -0.933469
0.866667 0.081846 -0.138277 -0.934703 0.040961 -0.239731 -1.085210
0.900000 0.083120 -0.146390 -0.953934 0.035807 -0.245134 -1.258665
0.933333 0.084178 -0.154696 -1.012627 0.030712 -0.250391 -1.422515
0.966667 0.085015 -0.163188 -1.034019 0.025698 -0.255504 -1.535279
1.000000 0.085738 -0.171827 -1.081342 0.020762 -0.260486 -1.553034
1.033333 0.086344 -0.180612 -1.178233 0.015881 -0.265351 -1.422223
1.066667 0.086834 -0.189542 -1.285008 0.011050 -0.270111 -1.092505
1.100000 0.087097 -0.198647 -1.374640 0.006253 -0.274780 -0.556730
1.133333 0.087242 -0.207893 -1.427541 0.001481 -0.279368 0.151903
1.166667 0.087268 -0.217279 -1.589488 -0.003306 -0.283893 0.972437
1.200000 0.087069 -0.226832 -1.667578 -0.008120 -0.288367 1.821128
1.233333 0.086751 -0.236522 -1.661487 -0.012968 -0.292794 2.601621
1.266667 0.086212 -0.246375 -1.519213 -0.017864 -0.297185 3.194004
1.300000 0.085554 -0.256359 -1.163133 -0.022814 -0.301546 3.506885
1.333333 0.084674 -0.266504 -0.785562 -0.027822 -0.305884 3.489592
1.366667 0.083675 -0.276777 -0.485021 -0.032868 -0.310196 3.105662
1.400000 0.082555 -0.287176 -0.121727 -0.037944 -0.314486 2.347191
1.433333 0.081207 -0.297735 0.018760 -0.043043 -0.318761 1.254149
1.466667 0.079739 -0.308416 0.050769 -0.048165 -0.323028 -0.081698
1.500000 0.078046 -0.319258 -0.035186 -0.053307 -0.327300 -1.540806
1.533333 0.076132 -0.330259 -0.201550 -0.058458 -0.331581 -3.009847
1.566667 0.074100 -0.341376 -0.438037 -0.063625 -0.335882 -4.362301
1.600000 0.071855 -0.352654 -0.717082 -0.068794 -0.340207 -5.475124
1.633333 0.069495 -0.364042 -1.022817 -0.073963 -0.344560 -6.284335
1.666667 0.066930 -0.375598 -1.284436 -0.079104 -0.348929 -6.773152
1.700000 0.064251 -0.387257 -1.646946 -0.084205 -0.353300 -6.951607
1.733333 0.061373 -0.399087 -1.979940 -0.089261 -0.357664 -6.847960
1.766667 0.058300 -0.411087 -2.242410 -0.094248 -0.361995 -6.514644
1.800000 0.055034 -0.423257 -2.421903 -0.099156 -0.366265 -6.022740
1.833333 0.051582 -0.435594 -2.627097 -0.103958 -0.370436 -5.419754
1.866667 0.048024 -0.448020 -2.796800 -0.108657 -0.374490 -4.740306
1.900000 0.044293 -0.460604 -2.917137 -0.113231 -0.378394 -4.032699
1.933333 0.040398 -0.473341 -3.023973 -0.117661 -0.382119 -3.334080
1.966667 0.036346 -0.486225 -3.125257 -0.121942 -0.385645 -2.670549
2.000000 0.032196 -0.499183 3.095996 -0.126071 -0.388964 -2.054161
2.033333 0.027867 -0.512277 3.036456 -0.130047 -0.392068 -1.507222
2.066667 0.023443 -0.525437 2.996824 -0.133850 -0.394941 -1.044925
2.100000 0.018928 -0.538661 3.000544 -0.137480 -0.397584 -0.668825
2.133333 0.014263 -0.551991 3.008761 -0.140937 -0.400001 -0.382306
2.166667 0.009455 -0.565421 3.045366 -0.144218 -0.402194 -0.186701
2.200000 0.004509 -0.578942 3.071096 -0.147313 -0.404163 -0.081556
2.233333 -0.000519 -0.592511 3.096297 -0.150228 -0.405914 -0.053719
2.266667 -0.005625 -0.606123 3.133774 -0.152968 -0.407455 -0.092914
2.300000 -0.010808 -0.619774 3.135501 -0.155535 -0.408787 -0.179402
2.333333 -0.016064 -0.633461 3.132134 -0.157933 -0.409910 -0.283674
2.366667 -0.021391 -0.647180 3.084055 -0.160166 -0.410824 -0.372345
2.400000 -0.026785 -0.660925 3.053301 -0.162243 -0.411536 -0.420464
2.433333 -0.032245 -0.674694 3.026463 -0.164172 -0.412047 -0.407269
2.466667 -0.037767 -0.688481 2.989329 -0.165958 -0.412366 -0.311566
2.500000 -0.043366 -0.702270 2.949769 -0.167608 -0.412500 -0.131277
2.533333 -0.049021 -0.716070 2.910386 -0.169119 -0.412456 0.117771
2.566667 -0.054729 -0.729877 2.874508 -0.170494 -0.412242 0.410426
2.600000 -0.060475 -0.743652 2.857647 -0.171729 -0.411867 0.727173
2.633333 -0.066268 -0.757426 2.889562 -0.172814 -0.411333 1.046415
2.666667 -0.072076 -0.771154 3.005307 -0.173734 -0.410636 1.337646
2.700000 -0.077885 -0.784823 3.102505 -0.174469 -0.409767 1.583539
2.733333 -0.083732 -0.798480 -3.100818 -0.175010 -0.408719 1.779217
2.766667 -0.089615 -0.812118 -3.012138 -0.175338 -0.407474 1.927178
2.800000 -0.095532 -0.825736 -2.912496 -0.175432 -0.406010 2.025160
2.833333 -0.101479 -0.839328 -2.836179 -0.175284 -0.404313 2.073644
2.866667 -0.107352 -0.852820 -2.781909 -0.174905 -0.402378 2.082502
2.900000 -0.113250 -0.866279 -2.752908 -0.174311 -0.400203 2.056561
2.933333 -0.119169 -0.879701 -2.717578 -0.173522 -0.397792 1.995021
2.966667 -0.125005 -0.893002 -2.652729 -0.172580 -0.395166 1.892100
3.000000 -0.130761 -0.906176 -2.575158 -0.171535 -0.392357 1.745671
3.033333 -0.136441 -0.919221 -2.484336 -0.170446 -0.389407 1.546913
3.066667 -0.142053 -0.932136 -2.394773 -0.169359 -0.386354 1.291845
3.100000 -0.147605 -0.944922 -2.291667 -0.168328 -0.383247 0.973454
3.133333 -0.153164 -0.957651 -2.225383 -0.167398 -0.380131 0.595213
3.166667 -0.158685 -0.970259 -2.192950 -0.166596 -0.377038 0.169469
3.200000 -0.164181 -0.982752 -2.233339 -0.165935 -0.373989 -0.283053
3.233333 -0.169665 -0.995139 -2.275050 -0.165407 -0.370992 -0.733674
3.266667 -0.175147 -1.007423 -2.323562 -0.164991 -0.368047 -1.156320
3.300000 -0.180624 -1.019634 -2.364134 -0.164655 -0.365138 -1.521402
3.333333 -0.186096 -1.031770 -2.430983 -0.164363 -0.362251 -1.810002
3.366667 -0.191576 -1.043807 -2.566734 -0.164082 -0.359368 -2.009284
3.400000 -0.197065 -1.055742 -2.676059 -0.163777 -0.356474 -2.122770
3.433333 -0.202541 -1.067593 -2.792173 -0.163420 -0.353549 -2.147319
3.466667 -0.208015 -1.079337 -2.861610 -0.162996 -0.350583 -2.092018
3.500000 -0.213471 -1.090992 -2.906250 -0.162488 -0.347565 -1.964466
3.533333 -0.218909 -1.102555 -2.953443 -0.161883 -0.344483 -1.772738
3.566667 -0.224321 -1.114003 -3.060268 -0.161174 -0.341329 -1.523602
3.600000 -0.229693 -1.125326 -3.099000 -0.160354 -0.338091 -1.221821
3.633333 -0.235039 -1.136551 3.130954 -0.159412 -0.334760 -0.881390
3.666667 -0.240357 -1.147675 3.103518 -0.158340 -0.331324 -0.510212
3.700000 -0.245647 -1.158696 3.073061 -0.157133 -0.327779 -0.121379
3.733333 -0.250906 -1.169611 3.052308 -0.155782 -0.324115 0.266718
3.766667 -0.256107 -1.180378 3.070205 -0.154273 -0.320314 0.625577
3.800000 -0.261273 -1.191036 3.110199 -0.152594 -0.316363 0.936844
3.833333 -0.266364 -1.201531 -3.114937 -0.150746 -0.312252 1.179508
3.866667 -0.271417 -1.211913 -3.044466 -0.148727 -0.307975 1.337612
3.900000 -0.276429 -1.222180 -2.944848 -0.146535 -0.303521 1.401419
3.933333 -0.281309 -1.232259 -2.856804 -0.144187 -0.298899 1.377949
3.966667 -0.286054 -1.242145 -2.744825 -0.141710 -0.294128 1.281579
4.000000 -0.290755 -1.251910 -2.658015 -0.139134 -0.289232 1.123950
4.033333 -0.295409 -1.261552 -2.627538 -0.136483 -0.284229 0.925684
4.066667 -0.299937 -1.270986 -2.673080 -0.133781 -0.279137 0.712505
4.100000 -0.304343 -1.280210 -2.689605 -0.131059 -0.273984 0.506634
4.133333 -0.308629 -1.289221 -2.704876 -0.128329 -0.268780 0.320745
4.166667 -0.312798 -1.298019 -2.702558 -0.125594 -0.263535 0.169361
4.200000 -0.316914 -1.306689 -2.704510 -0.122862 -0.258261 0.063626
4.233333 -0.320976 -1.315229 -2.702539 -0.120145 -0.252980 0.004263
4.266667 -0.324984 -1.323638 -2.697521 -0.117451 -0.247712 -0.024215
4.300000 -0.328881 -1.331842 -2.688295 -0.114780 -0.242467 -0.031475
4.333333 -0.332669 -1.339843 -2.699088 -0.112142 -0.237263 -0.025116
4.366667 -0.336349 -1.347644 -2.697844 -0.109543 -0.232116 -0.014587
4.400000 -0.339923 -1.355247 -2.693764 -0.106991 -0.227035 -0.007132
4.433333 -0.343439 -1.362717 -2.699882 -0.104487 -0.222028 -0.006381
4.466667 -0.346851 -1.369993 -2.704316 -0.102037 -0.217107 -0.005061
4.500000 -0.350162 -1.377079 -2.698818 -0.099649 -0.212280 -0.003586
4.533333 -0.353413 -1.384031 -2.706978 -0.097317 -0.207543 -0.001414
4.566667 -0.356605 -1.390849 -2.699069 -0.095040 -0.202891 0.001284
4.600000 -0.359736 -1.397533 -2.708220 -0.092807 -0.198315 0.004690
4.633333 -0.362807 -1.404083 -2.696541 -0.090613 -0.193803 0.008838
4.666667 -0.365818 -1.410500 -2.693827 -0.088440 -0.189335 0.010656
4.700000 -0.368735 -1.416741 -2.696854 -0.086274 -0.184891 0.011783
4.733333 -0.371562 -1.422809 -2.694521 -0.084113 -0.180468 0.009706
4.766667 -0.374327 -1.428744 -2.703074 -0.081952 -0.176060 0.007074
4.800000 -0.377031 -1.434547 -2.698214 -0.079791 -0.171667 0.002882
4.833333 -0.379648 -1.440184 -2.703158 -0.077628 -0.167287 -0.001291
4.866667 -0.382180 -1.445659 -2.688658 -0.075473 -0.162932 -0.005972
4.900000 -0.384651 -1.451002 -2.694522 -0.073331 -0.158609 -0.009917
4.933333 -0.387062 -1.456216 -2.698763 -0.071202 -0.154319 -0.011150
4.966667 -0.389411 -1.461299 -2.697490 -0.069088 -0.150064 -0.013044
5.000000 -0.391681 -1.466230 -2.698876 -0.066992 -0.145849 -0.014078
5.033333 -0.393874 -1.471011 -2.705598 -0.064914 -0.141676 -0.015353
5.066667 -0.395991 -1.475645 -2.701571 -0.062854 -0.137541 -0.012811
5.100000 -0.398048 -1.480151 -2.701647 -0.060811 -0.133446 -0.009070
