t x y theta dxdt dydt dthetadt
0.000000 0.000000 0.000000 1.314849 0.035528 0.023709 0.010347
0.033333 0.001115 0.000830 1.321426 0.039871 0.026910 0.007976
0.066667 0.002351 0.001729 1.331160 0.044533 0.030271 0.001891
0.100000 0.003819 0.002704 1.327906 0.049433 0.033735 -0.003825
0.133333 0.005562 0.003908 1.323791 0.054553 0.037287 -0.009723
0.166667 0.007429 0.005185 1.324159 0.059891 0.040911 -0.015453
0.200000 0.009664 0.006728 1.320549 0.065526 0.044682 -0.020007
0.233333 0.012027 0.008346 1.315411 0.071543 0.048687 -0.021071
0.266667 0.014518 0.010043 1.317824 0.078056 0.053025 -0.018169
0.300000 0.017138 0.011819 1.315161 0.085203 0.057804 -0.020285
0.333333 0.019888 0.013675 1.310266 0.093002 0.063055 -0.039396
0.366667 0.022769 0.015613 1.311866 0.101469 0.068811 -0.089273
0.400000 0.025781 0.017635 1.308689 0.110622 0.075055 -0.182054
0.433333 0.028925 0.019742 1.322154 0.120478 0.081765 -0.338180
0.466667 0.033076 0.022531 1.321091 0.131127 0.088921 -0.570278
0.500000 0.037359 0.025407 1.315307 0.142789 0.096541 -0.881869
0.533333 0.042910 0.029219 1.319013 0.155781 0.104626 -1.262065
0.566667 0.048589 0.033118 1.333089 0.170418 0.113180 -1.694316
0.600000 0.054394 0.037105 1.314555 0.186788 0.122111 -2.166227
0.633333 0.060323 0.041178 1.248301 0.205077 0.131295 -2.644928
0.666667 0.066371 0.045338 1.098748 0.225319 0.140602 -3.097343
0.700000 0.072538 0.049585 0.924932 0.247339 0.149753 -3.491394
0.733333 0.080627 0.054796 0.795350 0.270799 0.158408 -3.808926
0.766667 0.088826 0.060093 0.606927 0.295361 0.166228 -4.033324
0.800000 0.098908 0.066106 0.425360 0.320685 0.172895 -4.147629
0.833333 0.110786 0.072651 0.233424 0.346106 0.177983 -4.151386
0.866667 0.124325 0.079513 0.075414 0.370908 0.180899 -4.056745
0.900000 0.137943 0.086452 -0.056581 0.394370 0.181064 -3.884351
0.933333 0.151627 0.093466 -0.186513 0.415985 0.178178 -3.643752
0.966667 0.166588 0.100148 -0.281300 0.435151 0.171780 -3.351744
1.000000 0.181592 0.106901 -0.374024 0.451573 0.161313 -3.030369
1.033333 0.197548 0.112844 -0.471602 0.465232 0.146620 -2.702860
1.066667 0.214261 0.117770 -0.562104 0.476291 0.127818 -2.379681
1.100000 0.230976 0.122765 -0.667869 0.484983 0.105168 -2.056122
1.133333 0.247678 0.127828 -0.742317 0.491454 0.078769 -1.737144
1.166667 0.264574 0.131295 -0.783981 0.496018 0.049104 -1.424448
1.200000 0.281517 0.132998 -0.793616 0.498803 0.017092 -1.114077
1.233333 0.298453 0.132712 -0.834740 0.499968 -0.016494 -0.793695
1.266667 0.315314 0.132509 -0.839356 0.499677 -0.050906 -0.464837
1.300000 0.332146 0.130011 -0.824312 0.498103 -0.085103 -0.143128
1.333333 0.348976 0.125169 -0.855906 0.495413 -0.117839 0.163630
1.366667 0.365688 0.120438 -0.903209 0.491736 -0.148124 0.452298
1.400000 0.382236 0.113876 -0.879344 0.487253 -0.175180 0.718711
1.433333 0.398583 0.105843 -0.823106 0.482085 -0.198363 0.948252
1.466667 0.414767 0.097965 -0.745507 0.476127 -0.217003 1.135642
1.500000 0.430647 0.089145 -0.670597 0.469296 -0.230873 1.284282
1.533333 0.446176 0.079654 -0.617604 0.461537 -0.240087 1.391201
1.566667 0.461497 0.070370 -0.560421 0.452540 -0.244565 1.450100
1.600000 0.476597 0.061311 -0.503095 0.441733 -0.244312 1.461649
1.633333 0.491461 0.052496 -0.442414 0.428537 -0.239429 1.436850
1.666667 0.506077 0.043942 -0.388843 0.412470 -0.230054 1.385567
1.700000 0.520430 0.035667 -0.350519 0.392833 -0.216130 1.310377
1.733333 0.534507 0.027690 -0.312502 0.368898 -0.197541 1.214818
1.766667 0.548296 0.020028 -0.285322 0.340242 -0.174295 1.106026
1.800000 0.559896 0.013980 -0.261550 0.307079 -0.146688 0.987412
1.833333 0.571184 0.008280 -0.216570 0.269631 -0.114884 0.857678
1.866667 0.582149 0.002945 -0.180946 0.228311 -0.079154 0.718634
1.900000 0.590047 -0.000208 -0.144650 0.184157 -0.040201 0.575714
1.933333 0.594777 -0.000931 -0.113635 0.138418 0.001318 0.433566
1.966667 0.599165 -0.001249 -0.077342 0.092384 0.044650 0.292047
2.000000 0.600591 0.001076 -0.074995 0.046993 0.089352 0.149732
2.033333 0.599356 0.006055 -0.111237 0.003375 0.134792 0.010504
2.066667 0.597778 0.011462 -0.150693 -0.037372 0.180193 -0.123962
2.100000 0.594004 0.019527 -0.165254 -0.074649 0.225155 -0.251323
2.133333 0.589897 0.028025 -0.167332 -0.108240 0.269321 -0.365496
2.166667 0.585461 0.036958 -0.157668 -0.138011 0.312268 -0.460893
2.200000 0.579573 0.048316 -0.148908 -0.163972 0.353481 -0.534009
2.233333 0.573371 0.060110 -0.166638 -0.186525 0.392861 -0.586542
2.266667 0.566317 0.074121 -0.217411 -0.206125 0.430327 -0.620350
2.300000 0.558498 0.090082 -0.245419 -0.223264 0.465766 -0.636060
2.333333 0.550128 0.107841 -0.285576 -0.238228 0.498931 -0.634701
2.366667 0.541479 0.126015 -0.321462 -0.251330 0.529712 -0.615263
2.400000 0.532563 0.144597 -0.343325 -0.262883 0.558188 -0.574759
2.433333 0.523371 0.164508 -0.363248 -0.272987 0.584098 -0.513502
2.466667 0.513932 0.184809 -0.378445 -0.281827 0.607482 -0.433757
2.500000 0.504257 0.205489 -0.388567 -0.289521 0.628473 -0.338991
2.533333 0.494373 0.226999 -0.396921 -0.296235 0.647401 -0.235842
2.566667 0.484237 0.249352 -0.398995 -0.302130 0.664520 -0.130154
2.600000 0.473899 0.272051 -0.410008 -0.307245 0.679939 -0.027257
2.633333 0.463425 0.295400 -0.402242 -0.311617 0.693904 0.070136
2.666667 0.452771 0.319070 -0.399208 -0.315236 0.706514 0.159698
2.700000 0.442077 0.343150 -0.398221 -0.318058 0.717760 0.236227
2.733333 0.431226 0.367524 -0.375990 -0.320016 0.727597 0.295787
2.766667 0.420356 0.392249 -0.368696 -0.321084 0.736148 0.333376
2.800000 0.409483 0.417219 -0.349152 -0.321305 0.743585 0.340120
2.833333 0.398490 0.442441 -0.323961 -0.320765 0.750100 0.311520
2.866667 0.387388 0.467901 -0.312477 -0.319595 0.755895 0.245312
2.900000 0.376461 0.493389 -0.291141 -0.317908 0.761285 0.142749
2.933333 0.365791 0.518809 -0.260827 -0.315852 0.766568 0.006841
2.966667 0.355441 0.544199 -0.246822 -0.313553 0.771979 -0.157178
3.000000 0.345335 0.569701 -0.242003 -0.311112 0.777729 -0.336898
3.033333 0.335177 0.595369 -0.268585 -0.308603 0.783983 -0.519676
3.066667 0.324978 0.621186 -0.297088 -0.306074 0.790902 -0.695212
3.100000 0.314887 0.647755 -0.339896 -0.303556 0.798417 -0.850469
3.133333 0.304776 0.674444 -0.388261 -0.301020 0.806411 -0.971686
3.166667 0.294656 0.701236 -0.431789 -0.298415 0.814662 -1.050005
3.200000 0.284538 0.728116 -0.478673 -0.295647 0.822934 -1.084008
3.233333 0.274616 0.756010 -0.532730 -0.292625 0.830923 -1.076597
3.266667 0.264717 0.783959 -0.587602 -0.289251 0.838324 -1.029570
3.300000 0.255199 0.812700 -0.634414 -0.285476 0.844928 -0.950329
3.333333 0.245726 0.841460 -0.657814 -0.281284 0.850545 -0.850973
3.366667 0.236308 0.870219 -0.676347 -0.276684 0.855052 -0.740151
3.400000 0.226955 0.898959 -0.699787 -0.271710 0.858331 -0.623220
3.433333 0.217974 0.927926 -0.709365 -0.266401 0.860401 -0.506706
3.466667 0.209079 0.956836 -0.712230 -0.260805 0.861295 -0.396642
3.500000 0.200478 0.985803 -0.720994 -0.254914 0.861153 -0.299935
3.533333 0.191983 1.014674 -0.739396 -0.248702 0.860139 -0.215633
3.566667 0.183745 1.043501 -0.743449 -0.242159 0.858417 -0.143536
3.600000 0.175762 1.072250 -0.751423 -0.235268 0.856156 -0.082531
3.633333 0.168017 1.100844 -0.745193 -0.227995 0.853482 -0.031049
3.666667 0.160416 1.129264 -0.737602 -0.220319 0.850487 0.010955
3.700000 0.153096 1.157526 -0.729560 -0.212256 0.847173 0.048418
3.733333 0.145938 1.185575 -0.732131 -0.203837 0.843511 0.076400
3.766667 0.139121 1.213557 -0.728025 -0.195074 0.839473 0.092075
3.800000 0.132636 1.241531 -0.714587 -0.186006 0.834998 0.089141
3.833333 0.126567 1.269491 -0.733372 -0.176702 0.829971 0.067432
3.866667 0.120918 1.297425 -0.723844 -0.167241 0.824278 0.026821
3.900000 0.115473 1.325046 -0.707151 -0.157608 0.817773 -0.034917
3.933333 0.110447 1.352462 -0.688477 -0.147826 0.810300 -0.114085
3.966667 0.105770 1.379667 -0.686073 -0.137918 0.801714 -0.209046
4.000000 0.101320 1.406498 -0.692237 -0.127869 0.791917 -0.313049
4.033333 0.097103 1.432932 -0.698017 -0.117554 0.780782 -0.421157
4.066667 0.093385 1.459098 -0.735020 -0.106770 0.768124 -0.527011
4.100000 0.089914 1.484826 -0.749897 -0.095418 0.753756 -0.623890
4.133333 0.086698 1.510097 -0.779668 -0.083307 0.737431 -0.702674
4.166667 0.083743 1.534892 -0.821760 -0.070227 0.718824 -0.753518
4.200000 0.081056 1.559189 -0.857579 -0.055982 0.697497 -0.769956
4.233333 0.079476 1.582435 -0.885227 -0.040619 0.673209 -0.754193
4.266667 0.078175 1.605146 -0.918948 -0.024308 0.645816 -0.705535
4.300000 0.077159 1.627302 -0.955651 -0.007245 0.615322 -0.622542
4.333333 0.076433 1.648883 -0.993837 0.010228 0.581831 -0.511210
4.366667 0.076902 1.668845 -0.983171 0.027653 0.545713 -0.384920
4.400000 0.078387 1.687133 -1.020824 0.044519 0.507613 -0.249820
4.433333 0.080732 1.703663 -1.029871 0.060486 0.468100 -0.107267
4.466667 0.083802 1.718471 -1.020599 0.075272 0.427904 0.031666
4.500000 0.087369 1.731502 -1.003751 0.088631 0.387757 0.155299
4.533333 0.091188 1.742752 -0.982836 0.100382 0.348516 0.256134
4.566667 0.095317 1.753330 -0.980719 0.110513 0.310774 0.341121
4.600000 0.099412 1.762195 -0.962096 0.119084 0.274933 0.400930
4.633333 0.103820 1.770370 -0.925497 0.126114 0.241246 0.431212
4.666667 0.107842 1.776986 -0.905154 0.131727 0.209773 0.439625
4.700000 0.112181 1.782898 -0.898078 0.136078 0.180382 0.431353
4.733333 0.116838 1.788099 -0.864028 0.139404 0.152712 0.409393
4.766667 0.121815 1.792582 -0.846254 0.141869 0.126489 0.370060
4.800000 0.127116 1.796344 -0.864547 0.143669 0.101361 0.323508
4.833333 0.132740 1.799377 -0.847056 0.145081 0.077071 0.276353
4.866667 0.137611 1.801465 -0.838118 0.146291 0.053346 0.228309
4.900000 0.142810 1.802815 -0.818721 0.147472 0.030009 0.179561
4.933333 0.147453 1.803364 -0.825380 0.148808 0.006995 0.138917
4.966667 0.151666 1.803178 -0.817099 0.150500 -0.015726 0.108510
5.000000 0.156220 1.802242 -0.812331 0.152705 -0.038103 0.086839
5.033333 0.161119 1.800553 -0.815064 0.155456 -0.060052 0.072960
5.066667 0.165977 1.798086 -0.827533 0.158758 -0.081501 0.069064
5.100000 0.171189 1.794858 -0.815819 0.162566 -0.102357 0.078803
5.133333 0.176761 1.790870 -0.834534 0.166682 -0.122592 0.098191
5.166667 0.182696 1.786116 -0.821127 0.170876 -0.142245 0.127880
5.200000 0.188640 1.780891 -0.819175 0.174945 -0.161383 0.168386
5.233333 0.194958 1.774897 -0.817842 0.178803 -0.180138 0.219968
5.266667 0.201165 1.768506 -0.799857 0.182398 -0.198635 0.277554
5.300000 0.207196 1.761766 -0.795385 0.185826 -0.217077 0.341076
5.333333 0.213615 1.754251 -0.784193 0.189288 -0.235701 0.411425
5.366667 0.219745 1.746356 -0.778096 0.193044 -0.254787 0.494739
5.400000 0.226276 1.737682 -0.762684 0.197293 -0.274620 0.597034
5.433333 0.232611 1.728482 -0.733452 0.202245 -0.295515 0.727481
5.466667 0.238750 1.718627 -0.704191 0.208139 -0.317776 0.901955
5.500000 0.245309 1.707990 -0.684520 0.215072 -0.341613 1.129223
5.533333 0.252296 1.696568 -0.663112 0.223200 -0.367135 1.413875
5.566667 0.259716 1.684360 -0.636927 0.232650 -0.394276 1.753290
5.600000 0.267578 1.671367 -0.617057 0.243638 -0.422878 2.141331
5.633333 0.275886 1.657587 -0.560286 0.256244 -0.452637 2.560301
5.666667 0.284287 1.642454 -0.467121 0.270456 -0.483136 2.980426
5.700000 0.292968 1.625952 -0.371005 0.286369 -0.513913 3.369889
5.733333 0.302112 1.608081 -0.250921 0.303945 -0.544491 3.697745
5.766667 0.311931 1.588847 -0.070765 0.323057 -0.574444 3.932153
5.800000 0.322590 1.568361 0.124874 0.343452 -0.603389 4.043319
5.833333 0.333733 1.547102 0.336851 0.364947 -0.631013 4.011658
5.866667 0.345989 1.525001 0.529293 0.387345 -0.657141 3.833930
5.900000 0.359417 1.502240 0.697797 0.410280 -0.681765 3.516887
5.933333 0.374051 1.478972 0.833929 0.433413 -0.705011 3.074630
5.966667 0.389184 1.454953 0.955318 0.456495 -0.727097 2.534336
6.000000 0.404817 1.430188 1.022061 0.479378 -0.748344 1.931562
6.033333 0.421550 1.405025 1.068704 0.501863 -0.769100 1.303670
6.066667 0.438786 1.379128 1.077529 0.523847 -0.789681 0.682286
6.100000 0.456525 1.352505 1.070218 0.545424 -0.810323 0.093853
6.133333 0.475113 1.325272 1.036173 0.566791 -0.831189 -0.435867
6.166667 0.494203 1.297326 0.991443 0.588226 -0.852427 -0.891687
6.200000 0.514034 1.268677 0.925797 0.609904 -0.874086 -1.265149
6.233333 0.534609 1.239336 0.884065 0.632079 -0.896159 -1.555074
6.266667 0.556084 1.209161 0.795847 0.654940 -0.918621 -1.758552
6.300000 0.578056 1.178304 0.726128 0.678672 -0.941467 -1.880195
6.333333 0.600994 1.146480 0.643902 0.703446 -0.964664 -1.929326
6.366667 0.624422 1.113992 0.560870 0.729242 -0.988108 -1.915446
6.400000 0.648335 1.080850 0.459460 0.756119 -1.011717 -1.848020
6.433333 0.673437 1.046891 0.398452 0.784235 -1.035459 -1.735415
6.466667 0.699998 1.011916 0.336119 0.813911 -1.059350 -1.594155
6.500000 0.728158 0.975910 0.278875 0.845133 -1.083298 -1.433468
6.533333 0.756780 0.939292 0.246480 0.877699 -1.107214 -1.261641
6.566667 0.785854 0.902075 0.216250 0.911672 -1.131109 -1.087502
6.600000 0.815373 0.864272 0.200563 0.947100 -1.154994 -0.924009
6.633333 0.847138 0.825354 0.178353 0.983634 -1.178791 -0.777559
6.666667 0.881229 0.785377 0.152014 1.020534 -1.202319 -0.649838
6.700000 0.915730 0.744855 0.121055 1.057396 -1.225508 -0.542691
6.733333 0.950626 0.703802 0.121542 1.094088 -1.248400 -0.459636
6.766667 0.987909 0.661804 0.112812 1.129960 -1.270870 -0.399714
6.800000 1.027761 0.618620 0.107469 1.164177 -1.292736 -0.358126
6.833333 1.067957 0.574954 0.088214 1.196437 -1.314027 -0.332081
6.866667 1.108479 0.530823 0.096437 1.226859 -1.334884 -0.322029
6.900000 1.151421 0.485468 0.076943 1.255441 -1.355489 -0.326187
6.933333 1.194646 0.439685 0.076287 1.281875 -1.375842 -0.339539
6.966667 1.238130 0.393491 0.070360 1.306365 -1.396078 -0.358919
7.000000 1.281851 0.346906 0.065267 1.329560 -1.416547 -0.379466
7.033333 1.325785 0.299950 0.040611 1.351787 -1.437454 -0.399783
7.066667 1.371755 0.251537 0.024244 1.373120 -1.458961 -0.412831
7.100000 1.417889 0.202794 -0.003594 1.393692 -1.481075 -0.415322
7.133333 1.464162 0.153742 -0.023167 1.413827 -1.503974 -0.403623
7.166667 1.511988 0.103202 -0.028637 1.433591 -1.527782 -0.377217
7.200000 1.559899 0.052399 -0.040331 1.452719 -1.552363 -0.336920
7.233333 1.609649 -0.000368 -0.063809 1.470804 -1.577419 -0.284040
7.266667 1.659428 -0.053349 -0.078590 1.487640 -1.602732 -0.223010
7.300000 1.709205 -0.106519 -0.095480 1.502992 -1.628157 -0.158522
7.333333 1.759836 -0.161057 -0.085722 1.516474 -1.653284 -0.099932
7.366667 1.811232 -0.216941 -0.082352 1.527775 -1.677690 -0.051106
7.400000 1.863254 -0.274056 -0.075312 1.536602 -1.700957 -0.018165
7.433333 1.915150 -0.331246 -0.077961 1.542916 -1.722940 -0.006240
7.466667 1.967355 -0.389483 -0.065356 1.546454 -1.743300 -0.019507
7.500000 2.019707 -0.448712 -0.067433 1.546826 -1.761649 -0.058742
7.533333 2.071836 -0.507921 -0.044967 1.543729 -1.777935 -0.119816
7.566667 2.124008 -0.568114 -0.041897 1.536847 -1.792137 -0.201671
7.600000 2.176007 -0.629177 -0.043130 1.525980 -1.804343 -0.300524
7.633333 2.227683 -0.690118 -0.061969 1.510774 -1.814507 -0.408249
7.666667 2.279004 -0.750899 -0.086001 1.491126 -1.822739 -0.519937
7.700000 2.329434 -0.812100 -0.111277 1.467235 -1.829197 -0.631730
7.733333 2.379444 -0.873071 -0.124205 1.439218 -1.833807 -0.738661
7.766667 2.428275 -0.934443 -0.163363 1.407441 -1.836493 -0.837302
7.800000 2.475700 -0.996066 -0.197196 1.372078 -1.837148 -0.922967
7.833333 2.521397 -1.057735 -0.237653 1.333421 -1.835579 -0.999056
7.866667 2.565363 -1.119627 -0.265405 1.291528 -1.831479 -1.063100
7.900000 2.607281 -1.181509 -0.310314 1.246373 -1.824561 -1.112431
7.933333 2.648612 -1.242934 -0.340272 1.198010 -1.814562 -1.147815
7.966667 2.687521 -1.304261 -0.361136 1.146383 -1.801243 -1.169159
8.000000 2.725799 -1.365052 -0.432704 1.091738 -1.784490 -1.176637
8.033333 2.763427 -1.425271 -0.486477 1.034200 -1.764277 -1.166366
8.066667 2.797809 -1.484454 -0.506466 0.974129 -1.740670 -1.138076
8.100000 2.831504 -1.542987 -0.571792 0.911683 -1.713751 -1.091933
8.133333 2.861685 -1.600192 -0.586868 0.847344 -1.683717 -1.031252
8.166667 2.888418 -1.656135 -0.635684 0.781393 -1.650718 -0.954505
8.200000 2.911785 -1.710977 -0.682422 0.714011 -1.614750 -0.863200
8.233333 2.934422 -1.765024 -0.713943 0.645558 -1.575850 -0.760041
8.266667 2.953338 -1.817004 -0.716983 0.576395 -1.534147 -0.645779
8.300000 2.971519 -1.868121 -0.741111 0.507009 -1.489739 -0.524635
8.333333 2.988965 -1.918344 -0.748508 0.437454 -1.442702 -0.392440
8.366667 3.002901 -1.966409 -0.770394 0.367986 -1.393246 -0.250885
8.400000 3.013466 -2.012258 -0.777553 0.298906 -1.341765 -0.105264
8.433333 3.023305 -2.057121 -0.789631 0.230545 -1.288677 0.042424
8.466667 3.030036 -2.099553 -0.783561 0.163208 -1.234397 0.191146
8.500000 3.033857 -2.139749 -0.794420 0.097382 -1.179442 0.343127
8.533333 3.034949 -2.177789 -0.749645 0.033994 -1.124407 0.489603
8.566667 3.033496 -2.213726 -0.741517 -0.026107 -1.069811 0.624236
8.600000 3.029718 -2.247631 -0.708892 -0.082184 -1.016066 0.745035
8.633333 3.025303 -2.280410 -0.690580 -0.133486 -0.963514 0.850994
8.666667 3.018912 -2.311446 -0.632575 -0.179363 -0.912248 0.934729
8.700000 3.010821 -2.340739 -0.595563 -0.219319 -0.862096 0.986829
8.733333 3.001283 -2.368296 -0.547409 -0.253267 -0.812790 1.008728
8.766667 2.990611 -2.394104 -0.536058 -0.281069 -0.763834 1.005656
8.800000 2.979427 -2.418705 -0.483884 -0.302727 -0.714634 0.981257
8.833333 2.967758 -2.442086 -0.436411 -0.318224 -0.664538 0.938866
8.866667 2.955756 -2.463678 -0.387147 -0.327761 -0.613130 0.884442
8.900000 2.943324 -2.484027 -0.375234 -0.331788 -0.560223 0.829429
8.933333 2.930492 -2.503121 -0.347382 -0.330731 -0.505586 0.780660
8.966667 2.918126 -2.519988 -0.333953 -0.325191 -0.449249 0.737264
9.000000 2.906428 -2.534556 -0.307991 -0.315722 -0.391408 0.701065
9.033333 2.895883 -2.546486 -0.309691 -0.303354 -0.332641 0.669777
9.066667 2.885044 -2.557132 -0.300771 -0.288745 -0.273316 0.643392
9.100000 2.876095 -2.564572 -0.277967 -0.272389 -0.213826 0.612346
9.133333 2.866899 -2.570723 -0.246936 -0.254601 -0.154529 0.568202
9.166667 2.860015 -2.573503 -0.192634 -0.235850 -0.095869 0.500209
9.200000 2.852928 -2.574996 -0.182053 -0.216438 -0.038116 0.405673
9.233333 2.845657 -2.575205 -0.168562 -0.196136 0.018943 0.282201
9.266667 2.838224 -2.574134 -0.141685 -0.174974 0.075397 0.130162
9.300000 2.833054 -2.570229 -0.119566 -0.153084 0.131376 -0.042744
9.333333 2.827759 -2.565055 -0.109244 -0.130748 0.186942 -0.228291
9.366667 2.822355 -2.558620 -0.119846 -0.107874 0.242398 -0.406501
9.400000 2.818765 -2.549975 -0.156313 -0.084615 0.297884 -0.571031
9.433333 2.816661 -2.539188 -0.206427 -0.061522 0.353187 -0.711978
9.466667 2.815786 -2.526248 -0.239369 -0.039239 0.407934 -0.824513
9.500000 2.815943 -2.511152 -0.308122 -0.018074 0.461951 -0.902575
9.533333 2.816057 -2.494850 -0.340033 0.001639 0.514971 -0.947083
9.566667 2.817020 -2.476394 -0.379880 0.019433 0.566650 -0.963689
9.600000 2.818810 -2.455766 -0.400668 0.035091 0.616720 -0.957712
9.633333 2.820585 -2.433983 -0.433561 0.048731 0.665146 -0.936938
9.666667 2.823160 -2.410044 -0.451498 0.060738 0.712120 -0.905098
9.700000 2.825736 -2.384989 -0.477172 0.071336 0.757653 -0.870652
9.733333 2.828317 -2.358839 -0.506858 0.080816 0.801846 -0.833718
9.766667 2.830913 -2.331616 -0.535902 0.089544 0.844861 -0.797348
9.800000 2.833527 -2.303343 -0.560867 0.097910 0.887047 -0.759836
9.833333 2.837021 -2.272807 -0.593962 0.106103 0.928573 -0.718570
9.866667 2.840546 -2.241267 -0.629460 0.114253 0.969556 -0.672648
9.900000 2.844828 -2.207580 -0.644221 0.122444 1.010102 -0.624297
9.933333 2.849150 -2.172941 -0.672788 0.130789 1.050372 -0.573925
9.966667 2.853516 -2.137377 -0.703618 0.139300 1.090345 -0.522778
10.000000 2.858457 -2.100035 -0.702724 0.147805 1.129695 -0.471823
10.033333 2.863448 -2.061825 -0.703594 0.156273 1.168301 -0.424309
10.066667 2.868493 -2.022775 -0.713589 0.164665 1.206084 -0.383318
10.100000 2.874112 -1.981740 -0.714036 0.172963 1.242979 -0.344515
10.133333 2.880308 -1.938786 -0.740844 0.181050 1.278720 -0.309120
10.166667 2.886563 -1.895086 -0.759571 0.188853 1.313142 -0.276005
10.200000 2.892879 -1.850675 -0.754536 0.196400 1.346243 -0.244242
10.233333 2.899667 -1.804833 -0.782066 0.203623 1.377870 -0.208080
10.266667 2.906855 -1.757718 -0.772582 0.210396 1.407717 -0.169374
10.300000 2.914106 -1.709994 -0.786253 0.216631 1.435553 -0.129706
10.333333 2.921600 -1.661223 -0.792847 0.222337 1.461354 -0.091453
10.366667 2.929157 -1.611915 -0.806052 0.227528 1.485097 -0.057381
10.400000 2.936950 -1.561479 -0.790793 0.232170 1.506673 -0.027149
10.433333 2.944953 -1.510073 -0.789564 0.236314 1.526022 -0.009273
10.466667 2.953015 -1.458243 -0.774587 0.240080 1.543242 -0.001292
10.500000 2.961135 -1.406028 -0.774067 0.243559 1.558377 -0.005766
10.533333 2.969309 -1.353467 -0.771040 0.246828 1.571458 -0.025360
10.566667 2.977650 -1.300411 -0.768580 0.250006 1.582428 -0.056798
10.600000 2.986044 -1.247086 -0.771382 0.253299 1.591301 -0.103343
10.633333 2.994487 -1.193530 -0.787922 0.256827 1.598144 -0.155289
10.666667 3.002977 -1.139783 -0.777519 0.260683 1.602974 -0.213596
10.700000 3.011513 -1.085884 -0.802590 0.264958 1.605808 -0.271570
10.733333 3.020092 -1.031871 -0.779739 0.269772 1.606521 -0.323238
10.766667 3.029227 -0.977865 -0.808416 0.275121 1.605177 -0.369735
10.800000 3.038399 -0.923824 -0.813731 0.280868 1.601857 -0.406048
10.833333 3.047605 -0.869784 -0.851320 0.286943 1.596487 -0.435663
10.866667 3.056842 -0.815784 -0.888099 0.293276 1.588990 -0.452707
10.900000 3.066698 -0.762733 -0.889277 0.299746 1.579367 -0.463083
10.933333 3.077278 -0.710239 -0.914056 0.306102 1.567676 -0.464280
10.966667 3.087876 -0.657897 -0.903921 0.312220 1.553879 -0.458387
11.000000 3.098487 -0.605742 -0.933339 0.318033 1.537673 -0.445900
11.033333 3.109106 -0.553811 -0.951434 0.323418 1.518811 -0.430541
11.066667 3.120245 -0.503381 -0.953506 0.328207 1.497155 -0.418951
11.100000 3.131381 -0.453244 -0.991236 0.332334 1.472419 -0.404394
11.133333 3.142508 -0.403433 -0.987916 0.335840 1.444306 -0.391138
11.166667 3.154049 -0.355340 -0.984078 0.338664 1.412437 -0.373673
11.200000 3.165567 -0.307637 -1.009762 0.340746 1.376895 -0.351347
11.233333 3.177057 -0.260355 -1.029681 0.342033 1.337997 -0.320972
11.266667 3.188689 -0.215744 -1.034397 0.342546 1.296041 -0.281653
11.300000 3.200279 -0.171613 -1.063770 0.342201 1.251186 -0.237550
11.333333 3.211810 -0.130717 -1.059921 0.340916 1.204099 -0.188024
11.366667 3.223458 -0.092420 -1.066473 0.338650 1.155566 -0.134799
11.400000 3.235044 -0.054674 -1.086249 0.335296 1.105936 -0.084406
11.433333 3.246559 -0.017501 -1.087595 0.330759 1.055385 -0.038211
11.466667 3.257733 0.016527 -1.070446 0.324888 1.003855 0.005668
11.500000 3.268510 0.047547 -1.070446 0.317606 0.951747 0.043831
11.533333 3.279196 0.077946 -1.030412 0.308753 0.898639 0.073347
11.566667 3.289785 0.107709 -1.030412 0.298211 0.844010 0.091186
11.600000 3.300272 0.136825 -1.070885 0.285951 0.787669 0.100498
11.633333 3.309978 0.162708 -1.058673 0.271996 0.729640 0.101841
11.666667 3.319570 0.187923 -1.039578 0.256453 0.670071 0.095848
11.700000 3.328213 0.209726 -1.034960 0.239519 0.609070 0.083439
11.733333 3.335908 0.228297 -1.034960 0.221552 0.547491 0.068967
11.766667 3.343474 0.246187 -1.024394 0.202954 0.486386 0.054179
11.800000 3.350097 0.261210 -1.038463 0.184235 0.426969 0.041539
11.833333 3.355795 0.273502 -1.032493 0.165837 0.370239 0.032105
11.866667 3.360628 0.283272 -1.010961 0.148219 0.317378 0.020034
11.900000 3.364581 0.290862 -1.021134 0.131723 0.269260 0.010411
11.933333 3.367737 0.296635 -1.049991 0.116606 0.226324 0.006162
11.966667 3.370758 0.301761 -1.027158 0.103058 0.188875 0.004293
12.000000 3.373644 0.306253 -1.027158 0.091080 0.156751 0.002655
12.033333 3.376397 0.310122 -1.041148 0.080632 0.129630 0.000138
12.066667 3.378629 0.313377 -1.041148 0.071586 0.106933 0.005685
12.100000 3.380730 0.316036 -1.041148 0.063761 0.088114 0.015460
12.133333 3.382703 0.318111 -1.022184 0.056917 0.072601 0.017723
12.166667 3.384302 0.320168 -0.994192 0.050841 0.059831 0.017775
12.200000 3.385777 0.321669 -1.049752 0.045388 0.049422 0.018222
12.233333 3.387130 0.322628 -1.042080 0.040461 0.041078 0.016912
12.266667 3.388280 0.323645 -1.017341 0.035966 0.034488 0.010485
12.300000 3.389313 0.324148 -1.041384 0.031869 0.029419 0.001715
12.333333 3.390231 0.324152 -1.012718 0.028176 0.025665 -0.001955
12.366667 3.390994 0.324428 -1.006616 0.024860 0.022997 -0.000404
12.400000 3.391669 0.324944 -1.034383 0.021888 0.021124 0.001813
