t x y theta dxdt dydt dthetadt
0.000000 0.000000 0.000000 -0.819639 0.138667 -0.058514 1.346468
0.033333 0.004695 -0.001969 -0.761083 0.141639 -0.058957 1.571407
0.066667 0.009487 -0.003937 -0.674372 0.144530 -0.059384 1.784044
0.100000 0.014377 -0.005936 -0.607225 0.147340 -0.059804 1.981952
0.133333 0.019355 -0.007935 -0.542352 0.150072 -0.060228 2.167068
0.166667 0.024416 -0.009933 -0.481209 0.152733 -0.060670 2.341275
0.200000 0.029570 -0.011962 -0.401457 0.155330 -0.061138 2.495984
0.233333 0.034798 -0.013993 -0.323619 0.157870 -0.061642 2.604760
0.266667 0.040116 -0.016054 -0.255823 0.160360 -0.062185 2.647929
0.300000 0.045507 -0.018122 -0.198563 0.162806 -0.062775 2.626501
0.333333 0.050973 -0.020199 -0.086540 0.165215 -0.063411 2.531930
0.366667 0.056524 -0.022306 0.108667 0.167594 -0.064091 2.351336
0.400000 0.062156 -0.024443 0.318007 0.169947 -0.064813 2.080326
0.433333 0.067868 -0.026609 0.382884 0.172274 -0.065568 1.733987
0.466667 0.073658 -0.028804 0.431484 0.174583 -0.066350 1.320660
0.500000 0.079523 -0.031029 0.444506 0.176885 -0.067149 0.846395
0.533333 0.085462 -0.033283 0.434915 0.179188 -0.067953 0.346268
0.566667 0.091472 -0.035565 0.397632 0.181504 -0.068751 -0.133087
0.600000 0.097552 -0.037877 0.382056 0.183848 -0.069534 -0.549993
0.633333 0.103698 -0.040216 0.384105 0.186244 -0.070294 -0.883707
0.666667 0.109953 -0.042576 0.317143 0.188701 -0.071025 -1.104818
0.700000 0.116271 -0.044964 0.244575 0.191224 -0.071727 -1.202812
0.733333 0.122648 -0.047379 0.172663 0.193807 -0.072403 -1.186161
0.766667 0.129083 -0.049821 0.051678 0.196451 -0.073059 -1.057442
0.800000 0.135644 -0.052276 -0.088988 0.199143 -0.073702 -0.804815
0.833333 0.142330 -0.054741 -0.111529 0.201854 -0.074345 -0.410717
0.866667 0.149141 -0.057218 -0.041889 0.204570 -0.075003 0.124049
0.900000 0.156000 -0.059721 -0.007011 0.207274 -0.075693 0.801654
0.933333 0.162981 -0.062243 0.004391 0.209949 -0.076430 1.612972
0.966667 0.170084 -0.064786 -0.001253 0.212561 -0.077228 2.521656
1.000000 0.177224 -0.067353 -0.010455 0.215083 -0.078095 3.463840
1.033333 0.184472 -0.069948 0.027261 0.217493 -0.079030 4.382278
1.066667 0.191752 -0.072568 0.191096 0.219771 -0.080032 5.226366
1.100000 0.199125 -0.075223 0.451306 0.221888 -0.081090 5.942730
1.133333 0.206585 -0.077922 0.787923 0.223824 -0.082190 6.480982
1.166667 0.214127 -0.080672 1.146615 0.225577 -0.083324 6.804240
1.200000 0.221750 -0.083481 1.511393 0.227139 -0.084489 6.896411
1.233333 0.229449 -0.086356 1.828466 0.228513 -0.085683 6.750971
1.266667 0.237161 -0.089252 2.122628 0.229686 -0.086897 6.381412
1.300000 0.244880 -0.092169 2.371025 0.230664 -0.088127 5.822636
1.333333 0.252605 -0.095106 2.523041 0.231456 -0.089378 5.133385
1.366667 0.260331 -0.098063 2.643951 0.232067 -0.090658 4.378955
1.400000 0.268116 -0.101111 2.733057 0.232499 -0.091965 3.624156
1.433333 0.275896 -0.104177 2.806889 0.232759 -0.093305 2.917447
1.466667 0.283666 -0.107260 2.868618 0.232856 -0.094698 2.294427
1.500000 0.291470 -0.110440 2.911613 0.232790 -0.096161 1.773994
1.533333 0.299295 -0.113716 2.928422 0.232546 -0.097696 1.352693
1.566667 0.307100 -0.117007 2.952379 0.232109 -0.099295 1.019104
1.600000 0.314879 -0.120312 2.963847 0.231476 -0.100950 0.756622
1.633333 0.322630 -0.123628 2.976095 0.230633 -0.102657 0.553977
1.666667 0.330356 -0.127041 3.000509 0.229572 -0.104388 0.395734
1.700000 0.338043 -0.130551 3.019509 0.228297 -0.106110 0.271580
1.733333 0.345680 -0.134155 3.029199 0.226821 -0.107794 0.173873
1.766667 0.353272 -0.137766 3.015115 0.225159 -0.109420 0.098764
1.800000 0.360793 -0.141465 3.013343 0.223316 -0.110962 0.042714
1.833333 0.368232 -0.145249 2.997221 0.221307 -0.112381 0.001642
1.866667 0.375581 -0.149113 2.992252 0.219150 -0.113649 -0.023673
1.900000 0.382873 -0.152978 2.991041 0.216855 -0.114754 -0.036720
1.933333 0.390102 -0.156841 2.992378 0.214434 -0.115691 -0.037796
1.966667 0.397220 -0.160767 2.986685 0.211897 -0.116450 -0.029143
2.000000 0.404270 -0.164688 2.981565 0.209259 -0.117026 -0.015122
2.033333 0.411248 -0.168603 2.994720 0.206521 -0.117437 0.001105
2.066667 0.418097 -0.172561 2.996750 0.203677 -0.117703 0.013601
2.100000 0.424868 -0.176509 2.988054 0.200714 -0.117837 0.020400
2.133333 0.431500 -0.180487 3.002982 0.197617 -0.117846 0.019608
2.166667 0.438046 -0.184451 2.989905 0.194371 -0.117744 0.009984
2.200000 0.444503 -0.188397 2.998725 0.190960 -0.117542 -0.007186
2.233333 0.450868 -0.192325 3.003067 0.187376 -0.117242 -0.030443
2.266667 0.457137 -0.196231 3.007303 0.183617 -0.116844 -0.056343
2.300000 0.463245 -0.200138 3.010653 0.179695 -0.116349 -0.083653
2.333333 0.469252 -0.204019 2.996728 0.175628 -0.115761 -0.110716
2.366667 0.475088 -0.207888 2.995970 0.171437 -0.115081 -0.137087
2.400000 0.480750 -0.211739 2.983866 0.167140 -0.114308 -0.159870
2.433333 0.486232 -0.215565 2.968539 0.162771 -0.113442 -0.176462
2.466667 0.491533 -0.219360 2.974181 0.158358 -0.112475 -0.188537
2.500000 0.496718 -0.223118 2.958916 0.153917 -0.111407 -0.194780
2.533333 0.501785 -0.226839 2.948874 0.149452 -0.110229 -0.194572
2.566667 0.506659 -0.230511 2.939824 0.144959 -0.108934 -0.186264
2.600000 0.511411 -0.234141 2.943350 0.140427 -0.107519 -0.173361
2.633333 0.516038 -0.237726 2.942681 0.135823 -0.105979 -0.159395
2.666667 0.520538 -0.241265 2.927154 0.131115 -0.104312 -0.142083
2.700000 0.524909 -0.244755 2.918339 0.126275 -0.102518 -0.123648
2.733333 0.529071 -0.248168 2.912054 0.121297 -0.100602 -0.105830
2.766667 0.533099 -0.251528 2.915092 0.116180 -0.098573 -0.090235
2.800000 0.536913 -0.254802 2.913360 0.110943 -0.096446 -0.074570
2.833333 0.540589 -0.258019 2.912483 0.105616 -0.094236 -0.057917
2.866667 0.544048 -0.261143 2.915929 0.100231 -0.091958 -0.043659
2.900000 0.547287 -0.264175 2.912759 0.094824 -0.089628 -0.031559
2.933333 0.550308 -0.267112 2.904707 0.089421 -0.087259 -0.020223
2.966667 0.553111 -0.269954 2.911798 0.084045 -0.084861 -0.008344
3.000000 0.555769 -0.272729 2.909607 0.078702 -0.082437 0.006031
3.033333 0.558283 -0.275436 2.906916 0.073401 -0.079991 0.023585
3.066667 0.560650 -0.278073 2.908352 0.068147 -0.077526 0.047564
3.100000 0.562870 -0.280639 2.911902 0.062924 -0.075035 0.079092
3.133333 0.564942 -0.283131 2.908731 0.057707 -0.072504 0.116064
3.166667 0.566795 -0.285521 2.916019 0.052473 -0.069925 0.155084
3.200000 0.568427 -0.287808 2.912920 0.047207 -0.067288 0.191554
3.233333 0.569910 -0.290016 2.910442 0.041884 -0.064580 0.224275
3.266667 0.571241 -0.292145 2.921083 0.036487 -0.061793 0.247026
3.300000 0.572357 -0.294166 2.939011 0.031026 -0.058929 0.250510
3.333333 0.573322 -0.296105 2.968932 0.025519 -0.055996 0.230678
3.366667 0.574134 -0.297959 2.983024 0.019970 -0.052991 0.188948
3.400000 0.574735 -0.299699 2.996972 0.014382 -0.049914 0.125560
3.433333 0.575122 -0.301323 3.009282 0.008770 -0.046769 0.039540
3.466667 0.575293 -0.302828 3.010509 0.003148 -0.043560 -0.060028
3.500000 0.575312 -0.304245 2.998223 -0.002486 -0.040284 -0.153655
3.533333 0.575118 -0.305539 3.005592 -0.008128 -0.036943 -0.230289
3.566667 0.574715 -0.306710 3.014129 -0.013751 -0.033547 -0.285593
3.600000 0.574160 -0.307788 2.981694 -0.019336 -0.030107 -0.313288
3.633333 0.573454 -0.308771 2.904895 -0.024866 -0.026633 -0.303658
3.666667 0.572541 -0.309623 2.876312 -0.030334 -0.023127 -0.259233
3.700000 0.571423 -0.310340 2.857450 -0.035724 -0.019598 -0.191504
3.733333 0.570103 -0.310922 2.863093 -0.041023 -0.016048 -0.107867
3.766667 0.568587 -0.311370 2.868955 -0.046230 -0.012474 -0.009695
3.800000 0.566923 -0.311719 2.880549 -0.051339 -0.008872 0.095355
3.833333 0.565112 -0.311970 2.903902 -0.056343 -0.005240 0.191209
3.866667 0.563121 -0.312084 2.922476 -0.061232 -0.001579 0.270108
3.900000 0.560984 -0.312099 2.936751 -0.066006 0.002109 0.331929
3.933333 0.558679 -0.311977 2.952561 -0.070669 0.005823 0.380558
3.966667 0.556230 -0.311754 2.968463 -0.075231 0.009562 0.411850
4.000000 0.553625 -0.311394 2.973319 -0.079701 0.013323 0.427344
4.033333 0.550871 -0.310894 2.982566 -0.084095 0.017102 0.430559
4.066667 0.547973 -0.310253 2.980385 -0.088426 0.020900 0.425027
4.100000 0.544939 -0.309471 3.014181 -0.092706 0.024714 0.390271
4.133333 0.541769 -0.308546 3.038707 -0.096946 0.028540 0.295856
4.166667 0.538465 -0.307520 3.061010 -0.101148 0.032366 0.119485
4.200000 0.535029 -0.306391 3.042986 -0.105315 0.036186 -0.163069
4.233333 0.531462 -0.305160 3.076372 -0.109449 0.039999 -0.570351
4.266667 0.527749 -0.303783 3.111961 -0.113551 0.043803 -1.117511
4.300000 0.523888 -0.302262 3.128234 -0.117616 0.047599 -1.783127
4.333333 0.519881 -0.300597 3.129209 -0.121643 0.051397 -2.524747
4.366667 0.515731 -0.298790 3.085857 -0.125631 0.055214 -3.294297
4.400000 0.511459 -0.296883 3.019446 -0.129585 0.059062 -4.031371
4.433333 0.507051 -0.294834 2.817612 -0.133508 0.062950 -4.658968
4.466667 0.502526 -0.292685 2.524304 -0.137410 0.066894 -5.100198
4.500000 0.497885 -0.290437 2.251861 -0.141304 0.070906 -5.296944
4.533333 0.493116 -0.288040 1.922403 -0.145198 0.074987 -5.210586
4.566667 0.488217 -0.285487 1.629118 -0.149095 0.079125 -4.829468
4.600000 0.483209 -0.282838 1.391041 -0.152991 0.083303 -4.169256
4.633333 0.478068 -0.280025 1.173988 -0.156882 0.087501 -3.281571
4.666667 0.472789 -0.277046 1.028965 -0.160749 0.091676 -2.237468
4.700000 0.467367 -0.273900 0.972629 -0.164577 0.095786 -1.117757
4.733333 0.461797 -0.270590 1.012095 -0.168355 0.099796 -0.009651
4.766667 0.456076 -0.267119 1.133538 -0.172080 0.103677 1.011896
4.800000 0.450201 -0.263494 1.279813 -0.175752 0.107404 1.893728
4.833333 0.444234 -0.259781 1.473739 -0.179368 0.110959 2.589880
4.866667 0.438177 -0.255980 1.633568 -0.182935 0.114341 3.076299
4.900000 0.432033 -0.252095 1.748928 -0.186459 0.117560 3.351469
4.933333 0.425806 -0.248126 1.846055 -0.189944 0.120628 3.436449
4.966667 0.419425 -0.244039 1.982769 -0.193387 0.123562 3.366108
5.000000 0.412966 -0.239872 2.137913 -0.196787 0.126386 3.168300
5.033333 0.406358 -0.235601 2.277935 -0.200143 0.129121 2.890129
5.066667 0.399605 -0.231231 2.395409 -0.203446 0.131779 2.567419
5.100000 0.392713 -0.226768 2.447671 -0.206676 0.134367 2.226807
5.133333 0.385685 -0.222214 2.520619 -0.209802 0.136882 1.881524
5.166667 0.378595 -0.217589 2.547205 -0.212798 0.139322 1.544673
5.200000 0.371446 -0.212895 2.579169 -0.215636 0.141680 1.233067
5.233333 0.364188 -0.208120 2.602671 -0.218289 0.143949 0.949878
5.266667 0.356829 -0.203268 2.619245 -0.220735 0.146125 0.704238
5.300000 0.349382 -0.198341 2.627367 -0.222962 0.148205 0.498000
5.333333 0.341854 -0.193342 2.634900 -0.224972 0.150192 0.337269
5.366667 0.334256 -0.188277 2.651739 -0.226759 0.152083 0.215755
5.400000 0.326598 -0.183148 2.643201 -0.228320 0.153876 0.125083
5.433333 0.318905 -0.177965 2.635014 -0.229651 0.155568 0.062217
5.466667 0.311180 -0.172730 2.627642 -0.230758 0.157161 0.018660
5.500000 0.303422 -0.167442 2.623455 -0.231642 0.158653 -0.007748
5.533333 0.295640 -0.162107 2.635271 -0.232305 0.160043 -0.023660
5.566667 0.287841 -0.156727 2.617815 -0.232748 0.161330 -0.028609
5.600000 0.280034 -0.151306 2.619814 -0.232971 0.162514 -0.026060
5.633333 0.272227 -0.145849 2.621144 -0.232979 0.163593 -0.019447
5.666667 0.264431 -0.140361 2.621834 -0.232766 0.164565 -0.009357
5.700000 0.256628 -0.134836 2.630239 -0.232323 0.165427 -0.000811
5.733333 0.248822 -0.129277 2.628522 -0.231649 0.166178 0.008091
5.766667 0.241057 -0.123699 2.625173 -0.230744 0.166818 0.013622
5.800000 0.233295 -0.118091 2.612697 -0.229617 0.167350 0.018957
5.833333 0.225592 -0.112473 2.629454 -0.228268 0.167774 0.021321
5.866667 0.217956 -0.106849 2.628060 -0.226701 0.168092 0.020932
5.900000 0.210396 -0.101224 2.630130 -0.224926 0.168308 0.021561
5.933333 0.202921 -0.095601 2.624335 -0.222954 0.168427 0.022480
5.966667 0.195466 -0.089959 2.635071 -0.220801 0.168452 0.023283
6.000000 0.188113 -0.084327 2.633121 -0.218482 0.168391 0.021524
6.033333 0.180870 -0.078709 2.629914 -0.216033 0.168254 0.022216
6.066667 0.173655 -0.073078 2.631451 -0.213476 0.168050 0.025043
6.100000 0.166564 -0.067467 2.630848 -0.210836 0.167787 0.029175
6.133333 0.159508 -0.061848 2.634057 -0.208111 0.167463 0.035615
6.166667 0.152589 -0.056255 2.631506 -0.205289 0.167075 0.049385
6.200000 0.145817 -0.050692 2.632545 -0.202355 0.166617 0.076088
6.233333 0.139203 -0.045165 2.635697 -0.199272 0.166078 0.114762
6.266667 0.132632 -0.039637 2.640873 -0.196010 0.165446 0.166932
6.300000 0.126108 -0.034110 2.632727 -0.192544 0.164713 0.238342
6.333333 0.119631 -0.028586 2.640562 -0.188867 0.163876 0.328701
6.366667 0.113203 -0.023067 2.649511 -0.184972 0.162934 0.427505
6.400000 0.106971 -0.017601 2.654749 -0.180853 0.161882 0.511554
6.433333 0.100943 -0.012193 2.657959 -0.176530 0.160728 0.555796
6.466667 0.095125 -0.006844 2.691919 -0.172054 0.159486 0.528227
6.500000 0.089524 -0.001559 2.709083 -0.167481 0.158176 0.393667
6.533333 0.083979 0.003712 2.781278 -0.162882 0.156819 0.116503
6.566667 0.078657 0.008916 2.816490 -0.158350 0.155448 -0.314852
6.600000 0.073555 0.014051 2.844932 -0.153970 0.154092 -0.887183
6.633333 0.068512 0.019169 2.912263 -0.149789 0.152772 -1.573687
6.666667 0.063680 0.024218 2.967140 -0.145822 0.151497 -2.329117
6.700000 0.059045 0.029198 2.908353 -0.142062 0.150274 -3.105641
6.733333 0.054471 0.034158 2.767710 -0.138492 0.149104 -3.833781
6.766667 0.049957 0.039095 2.522264 -0.135066 0.147978 -4.454372
6.800000 0.045503 0.044009 2.215000 -0.131735 0.146885 -4.924036
6.833333 0.041110 0.048898 1.957156 -0.128479 0.145818 -5.206210
6.866667 0.036777 0.053761 1.665328 -0.125274 0.144767 -5.272683
6.900000 0.032601 0.058577 1.406300 -0.122107 0.143721 -5.106258
6.933333 0.028575 0.063351 1.230401 -0.118974 0.142669 -4.719376
6.966667 0.024693 0.068088 1.090014 -0.115888 0.141605 -4.139807
7.000000 0.020944 0.072787 0.982126 -0.112879 0.140528 -3.397648
7.033333 0.017318 0.077452 0.871834 -0.109983 0.139433 -2.522973
7.066667 0.013749 0.082084 0.789854 -0.107242 0.138321 -1.560009
7.100000 0.010278 0.086681 0.733619 -0.104698 0.137191 -0.555440
7.133333 0.006890 0.091241 0.684097 -0.102378 0.136039 0.461328
7.166667 0.003572 0.095762 0.698244 -0.100295 0.134862 1.460580
7.200000 0.000307 0.100241 0.760629 -0.098454 0.133648 2.410250
7.233333 -0.002904 0.104684 0.879961 -0.096846 0.132391 3.269230
7.266667 -0.006063 0.109089 1.036119 -0.095471 0.131075 4.008667
7.300000 -0.009171 0.113457 1.235173 -0.094330 0.129690 4.615128
7.333333 -0.012229 0.117786 1.485923 -0.093433 0.128224 5.064479
7.366667 -0.015296 0.122050 1.766443 -0.092801 0.126669 5.347747
7.400000 -0.018315 0.126275 2.024950 -0.092453 0.125030 5.465406
7.433333 -0.021361 0.130424 2.216703 -0.092402 0.123324 5.434644
7.466667 -0.024362 0.134533 2.419797 -0.092646 0.121576 5.268243
7.500000 -0.027317 0.138599 2.567005 -0.093176 0.119819 4.979503
7.533333 -0.030324 0.142582 2.704137 -0.093966 0.118104 4.592326
7.566667 -0.033392 0.146480 2.839814 -0.094982 0.116478 4.131414
7.600000 -0.036530 0.150292 2.976498 -0.096167 0.114979 3.620375
