t x y theta dxdt dydt dthetadt
0.000000 0.000000 0.000000 -3.019523 0.131331 -0.079498 0.001927
0.033333 0.004431 -0.002688 -3.015918 0.134750 -0.083134 0.001246
0.066667 0.008950 -0.005506 -3.009422 0.138139 -0.086861 -0.001524
0.100000 0.013608 -0.008446 -3.014970 0.141484 -0.090678 -0.004928
0.133333 0.018407 -0.011511 -3.014361 0.144773 -0.094586 -0.006490
0.166667 0.023350 -0.014705 -3.014548 0.148001 -0.098582 -0.007973
0.200000 0.028379 -0.018038 -3.019555 0.151179 -0.102664 -0.009011
0.233333 0.033493 -0.021509 -3.014502 0.154305 -0.106827 -0.010526
0.266667 0.038691 -0.025123 -3.011732 0.157384 -0.111073 -0.010089
0.300000 0.043973 -0.028880 -3.013420 0.160437 -0.115400 -0.009687
0.333333 0.049337 -0.032782 -3.021289 0.163490 -0.119809 -0.008206
0.366667 0.054859 -0.036835 -3.015822 0.166566 -0.124298 -0.005435
0.400000 0.060463 -0.041038 -3.022417 0.169681 -0.128870 -0.002192
0.433333 0.066146 -0.045390 -3.018132 0.172861 -0.133524 0.001679
0.466667 0.071909 -0.049896 -3.015307 0.176112 -0.138260 0.004443
0.500000 0.077838 -0.054567 -3.018468 0.179414 -0.143069 0.006913
0.533333 0.083843 -0.059395 -3.020179 0.182740 -0.147947 0.003587
0.566667 0.089925 -0.064380 -3.015757 0.186062 -0.152886 -0.007178
0.600000 0.096179 -0.069543 -3.014347 0.189355 -0.157879 -0.028033
0.633333 0.102607 -0.074889 -3.021531 0.192584 -0.162918 -0.060130
0.666667 0.109107 -0.080395 -3.006101 0.195726 -0.168008 -0.106538
0.700000 0.115787 -0.086093 -3.007847 0.198772 -0.173154 -0.167204
0.733333 0.122535 -0.091954 -3.016227 0.201718 -0.178373 -0.239188
0.766667 0.129349 -0.097980 -3.013215 0.204560 -0.183685 -0.319247
0.800000 0.136230 -0.104173 -3.020817 0.207290 -0.189103 -0.401092
0.833333 0.143173 -0.110532 -3.035063 0.209921 -0.194655 -0.481413
0.866667 0.150178 -0.117060 -3.058395 0.212461 -0.200357 -0.549994
0.900000 0.157243 -0.123757 -3.085175 0.214933 -0.206239 -0.603612
0.933333 0.164501 -0.130669 -3.122403 0.217346 -0.212312 -0.636525
0.966667 0.171814 -0.137751 3.137820 0.219711 -0.218599 -0.644713
1.000000 0.179220 -0.145136 3.096961 0.222044 -0.225120 -0.627766
1.033333 0.186677 -0.152693 3.079160 0.224343 -0.231875 -0.586539
1.066667 0.194224 -0.160551 3.039522 0.226603 -0.238850 -0.524428
1.100000 0.201820 -0.168581 3.026257 0.228803 -0.246012 -0.444364
1.133333 0.209460 -0.176784 3.018637 0.230944 -0.253333 -0.352641
1.166667 0.217185 -0.185281 3.013828 0.233020 -0.260764 -0.256727
1.200000 0.224992 -0.194069 3.010924 0.235023 -0.268260 -0.163711
1.233333 0.232877 -0.203143 3.001818 0.236948 -0.275779 -0.076353
1.266667 0.240836 -0.212500 2.992574 0.238792 -0.283295 -0.000841
1.300000 0.248867 -0.222137 3.016508 0.240555 -0.290787 0.058750
1.333333 0.256963 -0.232047 3.019181 0.242221 -0.298220 0.103568
1.366667 0.265088 -0.242127 3.025764 0.243781 -0.305582 0.133469
1.400000 0.273273 -0.252474 3.042528 0.245227 -0.312859 0.149757
1.433333 0.281480 -0.262988 3.045485 0.246556 -0.320050 0.153690
1.466667 0.289736 -0.273758 3.049557 0.247762 -0.327150 0.147145
1.500000 0.298036 -0.284780 3.065210 0.248843 -0.334155 0.134855
1.533333 0.306376 -0.296047 3.064330 0.249799 -0.341073 0.117135
1.566667 0.314748 -0.307554 3.061414 0.250628 -0.347892 0.096348
1.600000 0.323150 -0.319296 3.070302 0.251325 -0.354595 0.076905
1.633333 0.331574 -0.331268 3.060108 0.251883 -0.361150 0.060368
1.666667 0.340016 -0.343465 3.071950 0.252296 -0.367535 0.046990
1.700000 0.348470 -0.355880 3.070833 0.252556 -0.373729 0.038925
1.733333 0.356932 -0.368509 3.063778 0.252659 -0.379709 0.035350
1.766667 0.365394 -0.381345 3.069802 0.252605 -0.385462 0.036241
1.800000 0.373847 -0.394325 3.076269 0.252394 -0.390990 0.038358
1.833333 0.382290 -0.407500 3.064244 0.252033 -0.396297 0.041266
1.866667 0.390717 -0.420866 3.073790 0.251527 -0.401383 0.046840
1.900000 0.399124 -0.434365 3.063365 0.250882 -0.406253 0.051905
1.933333 0.407509 -0.447995 3.075519 0.250102 -0.410919 0.057083
1.966667 0.415862 -0.461799 3.084028 0.249195 -0.415396 0.062460
2.000000 0.424175 -0.475769 3.085552 0.248164 -0.419685 0.069766
2.033333 0.432443 -0.489900 3.089051 0.247015 -0.423793 0.075236
2.066667 0.440677 -0.504147 3.083813 0.245751 -0.427732 0.078222
2.100000 0.448874 -0.518508 3.082219 0.244375 -0.431508 0.079824
2.133333 0.457031 -0.532977 3.080172 0.242886 -0.435122 0.080038
2.166667 0.465144 -0.547553 3.097256 0.241279 -0.438578 0.078526
2.200000 0.473184 -0.562259 3.106274 0.239548 -0.441890 0.072220
2.233333 0.481144 -0.577089 3.094670 0.237685 -0.445067 0.064950
2.266667 0.489053 -0.592013 3.107473 0.235685 -0.448117 0.053864
2.300000 0.496908 -0.607028 3.109306 0.233545 -0.451045 0.037870
2.333333 0.504705 -0.622128 3.111287 0.231266 -0.453855 0.017206
2.366667 0.512441 -0.637311 3.109117 0.228846 -0.456549 -0.007665
2.400000 0.520074 -0.652593 3.105373 0.226290 -0.459123 -0.033367
2.433333 0.527598 -0.667970 3.110013 0.223601 -0.461576 -0.061765
2.466667 0.535009 -0.683436 3.107384 0.220790 -0.463902 -0.089442
2.500000 0.542350 -0.698968 3.114675 0.217856 -0.466099 -0.116199
2.533333 0.549568 -0.714579 3.096326 0.214801 -0.468163 -0.142106
2.566667 0.556711 -0.730246 3.090216 0.211633 -0.470089 -0.166372
2.600000 0.563725 -0.745984 3.072316 0.208350 -0.471875 -0.186544
2.633333 0.570659 -0.761769 3.074694 0.204944 -0.473517 -0.201556
2.666667 0.577455 -0.777614 3.077713 0.201411 -0.475017 -0.209915
2.700000 0.584109 -0.793513 3.068205 0.197763 -0.476370 -0.209280
2.733333 0.590676 -0.809446 3.049759 0.194005 -0.477576 -0.198203
2.766667 0.597155 -0.825409 3.048687 0.190139 -0.478634 -0.178806
2.800000 0.603479 -0.841409 3.024163 0.186182 -0.479542 -0.153774
2.833333 0.609644 -0.857441 3.028695 0.182153 -0.480294 -0.123653
2.866667 0.615649 -0.873500 3.012162 0.178057 -0.480888 -0.089881
2.900000 0.621488 -0.889580 3.010677 0.173883 -0.481321 -0.056501
2.933333 0.627158 -0.905678 3.020157 0.169631 -0.481590 -0.027068
2.966667 0.632729 -0.921776 3.018420 0.165300 -0.481691 0.000984
3.000000 0.638200 -0.937872 3.026262 0.160870 -0.481622 0.023300
3.033333 0.643569 -0.953959 3.038780 0.156314 -0.481382 0.040603
3.066667 0.648756 -0.970038 3.040321 0.151615 -0.480968 0.050280
3.100000 0.653757 -0.986100 3.030349 0.146759 -0.480378 0.055764
3.133333 0.658653 -1.002141 3.043095 0.141723 -0.479613 0.058829
3.166667 0.663358 -1.018154 3.038527 0.136500 -0.478672 0.058526
3.200000 0.667868 -1.034135 3.036296 0.131100 -0.477557 0.058691
3.233333 0.672182 -1.050075 3.033103 0.125557 -0.476267 0.059522
3.266667 0.676297 -1.065970 3.038079 0.119906 -0.474803 0.062125
3.300000 0.680210 -1.081813 3.044718 0.114190 -0.473167 0.064005
3.333333 0.683920 -1.097598 3.047441 0.108464 -0.471363 0.065575
3.366667 0.687425 -1.113319 3.054567 0.102772 -0.469392 0.063953
3.400000 0.690723 -1.128968 3.048535 0.097159 -0.467261 0.058430
3.433333 0.693811 -1.144538 3.054298 0.091658 -0.464974 0.048180
3.466667 0.696690 -1.160025 3.059359 0.086310 -0.462540 0.034950
3.500000 0.699461 -1.175438 3.069043 0.081129 -0.459964 0.020382
3.533333 0.702019 -1.190754 3.065336 0.076135 -0.457252 0.005722
3.566667 0.704470 -1.205986 3.062838 0.071337 -0.454410 -0.003512
3.600000 0.706705 -1.221109 3.051627 0.066728 -0.451440 -0.004921
3.633333 0.708835 -1.236139 3.061528 0.062291 -0.448342 0.001440
3.666667 0.710747 -1.251045 3.058326 0.058001 -0.445113 0.015938
3.700000 0.712556 -1.265850 3.051000 0.053851 -0.441756 0.039008
3.733333 0.714262 -1.280549 3.038617 0.049809 -0.438264 0.070982
3.766667 0.715868 -1.295138 3.041261 0.045852 -0.434632 0.108401
3.800000 0.717373 -1.309613 3.042470 0.041962 -0.430857 0.148595
3.833333 0.718673 -1.323935 3.062672 0.038143 -0.426931 0.192390
3.866667 0.719875 -1.338135 3.069727 0.034394 -0.422831 0.238794
3.900000 0.720981 -1.352208 3.090306 0.030722 -0.418530 0.285423
3.933333 0.721900 -1.366115 3.096650 0.027171 -0.413998 0.327561
3.966667 0.722726 -1.379888 3.098965 0.023791 -0.409197 0.362777
4.000000 0.723461 -1.393521 3.108638 0.020633 -0.404088 0.388708
4.033333 0.724033 -1.406974 3.124310 0.017725 -0.398650 0.403285
4.066667 0.724450 -1.420246 -3.139822 0.015109 -0.392875 0.402112
4.100000 0.724780 -1.433366 -3.118077 0.012817 -0.386765 0.382455
4.133333 0.725025 -1.446332 -3.107450 0.010843 -0.380333 0.344513
4.166667 0.725247 -1.459018 -3.089397 0.009175 -0.373609 0.290015
4.200000 0.725455 -1.471420 -3.064640 0.007802 -0.366627 0.221603
4.233333 0.725659 -1.483537 -3.037189 0.006710 -0.359411 0.138466
4.266667 0.725868 -1.495363 -3.035321 0.005855 -0.352002 0.046590
4.300000 0.726087 -1.506896 -3.047054 0.005178 -0.344458 -0.047452
4.333333 0.726231 -1.518254 -3.064468 0.004633 -0.336826 -0.138304
4.366667 0.726301 -1.529435 -3.070324 0.004175 -0.329142 -0.222553
4.400000 0.726401 -1.540310 -3.081494 0.003744 -0.321449 -0.297159
4.433333 0.726537 -1.550875 -3.101820 0.003285 -0.313795 -0.354217
4.466667 0.726603 -1.561256 -3.129182 0.002775 -0.306193 -0.393942
4.500000 0.726717 -1.571319 -3.137589 0.002198 -0.298647 -0.416790
4.533333 0.726880 -1.581063 3.138482 0.001531 -0.291174 -0.423410
4.566667 0.726995 -1.590571 3.115262 0.000745 -0.283801 -0.414393
4.600000 0.727044 -1.599886 3.110848 -0.000164 -0.276541 -0.391476
4.633333 0.727047 -1.608962 3.086960 -0.001192 -0.269390 -0.359419
4.666667 0.727008 -1.617801 3.062321 -0.002342 -0.262367 -0.317990
4.700000 0.726925 -1.626403 3.058553 -0.003608 -0.255475 -0.269532
4.733333 0.726800 -1.634769 3.047191 -0.004964 -0.248701 -0.215615
4.766667 0.726613 -1.642935 3.041931 -0.006380 -0.242020 -0.159479
4.800000 0.726383 -1.650871 3.029628 -0.007834 -0.235418 -0.100953
4.833333 0.726092 -1.658604 3.033539 -0.009314 -0.228889 -0.043302
4.866667 0.725757 -1.666112 3.042140 -0.010802 -0.222417 0.007463
4.900000 0.725363 -1.673416 3.042496 -0.012287 -0.215991 0.051441
4.933333 0.724927 -1.680501 3.048701 -0.013766 -0.209607 0.086650
4.966667 0.724449 -1.687371 3.048498 -0.015237 -0.203264 0.114165
5.000000 0.723915 -1.694033 3.063059 -0.016698 -0.196956 0.129793
5.033333 0.723325 -1.700486 3.067966 -0.018143 -0.190684 0.137076
5.066667 0.722696 -1.706732 3.076393 -0.019570 -0.184448 0.140530
5.100000 0.722012 -1.712769 3.077346 -0.020978 -0.178248 0.139537
5.133333 0.721290 -1.718604 3.088505 -0.022366 -0.172089 0.137004
5.166667 0.720515 -1.724228 3.085548 -0.023732 -0.165974 0.133304
5.200000 0.719688 -1.729639 3.085369 -0.025075 -0.159907 0.132912
5.233333 0.718823 -1.734856 3.091929 -0.026397 -0.153884 0.133222
5.266667 0.717920 -1.739879 3.098227 -0.027701 -0.147901 0.133968
5.300000 0.716967 -1.744689 3.099756 -0.028989 -0.141951 0.136036
5.333333 0.715976 -1.749312 3.100326 -0.030265 -0.136026 0.137690
5.366667 0.714950 -1.753750 3.110308 -0.031528 -0.130107 0.137098
5.400000 0.713874 -1.757974 3.116153 -0.032774 -0.124180 0.131951
5.433333 0.712760 -1.762016 3.113447 -0.033996 -0.118240 0.125490
5.466667 0.711609 -1.765879 3.139877 -0.035190 -0.112285 0.115948
5.500000 0.710420 -1.769565 3.138630 -0.036339 -0.106311 0.102267
5.533333 0.709183 -1.773034 3.140740 -0.037427 -0.100317 0.084580
5.566667 0.707898 -1.776286 3.133019 -0.038452 -0.094317 0.067125
5.600000 0.706567 -1.779321 3.139745 -0.039412 -0.088316 0.051681
5.633333 0.705188 -1.782138 3.138388 -0.040308 -0.082315 0.034790
5.666667 0.703767 -1.784784 -3.134595 -0.041137 -0.076308 0.019524
5.700000 0.702406 -1.787174 3.138249 -0.041926 -0.070301 0.010064
5.733333 0.701004 -1.789396 3.134980 -0.042699 -0.064291 0.005526
5.766667 0.699560 -1.791452 3.137508 -0.043475 -0.058264 0.002415
5.800000 0.698075 -1.793344 -3.137007 -0.044274 -0.052209 0.000004
5.833333 0.696649 -1.794986 3.130126 -0.045115 -0.046120 0.002074
5.866667 0.695180 -1.796463 3.137835 -0.046020 -0.039992 0.006406
5.900000 0.693665 -1.797723 3.138587 -0.046983 -0.033816 0.007717
5.933333 0.692103 -1.798763 -3.137018 -0.048001 -0.027594 0.007225
5.966667 0.690495 -1.799585 3.128058 -0.049065 -0.021337 0.008079
6.000000 0.688841 -1.800189 3.139174 -0.050168 -0.015057 0.009943
6.033333 0.687140 -1.800574 -3.130914 -0.051293 -0.008759 0.009227
6.066667 0.685392 -1.800742 3.139979 -0.052416 -0.002453 0.007658
6.100000 0.683597 -1.800691 3.137825 -0.053520 0.003855 0.007580
6.133333 0.681750 -1.800480 -3.134586 -0.054587 0.010173 0.009036
6.166667 0.679949 -1.800026 3.139179 -0.055602 0.016510 0.009409
6.200000 0.678101 -1.799354 3.139846 -0.056543 0.022880 0.008992
6.233333 0.676195 -1.798522 3.138876 -0.057403 0.029293 0.011347
6.266667 0.674240 -1.797473 3.137437 -0.058184 0.035766 0.015734
6.300000 0.672237 -1.796209 3.139279 -0.058881 0.042311 0.020524
6.333333 0.670184 -1.794729 -3.133478 -0.059483 0.048935 0.026736
6.366667 0.668168 -1.793003 -3.133435 -0.059982 0.055644 0.032252
6.400000 0.666188 -1.791031 -3.140001 -0.060386 0.062436 0.038229
6.433333 0.664157 -1.788845 -3.140917 -0.060701 0.069301 0.041283
6.466667 0.662074 -1.786446 -3.138641 -0.060933 0.076232 0.041542
6.500000 0.660022 -1.783800 -3.134864 -0.061100 0.083213 0.040675
6.533333 0.657998 -1.780908 -3.134182 -0.061241 0.090225 0.037149
6.566667 0.655921 -1.777805 -3.125137 -0.061389 0.097252 0.034790
6.600000 0.653868 -1.774454 -3.116962 -0.061555 0.104288 0.030649
6.633333 0.651836 -1.770854 -3.130480 -0.061752 0.111334 0.027310
6.666667 0.649823 -1.767006 -3.115793 -0.062004 0.118380 0.021984
6.700000 0.647826 -1.762908 -3.134718 -0.062326 0.125422 0.016925
6.733333 0.645768 -1.758605 -3.126699 -0.062710 0.132469 0.011835
6.766667 0.643649 -1.754099 -3.135116 -0.063155 0.139528 0.006177
6.800000 0.641538 -1.749341 -3.117814 -0.063668 0.146594 0.000931
6.833333 0.639432 -1.744331 -3.125973 -0.064258 0.153665 -0.004060
6.866667 0.637259 -1.739122 -3.126666 -0.064909 0.160753 -0.005507
6.900000 0.635087 -1.733659 -3.122830 -0.065606 0.167871 -0.007502
6.933333 0.632909 -1.727940 -3.120905 -0.066355 0.175014 -0.008895
6.966667 0.630725 -1.721966 -3.128438 -0.067169 0.182170 -0.009736
7.000000 0.628467 -1.715801 -3.126754 -0.068051 0.189337 -0.009185
7.033333 0.626196 -1.709378 -3.127161 -0.069005 0.196506 -0.009747
7.066667 0.623909 -1.702698 -3.129724 -0.070057 0.203644 -0.013407
7.100000 0.621602 -1.695759 -3.136049 -0.071243 0.210708 -0.017972
7.133333 0.619214 -1.688638 -3.134042 -0.072587 0.217675 -0.024964
7.166667 0.616798 -1.681256 -3.124639 -0.074119 0.224518 -0.037618
7.200000 0.614352 -1.673611 -3.126876 -0.075875 0.231197 -0.056448
7.233333 0.611870 -1.665702 -3.123190 -0.077896 0.237681 -0.081404
7.266667 0.609299 -1.657623 -3.127254 -0.080210 0.243958 -0.112344
7.300000 0.606684 -1.649278 -3.125980 -0.082826 0.250020 -0.150121
7.333333 0.603975 -1.640767 -3.138562 -0.085746 0.255851 -0.191308
7.366667 0.601170 -1.632095 -3.139898 -0.088954 0.261445 -0.229585
7.400000 0.598266 -1.623264 3.126837 -0.092434 0.266814 -0.259351
7.433333 0.595196 -1.614255 3.127991 -0.096144 0.271973 -0.274969
7.466667 0.591951 -1.605071 3.110353 -0.100056 0.276929 -0.269587
7.500000 0.588524 -1.595715 3.096442 -0.104148 0.281699 -0.235294
7.533333 0.584991 -1.586214 3.074822 -0.108411 0.286308 -0.166523
7.566667 0.581260 -1.576548 3.059668 -0.112839 0.290776 -0.059914
7.600000 0.577419 -1.566744 3.031077 -0.117412 0.295119 0.084031
7.633333 0.573465 -1.556805 3.037235 -0.122135 0.299352 0.261811
7.666667 0.569397 -1.546735 3.032483 -0.127004 0.303498 0.465403
7.700000 0.565214 -1.536537 3.051530 -0.132008 0.307579 0.677893
7.733333 0.560783 -1.526205 3.077809 -0.137113 0.311599 0.880363
7.766667 0.556233 -1.515753 3.109848 -0.142307 0.315575 1.053454
7.800000 0.551415 -1.505185 3.139264 -0.147569 0.319514 1.179848
7.833333 0.546323 -1.494506 -3.060598 -0.152865 0.323428 1.246759
7.866667 0.541049 -1.483640 -2.980126 -0.158150 0.327307 1.245677
7.900000 0.535652 -1.472668 -2.890872 -0.163388 0.331142 1.174258
7.933333 0.530065 -1.461523 -2.820634 -0.168562 0.334922 1.037908
7.966667 0.524353 -1.450280 -2.775899 -0.173642 0.338632 0.845590
8.000000 0.518448 -1.438877 -2.758273 -0.178618 0.342246 0.610611
8.033333 0.512417 -1.427384 -2.752626 -0.183497 0.345734 0.352521
8.066667 0.506257 -1.415806 -2.757004 -0.188305 0.349085 0.090137
8.100000 0.499910 -1.404089 -2.768824 -0.193063 0.352282 -0.151759
8.133333 0.493376 -1.392239 -2.792327 -0.197793 0.355318 -0.357896
8.166667 0.486658 -1.380265 -2.816139 -0.202510 0.358179 -0.515067
8.200000 0.479810 -1.368222 -2.840091 -0.207231 0.360866 -0.616828
8.233333 0.472831 -1.356114 -2.903008 -0.211959 0.363375 -0.662531
8.266667 0.465722 -1.343945 -2.931299 -0.216694 0.365700 -0.657106
8.300000 0.458437 -1.331687 -2.971123 -0.221435 0.367837 -0.609744
8.333333 0.450979 -1.319347 -2.998506 -0.226173 0.369781 -0.529080
8.366667 0.443350 -1.306936 -3.011078 -0.230907 0.371536 -0.426588
8.400000 0.435590 -1.294482 -3.020907 -0.235626 0.373101 -0.312014
8.433333 0.427660 -1.281974 -3.026259 -0.240317 0.374476 -0.199850
8.466667 0.419562 -1.269419 -3.032924 -0.244964 0.375657 -0.096990
8.500000 0.411296 -1.256829 -3.023513 -0.249555 0.376640 -0.013844
8.533333 0.402865 -1.244214 -3.007221 -0.254082 0.377420 0.043110
8.566667 0.394272 -1.231582 -2.991679 -0.258538 0.377989 0.070962
8.600000 0.385548 -1.218932 -2.985608 -0.262918 0.378344 0.070022
8.633333 0.376695 -1.206270 -2.970624 -0.267224 0.378484 0.044664
8.666667 0.367713 -1.193599 -2.969398 -0.271461 0.378418 -0.002279
8.700000 0.358603 -1.180923 -2.968666 -0.275635 0.378153 -0.062257
8.733333 0.349340 -1.168277 -2.969945 -0.279752 0.377696 -0.126544
8.766667 0.339949 -1.155634 -2.974072 -0.283817 0.377054 -0.186477
8.800000 0.330412 -1.143038 -2.989295 -0.287838 0.376235 -0.235154
8.833333 0.320731 -1.130497 -3.001635 -0.291815 0.375248 -0.267004
8.866667 0.310924 -1.117973 -3.022711 -0.295749 0.374100 -0.278354
8.900000 0.300979 -1.105522 -3.048718 -0.299636 0.372809 -0.267749
8.933333 0.290912 -1.093095 -3.062042 -0.303474 0.371388 -0.236514
8.966667 0.280722 -1.080696 -3.070603 -0.307258 0.369863 -0.188245
9.000000 0.270410 -1.068328 -3.086861 -0.310987 0.368239 -0.128547
9.033333 0.259971 -1.056067 -3.081822 -0.314660 0.366524 -0.063249
9.066667 0.249412 -1.043846 -3.081730 -0.318280 0.364713 0.003199
9.100000 0.238729 -1.031749 -3.078333 -0.321850 0.362785 0.062728
9.133333 0.227929 -1.019698 -3.058045 -0.325372 0.360719 0.108699
9.166667 0.217013 -1.007697 -3.051849 -0.328847 0.358488 0.138411
9.200000 0.205984 -0.995749 -3.055277 -0.332275 0.356076 0.149881
9.233333 0.194841 -0.983856 -3.033447 -0.335657 0.353458 0.144107
9.266667 0.183587 -0.972023 -3.022557 -0.338991 0.350618 0.122377
9.300000 0.172223 -0.960252 -3.017677 -0.342279 0.347538 0.089077
9.333333 0.160748 -0.948662 -3.010778 -0.345518 0.344210 0.051849
9.366667 0.149166 -0.937139 -3.015072 -0.348709 0.340613 0.014920
9.400000 0.137477 -0.925812 -3.015600 -0.351852 0.336751 -0.015281
9.433333 0.125685 -0.914688 -3.017663 -0.354946 0.332643 -0.033032
9.466667 0.113791 -0.903640 -3.029992 -0.357991 0.328310 -0.030776
9.500000 0.101794 -0.892671 -3.036841 -0.360987 0.323780 -0.000894
9.533333 0.089701 -0.881929 -3.053256 -0.363932 0.319057 0.062305
9.566667 0.077510 -0.871270 -3.056666 -0.366828 0.314175 0.165044
9.600000 0.065223 -0.860848 -3.049213 -0.369674 0.309148 0.309628
9.633333 0.052843 -0.850673 -3.050447 -0.372469 0.303965 0.494963
9.666667 0.040370 -0.840587 -3.041276 -0.375214 0.298621 0.711709
9.700000 0.027806 -0.830761 -3.034413 -0.377907 0.293125 0.956659
9.733333 0.015153 -0.821027 -3.006895 -0.380551 0.287491 1.224530
9.766667 0.002413 -0.811387 -2.981449 -0.383146 0.281704 1.514075
9.800000 -0.010414 -0.802025 -2.909358 -0.385697 0.275734 1.819339
9.833333 -0.023325 -0.792945 -2.831527 -0.388209 0.269583 2.144828
9.866667 -0.036319 -0.784148 -2.742509 -0.390685 0.263283 2.500086
9.900000 -0.049392 -0.775447 -2.635871 -0.393131 0.256840 2.878274
9.933333 -0.062542 -0.766844 -2.531685 -0.395555 0.250271 3.272349
9.966667 -0.075766 -0.758520 -2.465794 -0.397967 0.243626 3.668031
10.000000 -0.089065 -0.750474 -2.396416 -0.400371 0.236980 4.067039
10.033333 -0.102444 -0.742701 -2.252561 -0.402776 0.230378 4.450104
10.066667 -0.115906 -0.735200 -2.079863 -0.405196 0.223823 4.794668
10.100000 -0.129454 -0.727964 -1.860426 -0.407636 0.217359 5.081804
10.133333 -0.143094 -0.720991 -1.694379 -0.410098 0.211042 5.299811
10.166667 -0.156795 -0.714111 -1.455734 -0.412576 0.204912 5.432162
10.200000 -0.170555 -0.707322 -1.216196 -0.415068 0.198976 5.449656
10.233333 -0.184416 -0.700780 -1.002325 -0.417557 0.193265 5.347752
10.266667 -0.198379 -0.694477 -0.797717 -0.420016 0.187829 5.127687
10.300000 -0.212448 -0.688408 -0.625265 -0.422425 0.182682 4.807568
10.333333 -0.226565 -0.682423 -0.444063 -0.424760 0.177820 4.393224
10.366667 -0.240788 -0.676655 -0.276956 -0.426999 0.173248 3.906631
10.400000 -0.255120 -0.671093 -0.134105 -0.429112 0.169000 3.378112
10.433333 -0.269492 -0.665608 -0.064316 -0.431082 0.165085 2.825682
10.466667 -0.283974 -0.660307 0.016974 -0.432898 0.161501 2.263841
10.500000 -0.298489 -0.655078 0.076426 -0.434543 0.158241 1.697080
10.533333 -0.313035 -0.649919 0.095251 -0.436011 0.155311 1.143570
10.566667 -0.327607 -0.644827 0.140303 -0.437305 0.152694 0.611779
10.600000 -0.342203 -0.639799 0.149566 -0.438439 0.150350 0.103902
10.633333 -0.356898 -0.634878 0.132760 -0.439420 0.148257 -0.373151
10.666667 -0.371610 -0.630016 0.113982 -0.440264 0.146398 -0.807691
10.700000 -0.386335 -0.625209 0.079841 -0.440998 0.144774 -1.184429
10.733333 -0.401070 -0.620455 0.033318 -0.441635 0.143375 -1.498954
10.766667 -0.415812 -0.615750 -0.041595 -0.442185 0.142200 -1.737542
10.800000 -0.430557 -0.611092 -0.147144 -0.442653 0.141274 -1.881065
10.833333 -0.445302 -0.606477 -0.262683 -0.443067 0.140626 -1.919884
10.866667 -0.460115 -0.601829 -0.340997 -0.443433 0.140282 -1.852105
10.900000 -0.474921 -0.597220 -0.417632 -0.443751 0.140260 -1.686127
10.933333 -0.489715 -0.592644 -0.540067 -0.444036 0.140602 -1.428921
10.966667 -0.504494 -0.588101 -0.594541 -0.444306 0.141366 -1.108087
11.000000 -0.519321 -0.583461 -0.651381 -0.444564 0.142571 -0.758877
11.033333 -0.534187 -0.578713 -0.662775 -0.444799 0.144219 -0.416572
11.066667 -0.549027 -0.573989 -0.650658 -0.445010 0.146323 -0.110017
11.100000 -0.563836 -0.569285 -0.603035 -0.445194 0.148875 0.135801
11.133333 -0.578666 -0.564441 -0.553049 -0.445331 0.151820 0.295561
11.166667 -0.593514 -0.559445 -0.483553 -0.445388 0.155075 0.367062
11.200000 -0.608376 -0.554287 -0.428422 -0.445349 0.158589 0.354180
11.233333 -0.623253 -0.548955 -0.385386 -0.445195 0.162300 0.270649
11.266667 -0.638143 -0.543436 -0.377025 -0.444891 0.166101 0.133465
11.300000 -0.653045 -0.537723 -0.395952 -0.444404 0.169900 -0.031036
11.333333 -0.667887 -0.532017 -0.433038 -0.443716 0.173661 -0.190439
11.366667 -0.682728 -0.526107 -0.460086 -0.442814 0.177357 -0.324581
11.400000 -0.697560 -0.519989 -0.489133 -0.441676 0.180940 -0.413818
11.433333 -0.712318 -0.513875 -0.524781 -0.440292 0.184402 -0.446784
11.466667 -0.726999 -0.507765 -0.575683 -0.438666 0.187784 -0.417325
11.500000 -0.741642 -0.501449 -0.584029 -0.436805 0.191122 -0.332771
11.533333 -0.756238 -0.494931 -0.598445 -0.434703 0.194403 -0.206215
11.566667 -0.770742 -0.488415 -0.606919 -0.432358 0.197633 -0.049471
11.600000 -0.785150 -0.481901 -0.610381 -0.429771 0.200836 0.120661
11.633333 -0.799479 -0.475201 -0.599506 -0.426932 0.204012 0.293142
11.666667 -0.813719 -0.468323 -0.580159 -0.423817 0.207135 0.454174
11.700000 -0.827860 -0.461275 -0.556510 -0.420403 0.210183 0.596921
11.733333 -0.841888 -0.454066 -0.508648 -0.416670 0.213151 0.714344
11.766667 -0.855797 -0.446862 -0.495291 -0.412602 0.216016 0.805150
11.800000 -0.869580 -0.439662 -0.454829 -0.408190 0.218734 0.870576
11.833333 -0.883212 -0.432336 -0.408239 -0.403437 0.221265 0.908605
11.866667 -0.896677 -0.424898 -0.366031 -0.398357 0.223581 0.921605
11.900000 -0.909960 -0.417360 -0.337037 -0.392975 0.225654 0.913170
11.933333 -0.923045 -0.409738 -0.318731 -0.387336 0.227462 0.892034
11.966667 -0.935920 -0.402040 -0.290807 -0.381484 0.228986 0.857901
12.000000 -0.948567 -0.394281 -0.242476 -0.375467 0.230208 0.813607
12.033333 -0.960970 -0.386477 -0.220806 -0.369327 0.231120 0.764120
12.066667 -0.973112 -0.378643 -0.200577 -0.363113 0.231716 0.710343
12.100000 -0.985088 -0.370827 -0.178512 -0.356858 0.231998 0.651365
12.133333 -0.996897 -0.363030 -0.156571 -0.350566 0.231970 0.585327
12.166667 -1.008533 -0.355254 -0.149095 -0.344218 0.231639 0.514274
12.200000 -1.019857 -0.347511 -0.111875 -0.337793 0.231030 0.437015
12.233333 -1.031001 -0.339792 -0.098626 -0.331245 0.230155 0.355222
12.266667 -1.041961 -0.332100 -0.087419 -0.324521 0.229031 0.272821
12.300000 -1.052733 -0.324436 -0.083102 -0.317559 0.227656 0.196024
12.333333 -1.063315 -0.316802 -0.059533 -0.310325 0.226036 0.124309
12.366667 -1.073701 -0.309201 -0.073541 -0.302810 0.224175 0.061773
12.400000 -1.083739 -0.301706 -0.081414 -0.294997 0.222080 0.014521
12.433333 -1.093574 -0.294247 -0.099819 -0.286896 0.219759 -0.016797
12.466667 -1.103057 -0.286910 -0.086743 -0.278543 0.217233 -0.034860
12.500000 -1.112189 -0.279701 -0.110629 -0.270006 0.214544 -0.042143
12.533333 -1.121109 -0.272533 -0.118731 -0.261336 0.211724 -0.033751
12.566667 -1.129682 -0.265501 -0.117638 -0.252601 0.208817 -0.013539
12.600000 -1.137912 -0.258607 -0.110562 -0.243862 0.205856 0.012312
12.633333 -1.145802 -0.251854 -0.096861 -0.235191 0.202884 0.040097
12.666667 -1.153470 -0.245147 -0.090221 -0.226625 0.199916 0.065546
12.700000 -1.160813 -0.238575 -0.094151 -0.218185 0.196955 0.084921
12.733333 -1.167931 -0.232051 -0.094670 -0.209889 0.194004 0.090587
12.766667 -1.174741 -0.225655 -0.093905 -0.201744 0.191057 0.081856
12.800000 -1.181321 -0.219310 -0.093117 -0.193751 0.188097 0.055596
12.833333 -1.187616 -0.213084 -0.087490 -0.185895 0.185105 0.004876
12.866667 -1.193677 -0.206911 -0.061832 -0.178171 0.182078 -0.069700
12.900000 -1.199467 -0.200853 -0.055488 -0.170574 0.179014 -0.173272
12.933333 -1.204996 -0.194913 -0.062539 -0.163098 0.175914 -0.309196
12.966667 -1.210272 -0.189095 -0.042822 -0.155730 0.172788 -0.483072
13.000000 -1.215304 -0.183401 -0.107858 -0.148459 0.169669 -0.680691
13.033333 -1.220101 -0.177836 -0.106992 -0.141271 0.166587 -0.884292
13.066667 -1.224655 -0.172327 -0.114699 -0.134158 0.163560 -1.075642
13.100000 -1.228996 -0.166954 -0.121759 -0.127108 0.160612 -1.236921
13.133333 -1.233134 -0.161723 -0.194162 -0.120100 0.157761 -1.345733
13.166667 -1.237025 -0.156548 -0.278856 -0.113126 0.155010 -1.377932
13.200000 -1.240666 -0.151429 -0.376994 -0.106181 0.152343 -1.335189
13.233333 -1.244130 -0.146446 -0.452258 -0.099260 0.149743 -1.219320
13.266667 -1.247341 -0.141520 -0.547733 -0.092350 0.147200 -1.035509
13.300000 -1.250298 -0.136650 -0.616097 -0.085442 0.144697 -0.790350
13.333333 -1.253000 -0.131836 -0.642889 -0.078545 0.142201 -0.503737
13.366667 -1.255444 -0.127079 -0.615539 -0.071654 0.139698 -0.202003
13.400000 -1.257708 -0.122447 -0.580387 -0.064763 0.137180 0.097236
13.433333 -1.259787 -0.117940 -0.541599 -0.057873 0.134638 0.375301
13.466667 -1.261605 -0.113488 -0.514916 -0.050979 0.132068 0.610031
13.500000 -1.263232 -0.109158 -0.478197 -0.044067 0.129480 0.789274
13.533333 -1.264594 -0.104883 -0.446706 -0.037111 0.126898 0.911544
13.566667 -1.265691 -0.100662 -0.400481 -0.030094 0.124339 0.981054
13.600000 -1.266579 -0.096554 -0.348627 -0.022999 0.121816 1.004754
13.633333 -1.267256 -0.092556 -0.322836 -0.015815 0.119343 0.992375
13.666667 -1.267718 -0.088668 -0.301761 -0.008526 0.116934 0.955903
13.700000 -1.267908 -0.084832 -0.259484 -0.001138 0.114585 0.900797
13.733333 -1.267876 -0.081098 -0.214732 0.006355 0.112304 0.830217
13.766667 -1.267570 -0.077415 -0.183575 0.013953 0.110090 0.749496
13.800000 -1.266989 -0.073780 -0.171046 0.021654 0.107939 0.663426
13.833333 -1.266130 -0.070193 -0.137672 0.029453 0.105843 0.571194
13.866667 -1.265040 -0.066715 -0.127383 0.037339 0.103787 0.476856
13.900000 -1.263671 -0.063283 -0.122136 0.045309 0.101766 0.387094
13.933333 -1.262064 -0.059965 -0.097331 0.053348 0.099762 0.310288
13.966667 -1.260176 -0.056690 -0.091520 0.061446 0.097767 0.252513
14.000000 -1.258003 -0.053459 -0.102241 0.069601 0.095787 0.217546
14.033333 -1.255545 -0.050268 -0.095300 0.077813 0.093831 0.214319
14.066667 -1.252801 -0.047117 -0.102898 0.086076 0.091899 0.244677
14.100000 -1.249803 -0.044093 -0.104639 0.094389 0.089995 0.303281
14.133333 -1.246552 -0.041196 -0.098287 0.102743 0.088120 0.383266
14.166667 -1.243010 -0.038336 -0.107021 0.111134 0.086283 0.473104
14.200000 -1.239177 -0.035510 -0.097480 0.119549 0.084480 0.559255
14.233333 -1.235051 -0.032717 -0.079376 0.127970 0.082704 0.627320
14.266667 -1.230632 -0.029955 -0.037522 0.136383 0.080963 0.661748
14.300000 -1.225950 -0.027316 0.016386 0.144769 0.079258 0.656351
14.333333 -1.220972 -0.024706 0.065677 0.153106 0.077587 0.606008
14.366667 -1.215698 -0.022122 0.115567 0.161372 0.075941 0.509192
14.400000 -1.210168 -0.019641 0.160405 0.169557 0.074326 0.371148
14.433333 -1.204339 -0.017183 0.155655 0.177657 0.072755 0.201914
14.466667 -1.198262 -0.014812 0.166056 0.185679 0.071246 0.017113
14.500000 -1.191885 -0.012461 0.148100 0.193640 0.069813 -0.164774
14.533333 -1.185266 -0.010178 0.121352 0.201565 0.068481 -0.327801
14.566667 -1.178408 -0.007952 0.094677 0.209483 0.067280 -0.454333
14.600000 -1.171312 -0.005778 0.055539 0.217408 0.066226 -0.530742
14.633333 -1.163978 -0.003643 0.016312 0.225367 0.065335 -0.555472
14.666667 -1.156407 -0.001540 -0.004803 0.233379 0.064610 -0.529681
14.700000 -1.148530 0.000555 -0.039771 0.241460 0.064061 -0.464312
14.733333 -1.140346 0.002645 -0.064594 0.249614 0.063688 -0.371785
14.766667 -1.131921 0.004728 -0.081377 0.257853 0.063482 -0.267480
14.800000 -1.123186 0.006809 -0.097930 0.266187 0.063432 -0.166583
14.833333 -1.114142 0.008890 -0.077367 0.274610 0.063525 -0.079184
14.866667 -1.104846 0.010982 -0.057640 0.283108 0.063754 -0.012565
14.900000 -1.095297 0.013092 -0.033180 0.291670 0.064115 0.028285
14.933333 -1.085492 0.015227 -0.011811 0.300298 0.064607 0.042027
14.966667 -1.075374 0.017371 -0.011656 0.308981 0.065230 0.033397
15.000000 -1.064942 0.019525 -0.019589 0.317709 0.065997 0.004271
15.033333 -1.054195 0.021691 -0.015695 0.326486 0.066918 -0.039201
15.066667 -1.043184 0.023911 -0.026200 0.335319 0.067998 -0.090661
15.100000 -1.031858 0.026146 -0.040423 0.344213 0.069237 -0.143611
15.133333 -1.020214 0.028400 -0.048518 0.353163 0.070635 -0.190867
15.166667 -1.008294 0.030724 -0.058242 0.362176 0.072193 -0.234140
15.200000 -0.996090 0.033123 -0.072586 0.371265 0.073897 -0.267328
15.233333 -0.983595 0.035601 -0.068795 0.380444 0.075726 -0.288215
15.266667 -0.970804 0.038162 -0.081332 0.389729 0.077659 -0.297555
15.300000 -0.957693 0.040749 -0.070346 0.399136 0.079678 -0.295284
15.333333 -0.944270 0.043423 -0.099370 0.408682 0.081753 -0.281409
15.366667 -0.930528 0.046188 -0.121638 0.418369 0.083848 -0.250515
15.400000 -0.916456 0.049044 -0.137144 0.428203 0.085938 -0.203848
15.433333 -0.902065 0.051932 -0.153625 0.438173 0.088006 -0.140711
15.466667 -0.887327 0.054910 -0.157616 0.448258 0.090033 -0.062350
15.500000 -0.872231 0.057979 -0.168789 0.458430 0.091997 0.032080
15.533333 -0.856817 0.061083 -0.160535 0.468664 0.093889 0.138494
15.566667 -0.841023 0.064269 -0.152205 0.478938 0.095708 0.248630
15.600000 -0.824839 0.067535 -0.149696 0.489207 0.097450 0.352981
15.633333 -0.808338 0.070838 -0.121809 0.499447 0.099112 0.429417
15.666667 -0.791520 0.074179 -0.108791 0.509650 0.100700 0.458460
15.700000 -0.774387 0.077560 -0.079820 0.519812 0.102231 0.408191
15.733333 -0.756824 0.081011 -0.043987 0.529919 0.103713 0.247813
15.766667 -0.738948 0.084502 -0.016861 0.539988 0.105161 -0.047678
15.800000 -0.720759 0.088034 -0.000707 0.550056 0.106593 -0.499512
15.833333 -0.702260 0.091608 0.034307 0.560151 0.108030 -1.098605
15.866667 -0.683451 0.095223 0.073540 0.570297 0.109487 -1.839699
15.900000 -0.664334 0.098881 0.086637 0.580516 0.110973 -2.686260
15.933333 -0.644912 0.102581 0.055147 0.590873 0.112509 -3.596672
15.966667 -0.625008 0.106357 -0.099846 0.601397 0.114110 -4.515126
16.000000 -0.604803 0.110175 -0.295329 0.612133 0.115796 -5.383211
16.033333 -0.584297 0.114038 -0.573913 0.623127 0.117583 -6.159404
16.066667 -0.563493 0.117945 -0.887721 0.634422 0.119492 -6.785577
16.100000 -0.542169 0.121942 -1.202358 0.646043 0.121538 -7.233117
16.133333 -0.520553 0.125984 -1.560285 0.657974 0.123721 -7.467104
16.166667 -0.498402 0.130130 -1.825643 0.670199 0.126038 -7.493699
16.200000 -0.475963 0.134322 -2.160447 0.682650 0.128469 -7.315822
16.233333 -0.453242 0.138557 -2.370254 0.695250 0.130987 -6.955519
16.266667 -0.429969 0.142916 -2.632617 0.707898 0.133558 -6.446873
16.300000 -0.406142 0.147406 -2.806178 0.720506 0.136150 -5.827013
16.333333 -0.381760 0.152030 -3.014902 0.732969 0.138730 -5.146152
16.366667 -0.356822 0.156795 3.070118 0.745190 0.141269 -4.422653
16.400000 -0.331622 0.161602 2.914261 0.757095 0.143746 -3.693208
16.433333 -0.306166 0.166452 2.804741 0.768617 0.146145 -2.970798
16.466667 -0.280267 0.171380 2.753739 0.779734 0.148467 -2.277873
16.500000 -0.253933 0.176391 2.719071 0.790446 0.150725 -1.619172
16.533333 -0.227359 0.181443 2.696834 0.800801 0.152944 -1.001498
16.566667 -0.200365 0.186592 2.683689 0.810845 0.155148 -0.442748
16.600000 -0.173145 0.191779 2.702276 0.820646 0.157371 0.054510
16.633333 -0.145704 0.197002 2.716281 0.830280 0.159653 0.484904
16.666667 -0.117871 0.202334 2.749743 0.839790 0.162013 0.851446
16.700000 -0.089658 0.207775 2.811157 0.849207 0.164462 1.150440
16.733333 -0.061245 0.213250 2.853390 0.858548 0.167011 1.387213
16.766667 -0.032476 0.218832 2.900984 0.867854 0.169678 1.571626
16.800000 -0.003362 0.224520 2.984533 0.877132 0.172460 1.707251
16.833333 0.026083 0.230308 3.063029 0.886348 0.175331 1.792647
16.866667 0.055845 0.236194 3.136589 0.895502 0.178281 1.829401
16.900000 0.085769 0.242104 -3.086038 0.904578 0.181294 1.822088
16.933333 0.116089 0.248184 -3.014663 0.913533 0.184331 1.768982
16.966667 0.146791 0.254427 -2.947533 0.922278 0.187333 1.668633
17.000000 0.177629 0.260689 -2.889788 0.930737 0.190248 1.526367
17.033333 0.208822 0.267094 -2.833968 0.938857 0.193038 1.350623
17.066667 0.240356 0.273634 -2.778391 0.946545 0.195645 1.147900
17.100000 0.272217 0.280295 -2.724648 0.953708 0.198010 0.920981
17.133333 0.304389 0.287067 -2.690742 0.960260 0.200091 0.679846
17.166667 0.336646 0.293844 -2.680399 0.966171 0.201870 0.435551
17.200000 0.369183 0.300708 -2.673789 0.971412 0.203331 0.195378
17.233333 0.401784 0.307571 -2.682675 0.975976 0.204473 -0.031743
17.266667 0.434633 0.314501 -2.701137 0.979892 0.205309 -0.237508
17.300000 0.467526 0.321423 -2.712786 0.983202 0.205869 -0.410385
17.333333 0.500451 0.328335 -2.743231 0.985977 0.206190 -0.542116
17.366667 0.533397 0.335234 -2.775556 0.988251 0.206296 -0.630992
17.400000 0.566353 0.342116 -2.800183 0.990071 0.206219 -0.674946
17.433333 0.599456 0.349014 -2.846327 0.991456 0.205979 -0.676328
17.466667 0.632547 0.355889 -2.885697 0.992423 0.205593 -0.638018
17.500000 0.665744 0.362766 -2.906371 0.992973 0.205072 -0.566727
17.533333 0.699022 0.369637 -2.939116 0.993080 0.204415 -0.470455
17.566667 0.732254 0.376475 -2.948997 0.992728 0.203624 -0.355685
17.600000 0.765514 0.383292 -2.961247 0.991876 0.202691 -0.228389
17.633333 0.798705 0.390070 -2.964862 0.990499 0.201613 -0.094054
17.666667 0.831816 0.396805 -2.952909 0.988551 0.200377 0.038992
17.700000 0.864834 0.403494 -2.947974 0.985995 0.198972 0.166671
17.733333 0.897768 0.410133 -2.938339 0.982800 0.197385 0.283868
17.766667 0.930596 0.416719 -2.926526 0.978917 0.195597 0.389084
17.800000 0.963297 0.423248 -2.907809 0.974330 0.193600 0.479273
17.833333 0.995860 0.429717 -2.893081 0.969030 0.191387 0.551198
17.866667 1.028273 0.436123 -2.863740 0.963010 0.188952 0.606850
17.900000 1.060525 0.442463 -2.845888 0.956255 0.186286 0.645236
17.933333 1.092515 0.448702 -2.821920 0.948757 0.183383 0.667345
17.966667 1.124211 0.454831 -2.774468 0.940549 0.180251 0.672226
18.000000 1.155582 0.460838 -2.752489 0.931663 0.176897 0.661562
18.033333 1.186596 0.466714 -2.733732 0.922132 0.173329 0.636350
18.066667 1.217229 0.472450 -2.703692 0.912006 0.169562 0.593235
18.100000 1.247449 0.478036 -2.691655 0.901385 0.165627 0.535434
18.133333 1.277434 0.483534 -2.671325 0.890352 0.161552 0.462686
18.166667 1.307175 0.488941 -2.651262 0.878957 0.157352 0.376133
18.200000 1.336413 0.494164 -2.636064 0.867217 0.153030 0.275464
18.233333 1.365119 0.499189 -2.637882 0.855113 0.148578 0.166867
18.266667 1.393265 0.504005 -2.623330 0.842630 0.143988 0.062708
18.300000 1.421131 0.508721 -2.614563 0.829667 0.139222 -0.035412
18.333333 1.448708 0.513335 -2.605391 0.816167 0.134262 -0.118864
18.366667 1.475988 0.517845 -2.615064 0.802088 0.129091 -0.174241
18.400000 1.502610 0.522102 -2.663604 0.787449 0.123721 -0.184147
18.433333 1.528921 0.526252 -2.666112 0.772274 0.118163 -0.142061
18.466667 1.554534 0.530138 -2.688148 0.756592 0.112431 -0.041569
18.500000 1.579821 0.533911 -2.731992 0.740515 0.106568 0.128882
18.533333 1.604387 0.537416 -2.747747 0.724126 0.100606 0.374327
18.566667 1.628226 0.540652 -2.737504 0.707543 0.094590 0.686135
18.600000 1.651333 0.543620 -2.717564 0.690846 0.088548 1.039638
18.633333 1.673710 0.546320 -2.699028 0.674169 0.082529 1.418262
18.666667 1.695734 0.548903 -2.661594 0.657608 0.076565 1.796988
18.700000 1.717402 0.551369 -2.599548 0.641204 0.070665 2.147410
18.733333 1.738709 0.553716 -2.488396 0.624966 0.064825 2.437470
18.766667 1.759312 0.555799 -2.360137 0.608865 0.059027 2.647125
18.800000 1.779217 0.557620 -2.215825 0.592847 0.053242 2.769622
18.833333 1.798753 0.559321 -2.086952 0.576792 0.047420 2.798261
18.866667 1.817605 0.560761 -1.943408 0.560658 0.041543 2.731064
18.900000 1.836082 0.562082 -1.829387 0.544429 0.035610 2.575536
18.933333 1.854182 0.563284 -1.755122 0.528136 0.029640 2.354173
18.966667 1.871626 0.564226 -1.686007 0.511811 0.023653 2.088747
19.000000 1.888421 0.564916 -1.621483 0.495522 0.017689 1.800078
19.033333 1.904577 0.565357 -1.564650 0.479399 0.011817 1.509055
19.066667 1.920107 0.565556 -1.547869 0.463523 0.006082 1.239379
19.100000 1.935256 0.565641 -1.524277 0.447972 0.000528 1.004342
19.133333 1.949803 0.565495 -1.512037 0.432817 -0.004805 0.808957
19.166667 1.963761 0.565130 -1.493185 0.418120 -0.009882 0.650955
19.200000 1.977340 0.564654 -1.485541 0.403910 -0.014690 0.528334
19.233333 1.990359 0.563970 -1.464606 0.390165 -0.019239 0.428026
19.266667 2.003001 0.563178 -1.468422 0.376847 -0.023554 0.332538
19.300000 2.015269 0.562280 -1.451164 0.363916 -0.027656 0.224926
19.333333 2.027164 0.561277 -1.455258 0.351307 -0.031580 0.085431
19.366667 2.038689 0.560171 -1.418400 0.338955 -0.035360 -0.106381
19.400000 2.049844 0.558965 -1.416071 0.326817 -0.039017 -0.368063
19.433333 2.060538 0.557605 -1.413944 0.314856 -0.042569 -0.700447
19.466667 2.070788 0.556102 -1.403336 0.303064 -0.046013 -1.104437
19.500000 2.080613 0.554464 -1.410769 0.291435 -0.049343 -1.572174
19.533333 2.090080 0.552733 -1.432311 0.279976 -0.052543 -2.090768
19.566667 2.099157 0.550884 -1.498108 0.268712 -0.055583 -2.632233
19.600000 2.107858 0.548927 -1.604862 0.257668 -0.058435 -3.171039
19.633333 2.116195 0.546871 -1.740767 0.246865 -0.061076 -3.690106
19.666667 2.124187 0.544732 -1.907149 0.236303 -0.063493 -4.164086
19.700000 2.131836 0.542512 -2.116217 0.225968 -0.065688 -4.569940
19.733333 2.139150 0.540227 -2.314273 0.215838 -0.067671 -4.886456
19.766667 2.146138 0.537892 -2.475621 0.205874 -0.069467 -5.111444
19.800000 2.152794 0.535483 -2.667291 0.196035 -0.071104 -5.247223
19.833333 2.159140 0.533048 -2.865267 0.186282 -0.072604 -5.299698
19.866667 2.165184 0.530599 -3.055080 0.176590 -0.073994 -5.284661
19.900000 2.170934 0.528150 3.032565 0.166942 -0.075296 -5.223741
19.933333 2.176368 0.525636 2.860614 0.157327 -0.076528 -5.142990
19.966667 2.181490 0.523060 2.689427 0.147753 -0.077695 -5.055066
20.000000 2.186242 0.520436 2.525611 0.138235 -0.078801 -4.972149
20.033333 2.190690 0.517754 2.365078 0.128795 -0.079850 -4.898178
20.066667 2.194787 0.515047 2.247332 0.119460 -0.080839 -4.836993
20.100000 2.198542 0.512323 2.098700 0.110265 -0.081757 -4.787869
20.133333 2.202009 0.509549 1.949170 0.101245 -0.082596 -4.743300
20.166667 2.205158 0.506776 1.773267 0.092436 -0.083359 -4.696645
20.200000 2.208028 0.503957 1.601363 0.083863 -0.084045 -4.638770
20.233333 2.210624 0.501094 1.433865 0.075556 -0.084651 -4.566362
20.266667 2.212947 0.498253 1.278203 0.067536 -0.085172 -4.470113
20.300000 2.215014 0.495439 1.110274 0.059815 -0.085610 -4.341721
20.333333 2.216822 0.492587 0.949805 0.052397 -0.085969 -4.177074
20.366667 2.218376 0.489700 0.821409 0.045275 -0.086246 -3.982032
20.400000 2.219682 0.486780 0.690837 0.038448 -0.086441 -3.761513
20.433333 2.220745 0.483829 0.558463 0.031902 -0.086559 -3.518731
20.466667 2.221626 0.480909 0.451273 0.025612 -0.086616 -3.259657
20.500000 2.222336 0.478020 0.348845 0.019558 -0.086617 -2.993841
20.533333 2.222819 0.475106 0.251120 0.013731 -0.086561 -2.728855
20.566667 2.223152 0.472225 0.165575 0.008118 -0.086452 -2.463730
20.600000 2.223344 0.469379 0.078046 0.002700 -0.086303 -2.198902
20.633333 2.223326 0.466514 0.014223 -0.002530 -0.086117 -1.938055
20.666667 2.223102 0.463631 -0.028532 -0.007561 -0.085886 -1.685208
