t x y theta dxdt dydt dthetadt
0.000000 0.000000 0.000000 -2.051721 -0.101906 0.050387 -1.584989
0.033333 -0.003433 0.001691 -2.080231 -0.100184 0.055614 -1.831821
0.066667 -0.006808 0.003603 -2.112607 -0.098241 0.060969 -2.194756
0.100000 -0.010104 0.005750 -2.153846 -0.096061 0.066416 -2.688609
0.133333 -0.013302 0.008148 -2.190099 -0.093628 0.071920 -3.306261
0.166667 -0.016422 0.010688 -2.224527 -0.090930 0.077444 -4.020416
0.200000 -0.019460 0.013372 -2.271666 -0.087948 0.082963 -4.789797
0.233333 -0.022412 0.016202 -2.378759 -0.084676 0.088469 -5.554074
0.266667 -0.025276 0.019178 -2.619834 -0.081120 0.093968 -6.238858
0.300000 -0.028001 0.022438 -2.957599 -0.077298 0.099461 -6.757009
0.333333 -0.030630 0.025848 2.965233 -0.073219 0.104976 -7.024329
0.366667 -0.033066 0.029428 2.588268 -0.068902 0.110537 -6.979140
0.400000 -0.035312 0.033189 2.235788 -0.064384 0.116158 -6.576350
0.433333 -0.037369 0.037140 1.923737 -0.059709 0.121839 -5.789255
0.466667 -0.039320 0.041244 1.633803 -0.054922 0.127561 -4.636421
0.500000 -0.041085 0.045556 1.385155 -0.050062 0.133318 -3.189983
0.533333 -0.042667 0.050084 1.277704 -0.045184 0.139094 -1.556888
0.566667 -0.044066 0.054833 1.199801 -0.040325 0.144876 0.166665
0.600000 -0.045282 0.059805 1.213538 -0.035515 0.150656 1.863570
0.633333 -0.046378 0.064932 1.434062 -0.030762 0.156452 3.395765
0.666667 -0.047291 0.070280 1.753170 -0.026071 0.162281 4.643731
0.700000 -0.048079 0.075783 1.968278 -0.021438 0.168171 5.526038
0.733333 -0.048679 0.081501 2.325601 -0.016850 0.174132 5.986412
0.766667 -0.049151 0.087373 2.740840 -0.012284 0.180185 5.969493
0.800000 -0.049491 0.093401 3.057823 -0.007713 0.186341 5.473262
0.833333 -0.049699 0.099583 -2.952220 -0.003126 0.192583 4.547788
0.866667 -0.049748 0.106083 -2.730445 0.001505 0.198892 3.279933
0.900000 -0.049661 0.112737 -2.564359 0.006201 0.205231 1.760161
0.933333 -0.049400 0.119697 -2.475984 0.010991 0.211571 0.101735
0.966667 -0.048961 0.126956 -2.486815 0.015882 0.217863 -1.563510
1.000000 -0.048381 0.134366 -2.642897 0.020885 0.224072 -3.135388
1.033333 -0.047623 0.142068 -2.919680 0.026010 0.230163 -4.520861
1.066667 -0.046720 0.149919 3.024532 0.031254 0.236116 -5.655183
1.100000 -0.045589 0.157941 2.671377 0.036605 0.241919 -6.486733
1.133333 -0.044310 0.166107 2.403591 0.042042 0.247569 -6.995030
1.166667 -0.042883 0.174416 2.087557 0.047565 0.253104 -7.185718
1.200000 -0.041232 0.182921 1.794387 0.053169 0.258557 -7.075599
1.233333 -0.039360 0.191630 1.540468 0.058846 0.263978 -6.719824
1.266667 -0.037269 0.200551 1.266174 0.064590 0.269402 -6.173636
1.300000 -0.035025 0.209606 1.056592 0.070410 0.274869 -5.497497
1.333333 -0.032561 0.218890 0.858578 0.076310 0.280403 -4.738185
1.366667 -0.029943 0.228304 0.751222 0.082275 0.285989 -3.949543
1.400000 -0.027169 0.237843 0.634529 0.088294 0.291616 -3.173035
1.433333 -0.024153 0.247643 0.552692 0.094369 0.297277 -2.426314
1.466667 -0.020982 0.257564 0.501646 0.100522 0.302996 -1.727045
1.500000 -0.017538 0.267770 0.488767 0.106741 0.308755 -1.075661
1.533333 -0.013811 0.278271 0.494879 0.113026 0.314555 -0.482299
1.566667 -0.009927 0.288884 0.507195 0.119383 0.320412 0.062932
1.600000 -0.005887 0.299603 0.529466 0.125805 0.326314 0.567496
1.633333 -0.001552 0.310632 0.557001 0.132261 0.332217 1.034691
1.666667 0.002938 0.321761 0.593783 0.138701 0.338054 1.468889
1.700000 0.007584 0.332985 0.645384 0.145109 0.343798 1.863758
1.733333 0.012508 0.344510 0.671610 0.151458 0.349413 2.227390
1.766667 0.017703 0.356327 0.740997 0.157719 0.354855 2.554009
1.800000 0.023163 0.368428 0.848802 0.163863 0.360083 2.842074
1.833333 0.028775 0.380606 1.033652 0.169886 0.365095 3.082214
1.866667 0.034641 0.393051 1.170974 0.175775 0.369861 3.266828
1.900000 0.040656 0.405562 1.316730 0.181504 0.374336 3.389333
1.933333 0.046821 0.418136 1.415130 0.187061 0.378494 3.432797
1.966667 0.053132 0.430766 1.518467 0.192447 0.382328 3.394626
2.000000 0.059663 0.443626 1.628824 0.197675 0.385860 3.274464
2.033333 0.066338 0.456531 1.762809 0.202749 0.389092 3.084873
2.066667 0.073214 0.469639 1.913748 0.207691 0.392070 2.836790
2.100000 0.080285 0.482934 2.021739 0.212519 0.394834 2.546047
2.133333 0.087494 0.496256 2.120415 0.217240 0.397400 2.229710
2.166667 0.094842 0.509600 2.193175 0.221852 0.399760 1.899159
2.200000 0.102325 0.522959 2.227587 0.226354 0.401902 1.567467
2.233333 0.109941 0.536328 2.261395 0.230741 0.403818 1.247477
2.266667 0.117720 0.549816 2.274806 0.235007 0.405486 0.955644
2.300000 0.125652 0.563417 2.290800 0.239154 0.406886 0.698269
2.333333 0.133732 0.577115 2.302504 0.243182 0.407999 0.484801
2.366667 0.141936 0.590795 2.287228 0.247095 0.408815 0.320284
2.400000 0.150272 0.604544 2.290030 0.250890 0.409312 0.201169
2.433333 0.158729 0.618345 2.281732 0.254559 0.409449 0.119577
2.466667 0.167304 0.632108 2.290493 0.258101 0.409200 0.060118
2.500000 0.175996 0.645827 2.286537 0.261509 0.408554 0.021057
2.533333 0.184802 0.659496 2.289636 0.264784 0.407516 -0.009344
2.566667 0.193698 0.673149 2.291134 0.267922 0.406082 -0.037912
2.600000 0.202704 0.686738 2.308647 0.270927 0.404258 -0.067814
2.633333 0.211816 0.700255 2.279611 0.273805 0.402072 -0.100008
2.666667 0.221032 0.713693 2.309871 0.276562 0.399541 -0.131644
2.700000 0.230350 0.727046 2.289036 0.279202 0.396675 -0.167377
2.733333 0.239724 0.740289 2.285264 0.281728 0.393460 -0.202959
2.766667 0.249151 0.753408 2.267071 0.284147 0.389894 -0.235681
2.800000 0.258673 0.766420 2.247480 0.286468 0.385979 -0.261669
2.833333 0.268286 0.779320 2.248954 0.288698 0.381709 -0.280111
2.866667 0.277988 0.792100 2.238209 0.290842 0.377079 -0.287755
2.900000 0.287734 0.804671 2.223376 0.292913 0.372092 -0.283754
2.933333 0.297521 0.817009 2.221073 0.294919 0.366760 -0.270028
2.966667 0.307390 0.829210 2.193041 0.296865 0.361091 -0.248366
3.000000 0.317338 0.841265 2.196701 0.298752 0.355054 -0.224587
3.033333 0.327362 0.853169 2.175885 0.300579 0.348624 -0.201150
3.066667 0.337423 0.864746 2.176871 0.302348 0.341786 -0.186767
3.100000 0.347520 0.875972 2.164046 0.304059 0.334530 -0.185268
3.133333 0.357686 0.887029 2.157918 0.305706 0.326860 -0.200344
3.166667 0.367918 0.897912 2.181032 0.307292 0.318818 -0.243337
3.200000 0.378214 0.908616 2.184441 0.308816 0.310465 -0.310736
3.233333 0.388571 0.919134 2.174416 0.310282 0.301864 -0.392328
3.266667 0.398960 0.929188 2.172394 0.311685 0.293070 -0.462694
3.300000 0.409381 0.938755 2.149989 0.313024 0.284140 -0.497092
3.333333 0.419831 0.947814 2.130559 0.314298 0.275143 -0.468460
3.366667 0.430331 0.956669 2.122514 0.315506 0.266122 -0.340158
3.400000 0.440879 0.965316 2.073848 0.316652 0.257124 -0.090983
3.433333 0.451473 0.973751 2.024668 0.317737 0.248195 0.278090
3.466667 0.462110 0.981971 1.970057 0.318762 0.239351 0.746108
3.500000 0.472787 0.989971 1.862954 0.319729 0.230573 1.291313
3.533333 0.483458 0.997377 1.848844 0.320637 0.221823 1.878285
3.566667 0.494164 1.004556 1.965282 0.321486 0.213062 2.468552
3.600000 0.504902 1.011506 2.154832 0.322274 0.204286 3.024638
3.633333 0.515671 1.018225 2.351798 0.323001 0.195492 3.527182
3.666667 0.526468 1.024708 2.559878 0.323673 0.186674 3.965873
3.700000 0.537289 1.030955 2.725450 0.324304 0.177824 4.337372
3.733333 0.548117 1.036562 2.919273 0.324905 0.168932 4.657541
3.766667 0.558964 1.041928 3.098543 0.325494 0.159960 4.946064
3.800000 0.569829 1.047050 -3.057887 0.326097 0.150810 5.224770
3.833333 0.580708 1.051926 -2.950994 0.326746 0.141359 5.507411
3.866667 0.591600 1.056554 -2.886639 0.327464 0.131532 5.813517
3.900000 0.602501 1.060934 -2.754415 0.328270 0.121281 6.137070
3.933333 0.613410 1.065063 -2.512075 0.329182 0.110521 6.458628
3.966667 0.624323 1.068940 -2.217000 0.330203 0.099223 6.748104
4.000000 0.635301 1.072259 -1.961504 0.331321 0.087408 6.979793
4.033333 0.646354 1.075014 -1.627372 0.332501 0.075180 7.122098
4.066667 0.657403 1.077514 -1.313798 0.333712 0.062618 7.133405
4.100000 0.668539 1.079441 -1.040344 0.334905 0.049855 6.997925
4.133333 0.679765 1.080790 -0.788558 0.336026 0.037086 6.715199
4.166667 0.691079 1.081557 -0.548876 0.337019 0.024484 6.300416
4.200000 0.702379 1.082071 -0.336690 0.337834 0.012194 5.757635
4.233333 0.713758 1.082004 -0.153561 0.338435 0.000314 5.111806
4.266667 0.725116 1.081688 0.016515 0.338783 -0.011082 4.396963
4.300000 0.736450 1.081124 0.123110 0.338860 -0.022023 3.644464
4.333333 0.747831 1.079985 0.267450 0.338658 -0.032564 2.875263
4.366667 0.759182 1.078602 0.389859 0.338184 -0.042783 2.107415
4.400000 0.770499 1.076980 0.452321 0.337444 -0.052760 1.373733
4.433333 0.781780 1.075119 0.469556 0.336455 -0.062607 0.697033
4.466667 0.793020 1.073024 0.451552 0.335240 -0.072390 0.098660
4.500000 0.804218 1.070398 0.402364 0.333819 -0.082083 -0.406870
4.533333 0.815370 1.067544 0.315907 0.332211 -0.091701 -0.797744
4.566667 0.826473 1.064464 0.242211 0.330436 -0.101218 -1.062900
4.600000 0.837493 1.060903 0.170629 0.328514 -0.110589 -1.204921
4.633333 0.848423 1.056875 0.090193 0.326456 -0.119726 -1.232846
4.666667 0.859294 1.052635 0.018652 0.324260 -0.128570 -1.165855
4.700000 0.870060 1.047966 -0.031526 0.321922 -0.137122 -1.024509
4.733333 0.880761 1.043093 -0.061445 0.319440 -0.145330 -0.843107
4.766667 0.891396 1.038020 -0.072357 0.316810 -0.153162 -0.648127
4.800000 0.901961 1.032753 -0.066415 0.314022 -0.160630 -0.462077
4.833333 0.912454 1.027296 -0.059251 0.311065 -0.167771 -0.302325
4.866667 0.922804 1.021515 -0.045922 0.307943 -0.174598 -0.178452
4.900000 0.933077 1.015555 -0.043191 0.304656 -0.181124 -0.093452
4.933333 0.943269 1.009420 -0.031873 0.301199 -0.187374 -0.038586
4.966667 0.953298 1.003023 -0.020258 0.297568 -0.193362 -0.008032
5.000000 0.963159 0.996383 -0.032401 0.293768 -0.199074 0.008920
5.033333 0.972845 0.989522 -0.029574 0.289814 -0.204472 0.021295
5.066667 0.982441 0.982509 -0.055638 0.285722 -0.209551 0.041032
5.100000 0.991945 0.975350 -0.058850 0.281517 -0.214294 0.070308
5.133333 1.001354 0.968050 -0.064803 0.277220 -0.218677 0.108819
5.166667 1.010573 0.960611 -0.053812 0.272853 -0.222694 0.155144
5.200000 1.019600 0.953049 -0.060625 0.268426 -0.226341 0.207257
5.233333 1.028433 0.945380 -0.044138 0.263944 -0.229632 0.261489
5.266667 1.037164 0.937594 -0.020033 0.259402 -0.232559 0.308192
5.300000 1.045701 0.929735 0.000410 0.254790 -0.235108 0.347462
5.333333 1.054133 0.921772 0.010096 0.250106 -0.237269 0.376109
5.366667 1.062371 0.913765 0.036838 0.245352 -0.239041 0.394120
5.400000 1.070501 0.905666 0.054337 0.240530 -0.240421 0.395945
5.433333 1.078523 0.897481 0.051785 0.235637 -0.241409 0.384259
5.466667 1.086353 0.889292 0.063890 0.230686 -0.242018 0.362340
5.500000 1.093991 0.881114 0.067784 0.225693 -0.242281 0.332461
5.533333 1.101439 0.872955 0.092221 0.220685 -0.242249 0.296418
5.566667 1.108699 0.864828 0.108666 0.215677 -0.241952 0.257354
5.600000 1.115773 0.856742 0.124273 0.210699 -0.241433 0.221265
5.633333 1.122663 0.848709 0.133440 0.205786 -0.240725 0.186581
5.666667 1.129372 0.840737 0.128156 0.200963 -0.239857 0.156730
5.700000 1.135966 0.832726 0.131727 0.196243 -0.238828 0.130804
5.733333 1.142382 0.824795 0.123312 0.191619 -0.237613 0.112358
5.766667 1.148684 0.816834 0.128840 0.187088 -0.236183 0.099314
5.800000 1.154815 0.808972 0.119731 0.182640 -0.234519 0.091957
5.833333 1.160832 0.801089 0.127685 0.178256 -0.232595 0.090522
5.866667 1.166734 0.793190 0.125687 0.173916 -0.230383 0.092670
5.900000 1.172475 0.785413 0.140588 0.169615 -0.227901 0.095600
5.933333 1.178060 0.777762 0.145089 0.165352 -0.225185 0.096378
5.966667 1.183491 0.770245 0.151600 0.161139 -0.222304 0.095433
6.000000 1.188773 0.762865 0.153524 0.156979 -0.219305 0.089814
6.033333 1.193908 0.755630 0.165608 0.152887 -0.216258 0.080379
6.066667 1.198900 0.748543 0.161942 0.148881 -0.213230 0.066900
6.100000 1.203753 0.741610 0.162620 0.144970 -0.210262 0.052732
6.133333 1.208494 0.734696 0.160623 0.141159 -0.207366 0.038589
6.166667 1.213102 0.727937 0.158023 0.137446 -0.204526 0.024784
6.200000 1.217599 0.721204 0.163579 0.133829 -0.201732 0.013364
6.233333 1.221988 0.714499 0.157824 0.130300 -0.198960 0.005261
6.266667 1.226267 0.707827 0.163073 0.126848 -0.196170 0.000504
6.300000 1.230439 0.701190 0.166555 0.123461 -0.193331 -0.001879
6.333333 1.234493 0.694706 0.158403 0.120133 -0.190424 -0.001910
6.366667 1.238432 0.688377 0.162321 0.116857 -0.187446 -0.001180
6.400000 1.242259 0.682201 0.163841 0.113631 -0.184395 -0.000147
6.433333 1.245977 0.676176 0.154943 0.110455 -0.181278 0.000791
6.466667 1.249592 0.670202 0.158269 0.107332 -0.178116 0.001368
6.500000 1.253103 0.664378 0.158195 0.104266 -0.174936 0.002456
6.533333 1.256513 0.658609 0.161065 0.101261 -0.171754 0.001843
6.566667 1.259824 0.652896 0.160732 0.098319 -0.168571 0.001688
6.600000 1.263039 0.647331 0.169121 0.095443 -0.165390 0.001902
6.633333 1.266157 0.641827 0.162451 0.092628 -0.162209 0.001136
6.666667 1.269184 0.636469 0.163932 0.089872 -0.159025 0.000198
6.700000 1.272116 0.631177 0.156845 0.087171 -0.155825 -0.002173
6.733333 1.274964 0.626029 0.157579 0.084523 -0.152614 -0.002346
6.766667 1.277731 0.621026 0.162896 0.081924 -0.149407 -0.001828
6.800000 1.280405 0.616091 0.164132 0.079375 -0.146206 -0.000649
6.833333 1.283003 0.611299 0.163798 0.076876 -0.143022 0.000804
6.866667 1.285526 0.606646 0.154067 0.074427 -0.139858 0.002562
6.900000 1.287960 0.602067 0.155107 0.072027 -0.136724 0.006106
6.933333 1.290308 0.597562 0.163532 0.069676 -0.133620 0.007650
6.966667 1.292570 0.593133 0.163695 0.067371 -0.130544 0.006786
