t x y theta dxdt dydt dthetadt
0.000000 0.000000 0.000000 0.255076 0.011365 -0.026435 -0.017336
0.033333 -0.002175 -0.002579 0.255786 0.014803 -0.023569 -0.074960
0.066667 -0.001522 -0.003179 0.260208 0.022958 -0.017496 -0.075728
0.100000 -0.000775 -0.003692 0.579084 0.036584 -0.007435 -0.017165
0.133333 0.000077 -0.004115 0.256472 0.053964 0.005731 0.040937
0.166667 0.002375 -0.003764 0.577841 0.073827 0.021698 0.099717
0.200000 0.004783 -0.003322 0.259647 0.094897 0.040156 0.107251
0.233333 0.009926 -0.001025 0.253142 0.116117 0.060911 0.056593
0.266667 0.017955 0.003552 0.251680 0.139604 0.085799 -0.021496
0.300000 0.026091 0.008213 0.253210 0.166146 0.115548 -0.088850
0.333333 0.034333 0.012953 0.562530 0.201271 0.154829 -0.180040
0.366667 0.042685 0.017771 0.768394 0.248902 0.206686 -0.261772
0.400000 0.033437 0.011278 0.256027 0.314427 0.275098 -0.312769
0.433333 0.033583 0.012364 0.257183 0.402515 0.363442 -0.303360
0.466667 0.042288 0.021050 0.253297 0.506823 0.465116 -0.268472
0.500000 0.062036 0.040221 0.261460 0.620860 0.573263 -0.254926
0.533333 0.081891 0.059445 0.256531 0.729640 0.673441 -0.143176
0.566667 0.101844 0.078705 0.258103 0.810542 0.743996 0.028143
0.600000 0.121886 0.097982 0.254142 0.844275 0.766868 0.190268
0.633333 0.142007 0.117260 0.254310 0.816533 0.728337 0.359077
0.666667 0.217363 0.185776 0.269839 0.727832 0.629346 0.473916
0.700000 0.292730 0.254220 0.249314 0.582375 0.474194 0.577993
0.733333 0.368062 0.322530 0.311164 0.389002 0.271338 0.553843
0.766667 0.443309 0.390644 0.479371 0.173463 0.045328 0.509962
0.800000 0.409825 0.355415 0.568155 -0.040460 -0.180646 0.466635
0.833333 0.376263 0.319950 0.329444 -0.238546 -0.391080 0.349216
0.866667 0.342647 0.284282 0.852779 -0.405438 -0.571166 0.236345
0.900000 0.207754 0.152153 0.251150 -0.523300 -0.702798 0.128461
0.933333 0.147981 0.085523 0.257215 -0.580584 -0.773377 0.079553
0.966667 0.131861 0.057252 0.773922 -0.577854 -0.781577 -0.057497
1.000000 0.116983 0.034554 0.249451 -0.526405 -0.737522 -0.186974
1.033333 0.124196 0.030700 0.255038 -0.432714 -0.648412 -0.233884
1.066667 0.131564 0.026929 0.257638 -0.312881 -0.528381 -0.233175
1.100000 0.139087 0.023249 0.747764 -0.195343 -0.404675 -0.273453
1.133333 0.146774 0.019668 0.525818 -0.094972 -0.292867 -0.342024
1.166667 0.136305 0.008142 0.257371 -0.017847 -0.201460 -0.280086
1.200000 0.148667 0.011643 0.551713 0.032198 -0.133554 -0.152911
1.233333 0.144823 0.006827 0.254473 0.057110 -0.088596 -0.085630
1.266667 0.141157 0.002129 0.261628 0.063365 -0.063254 -0.042983
1.300000 0.137680 -0.002445 0.259943 0.064590 -0.046655 0.081616
1.333333 0.149411 0.002588 0.252595 0.064804 -0.035677 0.253048
1.366667 0.161334 0.007751 0.582071 0.061604 -0.031475 0.309667
1.400000 0.157681 0.003921 0.247324 0.064066 -0.029017 0.228792
1.433333 0.154231 0.000221 0.256852 0.072181 -0.027175 0.174143
1.466667 0.163614 0.005705 0.248646 0.083565 -0.026331 0.181422
1.500000 0.173208 0.011323 0.527127 0.095043 -0.027987 0.125547
1.533333 0.151625 0.001460 1.383182 0.109606 -0.030010 -0.048255
1.566667 0.157445 -0.002656 0.261885 0.129437 -0.030227 -0.146042
1.600000 0.163504 -0.006627 0.246454 0.150137 -0.030122 -0.175548
1.633333 0.170528 -0.008093 0.258231 0.170879 -0.030207 -0.204891
1.666667 0.177794 -0.009402 0.255823 0.192935 -0.029487 -0.355312
1.700000 0.188340 -0.007491 0.257813 0.218730 -0.025565 -0.461005
1.733333 0.199129 -0.005417 0.257178 0.244205 -0.019441 -0.335474
1.766667 0.210160 -0.003179 0.259374 0.268618 -0.012008 -0.210580
1.800000 0.221433 -0.000775 0.971732 0.290310 -0.004725 -0.103523
1.833333 0.224877 -0.006955 0.256775 0.308417 0.002072 0.004559
1.866667 0.228569 -0.012961 0.251694 0.321026 0.007291 0.171798
1.900000 0.237765 -0.014637 0.255784 0.326315 0.009827 0.315866
1.933333 0.253885 -0.011263 0.254064 0.324878 0.009882 0.281003
1.966667 0.270251 -0.007697 0.257820 0.317232 0.008925 0.193915
2.000000 0.286859 -0.003938 0.264232 0.306704 0.009853 0.141366
2.033333 0.303704 0.000015 0.255568 0.295214 0.013905 0.086489
2.066667 0.320783 0.004161 0.765644 0.284682 0.022318 -0.011137
2.100000 0.331062 0.003803 0.563793 0.278716 0.038147 -0.132002
2.133333 0.328092 -0.002501 0.763065 0.285829 0.068361 -0.252584
2.166667 0.325372 -0.008596 0.265724 0.319188 0.124435 -0.342500
2.200000 0.322902 -0.014477 0.255301 0.389803 0.216340 -0.443847
2.233333 0.328996 -0.013554 0.243597 0.508636 0.354199 -0.535497
2.266667 0.339523 -0.007455 0.255317 0.682840 0.544024 -0.532948
2.300000 0.357237 0.006098 0.246056 0.905615 0.777821 -0.474075
2.333333 0.375206 0.019864 0.253759 1.160929 1.039688 -0.325327
2.366667 0.393425 0.033833 0.245932 1.420141 1.301219 -0.177155
2.400000 0.411889 0.047995 0.251468 1.656637 1.535940 -0.031656
2.433333 0.452939 0.087448 0.262792 1.841779 1.714512 0.104010
2.466667 0.534666 0.168167 0.260508 1.948095 1.809154 0.185235
2.500000 0.693397 0.322323 0.305769 1.962755 1.806923 0.223706
2.533333 0.840010 0.464833 0.305839 1.878505 1.699871 0.204043
2.566667 0.986566 0.607164 0.331752 1.695288 1.487963 0.168415
2.600000 1.091845 0.705325 0.353736 1.415531 1.173951 0.115026
2.633333 1.092611 0.699977 0.332148 1.056588 0.776698 0.051278
2.666667 1.093190 0.694221 0.325880 0.644942 0.324332 -0.019697
2.700000 1.089260 0.677849 0.330870 0.214265 -0.147779 -0.082874
2.733333 1.085164 0.661097 0.330947 -0.201868 -0.604077 -0.137464
2.766667 1.062116 0.621269 0.330747 -0.568693 -1.007973 -0.181319
2.800000 1.002290 0.542738 0.318224 -0.855289 -1.327037 -0.206695
2.833333 0.942395 0.463963 0.265902 -1.050938 -1.549127 -0.214355
2.866667 0.882483 0.385024 0.255027 -1.151417 -1.668819 -0.205323
2.900000 0.822605 0.306000 0.270011 -1.165434 -1.694204 -0.188808
2.933333 0.762812 0.226971 0.249014 -1.103472 -1.635341 -0.163838
2.966667 0.703155 0.148017 0.255605 -0.979196 -1.506159 -0.130089
3.000000 0.643686 0.069218 0.256163 -0.808997 -1.323398 -0.093939
3.033333 0.623515 0.030317 0.258617 -0.605196 -1.100474 -0.063087
3.066667 0.626653 0.016877 0.260248 -0.382060 -0.852942 -0.039123
3.100000 0.630048 0.003739 0.251153 -0.145713 -0.588250 -0.018103
3.133333 0.633705 -0.009079 0.251044 0.097398 -0.314469 -0.000819
3.166667 0.645665 -0.010097 0.257461 0.342324 -0.038143 0.014690
3.200000 0.657892 -0.010770 0.258177 0.587167 0.237381 0.030653
3.233333 0.679649 0.000984 0.255161 0.831944 0.510925 0.052873
3.266667 0.715078 0.029305 0.259889 1.077056 0.781678 0.082549
3.300000 0.750745 0.057949 0.263508 1.310132 1.036238 0.115121
3.333333 0.786632 0.086894 0.255343 1.519926 1.262569 0.146502
3.366667 0.822723 0.116115 0.254707 1.695344 1.449372 0.173602
3.400000 0.859000 0.145588 0.253599 1.825316 1.585384 0.194954
3.433333 0.968415 0.247158 0.258386 1.900013 1.660887 0.209480
3.466667 1.077916 0.348875 0.298650 1.914160 1.671128 0.214128
3.500000 1.194683 0.457840 0.331571 1.870779 1.620050 0.207985
3.533333 1.311390 0.566764 0.329168 1.772929 1.511658 0.194205
3.566667 1.373988 0.622884 0.330856 1.627399 1.353157 0.170796
3.600000 1.408397 0.649035 0.332921 1.443343 1.154283 0.140079
3.633333 1.425992 0.655487 0.327568 1.236395 0.931230 0.144089
3.666667 1.443411 0.661716 0.325387 1.023051 0.701162 0.148827
3.700000 1.460651 0.667719 0.343651 0.819631 0.480828 0.179278
3.733333 1.477708 0.673496 0.327432 0.643003 0.287981 0.228195
3.766667 1.494577 0.679046 0.331773 0.502509 0.133340 0.286376
3.800000 1.505615 0.676475 0.332818 0.403262 0.023282 0.352093
3.833333 1.516462 0.673681 0.322980 0.344482 -0.042244 0.343029
3.866667 1.527120 0.670673 0.329998 0.317799 -0.071362 0.335937
3.900000 1.528656 0.656856 0.319087 0.314959 -0.071944 0.291405
3.933333 1.530012 0.642847 0.321899 0.326574 -0.053914 0.222171
3.966667 1.509268 0.607206 0.815373 0.348733 -0.022078 0.111774
4.000000 1.528736 0.613006 0.329435 0.375556 0.016445 0.001144
4.033333 1.548044 0.618673 0.570954 0.402036 0.055828 -0.089384
4.066667 1.573905 0.636334 0.480636 0.426711 0.093514 -0.192089
4.100000 1.599591 0.653849 0.330463 0.446509 0.125068 -0.278284
4.133333 1.625089 0.671204 0.327380 0.458792 0.146928 -0.333727
4.166667 1.642474 0.679601 0.327821 0.458115 0.153005 -0.308524
4.200000 1.655227 0.682564 0.327597 0.446611 0.145256 -0.283213
4.233333 1.667778 0.685349 0.332992 0.425758 0.124916 -0.218559
4.266667 1.680126 0.687957 0.331065 0.397788 0.094929 -0.128135
4.300000 1.691177 0.688512 0.330559 0.365316 0.058836 -0.036591
4.333333 1.702025 0.688894 0.326793 0.329917 0.019315 0.016905
4.366667 1.712669 0.689107 0.334045 0.291140 -0.022897 0.071254
4.400000 1.723145 0.688475 0.325675 0.251900 -0.064698 0.125593
4.433333 1.731917 0.686298 0.329078 0.215235 -0.102875 0.161368
4.466667 1.738939 0.682240 0.561548 0.181719 -0.136968 0.205802
4.500000 1.745766 0.678034 0.327238 0.153028 -0.165582 0.263174
4.533333 1.752397 0.673686 0.329057 0.133719 -0.184234 0.339863
4.566667 1.758836 0.669204 0.326451 0.133178 -0.184266 0.334575
4.600000 1.765083 0.664594 0.332769 0.146219 -0.170004 0.328628
4.633333 1.762688 0.651632 0.327343 0.167880 -0.145633 0.322114
4.666667 1.744487 0.624729 0.329372 0.198305 -0.110823 0.272422
4.700000 1.696814 0.572383 0.827931 0.239407 -0.063793 0.155752
4.733333 1.738633 0.599750 0.331114 0.283412 -0.012532 0.038699
4.766667 1.780306 0.627076 0.330148 0.321523 0.034401 -0.037725
4.800000 1.797410 0.632364 0.823826 0.354468 0.076936 -0.155276
4.833333 1.814353 0.637588 0.477439 0.382078 0.114275 -0.285520
4.866667 1.836058 0.653861 0.331858 0.399269 0.140705 -0.394575
4.900000 1.849056 0.660753 0.331080 0.396897 0.147319 -0.407951
4.933333 1.861869 0.667557 0.334277 0.381349 0.139660 -0.421324
4.966667 1.871849 0.670634 0.329225 0.358535 0.122811 -0.434647
5.000000 1.881641 0.673618 0.334089 0.330253 0.098297 -0.365599
5.033333 1.890595 0.675007 0.327804 0.298816 0.068090 -0.270115
5.066667 1.898329 0.675032 0.329547 0.268746 0.037279 -0.173538
5.100000 1.905876 0.674967 0.333069 0.245389 0.011024 -0.119012
5.133333 1.913498 0.674241 0.327879 0.226512 -0.012223 -0.062290
5.166667 1.920272 0.672463 0.327806 0.209490 -0.034536 0.005569
5.200000 1.926863 0.670604 0.333289 0.194314 -0.055261 0.032641
5.233333 1.933273 0.668667 0.328770 0.180301 -0.074662 0.056839
5.266667 1.939503 0.666658 0.328385 0.166182 -0.094145 0.079654
5.300000 1.945556 0.664581 0.331034 0.151689 -0.113597 0.121930
5.333333 1.951432 0.662438 0.329128 0.137501 -0.131744 0.161289
5.366667 1.955400 0.657436 0.343901 0.124552 -0.146939 0.176904
5.400000 1.959197 0.652381 0.340806 0.112654 -0.159429 0.203522
5.433333 1.961088 0.642840 0.323970 0.103631 -0.166465 0.207843
5.466667 1.962816 0.633265 0.343999 0.098573 -0.166337 0.212209
5.500000 1.964384 0.623666 0.462165 0.098423 -0.157714 0.185871
5.533333 1.972514 0.625423 0.329860 0.103122 -0.140866 0.160978
5.566667 1.970912 0.614533 0.476104 0.113173 -0.115409 0.137936
5.600000 1.969164 0.603646 0.332879 0.129633 -0.080019 0.093320
5.633333 1.967274 0.592772 0.548680 0.152801 -0.035802 0.041950
5.666667 1.976097 0.597042 0.332264 0.180186 0.013668 0.032552
5.700000 1.984781 0.601336 0.325878 0.209296 0.064812 0.028997
5.733333 1.993325 0.605652 0.470940 0.237700 0.114088 0.012625
5.766667 2.006061 0.617586 0.334979 0.261157 0.155451 0.038269
5.800000 2.008852 0.615855 0.342267 0.276246 0.184002 0.072801
5.833333 2.011501 0.614134 0.538106 0.277950 0.194582 0.159896
5.866667 2.030716 0.634288 0.337358 0.269171 0.189984 0.163810
5.900000 2.049779 0.654440 0.327907 0.252816 0.173019 0.189609
5.933333 2.068683 0.674570 0.337687 0.229314 0.145156 0.239920
5.966667 2.100076 0.702322 0.342318 0.199564 0.109560 0.239207
6.000000 2.089114 0.688271 0.827971 0.166333 0.070416 0.199968
6.033333 2.077990 0.674170 0.330229 0.133060 0.032089 0.109216
6.066667 2.076594 0.666368 0.328992 0.098167 -0.005523 0.117834
6.100000 2.075045 0.658537 0.560803 0.062086 -0.040675 0.074584
6.133333 2.073351 0.650687 0.328411 0.029407 -0.068756 0.020635
6.166667 2.071514 0.642826 0.745117 0.006468 -0.084516 -0.047289
6.200000 2.084915 0.652032 0.332337 -0.008386 -0.090072 -0.033732
6.233333 2.098169 0.661229 0.523294 -0.016052 -0.086620 -0.019123
6.266667 2.091258 0.656374 0.340441 -0.014378 -0.073714 -0.120491
