t x y theta dxdt dydt dthetadt
0.000000 0.000000 0.000000 0.413594 0.003264 -0.005423 0.009892
0.033333 0.000207 -0.000167 0.409525 0.004438 -0.007226 0.024806
0.066667 0.000305 -0.000581 0.404384 0.005582 -0.010782 0.051629
0.100000 0.000438 -0.000739 0.408154 0.006625 -0.016858 0.086917
0.133333 0.000901 -0.000704 0.411510 0.007457 -0.026258 0.122844
0.166667 0.001330 -0.000767 0.404032 0.007496 -0.040089 0.150063
0.200000 0.001637 -0.001110 0.409799 0.006118 -0.059224 0.154316
0.233333 0.001819 -0.001741 0.411302 0.002237 -0.084438 0.124894
0.266667 0.001873 -0.002669 0.413630 -0.005098 -0.115879 0.053009
0.300000 0.002071 -0.004366 0.425676 -0.016825 -0.153606 -0.057105
0.333333 0.003195 -0.007330 0.473858 -0.034327 -0.197502 -0.194094
0.366667 0.004097 -0.013000 0.508622 -0.058058 -0.246301 -0.340076
0.400000 0.003771 -0.022948 0.533045 -0.088333 -0.298495 -0.472563
0.433333 0.003297 -0.033218 0.508372 -0.124496 -0.352129 -0.568266
0.466667 0.002672 -0.043810 0.441787 -0.166218 -0.405026 -0.601965
0.500000 -0.003421 -0.060725 0.339442 -0.212657 -0.454106 -0.567852
0.533333 -0.009667 -0.077951 0.257176 -0.262212 -0.495919 -0.464076
0.566667 -0.021886 -0.099346 0.199675 -0.313250 -0.527617 -0.294721
0.600000 -0.034247 -0.121032 0.165190 -0.364401 -0.546435 -0.078743
0.633333 -0.046740 -0.142997 0.167964 -0.414776 -0.549942 0.152517
0.666667 -0.064579 -0.165097 0.205940 -0.462561 -0.536358 0.354548
0.700000 -0.082524 -0.187450 0.249084 -0.506901 -0.505932 0.504468
0.733333 -0.100560 -0.210045 0.329469 -0.546802 -0.459883 0.579602
0.766667 -0.118670 -0.232870 0.427440 -0.582173 -0.399965 0.560603
0.800000 -0.139726 -0.249332 0.560293 -0.612430 -0.329335 0.444758
0.833333 -0.160527 -0.259694 0.537542 -0.636630 -0.252194 0.258742
0.866667 -0.184360 -0.263187 0.527021 -0.654236 -0.174363 0.040793
0.900000 -0.208185 -0.266902 0.532139 -0.664253 -0.100639 -0.178001
0.933333 -0.232954 -0.263817 0.470129 -0.666186 -0.036090 -0.357371
0.966667 -0.257668 -0.260978 0.401109 -0.659210 0.014693 -0.458078
1.000000 -0.282171 -0.252676 0.340647 -0.643082 0.048340 -0.443906
1.033333 -0.306572 -0.244658 0.277675 -0.617922 0.063028 -0.318849
1.066667 -0.328928 -0.235280 0.239625 -0.584901 0.059356 -0.097425
1.100000 -0.350269 -0.227097 0.222330 -0.545318 0.037740 0.197376
1.133333 -0.371446 -0.219267 0.211581 -0.500595 -0.000139 0.524576
1.166667 -0.387730 -0.217861 0.242719 -0.452718 -0.051964 0.841391
1.200000 -0.398019 -0.224549 0.294731 -0.403894 -0.114355 1.100803
1.233333 -0.408108 -0.231641 0.381072 -0.356736 -0.183895 1.274936
1.266667 -0.417988 -0.239143 0.493703 -0.313443 -0.256699 1.349448
1.300000 -0.427651 -0.247063 0.602369 -0.275967 -0.328477 1.319732
1.333333 -0.437090 -0.255407 0.716827 -0.245942 -0.395396 1.184569
1.366667 -0.441662 -0.270502 0.785509 -0.223961 -0.454083 0.946778
1.400000 -0.444324 -0.290756 0.796748 -0.209790 -0.502545 0.619740
1.433333 -0.447321 -0.314689 0.772127 -0.202753 -0.539052 0.226830
1.466667 -0.451469 -0.339845 0.737363 -0.201222 -0.563769 -0.211281
1.500000 -0.458246 -0.363153 0.725720 -0.203524 -0.577580 -0.678831
1.533333 -0.464783 -0.386860 0.706978 -0.208128 -0.581709 -1.145182
1.566667 -0.471074 -0.410958 0.668203 -0.213717 -0.578814 -1.577521
1.600000 -0.481490 -0.427895 0.644804 -0.218810 -0.572338 -1.957253
1.633333 -0.491642 -0.445212 0.602276 -0.222166 -0.566741 -2.274929
1.666667 -0.501521 -0.462908 0.479464 -0.223300 -0.566102 -2.517370
1.700000 -0.509233 -0.476233 0.318717 -0.222024 -0.574136 -2.658759
1.733333 -0.516653 -0.489939 0.174086 -0.218090 -0.594028 -2.685754
1.766667 -0.523774 -0.504030 0.048101 -0.211075 -0.627519 -2.596962
1.800000 -0.529148 -0.520389 -0.059982 -0.201166 -0.674708 -2.383414
1.833333 -0.535168 -0.540991 -0.177522 -0.187775 -0.734303 -2.041684
1.866667 -0.541248 -0.565091 -0.279139 -0.169694 -0.804122 -1.586467
1.900000 -0.547508 -0.592847 -0.340247 -0.145574 -0.880889 -1.054443
1.933333 -0.553443 -0.620968 -0.381480 -0.113536 -0.961678 -0.479789
1.966667 -0.560732 -0.655135 -0.388236 -0.072266 -1.043288 0.110429
2.000000 -0.566719 -0.694740 -0.363505 -0.020692 -1.122674 0.682318
2.033333 -0.570163 -0.737828 -0.275054 0.041512 -1.197356 1.202171
2.066667 -0.573264 -0.781202 -0.188050 0.113650 -1.265521 1.648228
2.100000 -0.572086 -0.825264 -0.112564 0.194633 -1.326533 2.009312
2.133333 -0.566006 -0.871724 0.007182 0.281856 -1.379385 2.272413
2.166667 -0.555106 -0.920370 0.103665 0.372382 -1.423897 2.428668
2.200000 -0.537694 -0.970899 0.194113 0.463209 -1.460746 2.474731
2.233333 -0.519969 -1.021572 0.297143 0.551162 -1.490900 2.419012
2.266667 -0.495189 -1.073530 0.391915 0.632834 -1.515183 2.268530
2.300000 -0.470138 -1.125565 0.485662 0.705186 -1.534206 2.034112
2.333333 -0.444839 -1.177641 0.577152 0.766128 -1.548985 1.734723
2.366667 -0.413388 -1.230226 0.653400 0.813971 -1.560355 1.386568
2.400000 -0.381744 -1.282783 0.715872 0.847928 -1.568782 1.009792
2.433333 -0.349939 -1.335276 0.736308 0.867533 -1.574511 0.620041
2.466667 -0.318004 -1.387668 0.740305 0.873526 -1.577641 0.238823
2.500000 -0.285968 -1.439924 0.729986 0.866645 -1.577990 -0.117155
2.533333 -0.253478 -1.493397 0.685951 0.847999 -1.575191 -0.436426
2.566667 -0.220950 -1.546661 0.651491 0.819016 -1.568532 -0.710483
2.600000 -0.191094 -1.600427 0.589343 0.780873 -1.557218 -0.935643
2.633333 -0.165214 -1.653734 0.538783 0.734841 -1.540066 -1.110096
2.666667 -0.144015 -1.706049 0.490354 0.682365 -1.516101 -1.240181
2.700000 -0.122883 -1.758002 0.446955 0.625107 -1.484512 -1.331774
2.733333 -0.101837 -1.809556 0.415439 0.564412 -1.444672 -1.387638
2.766667 -0.080896 -1.860675 0.360849 0.501617 -1.395891 -1.410105
2.800000 -0.064669 -1.908703 0.333632 0.437850 -1.337310 -1.402684
2.833333 -0.052764 -1.952866 0.290238 0.374330 -1.268623 -1.370340
2.866667 -0.041005 -1.996494 0.219708 0.311510 -1.189172 -1.315031
2.900000 -0.033127 -2.036348 0.154857 0.250122 -1.099070 -1.236194
2.933333 -0.025408 -2.075611 0.083398 0.190867 -0.998330 -1.138215
2.966667 -0.020820 -2.109391 0.042015 0.134699 -0.887986 -1.023509
3.000000 -0.018767 -2.139464 0.011979 0.082643 -0.769814 -0.895590
3.033333 -0.018783 -2.164225 -0.023750 0.035449 -0.646072 -0.757723
3.066667 -0.018956 -2.188326 -0.001492 -0.005939 -0.519920 -0.615877
3.100000 -0.020960 -2.204988 -0.025219 -0.041225 -0.394162 -0.477500
3.133333 -0.024870 -2.214694 -0.019171 -0.069972 -0.272126 -0.351798
3.166667 -0.030060 -2.217521 -0.028765 -0.092177 -0.157228 -0.246074
3.200000 -0.035439 -2.213105 -0.054799 -0.108073 -0.053157 -0.161683
3.233333 -0.040935 -2.208054 -0.064451 -0.117877 0.037125 -0.096980
3.266667 -0.046539 -2.202387 -0.054532 -0.121797 0.110967 -0.049940
3.300000 -0.051712 -2.193087 -0.032761 -0.120062 0.166347 -0.018138
3.333333 -0.055525 -2.182331 -0.029110 -0.113319 0.202232 0.006070
3.366667 -0.059422 -2.171032 -0.045627 -0.102606 0.219355 0.027154
3.400000 -0.063397 -2.159214 -0.024373 -0.088985 0.220181 0.042952
3.433333 -0.067444 -2.146905 -0.034769 -0.073560 0.207391 0.051128
3.466667 -0.071557 -2.134131 -0.030182 -0.057473 0.184176 0.054997
3.500000 -0.073268 -2.126263 -0.032002 -0.041847 0.154130 0.053468
3.533333 -0.073054 -2.122772 -0.040159 -0.027577 0.120874 0.047071
3.566667 -0.071813 -2.122488 -0.025465 -0.015195 0.087435 0.034370
3.600000 -0.070380 -2.124817 -0.037740 -0.005073 0.056116 0.021589
3.633333 -0.069003 -2.126772 -0.015406 0.002543 0.028912 0.008378
3.666667 -0.067682 -2.128362 -0.004345 0.007427 0.007522 -0.006645
3.700000 -0.067303 -2.129969 -0.014795 0.009796 -0.007471 -0.018677
3.733333 -0.066977 -2.131232 -0.017441 0.010081 -0.016367 -0.029255
3.766667 -0.066900 -2.132374 -0.026392 0.008837 -0.020083 -0.034809
3.800000 -0.066871 -2.133194 -0.025394 0.006659 -0.020033 -0.039015
