t x y theta dxdt dydt dthetadt
0.000000 0.000000 0.000000 1.914800 -0.077498 -0.040509 0.008080
0.033333 -0.002644 -0.001359 1.915301 -0.082532 -0.041127 0.007536
0.066667 -0.005451 -0.002740 1.909557 -0.087698 -0.041740 0.009099
0.100000 -0.008424 -0.004144 1.918572 -0.093007 -0.042343 0.012331
0.133333 -0.011570 -0.005571 1.911371 -0.098470 -0.042935 0.013718
0.166667 -0.014893 -0.007020 1.914156 -0.104095 -0.043511 0.014139
0.200000 -0.018397 -0.008491 1.923182 -0.109893 -0.044066 0.013123
0.233333 -0.022121 -0.009973 1.915509 -0.115869 -0.044600 0.012726
0.266667 -0.026037 -0.011477 1.926438 -0.122021 -0.045110 0.010452
0.300000 -0.030180 -0.012989 1.926992 -0.128353 -0.045595 0.007249
0.333333 -0.034525 -0.014524 1.919535 -0.134860 -0.046055 0.004912
0.366667 -0.039104 -0.016066 1.914570 -0.141536 -0.046494 0.001814
0.400000 -0.043897 -0.017629 1.916396 -0.148366 -0.046918 0.000823
0.433333 -0.048908 -0.019214 1.916226 -0.155347 -0.047331 0.000923
0.466667 -0.054166 -0.020804 1.917124 -0.162472 -0.047735 0.003901
0.500000 -0.059674 -0.022399 1.924788 -0.169736 -0.048136 0.008243
0.533333 -0.065437 -0.023999 1.918439 -0.177132 -0.048536 0.012685
0.566667 -0.071441 -0.025619 1.916615 -0.184662 -0.048935 0.018092
0.600000 -0.077690 -0.027259 1.921670 -0.192327 -0.049327 0.021486
0.633333 -0.084205 -0.028902 1.917562 -0.200126 -0.049712 0.023397
0.666667 -0.090977 -0.030563 1.923972 -0.208057 -0.050084 0.020521
0.700000 -0.098011 -0.032245 1.915673 -0.216122 -0.050438 0.014947
0.733333 -0.105315 -0.033944 1.927456 -0.224326 -0.050764 0.006915
0.766667 -0.112892 -0.035662 1.932264 -0.232671 -0.051060 -0.004220
0.800000 -0.120754 -0.037378 1.935294 -0.241156 -0.051322 -0.018425
0.833333 -0.128902 -0.039113 1.924634 -0.249783 -0.051544 -0.035542
0.866667 -0.137340 -0.040844 1.922747 -0.258554 -0.051726 -0.050861
0.900000 -0.146074 -0.042571 1.919787 -0.267465 -0.051870 -0.064664
0.933333 -0.155111 -0.044315 1.924365 -0.276515 -0.051978 -0.075630
0.966667 -0.164449 -0.046053 1.930749 -0.285702 -0.052057 -0.083844
1.000000 -0.174092 -0.047785 1.907624 -0.295031 -0.052111 -0.084697
1.033333 -0.184056 -0.049531 1.892423 -0.304508 -0.052152 -0.077332
1.066667 -0.194331 -0.051269 1.902147 -0.314140 -0.052186 -0.061821
1.100000 -0.204940 -0.053021 1.900261 -0.323933 -0.052218 -0.036324
1.133333 -0.215865 -0.054763 1.892788 -0.333890 -0.052251 0.000713
1.166667 -0.227109 -0.056493 1.900025 -0.344013 -0.052286 0.053396
1.200000 -0.238704 -0.058235 1.893465 -0.354301 -0.052319 0.118563
1.233333 -0.250624 -0.059965 1.891629 -0.364751 -0.052346 0.195961
1.266667 -0.262908 -0.061704 1.903480 -0.375352 -0.052359 0.286282
1.300000 -0.275562 -0.063453 1.896588 -0.386098 -0.052351 0.391274
1.333333 -0.288591 -0.065211 1.908262 -0.396983 -0.052316 0.512205
1.366667 -0.302001 -0.066976 1.928621 -0.407990 -0.052242 0.648259
1.400000 -0.315799 -0.068747 1.957696 -0.419094 -0.052119 0.801945
1.433333 -0.329933 -0.070498 1.987017 -0.430271 -0.051935 0.973691
1.466667 -0.344408 -0.072229 2.014807 -0.441514 -0.051684 1.164134
1.500000 -0.359283 -0.073959 2.051452 -0.452812 -0.051356 1.366491
1.533333 -0.374564 -0.075684 2.087065 -0.464156 -0.050945 1.575801
1.566667 -0.390254 -0.077401 2.135392 -0.475554 -0.050448 1.782838
1.600000 -0.406290 -0.079094 2.198954 -0.487034 -0.049865 1.975321
1.633333 -0.422744 -0.080771 2.274302 -0.498619 -0.049194 2.138357
1.666667 -0.439544 -0.082421 2.364455 -0.510324 -0.048429 2.246427
1.700000 -0.456693 -0.084043 2.447106 -0.522161 -0.047567 2.281268
1.733333 -0.474190 -0.085634 2.555857 -0.534160 -0.046606 2.222372
1.766667 -0.492122 -0.087194 2.655061 -0.546344 -0.045542 2.057932
1.800000 -0.510496 -0.088717 2.774562 -0.558716 -0.044370 1.778307
1.833333 -0.529315 -0.090198 2.863101 -0.571272 -0.043091 1.383405
1.866667 -0.548483 -0.091645 2.960859 -0.584006 -0.041710 0.887877
1.900000 -0.568109 -0.093042 2.993665 -0.596906 -0.040225 0.312694
1.933333 -0.588197 -0.094383 3.027024 -0.609936 -0.038640 -0.317961
1.966667 -0.608753 -0.095664 3.013270 -0.623042 -0.036964 -0.975269
2.000000 -0.629782 -0.096877 2.928886 -0.636163 -0.035210 -1.620944
2.033333 -0.651157 -0.098051 2.813949 -0.649256 -0.033388 -2.217101
2.066667 -0.673013 -0.099151 2.722402 -0.662251 -0.031518 -2.734119
2.100000 -0.695355 -0.100174 2.586600 -0.675100 -0.029615 -3.151889
2.133333 -0.718183 -0.101115 2.450311 -0.687747 -0.027698 -3.453475
2.166667 -0.741351 -0.102014 2.289688 -0.700171 -0.025778 -3.632034
2.200000 -0.765008 -0.102823 2.122440 -0.712368 -0.023863 -3.696852
2.233333 -0.788999 -0.103587 1.959844 -0.724324 -0.021959 -3.668420
2.266667 -0.813478 -0.104256 1.820669 -0.736061 -0.020066 -3.559864
2.300000 -0.838287 -0.104878 1.698227 -0.747589 -0.018186 -3.389273
2.333333 -0.863422 -0.105454 1.591912 -0.758961 -0.016309 -3.173625
2.366667 -0.888881 -0.105983 1.522367 -0.770191 -0.014437 -2.934950
2.400000 -0.914659 -0.106465 1.430808 -0.781322 -0.012560 -2.685881
2.433333 -0.940916 -0.106851 1.343085 -0.792397 -0.010675 -2.432128
2.466667 -0.967485 -0.107188 1.265266 -0.803459 -0.008773 -2.183918
2.500000 -0.994525 -0.107432 1.204390 -0.814541 -0.006852 -1.944456
2.533333 -1.021870 -0.107628 1.137641 -0.825649 -0.004915 -1.716805
2.566667 -1.049517 -0.107773 1.069086 -0.836801 -0.002960 -1.491996
2.600000 -1.077621 -0.107833 1.037383 -0.847965 -0.000997 -1.269048
2.633333 -1.106018 -0.107843 0.989446 -0.859119 0.000967 -1.046268
2.666667 -1.134862 -0.107772 0.968854 -0.870215 0.002921 -0.825987
2.700000 -1.163990 -0.107650 0.943145 -0.881232 0.004861 -0.607793
2.733333 -1.193556 -0.107453 0.922905 -0.892123 0.006780 -0.392756
2.766667 -1.223554 -0.107182 0.909368 -0.902840 0.008671 -0.189802
2.800000 -1.253977 -0.106841 0.923766 -0.913360 0.010533 -0.002876
2.833333 -1.284662 -0.106448 0.925367 -0.923638 0.012360 0.163534
2.866667 -1.315756 -0.105990 0.934832 -0.933629 0.014151 0.308654
2.900000 -1.347100 -0.105480 0.961837 -0.943286 0.015904 0.426242
2.933333 -1.378688 -0.104919 0.984048 -0.952613 0.017620 0.511957
2.966667 -1.410660 -0.104298 1.010757 -0.961604 0.019303 0.563265
3.000000 -1.443010 -0.103618 1.039145 -0.970253 0.020958 0.583642
3.033333 -1.475585 -0.102888 1.068835 -0.978578 0.022591 0.571686
3.066667 -1.508376 -0.102106 1.102474 -0.986620 0.024207 0.526443
3.100000 -1.541515 -0.101269 1.129086 -0.994396 0.025813 0.450655
3.133333 -1.574858 -0.100380 1.132659 -1.001892 0.027412 0.349046
3.166667 -1.608395 -0.099441 1.155531 -1.009124 0.029009 0.226525
3.200000 -1.642121 -0.098452 1.161422 -1.016126 0.030608 0.082311
3.233333 -1.676151 -0.097406 1.161862 -1.022904 0.032214 -0.076902
3.266667 -1.710475 -0.096305 1.163508 -1.029448 0.033829 -0.244150
3.300000 -1.744963 -0.095153 1.144573 -1.035766 0.035456 -0.412958
3.333333 -1.779609 -0.093951 1.139081 -1.041879 0.037100 -0.582962
3.366667 -1.814514 -0.092690 1.119869 -1.047780 0.038763 -0.747909
3.400000 -1.849561 -0.091379 1.085918 -1.053433 0.040444 -0.899080
3.433333 -1.884842 -0.090006 1.036902 -1.058829 0.042144 -1.031950
3.466667 -1.920248 -0.088584 1.002152 -1.063965 0.043861 -1.143108
3.500000 -1.955865 -0.087097 0.952512 -1.068831 0.045595 -1.228397
3.533333 -1.991678 -0.085544 0.892077 -1.073399 0.047341 -1.277709
3.566667 -2.027590 -0.083943 0.853768 -1.077658 0.049093 -1.292347
3.600000 -2.063676 -0.082273 0.807400 -1.081597 0.050846 -1.276017
3.633333 -2.099843 -0.080557 0.741453 -1.085206 0.052595 -1.234063
3.666667 -2.136156 -0.078772 0.684257 -1.088466 0.054333 -1.168182
3.700000 -2.172601 -0.076917 0.640696 -1.091361 0.056052 -1.084337
3.733333 -2.209101 -0.075017 0.612609 -1.093895 0.057750 -0.994670
3.766667 -2.245706 -0.073049 0.589290 -1.096060 0.059419 -0.900908
3.800000 -2.282347 -0.071039 0.567025 -1.097859 0.061058 -0.806974
3.833333 -2.319064 -0.068962 0.548895 -1.099284 0.062661 -0.714883
3.866667 -2.355798 -0.066844 0.544667 -1.100338 0.064227 -0.631960
3.900000 -2.392584 -0.064664 0.514516 -1.101027 0.065755 -0.561106
3.933333 -2.429367 -0.062443 0.501754 -1.101347 0.067242 -0.499928
3.966667 -2.466173 -0.060162 0.461815 -1.101305 0.068691 -0.448968
4.000000 -2.502958 -0.057843 0.457222 -1.100900 0.070099 -0.409301
4.033333 -2.539736 -0.055467 0.452168 -1.100140 0.071466 -0.379187
4.066667 -2.576475 -0.053055 0.442462 -1.099022 0.072789 -0.354566
4.100000 -2.613165 -0.050606 0.439106 -1.097542 0.074072 -0.333708
4.133333 -2.649802 -0.048106 0.431096 -1.095699 0.075313 -0.316905
4.166667 -2.686370 -0.045557 0.415117 -1.093494 0.076511 -0.305674
4.200000 -2.722861 -0.042975 0.415714 -1.090926 0.077666 -0.295923
4.233333 -2.759268 -0.040361 0.396250 -1.087997 0.078780 -0.285884
4.266667 -2.795562 -0.037704 0.392756 -1.084708 0.079852 -0.275716
4.300000 -2.831753 -0.035017 0.378075 -1.081066 0.080879 -0.263598
4.333333 -2.867832 -0.032300 0.355504 -1.077069 0.081860 -0.247840
4.366667 -2.903751 -0.029547 0.349606 -1.072705 0.082795 -0.228380
4.400000 -2.939497 -0.026759 0.345670 -1.067969 0.083683 -0.206117
4.433333 -2.975056 -0.023939 0.345956 -1.062855 0.084521 -0.186068
4.466667 -3.010467 -0.021094 0.334582 -1.057356 0.085309 -0.167690
4.500000 -3.045721 -0.018225 0.330957 -1.051448 0.086046 -0.154349
4.533333 -3.080810 -0.015334 0.330447 -1.045115 0.086730 -0.148627
4.566667 -3.115651 -0.012420 0.328369 -1.038355 0.087358 -0.151207
4.600000 -3.150227 -0.009486 0.329668 -1.031157 0.087931 -0.165983
4.633333 -3.184612 -0.006532 0.333435 -1.023500 0.088447 -0.187977
4.666667 -3.218703 -0.003563 0.315161 -1.015373 0.088906 -0.217121
4.700000 -3.252482 -0.000580 0.309459 -1.006783 0.089309 -0.251842
4.733333 -3.286047 0.002418 0.310478 -0.997738 0.089654 -0.290766
4.766667 -3.319274 0.005426 0.286190 -0.988223 0.089940 -0.329438
4.800000 -3.352147 0.008442 0.285156 -0.978232 0.090166 -0.362623
4.833333 -3.384652 0.011463 0.274376 -0.967795 0.090332 -0.390245
4.866667 -3.416775 0.014487 0.254842 -0.956935 0.090437 -0.412367
4.900000 -3.448649 0.017521 0.232614 -0.945678 0.090483 -0.425833
4.933333 -3.480113 0.020554 0.198193 -0.934078 0.090473 -0.423618
4.966667 -3.511156 0.023585 0.195173 -0.922205 0.090411 -0.408214
5.000000 -3.541765 0.026610 0.193590 -0.910144 0.090303 -0.379966
5.033333 -3.571931 0.029628 0.174023 -0.897961 0.090154 -0.339193
5.066667 -3.601644 0.032637 0.149178 -0.885723 0.089967 -0.284946
5.100000 -3.630894 0.035635 0.137846 -0.873504 0.089750 -0.218074
5.133333 -3.659671 0.038620 0.123230 -0.861337 0.089503 -0.147367
5.166667 -3.688155 0.041605 0.124386 -0.849241 0.089227 -0.073101
5.200000 -3.716151 0.044573 0.127127 -0.837217 0.088922 0.004883
5.233333 -3.743845 0.047538 0.122193 -0.825248 0.088586 0.084141
5.266667 -3.771234 0.050501 0.139377 -0.813302 0.088216 0.159731
5.300000 -3.798113 0.053439 0.152497 -0.801316 0.087807 0.226045
5.333333 -3.824680 0.056372 0.155353 -0.789246 0.087356 0.284410
5.366667 -3.850932 0.059299 0.162595 -0.777077 0.086863 0.333002
5.400000 -3.876661 0.062196 0.177009 -0.764793 0.086328 0.367687
5.433333 -3.902070 0.065084 0.203932 -0.752392 0.085752 0.385845
5.466667 -3.926948 0.067939 0.212927 -0.739907 0.085140 0.392017
5.500000 -3.951295 0.070760 0.230096 -0.727388 0.084498 0.390311
5.533333 -3.975315 0.073569 0.257177 -0.714869 0.083832 0.380188
5.566667 -3.999007 0.076366 0.264629 -0.702368 0.083144 0.362691
5.600000 -4.022167 0.079127 0.278729 -0.689902 0.082438 0.338224
5.633333 -4.044798 0.081850 0.283781 -0.677491 0.081716 0.312648
5.666667 -4.067097 0.084558 0.298171 -0.665122 0.080979 0.282054
5.700000 -4.089063 0.087249 0.299419 -0.652777 0.080223 0.244915
5.733333 -4.110696 0.089922 0.308455 -0.640463 0.079449 0.201850
5.766667 -4.131995 0.092577 0.301919 -0.628177 0.078656 0.154936
5.800000 -4.152787 0.095197 0.319956 -0.615915 0.077844 0.106671
5.833333 -4.173079 0.097781 0.332050 -0.603677 0.077010 0.054404
5.866667 -4.192880 0.100329 0.352106 -0.591498 0.076157 0.001177
5.900000 -4.212347 0.102855 0.344092 -0.579412 0.075287 -0.049812
5.933333 -4.231483 0.105358 0.327921 -0.567430 0.074400 -0.095230
5.966667 -4.250149 0.107825 0.324012 -0.555587 0.073498 -0.135951
6.000000 -4.268353 0.110255 0.312658 -0.543910 0.072585 -0.168983
6.033333 -4.286228 0.112660 0.293512 -0.532403 0.071659 -0.192427
6.066667 -4.303777 0.115039 0.284377 -0.521025 0.070719 -0.203593
6.100000 -4.320884 0.117381 0.277826 -0.509759 0.069762 -0.203694
6.133333 -4.337668 0.119695 0.270700 -0.498592 0.068787 -0.196226
6.166667 -4.354131 0.121980 0.266488 -0.487492 0.067791 -0.180644
6.200000 -4.370275 0.124234 0.262536 -0.476426 0.066770 -0.161597
6.233333 -4.386006 0.126451 0.257170 -0.465384 0.065724 -0.140300
6.266667 -4.401330 0.128631 0.251706 -0.454389 0.064652 -0.119866
6.300000 -4.416256 0.130772 0.252719 -0.443452 0.063557 -0.100092
6.333333 -4.430791 0.132875 0.257221 -0.432588 0.062436 -0.080094
6.366667 -4.445020 0.134943 0.237210 -0.421827 0.061293 -0.060183
6.400000 -4.458874 0.136972 0.238087 -0.411217 0.060130 -0.039713
6.433333 -4.472360 0.138960 0.242663 -0.400796 0.058948 -0.019831
6.466667 -4.485484 0.140908 0.233182 -0.390582 0.057749 -0.000193
6.500000 -4.498256 0.142816 0.245367 -0.380597 0.056532 0.015288
6.533333 -4.510682 0.144681 0.242496 -0.370852 0.055300 0.026778
6.566667 -4.522826 0.146508 0.237124 -0.361362 0.054051 0.032349
6.600000 -4.534690 0.148295 0.238341 -0.352120 0.052786 0.033128
6.633333 -4.546234 0.150039 0.261409 -0.343122 0.051503 0.028788
6.666667 -4.557465 0.151738 0.261066 -0.334368 0.050204 0.018630
6.700000 -4.568392 0.153392 0.265234 -0.325853 0.048887 0.006329
6.733333 -4.579059 0.155003 0.260145 -0.317569 0.047552 -0.008356
6.766667 -4.589470 0.156571 0.251818 -0.309503 0.046198 -0.023066
6.800000 -4.599600 0.158092 0.249814 -0.301653 0.044826 -0.038463
6.833333 -4.609484 0.159568 0.248023 -0.294013 0.043435 -0.052237
6.866667 -4.619103 0.160996 0.239817 -0.286577 0.042025 -0.063766
6.900000 -4.628487 0.162378 0.243252 -0.279341 0.040595 -0.071522
6.933333 -4.637640 0.163712 0.245012 -0.272301 0.039145 -0.076153
6.966667 -4.646567 0.164998 0.238326 -0.265457 0.037676 -0.081100
7.000000 -4.655262 0.166234 0.237874 -0.258805 0.036187 -0.085701
7.033333 -4.663733 0.167420 0.236150 -0.252347 0.034679 -0.090464
7.066667 -4.671995 0.168555 0.222333 -0.246081 0.033151 -0.094559
7.100000 -4.680048 0.169639 0.235739 -0.240008 0.031603 -0.103915
7.133333 -4.687901 0.170670 0.232867 -0.234130 0.030037 -0.115124
7.166667 -4.695560 0.171649 0.212177 -0.228449 0.028451 -0.122380
7.200000 -4.703033 0.172574 0.203730 -0.222962 0.026845 -0.127539
7.233333 -4.710328 0.173447 0.227719 -0.217666 0.025220 -0.132061
7.266667 -4.717453 0.174265 0.209560 -0.212563 0.023573 -0.134847
7.300000 -4.724414 0.175028 0.196253 -0.207652 0.021906 -0.128735
7.333333 -4.731221 0.175737 0.201454 -0.202927 0.020217 -0.117839
7.366667 -4.737868 0.176388 0.185603 -0.198387 0.018505 -0.106860
7.400000 -4.744364 0.176982 0.181365 -0.194027 0.016770 -0.093737
7.433333 -4.750712 0.177517 0.170627 -0.189852 0.015012 -0.073450
7.466667 -4.756936 0.177993 0.177535 -0.185856 0.013230 -0.051291
7.500000 -4.763026 0.178410 0.191550 -0.182040 0.011424 -0.034389
7.533333 -4.768986 0.178766 0.172997 -0.178405 0.009595 -0.018066
7.566667 -4.774823 0.179060 0.170115 -0.174952 0.007742 -0.003396
7.600000 -4.780567 0.179292 0.184539 -0.171685 0.005865 0.007427
7.633333 -4.786200 0.179462 0.188338 -0.168604 0.003965 0.008661
7.666667 -4.791727 0.179568 0.183654 -0.165717 0.002043 0.003887
7.700000 -4.797154 0.179609 0.187420 -0.163036 0.000100 -0.001708
7.733333 -4.802488 0.179585 0.182042 -0.160576 -0.001863 -0.012999
7.766667 -4.807767 0.179495 0.191931 -0.158350 -0.003844 -0.036942
7.800000 -4.812963 0.179338 0.190929 -0.156370 -0.005839 -0.089191
7.833333 -4.818083 0.179113 0.177750 -0.154647 -0.007848 -0.191153
7.866667 -4.823134 0.178820 0.185783 -0.153184 -0.009865 -0.368386
7.900000 -4.828120 0.178457 0.174535 -0.151981 -0.011890 -0.640328
7.933333 -4.833088 0.178026 0.170466 -0.151021 -0.013921 -1.030991
7.966667 -4.838045 0.177527 0.173485 -0.150299 -0.015955 -1.545121
8.000000 -4.842999 0.176960 0.163357 -0.149797 -0.017990 -2.169106
8.033333 -4.847959 0.176327 0.157893 -0.149503 -0.020023 -2.878471
8.066667 -4.852931 0.175628 0.157061 -0.149403 -0.022048 -3.643875
8.100000 -4.857872 0.174856 0.047127 -0.149485 -0.024062 -4.439412
8.133333 -4.862842 0.174021 -0.177566 -0.149747 -0.026058 -5.214433
8.166667 -4.867792 0.173112 -0.469816 -0.150185 -0.028032 -5.924514
8.200000 -4.872787 0.172147 -0.771455 -0.150811 -0.029973 -6.530057
8.233333 -4.877773 0.171105 -1.007231 -0.151633 -0.031875 -7.000031
8.266667 -4.882755 0.169985 -1.316927 -0.152663 -0.033738 -7.301039
8.300000 -4.887810 0.168820 -1.602156 -0.153918 -0.035564 -7.416888
8.333333 -4.892872 0.167574 -1.877818 -0.155418 -0.037354 -7.355049
8.366667 -4.898028 0.166292 -2.146945 -0.157162 -0.039119 -7.131823
8.400000 -4.903290 0.164977 -2.409582 -0.159129 -0.040885 -6.778454
8.433333 -4.908574 0.163579 -2.648478 -0.161312 -0.042675 -6.318484
8.466667 -4.913882 0.162098 -2.881185 -0.163700 -0.044502 -5.786501
8.500000 -4.919327 0.160601 -3.097004 -0.166279 -0.046380 -5.205408
8.533333 -4.924918 0.159095 3.052329 -0.169033 -0.048327 -4.603287
8.566667 -4.930549 0.157501 2.940672 -0.171969 -0.050350 -4.010678
8.600000 -4.936323 0.155822 2.817795 -0.175115 -0.052438 -3.443448
8.633333 -4.942251 0.154062 2.693509 -0.178479 -0.054586 -2.917621
8.666667 -4.948230 0.152211 2.617762 -0.182058 -0.056792 -2.441134
8.700000 -4.954264 0.150270 2.594159 -0.185843 -0.059051 -2.018158
8.733333 -4.960356 0.148235 2.557688 -0.189836 -0.061349 -1.627263
8.766667 -4.966640 0.146136 2.548207 -0.194031 -0.063680 -1.239233
8.800000 -4.973122 0.143974 2.535855 -0.198408 -0.066048 -0.835461
8.833333 -4.979806 0.141748 2.496071 -0.202941 -0.068461 -0.395288
8.866667 -4.986696 0.139456 2.433080 -0.207605 -0.070925 0.100258
8.900000 -4.993661 0.137066 2.369541 -0.212377 -0.073451 0.670158
8.933333 -5.000839 0.134604 2.340816 -0.217202 -0.076058 1.313932
8.966667 -5.008233 0.132068 2.358962 -0.222013 -0.078761 2.023111
9.000000 -5.015708 0.129428 2.441853 -0.226756 -0.081565 2.787500
9.033333 -5.023268 0.126684 2.559326 -0.231414 -0.084464 3.574253
9.066667 -5.031048 0.123844 2.721833 -0.235987 -0.087448 4.346095
9.100000 -5.039048 0.120899 2.913626 -0.240468 -0.090505 5.057304
9.133333 -5.047269 0.117840 3.086732 -0.244878 -0.093616 5.668326
9.166667 -5.055581 0.114671 -2.932896 -0.249271 -0.096760 6.140559
9.200000 -5.063985 0.111391 -2.671312 -0.253687 -0.099923 6.450219
9.233333 -5.072484 0.107999 -2.400938 -0.258134 -0.103100 6.591978
9.266667 -5.081078 0.104494 -2.108352 -0.262615 -0.106288 6.562391
9.300000 -5.089769 0.100874 -1.837387 -0.267154 -0.109485 6.369091
9.333333 -5.098679 0.097170 -1.600070 -0.271761 -0.112700 6.020917
9.366667 -5.107804 0.093376 -1.412520 -0.276414 -0.115945 5.542866
9.400000 -5.117140 0.089486 -1.206794 -0.281078 -0.119233 4.950353
9.433333 -5.126576 0.085475 -1.036903 -0.285730 -0.122576 4.261063
9.466667 -5.136210 0.081357 -0.894810 -0.290337 -0.125988 3.500310
9.500000 -5.146038 0.077126 -0.790115 -0.294849 -0.129482 2.694317
9.533333 -5.156050 0.072778 -0.690538 -0.299219 -0.133066 1.868926
9.566667 -5.166163 0.068304 -0.647296 -0.303427 -0.136745 1.042126
9.600000 -5.176376 0.063703 -0.634172 -0.307471 -0.140514 0.239283
9.633333 -5.186690 0.058975 -0.649340 -0.311347 -0.144372 -0.512579
9.666667 -5.197157 0.054114 -0.689281 -0.315059 -0.148315 -1.188585
9.700000 -5.207724 0.049123 -0.772332 -0.318624 -0.152337 -1.770584
9.733333 -5.218425 0.043994 -0.860043 -0.322064 -0.156434 -2.243700
9.766667 -5.229254 0.038723 -1.002285 -0.325381 -0.160606 -2.592609
9.800000 -5.240180 0.033318 -1.158556 -0.328577 -0.164858 -2.809212
9.833333 -5.251218 0.027765 -1.289574 -0.331652 -0.169188 -2.897802
9.866667 -5.262359 0.022061 -1.403356 -0.334607 -0.173600 -2.870581
9.900000 -5.273594 0.016220 -1.526628 -0.337438 -0.178093 -2.740822
9.933333 -5.284925 0.010240 -1.633952 -0.340144 -0.182668 -2.521655
9.966667 -5.296336 0.004096 -1.721978 -0.342732 -0.187320 -2.239746
10.000000 -5.307839 -0.002188 -1.780682 -0.345208 -0.192048 -1.922919
10.033333 -5.319410 -0.008647 -1.831202 -0.347579 -0.196852 -1.591030
10.066667 -5.331045 -0.015284 -1.889885 -0.349861 -0.201724 -1.257547
10.100000 -5.342740 -0.022104 -1.910649 -0.352062 -0.206660 -0.939394
10.133333 -5.354522 -0.029068 -1.917189 -0.354194 -0.211653 -0.648822
10.166667 -5.366391 -0.036176 -1.933313 -0.356254 -0.216711 -0.388819
10.200000 -5.378306 -0.043482 -1.932680 -0.358251 -0.221825 -0.160756
10.233333 -5.390306 -0.050934 -1.914467 -0.360186 -0.226998 0.030337
10.266667 -5.402345 -0.058590 -1.907908 -0.362055 -0.232235 0.172543
10.300000 -5.414466 -0.066393 -1.906469 -0.363856 -0.237537 0.260265
10.333333 -5.426624 -0.074407 -1.879164 -0.365596 -0.242894 0.281512
10.366667 -5.438861 -0.082568 -1.865289 -0.367289 -0.248280 0.228366
10.400000 -5.451176 -0.090877 -1.838005 -0.368938 -0.253687 0.097457
10.433333 -5.463522 -0.099403 -1.811420 -0.370561 -0.259084 -0.108011
10.466667 -5.475899 -0.108146 -1.766225 -0.372174 -0.264441 -0.377904
10.500000 -5.488305 -0.117105 -1.760764 -0.373792 -0.269732 -0.696416
10.533333 -5.500784 -0.126213 -1.754284 -0.375418 -0.274946 -1.039143
10.566667 -5.513291 -0.135534 -1.782549 -0.377055 -0.280077 -1.382092
10.600000 -5.525866 -0.145004 -1.861467 -0.378704 -0.285117 -1.705715
10.633333 -5.538509 -0.154621 -1.973976 -0.380358 -0.290079 -1.988508
10.666667 -5.551218 -0.164386 -2.100985 -0.382001 -0.294983 -2.208152
10.700000 -5.563992 -0.174298 -2.228418 -0.383615 -0.299855 -2.352772
10.733333 -5.576828 -0.184357 -2.315888 -0.385189 -0.304713 -2.418959
10.766667 -5.589726 -0.194563 -2.408205 -0.386708 -0.309578 -2.410950
10.800000 -5.602683 -0.204915 -2.498318 -0.388159 -0.314465 -2.332381
10.833333 -5.615673 -0.215453 -2.578441 -0.389539 -0.319378 -2.198132
10.866667 -5.628698 -0.226172 -2.639466 -0.390850 -0.324307 -2.028742
10.900000 -5.641757 -0.237071 -2.684019 -0.392103 -0.329234 -1.842004
10.933333 -5.654851 -0.248146 -2.763716 -0.393304 -0.334140 -1.647721
10.966667 -5.667980 -0.259394 -2.809500 -0.394468 -0.339003 -1.453491
11.000000 -5.681142 -0.270811 -2.853824 -0.395604 -0.343801 -1.268484
11.033333 -5.694338 -0.282395 -2.895982 -0.396720 -0.348519 -1.095279
11.066667 -5.707579 -0.294120 -2.923236 -0.397822 -0.353149 -0.933991
11.100000 -5.720864 -0.305986 -2.957664 -0.398907 -0.357693 -0.781779
11.133333 -5.734191 -0.317991 -2.978207 -0.399972 -0.362154 -0.643179
11.166667 -5.747548 -0.330152 -2.984556 -0.401012 -0.366542 -0.519196
11.200000 -5.760943 -0.342450 -2.991348 -0.402020 -0.370866 -0.406335
11.233333 -5.774374 -0.354885 -2.993308 -0.402988 -0.375139 -0.306300
11.266667 -5.787834 -0.367468 -3.002681 -0.403912 -0.379368 -0.219024
11.300000 -5.801326 -0.380186 -3.007583 -0.404787 -0.383553 -0.146589
11.333333 -5.814845 -0.393049 -3.022028 -0.405613 -0.387697 -0.085405
11.366667 -5.828389 -0.406053 -3.014313 -0.406390 -0.391798 -0.033816
11.400000 -5.841959 -0.419196 -3.017161 -0.407117 -0.395854 0.005740
11.433333 -5.855552 -0.432477 -3.017599 -0.407796 -0.399859 0.037409
11.466667 -5.869167 -0.445887 -3.012116 -0.408427 -0.403813 0.064707
11.500000 -5.882801 -0.459424 -3.006676 -0.409013 -0.407713 0.090163
11.533333 -5.896457 -0.473093 -2.981332 -0.409553 -0.411559 0.109734
11.566667 -5.910127 -0.486886 -2.977766 -0.410047 -0.415351 0.124227
11.600000 -5.923809 -0.500803 -2.991770 -0.410495 -0.419089 0.136606
11.633333 -5.937509 -0.514845 -2.996246 -0.410900 -0.422776 0.145258
11.666667 -5.951225 -0.529010 -2.985895 -0.411260 -0.426411 0.147094
11.700000 -5.964956 -0.543296 -2.975611 -0.411573 -0.429996 0.141615
11.733333 -5.978690 -0.557701 -2.973316 -0.411836 -0.433531 0.136087
11.766667 -5.992426 -0.572221 -2.962837 -0.412049 -0.437016 0.128339
11.800000 -6.006172 -0.586858 -2.948816 -0.412212 -0.440447 0.115742
11.833333 -6.019929 -0.601609 -2.946169 -0.412320 -0.443826 0.099267
11.866667 -6.033694 -0.616472 -2.945782 -0.412372 -0.447149 0.083225
11.900000 -6.047450 -0.631446 -2.939169 -0.412372 -0.450416 0.068864
11.933333 -6.061212 -0.646527 -2.939468 -0.412320 -0.453628 0.053097
11.966667 -6.074979 -0.661713 -2.946985 -0.412213 -0.456783 0.040387
12.000000 -6.088728 -0.677005 -2.952007 -0.412047 -0.459882 0.033337
12.033333 -6.102458 -0.692401 -2.953707 -0.411821 -0.462925 0.032465
12.066667 -6.116187 -0.707895 -2.938935 -0.411530 -0.465915 0.033754
12.100000 -6.129912 -0.723487 -2.950981 -0.411169 -0.468851 0.037913
12.133333 -6.143632 -0.739174 -2.946248 -0.410728 -0.471735 0.043428
12.166667 -6.157346 -0.754956 -2.948946 -0.410201 -0.474569 0.047188
12.200000 -6.171026 -0.770834 -2.936112 -0.409579 -0.477353 0.047277
12.233333 -6.184694 -0.786802 -2.935698 -0.408853 -0.480088 0.043058
12.266667 -6.198347 -0.802860 -2.923127 -0.408012 -0.482775 0.036396
12.300000 -6.211959 -0.819009 -2.925191 -0.407049 -0.485414 0.025541
12.333333 -6.225549 -0.835243 -2.931237 -0.405962 -0.488005 0.013452
12.366667 -6.239092 -0.851564 -2.934402 -0.404753 -0.490546 0.000987
12.400000 -6.252582 -0.867970 -2.927555 -0.403424 -0.493037 -0.010213
12.433333 -6.266044 -0.884457 -2.931486 -0.401984 -0.495474 -0.019280
12.466667 -6.279449 -0.901025 -2.931690 -0.400442 -0.497858 -0.026352
12.500000 -6.292792 -0.917672 -2.938265 -0.398808 -0.500185 -0.031116
12.533333 -6.306072 -0.934397 -2.941203 -0.397090 -0.502454 -0.036702
12.566667 -6.319285 -0.951198 -2.945994 -0.395296 -0.504665 -0.042531
12.600000 -6.332428 -0.968073 -2.939359 -0.393429 -0.506816 -0.048288
12.633333 -6.345522 -0.985017 -2.939987 -0.391496 -0.508906 -0.055493
12.666667 -6.358564 -1.002028 -2.933266 -0.389493 -0.510937 -0.064093
12.700000 -6.371527 -1.019107 -2.939342 -0.387416 -0.512908 -0.074303
12.733333 -6.384430 -1.036248 -2.943340 -0.385254 -0.514821 -0.083748
12.766667 -6.397247 -1.053455 -2.945781 -0.382998 -0.516678 -0.093352
12.800000 -6.409997 -1.070721 -2.951591 -0.380634 -0.518479 -0.102474
12.833333 -6.422677 -1.088045 -2.959663 -0.378153 -0.520227 -0.108965
12.866667 -6.435283 -1.105424 -2.969672 -0.375547 -0.521922 -0.111592
12.900000 -6.447789 -1.122861 -2.969482 -0.372813 -0.523565 -0.109030
12.933333 -6.460215 -1.140350 -2.964969 -0.369948 -0.525157 -0.102183
12.966667 -6.472534 -1.157893 -2.975655 -0.366955 -0.526695 -0.090578
13.000000 -6.484744 -1.175487 -2.973574 -0.363837 -0.528182 -0.076157
13.033333 -6.496841 -1.193131 -2.986676 -0.360599 -0.529616 -0.059517
13.066667 -6.508822 -1.210822 -2.989061 -0.357249 -0.530998 -0.042056
13.100000 -6.520683 -1.228558 -2.989713 -0.353794 -0.532327 -0.024885
13.133333 -6.532439 -1.246337 -2.981259 -0.350244 -0.533604 -0.008151
13.166667 -6.544085 -1.264156 -2.985125 -0.346604 -0.534829 0.009630
13.200000 -6.555601 -1.282015 -2.984023 -0.342877 -0.536002 0.027659
13.233333 -6.566984 -1.299912 -2.980487 -0.339061 -0.537123 0.043478
13.266667 -6.578231 -1.317844 -2.976513 -0.335155 -0.538193 0.056751
13.300000 -6.589353 -1.335812 -2.982941 -0.331151 -0.539209 0.067744
13.333333 -6.600347 -1.353813 -2.973507 -0.327041 -0.540172 0.076064
13.366667 -6.611206 -1.371848 -2.975296 -0.322821 -0.541080 0.077628
13.400000 -6.621928 -1.389912 -2.967616 -0.318486 -0.541933 0.073702
13.433333 -6.632506 -1.408005 -2.967864 -0.314031 -0.542728 0.066737
13.466667 -6.642937 -1.426126 -2.963856 -0.309453 -0.543464 0.056365
13.500000 -6.653207 -1.444268 -2.943219 -0.304747 -0.544139 0.040073
13.533333 -6.663315 -1.462430 -2.951234 -0.299915 -0.544754 0.021691
13.566667 -6.673256 -1.480610 -2.958796 -0.294956 -0.545307 0.003307
13.600000 -6.683031 -1.498810 -2.949811 -0.289872 -0.545800 -0.015257
13.633333 -6.692633 -1.517024 -2.955610 -0.284664 -0.546233 -0.034767
13.666667 -6.702060 -1.535255 -2.959225 -0.279337 -0.546609 -0.052139
13.700000 -6.711307 -1.553495 -2.965279 -0.273891 -0.546927 -0.063644
13.733333 -6.720371 -1.571744 -2.967979 -0.268329 -0.547189 -0.075286
13.766667 -6.729249 -1.589998 -2.972319 -0.262652 -0.547396 -0.085543
13.800000 -6.737938 -1.608256 -2.972790 -0.256859 -0.547548 -0.093432
13.833333 -6.746430 -1.626522 -2.981454 -0.250950 -0.547645 -0.098135
13.866667 -6.754719 -1.644793 -2.965143 -0.244927 -0.547687 -0.105431
13.900000 -6.762809 -1.663063 -2.980693 -0.238793 -0.547671 -0.113703
13.933333 -6.770698 -1.681328 -2.985492 -0.232551 -0.547599 -0.118066
13.966667 -6.778371 -1.699593 -2.997560 -0.226201 -0.547468 -0.117753
14.000000 -6.785825 -1.717855 -2.978144 -0.219747 -0.547278 -0.114515
14.033333 -6.793055 -1.736111 -2.998672 -0.213192 -0.547025 -0.105521
14.066667 -6.800072 -1.754356 -3.011727 -0.206539 -0.546709 -0.083207
14.100000 -6.806872 -1.772586 -3.009500 -0.199786 -0.546330 -0.049824
14.133333 -6.813440 -1.790805 -3.015389 -0.192936 -0.545887 -0.006385
14.166667 -6.819771 -1.809011 -3.022654 -0.185990 -0.545380 0.046493
14.200000 -6.825878 -1.827196 -3.025164 -0.178946 -0.544810 0.113086
14.233333 -6.831758 -1.845359 -3.020956 -0.171801 -0.544178 0.187426
14.266667 -6.837391 -1.863501 -3.012172 -0.164554 -0.543486 0.262085
14.300000 -6.842774 -1.881620 -2.993909 -0.157205 -0.542734 0.332340
14.333333 -6.847902 -1.899712 -2.992562 -0.149757 -0.541923 0.395173
14.366667 -6.852794 -1.917775 -2.970052 -0.142213 -0.541054 0.442374
14.400000 -6.857446 -1.935806 -2.953013 -0.134578 -0.540128 0.465956
14.433333 -6.861833 -1.953805 -2.923801 -0.126862 -0.539144 0.463742
14.466667 -6.865951 -1.971773 -2.904330 -0.119072 -0.538102 0.437536
14.500000 -6.869796 -1.989706 -2.864900 -0.111221 -0.537001 0.389103
14.533333 -6.873364 -2.007604 -2.846820 -0.103314 -0.535842 0.318436
14.566667 -6.876682 -2.025460 -2.829558 -0.095359 -0.534622 0.234444
14.600000 -6.879748 -2.043273 -2.830901 -0.087359 -0.533342 0.144336
14.633333 -6.882527 -2.061043 -2.835082 -0.079315 -0.532001 0.057738
14.666667 -6.885051 -2.078767 -2.832837 -0.071225 -0.530597 -0.021757
14.700000 -6.887282 -2.096445 -2.845778 -0.063082 -0.529132 -0.086333
14.733333 -6.889254 -2.114073 -2.865335 -0.054882 -0.527606 -0.129786
14.766667 -6.890965 -2.131648 -2.879174 -0.046622 -0.526018 -0.150177
14.800000 -6.892414 -2.149169 -2.888411 -0.038304 -0.524371 -0.148611
14.833333 -6.893598 -2.166633 -2.899667 -0.029926 -0.522664 -0.129672
14.866667 -6.894481 -2.184040 -2.905242 -0.021489 -0.520898 -0.095197
14.900000 -6.895060 -2.201386 -2.898663 -0.012993 -0.519074 -0.052283
14.933333 -6.895334 -2.218670 -2.907271 -0.004441 -0.517190 -0.005626
14.966667 -6.895338 -2.235891 -2.895113 0.004176 -0.515245 0.036825
15.000000 -6.895072 -2.253047 -2.897039 0.012857 -0.513240 0.074659
15.033333 -6.894495 -2.270134 -2.895108 0.021605 -0.511171 0.105404
15.066667 -6.893646 -2.287153 -2.888421 0.030421 -0.509040 0.129224
15.100000 -6.892523 -2.304102 -2.864915 0.039312 -0.506843 0.147371
15.133333 -6.891085 -2.320975 -2.865347 0.048283 -0.504580 0.158562
15.166667 -6.889372 -2.337775 -2.855873 0.057331 -0.502252 0.166964
15.200000 -6.887340 -2.354495 -2.863129 0.066458 -0.499857 0.170445
15.233333 -6.884987 -2.371131 -2.861295 0.075665 -0.497396 0.170866
15.266667 -6.882312 -2.387682 -2.850112 0.084945 -0.494870 0.165582
15.300000 -6.879315 -2.404146 -2.847956 0.094282 -0.492279 0.154384
15.333333 -6.876041 -2.420529 -2.829945 0.103666 -0.489626 0.138545
15.366667 -6.872443 -2.436821 -2.832560 0.113089 -0.486908 0.117209
15.400000 -6.868518 -2.453019 -2.823103 0.122538 -0.484130 0.090709
15.433333 -6.864268 -2.469121 -2.808913 0.131995 -0.481292 0.058707
15.466667 -6.859691 -2.485126 -2.811412 0.141447 -0.478400 0.024219
15.500000 -6.854838 -2.501043 -2.809295 0.150886 -0.475455 -0.010300
15.533333 -6.849658 -2.516857 -2.811062 0.160299 -0.472461 -0.043138
15.566667 -6.844155 -2.532568 -2.816699 0.169670 -0.469422 -0.071601
15.600000 -6.838328 -2.548173 -2.830058 0.178989 -0.466342 -0.093085
15.633333 -6.832181 -2.563671 -2.844282 0.188250 -0.463222 -0.103976
15.666667 -6.825715 -2.579060 -2.834924 0.197446 -0.460067 -0.103337
15.700000 -6.818932 -2.594339 -2.852532 0.206562 -0.456883 -0.092043
15.733333 -6.811877 -2.609523 -2.848025 0.215590 -0.453673 -0.071901
15.766667 -6.804552 -2.624610 -2.848299 0.224526 -0.450441 -0.044882
15.800000 -6.796917 -2.639583 -2.866455 0.233366 -0.447189 -0.012093
15.833333 -6.788973 -2.654439 -2.858328 0.242111 -0.443917 0.021177
15.866667 -6.780722 -2.669179 -2.854768 0.250767 -0.440624 0.051448
15.900000 -6.772168 -2.683800 -2.850730 0.259339 -0.437309 0.075866
15.933333 -6.763351 -2.698321 -2.848211 0.267828 -0.433973 0.095966
15.966667 -6.754272 -2.712741 -2.840540 0.276234 -0.430617 0.110494
16.000000 -6.744933 -2.727059 -2.826696 0.284559 -0.427242 0.115333
16.033333 -6.735302 -2.741254 -2.826417 0.292801 -0.423850 0.114020
16.066667 -6.725381 -2.755325 -2.824291 0.300954 -0.420446 0.110709
16.100000 -6.715205 -2.769293 -2.813854 0.309024 -0.417027 0.107124
16.133333 -6.704745 -2.783134 -2.808599 0.317016 -0.413590 0.100436
16.166667 -6.694002 -2.796850 -2.805684 0.324932 -0.410135 0.092109
16.200000 -6.683012 -2.810460 -2.819263 0.332769 -0.406662 0.089355
16.233333 -6.671777 -2.823965 -2.819707 0.340531 -0.403168 0.090481
16.266667 -6.660299 -2.837365 -2.808852 0.348226 -0.399646 0.092495
16.300000 -6.648550 -2.850636 -2.804473 0.355851 -0.396097 0.096119
16.333333 -6.636534 -2.863776 -2.809114 0.363400 -0.392524 0.105577
16.366667 -6.624283 -2.876811 -2.798683 0.370875 -0.388928 0.119779
16.400000 -6.611799 -2.889739 -2.785498 0.378276 -0.385308 0.132438
16.433333 -6.599059 -2.902536 -2.781204 0.385597 -0.381671 0.143915
16.466667 -6.586065 -2.915201 -2.790850 0.392826 -0.378027 0.154651
16.500000 -6.572821 -2.927736 -2.787655 0.399956 -0.374382 0.162844
16.533333 -6.559332 -2.940138 -2.775093 0.406984 -0.370737 0.164845
16.566667 -6.545601 -2.952409 -2.770307 0.413901 -0.367099 0.160844
16.600000 -6.531654 -2.964574 -2.756132 0.420700 -0.363474 0.151471
16.633333 -6.517496 -2.976632 -2.750866 0.427377 -0.359862 0.136590
16.666667 -6.503129 -2.988584 -2.742959 0.433932 -0.356261 0.115778
16.700000 -6.488536 -3.000406 -2.741775 0.440368 -0.352663 0.092085
16.733333 -6.473722 -3.012097 -2.733250 0.446688 -0.349064 0.067342
16.766667 -6.458691 -3.023660 -2.724329 0.452894 -0.345458 0.041803
16.800000 -6.443464 -3.035117 -2.733093 0.458990 -0.341843 0.020001
16.833333 -6.428046 -3.046470 -2.743603 0.464977 -0.338221 0.001940
16.866667 -6.412427 -3.057695 -2.734838 0.470851 -0.334600 -0.012825
16.900000 -6.396611 -3.068793 -2.746553 0.476609 -0.330993 -0.025993
16.933333 -6.380603 -3.079763 -2.760263 0.482243 -0.327410 -0.037121
16.966667 -6.364407 -3.090607 -2.752612 0.487752 -0.323861 -0.044892
17.000000 -6.348026 -3.101325 -2.751347 0.493131 -0.320354 -0.052034
17.033333 -6.331463 -3.111918 -2.741835 0.498377 -0.316898 -0.059922
17.066667 -6.314723 -3.122388 -2.731504 0.503488 -0.313493 -0.066056
17.100000 -6.297820 -3.132757 -2.743275 0.508463 -0.310141 -0.070461
17.133333 -6.280758 -3.143029 -2.748761 0.513302 -0.306840 -0.075961
17.166667 -6.263540 -3.153203 -2.759081 0.518004 -0.303589 -0.082026
17.200000 -6.246172 -3.163281 -2.769819 0.522569 -0.300384 -0.087144
17.233333 -6.228649 -3.173240 -2.771553 0.526999 -0.297215 -0.087162
17.266667 -6.210979 -3.183082 -2.772555 0.531297 -0.294077 -0.082815
17.300000 -6.193169 -3.192831 -2.773968 0.535461 -0.290967 -0.074173
17.333333 -6.175220 -3.202466 -2.770996 0.539494 -0.287884 -0.058727
17.366667 -6.157140 -3.212009 -2.780012 0.543395 -0.284829 -0.038001
17.400000 -6.138932 -3.221442 -2.772025 0.547163 -0.281807 -0.016245
17.433333 -6.120599 -3.230765 -2.772468 0.550797 -0.278827 0.003677
17.466667 -6.102147 -3.240001 -2.788226 0.554298 -0.275895 0.021816
17.500000 -6.083580 -3.249150 -2.789629 0.557665 -0.273016 0.038387
17.533333 -6.064905 -3.258194 -2.782087 0.560899 -0.270192 0.052587
17.566667 -6.046127 -3.267134 -2.771232 0.564001 -0.267427 0.062041
17.600000 -6.027250 -3.275974 -2.766229 0.566973 -0.264722 0.071956
17.633333 -6.008274 -3.284732 -2.755814 0.569815 -0.262075 0.079623
17.666667 -5.989205 -3.293410 -2.755989 0.572530 -0.259488 0.083660
17.700000 -5.970046 -3.302010 -2.756392 0.575118 -0.256962 0.083442
17.733333 -5.950801 -3.310534 -2.764557 0.577580 -0.254499 0.079687
17.766667 -5.931479 -3.318965 -2.755653 0.579916 -0.252094 0.076329
17.800000 -5.912084 -3.327305 -2.756452 0.582126 -0.249745 0.069713
17.833333 -5.892617 -3.335574 -2.742942 0.584210 -0.247450 0.064070
17.866667 -5.873081 -3.343771 -2.741062 0.586168 -0.245208 0.058144
17.900000 -5.853480 -3.351900 -2.750397 0.587999 -0.243017 0.051518
17.933333 -5.833820 -3.359961 -2.733484 0.589705 -0.240879 0.042083
17.966667 -5.814108 -3.367937 -2.749485 0.591285 -0.238795 0.028041
18.000000 -5.794344 -3.375850 -2.742331 0.592739 -0.236766 0.009893
18.033333 -5.774533 -3.383699 -2.732232 0.594067 -0.234791 -0.013641
18.066667 -5.754680 -3.391487 -2.739951 0.595268 -0.232865 -0.039562
18.100000 -5.734791 -3.399196 -2.732850 0.596341 -0.230986 -0.068648
18.133333 -5.714868 -3.406848 -2.737514 0.597286 -0.229152 -0.096813
18.166667 -5.694914 -3.414443 -2.735426 0.598100 -0.227353 -0.124553
18.200000 -5.674935 -3.421983 -2.748914 0.598781 -0.225588 -0.149422
18.233333 -5.654934 -3.429471 -2.757168 0.599330 -0.223856 -0.169726
18.266667 -5.634916 -3.436908 -2.759010 0.599743 -0.222157 -0.185889
18.300000 -5.614884 -3.444295 -2.779986 0.600020 -0.220487 -0.193478
18.333333 -5.594847 -3.451614 -2.786477 0.600159 -0.218847 -0.193751
18.366667 -5.574810 -3.458864 -2.788170 0.600158 -0.217243 -0.183534
18.400000 -5.554773 -3.466070 -2.797948 0.600016 -0.215677 -0.163287
18.433333 -5.534746 -3.473214 -2.808542 0.599733 -0.214154 -0.135269
18.466667 -5.514726 -3.480317 -2.802103 0.599309 -0.212681 -0.100111
18.500000 -5.494726 -3.487363 -2.814149 0.598746 -0.211268 -0.059878
18.533333 -5.474742 -3.494372 -2.821683 0.598045 -0.209921 -0.017229
18.566667 -5.454788 -3.501331 -2.821776 0.597207 -0.208643 0.024803
18.600000 -5.434868 -3.508243 -2.817455 0.596235 -0.207440 0.063390
18.633333 -5.414977 -3.515124 -2.821725 0.595130 -0.206313 0.099248
18.666667 -5.395130 -3.521964 -2.802323 0.593896 -0.205264 0.131078
18.700000 -5.375331 -3.528766 -2.789245 0.592533 -0.204292 0.155439
18.733333 -5.355574 -3.535543 -2.778987 0.591042 -0.203397 0.171758
18.766667 -5.335875 -3.542288 -2.788553 0.589425 -0.202580 0.181873
18.800000 -5.316225 -3.549010 -2.775329 0.587677 -0.201839 0.186746
18.833333 -5.296626 -3.555712 -2.761038 0.585797 -0.201173 0.182709
18.866667 -5.277103 -3.562392 -2.759782 0.583777 -0.200581 0.173216
18.900000 -5.257660 -3.569052 -2.752615 0.581615 -0.200063 0.157414
18.933333 -5.238281 -3.575696 -2.748103 0.579309 -0.199618 0.136959
18.966667 -5.218968 -3.582328 -2.749875 0.576861 -0.199245 0.107063
19.000000 -5.199726 -3.588948 -2.738684 0.574273 -0.198943 0.065002
19.033333 -5.180585 -3.595558 -2.730896 0.571551 -0.198715 0.015731
19.066667 -5.161549 -3.602161 -2.735849 0.568705 -0.198560 -0.043516
19.100000 -5.142621 -3.608760 -2.723595 0.565747 -0.198478 -0.108380
19.133333 -5.123804 -3.615357 -2.718505 0.562686 -0.198468 -0.176494
19.166667 -5.105076 -3.621953 -2.744239 0.559528 -0.198533 -0.241713
19.200000 -5.086467 -3.628555 -2.724751 0.556286 -0.198675 -0.295211
19.233333 -5.067980 -3.635170 -2.764735 0.552965 -0.198893 -0.333673
19.266667 -5.049591 -3.641788 -2.779571 0.549567 -0.199192 -0.355990
19.300000 -5.031303 -3.648409 -2.802404 0.546091 -0.199575 -0.358617
19.333333 -5.013147 -3.655057 -2.840370 0.542533 -0.200045 -0.340228
19.366667 -4.995098 -3.661712 -2.855676 0.538893 -0.200599 -0.304254
19.400000 -4.977160 -3.668375 -2.849134 0.535164 -0.201240 -0.257216
19.433333 -4.959364 -3.675078 -2.873583 0.531342 -0.201965 -0.205185
19.466667 -4.941685 -3.681792 -2.863577 0.527428 -0.202771 -0.150165
19.500000 -4.924155 -3.688554 -2.879523 0.523427 -0.203644 -0.093762
19.533333 -4.906747 -3.695331 -2.844290 0.519344 -0.204579 -0.045831
19.566667 -4.889496 -3.702166 -2.850661 0.515178 -0.205574 -0.002558
19.600000 -4.872373 -3.709018 -2.847426 0.510935 -0.206622 0.040362
19.633333 -4.855413 -3.715938 -2.853992 0.506619 -0.207718 0.084113
19.666667 -4.838587 -3.722877 -2.846849 0.502230 -0.208864 0.132788
19.700000 -4.821896 -3.729836 -2.862691 0.497762 -0.210069 0.180771
19.733333 -4.805374 -3.736869 -2.853765 0.493218 -0.211328 0.238649
19.766667 -4.788992 -3.743924 -2.860746 0.488596 -0.212642 0.301592
19.800000 -4.772754 -3.751002 -2.850124 0.483895 -0.214011 0.362358
19.833333 -4.756661 -3.758103 -2.816114 0.479110 -0.215440 0.414921
19.866667 -4.740743 -3.765281 -2.813835 0.474242 -0.216922 0.454009
19.900000 -4.725002 -3.772534 -2.785314 0.469296 -0.218449 0.477791
19.933333 -4.709441 -3.779863 -2.741382 0.464269 -0.220021 0.478908
19.966667 -4.694034 -3.787218 -2.732414 0.459165 -0.221628 0.457852
20.000000 -4.678811 -3.794654 -2.693007 0.453991 -0.223257 0.415938
20.033333 -4.663747 -3.802117 -2.692583 0.448753 -0.224894 0.365467
20.066667 -4.648843 -3.809608 -2.667638 0.443447 -0.226541 0.306994
20.100000 -4.634136 -3.817185 -2.662256 0.438075 -0.228195 0.247614
20.133333 -4.619628 -3.824850 -2.659541 0.432634 -0.229854 0.192038
20.166667 -4.605286 -3.832544 -2.684217 0.427123 -0.231520 0.145356
20.200000 -4.591111 -3.840267 -2.681309 0.421534 -0.233205 0.112977
20.233333 -4.577147 -3.848082 -2.692187 0.415867 -0.234907 0.087557
20.266667 -4.563354 -3.855926 -2.671550 0.410124 -0.236624 0.071803
20.300000 -4.549731 -3.863799 -2.666860 0.404310 -0.238350 0.064016
20.333333 -4.536331 -3.871765 -2.668193 0.398428 -0.240082 0.060986
20.366667 -4.523156 -3.879824 -2.653034 0.392482 -0.241815 0.054129
20.400000 -4.510155 -3.887912 -2.652455 0.386479 -0.243541 0.040964
20.433333 -4.497387 -3.896091 -2.657009 0.380422 -0.245254 0.021439
20.466667 -4.484796 -3.904299 -2.660343 0.374312 -0.246956 -0.003766
20.500000 -4.472382 -3.912533 -2.644873 0.368139 -0.248651 -0.037102
20.533333 -4.460208 -3.920859 -2.650627 0.361890 -0.250349 -0.073197
20.566667 -4.448276 -3.929273 -2.661485 0.355559 -0.252056 -0.104754
20.600000 -4.436523 -3.937713 -2.657715 0.349148 -0.253771 -0.131312
20.633333 -4.424950 -3.946178 -2.653884 0.342651 -0.255502 -0.150923
20.666667 -4.413559 -3.954667 -2.682549 0.336071 -0.257249 -0.162001
20.700000 -4.402416 -3.963239 -2.685824 0.329420 -0.259001 -0.161723
20.733333 -4.391522 -3.971891 -2.691589 0.322722 -0.260741 -0.156478
20.766667 -4.380874 -3.980622 -2.711486 0.315989 -0.262459 -0.150812
20.800000 -4.370473 -3.989427 -2.716017 0.309228 -0.264151 -0.147015
20.833333 -4.360318 -3.998305 -2.721732 0.302463 -0.265797 -0.146574
20.866667 -4.350407 -4.007251 -2.711644 0.295723 -0.267372 -0.157994
20.900000 -4.340678 -4.016214 -2.711960 0.289035 -0.268858 -0.181827
20.933333 -4.331129 -4.025192 -2.706677 0.282407 -0.270247 -0.217186
20.966667 -4.321820 -4.034229 -2.710175 0.275855 -0.271527 -0.266241
21.000000 -4.312749 -4.043324 -2.705338 0.269392 -0.272687 -0.328100
21.033333 -4.303915 -4.052472 -2.716244 0.263023 -0.273726 -0.402306
21.066667 -4.295259 -4.061628 -2.739666 0.256734 -0.274657 -0.481927
21.100000 -4.286837 -4.070832 -2.774582 0.250514 -0.275487 -0.566429
21.133333 -4.278647 -4.080081 -2.797244 0.244368 -0.276212 -0.649190
21.166667 -4.270633 -4.089332 -2.820118 0.238297 -0.276833 -0.718451
21.200000 -4.262794 -4.098583 -2.843871 0.232296 -0.277352 -0.767969
21.233333 -4.255128 -4.107834 -2.844899 0.226355 -0.277775 -0.793497
21.266667 -4.247678 -4.117110 -2.880121 0.220477 -0.278100 -0.789384
21.300000 -4.240440 -4.126406 -2.950245 0.214660 -0.278328 -0.749014
21.333333 -4.233410 -4.135718 -2.972488 0.208895 -0.278466 -0.672111
21.366667 -4.226549 -4.145021 -3.004880 0.203181 -0.278517 -0.562197
21.400000 -4.219894 -4.154332 -3.046310 0.197527 -0.278478 -0.420894
21.433333 -4.213404 -4.163628 -3.068611 0.191948 -0.278342 -0.248871
21.466667 -4.207112 -4.172925 -3.075165 0.186452 -0.278108 -0.054574
21.500000 -4.201016 -4.182217 -3.075162 0.181054 -0.277771 0.150381
21.533333 -4.195109 -4.191499 -3.060030 0.175766 -0.277328 0.356699
21.566667 -4.189362 -4.200759 -3.035900 0.170597 -0.276777 0.556043
21.600000 -4.183795 -4.210000 -3.005494 0.165549 -0.276120 0.738150
21.633333 -4.178403 -4.219220 -2.970285 0.160629 -0.275354 0.895091
21.666667 -4.173165 -4.228410 -2.916480 0.155838 -0.274481 1.021919
21.700000 -4.168078 -4.237566 -2.878773 0.151173 -0.273502 1.118906
21.733333 -4.163140 -4.246688 -2.834818 0.146629 -0.272418 1.186697
21.766667 -4.158349 -4.255772 -2.793325 0.142201 -0.271233 1.227558
21.800000 -4.153703 -4.264817 -2.751977 0.137883 -0.269949 1.246100
21.833333 -4.149201 -4.273818 -2.693318 0.133663 -0.268571 1.244180
21.866667 -4.144838 -4.282771 -2.653740 0.129532 -0.267104 1.230194
21.900000 -4.140609 -4.291670 -2.612331 0.125483 -0.265550 1.204643
21.933333 -4.136508 -4.300511 -2.573190 0.121515 -0.263911 1.172214
21.966667 -4.132531 -4.309289 -2.530715 0.117624 -0.262188 1.133452
22.000000 -4.128686 -4.318013 -2.506076 0.113806 -0.260383 1.092797
22.033333 -4.124972 -4.326680 -2.453138 0.110059 -0.258499 1.054204
22.066667 -4.121386 -4.335287 -2.428606 0.106382 -0.256537 1.016590
22.100000 -4.117926 -4.343833 -2.395449 0.102776 -0.254493 0.984795
22.133333 -4.114569 -4.352293 -2.366681 0.099242 -0.252366 0.958453
22.166667 -4.111333 -4.360686 -2.335024 0.095778 -0.250153 0.942563
22.200000 -4.108217 -4.369011 -2.300901 0.092390 -0.247848 0.933005
22.233333 -4.105219 -4.377264 -2.281683 0.089078 -0.245446 0.928556
22.266667 -4.102310 -4.385413 -2.249602 0.085844 -0.242946 0.928823
22.300000 -4.099514 -4.393485 -2.234520 0.082683 -0.240353 0.932590
22.333333 -4.096829 -4.401480 -2.190503 0.079593 -0.237672 0.936340
22.366667 -4.094254 -4.409394 -2.151384 0.076574 -0.234903 0.933761
22.400000 -4.091785 -4.417225 -2.121581 0.073628 -0.232045 0.923857
22.433333 -4.089394 -4.424928 -2.089964 0.070758 -0.229094 0.906296
22.466667 -4.087078 -4.432499 -2.060271 0.067972 -0.226044 0.878502
22.500000 -4.084862 -4.439980 -2.015096 0.065282 -0.222879 0.835585
22.533333 -4.082745 -4.447370 -1.979062 0.062697 -0.219588 0.780573
22.566667 -4.080725 -4.454666 -1.975157 0.060224 -0.216166 0.718136
22.600000 -4.078799 -4.461867 -1.931805 0.057864 -0.212614 0.648789
22.633333 -4.076965 -4.468970 -1.912192 0.055621 -0.208932 0.573324
22.666667 -4.075192 -4.475927 -1.901483 0.053492 -0.205123 0.493455
22.700000 -4.073476 -4.482737 -1.883669 0.051470 -0.201203 0.416332
22.733333 -4.071816 -4.489398 -1.881371 0.049544 -0.197189 0.344318
22.766667 -4.070210 -4.495910 -1.870560 0.047704 -0.193097 0.274850
22.800000 -4.068655 -4.502272 -1.854492 0.045938 -0.188949 0.211992
22.833333 -4.067149 -4.508483 -1.857399 0.044231 -0.184768 0.158118
22.866667 -4.065689 -4.514544 -1.852573 0.042569 -0.180575 0.115223
22.900000 -4.064307 -4.520492 -1.848750 0.040951 -0.176380 0.080629
22.933333 -4.062968 -4.526289 -1.856152 0.039375 -0.172187 0.052316
22.966667 -4.061702 -4.531972 -1.853321 0.037840 -0.167997 0.031854
23.000000 -4.060475 -4.537502 -1.860574 0.036353 -0.163804 0.020173
23.033333 -4.059319 -4.542915 -1.857648 0.034924 -0.159596 0.012809
23.066667 -4.058198 -4.548176 -1.856101 0.033559 -0.155364 0.007485
23.100000 -4.057109 -4.553284 -1.854916 0.032253 -0.151109 0.005028
23.133333 -4.056087 -4.558270 -1.864070 0.031003 -0.146831 0.005554
23.166667 -4.055094 -4.563104 -1.851252 0.029809 -0.142530 0.006979
