t x y theta dxdt dydt dthetadt
0.000000 0.000000 0.000000 2.451845 -0.151123 0.025444 0.004595
0.033333 -0.005090 0.000855 2.434406 -0.154923 0.025794 0.006587
0.066667 -0.010310 0.001722 2.443711 -0.158767 0.026138 0.009931
0.100000 -0.015656 0.002601 2.445922 -0.162653 0.026475 0.009629
0.133333 -0.021131 0.003490 2.448297 -0.166580 0.026807 0.010063
0.166667 -0.026734 0.004390 2.448093 -0.170546 0.027131 0.010543
0.200000 -0.032475 0.005302 2.443173 -0.174553 0.027450 0.010888
0.233333 -0.038354 0.006224 2.456649 -0.178601 0.027762 0.008696
0.266667 -0.044376 0.007156 2.440500 -0.182691 0.028067 0.005541
0.300000 -0.050530 0.008099 2.450616 -0.186820 0.028366 0.002073
0.333333 -0.056817 0.009051 2.449297 -0.190990 0.028658 -0.003915
0.366667 -0.063239 0.010012 2.446121 -0.195198 0.028944 -0.012925
0.400000 -0.069797 0.010982 2.450585 -0.199441 0.029223 -0.025739
0.433333 -0.076507 0.011962 2.447306 -0.203718 0.029496 -0.044739
0.466667 -0.083353 0.012951 2.444955 -0.208029 0.029761 -0.073171
0.500000 -0.090356 0.013949 2.451076 -0.212377 0.030020 -0.110929
0.533333 -0.097516 0.014957 2.439405 -0.216762 0.030274 -0.158930
0.566667 -0.104816 0.015972 2.451660 -0.221186 0.030521 -0.219927
0.600000 -0.112256 0.016995 2.444086 -0.225651 0.030764 -0.296363
0.633333 -0.119838 0.018025 2.432824 -0.230159 0.031002 -0.382385
0.666667 -0.127561 0.019062 2.417714 -0.234706 0.031235 -0.478347
0.700000 -0.135450 0.020108 2.409616 -0.239293 0.031464 -0.584412
0.733333 -0.143482 0.021161 2.399948 -0.243919 0.031688 -0.701375
0.766667 -0.151681 0.022221 2.351381 -0.248581 0.031907 -0.821503
0.800000 -0.160047 0.023291 2.332069 -0.253270 0.032120 -0.939468
0.833333 -0.168557 0.024365 2.302188 -0.257980 0.032326 -1.056466
0.866667 -0.177234 0.025448 2.256676 -0.262702 0.032523 -1.165992
0.900000 -0.186076 0.026539 2.219708 -0.267427 0.032711 -1.261433
0.933333 -0.195081 0.027636 2.161306 -0.272144 0.032888 -1.331664
0.966667 -0.204234 0.028738 2.130944 -0.276846 0.033053 -1.379967
1.000000 -0.213547 0.029846 2.069070 -0.281530 0.033206 -1.402695
1.033333 -0.223019 0.030959 2.008393 -0.286191 0.033347 -1.394817
1.066667 -0.232640 0.032076 1.935301 -0.290830 0.033477 -1.354965
1.100000 -0.242415 0.033196 1.886002 -0.295446 0.033596 -1.283701
1.133333 -0.252344 0.034320 1.843093 -0.300044 0.033709 -1.189537
1.166667 -0.262426 0.035447 1.805967 -0.304627 0.033816 -1.072234
1.200000 -0.272661 0.036576 1.761932 -0.309197 0.033920 -0.938270
1.233333 -0.283045 0.037708 1.735182 -0.313760 0.034026 -0.797223
1.266667 -0.293580 0.038844 1.717249 -0.318322 0.034134 -0.661428
1.300000 -0.304266 0.039980 1.695291 -0.322884 0.034248 -0.541754
1.333333 -0.315102 0.041122 1.680781 -0.327450 0.034366 -0.443602
1.366667 -0.326089 0.042264 1.685115 -0.332025 0.034493 -0.375127
1.400000 -0.337228 0.043412 1.678134 -0.336611 0.034627 -0.342245
1.433333 -0.348521 0.044567 1.695127 -0.341213 0.034770 -0.351378
1.466667 -0.359969 0.045730 1.694418 -0.345833 0.034920 -0.400282
1.500000 -0.371567 0.046893 1.677713 -0.350474 0.035078 -0.487769
1.533333 -0.383323 0.048065 1.674255 -0.355139 0.035243 -0.611796
1.566667 -0.395238 0.049247 1.669844 -0.359828 0.035412 -0.765209
1.600000 -0.407303 0.050429 1.634641 -0.364541 0.035581 -0.940308
1.633333 -0.419519 0.051609 1.604606 -0.369277 0.035746 -1.120505
1.666667 -0.431897 0.052801 1.569231 -0.374037 0.035905 -1.295966
1.700000 -0.444439 0.054003 1.508138 -0.378816 0.036050 -1.453585
1.733333 -0.457146 0.055214 1.463956 -0.383611 0.036174 -1.582575
1.766667 -0.470017 0.056435 1.383536 -0.388419 0.036274 -1.670441
1.800000 -0.483038 0.057652 1.309122 -0.393238 0.036343 -1.710601
1.833333 -0.496225 0.058875 1.224225 -0.398067 0.036374 -1.700400
1.866667 -0.509576 0.060100 1.161344 -0.402902 0.036363 -1.640284
1.900000 -0.523094 0.061326 1.091523 -0.407742 0.036306 -1.532574
1.933333 -0.536761 0.062547 1.033725 -0.412590 0.036201 -1.381066
1.966667 -0.550593 0.063763 0.985587 -0.417442 0.036050 -1.200748
2.000000 -0.564592 0.064972 0.938071 -0.422294 0.035857 -1.001004
2.033333 -0.578739 0.066175 0.905959 -0.427138 0.035625 -0.795533
2.066667 -0.593051 0.067368 0.893230 -0.431968 0.035362 -0.591962
2.100000 -0.607530 0.068548 0.897362 -0.436772 0.035075 -0.403246
2.133333 -0.622176 0.069715 0.893944 -0.441541 0.034772 -0.239390
2.166667 -0.636988 0.070869 0.902102 -0.446271 0.034460 -0.103970
2.200000 -0.651967 0.072008 0.883296 -0.450956 0.034143 0.001035
2.233333 -0.667111 0.073134 0.911790 -0.455593 0.033829 0.072898
2.266667 -0.682397 0.074251 0.930755 -0.460182 0.033519 0.110922
2.300000 -0.697826 0.075360 0.937271 -0.464722 0.033215 0.115391
2.333333 -0.713396 0.076461 0.941762 -0.469214 0.032918 0.090708
2.366667 -0.729106 0.077554 0.949440 -0.473657 0.032628 0.042330
2.400000 -0.744956 0.078637 0.945503 -0.478056 0.032342 -0.029720
2.433333 -0.760964 0.079711 0.961804 -0.482417 0.032058 -0.117735
2.466667 -0.777130 0.080776 0.960421 -0.486742 0.031773 -0.217258
2.500000 -0.793452 0.081832 0.950411 -0.491036 0.031486 -0.317502
2.533333 -0.809911 0.082878 0.940874 -0.495304 0.031195 -0.416774
2.566667 -0.826505 0.083915 0.923178 -0.499548 0.030898 -0.512321
2.600000 -0.843232 0.084941 0.907275 -0.503773 0.030594 -0.595369
2.633333 -0.860093 0.085956 0.843227 -0.507979 0.030282 -0.657518
2.666667 -0.877085 0.086960 0.827864 -0.512171 0.029961 -0.696632
2.700000 -0.894228 0.087957 0.810034 -0.516351 0.029629 -0.711483
2.733333 -0.911501 0.088942 0.772903 -0.520520 0.029286 -0.694165
2.766667 -0.928924 0.089917 0.749529 -0.524670 0.028931 -0.644757
2.800000 -0.946475 0.090880 0.723078 -0.528796 0.028566 -0.567889
2.833333 -0.964173 0.091831 0.689224 -0.532886 0.028190 -0.473242
2.866667 -0.982018 0.092768 0.658280 -0.536931 0.027802 -0.363684
2.900000 -1.000009 0.093690 0.640745 -0.540921 0.027401 -0.247820
2.933333 -1.018143 0.094594 0.654493 -0.544846 0.026986 -0.143058
2.966667 -1.036398 0.095487 0.658072 -0.548705 0.026555 -0.054396
3.000000 -1.054773 0.096366 0.653077 -0.552494 0.026107 0.009926
3.033333 -1.073266 0.097233 0.672868 -0.556215 0.025640 0.042632
3.066667 -1.091876 0.098087 0.707636 -0.559870 0.025153 0.037516
3.100000 -1.110602 0.098927 0.709147 -0.563461 0.024647 -0.002706
3.133333 -1.129442 0.099754 0.719640 -0.566994 0.024122 -0.064667
3.166667 -1.148408 0.100557 0.744539 -0.570472 0.023574 -0.144075
3.200000 -1.167497 0.101335 0.724972 -0.573895 0.023004 -0.224176
3.233333 -1.186703 0.102087 0.703286 -0.577262 0.022412 -0.286335
3.266667 -1.206019 0.102825 0.673319 -0.580570 0.021800 -0.313173
3.300000 -1.225441 0.103549 0.666535 -0.583816 0.021168 -0.296552
3.333333 -1.244973 0.104246 0.606915 -0.586993 0.020521 -0.228272
3.366667 -1.264610 0.104928 0.589252 -0.590097 0.019863 -0.102532
3.400000 -1.284349 0.105581 0.561943 -0.593125 0.019197 0.074807
3.433333 -1.304189 0.106220 0.550133 -0.596073 0.018524 0.290043
3.466667 -1.324124 0.106827 0.561680 -0.598938 0.017847 0.528054
3.500000 -1.344151 0.107401 0.592487 -0.601719 0.017170 0.772380
3.533333 -1.364275 0.107961 0.627768 -0.604414 0.016496 0.995206
3.566667 -1.384481 0.108488 0.696038 -0.607017 0.015827 1.174270
3.600000 -1.404780 0.109002 0.739106 -0.609522 0.015168 1.292250
3.633333 -1.425171 0.109503 0.807460 -0.611922 0.014521 1.337830
3.666667 -1.445631 0.109971 0.892086 -0.614213 0.013892 1.301080
3.700000 -1.466180 0.110426 0.966202 -0.616385 0.013280 1.182956
3.733333 -1.486786 0.110853 1.032887 -0.618434 0.012687 0.994980
3.766667 -1.507445 0.111252 1.074018 -0.620364 0.012113 0.753338
3.800000 -1.528187 0.111639 1.112256 -0.622180 0.011560 0.472487
3.833333 -1.549013 0.112015 1.109124 -0.623896 0.011030 0.174864
3.866667 -1.569875 0.112370 1.098060 -0.625526 0.010522 -0.113347
3.900000 -1.590772 0.112707 1.076862 -0.627092 0.010039 -0.371899
3.933333 -1.611699 0.113026 1.045185 -0.628613 0.009580 -0.583493
3.966667 -1.632654 0.113330 0.993666 -0.630111 0.009145 -0.737127
4.000000 -1.653684 0.113623 0.939499 -0.631604 0.008733 -0.821793
4.033333 -1.674738 0.113902 0.882068 -0.633112 0.008342 -0.837870
4.066667 -1.695865 0.114171 0.850068 -0.634645 0.007971 -0.794400
4.100000 -1.717013 0.114425 0.814724 -0.636210 0.007617 -0.700947
4.133333 -1.738233 0.114669 0.782956 -0.637805 0.007278 -0.573223
4.166667 -1.759522 0.114906 0.756403 -0.639422 0.006952 -0.427828
4.200000 -1.780880 0.115134 0.755245 -0.641050 0.006635 -0.280959
4.233333 -1.802263 0.115343 0.747867 -0.642673 0.006325 -0.144493
4.266667 -1.823712 0.115546 0.772746 -0.644285 0.006023 -0.029563
4.300000 -1.845226 0.115741 0.789785 -0.645876 0.005727 0.056358
4.333333 -1.866804 0.115930 0.802428 -0.647445 0.005441 0.112074
4.366667 -1.888446 0.116113 0.813482 -0.648994 0.005166 0.140360
4.400000 -1.910117 0.116280 0.831598 -0.650528 0.004904 0.145236
4.433333 -1.931820 0.116433 0.840669 -0.652053 0.004657 0.130490
4.466667 -1.953556 0.116570 0.832141 -0.653574 0.004423 0.109212
4.500000 -1.975351 0.116704 0.819987 -0.655098 0.004201 0.090709
4.533333 -1.997204 0.116834 0.828093 -0.656632 0.003988 0.081015
4.566667 -2.019113 0.116960 0.838579 -0.658184 0.003783 0.084011
4.600000 -2.041078 0.117084 0.820192 -0.659756 0.003583 0.103602
4.633333 -2.063098 0.117206 0.822573 -0.661352 0.003387 0.138953
4.666667 -2.085171 0.117326 0.810763 -0.662967 0.003193 0.183926
4.700000 -2.107294 0.117435 0.815373 -0.664597 0.003002 0.233490
4.733333 -2.129469 0.117533 0.833447 -0.666234 0.002818 0.284310
4.766667 -2.151699 0.117621 0.855211 -0.667872 0.002643 0.331974
4.800000 -2.173985 0.117700 0.867130 -0.669503 0.002483 0.369321
4.833333 -2.196329 0.117771 0.892908 -0.671122 0.002345 0.395318
4.866667 -2.218732 0.117835 0.901277 -0.672729 0.002236 0.409318
4.900000 -2.241197 0.117893 0.931066 -0.674321 0.002161 0.404287
4.933333 -2.263707 0.117954 0.950176 -0.675900 0.002124 0.383463
4.966667 -2.286280 0.118012 0.950077 -0.677461 0.002126 0.346965
5.000000 -2.308896 0.118074 0.948739 -0.679006 0.002167 0.297729
5.033333 -2.331554 0.118141 0.983538 -0.680535 0.002246 0.235941
5.066667 -2.354253 0.118213 0.986541 -0.682047 0.002361 0.160756
5.100000 -2.377015 0.118287 1.000425 -0.683543 0.002507 0.081581
5.133333 -2.399816 0.118369 1.001455 -0.685021 0.002684 -0.006845
5.166667 -2.422679 0.118455 0.997163 -0.686484 0.002887 -0.101106
5.200000 -2.445602 0.118548 0.998285 -0.687929 0.003117 -0.198849
5.233333 -2.468561 0.118650 0.966098 -0.689352 0.003370 -0.289098
5.266667 -2.491578 0.118761 0.993665 -0.690747 0.003647 -0.367979
5.300000 -2.514628 0.118882 0.959925 -0.692110 0.003946 -0.429969
5.333333 -2.537736 0.119014 0.934558 -0.693435 0.004268 -0.465092
5.366667 -2.560874 0.119157 0.913908 -0.694712 0.004611 -0.470206
5.400000 -2.584067 0.119313 0.881833 -0.695939 0.004975 -0.440620
5.433333 -2.607288 0.119481 0.854427 -0.697110 0.005359 -0.385457
5.466667 -2.630560 0.119662 0.824334 -0.698222 0.005763 -0.303100
5.500000 -2.653881 0.119856 0.801633 -0.699269 0.006185 -0.203103
5.533333 -2.677226 0.120066 0.793802 -0.700247 0.006626 -0.095635
5.566667 -2.700593 0.120290 0.812518 -0.701153 0.007087 0.009124
5.600000 -2.724001 0.120530 0.823657 -0.701984 0.007567 0.095407
5.633333 -2.747428 0.120785 0.835581 -0.702737 0.008068 0.153834
5.666667 -2.770889 0.121058 0.859242 -0.703413 0.008591 0.174271
5.700000 -2.794368 0.121348 0.873104 -0.704016 0.009138 0.153558
5.733333 -2.817861 0.121656 0.903439 -0.704548 0.009710 0.091122
5.766667 -2.841369 0.121984 0.923825 -0.705013 0.010306 -0.007142
5.800000 -2.864889 0.122331 0.915362 -0.705414 0.010928 -0.125741
5.833333 -2.888419 0.122698 0.910620 -0.705756 0.011575 -0.249328
5.866667 -2.911959 0.123086 0.909947 -0.706040 0.012246 -0.363026
5.900000 -2.935510 0.123499 0.893933 -0.706270 0.012941 -0.455069
5.933333 -2.959067 0.123938 0.849635 -0.706446 0.013660 -0.511939
5.966667 -2.982629 0.124405 0.793683 -0.706571 0.014401 -0.523241
6.000000 -3.006196 0.124894 0.755433 -0.706643 0.015164 -0.490459
6.033333 -3.029765 0.125407 0.721614 -0.706664 0.015948 -0.414027
6.066667 -3.053332 0.125948 0.710367 -0.706633 0.016752 -0.300838
6.100000 -3.076898 0.126515 0.697532 -0.706548 0.017577 -0.156481
6.133333 -3.100463 0.127107 0.701686 -0.706410 0.018421 0.003303
6.166667 -3.124019 0.127730 0.697560 -0.706219 0.019286 0.160351
6.200000 -3.147566 0.128384 0.729985 -0.705976 0.020172 0.299371
6.233333 -3.171106 0.129066 0.741823 -0.705683 0.021076 0.405524
6.266667 -3.194632 0.129782 0.769407 -0.705341 0.021999 0.466361
6.300000 -3.218149 0.130526 0.806517 -0.704949 0.022942 0.466545
6.333333 -3.241657 0.131298 0.831107 -0.704507 0.023904 0.401438
6.366667 -3.265141 0.132109 0.861182 -0.704012 0.024884 0.261748
6.400000 -3.288613 0.132949 0.895347 -0.703459 0.025887 0.046514
6.433333 -3.312056 0.133831 0.918825 -0.702842 0.026915 -0.237996
6.466667 -3.335484 0.134744 0.919419 -0.702158 0.027967 -0.580646
6.500000 -3.358895 0.135687 0.916689 -0.701405 0.029044 -0.957287
6.533333 -3.382288 0.136661 0.878664 -0.700578 0.030146 -1.341280
6.566667 -3.405661 0.137666 0.839628 -0.699674 0.031272 -1.690248
6.600000 -3.428991 0.138719 0.775531 -0.698701 0.032416 -1.958063
6.633333 -3.452274 0.139820 0.673364 -0.697664 0.033573 -2.112514
6.666667 -3.475535 0.140953 0.563324 -0.696563 0.034739 -2.122642
6.700000 -3.498742 0.142134 0.391608 -0.695403 0.035908 -1.963411
6.733333 -3.521895 0.143362 0.210505 -0.694197 0.037072 -1.626792
6.766667 -3.545020 0.144623 0.143545 -0.692951 0.038220 -1.122514
6.800000 -3.568117 0.145918 0.049015 -0.691663 0.039347 -0.476149
6.833333 -3.591155 0.147255 0.021195 -0.690333 0.040449 0.289132
6.866667 -3.614133 0.148632 0.037141 -0.688962 0.041520 1.136720
6.900000 -3.637079 0.150042 0.101648 -0.687550 0.042560 2.013598
6.933333 -3.659992 0.151487 0.231019 -0.686087 0.043572 2.891450
6.966667 -3.682872 0.152967 0.385350 -0.684569 0.044559 3.750689
7.000000 -3.705686 0.154474 0.548276 -0.682999 0.045529 4.580320
7.033333 -3.728433 0.156009 0.766091 -0.681377 0.046490 5.365600
7.066667 -3.751142 0.157578 0.923883 -0.679698 0.047456 5.594429
7.100000 -3.773781 0.159172 1.149072 -0.677959 0.048442 5.281058
7.133333 -3.796344 0.160791 1.349876 -0.676167 0.049467 4.419817
7.166667 -3.818868 0.162446 1.647436 -0.674323 0.050550 2.994663
7.200000 -3.841311 0.164131 1.865129 -0.672432 0.051713 0.982124
7.233333 -3.863713 0.165852 2.097604 -0.670499 0.052971 -1.633002
7.266667 -3.886034 0.167608 2.510974 -0.668539 0.054335 -3.336294
7.300000 -3.908312 0.169400 2.911021 -0.666566 0.055809 -4.164999
7.333333 -3.930513 0.171236 -2.943962 -0.664589 0.057390 -4.155803
7.366667 -3.952631 0.173140 -2.508812 -0.662627 0.059066 -3.326294
7.400000 -3.974670 0.175115 -2.082499 -0.660692 0.060818 -1.686089
7.433333 -3.996638 0.177161 -1.739900 -0.658803 0.062623 0.764278
7.466667 -4.018538 0.179279 -1.378040 -0.656971 0.064454 2.496145
7.500000 -4.040378 0.181469 -1.073696 -0.655208 0.066282 3.551317
7.533333 -4.062163 0.183730 -0.902452 -0.653523 0.068085 3.990807
7.566667 -4.083899 0.186061 -0.743131 -0.651918 0.069840 3.863823
7.600000 -4.105589 0.188461 -0.670946 -0.650391 0.071530 3.231561
7.633333 -4.127229 0.190895 -0.651022 -0.648931 0.073145 2.139416
7.666667 -4.148819 0.193363 -0.624937 -0.647533 0.074683 1.143522
7.700000 -4.170377 0.195897 -0.632987 -0.646182 0.076146 0.261595
7.733333 -4.191884 0.198463 -0.680268 -0.644863 0.077538 -0.507798
7.766667 -4.213367 0.201091 -0.707698 -0.643560 0.078865 -1.160819
7.800000 -4.234796 0.203752 -0.791130 -0.642267 0.080138 -1.711545
7.833333 -4.256173 0.206444 -0.862789 -0.640972 0.081363 -2.176079
7.866667 -4.277533 0.209192 -0.924666 -0.639664 0.082542 -2.570311
7.900000 -4.298838 0.211971 -1.068038 -0.638339 0.083680 -2.894851
7.933333 -4.320087 0.214781 -1.162226 -0.637001 0.084781 -3.154733
7.966667 -4.341325 0.217643 -1.264493 -0.635660 0.085852 -3.354739
8.000000 -4.362506 0.220535 -1.397368 -0.634316 0.086893 -3.501434
8.033333 -4.383628 0.223454 -1.564711 -0.632978 0.087905 -3.590087
8.066667 -4.404692 0.226402 -1.693317 -0.631665 0.088897 -3.622956
8.100000 -4.425697 0.229376 -1.836855 -0.630390 0.089873 -3.620665
8.133333 -4.446689 0.232395 -1.948392 -0.629158 0.090833 -3.597236
8.166667 -4.467620 0.235440 -2.087636 -0.627974 0.091779 -3.566802
8.200000 -4.488489 0.238509 -2.212794 -0.626849 0.092712 -3.543882
8.233333 -4.509343 0.241616 -2.306105 -0.625786 0.093633 -3.547322
8.266667 -4.530181 0.244759 -2.390213 -0.624773 0.094535 -3.593359
8.300000 -4.551004 0.247936 -2.479378 -0.623791 0.095411 -3.688931
8.333333 -4.571762 0.251134 -2.580883 -0.622830 0.096255 -3.828703
8.366667 -4.592501 0.254363 -2.704439 -0.621868 0.097058 -4.008305
8.400000 -4.613219 0.257622 -2.827729 -0.620875 0.097811 -4.211032
8.433333 -4.633913 0.260909 -2.959342 -0.619829 0.098509 -4.415873
8.466667 -4.654581 0.264224 -3.137666 -0.618712 0.099145 -4.589785
8.500000 -4.675219 0.267568 2.978990 -0.617516 0.099720 -4.699154
8.533333 -4.695832 0.270918 2.770460 -0.616222 0.100229 -4.715456
8.566667 -4.716371 0.274285 2.606161 -0.614827 0.100675 -4.616380
8.600000 -4.736878 0.277657 2.401108 -0.613327 0.101061 -4.386864
8.633333 -4.757308 0.281043 2.202470 -0.611727 0.101388 -4.012385
8.666667 -4.777699 0.284434 2.021353 -0.610028 0.101664 -3.501380
8.700000 -4.798010 0.287838 1.882552 -0.608234 0.101892 -2.866866
8.733333 -4.818277 0.291244 1.761607 -0.606353 0.102081 -2.135990
8.766667 -4.838461 0.294661 1.696357 -0.604391 0.102234 -1.339736
8.800000 -4.858599 0.298075 1.667360 -0.602359 0.102355 -0.515724
8.833333 -4.878650 0.301499 1.673311 -0.600260 0.102447 0.282562
8.866667 -4.898655 0.304915 1.714648 -0.598102 0.102511 1.013061
8.900000 -4.918569 0.308339 1.814853 -0.595893 0.102547 1.635579
8.933333 -4.938392 0.311768 1.878636 -0.593647 0.102553 2.124791
8.966667 -4.958171 0.315186 2.057963 -0.591372 0.102531 2.459174
9.000000 -4.977855 0.318607 2.195212 -0.589074 0.102479 2.635989
9.033333 -4.997441 0.322033 2.354644 -0.586760 0.102399 2.664978
9.066667 -5.016929 0.325460 2.487268 -0.584447 0.102289 2.561468
9.100000 -5.036378 0.328872 2.594481 -0.582132 0.102152 2.348012
9.133333 -5.055725 0.332285 2.649361 -0.579816 0.101990 2.046137
9.166667 -5.075032 0.335683 2.703065 -0.577500 0.101805 1.691026
9.200000 -5.094232 0.339080 2.727089 -0.575186 0.101599 1.305961
9.233333 -5.113391 0.342462 2.768940 -0.572866 0.101376 0.913856
9.266667 -5.132439 0.345841 2.786090 -0.570523 0.101140 0.534139
9.300000 -5.151440 0.349207 2.787588 -0.568148 0.100895 0.182311
9.333333 -5.170326 0.352569 2.790860 -0.565724 0.100644 -0.135193
9.366667 -5.189157 0.355920 2.784745 -0.563233 0.100387 -0.418885
9.400000 -5.207927 0.359259 2.748307 -0.560646 0.100126 -0.670055
9.433333 -5.226577 0.362593 2.711212 -0.557944 0.099859 -0.883633
9.466667 -5.245153 0.365918 2.677585 -0.555106 0.099586 -1.060178
9.500000 -5.263652 0.369234 2.625352 -0.552114 0.099302 -1.203170
9.533333 -5.282065 0.372543 2.576938 -0.548949 0.099004 -1.310743
9.566667 -5.300385 0.375843 2.514907 -0.545592 0.098688 -1.382345
9.600000 -5.318573 0.379133 2.444385 -0.542037 0.098348 -1.417828
9.633333 -5.336628 0.382412 2.401635 -0.538269 0.097978 -1.430189
9.666667 -5.354547 0.385680 2.351726 -0.534284 0.097571 -1.423544
9.700000 -5.372328 0.388936 2.305447 -0.530076 0.097122 -1.403848
9.733333 -5.389969 0.392179 2.242625 -0.525644 0.096625 -1.374908
9.766667 -5.407461 0.395404 2.224136 -0.520988 0.096073 -1.349263
9.800000 -5.424796 0.398611 2.177539 -0.516106 0.095464 -1.331320
9.833333 -5.441985 0.401802 2.139352 -0.511007 0.094795 -1.313252
9.866667 -5.458995 0.404968 2.095472 -0.505688 0.094065 -1.290717
9.900000 -5.475816 0.408106 2.065683 -0.500154 0.093273 -1.253416
9.933333 -5.492437 0.411214 2.016594 -0.494419 0.092424 -1.193466
9.966667 -5.508848 0.414287 1.958983 -0.488509 0.091526 -1.089733
10.000000 -5.525103 0.417343 1.921407 -0.482454 0.090586 -0.930892
10.033333 -5.541128 0.420359 1.876012 -0.476290 0.089616 -0.713689
10.066667 -5.556916 0.423334 1.829769 -0.470057 0.088627 -0.443156
10.100000 -5.572467 0.426268 1.765433 -0.463799 0.087632 -0.128528
10.133333 -5.587778 0.429160 1.735215 -0.457552 0.086641 0.214524
10.166667 -5.602925 0.432031 1.742631 -0.451337 0.085662 0.561008
10.200000 -5.617831 0.434860 1.788478 -0.445172 0.084700 0.880732
10.233333 -5.632496 0.437647 1.870008 -0.439067 0.083760 1.142835
10.266667 -5.646993 0.440412 1.944124 -0.433029 0.082844 1.327959
10.300000 -5.661320 0.443154 2.016205 -0.427052 0.081952 1.417673
10.333333 -5.675477 0.445874 2.125854 -0.421119 0.081081 1.401835
10.366667 -5.689462 0.448570 2.225552 -0.415215 0.080229 1.277925
10.400000 -5.703213 0.451230 2.286068 -0.409323 0.079392 1.063093
10.433333 -5.716732 0.453855 2.332657 -0.403422 0.078567 0.782476
10.466667 -5.730076 0.456457 2.344222 -0.397494 0.077749 0.459189
10.500000 -5.743246 0.459033 2.356956 -0.391523 0.076935 0.118083
10.533333 -5.756188 0.461581 2.318583 -0.385513 0.076126 -0.208956
10.566667 -5.768955 0.464104 2.274361 -0.379472 0.075320 -0.492103
10.600000 -5.781544 0.466602 2.239956 -0.373400 0.074517 -0.717488
10.633333 -5.793909 0.469073 2.201415 -0.367299 0.073714 -0.875113
10.666667 -5.806050 0.471518 2.149714 -0.361174 0.072910 -0.960039
10.700000 -5.817966 0.473936 2.100124 -0.355036 0.072103 -0.970335
10.733333 -5.829703 0.476328 2.050755 -0.348881 0.071290 -0.917557
10.766667 -5.841214 0.478692 2.002396 -0.342714 0.070470 -0.818506
10.800000 -5.852546 0.481030 1.967564 -0.336541 0.069642 -0.684629
10.833333 -5.863649 0.483340 1.946308 -0.330373 0.068805 -0.531386
10.866667 -5.874573 0.485623 1.926105 -0.324220 0.067960 -0.374637
10.900000 -5.885269 0.487876 1.935884 -0.318078 0.067107 -0.227810
10.933333 -5.895786 0.490102 1.932376 -0.311954 0.066247 -0.099192
10.966667 -5.906076 0.492297 1.949661 -0.305844 0.065380 0.006816
11.000000 -5.916143 0.494461 1.972947 -0.299753 0.064507 0.088149
11.033333 -5.926031 0.496597 1.989185 -0.293674 0.063628 0.145810
11.066667 -5.935700 0.498703 1.998824 -0.287614 0.062745 0.185752
11.100000 -5.945191 0.500781 2.006142 -0.281578 0.061858 0.216696
11.133333 -5.954467 0.502829 2.005637 -0.275574 0.060967 0.250140
11.166667 -5.963567 0.504849 2.005452 -0.269612 0.060072 0.292714
11.200000 -5.972456 0.506838 1.991289 -0.263696 0.059175 0.351180
11.233333 -5.981137 0.508796 2.005597 -0.257837 0.058275 0.429685
11.266667 -5.989613 0.510724 2.002489 -0.252036 0.057371 0.530543
11.300000 -5.997886 0.512621 2.024308 -0.246299 0.056462 0.644292
11.333333 -6.005958 0.514486 2.060569 -0.240627 0.055548 0.755604
11.366667 -6.013859 0.516323 2.075152 -0.235026 0.054629 0.856401
11.400000 -6.021589 0.518131 2.093343 -0.229498 0.053704 0.934209
11.433333 -6.029150 0.519910 2.148528 -0.224041 0.052775 0.981015
11.466667 -6.036520 0.521657 2.227796 -0.218656 0.051843 0.984394
11.500000 -6.043703 0.523370 2.260554 -0.213340 0.050907 0.949108
11.533333 -6.050720 0.525054 2.319172 -0.208089 0.049970 0.880662
11.566667 -6.057555 0.526703 2.358845 -0.202898 0.049031 0.785232
11.600000 -6.064209 0.528319 2.394590 -0.197765 0.048094 0.667934
11.633333 -6.070701 0.529905 2.394052 -0.192691 0.047157 0.538436
11.666667 -6.077018 0.531457 2.405536 -0.187676 0.046223 0.412307
11.700000 -6.083174 0.532980 2.384540 -0.182721 0.045293 0.295721
11.733333 -6.089173 0.534475 2.385605 -0.177827 0.044367 0.196763
11.766667 -6.095014 0.535941 2.397040 -0.172994 0.043445 0.115602
11.800000 -6.100690 0.537374 2.396359 -0.168220 0.042527 0.059366
11.833333 -6.106203 0.538774 2.393673 -0.163505 0.041615 0.024460
11.866667 -6.111564 0.540146 2.389021 -0.158847 0.040706 0.005871
11.900000 -6.116767 0.541486 2.398711 -0.154245 0.039801 -0.003222
11.933333 -6.121815 0.542794 2.388814 -0.149701 0.038901 -0.007907
11.966667 -6.126715 0.544074 2.391428 -0.145216 0.038006 -0.005845
12.000000 -6.131469 0.545327 2.390991 -0.140793 0.037118 -0.003233
