t x y theta dxdt dydt dthetadt
0.000000 0.000000 0.000000 -2.245154 0.021084 -0.005369 -0.062618
0.033333 0.000794 -0.000355 -2.246101 0.018915 -0.000327 -0.055678
0.066667 0.001461 -0.000425 -2.243658 0.016612 0.004960 -0.048384
0.100000 0.001998 -0.000208 -2.248931 0.014209 0.010417 -0.041408
0.133333 0.002403 0.000300 -2.255808 0.011728 0.015996 -0.031693
0.166667 0.002673 0.001104 -2.261887 0.009177 0.021672 -0.020952
0.200000 0.002805 0.002207 -2.252656 0.006528 0.027505 -0.011935
0.233333 0.002964 0.003265 -2.251500 0.003765 0.033526 -0.007858
0.266667 0.003141 0.004292 -2.254576 0.000870 0.039769 -0.003090
0.300000 0.003172 0.005631 -2.255540 -0.002174 0.046270 0.000361
0.333333 0.003213 0.006952 -2.248932 -0.005396 0.053092 -0.000714
0.366667 0.003100 0.008592 -2.236592 -0.008817 0.060279 -0.007040
0.400000 0.002833 0.010558 -2.257214 -0.012432 0.067829 -0.013254
0.433333 0.002407 0.012854 -2.251565 -0.016217 0.075692 -0.020016
0.466667 0.001819 0.015483 -2.246402 -0.020140 0.083810 -0.030668
0.500000 0.001066 0.018452 -2.251112 -0.024170 0.092121 -0.042549
0.533333 0.000146 0.021763 -2.259078 -0.028243 0.100497 -0.051928
0.566667 -0.000945 0.025423 -2.256530 -0.032307 0.108836 -0.056337
0.600000 -0.002075 0.029165 -2.253703 -0.036343 0.117096 -0.061218
0.633333 -0.003382 0.033263 -2.264869 -0.040362 0.125297 -0.062587
0.666667 -0.004868 0.037723 -2.264938 -0.044373 0.133461 -0.058606
0.700000 -0.006419 0.042321 -2.266872 -0.048394 0.141624 -0.049804
0.733333 -0.008041 0.047070 -2.264931 -0.052478 0.149895 -0.041109
0.766667 -0.009746 0.051991 -2.277708 -0.056689 0.158401 -0.030954
0.800000 -0.011642 0.057291 -2.277785 -0.061058 0.167210 -0.017568
0.833333 -0.013735 0.062976 -2.281886 -0.065610 0.176372 -0.004353
0.866667 -0.015943 0.068900 -2.270463 -0.070383 0.185968 0.007105
0.900000 -0.018279 0.075091 -2.268229 -0.075415 0.196073 0.015024
0.933333 -0.020820 0.081681 -2.268388 -0.080718 0.206710 0.023344
0.966667 -0.023570 0.088675 -2.269971 -0.086281 0.217858 0.026649
1.000000 -0.026488 0.096017 -2.264376 -0.092106 0.229516 0.025505
1.033333 -0.029589 0.103736 -2.261244 -0.098197 0.241686 0.020590
1.066667 -0.032890 0.111866 -2.272978 -0.104538 0.254318 0.013235
1.100000 -0.036412 0.120419 -2.253303 -0.111094 0.267333 0.005812
1.133333 -0.040164 0.129443 -2.260666 -0.117842 0.280665 -0.002850
1.166667 -0.044142 0.138897 -2.268003 -0.124782 0.294306 -0.008623
1.200000 -0.048387 0.148900 -2.259032 -0.131905 0.308230 -0.011705
1.233333 -0.052918 0.159492 -2.268673 -0.139214 0.322441 -0.010574
1.266667 -0.057684 0.170524 -2.268284 -0.146742 0.337019 -0.005031
1.300000 -0.062688 0.182001 -2.269648 -0.154558 0.352120 0.003577
1.333333 -0.067930 0.193925 -2.268844 -0.162731 0.367908 0.017156
1.366667 -0.073414 0.206298 -2.273620 -0.171323 0.384526 0.033733
1.400000 -0.079142 0.219123 -2.279962 -0.180437 0.402205 0.054954
1.433333 -0.085116 0.232402 -2.260627 -0.190143 0.421106 0.078140
1.466667 -0.091337 0.246139 -2.267291 -0.200467 0.441281 0.102486
1.500000 -0.098018 0.260820 -2.257085 -0.211362 0.462633 0.127984
1.533333 -0.104951 0.275962 -2.252797 -0.222784 0.485055 0.150122
1.566667 -0.112393 0.292152 -2.256743 -0.234626 0.508310 0.167220
1.600000 -0.120370 0.309432 -2.240756 -0.246728 0.532043 0.175653
1.633333 -0.128906 0.327844 -2.247059 -0.258965 0.555954 0.179346
1.666667 -0.137696 0.346714 -2.222544 -0.271230 0.579794 0.175666
1.700000 -0.147084 0.366780 -2.216136 -0.283450 0.603390 0.166975
1.733333 -0.157090 0.388072 -2.207307 -0.295563 0.626583 0.157038
1.766667 -0.167348 0.409814 -2.200794 -0.307576 0.649372 0.148756
1.800000 -0.177859 0.432001 -2.191331 -0.319502 0.671777 0.144411
1.833333 -0.188619 0.454630 -2.190771 -0.331366 0.693860 0.139385
1.866667 -0.199629 0.477695 -2.193887 -0.343193 0.715679 0.138846
1.900000 -0.210886 0.501192 -2.213174 -0.355050 0.737378 0.142210
1.933333 -0.222841 0.526007 -2.205651 -0.366945 0.758999 0.148276
1.966667 -0.235498 0.552138 -2.196214 -0.378825 0.780459 0.157262
2.000000 -0.248397 0.578682 -2.186627 -0.390694 0.801771 0.169917
2.033333 -0.261533 0.605630 -2.166224 -0.402484 0.822814 0.191189
2.066667 -0.275390 0.633905 -2.150744 -0.414130 0.843460 0.218756
2.100000 -0.289478 0.662567 -2.151281 -0.425575 0.863586 0.252969
2.133333 -0.303793 0.691607 -2.146523 -0.436850 0.883231 0.295893
2.166667 -0.318825 0.721929 -2.157098 -0.448019 0.902509 0.349654
2.200000 -0.334076 0.752609 -2.144161 -0.459068 0.921389 0.414682
2.233333 -0.349540 0.783635 -2.132830 -0.470019 0.939916 0.487645
2.266667 -0.365212 0.814996 -2.119016 -0.480900 0.958152 0.567911
2.300000 -0.381089 0.846681 -2.105715 -0.491654 0.976022 0.649197
2.333333 -0.397656 0.879545 -2.088087 -0.502150 0.993306 0.726203
2.366667 -0.414415 0.912708 -2.046322 -0.512299 1.009860 0.790014
2.400000 -0.431844 0.946991 -2.011668 -0.522012 1.025546 0.833101
2.433333 -0.449931 0.982361 -1.960752 -0.531194 1.040204 0.849694
2.466667 -0.468191 1.017988 -1.925285 -0.539772 1.053716 0.835682
2.500000 -0.486618 1.053857 -1.895566 -0.547720 1.066029 0.792943
2.533333 -0.505202 1.089952 -1.856687 -0.555089 1.077237 0.723325
2.566667 -0.523938 1.126258 -1.831468 -0.561916 1.087397 0.632931
2.600000 -0.542818 1.162758 -1.802965 -0.568338 1.096738 0.529125
2.633333 -0.561833 1.199438 -1.792754 -0.574515 1.105529 0.423803
2.666667 -0.580977 1.236280 -1.783621 -0.580568 1.113974 0.325613
2.700000 -0.600242 1.273270 -1.772077 -0.586616 1.122278 0.240334
2.733333 -0.619619 1.310390 -1.783961 -0.592753 1.130589 0.173931
2.766667 -0.639456 1.348204 -1.795856 -0.598994 1.138936 0.131049
2.800000 -0.659722 1.386659 -1.799517 -0.605254 1.147173 0.115886
2.833333 -0.680076 1.425194 -1.804900 -0.611436 1.155137 0.124986
2.866667 -0.700508 1.463790 -1.791542 -0.617443 1.162661 0.153462
2.900000 -0.721290 1.502874 -1.793821 -0.623155 1.169545 0.200479
2.933333 -0.742389 1.542383 -1.795955 -0.628406 1.175514 0.259665
2.966667 -0.763538 1.581900 -1.782535 -0.633111 1.180431 0.323115
3.000000 -0.784936 1.621709 -1.762539 -0.637232 1.184235 0.380400
3.033333 -0.806365 1.661487 -1.748777 -0.640721 1.186853 0.426013
3.066667 -0.827971 1.701428 -1.731627 -0.643526 1.188211 0.459402
3.100000 -0.849588 1.741299 -1.712562 -0.645633 1.188289 0.474175
3.133333 -0.871312 1.781198 -1.680573 -0.647070 1.187147 0.469016
3.166667 -0.893027 1.820987 -1.658189 -0.647840 1.184800 0.445036
3.200000 -0.914795 1.860709 -1.642650 -0.647936 1.181239 0.406933
3.233333 -0.936533 1.900280 -1.615390 -0.647363 1.176485 0.355648
3.266667 -0.958250 1.939653 -1.610404 -0.646139 1.170566 0.292811
3.300000 -0.979916 1.978837 -1.602425 -0.644252 1.163466 0.223489
3.333333 -1.001521 2.017812 -1.605643 -0.641662 1.155105 0.155916
3.366667 -1.022990 2.056385 -1.605638 -0.638336 1.145415 0.094485
3.400000 -1.044377 2.094711 -1.601616 -0.634235 1.134320 0.043772
3.433333 -1.065567 2.132531 -1.602377 -0.629293 1.121680 0.010586
3.466667 -1.086656 2.170066 -1.601007 -0.623434 1.107341 -0.003727
3.500000 -1.107632 2.207298 -1.607109 -0.616620 1.091222 0.001527
3.533333 -1.128289 2.243808 -1.617267 -0.608878 1.073369 0.020489
3.566667 -1.148814 2.279978 -1.634020 -0.600222 1.053802 0.053988
3.600000 -1.168956 2.315311 -1.637894 -0.590731 1.032672 0.095913
3.633333 -1.188675 2.349734 -1.638305 -0.580558 1.010273 0.141061
3.666667 -1.207915 2.383135 -1.611068 -0.569938 0.987060 0.185254
3.700000 -1.226986 2.416129 -1.609895 -0.559083 0.963444 0.225614
3.733333 -1.245494 2.447942 -1.579127 -0.548121 0.939679 0.257977
3.766667 -1.263395 2.478489 -1.572445 -0.537166 0.915998 0.275079
3.800000 -1.280659 2.507718 -1.559529 -0.526296 0.892565 0.279589
3.833333 -1.297725 2.536486 -1.554253 -0.515516 0.869407 0.274624
3.866667 -1.314586 2.564782 -1.543188 -0.504742 0.846370 0.267119
3.900000 -1.331235 2.592594 -1.519160 -0.493888 0.823299 0.259488
3.933333 -1.347667 2.619911 -1.517192 -0.482892 0.800082 0.261741
3.966667 -1.363874 2.646721 -1.521140 -0.471732 0.776667 0.281982
4.000000 -1.379851 2.673015 -1.512082 -0.460296 0.752837 0.318563
4.033333 -1.395591 2.698780 -1.514293 -0.448467 0.728366 0.369323
4.066667 -1.410413 2.722764 -1.521506 -0.436182 0.703139 0.430332
4.100000 -1.424323 2.744996 -1.521604 -0.423414 0.677102 0.501415
4.133333 -1.437980 2.766673 -1.491717 -0.410177 0.650278 0.576053
4.166667 -1.451382 2.787790 -1.463557 -0.396451 0.622630 0.645760
4.200000 -1.464522 2.808340 -1.417163 -0.382312 0.594297 0.709322
4.233333 -1.477398 2.828315 -1.382330 -0.367886 0.565508 0.764239
4.266667 -1.489502 2.846821 -1.357424 -0.353286 0.536452 0.807565
4.300000 -1.501334 2.864741 -1.318468 -0.338556 0.507198 0.834987
4.333333 -1.512478 2.881343 -1.301072 -0.323772 0.477865 0.848359
4.366667 -1.522981 2.896712 -1.279923 -0.309071 0.448683 0.852236
4.400000 -1.532888 2.910928 -1.245448 -0.294608 0.419911 0.845550
4.433333 -1.542247 2.924069 -1.222669 -0.280553 0.391834 0.825504
4.466667 -1.551104 2.936216 -1.187134 -0.267037 0.364677 0.787284
4.500000 -1.559506 2.947443 -1.168222 -0.254251 0.338766 0.730157
4.533333 -1.567490 2.957818 -1.136703 -0.242314 0.314303 0.645828
4.566667 -1.575095 2.967403 -1.108021 -0.231267 0.291366 0.530077
4.600000 -1.582417 2.976391 -1.070420 -0.221099 0.269930 0.384317
4.633333 -1.589457 2.984784 -1.048284 -0.211740 0.249872 0.213869
4.666667 -1.596232 2.992572 -1.020271 -0.203122 0.231075 0.028165
4.700000 -1.602782 2.999817 -1.005860 -0.195137 0.213357 -0.164499
4.733333 -1.609050 3.006472 -1.022302 -0.187668 0.196524 -0.350799
4.766667 -1.615135 3.012649 -1.068734 -0.180611 0.180401 -0.520259
4.800000 -1.620940 3.018242 -1.107275 -0.173863 0.164825 -0.663309
4.833333 -1.626581 3.023397 -1.153677 -0.167318 0.149641 -0.772285
4.866667 -1.632060 3.028119 -1.206104 -0.160886 0.134710 -0.843268
4.900000 -1.637261 3.032265 -1.232310 -0.154486 0.119908 -0.877865
4.933333 -1.642318 3.036016 -1.264675 -0.148047 0.105129 -0.881052
4.966667 -1.647241 3.039389 -1.310996 -0.141509 0.090271 -0.862783
5.000000 -1.651887 3.042194 -1.330609 -0.134814 0.075233 -0.843190
5.033333 -1.656400 3.044616 -1.330488 -0.127925 0.059937 -0.849366
5.066667 -1.660638 3.046477 -1.365539 -0.120814 0.044332 -0.907175
5.100000 -1.664600 3.047779 -1.389289 -0.113462 0.028380 -1.041348
5.133333 -1.668287 3.048525 -1.402002 -0.105859 0.012056 -1.275534
5.166667 -1.671701 3.048721 -1.424159 -0.098021 -0.004619 -1.622971
5.200000 -1.674883 3.048378 -1.450726 -0.089976 -0.021592 -2.083860
5.233333 -1.677811 3.047455 -1.459472 -0.081755 -0.038820 -2.645234
5.266667 -1.680468 3.045994 -1.504823 -0.073387 -0.056272 -3.292496
5.300000 -1.682805 3.043847 -1.570349 -0.064906 -0.073907 -4.002337
5.333333 -1.684797 3.040972 -1.709928 -0.056353 -0.091667 -4.736289
5.366667 -1.686521 3.037571 -1.917961 -0.047749 -0.109553 -5.461265
5.400000 -1.687980 3.033649 -2.164038 -0.039115 -0.127576 -6.138452
5.433333 -1.689173 3.029212 -2.435351 -0.030475 -0.145707 -6.731800
5.466667 -1.689994 3.024003 -2.739233 -0.021858 -0.163892 -7.194781
5.500000 -1.690553 3.018290 -2.981313 -0.013284 -0.182121 -7.497387
5.533333 -1.690853 3.012079 3.007134 -0.004751 -0.200400 -7.627686
5.566667 -1.690836 3.004979 2.713406 0.003725 -0.218645 -7.577835
5.600000 -1.690564 2.997395 2.395348 0.012138 -0.236783 -7.352684
5.633333 -1.690038 2.989332 2.096920 0.020498 -0.254784 -6.961833
5.666667 -1.689200 2.980443 1.849615 0.028831 -0.272639 -6.442548
5.700000 -1.688051 2.970754 1.617971 0.037149 -0.290259 -5.814425
5.733333 -1.686656 2.960610 1.421296 0.045451 -0.307535 -5.101498
5.766667 -1.685017 2.950019 1.220757 0.053752 -0.324450 -4.328700
5.800000 -1.683136 2.938989 1.140823 0.062052 -0.340965 -3.527335
5.833333 -1.680949 2.927286 1.040601 0.070335 -0.356985 -2.719091
5.866667 -1.678454 2.914948 0.964773 0.078568 -0.372426 -1.901832
5.900000 -1.675727 2.902197 0.937855 0.086722 -0.387270 -1.081525
5.933333 -1.672692 2.888887 0.928568 0.094766 -0.401489 -0.254405
5.966667 -1.669350 2.875064 0.941468 0.102656 -0.414988 0.584693
6.000000 -1.665710 2.860774 0.967581 0.110344 -0.427659 1.453663
6.033333 -1.661785 2.846075 1.017399 0.117790 -0.439464 2.350019
6.066667 -1.657643 2.831010 1.077869 0.124966 -0.450344 3.251892
6.100000 -1.653287 2.815591 1.135357 0.131846 -0.460214 4.141975
6.133333 -1.648723 2.799826 1.247916 0.138418 -0.469058 4.991683
6.166667 -1.643931 2.783869 1.439321 0.144684 -0.476903 5.766889
6.200000 -1.638937 2.767588 1.712022 0.150665 -0.483834 6.419325
6.233333 -1.633745 2.750991 2.034546 0.156386 -0.489885 6.909141
6.266667 -1.628379 2.734329 2.365846 0.161867 -0.495165 7.214885
6.300000 -1.622853 2.717624 2.689946 0.167129 -0.499782 7.303800
6.333333 -1.617186 2.700899 3.007010 0.172176 -0.503808 7.162613
6.366667 -1.611335 2.683898 -2.984259 0.177017 -0.507325 6.798814
6.400000 -1.605332 2.667063 -2.762579 0.181653 -0.510421 6.246058
6.433333 -1.599153 2.649970 -2.495356 0.186096 -0.513235 5.545796
6.466667 -1.592803 2.632627 -2.301785 0.190347 -0.515832 4.737983
6.500000 -1.586339 2.615411 -2.155532 0.194426 -0.518310 3.877562
6.533333 -1.579711 2.597962 -2.072642 0.198361 -0.520771 3.016435
6.566667 -1.573002 2.580612 -2.035749 0.202181 -0.523325 2.195099
6.600000 -1.566136 2.563046 -1.987968 0.205900 -0.525988 1.434284
6.633333 -1.559210 2.545554 -1.986940 0.209525 -0.528755 0.758041
6.666667 -1.552236 2.528140 -2.007699 0.213066 -0.531645 0.181872
6.700000 -1.545116 2.510533 -2.027424 0.216517 -0.534613 -0.291569
6.733333 -1.537855 2.492739 -2.072447 0.219867 -0.537613 -0.667583
6.766667 -1.530455 2.474766 -2.121179 0.223085 -0.540527 -0.955263
6.800000 -1.522919 2.456622 -2.176388 0.226160 -0.543315 -1.159600
6.833333 -1.515253 2.438313 -2.226702 0.229076 -0.545907 -1.296115
6.866667 -1.507459 2.419847 -2.277647 0.231816 -0.548225 -1.379184
6.900000 -1.499541 2.401230 -2.332913 0.234361 -0.550205 -1.416112
6.933333 -1.491615 2.382712 -2.379978 0.236693 -0.551786 -1.416135
6.966667 -1.483677 2.364280 -2.436621 0.238825 -0.552988 -1.386731
7.000000 -1.475729 2.345937 -2.485388 0.240770 -0.553829 -1.336190
7.033333 -1.467671 2.327469 -2.543314 0.242552 -0.554352 -1.268746
7.066667 -1.459505 2.308884 -2.581815 0.244183 -0.554588 -1.186905
7.100000 -1.451336 2.290397 -2.612336 0.245706 -0.554623 -1.098317
7.133333 -1.443067 2.271803 -2.650423 0.247156 -0.554534 -1.005372
7.166667 -1.434798 2.253314 -2.686375 0.248553 -0.554361 -0.910371
7.200000 -1.426435 2.234729 -2.717061 0.249901 -0.554106 -0.814402
7.233333 -1.418079 2.216259 -2.739847 0.251209 -0.553791 -0.719966
7.266667 -1.409731 2.197905 -2.750833 0.252509 -0.553481 -0.630524
7.300000 -1.401297 2.179471 -2.768659 0.253808 -0.553190 -0.543980
7.333333 -1.392780 2.160963 -2.787812 0.255113 -0.552935 -0.460822
7.366667 -1.384268 2.142567 -2.810123 0.256428 -0.552721 -0.380453
7.400000 -1.375757 2.124283 -2.810200 0.257770 -0.552583 -0.304605
7.433333 -1.367171 2.105937 -2.829358 0.259143 -0.552537 -0.232104
7.466667 -1.358514 2.087534 -2.830477 0.260531 -0.552548 -0.161575
7.500000 -1.349786 2.069078 -2.834611 0.261920 -0.552587 -0.092452
7.533333 -1.340991 2.050572 -2.836272 0.263291 -0.552611 -0.026229
7.566667 -1.332203 2.032186 -2.832170 0.264635 -0.552605 0.033601
7.600000 -1.323353 2.013759 -2.828129 0.265932 -0.552522 0.090158
7.633333 -1.314443 1.995294 -2.830546 0.267156 -0.552310 0.141017
7.666667 -1.305476 1.976793 -2.817701 0.268293 -0.551931 0.184099
7.700000 -1.296515 1.958422 -2.808012 0.269342 -0.551388 0.215988
7.733333 -1.287502 1.940022 -2.800462 0.270311 -0.550700 0.237377
7.766667 -1.278439 1.921598 -2.787353 0.271194 -0.549849 0.250650
7.800000 -1.269327 1.903151 -2.780342 0.271990 -0.548822 0.249955
7.833333 -1.260233 1.884849 -2.758240 0.272713 -0.547637 0.233860
7.866667 -1.251151 1.866681 -2.750803 0.273378 -0.546322 0.205743
7.900000 -1.242028 1.848498 -2.756414 0.273986 -0.544865 0.168929
7.933333 -1.232865 1.830305 -2.728730 0.274540 -0.543264 0.123245
7.966667 -1.223716 1.812245 -2.722587 0.275053 -0.541551 0.074072
8.000000 -1.214532 1.794178 -2.733457 0.275546 -0.539776 0.030580
8.033333 -1.205314 1.776107 -2.727709 0.276025 -0.537957 0.000582
8.066667 -1.196094 1.758154 -2.725630 0.276491 -0.536093 -0.014726
8.100000 -1.186870 1.740322 -2.735341 0.276950 -0.534208 -0.013208
8.133333 -1.177642 1.722606 -2.758889 0.277408 -0.532323 0.012175
8.166667 -1.168403 1.704998 -2.769142 0.277864 -0.530450 0.057299
8.200000 -1.159140 1.687394 -2.776703 0.278314 -0.528602 0.115905
8.233333 -1.149856 1.669794 -2.776553 0.278756 -0.526810 0.182106
8.266667 -1.140551 1.652200 -2.770967 0.279191 -0.525107 0.254198
8.300000 -1.131230 1.634706 -2.736188 0.279613 -0.523514 0.322538
8.333333 -1.121895 1.617302 -2.721771 0.280015 -0.522040 0.376539
8.366667 -1.112544 1.599979 -2.695551 0.280390 -0.520691 0.409901
8.400000 -1.103181 1.582728 -2.685395 0.280730 -0.519471 0.421743
8.433333 -1.093807 1.565488 -2.654013 0.281032 -0.518382 0.410280
8.466667 -1.084423 1.548257 -2.631804 0.281292 -0.517432 0.371921
8.500000 -1.075030 1.531058 -2.611479 0.281511 -0.516624 0.313929
8.533333 -1.065632 1.513881 -2.612997 0.281691 -0.515959 0.241476
8.566667 -1.056233 1.496719 -2.610197 0.281839 -0.515438 0.162490
8.600000 -1.046830 1.479568 -2.593889 0.281962 -0.515048 0.079307
8.633333 -1.037425 1.462421 -2.598431 0.282061 -0.514770 -0.001106
8.666667 -1.028018 1.445278 -2.597433 0.282140 -0.514584 -0.073790
8.700000 -1.018612 1.428147 -2.614282 0.282199 -0.514470 -0.136029
8.733333 -1.009210 1.411027 -2.627912 0.282237 -0.514411 -0.185075
8.766667 -0.999797 1.393888 -2.633127 0.282247 -0.514384 -0.220959
8.800000 -0.990391 1.376760 -2.640622 0.282220 -0.514374 -0.241356
8.833333 -0.980977 1.359616 -2.652896 0.282150 -0.514366 -0.249967
8.866667 -0.971557 1.342457 -2.664933 0.282031 -0.514347 -0.246906
8.900000 -0.962126 1.325277 -2.683733 0.281858 -0.514306 -0.234471
8.933333 -0.952708 1.308109 -2.692979 0.281625 -0.514234 -0.215687
8.966667 -0.943305 1.290953 -2.689784 0.281336 -0.514135 -0.192296
9.000000 -0.933917 1.273808 -2.699389 0.280995 -0.514012 -0.165998
9.033333 -0.924546 1.256675 -2.709533 0.280612 -0.513880 -0.136306
9.066667 -0.915194 1.239554 -2.697818 0.280198 -0.513750 -0.105612
9.100000 -0.905862 1.222443 -2.703522 0.279767 -0.513643 -0.076349
9.133333 -0.896552 1.205344 -2.710430 0.279333 -0.513576 -0.049915
9.166667 -0.887266 1.188256 -2.715069 0.278904 -0.513563 -0.026039
9.200000 -0.877971 1.171144 -2.719961 0.278485 -0.513613 -0.005240
9.233333 -0.868703 1.154042 -2.720314 0.278073 -0.513726 0.010372
9.266667 -0.859463 1.136950 -2.704684 0.277664 -0.513900 0.021291
9.300000 -0.850223 1.119842 -2.701740 0.277249 -0.514130 0.029044
9.333333 -0.840983 1.102710 -2.705040 0.276817 -0.514408 0.035016
9.366667 -0.831739 1.085548 -2.701800 0.276356 -0.514723 0.037475
9.400000 -0.822497 1.068360 -2.693883 0.275850 -0.515062 0.035973
9.433333 -0.813290 1.051182 -2.698620 0.275291 -0.515416 0.034325
9.466667 -0.804120 1.034014 -2.697868 0.274663 -0.515771 0.031375
9.500000 -0.794965 1.016824 -2.699287 0.273959 -0.516114 0.027861
9.533333 -0.785828 0.999615 -2.698386 0.273169 -0.516435 0.022919
9.566667 -0.776715 0.982391 -2.704913 0.272291 -0.516727 0.020490
9.600000 -0.767623 0.965137 -2.698101 0.271327 -0.516987 0.019900
9.633333 -0.758575 0.947893 -2.693354 0.270277 -0.517213 0.017975
9.666667 -0.749556 0.930621 -2.689575 0.269142 -0.517403 0.017555
9.700000 -0.740584 0.913358 -2.700442 0.267927 -0.517558 0.018194
9.733333 -0.731662 0.896106 -2.692605 0.266636 -0.517682 0.020623
9.766667 -0.722778 0.878833 -2.677315 0.265272 -0.517780 0.019133
9.800000 -0.713946 0.861571 -2.704254 0.263841 -0.517864 0.017703
9.833333 -0.705168 0.844319 -2.694179 0.262349 -0.517943 0.016458
9.866667 -0.696434 0.827048 -2.697163 0.260800 -0.518027 0.015685
9.900000 -0.687757 0.809787 -2.687825 0.259201 -0.518124 0.012318
9.933333 -0.679140 0.792537 -2.695045 0.257554 -0.518243 0.007526
9.966667 -0.670567 0.775254 -2.682175 0.255862 -0.518390 0.005332
10.000000 -0.662056 0.757981 -2.690860 0.254124 -0.518560 0.001999
10.033333 -0.653609 0.740721 -2.685905 0.252340 -0.518753 -0.002179
10.066667 -0.645218 0.723434 -2.684154 0.250511 -0.518967 -0.009128
10.100000 -0.636887 0.706125 -2.691520 0.248636 -0.519202 -0.015243
10.133333 -0.628614 0.688786 -2.698691 0.246713 -0.519455 -0.021836
10.166667 -0.620410 0.671461 -2.690918 0.244740 -0.519717 -0.029329
10.200000 -0.612276 0.654149 -2.687672 0.242716 -0.519984 -0.038456
10.233333 -0.604215 0.636850 -2.694996 0.240641 -0.520251 -0.048434
10.266667 -0.596216 0.619505 -2.696457 0.238513 -0.520520 -0.059019
10.300000 -0.588284 0.602110 -2.696504 0.236328 -0.520785 -0.071239
10.333333 -0.580427 0.584731 -2.696450 0.234086 -0.521050 -0.085914
10.366667 -0.572648 0.567368 -2.700709 0.231784 -0.521324 -0.102762
10.400000 -0.564948 0.550021 -2.697144 0.229418 -0.521624 -0.119492
10.433333 -0.557327 0.532629 -2.710386 0.226984 -0.521965 -0.135021
10.466667 -0.549788 0.515191 -2.715700 0.224477 -0.522361 -0.149483
10.500000 -0.542331 0.497771 -2.716175 0.221897 -0.522833 -0.160620
10.533333 -0.534958 0.480372 -2.724022 0.219246 -0.523392 -0.166157
10.566667 -0.527670 0.462994 -2.738065 0.216525 -0.524041 -0.165093
10.600000 -0.520477 0.445568 -2.739222 0.213742 -0.524767 -0.156358
10.633333 -0.513380 0.428093 -2.746683 0.210904 -0.525553 -0.139429
10.666667 -0.506386 0.410577 -2.758524 0.208021 -0.526375 -0.111191
10.700000 -0.499495 0.393019 -2.762956 0.205104 -0.527186 -0.074152
10.733333 -0.492708 0.375415 -2.762845 0.202161 -0.527942 -0.028066
10.766667 -0.486025 0.357770 -2.767310 0.199202 -0.528604 0.025253
10.800000 -0.479444 0.340075 -2.775433 0.196233 -0.529138 0.083517
10.833333 -0.472957 0.322324 -2.757775 0.193257 -0.529525 0.141248
10.866667 -0.466565 0.304605 -2.763944 0.190273 -0.529761 0.192593
10.900000 -0.460268 0.286922 -2.758102 0.187275 -0.529871 0.235976
10.933333 -0.454072 0.269196 -2.742225 0.184253 -0.529892 0.266621
10.966667 -0.447974 0.251509 -2.719127 0.181195 -0.529866 0.281768
11.000000 -0.441973 0.233863 -2.699516 0.178091 -0.529834 0.278840
11.033333 -0.436070 0.216260 -2.690368 0.174927 -0.529840 0.262299
11.066667 -0.430267 0.198701 -2.672060 0.171696 -0.529914 0.232714
11.100000 -0.424572 0.181101 -2.658337 0.168393 -0.530061 0.192371
11.133333 -0.418992 0.163467 -2.656394 0.165017 -0.530279 0.146786
11.166667 -0.413526 0.145795 -2.652132 0.161569 -0.530550 0.100097
11.200000 -0.408182 0.128093 -2.662835 0.158051 -0.530852 0.058482
11.233333 -0.402960 0.110362 -2.666863 0.154473 -0.531139 0.021608
11.266667 -0.397866 0.092602 -2.673596 0.150845 -0.531358 -0.005111
11.300000 -0.392901 0.074812 -2.667117 0.147174 -0.531475 -0.022605
11.333333 -0.388039 0.057086 -2.675336 0.143468 -0.531457 -0.033205
11.366667 -0.383318 0.039342 -2.669986 0.139742 -0.531272 -0.038281
11.400000 -0.378728 0.021567 -2.685387 0.136005 -0.530900 -0.040152
11.433333 -0.374243 0.003865 -2.677540 0.132255 -0.530348 -0.040390
11.466667 -0.369898 -0.013851 -2.672819 0.128493 -0.529631 -0.041651
11.500000 -0.365698 -0.031576 -2.670345 0.124724 -0.528749 -0.042204
11.533333 -0.361603 -0.049219 -2.672617 0.120949 -0.527708 -0.040986
11.566667 -0.357612 -0.066775 -2.674848 0.117156 -0.526532 -0.037314
11.600000 -0.353767 -0.084328 -2.679505 0.113343 -0.525234 -0.031999
11.633333 -0.350068 -0.101881 -2.686055 0.109519 -0.523802 -0.021582
11.666667 -0.346473 -0.119339 -2.694097 0.105692 -0.522226 -0.006345
11.700000 -0.342982 -0.136696 -2.692119 0.101864 -0.520510 0.014014
11.733333 -0.339639 -0.154031 -2.690680 0.098044 -0.518647 0.038535
11.766667 -0.336442 -0.171337 -2.694300 0.094254 -0.516605 0.065717
11.800000 -0.333391 -0.188599 -2.683580 0.090507 -0.514364 0.093790
11.833333 -0.330444 -0.205746 -2.680526 0.086806 -0.511922 0.119260
11.866667 -0.327641 -0.222836 -2.672457 0.083153 -0.509272 0.142992
11.900000 -0.324977 -0.239861 -2.671460 0.079560 -0.506393 0.162425
11.933333 -0.322414 -0.256760 -2.660593 0.076029 -0.503279 0.176212
11.966667 -0.319951 -0.273531 -2.650352 0.072557 -0.499936 0.187481
12.000000 -0.317587 -0.290170 -2.651889 0.069140 -0.496376 0.199592
12.033333 -0.315321 -0.306672 -2.632071 0.065783 -0.492601 0.213762
12.066667 -0.313179 -0.323065 -2.621655 0.062487 -0.488618 0.228293
12.100000 -0.311155 -0.339336 -2.633463 0.059247 -0.484432 0.246353
12.133333 -0.309253 -0.355465 -2.629777 0.056065 -0.480045 0.269559
12.166667 -0.307465 -0.371442 -2.623582 0.052945 -0.475444 0.294806
12.200000 -0.305786 -0.387249 -2.598145 0.049894 -0.470599 0.318333
12.233333 -0.304201 -0.402898 -2.592769 0.046917 -0.465481 0.341240
12.266667 -0.302708 -0.418385 -2.590450 0.044017 -0.460074 0.363895
12.300000 -0.301305 -0.433706 -2.562280 0.041197 -0.454362 0.380924
12.333333 -0.299993 -0.448858 -2.553089 0.038455 -0.448329 0.393081
12.366667 -0.298769 -0.463837 -2.529191 0.035784 -0.441981 0.399733
12.400000 -0.297632 -0.478558 -2.510891 0.033174 -0.435331 0.405112
12.433333 -0.296578 -0.493005 -2.493786 0.030612 -0.428397 0.407620
12.466667 -0.295609 -0.507269 -2.496765 0.028090 -0.421189 0.409785
12.500000 -0.294721 -0.521216 -2.483790 0.025601 -0.413753 0.417214
12.533333 -0.293912 -0.534834 -2.474976 0.023135 -0.406113 0.430160
12.566667 -0.293185 -0.548261 -2.451405 0.020682 -0.398259 0.451354
12.600000 -0.292538 -0.561494 -2.446251 0.018239 -0.390199 0.479514
12.633333 -0.291970 -0.574341 -2.429129 0.015797 -0.381914 0.513228
12.666667 -0.291481 -0.586990 -2.415677 0.013347 -0.373355 0.548615
12.700000 -0.291068 -0.599437 -2.403742 0.010878 -0.364436 0.582289
12.733333 -0.290752 -0.611402 -2.378630 0.008388 -0.355126 0.611714
12.766667 -0.290510 -0.623163 -2.348379 0.005884 -0.345454 0.633872
12.800000 -0.290341 -0.634717 -2.323255 0.003364 -0.335405 0.645609
12.833333 -0.290243 -0.646064 -2.293996 0.000837 -0.325000 0.647898
12.866667 -0.290250 -0.656863 -2.266954 -0.001683 -0.314348 0.639574
12.900000 -0.290363 -0.667104 -2.241330 -0.004175 -0.303598 0.620598
12.933333 -0.290544 -0.677134 -2.221299 -0.006626 -0.292838 0.590479
12.966667 -0.290829 -0.686596 -2.213046 -0.009025 -0.282154 0.551214
13.000000 -0.291219 -0.695489 -2.192759 -0.011351 -0.271699 0.504686
13.033333 -0.291670 -0.704170 -2.177872 -0.013584 -0.261597 0.452900
13.066667 -0.292182 -0.712641 -2.150985 -0.015716 -0.251883 0.398617
13.100000 -0.292753 -0.720902 -2.140885 -0.017742 -0.242524 0.343323
13.133333 -0.293412 -0.728627 -2.130661 -0.019656 -0.233533 0.289502
13.166667 -0.294126 -0.736143 -2.120612 -0.021455 -0.224866 0.237452
13.200000 -0.294894 -0.743452 -2.121988 -0.023148 -0.216426 0.189691
13.233333 -0.295714 -0.750554 -2.107199 -0.024743 -0.208149 0.144451
13.266667 -0.296585 -0.757451 -2.107756 -0.026249 -0.199998 0.104931
13.300000 -0.297504 -0.764144 -2.117888 -0.027669 -0.191991 0.072026
13.333333 -0.298469 -0.770421 -2.119674 -0.029014 -0.184107 0.046303
13.366667 -0.299472 -0.776305 -2.110277 -0.030285 -0.176362 0.028050
13.400000 -0.300518 -0.781989 -2.113947 -0.031483 -0.168785 0.015471
13.433333 -0.301592 -0.787315 -2.110615 -0.032607 -0.161403 0.009612
13.466667 -0.302706 -0.792446 -2.113551 -0.033657 -0.154242 0.006807
13.500000 -0.303858 -0.797384 -2.116530 -0.034633 -0.147314 0.005966
13.533333 -0.305047 -0.802133 -2.116952 -0.035536 -0.140635 0.005804
13.566667 -0.306271 -0.806694 -2.115137 -0.036373 -0.134199 0.005727
13.600000 -0.307528 -0.811069 -2.109998 -0.037150 -0.127998 0.004833
13.633333 -0.308817 -0.815262 -2.112108 -0.037866 -0.122000 0.003211
13.666667 -0.310103 -0.819205 -2.112811 -0.038525 -0.116175 0.001662
13.700000 -0.311383 -0.822909 -2.107630 -0.039133 -0.110502 -0.000663
13.733333 -0.312689 -0.826439 -2.108874 -0.039689 -0.104971 -0.004255
13.766667 -0.314020 -0.829797 -2.113443 -0.040189 -0.099583 -0.008134
13.800000 -0.315375 -0.832986 -2.118432 -0.040633 -0.094340 -0.010845
13.833333 -0.316751 -0.836010 -2.111672 -0.041021 -0.089257 -0.012635
