t x y theta dxdt dydt dthetadt
0.000000 0.000000 0.000000 1.725553 -0.014747 0.011959 0.023930
0.033333 -0.000292 0.000234 1.736117 -0.013048 0.006905 0.024851
0.066667 -0.000394 0.000238 1.735028 -0.011656 0.001161 0.024774
0.100000 -0.000351 0.000118 1.750759 -0.010947 -0.005366 0.022981
0.133333 -0.000465 0.000010 1.741225 -0.011260 -0.013183 0.020399
0.166667 -0.000736 -0.000101 1.741774 -0.012971 -0.023278 0.019008
0.200000 -0.000927 -0.000578 1.742483 -0.016340 -0.036501 0.015308
0.233333 -0.001085 -0.001406 1.747516 -0.021553 -0.053492 0.007884
0.266667 -0.001395 -0.002280 1.740046 -0.028720 -0.074963 -0.002488
0.300000 -0.001858 -0.003213 1.738192 -0.037781 -0.101316 -0.013288
0.333333 -0.002701 -0.005234 1.737160 -0.048758 -0.132864 -0.024651
0.366667 -0.003976 -0.008550 1.744437 -0.061650 -0.169609 -0.037602
0.400000 -0.005397 -0.011961 1.744099 -0.076486 -0.211656 -0.049867
0.433333 -0.007561 -0.017610 1.752062 -0.093252 -0.259071 -0.059554
0.466667 -0.010721 -0.026675 1.737442 -0.111890 -0.311616 -0.067269
0.500000 -0.015494 -0.040647 1.740747 -0.132290 -0.368813 -0.076177
0.533333 -0.020400 -0.054740 1.728582 -0.154047 -0.429405 -0.087252
0.566667 -0.025434 -0.068950 1.716826 -0.176629 -0.491792 -0.098288
0.600000 -0.030591 -0.083278 1.711041 -0.199524 -0.554344 -0.108934
0.633333 -0.035866 -0.097722 1.720517 -0.222431 -0.615921 -0.120626
0.666667 -0.043689 -0.119594 1.720388 -0.245013 -0.675375 -0.133314
0.700000 -0.054282 -0.149091 1.722561 -0.266959 -0.731732 -0.145374
0.733333 -0.064967 -0.178676 1.712913 -0.288087 -0.784416 -0.154500
0.766667 -0.075732 -0.208329 1.713312 -0.307999 -0.832520 -0.162248
0.800000 -0.086566 -0.238032 1.694016 -0.326300 -0.875142 -0.167509
0.833333 -0.097457 -0.267766 1.689783 -0.342356 -0.910878 -0.166893
0.866667 -0.108394 -0.297514 1.672816 -0.355816 -0.939181 -0.156558
0.900000 -0.121197 -0.331030 1.674563 -0.366348 -0.959724 -0.137081
0.933333 -0.134021 -0.364517 1.667247 -0.373568 -0.972117 -0.110903
0.966667 -0.147989 -0.399918 1.661160 -0.377217 -0.976249 -0.078013
1.000000 -0.162290 -0.435835 1.650597 -0.376836 -0.971608 -0.039917
1.033333 -0.176570 -0.471650 1.645834 -0.372065 -0.957854 0.001124
1.066667 -0.190146 -0.505798 1.653367 -0.362432 -0.934225 0.038387
1.100000 -0.202364 -0.536986 1.667195 -0.347820 -0.900544 0.071337
1.133333 -0.214518 -0.568001 1.667460 -0.328297 -0.856901 0.099373
1.166667 -0.226597 -0.598823 1.680339 -0.304260 -0.803969 0.119306
1.200000 -0.238588 -0.629432 1.693289 -0.276517 -0.743247 0.127700
1.233333 -0.248684 -0.655908 1.681782 -0.245999 -0.676479 0.122252
1.266667 -0.256639 -0.678192 1.684322 -0.213706 -0.605438 0.105955
1.300000 -0.262637 -0.696022 1.691752 -0.180545 -0.531772 0.081400
1.333333 -0.266409 -0.709253 1.703733 -0.147677 -0.457702 0.048622
1.366667 -0.270055 -0.722212 1.721652 -0.116141 -0.385386 0.011137
1.400000 -0.273571 -0.734899 1.718770 -0.086791 -0.316547 -0.026038
1.433333 -0.275309 -0.743551 1.706603 -0.060374 -0.252751 -0.060238
1.466667 -0.275649 -0.748698 1.702183 -0.037445 -0.195395 -0.088651
1.500000 -0.275089 -0.750891 1.690405 -0.018263 -0.145244 -0.111474
1.533333 -0.274399 -0.752829 1.687649 -0.002505 -0.101959 -0.125025
1.566667 -0.273215 -0.753417 1.676759 0.010276 -0.064927 -0.126185
1.600000 -0.271985 -0.753204 1.664472 0.020569 -0.033620 -0.116238
1.633333 -0.270633 -0.752768 1.664244 0.029069 -0.007029 -0.095933
1.666667 -0.269567 -0.752129 1.657429 0.036530 0.016151 -0.068600
1.700000 -0.268385 -0.751292 1.654712 0.043644 0.037213 -0.035980
1.733333 -0.267291 -0.749997 1.658069 0.050805 0.056864 -0.001450
1.766667 -0.266087 -0.748528 1.656443 0.058293 0.075723 0.030707
1.800000 -0.264774 -0.746896 1.666527 0.066430 0.094735 0.058858
1.833333 -0.263102 -0.744277 1.663053 0.075294 0.114298 0.081847
1.866667 -0.260674 -0.740278 1.671599 0.084748 0.134369 0.098911
1.900000 -0.257110 -0.734544 1.681493 0.094567 0.154622 0.109642
1.933333 -0.253454 -0.728705 1.681985 0.104510 0.174798 0.115546
1.966667 -0.249190 -0.721803 1.693257 0.114355 0.194599 0.116336
2.000000 -0.244939 -0.714447 1.690296 0.123602 0.212893 0.115118
2.033333 -0.240568 -0.706724 1.690953 0.131696 0.228316 0.116840
2.066667 -0.236127 -0.698968 1.695204 0.138066 0.239270 0.124850
2.100000 -0.231625 -0.691196 1.704374 0.142081 0.243814 0.139341
2.133333 -0.226196 -0.680968 1.714181 0.143118 0.239946 0.157575
2.166667 -0.220719 -0.670764 1.709301 0.140643 0.225835 0.179662
2.200000 -0.215203 -0.660605 1.701881 0.134346 0.200096 0.200253
2.233333 -0.209101 -0.649847 1.705329 0.124045 0.161659 0.208049
2.266667 -0.203342 -0.640124 1.714393 0.109845 0.110401 0.196515
2.300000 -0.197568 -0.630507 1.723007 0.092053 0.046792 0.163703
2.333333 -0.193476 -0.625177 1.743995 0.071241 -0.028002 0.110896
2.366667 -0.191080 -0.625111 1.789717 0.048078 -0.112462 0.034214
2.400000 -0.190503 -0.630937 1.798363 0.023550 -0.204161 -0.064561
2.433333 -0.191687 -0.643286 1.793567 -0.000982 -0.299677 -0.176189
2.466667 -0.192877 -0.655781 1.786787 -0.024369 -0.396220 -0.291270
2.500000 -0.194073 -0.668418 1.767101 -0.045508 -0.490728 -0.401819
2.533333 -0.196728 -0.687525 1.743676 -0.063371 -0.580436 -0.501372
2.566667 -0.200546 -0.712510 1.703068 -0.076940 -0.662820 -0.573053
2.600000 -0.204368 -0.737600 1.658472 -0.085725 -0.736322 -0.606581
2.633333 -0.208786 -0.767579 1.622207 -0.089812 -0.800276 -0.595628
2.666667 -0.213202 -0.797618 1.616870 -0.089122 -0.853663 -0.543061
2.700000 -0.217613 -0.827693 1.589076 -0.083512 -0.895665 -0.451789
2.733333 -0.221405 -0.860927 1.563129 -0.073232 -0.925839 -0.327191
2.766667 -0.224110 -0.896028 1.536038 -0.059034 -0.944411 -0.183696
2.800000 -0.226804 -0.931081 1.530359 -0.041413 -0.951090 -0.034576
2.833333 -0.229488 -0.966053 1.530684 -0.020705 -0.945679 0.106223
2.866667 -0.230176 -1.000005 1.548775 0.002312 -0.928643 0.234733
2.900000 -0.228720 -1.032126 1.578453 0.026440 -0.901015 0.341195
2.933333 -0.227259 -1.064077 1.604043 0.050675 -0.864236 0.420797
2.966667 -0.225797 -1.095831 1.643183 0.074385 -0.819074 0.470643
3.000000 -0.222716 -1.123930 1.659302 0.096686 -0.767221 0.491484
3.033333 -0.218184 -1.149272 1.681498 0.116461 -0.710603 0.487610
3.066667 -0.212531 -1.171507 1.700372 0.132965 -0.650950 0.458927
3.100000 -0.206905 -1.193452 1.714219 0.145852 -0.589379 0.413843
3.133333 -0.200611 -1.211330 1.724221 0.154764 -0.526825 0.356731
3.166667 -0.194054 -1.224740 1.730317 0.159397 -0.465160 0.294376
3.200000 -0.187554 -1.237818 1.742600 0.159745 -0.405372 0.232551
3.233333 -0.181124 -1.250554 1.735147 0.156260 -0.348258 0.174616
3.266667 -0.174775 -1.262940 1.751092 0.149426 -0.294215 0.123968
3.300000 -0.169512 -1.270477 1.767098 0.139800 -0.244434 0.080562
3.333333 -0.164351 -1.277651 1.753392 0.128058 -0.199505 0.047271
3.366667 -0.160623 -1.281210 1.763207 0.114956 -0.159257 0.022188
3.400000 -0.157015 -1.284401 1.747893 0.101192 -0.123796 0.004786
3.433333 -0.154550 -1.285722 1.738360 0.087384 -0.093220 -0.006642
3.466667 -0.152221 -1.286678 1.736747 0.074058 -0.067859 -0.011771
3.500000 -0.150034 -1.287270 1.737058 0.061506 -0.047118 -0.010201
3.533333 -0.148437 -1.287545 1.743258 0.049996 -0.030646 -0.006726
3.566667 -0.147420 -1.287833 1.745628 0.039584 -0.017782 -0.000437
3.600000 -0.146565 -1.287764 1.739749 0.030275 -0.007820 0.007259
3.633333 -0.145904 -1.287731 1.745587 0.021845 0.000265 0.014031
3.666667 -0.145440 -1.287703 1.752768 0.014001 0.007666 0.016953
3.700000 -0.145177 -1.287809 1.751283 0.006496 0.015243 0.013734
3.733333 -0.145103 -1.287563 1.747289 -0.001059 0.023995 0.006230
3.766667 -0.145223 -1.286967 1.749288 -0.009076 0.034698 -0.008142
3.800000 -0.145545 -1.286022 1.742139 -0.017938 0.048046 -0.032051
3.833333 -0.145876 -1.284936 1.750277 -0.027968 0.064536 -0.063538
3.866667 -0.146509 -1.283532 1.752349 -0.039338 0.084370 -0.101028
3.900000 -0.147361 -1.281783 1.748815 -0.052208 0.107645 -0.144746
3.933333 -0.148640 -1.279196 1.754753 -0.066451 0.133905 -0.193980
3.966667 -0.150390 -1.275465 1.745876 -0.081754 0.162341 -0.243086
4.000000 -0.153275 -1.269780 1.728710 -0.097524 0.191583 -0.284857
4.033333 -0.156405 -1.263762 1.725530 -0.112706 0.219411 -0.316090
4.066667 -0.160747 -1.255397 1.714666 -0.126245 0.243536 -0.334608
4.100000 -0.166113 -1.244852 1.685178 -0.137020 0.261558 -0.337903
4.133333 -0.171734 -1.233996 1.658314 -0.144183 0.271686 -0.327701
4.166667 -0.178184 -1.221442 1.648988 -0.146945 0.272313 -0.311813
4.200000 -0.184945 -1.208222 1.626799 -0.145114 0.263014 -0.298479
4.233333 -0.191967 -1.194724 1.609357 -0.139268 0.244873 -0.292147
4.266667 -0.198330 -1.183070 1.614234 -0.129723 0.218805 -0.296575
4.300000 -0.204959 -1.171159 1.615993 -0.116930 0.186044 -0.314819
4.333333 -0.209180 -1.164625 1.634075 -0.101473 0.148083 -0.344078
4.366667 -0.209477 -1.166009 1.649111 -0.084363 0.107267 -0.376722
4.400000 -0.210060 -1.167142 1.640220 -0.065999 0.065183 -0.406117
4.433333 -0.210938 -1.168016 1.614675 -0.046429 0.022740 -0.425495
4.466667 -0.212123 -1.168628 1.571866 -0.026469 -0.018229 -0.425463
4.500000 -0.213624 -1.168970 1.521575 -0.006868 -0.056048 -0.395794
4.533333 -0.215451 -1.169038 1.490695 0.012068 -0.089982 -0.333160
4.566667 -0.217616 -1.168825 1.473791 0.030751 -0.120603 -0.236615
4.600000 -0.214140 -1.176994 1.461776 0.048327 -0.147122 -0.107558
4.633333 -0.211027 -1.184861 1.448652 0.063942 -0.168753 0.045666
4.666667 -0.208294 -1.192413 1.469511 0.076891 -0.184913 0.207878
4.700000 -0.205957 -1.199634 1.483551 0.086145 -0.194656 0.361838
4.733333 -0.200112 -1.209140 1.501644 0.090127 -0.196360 0.493459
4.766667 -0.194700 -1.218283 1.540156 0.086982 -0.188075 0.588865
4.800000 -0.189741 -1.227045 1.574323 0.076423 -0.169998 0.636944
4.833333 -0.185255 -1.235408 1.613041 0.058171 -0.142338 0.630677
4.866667 -0.181262 -1.243357 1.643582 0.032504 -0.106017 0.569947
4.900000 -0.178170 -1.248791 1.677026 0.000401 -0.062868 0.456702
4.933333 -0.177026 -1.250948 1.710864 -0.036385 -0.015407 0.295713
4.966667 -0.176432 -1.252647 1.725192 -0.076363 0.034334 0.095366
5.000000 -0.179706 -1.249656 1.734737 -0.118381 0.084923 -0.134035
5.033333 -0.187498 -1.241821 1.734794 -0.161126 0.134798 -0.380840
5.066667 -0.195878 -1.233511 1.703915 -0.203687 0.182927 -0.631129
5.100000 -0.204854 -1.224723 1.677612 -0.245668 0.229131 -0.874220
5.133333 -0.214433 -1.215458 1.643149 -0.287237 0.273924 -1.101203
5.166667 -0.224624 -1.205715 1.588497 -0.328084 0.317195 -1.306230
5.200000 -0.235433 -1.195494 1.518006 -0.368452 0.359540 -1.484906
5.233333 -0.246868 -1.184795 1.457877 -0.408907 0.401818 -1.631783
5.266667 -0.258934 -1.173618 1.389584 -0.449903 0.444620 -1.750820
5.300000 -0.274494 -1.158216 1.324573 -0.491385 0.487771 -1.841066
5.333333 -0.290694 -1.142343 1.274656 -0.533293 0.530876 -1.901186
5.366667 -0.309540 -1.123216 1.200322 -0.575737 0.573621 -1.929967
5.400000 -0.330612 -1.101487 1.145714 -0.618499 0.615132 -1.929924
5.433333 -0.353751 -1.077645 1.074467 -0.661251 0.654306 -1.905662
5.466667 -0.377527 -1.053368 0.991597 -0.703644 0.690100 -1.853802
5.500000 -0.401935 -1.028672 0.913289 -0.745978 0.722207 -1.775437
5.533333 -0.426970 -1.003568 0.845224 -0.788355 0.750265 -1.671609
5.566667 -0.452626 -0.978072 0.795066 -0.831016 0.774386 -1.547613
5.600000 -0.480720 -0.951155 0.732836 -0.874150 0.795008 -1.404462
5.633333 -0.509422 -0.923875 0.682925 -0.917845 0.812774 -1.243339
5.666667 -0.540088 -0.896029 0.654333 -0.961964 0.828335 -1.075369
5.700000 -0.572527 -0.867898 0.626607 -1.005930 0.842098 -0.907049
5.733333 -0.606517 -0.839751 0.606119 -1.049150 0.854600 -0.749632
5.766667 -0.643105 -0.810848 0.573936 -1.090793 0.866103 -0.604455
5.800000 -0.682065 -0.781024 0.567485 -1.130132 0.876788 -0.475810
5.833333 -0.722171 -0.751306 0.551199 -1.166371 0.886793 -0.368156
5.866667 -0.763188 -0.721627 0.561681 -1.198909 0.896411 -0.279010
5.900000 -0.804696 -0.691718 0.564856 -1.227311 0.906003 -0.210784
5.933333 -0.846673 -0.661597 0.556294 -1.251242 0.915897 -0.160300
5.966667 -0.889100 -0.631281 0.560335 -1.270708 0.926495 -0.132571
6.000000 -0.932465 -0.600260 0.545025 -1.285831 0.938178 -0.128697
6.033333 -0.976237 -0.569080 0.548269 -1.296965 0.951293 -0.149800
6.066667 -1.020606 -0.537322 0.528527 -1.304596 0.965876 -0.190829
6.100000 -1.065337 -0.505442 0.540342 -1.309276 0.981747 -0.246893
6.133333 -1.110407 -0.473460 0.555618 -1.311636 0.998561 -0.311747
6.166667 -1.154990 -0.441066 0.554668 -1.312204 1.015903 -0.376157
6.200000 -1.198978 -0.407082 0.545071 -1.311518 1.033267 -0.433092
6.233333 -1.242260 -0.371765 0.519236 -1.310097 1.049919 -0.471306
6.266667 -1.284973 -0.335060 0.471742 -1.308576 1.065298 -0.489494
6.300000 -1.327918 -0.298359 0.450299 -1.307508 1.078952 -0.482287
6.333333 -1.371077 -0.261685 0.411578 -1.307376 1.090544 -0.447648
6.366667 -1.414335 -0.224001 0.378072 -1.308634 1.099645 -0.385014
6.400000 -1.457766 -0.186394 0.365492 -1.311628 1.105979 -0.294455
6.433333 -1.501350 -0.148889 0.347029 -1.316598 1.109449 -0.185043
6.466667 -1.545067 -0.111511 0.358623 -1.323387 1.110028 -0.064144
6.500000 -1.588897 -0.074285 0.373518 -1.331970 1.107587 0.058981
6.533333 -1.632819 -0.037235 0.379743 -1.342317 1.101999 0.173322
6.566667 -1.676812 -0.000388 0.400030 -1.354249 1.093408 0.266351
6.600000 -1.722298 0.036977 0.402591 -1.367416 1.081713 0.330155
6.633333 -1.767812 0.074089 0.414033 -1.381402 1.066962 0.361981
6.666667 -1.813334 0.110925 0.431324 -1.395979 1.049157 0.365068
6.700000 -1.860021 0.146756 0.461754 -1.410558 1.028569 0.340418
6.733333 -1.907650 0.181522 0.503369 -1.424457 1.005344 0.292823
6.766667 -1.956070 0.214419 0.505058 -1.436984 0.979401 0.236542
6.800000 -2.004400 0.246946 0.521203 -1.447692 0.951085 0.182071
6.833333 -2.054189 0.277814 0.521009 -1.455969 0.920491 0.146400
6.866667 -2.103836 0.308273 0.510826 -1.461057 0.887482 0.142844
6.900000 -2.153311 0.338304 0.492795 -1.462387 0.851453 0.192633
6.933333 -2.203034 0.365716 0.492969 -1.459537 0.812244 0.311175
6.966667 -2.252530 0.392666 0.465567 -1.452141 0.769632 0.502814
7.000000 -2.301772 0.419138 0.480754 -1.439550 0.722955 0.761871
7.033333 -2.350733 0.445117 0.460171 -1.421350 0.671646 1.070573
7.066667 -2.399274 0.468294 0.470453 -1.397438 0.615813 1.401422
7.100000 -2.446905 0.488423 0.502664 -1.367772 0.556226 1.714815
7.133333 -2.494174 0.508024 0.585802 -1.332300 0.493170 1.971584
7.166667 -2.539722 0.524338 0.691660 -1.291338 0.427550 2.133043
7.200000 -2.583116 0.537250 0.832476 -1.245691 0.360756 2.175491
7.233333 -2.624340 0.546694 0.982281 -1.196565 0.294612 2.082546
7.266667 -2.665106 0.555596 1.121082 -1.144952 0.230117 1.853202
7.300000 -2.703162 0.561135 1.245194 -1.092153 0.168027 1.499772
7.333333 -2.738226 0.563777 1.328581 -1.039639 0.109473 1.050809
7.366667 -2.769794 0.564011 1.345681 -0.988724 0.055047 0.545165
7.400000 -2.800841 0.563731 1.330084 -0.940338 0.004880 0.022266
7.433333 -2.829199 0.561805 1.273738 -0.895021 -0.041508 -0.476178
7.466667 -2.857017 0.559389 1.195480 -0.853426 -0.084010 -0.913558
7.500000 -2.884286 0.556497 1.109565 -0.815767 -0.122846 -1.262446
7.533333 -2.910016 0.551358 1.035419 -0.781918 -0.158484 -1.515077
7.566667 -2.935183 0.545772 0.957918 -0.751359 -0.191482 -1.673113
7.600000 -2.959122 0.537275 0.881908 -0.724004 -0.221766 -1.748493
7.633333 -2.982486 0.528366 0.808836 -0.699810 -0.248919 -1.757766
7.666667 -3.005271 0.519065 0.773406 -0.678676 -0.272709 -1.725551
7.700000 -3.027471 0.509390 0.721713 -0.660553 -0.292737 -1.670974
7.733333 -3.048535 0.498421 0.681063 -0.645477 -0.308629 -1.608470
7.766667 -3.068647 0.486411 0.632976 -0.633822 -0.319559 -1.548234
7.800000 -3.088158 0.473942 0.590264 -0.625365 -0.325286 -1.494955
7.833333 -3.107866 0.461573 0.527686 -0.619505 -0.325637 -1.453487
7.866667 -3.126971 0.448936 0.470479 -0.615496 -0.320093 -1.417263
7.900000 -3.145471 0.436053 0.427205 -0.612654 -0.308108 -1.386876
7.933333 -3.166047 0.425111 0.372794 -0.610064 -0.289333 -1.355956
7.966667 -3.188469 0.416075 0.344967 -0.606416 -0.264200 -1.328568
8.000000 -3.210267 0.406852 0.300007 -0.600660 -0.233311 -1.305614
8.033333 -3.231433 0.397460 0.262654 -0.592185 -0.197600 -1.286003
8.066667 -3.251960 0.387916 0.201479 -0.580265 -0.158390 -1.270408
8.100000 -3.272595 0.381133 0.168294 -0.564120 -0.117250 -1.256535
8.133333 -3.292698 0.377366 0.137587 -0.543452 -0.075573 -1.249909
8.166667 -3.311549 0.376896 0.098967 -0.518522 -0.034385 -1.237919
8.200000 -3.328028 0.380700 0.065978 -0.489751 0.005198 -1.218527
8.233333 -3.343831 0.384404 0.020913 -0.457443 0.042315 -1.189492
8.266667 -3.358952 0.388011 -0.015030 -0.422445 0.075822 -1.150455
8.300000 -3.373386 0.391522 -0.096076 -0.385733 0.105064 -1.092729
8.333333 -3.387130 0.394940 -0.149427 -0.347951 0.129665 -1.004499
8.366667 -3.400177 0.398267 -0.171040 -0.309331 0.149537 -0.890399
8.400000 -3.407755 0.405641 -0.182326 -0.270223 0.164979 -0.748571
8.433333 -3.414634 0.412924 -0.205885 -0.230905 0.176146 -0.581031
8.466667 -3.420816 0.420113 -0.245439 -0.191496 0.183453 -0.393956
8.500000 -3.426305 0.427205 -0.254081 -0.152057 0.186939 -0.205850
8.533333 -3.431100 0.434198 -0.291383 -0.112899 0.186517 -0.030861
8.566667 -3.435205 0.441089 -0.302029 -0.074599 0.182042 0.124726
8.600000 -3.437209 0.448384 -0.258120 -0.037267 0.173568 0.252513
8.633333 -3.438529 0.455571 -0.213880 -0.001153 0.161459 0.346203
8.666667 -3.437614 0.461848 -0.161603 0.033328 0.146164 0.401814
8.700000 -3.434726 0.466681 -0.125655 0.065484 0.128512 0.422668
8.733333 -3.431173 0.471400 -0.114870 0.094754 0.109269 0.409360
8.766667 -3.426126 0.474171 -0.109530 0.120433 0.089199 0.366661
8.800000 -3.420432 0.476828 -0.113407 0.141800 0.068985 0.305107
8.833333 -3.414194 0.477652 -0.103131 0.158080 0.049187 0.234696
8.866667 -3.407327 0.478367 -0.090105 0.169076 0.030293 0.166757
8.900000 -3.399843 0.478974 -0.091043 0.175176 0.012461 0.111747
8.933333 -3.392594 0.478421 -0.099442 0.176722 -0.004164 0.075392
8.966667 -3.384745 0.477769 -0.107408 0.174435 -0.019701 0.059916
9.000000 -3.378182 0.476663 -0.111383 0.168828 -0.034347 0.065887
9.033333 -3.373268 0.475242 -0.123044 0.160858 -0.048347 0.095551
9.066667 -3.367776 0.473734 -0.110076 0.151020 -0.061795 0.147878
9.100000 -3.363939 0.471610 -0.085637 0.139702 -0.074648 0.217270
9.133333 -3.359532 0.469411 -0.089765 0.127403 -0.086836 0.302347
9.166667 -3.356181 0.465800 -0.092838 0.114718 -0.097791 0.398087
9.200000 -3.352262 0.462126 -0.092013 0.102296 -0.107044 0.496618
9.233333 -3.347775 0.458396 -0.081638 0.090375 -0.113862 0.589018
9.266667 -3.344228 0.453392 -0.067260 0.079831 -0.117325 0.670639
9.300000 -3.341726 0.447835 -0.020065 0.071299 -0.116563 0.737683
9.333333 -3.340840 0.442475 0.034591 0.065541 -0.110745 0.783015
9.366667 -3.339380 0.437090 0.075383 0.063016 -0.099697 0.802505
9.400000 -3.339496 0.433065 0.107835 0.064334 -0.083317 0.796922
9.433333 -3.339027 0.429032 0.135349 0.070102 -0.062035 0.766242
9.466667 -3.337966 0.424997 0.158028 0.080188 -0.037006 0.712640
9.500000 -3.336952 0.423288 0.185909 0.094612 -0.009436 0.643911
9.533333 -3.335333 0.421589 0.209785 0.113190 0.019659 0.569894
9.566667 -3.331994 0.423173 0.231346 0.135723 0.049296 0.499014
9.600000 -3.326215 0.428556 0.241128 0.161611 0.078478 0.433796
9.633333 -3.319816 0.433950 0.237581 0.190347 0.106479 0.381384
9.666667 -3.312792 0.439351 0.237440 0.221801 0.132978 0.343261
9.700000 -3.305142 0.444757 0.235440 0.255653 0.157692 0.316703
9.733333 -3.296863 0.450162 0.264573 0.291431 0.180006 0.297338
9.766667 -3.287951 0.455564 0.261734 0.328846 0.199856 0.283278
9.800000 -3.278405 0.460958 0.281826 0.367968 0.217442 0.272908
9.833333 -3.265987 0.468586 0.298683 0.408753 0.232663 0.260130
9.866667 -3.250958 0.478064 0.304240 0.450835 0.245150 0.241602
9.900000 -3.235296 0.487517 0.310354 0.493889 0.254405 0.216874
9.933333 -3.217604 0.497817 0.320761 0.537633 0.260015 0.188095
9.966667 -3.199286 0.508073 0.331027 0.581694 0.261299 0.154058
10.000000 -3.179055 0.518088 0.348125 0.625334 0.257569 0.113840
10.033333 -3.156353 0.527805 0.342108 0.668079 0.248592 0.069090
10.066667 -3.133047 0.537451 0.336965 0.709766 0.234726 0.021678
10.100000 -3.109144 0.547017 0.323344 0.750279 0.216526 -0.029222
10.133333 -3.083334 0.555211 0.328644 0.789707 0.194699 -0.082696
10.166667 -3.056055 0.561916 0.330284 0.828065 0.170074 -0.134851
10.200000 -3.027466 0.566772 0.332824 0.865634 0.143490 -0.181598
10.233333 -2.997031 0.569530 0.336506 0.902366 0.115943 -0.220998
10.266667 -2.966060 0.572183 0.322479 0.938030 0.088102 -0.254027
10.300000 -2.934568 0.574728 0.312141 0.972296 0.060715 -0.276678
10.333333 -2.902570 0.577165 0.287967 1.004649 0.034466 -0.290539
10.366667 -2.867768 0.577369 0.257469 1.034534 0.009984 -0.297699
10.400000 -2.832493 0.577466 0.251506 1.061413 -0.012381 -0.297951
10.433333 -2.795493 0.575979 0.227120 1.084965 -0.032603 -0.290491
10.466667 -2.757083 0.573138 0.228808 1.104640 -0.050439 -0.274627
10.500000 -2.718259 0.570198 0.246724 1.119994 -0.065773 -0.257872
10.533333 -2.679042 0.567165 0.230593 1.130809 -0.078516 -0.240350
10.566667 -2.639839 0.563771 0.223784 1.137216 -0.088800 -0.222493
10.600000 -2.601245 0.559970 0.199438 1.139174 -0.096605 -0.206572
10.633333 -2.562317 0.556091 0.218067 1.136722 -0.102020 -0.198688
10.666667 -2.524566 0.552316 0.192059 1.130735 -0.105502 -0.196272
10.700000 -2.486518 0.548476 0.189649 1.122016 -0.107611 -0.194024
10.733333 -2.448194 0.544575 0.190099 1.111193 -0.108990 -0.193944
10.766667 -2.409610 0.540619 0.178862 1.098637 -0.110150 -0.198093
10.800000 -2.374546 0.537328 0.169027 1.085257 -0.111674 -0.207918
10.833333 -2.339255 0.533994 0.165491 1.071856 -0.114018 -0.217507
10.866667 -2.303749 0.530622 0.147815 1.058565 -0.117586 -0.229671
10.900000 -2.268043 0.527218 0.175730 1.045691 -0.122719 -0.248514
10.933333 -2.234445 0.523530 0.155629 1.033845 -0.129542 -0.268913
10.966667 -2.200672 0.519822 0.137820 1.023671 -0.138155 -0.290365
11.000000 -2.166733 0.516101 0.129919 1.015071 -0.148534 -0.309645
11.033333 -2.133530 0.511177 0.119249 1.008018 -0.160550 -0.327145
11.066667 -2.100864 0.505101 0.094430 1.002727 -0.173717 -0.341928
11.100000 -2.068064 0.499033 0.099826 0.999275 -0.187370 -0.346587
11.133333 -2.035138 0.492983 0.074711 0.997301 -0.200978 -0.341577
11.166667 -2.002095 0.486960 0.056083 0.996437 -0.214016 -0.325961
11.200000 -1.969307 0.479315 0.052415 0.996662 -0.225875 -0.301244
11.233333 -1.936065 0.470051 0.036016 0.997774 -0.236011 -0.266243
11.266667 -1.902733 0.460847 0.028398 0.999425 -0.244210 -0.221818
11.300000 -1.869319 0.451715 0.015160 1.001298 -0.250400 -0.169357
11.333333 -1.835833 0.442670 0.011168 1.002919 -0.254393 -0.113374
11.366667 -1.802281 0.433724 0.002044 1.003510 -0.255948 -0.052709
11.400000 -1.768674 0.424890 -0.001637 1.002234 -0.255102 0.012545
11.433333 -1.735019 0.416181 0.012292 0.998245 -0.252092 0.077134
11.466667 -1.701325 0.407610 0.031945 0.990758 -0.247061 0.138051
11.500000 -1.667600 0.399190 0.017070 0.979012 -0.240228 0.191046
11.533333 -1.633852 0.390935 0.018441 0.963021 -0.232156 0.235682
11.566667 -1.600089 0.382857 0.034418 0.943546 -0.223699 0.268278
11.600000 -1.566320 0.374970 0.044749 0.921513 -0.215728 0.286725
11.633333 -1.532552 0.367286 0.076241 0.898247 -0.209078 0.291282
11.666667 -1.502936 0.360973 0.095127 0.875549 -0.204796 0.286132
11.700000 -1.477001 0.355552 0.102868 0.855605 -0.203885 0.268444
11.733333 -1.451078 0.350370 0.104235 0.840271 -0.206971 0.241022
11.766667 -1.426870 0.345216 0.118318 0.830968 -0.214250 0.205955
11.800000 -1.402669 0.340322 0.116657 0.828849 -0.225601 0.166797
11.833333 -1.378206 0.334811 0.131694 0.834616 -0.240558 0.127311
11.866667 -1.352814 0.327770 0.128827 0.847924 -0.258079 0.089850
11.900000 -1.325839 0.318907 0.130591 0.867402 -0.276605 0.061837
11.933333 -1.297266 0.308489 0.120687 0.891224 -0.294334 0.045035
11.966667 -1.267043 0.296682 0.123204 0.917249 -0.309367 0.043233
12.000000 -1.235202 0.283869 0.131717 0.943361 -0.319698 0.055542
12.033333 -1.201942 0.270776 0.120583 0.967628 -0.323451 0.082350
12.066667 -1.166588 0.257766 0.124232 0.988714 -0.319171 0.116422
12.100000 -1.131259 0.245170 0.118105 1.006096 -0.306262 0.151626
12.133333 -1.095962 0.233009 0.113575 1.019873 -0.284833 0.182467
12.166667 -1.060707 0.221305 0.115642 1.030602 -0.255609 0.203022
12.200000 -1.025503 0.210079 0.141608 1.039057 -0.219849 0.210260
12.233333 -0.991067 0.201673 0.164769 1.045994 -0.179277 0.199693
12.266667 -0.957209 0.196007 0.184820 1.052128 -0.135847 0.175436
12.300000 -0.923626 0.192896 0.206614 1.057889 -0.091302 0.140366
12.333333 -0.889809 0.192145 0.218943 1.063243 -0.047231 0.097577
12.366667 -0.854591 0.193315 0.215509 1.067758 -0.005008 0.051362
12.400000 -0.817860 0.195883 0.200364 1.070630 0.034213 0.008080
12.433333 -0.781237 0.199021 0.182340 1.070845 0.069901 -0.025672
12.466667 -0.743589 0.202884 0.169490 1.067345 0.101989 -0.046958
12.500000 -0.706073 0.207330 0.159236 1.059270 0.130727 -0.053378
12.533333 -0.668698 0.212366 0.159336 1.046052 0.156694 -0.041944
12.566667 -0.632093 0.218007 0.157018 1.027673 0.180678 -0.011699
12.600000 -0.596691 0.224232 0.160024 1.004545 0.203806 0.034234
12.633333 -0.562835 0.231195 0.171140 0.977520 0.227171 0.092247
12.666667 -0.529992 0.238705 0.174017 0.947668 0.251707 0.160307
12.700000 -0.498812 0.246964 0.178174 0.916070 0.278446 0.236364
12.733333 -0.469366 0.256150 0.183791 0.883843 0.308235 0.314894
12.766667 -0.442516 0.266768 0.186276 0.851972 0.341985 0.392351
12.800000 -0.415864 0.278010 0.193353 0.821458 0.380246 0.466733
12.833333 -0.389411 0.289876 0.202448 0.793149 0.423235 0.535278
12.866667 -0.363155 0.302368 0.227807 0.767658 0.471140 0.591467
12.900000 -0.337098 0.315486 0.264505 0.745383 0.523633 0.628201
12.933333 -0.313494 0.332206 0.297397 0.726833 0.580436 0.645014
12.966667 -0.291142 0.353191 0.331720 0.712214 0.640627 0.637092
13.000000 -0.268983 0.374790 0.367106 0.701476 0.703153 0.600948
13.033333 -0.247224 0.400196 0.396035 0.694560 0.766757 0.536927
13.066667 -0.225651 0.426197 0.395335 0.691472 0.830187 0.451754
13.100000 -0.204027 0.455599 0.425713 0.692409 0.892331 0.353301
13.133333 -0.181688 0.487828 0.447772 0.696973 0.951952 0.245339
13.166667 -0.158283 0.522854 0.449614 0.704699 1.008406 0.137371
13.200000 -0.135050 0.558406 0.441861 0.715215 1.061284 0.038394
13.233333 -0.111986 0.594460 0.423552 0.727901 1.110602 -0.044040
13.266667 -0.086905 0.634016 0.412965 0.741989 1.156262 -0.109294
13.300000 -0.061993 0.674027 0.406284 0.756520 1.198401 -0.153922
13.333333 -0.037249 0.714466 0.399915 0.770822 1.237407 -0.174500
13.366667 -0.010798 0.757100 0.395249 0.784264 1.273607 -0.175452
13.400000 0.015481 0.800106 0.376540 0.796171 1.307238 -0.158967
13.433333 0.042923 0.844869 0.366588 0.805935 1.338307 -0.130503
13.466667 0.071288 0.891139 0.353246 0.813152 1.366961 -0.090529
13.500000 0.099470 0.937687 0.359243 0.817515 1.393232 -0.044450
13.533333 0.127724 0.985025 0.360947 0.818818 1.416895 0.003619
13.566667 0.155786 1.032576 0.373329 0.817261 1.437810 0.054753
13.600000 0.184058 1.081891 0.367482 0.813034 1.455751 0.106092
13.633333 0.212125 1.131350 0.376503 0.806215 1.470437 0.155576
13.666667 0.239362 1.181684 0.383890 0.796974 1.481603 0.200764
13.700000 0.265232 1.232249 0.375457 0.785577 1.488974 0.243897
13.733333 0.290884 1.282848 0.391146 0.771963 1.492049 0.282231
13.766667 0.316316 1.333444 0.410683 0.755822 1.490194 0.314931
13.800000 0.341524 1.384000 0.419184 0.736912 1.483044 0.338351
13.833333 0.366504 1.434478 0.432070 0.715559 1.470719 0.352621
13.866667 0.391254 1.484843 0.447300 0.691638 1.452997 0.355850
13.900000 0.415771 1.535057 0.460909 0.664833 1.429693 0.341579
13.933333 0.440051 1.585084 0.480054 0.635455 1.401349 0.312063
13.966667 0.460044 1.631315 0.492651 0.604156 1.368813 0.265924
14.000000 0.479798 1.677290 0.509715 0.571456 1.332471 0.208021
14.033333 0.499317 1.722976 0.526222 0.537541 1.292413 0.138698
14.066667 0.514732 1.763711 0.522294 0.503489 1.249801 0.063191
14.100000 0.529919 1.804098 0.538015 0.470536 1.205535 -0.011642
14.133333 0.544885 1.844112 0.518376 0.439596 1.160130 -0.082883
14.166667 0.559635 1.883725 0.510470 0.411023 1.113347 -0.148287
14.200000 0.571067 1.918444 0.500513 0.385803 1.065905 -0.207751
14.233333 0.582301 1.952717 0.479613 0.365141 1.018504 -0.256890
14.266667 0.593345 1.986521 0.473065 0.349333 0.970698 -0.300567
14.300000 0.604210 2.019838 0.460258 0.338885 0.922526 -0.341768
14.333333 0.613721 2.048639 0.454356 0.334397 0.874362 -0.384339
14.366667 0.623074 2.076917 0.429827 0.336560 0.827200 -0.430441
14.400000 0.632279 2.104657 0.428694 0.345507 0.781053 -0.484810
14.433333 0.642089 2.128844 0.432750 0.361226 0.736148 -0.554029
14.466667 0.651773 2.152468 0.416341 0.384021 0.693097 -0.636511
14.500000 0.662775 2.173566 0.388410 0.413454 0.652456 -0.729504
14.533333 0.675780 2.193126 0.361873 0.449016 0.614186 -0.829876
14.566667 0.691377 2.211840 0.332327 0.490092 0.578105 -0.931820
14.600000 0.706876 2.229959 0.298194 0.535819 0.544409 -1.024195
14.633333 0.726345 2.247282 0.260739 0.584595 0.512939 -1.096401
14.666667 0.745720 2.264000 0.240829 0.634814 0.483532 -1.143926
14.700000 0.764998 2.280107 0.175734 0.685444 0.455681 -1.164946
14.733333 0.789188 2.294843 0.107569 0.734575 0.429004 -1.156998
14.766667 0.817753 2.308057 0.056359 0.780373 0.403150 -1.123247
14.800000 0.846201 2.320651 0.001065 0.821097 0.377779 -1.072046
14.833333 0.874519 2.332624 -0.031502 0.855600 0.352536 -1.014574
14.866667 0.906456 2.343945 -0.051703 0.882066 0.326917 -0.955416
14.900000 0.938235 2.354642 -0.072649 0.898278 0.300376 -0.899836
14.933333 0.971808 2.364278 -0.090598 0.903407 0.272590 -0.854671
14.966667 1.005187 2.373291 -0.102735 0.897161 0.243108 -0.823593
15.000000 1.038353 2.381682 -0.118669 0.879179 0.211218 -0.804263
15.033333 1.071288 2.389452 -0.146518 0.849580 0.176530 -0.786634
15.066667 1.100552 2.395211 -0.158434 0.809730 0.138935 -0.767779
15.100000 1.129551 2.400355 -0.189867 0.761588 0.098728 -0.744957
15.133333 1.158270 2.404885 -0.246003 0.706751 0.056081 -0.715346
15.166667 1.181886 2.406979 -0.306794 0.646847 0.011395 -0.673103
15.200000 1.200849 2.406600 -0.335195 0.584360 -0.034315 -0.621589
15.233333 1.216014 2.403220 -0.340178 0.521666 -0.079988 -0.570223
15.266667 1.230871 2.399259 -0.334002 0.460696 -0.124652 -0.521262
15.300000 1.245419 2.394729 -0.359257 0.403083 -0.167539 -0.471922
15.333333 1.256742 2.386927 -0.364997 0.350763 -0.207740 -0.420073
15.366667 1.267760 2.378584 -0.354028 0.304865 -0.244656 -0.367209
15.400000 1.273690 2.367955 -0.351208 0.265940 -0.278082 -0.305543
15.433333 1.279326 2.356819 -0.355077 0.234280 -0.308288 -0.226893
15.466667 1.284678 2.345194 -0.385336 0.210387 -0.335586 -0.128352
15.500000 1.289755 2.333100 -0.422028 0.195103 -0.360302 -0.013158
15.533333 1.294565 2.320556 -0.469528 0.188325 -0.382974 0.117349
15.566667 1.299117 2.307581 -0.481692 0.190340 -0.403987 0.258784
15.600000 1.303422 2.294193 -0.464919 0.201235 -0.423738 0.399476
15.633333 1.307487 2.280413 -0.417593 0.220717 -0.442284 0.527500
15.666667 1.314016 2.264786 -0.370148 0.247718 -0.459304 0.631546
15.700000 1.320321 2.248808 -0.315806 0.280468 -0.474455 0.700495
15.733333 1.326409 2.232501 -0.267916 0.317657 -0.487291 0.723944
15.766667 1.336238 2.215057 -0.226778 0.357643 -0.497303 0.700521
15.800000 1.349852 2.197215 -0.215711 0.398267 -0.503873 0.638474
15.833333 1.367422 2.178979 -0.173660 0.437192 -0.506239 0.549353
15.866667 1.384773 2.160503 -0.156735 0.472441 -0.504188 0.445944
15.900000 1.401898 2.141811 -0.158867 0.502387 -0.497520 0.343499
15.933333 1.421695 2.124481 -0.172929 0.524943 -0.485981 0.256647
15.966667 1.441249 2.106979 -0.171496 0.538389 -0.469214 0.193434
16.000000 1.462045 2.092212 -0.187718 0.541983 -0.447421 0.153746
16.033333 1.482575 2.077313 -0.181905 0.536007 -0.421242 0.132278
16.066667 1.502828 2.062301 -0.183166 0.521009 -0.391345 0.124695
16.100000 1.522793 2.047192 -0.181820 0.497240 -0.358039 0.125461
16.133333 1.541330 2.034551 -0.178508 0.465988 -0.321966 0.127426
16.166667 1.557656 2.024310 -0.134664 0.428980 -0.284402 0.124366
16.200000 1.571541 2.016346 -0.132948 0.387847 -0.245842 0.111686
16.233333 1.585102 2.008342 -0.127856 0.343715 -0.206564 0.092855
16.266667 1.595651 2.002584 -0.129115 0.297802 -0.166811 0.067183
16.300000 1.602246 1.999757 -0.120743 0.252291 -0.127895 0.032943
16.333333 1.608512 1.996910 -0.123003 0.208711 -0.090647 -0.010526
16.366667 1.614449 1.994046 -0.131353 0.167973 -0.055238 -0.058569
16.400000 1.620060 1.991170 -0.151418 0.130646 -0.022503 -0.104804
16.433333 1.621700 1.992667 -0.153512 0.097496 0.006095 -0.151174
16.466667 1.623022 1.994152 -0.161225 0.068667 0.029171 -0.193467
16.500000 1.624032 1.995626 -0.138428 0.043280 0.046401 -0.228209
16.533333 1.623484 2.000362 -0.156160 0.020567 0.056805 -0.244444
16.566667 1.622638 2.005079 -0.139556 -0.000083 0.059208 -0.243907
16.600000 1.621965 2.010195 -0.171504 -0.019152 0.052940 -0.229593
16.633333 1.621681 2.014114 -0.197950 -0.037615 0.038671 -0.200049
16.666667 1.621124 2.017998 -0.242999 -0.055989 0.017421 -0.156954
16.700000 1.620300 2.021841 -0.244514 -0.074417 -0.010052 -0.099363
16.733333 1.618402 2.022410 -0.240876 -0.092944 -0.041662 -0.040530
16.766667 1.615029 2.019760 -0.229077 -0.111512 -0.075051 0.016141
16.800000 1.610276 2.014250 -0.228824 -0.129880 -0.107653 0.067320
16.833333 1.605293 2.008701 -0.230556 -0.147435 -0.137676 0.108609
16.866667 1.599110 2.001034 -0.191334 -0.163587 -0.163443 0.131986
16.900000 1.592720 1.993341 -0.160854 -0.177781 -0.183429 0.133851
16.933333 1.585669 1.984611 -0.161891 -0.189425 -0.196951 0.121282
16.966667 1.578083 1.975549 -0.154615 -0.197892 -0.203533 0.100971
17.000000 1.570390 1.966816 -0.173194 -0.202826 -0.203320 0.080598
17.033333 1.562728 1.958942 -0.177600 -0.203765 -0.196341 0.062514
17.066667 1.555857 1.953034 -0.176334 -0.200488 -0.183112 0.055969
17.100000 1.548858 1.947144 -0.184453 -0.192761 -0.164086 0.064010
17.133333 1.541742 1.941276 -0.186052 -0.180657 -0.140400 0.080812
17.166667 1.534523 1.935436 -0.186994 -0.164645 -0.113598 0.099739
17.200000 1.527213 1.929628 -0.199062 -0.145088 -0.085193 0.110075
17.233333 1.519822 1.923857 -0.193044 -0.122786 -0.057017 0.110670
17.266667 1.515541 1.922743 -0.170849 -0.098626 -0.030969 0.097048
17.300000 1.513799 1.925343 -0.136977 -0.073717 -0.009252 0.063976
17.333333 1.512003 1.927980 -0.097999 -0.049186 0.006750 0.012681
17.366667 1.512723 1.932178 -0.106342 -0.026126 0.015866 -0.052097
17.400000 1.513396 1.936403 -0.123140 -0.005664 0.017362 -0.121999
17.433333 1.514027 1.940646 -0.140708 0.011341 0.010984 -0.191450
17.466667 1.516551 1.942832 -0.163376 0.024447 -0.002372 -0.253527
17.500000 1.519035 1.945026 -0.170836 0.033647 -0.021192 -0.298578
17.533333 1.521503 1.944178 -0.194554 0.039100 -0.043874 -0.316348
17.566667 1.523534 1.940842 -0.210967 0.041427 -0.068349 -0.308656
17.600000 1.524800 1.935346 -0.227334 0.041367 -0.092520 -0.277690
17.633333 1.526028 1.929859 -0.250706 0.039658 -0.114570 -0.226979
17.666667 1.527218 1.924384 -0.262366 0.037038 -0.133591 -0.162587
17.700000 1.528372 1.918927 -0.253451 0.034073 -0.148871 -0.090852
17.733333 1.529192 1.912900 -0.250813 0.031399 -0.159974 -0.023520
17.766667 1.529979 1.906898 -0.242406 0.029406 -0.166765 0.036708
17.800000 1.530733 1.900926 -0.241036 0.028335 -0.169521 0.090434
17.833333 1.531456 1.894989 -0.237737 0.028411 -0.168151 0.136648
17.866667 1.532150 1.889090 -0.218588 0.029692 -0.162396 0.175325
17.900000 1.532816 1.883234 -0.215803 0.032188 -0.152093 0.208405
17.933333 1.533455 1.877426 -0.207902 0.035776 -0.137305 0.240611
17.966667 1.534436 1.870841 -0.199231 0.040244 -0.118325 0.275866
18.000000 1.535392 1.864312 -0.197037 0.045414 -0.095304 0.310106
18.033333 1.536843 1.859230 -0.185408 0.050972 -0.069096 0.339723
18.066667 1.538761 1.856443 -0.187344 0.056493 -0.040814 0.365986
18.100000 1.541057 1.856688 -0.190224 0.061486 -0.011972 0.386305
18.133333 1.543327 1.856997 -0.152520 0.065468 0.016021 0.396110
18.166667 1.546070 1.860212 -0.123235 0.067995 0.041479 0.389788
18.200000 1.548784 1.863484 -0.100708 0.068597 0.062605 0.367640
18.233333 1.551927 1.868437 -0.079983 0.066894 0.077850 0.333184
18.266667 1.555038 1.873433 -0.067425 0.062635 0.086018 0.284135
18.300000 1.557867 1.878331 -0.053427 0.055622 0.086441 0.219124
18.333333 1.560352 1.882869 -0.051624 0.045797 0.078745 0.143310
18.366667 1.562312 1.886924 -0.063356 0.033284 0.063455 0.064704
18.400000 1.563414 1.890208 -0.057158 0.018434 0.041523 -0.012079
18.433333 1.564476 1.893502 -0.057953 0.001794 0.014418 -0.086005
18.466667 1.564793 1.895279 -0.061208 -0.015956 -0.016196 -0.154248
18.500000 1.564398 1.894977 -0.077342 -0.033991 -0.048508 -0.210179
18.533333 1.563003 1.892552 -0.088298 -0.051453 -0.080594 -0.253238
18.566667 1.560590 1.888031 -0.098086 -0.067476 -0.110691 -0.287115
18.600000 1.557054 1.881642 -0.100037 -0.081295 -0.137155 -0.314673
18.633333 1.552525 1.873812 -0.116264 -0.092258 -0.158626 -0.333057
18.666667 1.547974 1.865999 -0.139116 -0.099859 -0.174092 -0.341134
18.700000 1.543274 1.857840 -0.150862 -0.103756 -0.182975 -0.343682
18.733333 1.538846 1.850083 -0.155891 -0.103859 -0.185319 -0.341261
18.766667 1.534852 1.842927 -0.181917 -0.100418 -0.181760 -0.331915
18.800000 1.530859 1.835816 -0.188412 -0.093927 -0.173353 -0.311560
18.833333 1.526870 1.828756 -0.187556 -0.085014 -0.161357 -0.284319
18.866667 1.523655 1.823234 -0.200125 -0.074451 -0.147169 -0.251738
18.900000 1.521451 1.818961 -0.208807 -0.063067 -0.132157 -0.214760
18.933333 1.520155 1.815935 -0.234081 -0.051674 -0.117354 -0.173869
18.966667 1.518879 1.812977 -0.236011 -0.040842 -0.103403 -0.133614
19.000000 1.518435 1.810916 -0.237214 -0.031044 -0.090758 -0.098672
19.033333 1.518013 1.808925 -0.242114 -0.022661 -0.079732 -0.068507
19.066667 1.518061 1.806778 -0.232430 -0.015897 -0.070299 -0.046861
19.100000 1.518132 1.804704 -0.232746 -0.010759 -0.062239 -0.030644
19.133333 1.518227 1.802704 -0.225661 -0.007059 -0.055257 -0.023197
19.166667 1.518262 1.800731 -0.220455 -0.004633 -0.049148 -0.022127
19.200000 1.518323 1.798836 -0.205037 -0.003180 -0.043567 -0.027686
19.233333 1.518303 1.797236 -0.228330 -0.002390 -0.038234 -0.036565
19.266667 1.518050 1.796138 -0.228375 -0.001961 -0.033071 -0.045488
19.300000 1.517841 1.795384 -0.234592 -0.001688 -0.028105 -0.054443
