t x y theta dxdt dydt dthetadt
0.000000 0.000000 0.000000 0.538624 -0.130776 -0.003806 0.263280
0.033333 -0.004361 -0.000313 0.530173 -0.131861 0.003543 0.249103
0.066667 -0.008792 -0.000165 0.531100 -0.132988 0.011739 0.235991
0.100000 -0.013298 0.000532 0.547542 -0.134124 0.020522 0.225119
0.133333 -0.017894 0.001867 0.549625 -0.135262 0.029802 0.219452
0.166667 -0.022456 0.003141 0.568009 -0.136434 0.039731 0.223056
0.200000 -0.026984 0.004364 0.580580 -0.137697 0.050587 0.242164
0.233333 -0.031643 0.006455 0.584184 -0.139071 0.062435 0.280207
0.266667 -0.036270 0.008508 0.590530 -0.140591 0.075431 0.339760
0.300000 -0.040865 0.010530 0.588955 -0.142285 0.089673 0.424315
0.333333 -0.045428 0.012528 0.592496 -0.144150 0.105103 0.532844
0.366667 -0.050180 0.015757 0.589481 -0.146145 0.121396 0.662403
0.400000 -0.054901 0.018972 0.604970 -0.148221 0.138190 0.807121
0.433333 -0.059837 0.023597 0.624975 -0.150343 0.155223 0.961719
0.466667 -0.064995 0.029721 0.661594 -0.152482 0.172169 1.121624
0.500000 -0.070395 0.037389 0.723929 -0.154633 0.188735 1.277208
0.533333 -0.075762 0.045053 0.785096 -0.156799 0.204698 1.421022
0.566667 -0.081095 0.052712 0.843893 -0.158981 0.219925 1.546288
0.600000 -0.086394 0.060366 0.905529 -0.161211 0.234364 1.649511
0.633333 -0.091658 0.068013 0.966282 -0.163548 0.248123 1.725988
0.666667 -0.096885 0.075652 1.026362 -0.166054 0.261415 1.768466
0.700000 -0.102456 0.084754 1.086141 -0.168737 0.274391 1.776230
0.733333 -0.107989 0.093844 1.142037 -0.171603 0.287202 1.751140
0.766667 -0.113482 0.102920 1.203651 -0.174672 0.300019 1.693246
0.800000 -0.119344 0.113246 1.281406 -0.177866 0.312749 1.601057
0.833333 -0.125574 0.124737 1.349294 -0.181051 0.325086 1.477114
0.866667 -0.131759 0.136201 1.399622 -0.184049 0.336573 1.330665
0.900000 -0.137896 0.147633 1.458721 -0.186757 0.346971 1.193016
0.933333 -0.144367 0.159960 1.510622 -0.189041 0.355962 1.070607
0.966667 -0.150784 0.172242 1.542984 -0.190773 0.363215 0.973376
1.000000 -0.157492 0.185238 1.542984 -0.191900 0.368624 0.917941
1.033333 -0.164140 0.198174 1.542984 -0.192436 0.372249 0.914844
1.066667 -0.170726 0.211040 1.542984 -0.192428 0.374218 0.968088
1.100000 -0.177246 0.223829 1.542984 -0.191881 0.374482 1.031602
1.133333 -0.183698 0.236533 1.542984 -0.190857 0.373089 1.102637
1.166667 -0.190076 0.249143 1.542984 -0.189386 0.370046 1.170053
1.200000 -0.196380 0.261652 1.542984 -0.187510 0.365303 1.213103
1.233333 -0.202605 0.274051 1.852630 -0.185219 0.358686 1.184411
1.266667 -0.208748 0.286333 1.880881 -0.182502 0.350024 1.060243
1.300000 -0.214897 0.298277 1.908953 -0.179344 0.339171 0.836178
1.333333 -0.220958 0.310087 1.962598 -0.175719 0.326036 0.485737
1.366667 -0.226937 0.321354 1.981727 -0.171634 0.310692 -0.002259
1.400000 -0.232822 0.332474 1.989166 -0.167102 0.293326 -0.634546
1.433333 -0.238520 0.342797 1.997207 -0.162172 0.274323 -1.350909
1.466667 -0.243986 0.352192 1.972805 -0.156891 0.254047 -2.126052
1.500000 -0.249188 0.360515 1.892166 -0.151351 0.233051 -2.913362
1.533333 -0.254095 0.367651 1.828237 -0.145631 0.211834 -3.658842
1.566667 -0.258710 0.373519 1.675513 -0.139809 0.190844 -4.310715
1.600000 -0.263215 0.379211 1.484186 -0.133918 0.170380 -4.811523
1.633333 -0.267439 0.383511 1.224713 -0.127979 0.150643 -5.131523
1.666667 -0.271547 0.387632 0.935476 -0.121983 0.131830 -5.225273
1.700000 -0.275539 0.391574 0.663457 -0.115843 0.113844 -5.073679
1.733333 -0.279412 0.395337 0.408567 -0.109484 0.096570 -4.668003
1.766667 -0.283164 0.398920 0.195318 -0.102802 0.079744 -4.024501
1.800000 -0.286599 0.401239 0.027883 -0.095735 0.063260 -3.182062
1.833333 -0.289911 0.403381 -0.076548 -0.088163 0.046804 -2.205025
1.866667 -0.292808 0.404430 -0.153863 -0.080027 0.030171 -1.178166
1.900000 -0.295580 0.405306 -0.186936 -0.071324 0.013291 -0.180519
1.933333 -0.297866 0.405246 -0.149471 -0.062074 -0.003831 0.709298
1.966667 -0.300026 0.405018 -0.032258 -0.052295 -0.021152 1.428646
2.000000 -0.301640 0.403936 0.157324 -0.042033 -0.038740 1.932399
2.033333 -0.302698 0.401993 0.354404 -0.031455 -0.056389 2.196428
2.066667 -0.303628 0.399896 0.520460 -0.020692 -0.074024 2.228775
2.100000 -0.304432 0.397651 0.642609 -0.009894 -0.091516 2.051301
2.133333 -0.304678 0.394548 0.728409 0.000812 -0.108804 1.703911
2.166667 -0.304390 0.390611 0.826575 0.011240 -0.125689 1.238119
2.200000 -0.303604 0.385861 0.832627 0.021233 -0.141902 0.716575
2.233333 -0.302375 0.380321 0.813122 0.030725 -0.157306 0.200759
2.266667 -0.301028 0.374670 0.762453 0.039630 -0.171671 -0.262399
2.300000 -0.299342 0.368313 0.679147 0.047882 -0.184767 -0.635453
2.333333 -0.297359 0.361306 0.604892 0.055443 -0.196377 -0.899795
2.366667 -0.295268 0.354218 0.540938 0.062342 -0.206396 -1.046620
2.400000 -0.292908 0.346627 0.491397 0.068637 -0.214789 -1.088306
2.433333 -0.290447 0.338977 0.433934 0.074383 -0.221560 -1.044648
2.466667 -0.287888 0.331276 0.401382 0.079641 -0.226717 -0.938582
2.500000 -0.285083 0.323322 0.381259 0.084479 -0.230364 -0.795064
2.533333 -0.282187 0.315340 0.358219 0.088953 -0.232593 -0.633132
2.566667 -0.279051 0.307260 0.351792 0.093063 -0.233435 -0.472987
2.600000 -0.275832 0.299175 0.349745 0.096806 -0.232940 -0.325187
2.633333 -0.272410 0.291168 0.342976 0.100135 -0.231050 -0.195290
2.666667 -0.268913 0.283178 0.343468 0.103013 -0.227782 -0.084082
2.700000 -0.265285 0.275436 0.349101 0.105414 -0.223153 0.010059
2.733333 -0.261591 0.267734 0.356669 0.107311 -0.217225 0.086956
2.766667 -0.257835 0.260081 0.348881 0.108702 -0.210073 0.150348
2.800000 -0.254063 0.252921 0.353925 0.109575 -0.201776 0.202012
2.833333 -0.250238 0.245831 0.367012 0.109976 -0.192527 0.243417
2.866667 -0.246457 0.239371 0.383375 0.109920 -0.182431 0.274198
2.900000 -0.242761 0.233618 0.391982 0.109433 -0.171594 0.300249
2.933333 -0.239025 0.227963 0.406563 0.108500 -0.159979 0.333357
2.966667 -0.235467 0.223173 0.419348 0.107158 -0.147729 0.384700
3.000000 -0.231877 0.218497 0.437006 0.105413 -0.134826 0.464572
3.033333 -0.228259 0.213942 0.451975 0.103213 -0.121112 0.583033
3.066667 -0.224617 0.209515 0.461472 0.100535 -0.106453 0.750892
3.100000 -0.221307 0.206256 0.459042 0.097360 -0.090717 0.961204
3.133333 -0.217980 0.203136 0.461554 0.093734 -0.073962 1.192150
3.166667 -0.214639 0.200164 0.481695 0.089640 -0.056037 1.412938
3.200000 -0.211687 0.198516 0.490432 0.085130 -0.037015 1.598377
3.233333 -0.208727 0.197024 0.555198 0.080284 -0.017048 1.716836
3.266667 -0.206162 0.196826 0.675708 0.075241 0.003503 1.733387
3.300000 -0.203595 0.196790 0.818301 0.070090 0.024402 1.633705
3.333333 -0.201368 0.197970 0.937800 0.064893 0.045525 1.423861
3.366667 -0.199458 0.200333 1.068025 0.059753 0.066602 1.125037
3.400000 -0.197846 0.203829 1.174828 0.054757 0.087396 0.759378
3.433333 -0.196238 0.207486 1.192035 0.049974 0.107683 0.369417
3.466667 -0.194635 0.211301 1.142649 0.045385 0.127511 0.013387
3.500000 -0.193038 0.215272 1.047547 0.041000 0.146841 -0.258831
3.533333 -0.191748 0.220413 0.960199 0.036807 0.165608 -0.414122
3.566667 -0.190752 0.226801 0.868870 0.032730 0.183924 -0.429617
3.600000 -0.189763 0.233333 0.772447 0.028619 0.202143 -0.295712
3.633333 -0.188782 0.240005 0.726286 0.024367 0.220489 -0.030092
3.666667 -0.188102 0.248131 0.708907 0.019926 0.238980 0.328265
3.700000 -0.187430 0.256383 0.733000 0.015247 0.257633 0.731841
3.733333 -0.186765 0.264754 0.811556 0.010310 0.276455 1.137328
3.766667 -0.186519 0.274569 0.911709 0.005179 0.295240 1.500582
3.800000 -0.186279 0.284486 1.029932 0.000010 0.313518 1.786611
3.833333 -0.186044 0.294495 1.136276 -0.005089 0.330974 1.977406
3.866667 -0.186255 0.305815 1.224437 -0.010026 0.347414 2.067108
3.900000 -0.186895 0.318383 1.310525 -0.014671 0.362546 2.062260
3.933333 -0.187952 0.332125 1.368929 -0.018873 0.376003 1.979538
3.966667 -0.189008 0.345912 1.432550 -0.022560 0.387650 1.840143
4.000000 -0.190060 0.359732 1.499571 -0.025697 0.397446 1.665981
4.033333 -0.191106 0.373570 1.545110 -0.028214 0.405253 1.476298
4.066667 -0.192143 0.387412 1.591847 -0.030089 0.411006 1.286455
4.100000 -0.193169 0.401245 1.623262 -0.031370 0.414841 1.109454
4.133333 -0.194182 0.415053 1.659456 -0.032178 0.417080 0.945877
4.166667 -0.195388 0.429371 1.686327 -0.032579 0.417890 0.798267
4.200000 -0.196574 0.443635 1.705360 -0.032643 0.417441 0.667089
4.233333 -0.197739 0.457832 1.711419 -0.032442 0.415892 0.551951
4.266667 -0.198879 0.471947 1.730785 -0.032018 0.413342 0.451583
4.300000 -0.199992 0.485964 1.733930 -0.031376 0.409794 0.363375
4.333333 -0.201074 0.499869 1.744925 -0.030469 0.405047 0.287986
4.366667 -0.202128 0.513535 1.752708 -0.029283 0.399000 0.221615
4.400000 -0.203116 0.526813 1.761100 -0.027808 0.391576 0.159795
4.433333 -0.204064 0.539935 1.767040 -0.026037 0.382698 0.092919
4.466667 -0.204971 0.552887 1.763974 -0.023960 0.372270 0.012925
4.500000 -0.205834 0.565655 1.769131 -0.021544 0.360051 -0.093267
4.533333 -0.206649 0.578226 1.763733 -0.018771 0.345880 -0.239949
4.566667 -0.207262 0.589686 1.769039 -0.015593 0.329461 -0.442183
4.600000 -0.207823 0.600921 1.765610 -0.011960 0.310462 -0.712864
4.633333 -0.208329 0.611920 1.766515 -0.007855 0.288758 -1.056074
4.666667 -0.208541 0.621320 1.745937 -0.003280 0.264340 -1.470480
4.700000 -0.208693 0.630461 1.725148 0.001712 0.237497 -1.944221
4.733333 -0.208783 0.639330 1.687107 0.007081 0.208584 -2.454076
4.766667 -0.208534 0.646228 1.614003 0.012788 0.178139 -2.965901
4.800000 -0.208220 0.652837 1.506949 0.018792 0.146725 -3.441096
4.833333 -0.207542 0.657385 1.376165 0.025049 0.114910 -3.843661
4.866667 -0.206501 0.659863 1.175341 0.031532 0.083186 -4.140305
4.900000 -0.205096 0.660286 0.964503 0.038270 0.051965 -4.304873
4.933333 -0.203620 0.660398 0.737877 0.045294 0.021678 -4.323558
4.966667 -0.202074 0.660198 0.532479 0.052656 -0.007447 -4.198255
5.000000 -0.200457 0.659684 0.342714 0.060408 -0.035179 -3.942291
5.033333 -0.198769 0.658855 0.194596 0.068651 -0.061584 -3.576918
5.066667 -0.196500 0.656304 0.075955 0.077471 -0.086794 -3.135778
5.100000 -0.193577 0.652128 0.008849 0.086838 -0.110970 -2.656411
5.133333 -0.190583 0.647640 -0.034954 0.096639 -0.134249 -2.178245
5.166667 -0.187519 0.642841 -0.067324 0.106718 -0.156625 -1.731376
5.200000 -0.184387 0.637734 -0.103021 0.116914 -0.178092 -1.339472
5.233333 -0.180475 0.631386 -0.118734 0.126985 -0.198421 -1.017114
5.266667 -0.175771 0.623902 -0.145432 0.136687 -0.217402 -0.763674
5.300000 -0.170268 0.615358 -0.145432 0.145880 -0.234902 -0.573760
5.333333 -0.164707 0.606524 -0.145432 0.154508 -0.250842 -0.432691
5.366667 -0.159090 0.597408 -0.145432 0.162485 -0.265164 -0.331114
5.400000 -0.153422 0.588017 -0.168347 0.169723 -0.277788 -0.258966
5.433333 -0.147706 0.578356 -0.168347 0.176256 -0.288795 -0.215152
5.466667 -0.141946 0.568434 -0.204826 0.182193 -0.298285 -0.205896
5.500000 -0.135546 0.558098 -0.193560 0.187572 -0.306369 -0.246597
5.533333 -0.129110 0.547514 -0.196996 0.192384 -0.313185 -0.360818
5.566667 -0.122644 0.536691 -0.189841 0.196606 -0.318907 -0.573590
5.600000 -0.116151 0.525637 -0.182697 0.200219 -0.323751 -0.904315
5.633333 -0.109250 0.514492 -0.178910 0.203066 -0.327854 -1.347233
5.666667 -0.102072 0.503320 -0.187998 0.204905 -0.331296 -1.880321
5.700000 -0.094758 0.492180 -0.193892 0.205632 -0.334181 -2.451130
5.733333 -0.087477 0.481103 -0.221310 0.205164 -0.336617 -2.985420
5.766667 -0.080197 0.469833 -0.310537 0.203529 -0.338741 -3.394109
5.800000 -0.072923 0.458377 -0.449754 0.200750 -0.340667 -3.597804
5.833333 -0.066088 0.447031 -0.682801 0.197052 -0.342544 -3.541848
5.866667 -0.059271 0.435515 -0.994493 0.192704 -0.344491 -3.197843
5.900000 -0.053043 0.424114 -1.343138 0.187960 -0.346569 -2.566116
5.933333 -0.046842 0.412556 -1.610085 0.183066 -0.348798 -1.689960
5.966667 -0.041267 0.401045 -1.738499 0.178270 -0.351190 -0.640061
6.000000 -0.035726 0.389393 -1.722631 0.173778 -0.353765 0.498319
6.033333 -0.030222 0.377605 -1.591536 0.169594 -0.356501 1.628613
6.066667 -0.024760 0.365689 -1.335522 0.165700 -0.359391 2.654076
6.100000 -0.019342 0.353652 -1.061449 0.161930 -0.362408 3.480638
6.133333 -0.013973 0.341502 -0.791650 0.158119 -0.365550 4.053414
6.166667 -0.008655 0.329246 -0.543963 0.153960 -0.368786 4.345627
6.200000 -0.003393 0.316891 -0.362252 0.149200 -0.372074 4.367277
6.233333 0.001810 0.304445 -0.196513 0.143673 -0.375379 4.156707
6.266667 0.006952 0.291916 -0.107876 0.137218 -0.378666 3.783598
6.300000 0.012027 0.279310 -0.002101 0.129781 -0.381908 3.322098
6.333333 0.016502 0.266521 0.082739 0.121351 -0.385069 2.834314
6.366667 0.020358 0.253552 0.148690 0.112078 -0.388101 2.371427
6.400000 0.024140 0.240530 0.205613 0.102143 -0.390955 1.960071
6.433333 0.027308 0.227356 0.242646 0.091783 -0.393569 1.618186
6.466667 0.030399 0.214145 0.281539 0.081222 -0.395871 1.334683
6.500000 0.032916 0.200819 0.312997 0.070739 -0.397787 1.104792
6.533333 0.034887 0.187405 0.343621 0.060564 -0.399257 0.919270
6.566667 0.036347 0.173921 0.358461 0.050874 -0.400250 0.767607
6.600000 0.037729 0.160433 0.391682 0.041803 -0.400722 0.643422
6.633333 0.038680 0.146924 0.398785 0.033420 -0.400664 0.537897
6.666667 0.039554 0.133427 0.411485 0.025825 -0.400087 0.452936
6.700000 0.040079 0.119979 0.424987 0.019023 -0.398997 0.383346
6.733333 0.040530 0.106558 0.430355 0.012990 -0.397383 0.327050
6.766667 0.040706 0.093247 0.446021 0.007667 -0.395211 0.282516
6.800000 0.040641 0.080085 0.440111 0.003028 -0.392466 0.250214
6.833333 0.040508 0.066974 0.454012 -0.000984 -0.389092 0.227067
6.866667 0.040308 0.053922 0.460348 -0.004439 -0.385025 0.211137
6.900000 0.040044 0.040937 0.460413 -0.007403 -0.380203 0.201543
6.933333 0.039656 0.028218 0.465024 -0.009896 -0.374588 0.197036
6.966667 0.039208 0.015581 0.474480 -0.011933 -0.368139 0.195106
7.000000 0.038702 0.003032 0.475846 -0.013558 -0.360801 0.194412
7.033333 0.038136 -0.009179 0.490567 -0.014801 -0.352594 0.197725
7.066667 0.037536 -0.021019 0.494605 -0.015682 -0.343520 0.204924
7.100000 0.036914 -0.032463 0.514771 -0.016216 -0.333649 0.212694
7.133333 0.036298 -0.043483 0.508825 -0.016447 -0.323085 0.220487
7.166667 0.035697 -0.054056 0.511905 -0.016415 -0.311974 0.229800
7.200000 0.035050 -0.064504 0.517090 -0.016154 -0.300483 0.237459
7.233333 0.034448 -0.074468 0.526588 -0.015694 -0.288717 0.240236
7.266667 0.033898 -0.083926 0.537851 -0.015089 -0.276841 0.235917
7.300000 0.033415 -0.092855 0.540942 -0.014391 -0.264976 0.228211
7.333333 0.033013 -0.101228 0.554764 -0.013631 -0.253189 0.215962
7.366667 0.032577 -0.109455 0.578752 -0.012835 -0.241509 0.196009
7.400000 0.032218 -0.117080 0.590351 -0.012037 -0.230010 0.170587
7.433333 0.031830 -0.124554 0.588406 -0.011266 -0.218766 0.142375
7.466667 0.031412 -0.131874 0.590487 -0.010522 -0.207762 0.114083
7.500000 0.031059 -0.138646 0.594331 -0.009794 -0.196961 0.085108
7.533333 0.030764 -0.144909 0.586364 -0.009074 -0.186354 0.056982
7.566667 0.030523 -0.150684 0.586481 -0.008368 -0.175991 0.034706
7.600000 0.030259 -0.156301 0.587446 -0.007664 -0.165849 0.019331
7.633333 0.029974 -0.161758 0.581400 -0.006959 -0.155930 0.010049
7.666667 0.029728 -0.166811 0.590741 -0.006266 -0.146314 0.004297
7.700000 0.029527 -0.171484 0.584695 -0.005610 -0.137088 0.001236
7.733333 0.029359 -0.175797 0.584350 -0.005008 -0.128312 0.001273
7.766667 0.029225 -0.179776 0.586526 -0.004462 -0.119982 0.002414
7.800000 0.029126 -0.183437 0.592977 -0.003982 -0.112131 0.001853
7.833333 0.029062 -0.186805 0.593400 -0.003584 -0.104798 -0.001229
7.866667 0.028985 -0.190017 0.586851 -0.003268 -0.097970 -0.003408
7.900000 0.028896 -0.193075 0.586153 -0.003028 -0.091615 -0.003632
7.933333 0.028796 -0.195981 0.588964 -0.002853 -0.085699 -0.004306
7.966667 0.028718 -0.198662 0.590872 -0.002739 -0.080197 -0.006040
8.000000 0.028632 -0.201194 0.588487 -0.002672 -0.075060 -0.005853
8.033333 0.028537 -0.203580 0.574668 -0.002626 -0.070210 -0.001846
