t x y theta dxdt dydt dthetadt
0.000000 0.000000 0.000000 -1.452755 -0.004737 0.150270 0.437134
0.033333 -0.000157 0.005052 -1.441574 -0.004562 0.152694 0.536642
0.066667 -0.000311 0.010194 -1.410062 -0.004380 0.155113 0.640952
0.100000 -0.000457 0.015411 -1.400821 -0.004188 0.157527 0.754941
0.133333 -0.000599 0.020718 -1.355358 -0.003988 0.159938 0.884390
0.166667 -0.000732 0.026099 -1.318446 -0.003780 0.162346 1.033348
0.200000 -0.000857 0.031553 -1.278571 -0.003562 0.164754 1.212243
0.233333 -0.000973 0.037080 -1.241093 -0.003336 0.167163 1.425861
0.266667 -0.001080 0.042680 -1.224812 -0.003102 0.169573 1.686383
0.300000 -0.001177 0.048352 -1.184090 -0.002858 0.171983 1.987109
0.333333 -0.001269 0.054114 -1.144363 -0.002606 0.174394 2.329556
0.366667 -0.001353 0.059967 -1.092410 -0.002343 0.176803 2.709031
0.400000 -0.001431 0.065908 -0.993436 -0.002069 0.179206 3.118568
0.433333 -0.001501 0.071940 -0.860774 -0.001782 0.181602 3.557353
0.466667 -0.001560 0.078041 -0.738421 -0.001481 0.183988 4.000955
0.500000 -0.001609 0.084233 -0.581350 -0.001162 0.186362 4.438978
0.533333 -0.001647 0.090492 -0.412780 -0.000826 0.188721 4.851424
0.566667 -0.001674 0.096820 -0.267254 -0.000471 0.191063 5.222512
0.600000 -0.001688 0.103216 -0.013600 -0.000097 0.193394 5.524600
0.633333 -0.001689 0.109702 0.155373 0.000295 0.195711 5.731365
0.666667 -0.001677 0.116255 0.349376 0.000702 0.198011 5.835209
0.700000 -0.001649 0.122899 0.545508 0.001122 0.200292 5.835543
0.733333 -0.001609 0.129607 0.790499 0.001554 0.202552 5.731123
0.766667 -0.001551 0.136406 1.088710 0.001995 0.204787 5.515864
0.800000 -0.001476 0.143297 1.325196 0.002444 0.206990 5.212010
0.833333 -0.001387 0.150249 1.490564 0.002899 0.209162 4.835541
0.866667 -0.001285 0.157262 1.650850 0.003362 0.211306 4.398888
0.900000 -0.001164 0.164364 1.775176 0.003831 0.213430 3.913184
0.933333 -0.001029 0.171524 1.860492 0.004307 0.215539 3.401720
0.966667 -0.000880 0.178743 1.936629 0.004792 0.217642 2.900117
1.000000 -0.000715 0.186018 2.030339 0.005284 0.219750 2.422448
1.033333 -0.000536 0.193350 2.107749 0.005787 0.221869 1.982811
1.066667 -0.000338 0.200763 2.166978 0.006299 0.224003 1.596280
1.100000 -0.000122 0.208258 2.205591 0.006821 0.226150 1.269568
1.133333 0.000112 0.215831 2.226302 0.007352 0.228307 1.002208
1.166667 0.000364 0.223482 2.232204 0.007891 0.230465 0.784641
1.200000 0.000636 0.231209 2.226947 0.008438 0.232609 0.617969
1.233333 0.000925 0.239010 2.239138 0.008990 0.234719 0.498913
1.266667 0.001234 0.246883 2.240696 0.009545 0.236778 0.421397
1.300000 0.001561 0.254827 2.246302 0.010103 0.238770 0.378264
1.333333 0.001907 0.262839 2.245658 0.010662 0.240683 0.360355
1.366667 0.002272 0.270918 2.266157 0.011221 0.242505 0.358987
1.400000 0.002656 0.279061 2.275483 0.011781 0.244232 0.357127
1.433333 0.003059 0.287266 2.289093 0.012340 0.245863 0.348923
1.466667 0.003479 0.295508 2.322466 0.012901 0.247400 0.330120
1.500000 0.003919 0.303808 2.332186 0.013462 0.248844 0.301608
1.533333 0.004376 0.312143 2.367215 0.014026 0.250199 0.262018
1.566667 0.004851 0.320510 2.385706 0.014591 0.251469 0.214566
1.600000 0.005346 0.328927 2.380092 0.015158 0.252659 0.166749
1.633333 0.005861 0.337389 2.361938 0.015728 0.253774 0.119528
1.666667 0.006393 0.345878 2.360468 0.016301 0.254813 0.075206
1.700000 0.006946 0.354408 2.354946 0.016876 0.255778 0.034480
1.733333 0.007517 0.362961 2.334796 0.017453 0.256668 0.006124
1.766667 0.008108 0.371549 2.347693 0.018032 0.257481 -0.009186
1.800000 0.008719 0.380166 2.365562 0.018612 0.258212 -0.012786
1.833333 0.009350 0.388810 2.363441 0.019194 0.258858 -0.002512
1.866667 0.010000 0.397472 2.367744 0.019777 0.259414 0.020793
1.900000 0.010669 0.406148 2.368960 0.020363 0.259877 0.055899
1.933333 0.011356 0.414838 2.354059 0.020952 0.260242 0.096800
1.966667 0.012063 0.423539 2.339724 0.021546 0.260503 0.145744
2.000000 0.012789 0.432249 2.342066 0.022144 0.260657 0.204497
2.033333 0.013536 0.440964 2.344956 0.022748 0.260702 0.269103
2.066667 0.014302 0.449684 2.369496 0.023359 0.260638 0.341550
2.100000 0.015089 0.458401 2.381958 0.023977 0.260467 0.423765
2.133333 0.015896 0.467108 2.394709 0.024602 0.260189 0.518280
2.166667 0.016725 0.475803 2.426903 0.025234 0.259810 0.622485
2.200000 0.017575 0.484482 2.444207 0.025871 0.259339 0.740672
2.233333 0.018447 0.493138 2.459338 0.026514 0.258785 0.881722
2.266667 0.019340 0.501769 2.492480 0.027161 0.258155 1.045693
2.300000 0.020257 0.510370 2.521504 0.027810 0.257465 1.233907
2.333333 0.021196 0.518935 2.544100 0.028458 0.256731 1.442353
2.366667 0.022155 0.527490 2.564343 0.029104 0.255969 1.674369
2.400000 0.023134 0.536033 2.634905 0.029746 0.255188 1.919833
2.433333 0.024137 0.544529 2.689918 0.030381 0.254398 2.165446
2.466667 0.025166 0.552973 2.784453 0.031009 0.253604 2.403109
2.500000 0.026215 0.561400 2.872469 0.031627 0.252806 2.624593
2.533333 0.027283 0.569808 2.986927 0.032236 0.252000 2.827201
2.566667 0.028370 0.578195 3.109004 0.032836 0.251176 2.999380
2.600000 0.029476 0.586560 -3.061309 0.033426 0.250328 3.143654
2.633333 0.030601 0.594902 -2.945210 0.034007 0.249445 3.263750
2.666667 0.031746 0.603219 -2.855238 0.034580 0.248519 3.368949
2.700000 0.032909 0.611508 -2.726651 0.035147 0.247539 3.465139
2.733333 0.034092 0.619769 -2.603499 0.035710 0.246498 3.561113
2.766667 0.035293 0.628000 -2.511531 0.036271 0.245394 3.671123
2.800000 0.036510 0.636166 -2.400754 0.036831 0.244226 3.799867
2.833333 0.037746 0.644299 -2.279870 0.037394 0.242992 3.956878
2.866667 0.039001 0.652397 -2.144834 0.037960 0.241694 4.139226
2.900000 0.040275 0.660427 -2.000517 0.038533 0.240336 4.347254
2.933333 0.041567 0.668419 -1.849316 0.039114 0.238922 4.571938
2.966667 0.042878 0.676373 -1.721543 0.039707 0.237452 4.806647
3.000000 0.044207 0.684287 -1.567439 0.040315 0.235923 5.047037
3.033333 0.045559 0.692131 -1.389537 0.040940 0.234335 5.282365
3.066667 0.046929 0.699932 -1.187092 0.041582 0.232690 5.506083
3.100000 0.048316 0.707688 -0.987959 0.042245 0.230985 5.710512
3.133333 0.049730 0.715375 -0.796738 0.042925 0.229221 5.897282
3.166667 0.051170 0.722991 -0.575068 0.043621 0.227403 6.050997
3.200000 0.052628 0.730559 -0.363184 0.044328 0.225538 6.160883
3.233333 0.054113 0.738057 -0.148961 0.045043 0.223630 6.216466
3.266667 0.055626 0.745485 0.031944 0.045760 0.221687 6.216998
3.300000 0.057166 0.752843 0.272237 0.046473 0.219717 6.157351
3.333333 0.058734 0.760130 0.496768 0.047177 0.217728 6.028071
3.366667 0.060330 0.767347 0.735655 0.047866 0.215726 5.836322
3.400000 0.061940 0.774509 0.949085 0.048535 0.213715 5.588056
3.433333 0.063577 0.781600 1.146578 0.049178 0.211704 5.294592
3.466667 0.065229 0.788633 1.337466 0.049793 0.209695 4.956661
3.500000 0.066904 0.795593 1.492258 0.050377 0.207692 4.586240
3.533333 0.068602 0.802479 1.635270 0.050931 0.205692 4.197297
3.566667 0.070321 0.809290 1.744973 0.051454 0.203693 3.805120
3.600000 0.072054 0.816040 1.862047 0.051947 0.201693 3.417724
3.633333 0.073800 0.822727 1.967606 0.052413 0.199682 3.040298
3.666667 0.075560 0.829352 2.048317 0.052853 0.197655 2.680709
3.700000 0.077333 0.835913 2.126899 0.053270 0.195603 2.343595
3.733333 0.079119 0.842409 2.203586 0.053665 0.193522 2.035492
3.766667 0.080917 0.848840 2.266880 0.054041 0.191403 1.753294
3.800000 0.082727 0.855204 2.327891 0.054400 0.189241 1.502949
3.833333 0.084548 0.861502 2.358575 0.054744 0.187032 1.290249
3.866667 0.086381 0.867712 2.381897 0.055073 0.184772 1.122071
3.900000 0.088226 0.873835 2.421340 0.055388 0.182465 0.995457
3.933333 0.090081 0.879889 2.429958 0.055690 0.180114 0.904637
3.966667 0.091946 0.885854 2.433907 0.055979 0.177727 0.848095
4.000000 0.093821 0.891748 2.413117 0.056254 0.175314 0.823872
4.033333 0.095703 0.897552 2.433865 0.056517 0.172886 0.824355
4.066667 0.097595 0.903285 2.493407 0.056767 0.170451 0.838494
4.100000 0.099494 0.908928 2.539245 0.057005 0.168014 0.866218
4.133333 0.101400 0.914481 2.591444 0.057233 0.165580 0.901339
4.166667 0.103313 0.919942 2.622619 0.057451 0.163150 0.939868
4.200000 0.105233 0.925330 2.655332 0.057660 0.160723 0.971176
4.233333 0.107160 0.930644 2.667727 0.057861 0.158296 0.995989
4.266667 0.109093 0.935883 2.692503 0.058054 0.155870 1.019709
4.300000 0.111034 0.941046 2.713596 0.058239 0.153443 1.040267
4.333333 0.112979 0.946134 2.760154 0.058415 0.151014 1.063299
4.366667 0.114931 0.951130 2.792118 0.058581 0.148583 1.090356
4.400000 0.116889 0.956050 2.839351 0.058733 0.146149 1.124819
4.433333 0.118852 0.960877 2.888069 0.058869 0.143716 1.162671
4.466667 0.120819 0.965628 2.915491 0.058985 0.141284 1.202169
4.500000 0.122793 0.970285 2.950515 0.059075 0.138857 1.246566
4.533333 0.124770 0.974865 2.999197 0.059135 0.136441 1.299638
