t x y theta dxdt dydt dthetadt
0.000000 0.000000 0.000000 -2.761029 0.015645 0.152789 -6.629345
0.033333 0.000520 0.005154 -3.085603 0.014533 0.156514 -6.589113
0.066667 0.001009 0.010465 2.969831 0.013391 0.160202 -6.373104
0.100000 0.001437 0.015897 2.716981 0.012225 0.163840 -5.989231
0.133333 0.001836 0.021433 2.530056 0.011039 0.167420 -5.468834
0.166667 0.002175 0.027093 2.377971 0.009836 0.170938 -4.859466
0.200000 0.002486 0.032856 2.233124 0.008623 0.174396 -4.197363
0.233333 0.002737 0.038745 2.079311 0.007407 0.177794 -3.521619
0.266667 0.002960 0.044735 1.978053 0.006193 0.181138 -2.859514
0.300000 0.003154 0.050828 1.926387 0.004988 0.184436 -2.248113
0.333333 0.003290 0.057043 1.889461 0.003794 0.187692 -1.700351
0.366667 0.003397 0.063360 1.873187 0.002616 0.190910 -1.216159
0.400000 0.003475 0.069778 1.846909 0.001457 0.194092 -0.794835
0.433333 0.003495 0.076312 1.836820 0.000312 0.197238 -0.438009
0.466667 0.003486 0.082945 1.829418 -0.000819 0.200347 -0.147257
0.500000 0.003420 0.089688 1.846559 -0.001938 0.203414 0.082600
0.533333 0.003326 0.096531 1.875497 -0.003047 0.206438 0.256364
0.566667 0.003203 0.103473 1.902792 -0.004147 0.209418 0.380816
0.600000 0.003052 0.110514 1.919257 -0.005238 0.212352 0.459366
0.633333 0.002872 0.117653 1.954051 -0.006319 0.215239 0.499335
0.666667 0.002643 0.124886 1.963086 -0.007387 0.218076 0.508300
0.700000 0.002385 0.132217 1.982915 -0.008443 0.220864 0.493668
0.733333 0.002081 0.139637 2.009938 -0.009484 0.223603 0.462656
0.766667 0.001733 0.147141 2.034200 -0.010506 0.226290 0.419912
0.800000 0.001358 0.154741 2.041874 -0.011507 0.228924 0.372855
0.833333 0.000945 0.162421 2.051292 -0.012479 0.231508 0.327843
0.866667 0.000504 0.170195 2.050270 -0.013421 0.234036 0.285462
0.900000 0.000036 0.178063 2.061926 -0.014325 0.236509 0.246528
0.933333 -0.000464 0.186003 2.052110 -0.015191 0.238928 0.214080
0.966667 -0.000994 0.194010 2.062350 -0.016018 0.241295 0.187293
1.000000 -0.001551 0.202110 2.074759 -0.016806 0.243610 0.166354
1.033333 -0.002133 0.210273 2.081547 -0.017559 0.245876 0.149128
1.066667 -0.002740 0.218526 2.089295 -0.018279 0.248101 0.136104
1.100000 -0.003369 0.226836 2.101964 -0.018969 0.250292 0.125909
1.133333 -0.004022 0.235236 2.092798 -0.019632 0.252453 0.113579
1.166667 -0.004692 0.243688 2.095046 -0.020271 0.254590 0.101014
1.200000 -0.005376 0.252190 2.092726 -0.020890 0.256715 0.087667
1.233333 -0.006084 0.260781 2.095837 -0.021494 0.258837 0.075342
1.266667 -0.006817 0.269459 2.113869 -0.022085 0.260963 0.061974
1.300000 -0.007564 0.278193 2.106681 -0.022668 0.263098 0.051468
1.333333 -0.008328 0.286986 2.113933 -0.023246 0.265254 0.042445
1.366667 -0.009115 0.295864 2.105313 -0.023820 0.267434 0.034344
1.400000 -0.009917 0.304804 2.112958 -0.024390 0.269635 0.026039
1.433333 -0.010735 0.313807 2.105093 -0.024956 0.271856 0.016528
1.466667 -0.011576 0.322894 2.111343 -0.025516 0.274099 0.009683
1.500000 -0.012437 0.332065 2.113125 -0.026071 0.276361 0.001450
1.533333 -0.013320 0.341318 2.110768 -0.026619 0.278637 -0.004257
1.566667 -0.014223 0.350653 2.111868 -0.027160 0.280925 -0.009230
1.600000 -0.015142 0.360059 2.106230 -0.027694 0.283226 -0.012059
1.633333 -0.016076 0.369538 2.113373 -0.028221 0.285534 -0.013382
1.666667 -0.017026 0.379091 2.107058 -0.028740 0.287847 -0.013807
1.700000 -0.017991 0.388720 2.108205 -0.029252 0.290162 -0.013139
1.733333 -0.018975 0.398428 2.107425 -0.029759 0.292480 -0.012835
1.766667 -0.019975 0.408214 2.098911 -0.030260 0.294800 -0.010746
1.800000 -0.020992 0.418077 2.104403 -0.030757 0.297124 -0.008328
1.833333 -0.022028 0.428017 2.106716 -0.031251 0.299454 -0.004176
1.866667 -0.023078 0.438040 2.108783 -0.031742 0.301795 -0.001430
1.900000 -0.024146 0.448137 2.108394 -0.032228 0.304153 0.002077
1.933333 -0.025229 0.458321 2.102842 -0.032711 0.306534 0.006301
1.966667 -0.026329 0.468578 2.103040 -0.033187 0.308947 0.009034
2.000000 -0.027445 0.478907 2.111598 -0.033658 0.311403 0.010639
2.033333 -0.028577 0.489306 2.101810 -0.034123 0.313909 0.010188
2.066667 -0.029723 0.499798 2.105966 -0.034582 0.316471 0.011313
2.100000 -0.030885 0.510358 2.110488 -0.035035 0.319086 0.011807
2.133333 -0.032062 0.521014 2.107112 -0.035483 0.321752 0.010810
2.166667 -0.033253 0.531766 2.113048 -0.035924 0.324457 0.009224
2.200000 -0.034458 0.542616 2.107913 -0.036360 0.327187 0.009033
2.233333 -0.035678 0.553566 2.111152 -0.036790 0.329926 0.009217
2.266667 -0.036913 0.564616 2.110521 -0.037214 0.332663 0.007266
2.300000 -0.038162 0.575767 2.111774 -0.037634 0.335395 0.004712
2.333333 -0.039425 0.587022 2.106855 -0.038049 0.338118 0.003408
2.366667 -0.040703 0.598381 2.100144 -0.038461 0.340832 0.003961
2.400000 -0.041993 0.609797 2.118607 -0.038869 0.343542 0.003893
2.433333 -0.043295 0.621267 2.114818 -0.039275 0.346255 0.006192
2.466667 -0.044611 0.632845 2.106028 -0.039677 0.348970 0.010715
2.500000 -0.045939 0.644475 2.111885 -0.040074 0.351689 0.014140
2.533333 -0.047280 0.656214 2.112452 -0.040465 0.354406 0.011854
2.566667 -0.048636 0.668063 2.105991 -0.040848 0.357123 -0.000692
2.600000 -0.050006 0.680022 2.111045 -0.041219 0.359827 -0.025867
2.633333 -0.051391 0.692094 2.110447 -0.041576 0.362507 -0.069740
2.666667 -0.052790 0.704278 2.112010 -0.041913 0.365145 -0.135318
2.700000 -0.054198 0.716502 2.111369 -0.042228 0.367719 -0.221559
2.733333 -0.055619 0.728838 2.124964 -0.042515 0.370214 -0.326821
2.766667 -0.057048 0.741209 2.134579 -0.042772 0.372613 -0.448519
2.800000 -0.058486 0.753687 2.121110 -0.042997 0.374902 -0.581487
2.833333 -0.059932 0.766269 2.091743 -0.043187 0.377076 -0.719901
2.866667 -0.061385 0.778878 2.055297 -0.043342 0.379135 -0.854323
2.900000 -0.062841 0.791580 2.006492 -0.043463 0.381073 -0.975815
2.933333 -0.064297 0.804369 1.967676 -0.043552 0.382885 -1.076704
2.966667 -0.065759 0.817176 1.930753 -0.043610 0.384558 -1.148587
3.000000 -0.067220 0.830056 1.881185 -0.043642 0.386085 -1.188803
3.033333 -0.068678 0.843003 1.824460 -0.043652 0.387451 -1.194030
3.066667 -0.070140 0.855960 1.777252 -0.043646 0.388638 -1.166323
3.100000 -0.071599 0.868968 1.727118 -0.043627 0.389641 -1.110578
3.133333 -0.073053 0.882020 1.692774 -0.043600 0.390454 -1.028355
3.166667 -0.074503 0.895107 1.647241 -0.043567 0.391072 -0.922625
3.200000 -0.075948 0.908221 1.626458 -0.043533 0.391495 -0.798373
3.233333 -0.077396 0.921330 1.607989 -0.043497 0.391723 -0.660524
3.266667 -0.078846 0.934431 1.576638 -0.043462 0.391762 -0.513942
3.300000 -0.080297 0.947521 1.563401 -0.043428 0.391619 -0.363162
3.333333 -0.081744 0.960607 1.547883 -0.043395 0.391298 -0.215422
3.366667 -0.083193 0.973676 1.535018 -0.043362 0.390809 -0.079254
3.400000 -0.084638 0.986725 1.545612 -0.043325 0.390164 0.043161
3.433333 -0.086080 0.999748 1.553480 -0.043285 0.389371 0.147456
3.466667 -0.087523 1.012743 1.576150 -0.043239 0.388433 0.229621
3.500000 -0.088965 1.025707 1.602081 -0.043184 0.387348 0.287568
3.533333 -0.090407 1.038637 1.610451 -0.043117 0.386115 0.322135
3.566667 -0.091845 1.051513 1.636778 -0.043038 0.384731 0.334008
3.600000 -0.093282 1.064347 1.646978 -0.042943 0.383182 0.325483
3.633333 -0.094718 1.077139 1.665019 -0.042829 0.381463 0.299479
3.666667 -0.096147 1.089855 1.669190 -0.042696 0.379576 0.262633
3.700000 -0.097574 1.102522 1.673171 -0.042545 0.377531 0.221079
3.733333 -0.099000 1.115136 1.681877 -0.042374 0.375329 0.177309
3.766667 -0.100416 1.127656 1.683062 -0.042186 0.372980 0.138041
3.800000 -0.101822 1.140077 1.682902 -0.041984 0.370506 0.104386
3.833333 -0.103217 1.152392 1.688337 -0.041771 0.367923 0.081410
3.866667 -0.104610 1.164643 1.689138 -0.041548 0.365235 0.077911
3.900000 -0.105989 1.176777 1.685915 -0.041315 0.362440 0.109048
3.933333 -0.107356 1.188790 1.690727 -0.041073 0.359544 0.195289
3.966667 -0.108720 1.200729 1.685655 -0.040821 0.356541 0.360043
4.000000 -0.110079 1.212592 1.682251 -0.040557 0.353410 0.626065
4.033333 -0.111435 1.224375 1.687577 -0.040277 0.350138 1.009081
4.066667 -0.112775 1.236017 1.691343 -0.039981 0.346727 1.504974
4.100000 -0.114111 1.247575 1.697206 -0.039664 0.343178 2.084140
4.133333 -0.115442 1.259046 1.701494 -0.039321 0.339493 2.701916
4.166667 -0.116756 1.270362 1.728163 -0.038949 0.335692 3.290786
4.200000 -0.118054 1.281519 1.842238 -0.038545 0.331802 3.778108
4.233333 -0.119334 1.292513 2.044114 -0.038109 0.327854 4.088712
4.266667 -0.120598 1.303342 2.292209 -0.037644 0.323870 4.162810
4.300000 -0.121847 1.314004 2.606963 -0.037160 0.319879 3.966440
4.333333 -0.123091 1.324566 2.890902 -0.036669 0.315905 3.491334
4.366667 -0.124330 1.335025 -3.132659 -0.036181 0.311957 2.759758
4.400000 -0.125531 1.345355 -2.944183 -0.035709 0.308034 1.820105
4.433333 -0.126698 1.355556 -2.884702 -0.035263 0.304128 0.747568
4.466667 -0.127831 1.365629 -2.924881 -0.034852 0.300229 -0.374185
4.500000 -0.128960 1.375593 -3.073427 -0.034483 0.296316 -1.454749
4.533333 -0.130083 1.385446 3.022380 -0.034157 0.292371 -2.421197
4.566667 -0.131205 1.395138 2.809572 -0.033879 0.288384 -3.214042
4.600000 -0.132322 1.404715 2.596341 -0.033647 0.284353 -3.799621
4.633333 -0.133436 1.414133 2.405714 -0.033456 0.280272 -4.176920
4.666667 -0.134548 1.423393 2.258212 -0.033300 0.276143 -4.365202
4.700000 -0.135655 1.432535 2.114762 -0.033171 0.271971 -4.398366
4.733333 -0.136759 1.441517 1.993719 -0.033065 0.267760 -4.306718
4.766667 -0.137858 1.450377 1.871829 -0.032976 0.263508 -4.112550
4.800000 -0.138952 1.459114 1.728326 -0.032901 0.259218 -3.828607
4.833333 -0.140044 1.467691 1.600255 -0.032844 0.254891 -3.456875
4.866667 -0.141131 1.476143 1.469574 -0.032806 0.250524 -2.982102
4.900000 -0.142218 1.484434 1.339677 -0.032788 0.246121 -2.396001
4.933333 -0.143305 1.492563 1.212843 -0.032792 0.241684 -1.698488
4.966667 -0.144387 1.500565 1.086286 -0.032816 0.237220 -0.901657
5.000000 -0.145473 1.508406 0.962340 -0.032860 0.232734 -0.030691
5.033333 -0.146564 1.516087 0.958428 -0.032920 0.228236 0.889688
5.066667 -0.147662 1.523610 1.018523 -0.032994 0.223738 1.811269
5.100000 -0.148769 1.530972 1.198059 -0.033079 0.219245 2.673304
5.133333 -0.149871 1.538203 1.383910 -0.033173 0.214761 3.423192
5.166667 -0.150985 1.545272 1.541517 -0.033271 0.210295 4.008081
5.200000 -0.152094 1.552208 1.744299 -0.033368 0.205850 4.391086
5.233333 -0.153198 1.559011 1.972446 -0.033466 0.201422 4.539767
5.266667 -0.154315 1.565651 2.152210 -0.033560 0.197012 4.452468
5.300000 -0.155445 1.572128 2.400457 -0.033648 0.192617 4.157498
5.333333 -0.156569 1.578471 2.546620 -0.033726 0.188241 3.694657
5.366667 -0.157690 1.584679 2.753332 -0.033795 0.183874 3.097963
5.400000 -0.158824 1.590726 2.878271 -0.033851 0.179516 2.409763
5.433333 -0.159954 1.596639 2.905385 -0.033891 0.175165 1.678854
5.466667 -0.161096 1.602394 2.892081 -0.033910 0.170820 0.946388
5.500000 -0.162234 1.608014 2.863629 -0.033908 0.166472 0.263662
5.533333 -0.163367 1.613498 2.834671 -0.033883 0.162112 -0.336406
5.566667 -0.164505 1.618826 2.809108 -0.033831 0.157739 -0.801502
5.600000 -0.165638 1.624020 2.765209 -0.033753 0.153349 -1.099955
5.633333 -0.166765 1.629078 2.690307 -0.033650 0.148933 -1.216585
5.666667 -0.167891 1.633979 2.609133 -0.033524 0.144490 -1.157069
