t x y theta dxdt dydt dthetadt
0.000000 0.000000 0.000000 0.232371 0.067263 0.004586 0.001824
0.033333 0.002313 0.000156 0.233171 0.072366 0.004860 0.001302
0.066667 0.004813 0.000321 0.225083 0.077576 0.005140 0.001761
0.100000 0.007467 0.000496 0.231027 0.082897 0.005425 0.001170
0.133333 0.010281 0.000680 0.227334 0.088340 0.005714 0.000759
0.166667 0.013292 0.000874 0.238984 0.093910 0.006008 -0.000631
0.200000 0.016474 0.001079 0.232958 0.099610 0.006306 -0.002673
0.233333 0.019831 0.001294 0.233998 0.105450 0.006607 -0.003675
0.266667 0.023396 0.001519 0.230167 0.111436 0.006913 -0.005142
0.300000 0.027175 0.001754 0.232084 0.117567 0.007222 -0.006358
0.333333 0.031169 0.001999 0.234643 0.123839 0.007536 -0.008468
0.366667 0.035383 0.002254 0.228978 0.130248 0.007854 -0.008334
0.400000 0.039820 0.002519 0.224156 0.136788 0.008176 -0.008219
0.433333 0.044467 0.002796 0.228112 0.143453 0.008502 -0.007684
0.466667 0.049330 0.003084 0.230340 0.150236 0.008831 -0.006893
0.500000 0.054426 0.003382 0.229315 0.157133 0.009163 -0.004291
0.533333 0.059751 0.003692 0.234677 0.164146 0.009499 -0.001693
0.566667 0.065310 0.004015 0.228933 0.171274 0.009837 -0.001213
0.600000 0.071111 0.004349 0.227306 0.178525 0.010178 -0.000420
0.633333 0.077155 0.004695 0.222699 0.185900 0.010520 0.000439
0.666667 0.083447 0.005051 0.235574 0.193402 0.010865 0.000102
0.700000 0.089989 0.005418 0.232821 0.201029 0.011212 -0.002476
0.733333 0.096782 0.005796 0.225091 0.208776 0.011561 -0.005285
0.766667 0.103850 0.006187 0.227227 0.216641 0.011911 -0.006280
0.800000 0.111174 0.006589 0.228602 0.224613 0.012263 -0.007580
0.833333 0.118758 0.007002 0.235200 0.232692 0.012617 -0.009941
0.866667 0.126636 0.007429 0.233495 0.240884 0.012973 -0.009864
0.900000 0.134778 0.007867 0.220860 0.249193 0.013332 -0.007389
0.933333 0.143226 0.008318 0.231209 0.257625 0.013694 -0.004089
0.966667 0.151943 0.008781 0.226799 0.266176 0.014058 -0.001655
1.000000 0.160928 0.009255 0.220599 0.274846 0.014426 0.001881
1.033333 0.170185 0.009740 0.227076 0.283622 0.014796 0.006471
1.066667 0.179714 0.010236 0.219036 0.292481 0.015167 0.010468
1.100000 0.189586 0.010747 0.229000 0.301405 0.015540 0.012017
1.133333 0.199733 0.011270 0.231808 0.310396 0.015912 0.012649
1.166667 0.210236 0.011807 0.231553 0.319465 0.016286 0.012836
1.200000 0.221104 0.012360 0.234548 0.328617 0.016661 0.010528
1.233333 0.232250 0.012924 0.232255 0.337861 0.017037 0.007460
1.266667 0.243675 0.013499 0.230183 0.347227 0.017416 0.002651
1.300000 0.255378 0.014085 0.228022 0.356735 0.017797 -0.001061
1.333333 0.267360 0.014683 0.236343 0.366375 0.018180 -0.004681
1.366667 0.279622 0.015292 0.228324 0.376142 0.018566 -0.007251
1.400000 0.292163 0.015912 0.229003 0.386064 0.018954 -0.007978
1.433333 0.305119 0.016547 0.228168 0.396157 0.019345 -0.008010
1.466667 0.318499 0.017200 0.224799 0.406397 0.019739 -0.006973
1.500000 0.332309 0.017868 0.226878 0.416771 0.020135 -0.005738
1.533333 0.346396 0.018548 0.232896 0.427300 0.020534 -0.003296
1.566667 0.360760 0.019238 0.229287 0.437998 0.020934 -0.001720
1.600000 0.375576 0.019944 0.228161 0.448822 0.021335 -0.001025
1.633333 0.390665 0.020661 0.228123 0.459750 0.021736 -0.000642
1.666667 0.406025 0.021389 0.224464 0.470825 0.022138 0.000238
1.700000 0.421861 0.022133 0.230340 0.482056 0.022540 -0.000936
1.733333 0.438179 0.022893 0.232081 0.493420 0.022943 -0.006151
1.766667 0.454762 0.023664 0.229314 0.504891 0.023345 -0.015394
1.800000 0.471607 0.024445 0.223620 0.516520 0.023748 -0.027398
1.833333 0.488956 0.025242 0.230293 0.528327 0.024150 -0.043468
1.866667 0.506817 0.026057 0.230621 0.540245 0.024550 -0.063470
1.900000 0.525196 0.026887 0.227611 0.552230 0.024946 -0.082995
1.933333 0.543823 0.027728 0.225402 0.564265 0.025337 -0.100979
1.966667 0.562693 0.028577 0.229631 0.576328 0.025720 -0.117797
2.000000 0.582102 0.029443 0.230097 0.588327 0.026091 -0.137946
2.033333 0.601745 0.030317 0.212413 0.600234 0.026447 -0.160694
2.066667 0.621939 0.031208 0.190922 0.612062 0.026785 -0.188617
2.100000 0.642687 0.032114 0.175605 0.623847 0.027102 -0.224273
2.133333 0.663986 0.033032 0.181895 0.635555 0.027397 -0.266912
2.166667 0.685494 0.033959 0.183386 0.647144 0.027668 -0.313156
2.200000 0.707205 0.034893 0.195871 0.658623 0.027915 -0.359568
2.233333 0.729113 0.035835 0.194057 0.669950 0.028140 -0.405281
2.266667 0.751530 0.036783 0.163862 0.681107 0.028342 -0.444996
2.300000 0.774445 0.037734 0.137882 0.692054 0.028525 -0.476080
2.333333 0.797837 0.038690 0.109436 0.702827 0.028694 -0.496995
2.366667 0.821689 0.039648 0.085891 0.713436 0.028851 -0.505424
2.400000 0.845697 0.040614 0.053694 0.723869 0.029003 -0.495916
2.433333 0.870130 0.041582 0.033635 0.734071 0.029152 -0.469245
2.466667 0.894700 0.042556 0.016172 0.743995 0.029302 -0.430068
2.500000 0.919654 0.043534 0.010337 0.753581 0.029454 -0.381186
2.533333 0.944973 0.044516 -0.005744 0.762740 0.029609 -0.323199
2.566667 0.970634 0.045502 -0.003692 0.771408 0.029767 -0.264560
2.600000 0.996615 0.046496 -0.003876 0.779495 0.029926 -0.214804
2.633333 1.022901 0.047496 -0.008920 0.786960 0.030085 -0.173991
2.666667 1.049470 0.048502 -0.038439 0.793714 0.030241 -0.138936
2.700000 1.076299 0.049515 -0.018635 0.799692 0.030394 -0.111743
2.733333 1.103367 0.050534 -0.013628 0.804843 0.030542 -0.096747
2.766667 1.130471 0.051557 -0.029378 0.809127 0.030681 -0.086247
2.800000 1.157768 0.052586 -0.032011 0.812549 0.030812 -0.075079
2.833333 1.185076 0.053618 -0.024831 0.815134 0.030934 -0.063793
2.866667 1.212382 0.054652 -0.026511 0.816940 0.031047 -0.057920
2.900000 1.239815 0.055691 -0.031876 0.818021 0.031150 -0.052550
2.933333 1.267218 0.056733 -0.043502 0.818446 0.031246 -0.041834
2.966667 1.294581 0.057776 -0.044512 0.818276 0.031334 -0.032319
3.000000 1.322005 0.058825 -0.036165 0.817559 0.031414 -0.025317
3.033333 1.349361 0.059875 -0.036519 0.816313 0.031486 -0.019999
3.066667 1.376636 0.060926 -0.053636 0.814549 0.031547 -0.010973
3.100000 1.403815 0.061976 -0.035184 0.812286 0.031597 -0.001511
3.133333 1.430964 0.063033 -0.035917 0.809518 0.031636 0.004201
3.166667 1.458060 0.064096 -0.031590 0.806235 0.031663 0.008611
3.200000 1.485019 0.065159 -0.038731 0.802433 0.031679 0.012179
3.233333 1.511830 0.066220 -0.038517 0.798112 0.031687 0.014555
3.266667 1.538477 0.067279 -0.038602 0.793267 0.031690 0.012076
3.300000 1.564947 0.068336 -0.042346 0.787878 0.031692 0.008458
3.333333 1.591227 0.069391 -0.034508 0.781930 0.031697 0.004713
3.366667 1.617304 0.070443 -0.034657 0.775419 0.031711 0.002584
3.400000 1.643162 0.071492 -0.035846 0.768326 0.031740 0.002020
3.433333 1.668785 0.072546 -0.025361 0.760641 0.031785 0.003103
3.466667 1.694163 0.073596 -0.031102 0.752365 0.031846 0.007559
3.500000 1.719255 0.074651 -0.037078 0.743510 0.031923 0.011471
3.533333 1.744044 0.075712 -0.041604 0.734100 0.032010 0.017690
3.566667 1.768503 0.076779 -0.042352 0.724171 0.032098 0.023153
3.600000 1.792610 0.077851 -0.049057 0.713778 0.032177 0.027644
3.633333 1.816339 0.078930 -0.029735 0.702961 0.032238 0.029829
3.666667 1.839665 0.080014 -0.031297 0.691744 0.032276 0.030654
3.700000 1.862562 0.081105 -0.028407 0.680131 0.032288 0.030302
3.733333 1.885006 0.082203 -0.024466 0.668102 0.032274 0.025256
3.766667 1.907090 0.083294 -0.015141 0.655623 0.032237 0.017204
3.800000 1.928802 0.084375 -0.029306 0.642641 0.032185 0.006686
3.833333 1.950131 0.085448 -0.028218 0.629125 0.032122 -0.003027
3.866667 1.971065 0.086512 -0.012320 0.615068 0.032052 -0.014654
3.900000 1.991592 0.087565 -0.033420 0.600484 0.031975 -0.023062
3.933333 2.011701 0.088607 -0.035091 0.585418 0.031891 -0.028439
3.966667 2.031184 0.089658 -0.033139 0.569903 0.031798 -0.029706
4.000000 2.050016 0.090719 -0.033560 0.553962 0.031696 -0.027917
4.033333 2.068170 0.091789 -0.037426 0.537629 0.031582 -0.025620
4.066667 2.085622 0.092869 -0.025435 0.520946 0.031453 -0.020026
4.100000 2.102602 0.093936 -0.039599 0.503947 0.031307 -0.016910
4.133333 2.119102 0.094989 -0.042358 0.486650 0.031141 -0.013573
4.166667 2.135113 0.096028 -0.035575 0.469065 0.030954 -0.012066
4.200000 2.150625 0.097051 -0.041613 0.451227 0.030744 -0.018777
4.233333 2.165629 0.098059 -0.021686 0.433135 0.030511 -0.048436
4.266667 2.180116 0.099050 -0.029951 0.414704 0.030261 -0.120967
4.300000 2.193723 0.100056 -0.041669 0.395833 0.030004 -0.261025
4.333333 2.206425 0.101078 -0.036951 0.376455 0.029741 -0.500585
4.366667 2.218585 0.102081 -0.042643 0.356521 0.029474 -0.859374
4.400000 2.230198 0.103065 -0.042187 0.335969 0.029204 -1.351862
4.433333 2.241257 0.104029 -0.036858 0.314756 0.028930 -1.971000
4.466667 2.251754 0.104973 -0.028453 0.292948 0.028644 -2.697853
4.500000 2.261220 0.105933 -0.050132 0.270634 0.028334 -3.493488
4.533333 2.270111 0.106871 -0.133962 0.247793 0.027989 -4.300639
4.566667 2.278424 0.107787 -0.300143 0.224417 0.027596 -5.066446
4.600000 2.285634 0.108712 -0.548625 0.200495 0.027136 -5.722092
4.633333 2.291725 0.109642 -0.858238 0.176020 0.026582 -6.208503
4.666667 2.297225 0.110548 -1.208313 0.150900 0.025907 -6.476304
4.700000 2.301586 0.111440 -1.493969 0.125047 0.025088 -6.503295
4.733333 2.305348 0.112307 -1.827872 0.098494 0.024108 -6.288038
4.766667 2.308510 0.113147 -2.108368 0.071317 0.022956 -5.849847
4.800000 2.311069 0.113961 -2.341626 0.043594 0.021636 -5.237718
4.833333 2.312482 0.114718 -2.511397 0.015445 0.020168 -4.519026
4.866667 2.312753 0.115410 -2.628781 -0.012883 0.018584 -3.766292
4.900000 2.311889 0.116028 -2.692109 -0.041112 0.016922 -3.035276
4.933333 2.309901 0.116567 -2.705718 -0.069000 0.015220 -2.380409
4.966667 2.306800 0.117026 -2.691982 -0.096334 0.013511 -1.839881
5.000000 2.302599 0.117405 -2.692667 -0.122894 0.011822 -1.431984
5.033333 2.297310 0.117704 -2.710207 -0.148533 0.010166 -1.152888
5.066667 2.291428 0.117973 -2.739165 -0.173238 0.008549 -0.985220
5.100000 2.284956 0.118210 -2.765778 -0.197080 0.006962 -0.911357
5.133333 2.277898 0.118416 -2.782872 -0.220153 0.005397 -0.903310
5.166667 2.270260 0.118591 -2.828610 -0.242577 0.003845 -0.927911
5.200000 2.262045 0.118734 -2.875815 -0.264493 0.002298 -0.959639
5.233333 2.253260 0.118846 -2.923945 -0.286027 0.000749 -0.979058
5.266667 2.243523 0.118877 -2.947252 -0.307243 -0.000791 -0.979956
5.300000 2.232858 0.118826 -2.986920 -0.328146 -0.002297 -0.951165
5.333333 2.221288 0.118693 -3.009627 -0.348715 -0.003733 -0.892324
5.366667 2.208837 0.118475 -3.056512 -0.368903 -0.005060 -0.812416
5.400000 2.195848 0.118226 -3.086002 -0.388661 -0.006237 -0.716163
5.433333 2.182329 0.117944 -3.138886 -0.407943 -0.007223 -0.610720
5.466667 2.168288 0.117631 3.138751 -0.426742 -0.008008 -0.494460
5.500000 2.153735 0.117286 3.130334 -0.445084 -0.008609 -0.380791
5.533333 2.138676 0.116910 3.129182 -0.463036 -0.009067 -0.273418
5.566667 2.123123 0.116503 3.131534 -0.480691 -0.009426 -0.173323
5.600000 2.106885 0.116160 3.111553 -0.498106 -0.009752 -0.084770
5.633333 2.089989 0.115880 3.138154 -0.515297 -0.010109 -0.012632
5.666667 2.072460 0.115664 -3.130619 -0.532235 -0.010552 0.038315
5.700000 2.054304 0.115354 3.125938 -0.548864 -0.011121 0.075800
5.733333 2.035566 0.115110 -3.129278 -0.565087 -0.011849 0.097109
5.766667 2.016251 0.114774 -3.137726 -0.580781 -0.012768 0.105910
5.800000 1.996384 0.114345 -3.116546 -0.595860 -0.013886 0.101839
5.833333 1.976103 0.113886 -3.127055 -0.610278 -0.015200 0.092620
5.866667 1.955316 0.113338 -3.109975 -0.624011 -0.016685 0.079842
5.900000 1.934137 0.112759 -3.116224 -0.637052 -0.018324 0.060044
5.933333 1.912580 0.112150 -3.118499 -0.649424 -0.020079 0.040776
5.966667 1.890656 0.111510 -3.111980 -0.661168 -0.021915 0.019559
6.000000 1.868326 0.110786 -3.104762 -0.672324 -0.023804 0.001561
6.033333 1.845615 0.109978 -3.109086 -0.682910 -0.025726 -0.015317
6.066667 1.822549 0.109086 -3.114335 -0.692944 -0.027673 -0.027489
6.100000 1.799150 0.108111 -3.116240 -0.702430 -0.029626 -0.034094
6.133333 1.775445 0.107055 -3.121456 -0.711356 -0.031581 -0.039098
6.166667 1.751447 0.105971 -3.123902 -0.719705 -0.033522 -0.040449
6.200000 1.727186 0.104806 -3.128843 -0.727455 -0.035444 -0.038839
6.233333 1.702684 0.103562 -3.129941 -0.734589 -0.037340 -0.035144
6.266667 1.677929 0.102292 -3.126291 -0.741091 -0.039210 -0.033609
6.300000 1.652981 0.100945 -3.127820 -0.746964 -0.041052 -0.032539
6.333333 1.627805 0.099574 -3.129081 -0.752226 -0.042864 -0.031040
6.366667 1.602484 0.098128 -3.122393 -0.756886 -0.044653 -0.031383
6.400000 1.577043 0.096607 -3.121464 -0.760958 -0.046402 -0.034008
6.433333 1.551505 0.095014 -3.125032 -0.764456 -0.048101 -0.038164
6.466667 1.525886 0.093348 -3.132765 -0.767401 -0.049727 -0.040461
6.500000 1.500104 0.091663 -3.133230 -0.769782 -0.051259 -0.043917
6.533333 1.474287 0.089908 -3.137035 -0.771573 -0.052662 -0.047498
6.566667 1.448457 0.088083 -3.134705 -0.772772 -0.053899 -0.047967
6.600000 1.422636 0.086190 3.135598 -0.773399 -0.054952 -0.045113
6.633333 1.396700 0.084283 -3.137262 -0.773479 -0.055803 -0.040101
6.666667 1.370663 0.082362 -3.138761 -0.773037 -0.056438 -0.034774
6.700000 1.344694 0.080375 3.135867 -0.772133 -0.056855 -0.025780
6.733333 1.318834 0.078480 -3.140923 -0.770840 -0.057080 -0.016103
6.766667 1.293075 0.076520 -3.139612 -0.769216 -0.057143 -0.008041
6.800000 1.267435 0.074495 3.137263 -0.767285 -0.057068 -0.003781
6.833333 1.241954 0.072564 3.125952 -0.765081 -0.056891 -0.000562
6.866667 1.216646 0.070726 3.136608 -0.762651 -0.056657 0.000888
6.900000 1.191317 0.068886 -3.137897 -0.760029 -0.056399 -0.002231
6.933333 1.165978 0.067042 -3.138430 -0.757251 -0.056138 -0.007872
6.966667 1.140641 0.065198 -3.135770 -0.754315 -0.055893 -0.015616
7.000000 1.115314 0.063353 -3.139996 -0.751234 -0.055675 -0.023109
7.033333 1.090210 0.061448 3.141315 -0.748009 -0.055475 -0.033156
7.066667 1.065363 0.059639 3.141049 -0.744601 -0.055268 -0.043536
7.100000 1.040559 0.057833 -3.140453 -0.740950 -0.055022 -0.051255
7.133333 1.016016 0.055968 3.129409 -0.737011 -0.054702 -0.055085
7.166667 0.991534 0.054108 3.131038 -0.732791 -0.054279 -0.055838
7.200000 0.967124 0.052256 3.126051 -0.728276 -0.053723 -0.053490
7.233333 0.942794 0.050411 3.125370 -0.723414 -0.053013 -0.047354
7.266667 0.918555 0.048577 3.121606 -0.718154 -0.052127 -0.037247
7.300000 0.894651 0.046840 3.123690 -0.712504 -0.051068 -0.026648
7.333333 0.870855 0.045116 3.121334 -0.706437 -0.049845 -0.018065
7.366667 0.847177 0.043404 3.119353 -0.699907 -0.048466 -0.009627
7.400000 0.823858 0.041791 3.117156 -0.692907 -0.046948 -0.002819
7.433333 0.800908 0.040277 3.129397 -0.685486 -0.045320 0.001562
7.466667 0.778099 0.038779 3.130989 -0.677714 -0.043619 0.001122
7.500000 0.755441 0.037297 3.121346 -0.669583 -0.041852 -0.001206
7.533333 0.733173 0.035915 3.127400 -0.661119 -0.040030 -0.004924
7.566667 0.711305 0.034634 3.121829 -0.652372 -0.038170 -0.011295
7.600000 0.689840 0.033454 3.132030 -0.643390 -0.036288 -0.021217
7.633333 0.668553 0.032293 3.122841 -0.634179 -0.034385 -0.031578
7.666667 0.647451 0.031151 3.123445 -0.624750 -0.032464 -0.041516
7.700000 0.626540 0.030029 3.121959 -0.615169 -0.030548 -0.052724
7.733333 0.606056 0.029007 3.122155 -0.605482 -0.028651 -0.065134
7.766667 0.586005 0.028085 3.115148 -0.595718 -0.026782 -0.080683
7.800000 0.566389 0.027262 3.117875 -0.585882 -0.024943 -0.112106
7.833333 0.547214 0.026539 3.110328 -0.576039 -0.023153 -0.185800
7.866667 0.528259 0.025836 3.113358 -0.566269 -0.021439 -0.344247
7.900000 0.509526 0.025155 3.104900 -0.556618 -0.019817 -0.636071
7.933333 0.491021 0.024495 3.098071 -0.547096 -0.018293 -1.110820
7.966667 0.472968 0.023930 3.092610 -0.537699 -0.016875 -1.810527
8.000000 0.455369 0.023458 3.091877 -0.528421 -0.015567 -2.222835
8.033333 0.438010 0.023007 3.085517 -0.519187 -0.014358 -2.331603
8.066667 0.420894 0.022577 3.077550 -0.509904 -0.013229 -2.078508
8.100000 0.404025 0.022168 3.041009 -0.500500 -0.012171 -1.387233
8.133333 0.387405 0.021778 2.854482 -0.490952 -0.011187 -0.160006
8.166667 0.371037 0.021409 2.556856 -0.481240 -0.010278 1.701038
8.200000 0.354926 0.021059 2.046300 -0.471326 -0.009440 3.244881
8.233333 0.339269 0.020770 1.442506 -0.461233 -0.008678 4.559419
8.266667 0.324060 0.020527 0.827800 -0.450994 -0.008001 5.198214
8.300000 0.309291 0.020314 0.261776 -0.440653 -0.007416 5.231134
8.333333 0.294787 0.020119 -0.235361 -0.430232 -0.006929 4.685558
8.366667 0.280709 0.019927 -0.631895 -0.419786 -0.006548 3.567563
8.400000 0.266898 0.019753 -0.965824 -0.409379 -0.006286 2.359448
8.433333 0.253499 0.019563 -1.272372 -0.399036 -0.006149 0.983560
8.466667 0.240369 0.019391 -1.493216 -0.388761 -0.006131 0.369827
8.500000 0.227635 0.019191 -1.708044 -0.378539 -0.006214 0.373392
8.533333 0.215172 0.019007 -1.868020 -0.368363 -0.006373 0.861056
8.566667 0.202981 0.018838 -1.907311 -0.358202 -0.006582 1.709520
8.600000 0.191164 0.018631 -1.734430 -0.348038 -0.006808 2.815614
8.633333 0.179715 0.018391 -1.406736 -0.337868 -0.007022 4.101516
8.666667 0.168626 0.018126 -1.036050 -0.327713 -0.007196 4.993097
8.700000 0.157891 0.017844 -0.633525 -0.317593 -0.007312 5.469321
8.733333 0.147504 0.017557 -0.265486 -0.307541 -0.007355 5.537671
8.766667 0.137460 0.017273 0.015318 -0.297607 -0.007311 5.227841
8.800000 0.127753 0.016999 0.288374 -0.287829 -0.007179 4.600511
8.833333 0.118376 0.016742 0.392704 -0.278241 -0.006962 3.745276
8.866667 0.109323 0.016503 0.404304 -0.268865 -0.006674 2.766560
8.900000 0.100586 0.016283 0.400735 -0.259721 -0.006328 1.774740
8.933333 0.092159 0.016081 0.388952 -0.250813 -0.005943 0.856863
8.966667 0.083994 0.015893 0.392963 -0.242131 -0.005538 0.078485
9.000000 0.076124 0.015722 0.357511 -0.233667 -0.005130 -0.516306
9.033333 0.068512 0.015563 0.252193 -0.225410 -0.004729 -0.918430
9.066667 0.061156 0.015417 0.185369 -0.217342 -0.004344 -1.147506
9.100000 0.054075 0.015283 0.094887 -0.209450 -0.003977 -1.237049
9.133333 0.047262 0.015160 0.024788 -0.201721 -0.003629 -1.217311
9.166667 0.040698 0.015049 -0.030446 -0.194147 -0.003302 -1.116698
9.200000 0.034380 0.014949 -0.071934 -0.186717 -0.002995 -0.965129
9.233333 0.028311 0.014856 -0.085826 -0.179426 -0.002706 -0.792870
9.266667 0.022482 0.014773 -0.094345 -0.172272 -0.002434 -0.614936
9.300000 0.016892 0.014702 -0.081948 -0.165252 -0.002176 -0.447356
9.333333 0.011537 0.014641 -0.090011 -0.158364 -0.001932 -0.301847
9.366667 0.006406 0.014585 -0.081797 -0.151604 -0.001699 -0.186151
9.400000 0.001491 0.014533 -0.084105 -0.144972 -0.001476 -0.104257
9.433333 -0.003213 0.014486 -0.089550 -0.138472 -0.001261 -0.051048
9.466667 -0.007693 0.014448 -0.081286 -0.132102 -0.001055 -0.021840
9.500000 -0.011974 0.014414 -0.089340 -0.125863 -0.000855 -0.006276
9.533333 -0.016037 0.014389 -0.091911 -0.119760 -0.000661 0.000260
9.566667 -0.019887 0.014374 -0.082382 -0.113795 -0.000473 0.001987
9.600000 -0.023556 0.014361 -0.088959 -0.107965 -0.000289 0.002117
9.633333 -0.027017 0.014357 -0.088507 -0.102264 -0.000111 0.002453
9.666667 -0.030275 0.014362 -0.083713 -0.096692 0.000063 0.004314
9.700000 -0.033368 0.014369 -0.082432 -0.091247 0.000232 0.004519
9.733333 -0.036301 0.014380 -0.082146 -0.085922 0.000396 0.003685
9.766667 -0.039080 0.014393 -0.092908 -0.080712 0.000556 0.003286
9.800000 -0.041670 0.014414 -0.089044 -0.075619 0.000712 0.002327
9.833333 -0.044073 0.014442 -0.081751 -0.070645 0.000862 0.001684
