t x y theta dxdt dydt dthetadt
0.000000 0.000000 0.000000 0.023063 0.009455 -0.003954 -0.001468
0.033333 0.001381 -0.000722 0.015169 0.013607 -0.005778 -0.001968
0.066667 0.002228 -0.001037 0.022717 0.018094 -0.007606 -0.002042
0.100000 0.002487 -0.001242 0.009600 0.023318 -0.009579 0.000285
0.133333 0.002387 -0.001094 0.022744 0.029993 -0.011896 0.003610
0.166667 0.002829 -0.001232 0.015430 0.038764 -0.014800 0.009462
0.200000 0.003829 -0.001666 0.016493 0.050253 -0.018544 0.018421
0.233333 0.004898 -0.002080 0.014500 0.065296 -0.023501 0.028645
0.266667 0.005891 -0.002631 0.016243 0.084538 -0.029976 0.040004
0.300000 0.007595 -0.003239 0.018406 0.108549 -0.038317 0.046785
0.333333 0.010018 -0.004017 0.020770 0.137369 -0.048779 0.051291
0.366667 0.013607 -0.005262 0.021365 0.171090 -0.061674 0.049179
0.400000 0.019071 -0.007105 0.022006 0.209708 -0.077282 0.041619
0.433333 0.025206 -0.009306 0.035971 0.252894 -0.095741 0.028671
0.466667 0.034569 -0.012295 0.034724 0.299921 -0.117052 0.012530
0.500000 0.044627 -0.015658 0.044670 0.349833 -0.140981 -0.003632
0.533333 0.055390 -0.019404 0.041381 0.401964 -0.167264 -0.020214
0.566667 0.069195 -0.024508 0.040164 0.455520 -0.195453 -0.032682
0.600000 0.085254 -0.030892 0.028782 0.509835 -0.225117 -0.041300
0.633333 0.104059 -0.039000 0.020990 0.564091 -0.255679 -0.044400
0.666667 0.124859 -0.048536 0.017587 0.617970 -0.286635 -0.043700
0.700000 0.147530 -0.059617 0.004315 0.671220 -0.317519 -0.037869
0.733333 0.170929 -0.071105 0.008691 0.723383 -0.347870 -0.027309
0.766667 0.196382 -0.083840 0.016458 0.773985 -0.377268 -0.016280
0.800000 0.222558 -0.096981 0.022185 0.822601 -0.405318 -0.006102
0.833333 0.249452 -0.110527 0.023218 0.869574 -0.432082 0.000641
0.866667 0.279512 -0.125488 0.018005 0.915045 -0.457673 0.003445
0.900000 0.312339 -0.141666 0.026185 0.959173 -0.482331 0.000437
0.933333 0.346527 -0.158847 0.023470 1.002062 -0.506173 -0.007982
0.966667 0.381403 -0.176421 0.022516 1.044014 -0.529451 -0.019002
1.000000 0.416953 -0.194383 0.025565 1.085260 -0.552388 -0.031534
1.033333 0.453166 -0.212727 0.020390 1.125220 -0.574775 -0.042770
1.066667 0.491280 -0.232357 0.021883 1.163513 -0.596409 -0.053056
1.100000 0.530031 -0.252357 0.011172 1.200010 -0.617129 -0.061920
1.133333 0.569405 -0.272721 0.014669 1.234795 -0.636952 -0.070332
1.166667 0.613248 -0.295402 0.004551 1.267524 -0.655661 -0.078003
1.200000 0.657680 -0.318432 -0.000757 1.297906 -0.673097 -0.084427
1.233333 0.702681 -0.341799 0.010032 1.325972 -0.689265 -0.094153
1.266667 0.748232 -0.365495 0.008301 1.351981 -0.704366 -0.104796
1.300000 0.794313 -0.389509 -0.005280 1.375953 -0.718503 -0.114922
1.333333 0.840902 -0.413832 -0.002309 1.397850 -0.731731 -0.124951
1.366667 0.887980 -0.438452 -0.002908 1.418283 -0.744433 -0.134254
1.400000 0.935525 -0.463360 -0.012225 1.437927 -0.756924 -0.143367
1.433333 0.983516 -0.488545 -0.020145 1.457457 -0.769518 -0.145700
1.466667 1.031932 -0.513995 -0.023433 1.476934 -0.782156 -0.143691
1.500000 1.080751 -0.539701 -0.036858 1.496454 -0.794784 -0.139472
1.533333 1.130557 -0.566313 -0.034032 1.516062 -0.807298 -0.130676
1.566667 1.180722 -0.593158 -0.057521 1.535295 -0.819314 -0.115995
1.600000 1.233882 -0.621744 -0.052154 1.553381 -0.830391 -0.097957
1.633333 1.286481 -0.650191 -0.045555 1.569621 -0.840118 -0.081586
1.666667 1.339363 -0.678829 -0.062190 1.583728 -0.848347 -0.065720
1.700000 1.392503 -0.707646 -0.049209 1.595557 -0.854996 -0.051104
1.733333 1.447862 -0.737140 -0.048628 1.605103 -0.860180 -0.039644
1.766667 1.503425 -0.766784 -0.050592 1.612644 -0.864240 -0.038732
1.800000 1.558338 -0.795999 -0.058125 1.618747 -0.867665 -0.044565
1.833333 1.612117 -0.824773 -0.059580 1.623943 -0.870933 -0.056328
1.866667 1.666019 -0.853653 -0.060765 1.628593 -0.874393 -0.073579
1.900000 1.717756 -0.881275 -0.038098 1.633138 -0.878475 -0.096449
1.933333 1.771912 -0.910158 -0.051392 1.637658 -0.883312 -0.122450
1.966667 1.826114 -0.939107 -0.058902 1.642455 -0.889075 -0.143630
2.000000 1.880923 -0.968610 -0.077176 1.647615 -0.895771 -0.158958
2.033333 1.935725 -0.998151 -0.069387 1.653084 -0.903342 -0.165775
2.066667 1.992934 -1.029243 -0.080074 1.658691 -0.911687 -0.163971
2.100000 2.048917 -1.060339 -0.092026 1.664028 -0.920470 -0.149357
2.133333 2.104807 -1.091426 -0.101137 1.669190 -0.929582 -0.124166
2.166667 2.160576 -1.122489 -0.126999 1.673743 -0.938606 -0.092442
2.200000 2.216195 -1.153510 -0.121890 1.677422 -0.947258 -0.059736
2.233333 2.271572 -1.184675 -0.123161 1.680064 -0.955357 -0.027480
2.266667 2.326295 -1.216080 -0.125128 1.681864 -0.962906 0.001297
2.300000 2.383377 -1.249219 -0.103329 1.682726 -0.969846 0.022110
2.333333 2.440195 -1.282249 -0.093749 1.682230 -0.976063 0.034102
2.366667 2.496719 -1.315150 -0.088738 1.680174 -0.981592 0.036623
2.400000 2.553377 -1.348481 -0.083893 1.676269 -0.986383 0.033988
2.433333 2.610084 -1.381885 -0.088248 1.670201 -0.990251 0.025910
2.466667 2.666406 -1.415102 -0.090246 1.661440 -0.992880 0.015532
2.500000 2.722312 -1.448114 -0.096016 1.650017 -0.994278 0.007573
2.533333 2.777773 -1.480900 -0.100242 1.636148 -0.994426 0.004413
2.566667 2.832654 -1.514311 -0.099842 1.620071 -0.993336 0.007027
2.600000 2.886911 -1.548103 -0.113399 1.602115 -0.991068 0.014891
2.633333 2.940632 -1.581609 -0.106259 1.582529 -0.987764 0.027222
2.666667 2.992714 -1.614991 -0.104104 1.561277 -0.983364 0.043838
2.700000 3.044205 -1.648046 -0.095975 1.538110 -0.977661 0.060236
2.733333 3.095078 -1.680753 -0.085913 1.512688 -0.970460 0.075906
2.766667 3.145305 -1.713091 -0.087567 1.484219 -0.961268 0.094062
2.800000 3.194861 -1.745041 -0.090578 1.451854 -0.949650 0.115974
2.833333 3.243720 -1.776582 -0.076613 1.414589 -0.934895 0.144578
2.866667 3.291855 -1.807694 -0.074268 1.372056 -0.916753 0.179910
2.900000 3.339402 -1.839637 -0.076003 1.323609 -0.894684 0.226515
2.933333 3.386176 -1.871110 -0.076099 1.268424 -0.867978 0.283977
2.966667 3.430442 -1.901949 -0.074608 1.206554 -0.836281 0.347019
3.000000 3.469025 -1.929709 -0.065064 1.138398 -0.799259 0.409282
3.033333 3.506772 -1.956943 -0.056873 1.065032 -0.756995 0.466503
3.066667 3.543666 -1.983634 -0.032324 0.987263 -0.709234 0.512817
3.100000 3.574745 -2.006941 -0.002836 0.906883 -0.656545 0.536567
3.133333 3.604947 -2.029677 0.031111 0.826052 -0.599859 0.529222
3.166667 3.629320 -2.048410 0.066330 0.746884 -0.540457 0.487197
3.200000 3.652803 -2.066551 0.084872 0.670837 -0.479495 0.412371
3.233333 3.672153 -2.081846 0.118070 0.599006 -0.418258 0.302595
3.266667 3.688417 -2.094422 0.135386 0.532582 -0.358443 0.165886
3.300000 3.702359 -2.104442 0.137982 0.471242 -0.301076 0.017141
3.333333 3.714496 -2.112059 0.131663 0.414553 -0.247151 -0.125779
3.366667 3.725641 -2.117372 0.136853 0.361285 -0.197084 -0.250246
3.400000 3.736420 -2.120655 0.116038 0.310489 -0.151465 -0.347502
3.433333 3.746347 -2.123342 0.075428 0.261138 -0.110486 -0.404745
3.466667 3.755429 -2.125440 0.027359 0.211487 -0.073730 -0.419590
3.500000 3.763677 -2.126957 -0.009371 0.161007 -0.040824 -0.395664
3.533333 3.771100 -2.127899 -0.036980 0.109014 -0.011095 -0.343303
3.566667 3.774882 -2.127568 -0.056829 0.055452 0.016074 -0.268576
3.600000 3.777865 -2.126678 -0.050210 0.000352 0.041541 -0.181542
3.633333 3.773826 -2.124404 -0.044011 -0.055848 0.066095 -0.095828
3.666667 3.769024 -2.121591 -0.017414 -0.111749 0.090088 -0.023930
3.700000 3.763482 -2.118250 -0.005706 -0.166398 0.113877 0.027779
3.733333 3.757221 -2.114391 0.002141 -0.218736 0.137729 0.057719
3.766667 3.750266 -2.110027 0.012046 -0.268170 0.161883 0.062507
3.800000 3.737982 -2.103602 0.016601 -0.313581 0.186340 0.047885
3.833333 3.725055 -2.096695 0.013622 -0.354598 0.210984 0.019100
3.866667 3.711514 -2.089321 0.009834 -0.391063 0.235938 -0.012981
3.900000 3.697389 -2.081493 0.002158 -0.422739 0.261129 -0.041984
3.933333 3.682710 -2.073225 -0.008475 -0.449443 0.286369 -0.062554
3.966667 3.665733 -2.063012 -0.011716 -0.470616 0.311286 -0.067188
4.000000 3.648263 -2.052390 -0.019128 -0.486565 0.335775 -0.053718
4.033333 3.629807 -2.040205 -0.020003 -0.496925 0.359709 -0.019248
4.066667 3.611245 -2.026963 -0.016369 -0.501403 0.382732 0.034777
4.100000 3.592288 -2.013363 -0.029253 -0.499760 0.404585 0.108012
4.133333 3.575151 -1.999329 -0.018954 -0.491914 0.425059 0.193109
4.166667 3.557683 -1.984976 -0.028358 -0.478088 0.444198 0.282032
4.200000 3.542050 -1.969041 -0.022379 -0.458271 0.461927 0.363010
4.233333 3.526146 -1.952825 -0.012508 -0.433069 0.478326 0.426531
4.266667 3.509998 -1.936352 0.008892 -0.403491 0.493620 0.458307
4.300000 3.493637 -1.919640 0.037931 -0.370272 0.508130 0.445830
4.333333 3.480445 -1.902437 0.085278 -0.333829 0.522213 0.385446
4.366667 3.470233 -1.884810 0.115739 -0.294536 0.536134 0.274311
4.400000 3.463648 -1.866539 0.155582 -0.253264 0.550055 0.115601
4.433333 3.456942 -1.848116 0.186227 -0.210604 0.564010 -0.084165
4.466667 3.450131 -1.829563 0.176644 -0.166858 0.578016 -0.302801
4.500000 3.443232 -1.810900 0.158136 -0.122891 0.591899 -0.520758
4.533333 3.441137 -1.790338 0.126655 -0.080219 0.605144 -0.715026
4.566667 3.438983 -1.769712 0.091464 -0.040290 0.616837 -0.866781
4.600000 3.436782 -1.749046 0.004084 -0.003695 0.626186 -0.951690
4.633333 3.437888 -1.727219 -0.047500 0.028752 0.632405 -0.955666
4.666667 3.441810 -1.704902 -0.115763 0.056002 0.634664 -0.877738
4.700000 3.447612 -1.681969 -0.169931 0.077331 0.631547 -0.716108
4.733333 3.453392 -1.659094 -0.221659 0.093091 0.622250 -0.480740
4.766667 3.458860 -1.636874 -0.234249 0.103842 0.606719 -0.184474
4.800000 3.464310 -1.614763 -0.231356 0.109837 0.584867 0.142846
4.833333 3.469745 -1.592784 -0.220066 0.111864 0.556759 0.475508
4.866667 3.473345 -1.572688 -0.186748 0.111468 0.522264 0.786298
4.900000 3.475266 -1.556733 -0.156220 0.110264 0.482972 1.045639
4.933333 3.477184 -1.540975 -0.097284 0.109217 0.439915 1.230201
4.966667 3.479104 -1.525429 -0.021223 0.109106 0.393702 1.325038
5.000000 3.481033 -1.510113 0.055894 0.110462 0.344803 1.328713
5.033333 3.485319 -1.502674 0.163531 0.113344 0.294231 1.241632
5.066667 3.489621 -1.495489 0.237421 0.116718 0.243429 1.075004
5.100000 3.493942 -1.488565 0.286829 0.119310 0.192490 0.845927
5.133333 3.498286 -1.481910 0.315793 0.119724 0.141909 0.580678
5.166667 3.502653 -1.475529 0.317073 0.116589 0.092230 0.312279
5.200000 3.508543 -1.474539 0.302103 0.108792 0.044524 0.067150
5.233333 3.514460 -1.473831 0.271512 0.095612 -0.001410 -0.120258
5.266667 3.519321 -1.476603 0.236938 0.077302 -0.045604 -0.225614
5.300000 3.524213 -1.479652 0.191913 0.054256 -0.087763 -0.231414
5.333333 3.526198 -1.484710 0.157619 0.027509 -0.127732 -0.141041
5.366667 3.528221 -1.490035 0.122452 -0.001900 -0.165360 0.023149
5.400000 3.526704 -1.496743 0.088912 -0.032562 -0.201226 0.243190
5.433333 3.525238 -1.503703 0.059441 -0.063265 -0.235272 0.484406
5.466667 3.520189 -1.512469 0.091085 -0.093146 -0.268144 0.712167
5.500000 3.515212 -1.521467 0.184480 -0.121346 -0.300486 0.891569
5.533333 3.508944 -1.532902 0.237638 -0.147430 -0.332621 1.008511
5.566667 3.502773 -1.544546 0.344870 -0.171017 -0.365070 1.054678
5.600000 3.496714 -1.556383 0.435683 -0.192072 -0.397912 1.023612
5.633333 3.490781 -1.568400 0.504089 -0.210557 -0.431222 0.921689
5.666667 3.483458 -1.583926 0.528047 -0.226190 -0.464360 0.769644
5.700000 3.476290 -1.599599 0.529933 -0.238687 -0.496688 0.599485
5.733333 3.467294 -1.617718 0.528475 -0.247389 -0.527828 0.429908
5.766667 3.458485 -1.635943 0.501339 -0.251163 -0.556924 0.292739
5.800000 3.447745 -1.656677 0.475619 -0.248902 -0.583023 0.209152
5.833333 3.437228 -1.677469 0.455903 -0.239090 -0.605103 0.194234
5.866667 3.426952 -1.698296 0.453695 -0.220500 -0.622700 0.244906
5.900000 3.416306 -1.721506 0.443119 -0.191862 -0.635160 0.346393
5.933333 3.407898 -1.744672 0.452478 -0.152955 -0.642131 0.484126
5.966667 3.399786 -1.767791 0.464250 -0.104228 -0.643475 0.629585
6.000000 3.395418 -1.790509 0.496898 -0.046493 -0.639395 0.762679
6.033333 3.391374 -1.813125 0.543241 0.018750 -0.630230 0.861992
6.066667 3.391601 -1.835031 0.597145 0.089173 -0.616275 0.916587
6.100000 3.396602 -1.855770 0.679258 0.161936 -0.598281 0.918268
6.133333 3.401951 -1.876325 0.712622 0.235027 -0.576792 0.868023
6.166667 3.412602 -1.895773 0.758361 0.305889 -0.552630 0.771500
6.200000 3.428647 -1.913464 0.793932 0.372040 -0.526679 0.635776
6.233333 3.445029 -1.930897 0.808100 0.430945 -0.499805 0.476310
6.266667 3.461739 -1.948046 0.808707 0.481271 -0.472746 0.308092
6.300000 3.480321 -1.962965 0.814552 0.522099 -0.446090 0.149482
6.333333 3.500755 -1.976422 0.805728 0.551972 -0.420502 0.012556
6.366667 3.523195 -1.989326 0.782633 0.570739 -0.396429 -0.090820
6.400000 3.545207 -2.001312 0.772143 0.579007 -0.374044 -0.152745
6.433333 3.567039 -2.012544 0.760940 0.577941 -0.353482 -0.174963
6.466667 3.589263 -2.023828 0.733307 0.568319 -0.334843 -0.163067
6.500000 3.608811 -2.034220 0.725709 0.551573 -0.317917 -0.127122
6.533333 3.628581 -2.044168 0.704185 0.529717 -0.302084 -0.076122
6.566667 3.646341 -2.053927 0.699507 0.504589 -0.286701 -0.021104
6.600000 3.664303 -2.063207 0.713454 0.477491 -0.271159 0.027758
6.633333 3.678508 -2.071969 0.728221 0.449653 -0.254659 0.063563
6.666667 3.690069 -2.080867 0.751085 0.422563 -0.236421 0.080305
6.700000 3.701814 -2.089232 0.769622 0.396988 -0.215916 0.075782
6.733333 3.713739 -2.097046 0.781227 0.373651 -0.193062 0.047497
6.766667 3.725842 -2.104291 0.780851 0.352719 -0.167772 -0.008322
6.800000 3.738120 -2.110950 0.777172 0.334417 -0.140006 -0.089068
6.833333 3.749242 -2.116006 0.759944 0.318842 -0.110034 -0.189518
6.866667 3.758590 -2.118665 0.754891 0.305767 -0.078346 -0.304586
6.900000 3.768108 -2.120692 0.754340 0.295272 -0.045271 -0.432652
6.933333 3.777797 -2.122073 0.747502 0.287392 -0.010910 -0.569173
6.966667 3.785912 -2.120921 0.719947 0.282754 0.024519 -0.698627
7.000000 3.794200 -2.119100 0.705322 0.281981 0.060799 -0.814012
7.033333 3.802661 -2.116599 0.669242 0.285463 0.097799 -0.907508
7.066667 3.811299 -2.113409 0.652133 0.293520 0.135897 -0.972298
7.100000 3.819625 -2.108678 0.573116 0.306181 0.175366 -0.988523
7.133333 3.828131 -2.103240 0.537065 0.323239 0.216503 -0.949478
7.166667 3.837970 -2.095688 0.487041 0.343679 0.259743 -0.859475
7.200000 3.847990 -2.087415 0.444073 0.366457 0.305676 -0.721775
7.233333 3.860346 -2.076996 0.363375 0.390552 0.354801 -0.543102
7.266667 3.874278 -2.064880 0.337151 0.414884 0.407194 -0.331580
7.300000 3.890611 -2.050107 0.334438 0.438215 0.462615 -0.115700
7.333333 3.907113 -2.034602 0.359888 0.459455 0.520659 0.089906
7.366667 3.923777 -2.018367 0.394393 0.478054 0.580844 0.271567
7.400000 3.940862 -1.999506 0.420717 0.493548 0.642287 0.416337
7.433333 3.958507 -1.977460 0.474351 0.505803 0.704137 0.508936
7.466667 3.976302 -1.952487 0.508710 0.515063 0.765430 0.543226
7.500000 3.994165 -1.924429 0.535241 0.522122 0.825418 0.525952
7.533333 4.011854 -1.893825 0.565677 0.527742 0.883135 0.460081
7.566667 4.029661 -1.862539 0.578254 0.532576 0.937528 0.351593
7.600000 4.046844 -1.829106 0.579333 0.537243 0.987757 0.210895
7.633333 4.064129 -1.795024 0.580159 0.542252 1.033280 0.050855
7.666667 4.081887 -1.758822 0.590251 0.548127 1.073838 -0.122188
7.700000 4.099765 -1.720974 0.588947 0.555003 1.109410 -0.304878
7.733333 4.118420 -1.681720 0.566684 0.563113 1.140209 -0.487820
7.766667 4.137145 -1.641897 0.552903 0.572694 1.166538 -0.663226
7.800000 4.155932 -1.601526 0.524778 0.583893 1.188859 -0.829099
7.833333 4.175920 -1.561145 0.506687 0.596726 1.207479 -0.978850
7.866667 4.195950 -1.520263 0.471580 0.610818 1.222785 -1.104323
7.900000 4.216012 -1.478901 0.407770 0.625900 1.235102 -1.197879
7.933333 4.236096 -1.437084 0.363141 0.641642 1.245086 -1.263679
7.966667 4.256190 -1.394833 0.290282 0.657817 1.253468 -1.301190
8.000000 4.278983 -1.352263 0.224153 0.674052 1.260788 -1.306493
8.033333 4.301763 -1.309307 0.170366 0.690164 1.267500 -1.285924
8.066667 4.326655 -1.267656 0.145105 0.705986 1.274068 -1.248997
8.100000 4.351504 -1.225664 0.107808 0.721348 1.280868 -1.203425
8.133333 4.376293 -1.183354 0.060815 0.735970 1.287989 -1.151371
8.166667 4.401006 -1.140747 0.041859 0.749291 1.295307 -1.101332
8.200000 4.425626 -1.097865 0.014649 0.761216 1.302916 -1.063229
8.233333 4.450136 -1.054732 -0.017842 0.771566 1.311034 -1.035458
8.266667 4.476387 -1.010500 -0.052845 0.780361 1.319527 -1.014480
8.300000 4.503758 -0.965234 -0.089950 0.787519 1.328190 -1.001672
8.333333 4.531171 -0.920691 -0.101088 0.792936 1.336836 -0.998107
8.366667 4.558401 -0.875990 -0.158938 0.796730 1.345672 -0.996952
8.400000 4.585427 -0.831155 -0.206373 0.798712 1.354662 -0.994307
8.433333 4.612228 -0.786208 -0.221099 0.798679 1.363611 -0.995328
8.466667 4.639764 -0.740383 -0.271783 0.796361 1.372641 -0.998312
8.500000 4.666170 -0.695434 -0.297690 0.791658 1.382150 -1.001895
8.533333 4.692896 -0.649392 -0.315111 0.784391 1.392388 -1.002149
8.566667 4.719411 -0.602390 -0.335606 0.774361 1.403100 -1.004490
8.600000 4.745601 -0.555398 -0.380382 0.761310 1.414203 -1.008159
8.633333 4.771446 -0.508442 -0.420191 0.744994 1.425690 -1.005369
8.666667 4.796924 -0.461547 -0.461224 0.725418 1.437421 -0.998037
8.700000 4.821683 -0.412683 -0.486713 0.702378 1.448300 -0.983747
8.733333 4.846036 -0.363933 -0.522779 0.676047 1.457440 -0.961830
8.766667 4.869964 -0.315323 -0.571314 0.646436 1.463747 -0.928992
8.800000 4.891996 -0.265727 -0.598946 0.613751 1.465204 -0.890136
8.833333 4.912201 -0.215541 -0.636438 0.578206 1.459091 -0.852931
8.866667 4.930169 -0.165339 -0.662831 0.539966 1.442702 -0.821863
8.900000 4.947648 -0.115389 -0.676660 0.499484 1.413952 -0.800771
8.933333 4.963306 -0.064741 -0.699365 0.457129 1.370618 -0.791522
8.966667 4.978450 -0.014404 -0.725353 0.413571 1.311495 -0.793819
9.000000 4.993069 0.035593 -0.733514 0.369433 1.236993 -0.800510
9.033333 5.004477 0.080078 -0.750456 0.325534 1.148971 -0.802425
9.066667 5.015342 0.124172 -0.766575 0.282398 1.049342 -0.793008
9.100000 5.023802 0.161360 -0.794590 0.240632 0.941448 -0.763706
9.133333 5.029893 0.190180 -0.848293 0.200805 0.829420 -0.712474
9.166667 5.034168 0.210799 -0.916359 0.163430 0.717532 -0.637581
9.200000 5.037883 0.230987 -0.953894 0.128961 0.609370 -0.536190
9.233333 5.040303 0.241902 -0.985102 0.097405 0.508652 -0.404177
9.266667 5.042162 0.252401 -0.981363 0.068914 0.419070 -0.237985
9.300000 5.043460 0.262497 -0.969388 0.043141 0.342707 -0.039983
9.333333 5.044197 0.272203 -0.965973 0.019473 0.280314 0.191034
9.366667 5.044272 0.276482 -0.947805 -0.002891 0.231688 0.450024
9.400000 5.043787 0.280405 -0.940434 -0.024707 0.196476 0.731686
9.433333 5.042745 0.283993 -0.909114 -0.046547 0.172876 1.018682
9.466667 5.041573 0.286748 -0.905326 -0.069022 0.159117 1.303149
9.500000 5.039777 0.289610 -0.897214 -0.092334 0.153476 1.576794
9.533333 5.037115 0.293001 -0.851496 -0.116579 0.155037 1.832890
9.566667 5.032885 0.297701 -0.732422 -0.141689 0.162583 2.066419
9.600000 5.028110 0.302165 -0.627863 -0.167618 0.174960 2.265279
9.633333 5.021309 0.309105 -0.508278 -0.194191 0.191296 2.432912
9.666667 5.013973 0.315845 -0.401864 -0.221161 0.210632 2.562614
9.700000 5.006107 0.322400 -0.329798 -0.248416 0.232294 2.660918
9.733333 4.997718 0.328787 -0.231129 -0.275669 0.255344 2.727050
9.766667 4.987815 0.338532 -0.142383 -0.302712 0.279228 2.772719
9.800000 4.977404 0.348137 -0.054824 -0.329336 0.303393 2.815480
9.833333 4.966494 0.357615 0.009679 -0.355389 0.327560 2.860976
9.866667 4.953777 0.370138 0.123159 -0.380645 0.351229 2.917373
9.900000 4.940579 0.382554 0.213637 -0.404840 0.374119 2.972600
9.933333 4.926911 0.394873 0.272337 -0.427703 0.396053 3.025385
9.966667 4.911140 0.409904 0.397769 -0.448809 0.417242 3.058746
10.000000 4.894922 0.424851 0.490471 -0.467727 0.438203 3.058477
10.033333 4.878271 0.439721 0.646106 -0.484041 0.459465 3.009244
10.066667 4.861284 0.456064 0.768005 -0.497528 0.482145 2.902002
10.100000 4.843890 0.472338 0.886165 -0.508030 0.506858 2.740038
10.133333 4.826104 0.488546 1.001377 -0.515611 0.534102 2.522050
10.166667 4.807938 0.504694 1.087863 -0.520780 0.564353 2.264650
10.200000 4.789408 0.520783 1.188148 -0.524208 0.597532 1.975388
10.233333 4.770922 0.539836 1.244501 -0.526597 0.633308 1.679386
10.266667 4.753364 0.560831 1.266645 -0.528710 0.670788 1.397332
10.300000 4.736687 0.583711 1.275724 -0.531554 0.709106 1.149688
10.333333 4.719777 0.610232 1.299120 -0.536010 0.747069 0.954695
10.366667 4.702567 0.636683 1.308842 -0.542614 0.783160 0.816207
10.400000 4.685533 0.665371 1.309551 -0.551648 0.815842 0.746191
10.433333 4.668220 0.693970 1.315326 -0.563323 0.844083 0.738608
10.466667 4.650507 0.723571 1.318573 -0.577668 0.867063 0.781960
10.500000 4.631888 0.754572 1.342275 -0.594107 0.884286 0.857257
10.533333 4.611326 0.786279 1.366894 -0.611916 0.895901 0.947500
10.566667 4.590535 0.817843 1.410926 -0.630424 0.902192 1.036624
10.600000 4.569531 0.849249 1.452104 -0.649023 0.903901 1.102462
10.633333 4.546245 0.879750 1.516119 -0.667048 0.901725 1.127864
10.666667 4.522776 0.910064 1.571012 -0.683850 0.896689 1.103769
10.700000 4.499143 0.940175 1.617759 -0.699164 0.889848 1.028673
10.733333 4.475362 0.970069 1.680077 -0.713016 0.882091 0.902945
10.766667 4.451451 0.999732 1.734629 -0.725231 0.874180 0.732583
10.800000 4.426550 1.027962 1.759159 -0.735427 0.866684 0.529494
10.833333 4.401553 1.055934 1.777240 -0.743409 0.859772 0.311462
10.866667 4.376480 1.083633 1.772848 -0.748973 0.853204 0.091035
10.900000 4.351348 1.111049 1.760918 -0.751865 0.846614 -0.121061
10.933333 4.326176 1.138166 1.734966 -0.751691 0.839570 -0.316178
10.966667 4.299984 1.166652 1.703079 -0.748386 0.831750 -0.489830
11.000000 4.273370 1.196099 1.672755 -0.742096 0.822367 -0.643867
11.033333 4.246772 1.225205 1.635293 -0.732881 0.810832 -0.785253
11.066667 4.220212 1.253956 1.612500 -0.720727 0.796451 -0.921110
11.100000 4.196158 1.280802 1.590081 -0.705755 0.778424 -1.061386
11.133333 4.174224 1.306085 1.561647 -0.688251 0.755856 -1.213833
11.166667 4.152378 1.330969 1.552529 -0.668534 0.727822 -1.386388
11.200000 4.130634 1.355444 1.507021 -0.647234 0.694344 -1.576789
11.233333 4.109007 1.379497 1.460984 -0.624985 0.655451 -1.784308
11.266667 4.087511 1.403117 1.397598 -0.602640 0.611615 -2.001966
11.300000 4.066160 1.426293 1.321588 -0.580794 0.563521 -2.217186
11.333333 4.047892 1.444658 1.230238 -0.559954 0.512429 -2.420179
11.366667 4.029794 1.462561 1.150730 -0.540413 0.459832 -2.595521
11.400000 4.013184 1.477373 1.045449 -0.522297 0.406970 -2.738397
11.433333 3.997670 1.488939 0.919662 -0.505801 0.355317 -2.836437
11.466667 3.982416 1.497595 0.808417 -0.491016 0.306329 -2.881138
11.500000 3.966597 1.503587 0.692805 -0.478096 0.261538 -2.865327
11.533333 3.950992 1.509119 0.605357 -0.466871 0.221642 -2.782950
11.566667 3.935609 1.514195 0.511134 -0.457013 0.186789 -2.634367
11.600000 3.920455 1.518824 0.407671 -0.447975 0.156683 -2.419090
11.633333 3.905539 1.523011 0.309923 -0.438866 0.130346 -2.148996
11.666667 3.890869 1.526763 0.207887 -0.428664 0.106275 -1.840263
11.700000 3.876452 1.530087 0.144570 -0.416407 0.082548 -1.516983
11.733333 3.862296 1.532991 0.074248 -0.401380 0.057604 -1.199241
11.766667 3.848407 1.535482 0.042551 -0.383335 0.030592 -0.910184
11.800000 3.834794 1.537568 0.035669 -0.362149 0.000973 -0.669133
11.833333 3.821463 1.539256 0.066053 -0.338179 -0.030964 -0.488726
11.866667 3.808420 1.540556 0.112677 -0.312026 -0.064494 -0.374239
11.900000 3.798300 1.537140 0.153004 -0.284590 -0.098243 -0.318560
11.933333 3.788480 1.533357 0.167264 -0.256729 -0.130622 -0.312818
11.966667 3.781272 1.526629 0.163358 -0.229187 -0.159970 -0.337228
12.000000 3.775792 1.518199 0.115986 -0.202753 -0.184568 -0.369798
12.033333 3.771457 1.508826 0.077279 -0.178027 -0.203135 -0.387942
12.066667 3.767423 1.499152 0.044795 -0.155485 -0.214507 -0.375564
12.100000 3.763347 1.489041 -0.011767 -0.135076 -0.218271 -0.325936
12.133333 3.759418 1.479723 -0.050028 -0.116846 -0.214535 -0.241871
12.166667 3.755604 1.472144 -0.077680 -0.100588 -0.204416 -0.134404
12.200000 3.752083 1.464335 -0.089424 -0.085954 -0.189427 -0.020899
12.233333 3.748852 1.456314 -0.060518 -0.072546 -0.171152 0.078467
12.266667 3.746390 1.450690 0.001785 -0.060072 -0.151373 0.148864
12.300000 3.744644 1.447172 0.051036 -0.048532 -0.131771 0.178567
12.333333 3.743711 1.444970 0.087083 -0.037885 -0.113773 0.165005
12.366667 3.743524 1.443364 0.109478 -0.028223 -0.098107 0.111108
12.400000 3.743611 1.441604 0.098767 -0.019812 -0.085250 0.027825
12.433333 3.743847 1.439954 0.075478 -0.013028 -0.075579 -0.064809
12.466667 3.743953 1.438234 0.061709 -0.008056 -0.069090 -0.147116
12.500000 3.743755 1.436257 0.032819 -0.004953 -0.065341 -0.201870
12.533333 3.743814 1.434158 0.010924 -0.003717 -0.063710 -0.219223
