t x y theta dxdt dydt dthetadt
0.000000 0.000000 0.000000 1.210894 -0.044914 -0.118493 -0.027559
0.033333 -0.001618 -0.003934 1.194373 -0.041514 -0.121550 -0.059453
0.066667 -0.003297 -0.007874 1.202851 -0.037184 -0.125115 -0.102924
0.100000 -0.005004 -0.011907 1.213189 -0.031603 -0.129327 -0.158582
0.133333 -0.006291 -0.016099 1.204589 -0.024416 -0.134392 -0.221065
0.166667 -0.007147 -0.020459 1.207468 -0.015314 -0.140480 -0.288870
0.200000 -0.007949 -0.025022 1.195376 -0.003987 -0.147751 -0.352571
0.233333 -0.008616 -0.029775 1.187796 0.009955 -0.156396 -0.407464
0.266667 -0.008818 -0.034717 1.175110 0.027077 -0.166720 -0.448644
0.300000 -0.008469 -0.040039 1.148590 0.047651 -0.178872 -0.470804
0.333333 -0.007632 -0.045562 1.107120 0.071757 -0.192838 -0.472420
0.366667 -0.005710 -0.051759 1.073427 0.099756 -0.208727 -0.451372
0.400000 -0.003277 -0.058170 1.049717 0.131974 -0.226660 -0.413696
0.433333 0.000772 -0.065582 1.030256 0.168269 -0.246502 -0.364663
0.466667 0.006710 -0.074198 1.025210 0.207927 -0.267781 -0.308265
0.500000 0.013185 -0.083041 1.019799 0.250370 -0.290130 -0.250318
0.533333 0.020202 -0.092113 1.030468 0.295131 -0.313257 -0.200397
0.566667 0.030233 -0.102834 1.043556 0.340979 -0.336536 -0.165503
0.600000 0.043772 -0.115354 1.039523 0.386469 -0.359203 -0.146998
0.633333 0.057865 -0.128106 1.032642 0.430572 -0.380747 -0.144089
0.666667 0.072510 -0.141089 1.037947 0.472945 -0.401054 -0.158880
0.700000 0.091622 -0.156091 1.028024 0.513078 -0.419932 -0.191334
0.733333 0.111282 -0.171319 1.023205 0.550581 -0.437263 -0.235339
0.766667 0.131485 -0.186769 0.999013 0.585838 -0.453339 -0.285529
0.800000 0.152225 -0.202438 0.995556 0.619768 -0.468766 -0.343778
0.833333 0.173498 -0.218323 0.989415 0.653257 -0.484158 -0.410255
0.866667 0.195297 -0.234419 0.975191 0.686648 -0.499837 -0.483123
0.900000 0.217615 -0.250722 0.960099 0.720566 -0.516284 -0.561802
0.933333 0.240448 -0.267229 0.954729 0.755312 -0.533856 -0.647506
0.966667 0.263788 -0.283934 0.927252 0.790775 -0.552700 -0.741236
1.000000 0.290195 -0.302091 0.901818 0.826302 -0.572630 -0.837524
1.033333 0.319029 -0.321448 0.871255 0.860861 -0.593240 -0.933884
1.066667 0.349764 -0.341830 0.843213 0.893517 -0.614162 -1.027652
1.100000 0.381969 -0.363165 0.803275 0.923186 -0.634837 -1.115558
1.133333 0.415102 -0.385242 0.755783 0.949037 -0.654696 -1.192270
1.166667 0.449330 -0.408370 0.711129 0.970353 -0.673077 -1.257016
1.200000 0.483978 -0.431638 0.655904 0.986748 -0.689543 -1.307974
1.233333 0.518444 -0.455370 0.607212 0.998351 -0.703795 -1.342139
1.266667 0.552259 -0.479443 0.565724 1.005617 -0.715656 -1.359038
1.300000 0.585971 -0.504100 0.522918 1.009080 -0.725031 -1.357128
1.333333 0.620039 -0.528850 0.476375 1.009270 -0.731941 -1.339987
1.366667 0.653159 -0.553889 0.419203 1.006819 -0.736511 -1.305746
1.400000 0.686606 -0.578994 0.371878 1.002425 -0.738839 -1.256717
1.433333 0.720369 -0.604153 0.324614 0.996626 -0.739015 -1.195980
1.466667 0.754432 -0.629351 0.292086 0.989669 -0.737101 -1.126117
1.500000 0.788784 -0.654576 0.241791 0.981743 -0.733146 -1.050279
1.533333 0.821746 -0.679379 0.210247 0.973068 -0.727079 -0.969203
1.566667 0.853359 -0.703630 0.182913 0.963889 -0.718978 -0.885248
1.600000 0.885224 -0.727870 0.149529 0.954290 -0.708773 -0.799903
1.633333 0.916301 -0.751587 0.144193 0.944487 -0.696543 -0.715151
1.666667 0.947611 -0.775268 0.120748 0.934760 -0.682227 -0.627713
1.700000 0.978194 -0.798068 0.090073 0.925559 -0.665975 -0.537259
1.733333 1.008993 -0.820809 0.083456 0.917160 -0.647968 -0.443744
1.766667 1.039205 -0.842416 0.068570 0.909650 -0.628178 -0.346230
1.800000 1.069617 -0.863945 0.040547 0.903156 -0.606806 -0.241987
1.833333 1.099416 -0.884076 0.034702 0.897636 -0.583987 -0.128049
1.866667 1.128579 -0.902771 0.025543 0.893157 -0.560138 -0.007078
1.900000 1.157924 -0.921364 0.028537 0.889562 -0.535424 0.117739
1.933333 1.187183 -0.938513 0.035023 0.886841 -0.510243 0.246628
1.966667 1.216614 -0.955551 0.049293 0.885014 -0.485068 0.375960
2.000000 1.245938 -0.971007 0.066089 0.884105 -0.460369 0.498360
2.033333 1.275424 -0.986343 0.090826 0.884090 -0.436441 0.609299
2.066667 1.304722 -1.000103 0.106396 0.884827 -0.413526 0.704986
2.100000 1.333961 -1.012323 0.136940 0.886265 -0.392056 0.785337
2.133333 1.363350 -1.024419 0.180700 0.888285 -0.372212 0.845269
2.166667 1.392884 -1.036391 0.217281 0.890879 -0.354263 0.885140
2.200000 1.422553 -1.047279 0.252165 0.893989 -0.338336 0.905591
2.233333 1.452359 -1.058046 0.283286 0.897672 -0.324743 0.907502
2.266667 1.482283 -1.068105 0.314471 0.902028 -0.313690 0.891167
2.300000 1.512299 -1.077698 0.345722 0.907129 -0.305169 0.857499
2.333333 1.542455 -1.087039 0.377719 0.913061 -0.299245 0.811979
2.366667 1.572788 -1.096246 0.413356 0.919791 -0.295836 0.754642
2.400000 1.603347 -1.105546 0.431261 0.927333 -0.294888 0.689925
2.433333 1.634020 -1.114739 0.461666 0.935618 -0.296288 0.617481
2.466667 1.664806 -1.123828 0.471620 0.944507 -0.299786 0.542202
2.500000 1.696378 -1.133525 0.501050 0.953812 -0.305130 0.463279
2.533333 1.728054 -1.143122 0.502222 0.963348 -0.312043 0.381048
2.566667 1.760485 -1.153558 0.523293 0.972954 -0.320322 0.297324
2.600000 1.793652 -1.164948 0.518617 0.982361 -0.329679 0.213561
2.633333 1.826909 -1.176240 0.532437 0.991295 -0.339784 0.130549
2.666667 1.860247 -1.187435 0.537881 0.999536 -0.350443 0.045607
2.700000 1.893663 -1.198532 0.542668 1.006931 -0.361668 -0.038368
2.733333 1.927574 -1.210738 0.531173 1.013288 -0.373383 -0.122179
2.766667 1.961837 -1.224042 0.526441 1.018470 -0.385367 -0.205713
2.800000 1.996158 -1.237244 0.521027 1.022480 -0.397482 -0.289816
2.833333 2.030532 -1.250340 0.506013 1.025369 -0.409524 -0.369935
2.866667 2.064951 -1.263327 0.491933 1.027096 -0.421302 -0.443331
2.900000 2.099587 -1.277400 0.480246 1.027655 -0.432347 -0.509006
2.933333 2.134215 -1.292418 0.467900 1.027115 -0.442303 -0.564193
2.966667 2.168735 -1.308310 0.431001 1.025565 -0.450955 -0.607238
3.000000 2.203275 -1.324074 0.409384 1.023039 -0.458088 -0.637659
3.033333 2.237197 -1.340419 0.377486 1.019612 -0.463514 -0.658795
3.066667 2.271128 -1.356621 0.352398 1.015548 -0.467018 -0.671126
3.100000 2.305062 -1.372674 0.314361 1.011087 -0.468648 -0.672154
3.133333 2.338994 -1.388569 0.312858 1.006427 -0.468527 -0.667901
3.166667 2.372918 -1.404299 0.286167 1.001639 -0.466745 -0.658296
3.200000 2.405710 -1.420020 0.266217 0.996888 -0.463374 -0.644787
3.233333 2.438485 -1.435561 0.237563 0.992164 -0.458491 -0.623159
3.266667 2.471239 -1.450915 0.246492 0.987362 -0.452184 -0.596162
3.300000 2.503968 -1.466075 0.195602 0.982346 -0.444334 -0.565491
3.333333 2.536668 -1.481032 0.195234 0.976986 -0.434736 -0.525756
3.366667 2.569335 -1.495778 0.150662 0.971322 -0.423314 -0.475520
3.400000 2.601966 -1.510308 0.135118 0.965211 -0.410024 -0.413050
3.433333 2.634557 -1.524613 0.129822 0.958702 -0.395004 -0.344052
3.466667 2.667104 -1.538686 0.112174 0.951818 -0.378306 -0.263514
3.500000 2.698628 -1.551246 0.091692 0.944683 -0.360222 -0.174703
3.533333 2.730102 -1.563561 0.092926 0.937417 -0.341050 -0.080298
3.566667 2.760689 -1.574164 0.101186 0.930132 -0.321101 0.012788
3.600000 2.791222 -1.584513 0.102080 0.923054 -0.300639 0.101560
3.633333 2.821501 -1.593280 0.113292 0.916355 -0.279915 0.187288
3.666667 2.851723 -1.601786 0.124045 0.910274 -0.259376 0.264828
3.700000 2.881887 -1.610028 0.123127 0.904937 -0.239336 0.332281
3.733333 2.911992 -1.618004 0.149490 0.900502 -0.220153 0.389704
3.766667 2.942037 -1.625712 0.162224 0.897032 -0.202018 0.440365
3.800000 2.971750 -1.632041 0.179107 0.894564 -0.185285 0.483947
3.833333 3.001178 -1.637099 0.210891 0.893122 -0.170168 0.516886
3.866667 3.030545 -1.641886 0.218360 0.892661 -0.156770 0.540725
3.900000 3.059849 -1.646403 0.224762 0.893140 -0.145163 0.556052
3.933333 3.089360 -1.650202 0.252349 0.894427 -0.135367 0.562244
3.966667 3.118808 -1.653731 0.277940 0.896370 -0.127371 0.558341
4.000000 3.148446 -1.657113 0.304069 0.898775 -0.120932 0.544477
4.033333 3.178380 -1.660519 0.322797 0.901397 -0.115723 0.525606
4.066667 3.208654 -1.664200 0.351193 0.903975 -0.111381 0.499266
4.100000 3.239376 -1.668504 0.355761 0.906239 -0.107493 0.467160
4.133333 3.270030 -1.672539 0.380316 0.908062 -0.103775 0.428946
4.166667 3.300614 -1.676307 0.380075 0.909360 -0.100017 0.388835
4.200000 3.331126 -1.679805 0.402278 0.910114 -0.096121 0.345938
4.233333 3.361564 -1.683034 0.402760 0.910449 -0.092242 0.301118
4.266667 3.391926 -1.685993 0.420695 0.910599 -0.088728 0.255255
4.300000 3.422210 -1.688681 0.420304 0.910885 -0.086077 0.209778
4.333333 3.452415 -1.691098 0.436674 0.911492 -0.084585 0.164632
4.366667 3.482539 -1.693244 0.436448 0.912596 -0.084601 0.115465
4.400000 3.512580 -1.695119 0.449370 0.914327 -0.086514 0.065819
4.433333 3.542537 -1.696721 0.442894 0.916615 -0.090482 0.012708
4.466667 3.573202 -1.699966 0.442002 0.919133 -0.096273 -0.040814
4.500000 3.603779 -1.702936 0.448511 0.921469 -0.103606 -0.097841
4.533333 3.634265 -1.705630 0.432851 0.923244 -0.112195 -0.153145
4.566667 3.665406 -1.709465 0.437791 0.923940 -0.121528 -0.206019
4.600000 3.696981 -1.714299 0.420618 0.922945 -0.130871 -0.255275
4.633333 3.728457 -1.718845 0.421211 0.919793 -0.139539 -0.300120
4.666667 3.760035 -1.724059 0.395668 0.914197 -0.147108 -0.338571
4.700000 3.791438 -1.729655 0.382707 0.905815 -0.153012 -0.366263
4.733333 3.822404 -1.735536 0.372159 0.894210 -0.156675 -0.385659
4.766667 3.852751 -1.741524 0.357719 0.879286 -0.157774 -0.392845
4.800000 3.882148 -1.747541 0.338755 0.861171 -0.156213 -0.388539
4.833333 3.910934 -1.753541 0.321120 0.839888 -0.151871 -0.370086
4.866667 3.939598 -1.759205 0.309829 0.815504 -0.144683 -0.339931
4.900000 3.967090 -1.764578 0.291047 0.788405 -0.134785 -0.299083
4.933333 3.993192 -1.769431 0.279023 0.759260 -0.122487 -0.248655
4.966667 4.019174 -1.773924 0.268771 0.728479 -0.108022 -0.190626
5.000000 4.043532 -1.777712 0.265969 0.696552 -0.091641 -0.127657
5.033333 4.066066 -1.780724 0.256136 0.664259 -0.073728 -0.062971
5.066667 4.086780 -1.782838 0.266669 0.632656 -0.054636 -0.002733
5.100000 4.107391 -1.784567 0.264495 0.602589 -0.034587 0.049321
5.133333 4.126450 -1.785464 0.270668 0.574811 -0.013785 0.088366
5.166667 4.144148 -1.785531 0.271191 0.550279 0.007502 0.106219
5.200000 4.160418 -1.784772 0.294098 0.529753 0.029038 0.093739
5.233333 4.176620 -1.783610 0.293611 0.513609 0.050665 0.042100
5.266667 4.192069 -1.781640 0.306023 0.501947 0.072446 -0.050537
5.300000 4.207126 -1.778906 0.320284 0.494779 0.094312 -0.192220
5.333333 4.222171 -1.775429 0.330677 0.492082 0.116475 -0.384795
5.366667 4.237385 -1.771238 0.329315 0.493721 0.139436 -0.621707
5.400000 4.253210 -1.766175 0.311530 0.499578 0.163963 -0.888678
5.433333 4.270247 -1.760071 0.297987 0.509752 0.190992 -1.169215
5.466667 4.287296 -1.753556 0.274049 0.524071 0.221104 -1.445291
5.500000 4.304368 -1.746629 0.213129 0.542568 0.255214 -1.687897
5.533333 4.321471 -1.739293 0.127618 0.565067 0.293820 -1.873068
5.566667 4.338615 -1.731548 0.019980 0.591223 0.337001 -1.986272
5.600000 4.357903 -1.720906 -0.080498 0.620585 0.384344 -2.020740
5.633333 4.377246 -1.709861 -0.203849 0.652762 0.435185 -1.974610
5.666667 4.398629 -1.695845 -0.300258 0.687631 0.488898 -1.856345
5.700000 4.421905 -1.678867 -0.370380 0.724845 0.544270 -1.690448
5.733333 4.447285 -1.658713 -0.446835 0.764282 0.600126 -1.501936
5.766667 4.474740 -1.635407 -0.485236 0.805786 0.655245 -1.313877
5.800000 4.502258 -1.611754 -0.490336 0.849268 0.708730 -1.147162
5.833333 4.531890 -1.585070 -0.466986 0.894308 0.759449 -1.021120
5.866667 4.561575 -1.558077 -0.448409 0.940401 0.806537 -0.946296
5.900000 4.591308 -1.530796 -0.457758 0.987033 0.849565 -0.915004
5.933333 4.623478 -1.501526 -0.485904 1.033359 0.888261 -0.917422
5.966667 4.658008 -1.470621 -0.529490 1.078687 0.922731 -0.935489
6.000000 4.695033 -1.438509 -0.576882 1.122082 0.952939 -0.945412
6.033333 4.734962 -1.404878 -0.634898 1.162454 0.979206 -0.920221
6.066667 4.777706 -1.370067 -0.696578 1.198316 1.001579 -0.834398
6.100000 4.820416 -1.335118 -0.746455 1.227997 1.019896 -0.679941
6.133333 4.863071 -1.300060 -0.798904 1.250301 1.034139 -0.448171
6.166667 4.907614 -1.264447 -0.823115 1.264069 1.044207 -0.142775
6.200000 4.952056 -1.228783 -0.851902 1.268690 1.050162 0.222988
6.233333 4.996373 -1.193099 -0.829048 1.263940 1.051874 0.628510
6.266667 5.040540 -1.157423 -0.813894 1.250185 1.049184 1.049167
6.300000 5.084697 -1.121522 -0.761971 1.228072 1.041765 1.466554
6.333333 5.127886 -1.085630 -0.690881 1.197912 1.028752 1.849540
6.366667 5.169377 -1.050167 -0.600161 1.160295 1.009296 2.163370
6.400000 5.208133 -1.015546 -0.499352 1.115624 0.982068 2.373611
6.433333 5.243329 -0.982380 -0.400900 1.064912 0.946284 2.448100
6.466667 5.278248 -0.949397 -0.277390 1.009347 0.901672 2.358048
6.500000 5.312873 -0.916623 -0.143349 0.950355 0.848195 2.081465
6.533333 5.347190 -0.884083 -0.046930 0.889650 0.786627 1.621117
6.566667 5.377032 -0.855216 0.073660 0.828948 0.717556 1.001198
6.600000 5.402850 -0.830507 0.165679 0.770122 0.642723 0.261142
6.633333 5.425158 -0.810481 0.261190 0.714576 0.563434 -0.550216
6.666667 5.444614 -0.795544 0.267312 0.663817 0.480816 -1.374877
6.700000 5.463729 -0.780926 0.161993 0.619429 0.396309 -2.152058
6.733333 5.480898 -0.772297 -0.018476 0.583247 0.311286 -2.832790
6.766667 5.497730 -0.763993 -0.259245 0.556407 0.227361 -3.372701
6.800000 5.514225 -0.756015 -0.489958 0.539495 0.145088 -3.742475
6.833333 5.529741 -0.753674 -0.680956 0.532559 0.065452 -3.923096
6.866667 5.544927 -0.751649 -0.857246 0.534798 -0.010844 -3.913644
6.900000 5.560506 -0.754603 -0.996643 0.545015 -0.082591 -3.730282
6.933333 5.575759 -0.757852 -1.119191 0.561367 -0.149045 -3.396959
6.966667 5.592647 -0.765069 -1.213823 0.582380 -0.208994 -2.954250
7.000000 5.611716 -0.775632 -1.297042 0.606744 -0.260349 -2.437739
7.033333 5.633450 -0.788745 -1.366623 0.633240 -0.301337 -1.877130
7.066667 5.658114 -0.803696 -1.439905 0.660764 -0.329564 -1.292858
7.100000 5.682437 -0.818837 -1.472160 0.688066 -0.343610 -0.703533
7.133333 5.706411 -0.834140 -1.498938 0.713943 -0.342168 -0.120320
7.166667 5.730023 -0.849579 -1.502785 0.737146 -0.324714 0.453864
7.200000 5.753266 -0.865128 -1.492528 0.756546 -0.291462 1.010630
7.233333 5.778811 -0.878610 -1.429333 0.771304 -0.243428 1.532002
7.266667 5.806079 -0.889570 -1.352201 0.780999 -0.182845 1.997185
7.300000 5.834515 -0.897302 -1.256725 0.785393 -0.112395 2.394417
7.333333 5.863395 -0.901419 -1.144502 0.784358 -0.034855 2.708151
7.366667 5.892095 -0.901564 -1.006096 0.777947 0.046450 2.922192
7.400000 5.920043 -0.897419 -0.862160 0.766413 0.127601 3.029106
7.433333 5.946646 -0.888874 -0.748273 0.750170 0.205369 3.038118
7.466667 5.972748 -0.880319 -0.616882 0.729583 0.277570 2.958576
7.500000 5.996961 -0.867048 -0.484034 0.705214 0.342587 2.803479
7.533333 6.018806 -0.849005 -0.387466 0.677931 0.399022 2.592873
7.566667 6.040106 -0.830967 -0.311180 0.648457 0.446484 2.353595
7.600000 6.060846 -0.812945 -0.235711 0.617316 0.485702 2.108401
7.633333 6.081015 -0.794951 -0.191664 0.584887 0.517466 1.869985
7.666667 6.100601 -0.776995 -0.149355 0.551599 0.542133 1.656924
7.700000 6.119591 -0.759087 -0.122017 0.517710 0.560286 1.482718
7.733333 6.137973 -0.741238 -0.090089 0.483066 0.572794 1.352598
7.766667 6.154082 -0.721347 -0.047326 0.447772 0.579909 1.265845
7.800000 6.168211 -0.700171 -0.024298 0.412064 0.581175 1.222143
7.833333 6.180383 -0.678507 0.015547 0.376332 0.575979 1.217529
7.866667 6.191911 -0.656955 0.054659 0.340858 0.563623 1.240995
7.900000 6.201863 -0.636226 0.094164 0.306095 0.543342 1.283121
7.933333 6.211160 -0.615638 0.132378 0.272783 0.514229 1.338455
7.966667 6.219140 -0.596981 0.173417 0.241385 0.476298 1.398402
8.000000 6.226456 -0.578490 0.223574 0.212279 0.430145 1.450017
8.033333 6.232726 -0.562519 0.278361 0.185720 0.376850 1.483547
8.066667 6.237913 -0.549302 0.328032 0.161987 0.318122 1.493647
8.100000 6.242301 -0.539070 0.399694 0.141227 0.255923 1.465191
8.133333 6.245937 -0.531915 0.456428 0.123486 0.192619 1.385251
8.166667 6.248916 -0.527642 0.513806 0.108839 0.130155 1.246192
8.200000 6.251248 -0.526014 0.544903 0.097179 0.070684 1.053824
8.233333 6.253239 -0.526743 0.619251 0.088169 0.016116 0.813246
8.266667 6.255352 -0.529786 0.685003 0.081306 -0.031997 0.529015
8.300000 6.256786 -0.532992 0.717452 0.075885 -0.072535 0.221931
8.333333 6.259108 -0.537939 0.716968 0.071003 -0.104950 -0.089812
8.366667 6.262219 -0.544470 0.692762 0.065533 -0.128925 -0.383407
8.400000 6.264643 -0.551123 0.654443 0.058533 -0.144891 -0.649064
8.433333 6.267604 -0.558332 0.586806 0.049024 -0.153490 -0.869980
8.466667 6.270603 -0.565390 0.525758 0.036199 -0.155736 -1.030268
8.500000 6.273117 -0.571872 0.445420 0.019317 -0.152653 -1.124867
8.533333 6.274665 -0.577247 0.411261 -0.002009 -0.145372 -1.153468
8.566667 6.275496 -0.582666 0.371281 -0.027669 -0.135121 -1.125420
8.600000 6.275240 -0.586923 0.323734 -0.057539 -0.122931 -1.049190
8.633333 6.273332 -0.590090 0.292362 -0.090953 -0.109906 -0.942276
8.666667 6.270693 -0.593263 0.247086 -0.127420 -0.096752 -0.820371
8.700000 6.265940 -0.595648 0.229734 -0.166184 -0.084039 -0.701126
8.733333 6.260451 -0.598016 0.229027 -0.206657 -0.072009 -0.594552
8.766667 6.252524 -0.599833 0.213355 -0.248349 -0.060761 -0.507889
8.800000 6.243861 -0.601611 0.204343 -0.290825 -0.050193 -0.443202
8.833333 6.232215 -0.602855 0.196401 -0.334007 -0.039913 -0.397964
8.866667 6.219839 -0.604041 0.194140 -0.377631 -0.029646 -0.373534
8.900000 6.206737 -0.605159 0.193399 -0.421646 -0.019118 -0.362572
8.933333 6.192915 -0.606200 0.184729 -0.465980 -0.008150 -0.360717
8.966667 6.178379 -0.607153 0.161628 -0.510842 0.003524 -0.359420
9.000000 6.160689 -0.607026 0.145426 -0.556321 0.015995 -0.356665
9.033333 6.140036 -0.605805 0.124862 -0.602432 0.029122 -0.348192
9.066667 6.118692 -0.604472 0.112623 -0.649161 0.042706 -0.327540
9.100000 6.096670 -0.603020 0.081678 -0.696261 0.056464 -0.294482
9.133333 6.073981 -0.601443 0.088043 -0.743483 0.070113 -0.249755
9.166667 6.048928 -0.598924 0.074994 -0.790294 0.083258 -0.198097
9.200000 6.021266 -0.595514 0.062546 -0.836258 0.095554 -0.140097
9.233333 5.991137 -0.591349 0.071052 -0.880964 0.106783 -0.082695
9.266667 5.960404 -0.587036 0.059755 -0.924003 0.116784 -0.031451
9.300000 5.929086 -0.582572 0.069462 -0.965120 0.125445 0.008577
9.333333 5.895847 -0.577837 0.069329 -1.003950 0.132649 0.036552
9.366667 5.860836 -0.573016 0.081392 -1.040310 0.138420 0.048043
9.400000 5.824130 -0.568170 0.097242 -1.073964 0.142924 0.038294
9.433333 5.786927 -0.563157 0.090729 -1.104737 0.146411 0.011389
9.466667 5.749253 -0.557974 0.094538 -1.132492 0.149184 -0.033855
9.500000 5.711130 -0.552617 0.105503 -1.157095 0.151547 -0.096731
9.533333 5.671619 -0.547489 0.102749 -1.178498 0.153903 -0.177852
9.566667 5.631118 -0.542502 0.098356 -1.196671 0.156602 -0.272109
9.600000 5.589863 -0.537709 0.086685 -1.211664 0.159941 -0.371874
9.633333 5.548265 -0.532727 0.075318 -1.223454 0.164157 -0.477603
9.666667 5.506353 -0.527550 0.062671 -1.231954 0.169494 -0.582668
9.700000 5.464155 -0.522176 0.036755 -1.236961 0.176242 -0.679061
9.733333 5.422164 -0.516511 -0.001130 -1.238346 0.184549 -0.761726
9.766667 5.380659 -0.510456 -0.017075 -1.236042 0.194500 -0.826434
9.800000 5.338949 -0.504191 -0.056281 -1.229959 0.206086 -0.871504
9.833333 5.297059 -0.497714 -0.103420 -1.220140 0.219209 -0.891952
9.866667 5.255752 -0.490469 -0.136005 -1.206761 0.233692 -0.888434
9.900000 5.214319 -0.483006 -0.179056 -1.190104 0.249313 -0.861676
9.933333 5.173734 -0.474738 -0.216371 -1.170488 0.265883 -0.814615
9.966667 5.134181 -0.465654 -0.239146 -1.148157 0.283220 -0.751260
10.000000 5.095765 -0.455842 -0.257934 -1.123401 0.301145 -0.675796
10.033333 5.058754 -0.445296 -0.282885 -1.096368 0.319559 -0.595665
10.066667 5.023385 -0.434046 -0.307244 -1.067380 0.338359 -0.514028
10.100000 4.988019 -0.422575 -0.311780 -1.036782 0.357507 -0.441249
10.133333 4.953992 -0.410301 -0.328362 -1.004822 0.377042 -0.378242
10.166667 4.920003 -0.397812 -0.329072 -0.971624 0.397090 -0.328668
10.200000 4.887593 -0.384525 -0.338816 -0.937463 0.417730 -0.295153
10.233333 4.856924 -0.370488 -0.330520 -0.902854 0.438936 -0.278676
10.266667 4.827554 -0.355439 -0.346223 -0.868074 0.460695 -0.279909
10.300000 4.798274 -0.340189 -0.355612 -0.833531 0.482817 -0.290101
10.333333 4.771092 -0.323973 -0.353731 -0.799869 0.504893 -0.310412
10.366667 4.746045 -0.306695 -0.363715 -0.767992 0.526393 -0.332685
10.400000 4.721112 -0.289236 -0.374200 -0.738479 0.546907 -0.350727
10.433333 4.697947 -0.270254 -0.401352 -0.711717 0.566033 -0.352694
10.466667 4.676758 -0.249509 -0.399226 -0.688188 0.583439 -0.335119
10.500000 4.655692 -0.228610 -0.428490 -0.668237 0.598909 -0.295610
10.533333 4.634750 -0.207570 -0.451036 -0.651855 0.612492 -0.229201
10.566667 4.613931 -0.186401 -0.470983 -0.638724 0.624423 -0.138615
10.600000 4.593239 -0.165114 -0.489850 -0.628652 0.634891 -0.027121
10.633333 4.572671 -0.143722 -0.490796 -0.621348 0.644264 0.091743
10.666667 4.552230 -0.122236 -0.487032 -0.616356 0.652907 0.214499
10.700000 4.531916 -0.100669 -0.469628 -0.613217 0.661184 0.328177
10.733333 4.511728 -0.079033 -0.452077 -0.611647 0.669289 0.424323
10.766667 4.491667 -0.057340 -0.408551 -0.611461 0.677266 0.493092
10.800000 4.471588 -0.034301 -0.385011 -0.612542 0.685028 0.529432
10.833333 4.451636 -0.011233 -0.346079 -0.614893 0.692348 0.533252
10.866667 4.431436 0.012466 -0.323973 -0.618585 0.698839 0.504068
10.900000 4.410958 0.036631 -0.293280 -0.623653 0.704079 0.449042
10.933333 4.390607 0.060781 -0.282475 -0.630019 0.707710 0.373206
10.966667 4.369891 0.084877 -0.276303 -0.637594 0.709417 0.287782
11.000000 4.348462 0.109087 -0.268261 -0.646080 0.709130 0.199552
11.033333 4.327163 0.133238 -0.278569 -0.655230 0.706794 0.120632
11.066667 4.305136 0.157241 -0.275018 -0.664806 0.702481 0.054594
11.100000 4.283243 0.181154 -0.275771 -0.674636 0.696344 0.006510
11.133333 4.260513 0.204719 -0.281527 -0.684541 0.688550 -0.021414
11.166667 4.237111 0.227729 -0.300136 -0.694431 0.679165 -0.030022
11.200000 4.212977 0.249967 -0.296684 -0.704353 0.668209 -0.019819
11.233333 4.188995 0.272057 -0.303682 -0.714131 0.655782 0.001678
11.266667 4.165169 0.293985 -0.305144 -0.723668 0.641948 0.033413
11.300000 4.141505 0.315737 -0.303502 -0.732834 0.626739 0.069378
11.333333 4.118008 0.337301 -0.302341 -0.741718 0.610024 0.107055
11.366667 4.092929 0.357975 -0.289439 -0.750243 0.591807 0.140467
11.400000 4.066875 0.377203 -0.284644 -0.758341 0.571955 0.166295
11.433333 4.041010 0.396205 -0.272178 -0.766112 0.550165 0.183039
11.466667 4.015341 0.414972 -0.262005 -0.773519 0.526167 0.187962
11.500000 3.988940 0.431873 -0.255533 -0.780447 0.499827 0.182419
11.533333 3.962753 0.448520 -0.242581 -0.786586 0.471279 0.163003
11.566667 3.936789 0.464903 -0.235845 -0.791849 0.440689 0.133257
11.600000 3.910000 0.479544 -0.228825 -0.796122 0.408443 0.095690
11.633333 3.883453 0.493907 -0.235166 -0.799213 0.375094 0.052741
11.666667 3.856483 0.506517 -0.220071 -0.800879 0.341377 0.005361
11.700000 3.829276 0.517394 -0.224225 -0.800915 0.307838 -0.046320
11.733333 3.802007 0.526472 -0.233360 -0.799147 0.275028 -0.097650
11.766667 3.774755 0.533901 -0.234644 -0.795144 0.243528 -0.149060
11.800000 3.747632 0.539625 -0.241583 -0.788571 0.213769 -0.202443
11.833333 3.720821 0.545062 -0.248051 -0.779187 0.186196 -0.259392
11.866667 3.694332 0.550212 -0.264044 -0.766996 0.160991 -0.316279
11.900000 3.668177 0.555080 -0.273985 -0.752163 0.138310 -0.372099
11.933333 3.642368 0.559669 -0.274201 -0.734912 0.118054 -0.427122
11.966667 3.617329 0.563207 -0.292518 -0.715619 0.100033 -0.478667
12.000000 3.593339 0.565848 -0.308718 -0.694451 0.084042 -0.522049
12.033333 3.570647 0.567746 -0.329216 -0.671618 0.069845 -0.552036
12.066667 3.548340 0.569383 -0.354336 -0.647218 0.057276 -0.568901
12.100000 3.528009 0.570563 -0.377107 -0.621367 0.046266 -0.570910
12.133333 3.508077 0.571496 -0.407284 -0.594151 0.036867 -0.555916
12.166667 3.488552 0.572189 -0.443089 -0.565825 0.029015 -0.525098
12.200000 3.469438 0.572648 -0.461021 -0.536708 0.022622 -0.483557
12.233333 3.450742 0.572880 -0.478633 -0.506752 0.017576 -0.438855
12.266667 3.432468 0.572892 -0.485141 -0.475914 0.013765 -0.397192
12.300000 3.416953 0.573188 -0.497557 -0.443908 0.011065 -0.364091
12.333333 3.404368 0.573811 -0.496794 -0.410663 0.009305 -0.346740
12.366667 3.392213 0.574234 -0.501190 -0.375946 0.008421 -0.348896
12.400000 3.380487 0.574464 -0.502189 -0.339824 0.008339 -0.369446
12.433333 3.369189 0.574507 -0.503131 -0.302852 0.008977 -0.400981
12.466667 3.358319 0.574369 -0.504158 -0.265597 0.010324 -0.435979
12.500000 3.347873 0.574057 -0.520825 -0.228709 0.012340 -0.466100
12.533333 3.340545 0.574203 -0.542779 -0.192643 0.015018 -0.480295
12.566667 3.336197 0.574899 -0.589621 -0.158070 0.018292 -0.466673
12.600000 3.332260 0.575438 -0.620337 -0.125518 0.022172 -0.417483
12.633333 3.330749 0.576602 -0.647698 -0.095597 0.026526 -0.332273
12.666667 3.329630 0.577621 -0.668609 -0.068888 0.031076 -0.209922
12.700000 3.328892 0.578497 -0.685703 -0.046086 0.035559 -0.053334
12.733333 3.328527 0.579235 -0.698348 -0.027720 0.039749 0.131458
12.766667 3.328744 0.580702 -0.684957 -0.013972 0.043446 0.330317
12.800000 3.329145 0.582893 -0.668259 -0.004837 0.046333 0.532862
12.833333 3.329884 0.584957 -0.636552 0.000207 0.048251 0.729223
12.866667 3.330949 0.586895 -0.598433 0.001673 0.049118 0.907566
