t x y theta dxdt dydt dthetadt
0.000000 0.000000 0.000000 -1.438164 0.005295 0.033206 -0.007568
0.033333 0.000155 0.001116 -1.439721 0.006771 0.037900 -0.006989
0.066667 0.000333 0.002408 -1.439227 0.008592 0.043303 -0.005777
0.100000 0.000554 0.003731 -1.441870 0.010800 0.049536 -0.003136
0.133333 0.000820 0.005084 -1.436216 0.013420 0.056679 0.005839
0.166667 0.001177 0.006714 -1.429494 0.016453 0.064709 0.021543
0.200000 0.001635 0.008661 -1.438620 0.019874 0.073505 0.046445
0.233333 0.002245 0.010986 -1.437037 0.023658 0.082948 0.086672
0.266667 0.002984 0.013713 -1.436820 0.027820 0.093006 0.146822
0.300000 0.003904 0.016926 -1.441902 0.032326 0.103501 0.229693
0.333333 0.005035 0.020660 -1.430047 0.037141 0.114235 0.330293
0.366667 0.006412 0.024995 -1.432506 0.042277 0.125123 0.445814
0.400000 0.007843 0.029343 -1.431262 0.047774 0.136157 0.568583
0.433333 0.009603 0.034485 -1.424666 0.053654 0.147267 0.691286
0.466667 0.011419 0.039630 -1.389852 0.059935 0.158337 0.800378
0.500000 0.013290 0.044773 -1.352257 0.066676 0.169397 0.885617
0.533333 0.015217 0.049910 -1.301440 0.073965 0.180558 0.943244
0.566667 0.017657 0.056024 -1.247213 0.081827 0.191826 0.965690
0.600000 0.020634 0.063099 -1.181432 0.090283 0.203137 0.949254
0.633333 0.023665 0.070148 -1.130144 0.099324 0.214476 0.890753
0.666667 0.026751 0.077166 -1.111909 0.108867 0.225732 0.800882
0.700000 0.030494 0.085077 -1.094443 0.118772 0.236680 0.686619
0.733333 0.034288 0.092940 -1.078041 0.128862 0.246997 0.557801
0.766667 0.038776 0.101588 -1.053018 0.138921 0.256376 0.425196
0.800000 0.044012 0.110999 -1.050376 0.148594 0.264390 0.297534
0.833333 0.049294 0.120336 -1.032191 0.157455 0.270439 0.179689
0.866667 0.054619 0.129588 -1.042861 0.165113 0.274002 0.066696
0.900000 0.060580 0.139403 -1.070502 0.171228 0.274661 -0.037453
0.933333 0.067079 0.149579 -1.078753 0.175456 0.272075 -0.134478
0.966667 0.073611 0.159638 -1.081452 0.177427 0.265756 -0.220347
1.000000 0.080327 0.169528 -1.064773 0.177028 0.255596 -0.296869
1.033333 0.087068 0.179280 -1.058795 0.174354 0.241849 -0.366287
1.066667 0.093606 0.188223 -1.053671 0.169535 0.224822 -0.430031
1.100000 0.100161 0.197010 -1.083097 0.162573 0.204606 -0.503695
1.133333 0.105828 0.203978 -1.138929 0.153615 0.181455 -0.599327
1.166667 0.110278 0.208634 -1.188652 0.142973 0.156033 -0.726812
1.200000 0.114737 0.213112 -1.229837 0.130676 0.128587 -0.880374
1.233333 0.119202 0.217405 -1.213149 0.116656 0.099187 -1.049604
1.266667 0.123672 0.221511 -1.203095 0.100671 0.067625 -1.222695
1.300000 0.126373 0.222312 -1.184455 0.082934 0.034410 -1.377589
1.333333 0.129080 0.222920 -1.232390 0.063468 -0.000265 -1.485938
1.366667 0.131792 0.223335 -1.335174 0.042310 -0.036380 -1.523074
1.400000 0.134511 0.223556 -1.406660 0.019827 -0.073586 -1.478658
1.433333 0.135125 0.220541 -1.523081 -0.003411 -0.111346 -1.337399
1.466667 0.135750 0.217336 -1.675595 -0.026492 -0.148782 -1.088249
1.500000 0.134198 0.211316 -1.746828 -0.048793 -0.185570 -0.735910
1.533333 0.130574 0.202625 -1.789431 -0.069444 -0.221039 -0.300256
1.566667 0.126979 0.193764 -1.797463 -0.087654 -0.254564 0.181466
1.600000 0.121793 0.182717 -1.768434 -0.102659 -0.285375 0.675822
1.633333 0.116655 0.171524 -1.703415 -0.114028 -0.313102 1.135381
1.666667 0.111577 0.160195 -1.622824 -0.121505 -0.337455 1.512416
1.700000 0.106568 0.148745 -1.493979 -0.124995 -0.358333 1.774415
1.733333 0.101532 0.136092 -1.379603 -0.124696 -0.375961 1.899850
1.766667 0.096899 0.122552 -1.253213 -0.120787 -0.390484 1.889829
1.800000 0.092970 0.108304 -1.158588 -0.113783 -0.402427 1.755665
1.833333 0.089153 0.093993 -1.106499 -0.104145 -0.412093 1.521477
1.866667 0.085456 0.079634 -1.033855 -0.092386 -0.419752 1.219247
1.900000 0.081891 0.065243 -1.004076 -0.078933 -0.425369 0.889005
1.933333 0.078466 0.050837 -1.003126 -0.064166 -0.428893 0.566556
1.966667 0.076057 0.036195 -0.996924 -0.048578 -0.430417 0.280142
2.000000 0.074604 0.021416 -1.013765 -0.032490 -0.429864 0.049949
2.033333 0.074031 0.006582 -1.074791 -0.016209 -0.427170 -0.108995
2.066667 0.074274 -0.008154 -1.116789 -0.000108 -0.422317 -0.188295
2.100000 0.075262 -0.022640 -1.133109 0.015401 -0.415347 -0.194962
2.133333 0.076435 -0.037042 -1.144739 0.029973 -0.406208 -0.136734
2.166667 0.077799 -0.051343 -1.163669 0.043460 -0.394667 -0.019968
2.200000 0.079733 -0.064814 -1.149241 0.055799 -0.380585 0.141962
2.233333 0.082187 -0.077253 -1.142185 0.067062 -0.363788 0.333652
2.266667 0.084847 -0.089545 -1.139555 0.077494 -0.344224 0.539813
2.300000 0.087715 -0.101675 -1.117679 0.087454 -0.321966 0.745711
2.333333 0.090867 -0.112469 -1.076735 0.097297 -0.297191 0.935193
2.366667 0.094237 -0.123074 -1.040617 0.107234 -0.270337 1.086506
2.400000 0.097629 -0.132367 -1.000899 0.117460 -0.241938 1.186188
2.433333 0.101301 -0.140059 -0.956930 0.128067 -0.212740 1.217572
2.466667 0.105203 -0.147527 -0.901653 0.139078 -0.183402 1.170190
2.500000 0.109742 -0.153073 -0.822842 0.150454 -0.154612 1.044168
2.533333 0.115006 -0.156748 -0.747056 0.162127 -0.126997 0.845102
2.566667 0.121041 -0.158652 -0.659542 0.174018 -0.101171 0.584964
2.600000 0.127317 -0.160305 -0.618745 0.185941 -0.077572 0.282637
2.633333 0.133836 -0.161703 -0.630368 0.197761 -0.056302 -0.029429
2.666667 0.140600 -0.162843 -0.651125 0.209341 -0.037457 -0.321632
2.700000 0.147610 -0.163722 -0.696232 0.220623 -0.020793 -0.570705
2.733333 0.155369 -0.163803 -0.753133 0.231632 -0.005827 -0.752898
2.766667 0.163377 -0.163616 -0.845393 0.242541 0.008294 -0.841569
2.800000 0.171634 -0.163160 -0.921126 0.253581 0.022373 -0.828414
2.833333 0.180328 -0.162276 -0.968062 0.264916 0.036984 -0.719904
2.866667 0.189271 -0.161117 -1.015455 0.276707 0.052697 -0.523848
2.900000 0.198464 -0.159684 -1.044474 0.289019 0.069784 -0.253762
2.933333 0.207907 -0.157973 -1.031647 0.301858 0.088262 0.065668
2.966667 0.217889 -0.155356 -1.006820 0.315043 0.107738 0.397411
3.000000 0.228119 -0.152460 -0.972519 0.328451 0.127861 0.713192
3.033333 0.239085 -0.148261 -0.956424 0.341970 0.148275 0.992138
3.066667 0.250890 -0.142546 -0.912973 0.355443 0.168519 1.208821
3.100000 0.263649 -0.135183 -0.837394 0.368727 0.188102 1.345175
3.133333 0.276650 -0.127549 -0.772770 0.381727 0.206592 1.396614
3.166667 0.289889 -0.119650 -0.688248 0.394486 0.223770 1.365955
3.200000 0.303364 -0.111489 -0.588230 0.406966 0.239318 1.260568
3.233333 0.317070 -0.103071 -0.531261 0.419195 0.253077 1.089397
3.266667 0.331004 -0.094402 -0.490808 0.431316 0.265091 0.872807
3.300000 0.345163 -0.085486 -0.458135 0.443538 0.275632 0.634589
3.333333 0.360227 -0.075795 -0.454446 0.455931 0.284931 0.393682
3.366667 0.375507 -0.065869 -0.462361 0.468493 0.293199 0.172457
3.400000 0.390997 -0.055713 -0.484285 0.481218 0.300715 -0.010900
3.433333 0.407117 -0.045346 -0.514727 0.494037 0.307694 -0.140953
3.466667 0.423908 -0.034780 -0.550233 0.506751 0.314266 -0.211154
3.500000 0.441287 -0.024090 -0.584050 0.519081 0.320469 -0.222012
3.533333 0.459217 -0.013331 -0.597183 0.530870 0.326439 -0.177520
3.566667 0.477329 -0.002374 -0.612343 0.541956 0.332265 -0.088689
3.600000 0.495842 0.008687 -0.605695 0.552182 0.338010 0.031756
3.633333 0.514692 0.019893 -0.585560 0.561416 0.343668 0.163837
3.666667 0.533700 0.031278 -0.582461 0.569606 0.349182 0.288609
3.700000 0.553059 0.043009 -0.566474 0.576741 0.354403 0.388961
3.733333 0.572560 0.054906 -0.565850 0.582813 0.359115 0.451383
3.766667 0.592329 0.067218 -0.531300 0.587807 0.363076 0.466276
3.800000 0.612223 0.079681 -0.490469 0.591731 0.366038 0.427980
3.833333 0.632263 0.092399 -0.449458 0.594621 0.367820 0.339573
3.866667 0.652412 0.105252 -0.411542 0.596505 0.368318 0.208891
3.900000 0.672604 0.118095 -0.392714 0.597425 0.367564 0.047220
3.933333 0.692806 0.130802 -0.380496 0.597364 0.365633 -0.132113
3.966667 0.712939 0.143269 -0.397987 0.596384 0.362741 -0.309354
4.000000 0.732971 0.155393 -0.435760 0.594598 0.359201 -0.462859
4.033333 0.752817 0.167090 -0.462905 0.592099 0.355405 -0.570214
4.066667 0.772721 0.178882 -0.521720 0.588969 0.351707 -0.613588
4.100000 0.792393 0.190275 -0.558261 0.585338 0.348434 -0.584205
4.133333 0.811748 0.201308 -0.596782 0.581424 0.345900 -0.478491
4.166667 0.831140 0.212420 -0.659074 0.577377 0.344310 -0.306165
4.200000 0.850561 0.223605 -0.685200 0.573281 0.343760 -0.086792
4.233333 0.869572 0.234759 -0.692038 0.569241 0.344173 0.154722
4.266667 0.888165 0.246038 -0.689812 0.565400 0.345454 0.389862
4.300000 0.906769 0.257376 -0.646444 0.561829 0.347418 0.595195
4.333333 0.925376 0.268769 -0.588744 0.558521 0.349808 0.749048
4.366667 0.943778 0.280681 -0.515918 0.555516 0.352326 0.835633
4.400000 0.962172 0.292638 -0.447952 0.552894 0.354664 0.850107
4.433333 0.980554 0.304634 -0.387408 0.550673 0.356594 0.793077
4.466667 0.998916 0.316664 -0.343564 0.548804 0.357864 0.672792
4.500000 1.017141 0.328908 -0.329699 0.547255 0.358278 0.504007
4.533333 1.035256 0.341216 -0.320276 0.546008 0.357718 0.307002
4.566667 1.053285 0.353463 -0.322762 0.545006 0.356165 0.104033
4.600000 1.071308 0.365626 -0.345105 0.544160 0.353695 -0.085101
4.633333 1.089366 0.377624 -0.363097 0.543404 0.350401 -0.243557
4.666667 1.107506 0.389356 -0.390749 0.542692 0.346437 -0.356433
4.700000 1.125589 0.401084 -0.415931 0.541965 0.341977 -0.418056
4.733333 1.143748 0.412327 -0.430451 0.541148 0.337218 -0.431062
4.766667 1.161841 0.423557 -0.453892 0.540178 0.332307 -0.398696
4.800000 1.179965 0.434172 -0.486977 0.538997 0.327383 -0.329303
4.833333 1.198012 0.444765 -0.515854 0.537548 0.322543 -0.232499
4.866667 1.215975 0.455335 -0.516154 0.535785 0.317878 -0.123795
4.900000 1.233851 0.465877 -0.523717 0.533660 0.313470 -0.014323
4.933333 1.251633 0.476388 -0.509017 0.531152 0.309319 0.088720
4.966667 1.269316 0.486865 -0.497210 0.528234 0.305449 0.177014
5.000000 1.286984 0.496750 -0.475318 0.524874 0.301866 0.243638
5.033333 1.304543 0.506595 -0.456549 0.521055 0.298651 0.286068
5.066667 1.321989 0.516397 -0.436792 0.516746 0.295887 0.310784
5.100000 1.339317 0.526152 -0.411330 0.511939 0.293676 0.321163
5.133333 1.356522 0.535860 -0.387983 0.506615 0.292160 0.318460
5.166667 1.373391 0.545319 -0.388660 0.500797 0.291454 0.306126
5.200000 1.390128 0.554724 -0.399074 0.494540 0.291611 0.290904
5.233333 1.406535 0.564133 -0.409591 0.487926 0.292638 0.275498
5.266667 1.422802 0.573483 -0.402968 0.481065 0.294516 0.258969
5.300000 1.438778 0.583020 -0.388115 0.474087 0.297151 0.243254
5.333333 1.454463 0.592811 -0.373461 0.467129 0.300422 0.235457
5.366667 1.469850 0.602872 -0.358378 0.460306 0.304174 0.235784
5.400000 1.484942 0.613194 -0.330628 0.453720 0.308231 0.241957
5.433333 1.499755 0.623791 -0.314501 0.447431 0.312360 0.253352
5.466667 1.514411 0.634313 -0.326523 0.441482 0.316296 0.269033
5.500000 1.528908 0.644755 -0.328616 0.435890 0.319833 0.287200
5.533333 1.543267 0.655512 -0.329004 0.430646 0.322789 0.300231
5.566667 1.557483 0.666576 -0.342645 0.425719 0.325002 0.308144
5.600000 1.571600 0.677900 -0.321207 0.421048 0.326372 0.310258
5.633333 1.585550 0.689127 -0.298810 0.416576 0.326855 0.305679
5.666667 1.599332 0.700252 -0.261575 0.412259 0.326400 0.291960
5.700000 1.613037 0.711367 -0.249895 0.408026 0.324949 0.269616
5.733333 1.626570 0.722371 -0.222197 0.403820 0.322440 0.240656
5.766667 1.639930 0.733259 -0.216117 0.399605 0.318858 0.205809
5.800000 1.653117 0.744027 -0.217731 0.395370 0.314221 0.169717
5.833333 1.666299 0.754556 -0.216996 0.391064 0.308532 0.134807
5.866667 1.679305 0.764955 -0.228333 0.386626 0.301870 0.106995
5.900000 1.692134 0.775221 -0.247141 0.382026 0.294319 0.087287
5.933333 1.704784 0.785349 -0.243998 0.377240 0.286021 0.076339
5.966667 1.717348 0.794968 -0.249298 0.372235 0.277118 0.072359
6.000000 1.729796 0.804014 -0.235429 0.366909 0.267676 0.067959
6.033333 1.742065 0.812911 -0.219472 0.361154 0.257740 0.059351
6.066667 1.754094 0.821121 -0.212131 0.354874 0.247363 0.037769
6.100000 1.765944 0.829178 -0.204229 0.347969 0.236589 -0.002610
6.133333 1.777613 0.837079 -0.186687 0.340331 0.225420 -0.064603
6.166667 1.788869 0.844160 -0.202180 0.331773 0.213767 -0.147229
6.200000 1.799946 0.851082 -0.199656 0.322247 0.201627 -0.246896
6.233333 1.810845 0.857845 -0.200673 0.311698 0.189063 -0.357867
6.266667 1.821566 0.864446 -0.219402 0.299944 0.175987 -0.466963
6.300000 1.832110 0.870886 -0.237419 0.286688 0.162266 -0.561933
6.333333 1.841733 0.876212 -0.255588 0.271589 0.147798 -0.630607
6.366667 1.850264 0.880344 -0.289854 0.254568 0.132661 -0.665571
6.400000 1.858626 0.884315 -0.336593 0.235375 0.116855 -0.658553
6.433333 1.866823 0.888128 -0.367286 0.213932 0.100421 -0.610677
6.466667 1.874858 0.891784 -0.406930 0.190300 0.083549 -0.531657
6.500000 1.881352 0.894263 -0.437905 0.164774 0.066614 -0.436294
6.533333 1.887695 0.896591 -0.475517 0.137740 0.049921 -0.338955
6.566667 1.892405 0.898002 -0.491889 0.109465 0.033637 -0.255983
6.600000 1.895523 0.898582 -0.474521 0.080551 0.018058 -0.205276
6.633333 1.897134 0.898413 -0.440485 0.051471 0.003501 -0.195384
6.666667 1.897324 0.897568 -0.405114 0.022907 -0.009701 -0.228259
6.700000 1.897411 0.896599 -0.368658 -0.004683 -0.021380 -0.295705
6.733333 1.896116 0.895097 -0.364381 -0.030884 -0.031250 -0.389100
6.766667 1.894745 0.893485 -0.389035 -0.055453 -0.039068 -0.490694
6.800000 1.891979 0.891609 -0.418978 -0.078469 -0.044687 -0.580453
6.833333 1.887779 0.889601 -0.484864 -0.099880 -0.048137 -0.639740
6.866667 1.883551 0.887505 -0.530617 -0.119968 -0.049557 -0.655941
6.900000 1.879315 0.885328 -0.586178 -0.138829 -0.049069 -0.621709
6.933333 1.875088 0.883078 -0.641402 -0.156575 -0.046968 -0.537209
6.966667 1.869425 0.881241 -0.682553 -0.173073 -0.043529 -0.412245
7.000000 1.863811 0.879345 -0.687302 -0.188119 -0.039048 -0.256600
7.033333 1.856921 0.878021 -0.674358 -0.201637 -0.033793 -0.086496
7.066667 1.848903 0.877280 -0.636438 -0.213302 -0.028001 0.083797
7.100000 1.840998 0.876501 -0.597206 -0.222820 -0.021944 0.237686
7.133333 1.832262 0.876222 -0.582931 -0.229814 -0.015849 0.365659
7.166667 1.823686 0.875916 -0.581576 -0.234080 -0.009836 0.467269
7.200000 1.815293 0.875590 -0.565923 -0.235337 -0.004007 0.540423
7.233333 1.806624 0.875739 -0.545429 -0.233300 0.001624 0.589198
7.266667 1.798187 0.875878 -0.527195 -0.227896 0.007097 0.618930
7.300000 1.790007 0.876011 -0.519032 -0.219100 0.012491 0.639560
7.333333 1.782236 0.876568 -0.480157 -0.206982 0.017951 0.655233
7.366667 1.774770 0.877128 -0.452203 -0.191563 0.023529 0.659536
7.400000 1.768143 0.878102 -0.422598 -0.173045 0.029224 0.648258
7.433333 1.761868 0.879087 -0.406855 -0.151674 0.035032 0.618237
7.466667 1.755967 0.880086 -0.393452 -0.127710 0.040896 0.569728
7.500000 1.751324 0.881468 -0.362723 -0.101411 0.046752 0.501633
7.533333 1.747970 0.883215 -0.329145 -0.073088 0.052534 0.417829
7.566667 1.745951 0.885259 -0.296963 -0.043207 0.058168 0.334228
7.600000 1.745315 0.887532 -0.292711 -0.012155 0.063657 0.269315
7.633333 1.745154 0.889833 -0.288320 0.019729 0.068982 0.237086
7.666667 1.746406 0.892285 -0.274874 0.052106 0.074131 0.247901
7.700000 1.749074 0.894888 -0.314472 0.084650 0.079117 0.309750
7.733333 1.752266 0.897527 -0.343153 0.117208 0.083946 0.428646
7.766667 1.756907 0.900370 -0.356995 0.149775 0.088667 0.598817
7.800000 1.762099 0.903251 -0.360177 0.182590 0.093334 0.802721
7.833333 1.768762 0.906421 -0.326691 0.215721 0.097949 1.018486
7.866667 1.776899 0.909911 -0.296555 0.249309 0.102508 1.223481
7.900000 1.785619 0.913442 -0.237923 0.283459 0.106992 1.393864
7.933333 1.794934 0.917014 -0.146342 0.318052 0.111354 1.506415
7.966667 1.805887 0.920914 -0.044868 0.353117 0.115538 1.543517
8.000000 1.817451 0.924857 0.073732 0.388339 0.119458 1.498398
8.033333 1.830811 0.929003 0.139286 0.423545 0.123081 1.379788
8.066667 1.846120 0.933321 0.201306 0.458645 0.126431 1.197953
8.100000 1.862054 0.937681 0.238659 0.493693 0.129580 0.973048
8.133333 1.880194 0.942151 0.257901 0.528831 0.132659 0.728653
8.166667 1.898963 0.946664 0.252692 0.564092 0.135881 0.490968
8.200000 1.918361 0.951219 0.238145 0.599641 0.139465 0.286098
8.233333 1.938386 0.955817 0.218214 0.635763 0.143635 0.128420
8.266667 1.959039 0.960456 0.215993 0.672646 0.148550 0.030969
8.300000 1.982166 0.965211 0.182028 0.710219 0.154270 -0.002715
8.333333 2.005915 0.970007 0.176852 0.748609 0.160733 0.022049
8.366667 2.030282 0.974843 0.172718 0.787952 0.167699 0.096485
8.400000 2.056730 0.980091 0.163403 0.828436 0.174853 0.205017
8.433333 2.085232 0.985897 0.180335 0.870216 0.181779 0.328365
8.466667 2.115623 0.992406 0.204226 0.913350 0.188025 0.447258
8.500000 2.147850 0.999667 0.191343 0.958095 0.193080 0.545905
8.533333 2.180651 1.006960 0.220097 1.004519 0.196465 0.612762
8.566667 2.214012 1.014281 0.271997 1.052607 0.197779 0.636814
8.600000 2.247921 1.021629 0.328216 1.102340 0.196711 0.610009
8.633333 2.284042 1.028934 0.374444 1.153420 0.193135 0.533577
8.666667 2.322461 1.035983 0.408546 1.205662 0.187021 0.413479
8.700000 2.363227 1.042587 0.419184 1.258611 0.178615 0.254043
8.733333 2.406524 1.048687 0.433340 1.311516 0.168319 0.063621
8.766667 2.452566 1.054245 0.432249 1.363358 0.156669 -0.144763
8.800000 2.499032 1.059814 0.413128 1.412963 0.144261 -0.354229
8.833333 2.547743 1.064612 0.391540 1.459336 0.131684 -0.550925
8.866667 2.598468 1.068629 0.355686 1.501438 0.119584 -0.723841
8.900000 2.650976 1.071907 0.312605 1.538434 0.108516 -0.859690
8.933333 2.704974 1.074488 0.275865 1.569855 0.098999 -0.946110
8.966667 2.759239 1.077084 0.228965 1.595721 0.091398 -0.973479
9.000000 2.814338 1.079158 0.190138 1.616117 0.086033 -0.938371
9.033333 2.869632 1.081254 0.155103 1.631340 0.083041 -0.840165
9.066667 2.925083 1.083373 0.100998 1.641870 0.082400 -0.678218
9.100000 2.980787 1.085503 0.051446 1.648341 0.083900 -0.459059
9.133333 3.036505 1.087833 0.025509 1.651461 0.087125 -0.196950
9.166667 3.092026 1.090543 0.001909 1.651815 0.091679 0.088058
9.200000 3.147555 1.093290 -0.004662 1.650082 0.097089 0.373462
9.233333 3.202615 1.096677 0.029037 1.646811 0.102926 0.637413
9.266667 3.257385 1.100802 0.068739 1.642429 0.108767 0.850579
9.300000 3.312053 1.104969 0.135368 1.637230 0.114300 0.987659
9.333333 3.366580 1.109178 0.216963 1.631381 0.119359 1.033571
9.366667 3.420931 1.113432 0.278510 1.624980 0.123806 0.981258
9.400000 3.475068 1.117731 0.363597 1.618074 0.127548 0.832998
9.433333 3.528955 1.122076 0.434928 1.610667 0.130602 0.596727
9.466667 3.582555 1.126469 0.458997 1.602697 0.133112 0.294920
9.500000 3.636228 1.131004 0.470311 1.594016 0.135245 -0.041396
9.533333 3.689541 1.135588 0.441366 1.584434 0.137196 -0.380376
9.566667 3.742457 1.140223 0.408042 1.573672 0.139221 -0.692491
9.600000 3.794940 1.144910 0.344864 1.561362 0.141635 -0.945370
9.633333 3.846954 1.149649 0.272873 1.547013 0.144751 -1.108481
9.666667 3.898461 1.154441 0.197054 1.530068 0.148849 -1.161372
9.700000 3.949894 1.159123 0.130204 1.510093 0.154187 -1.095659
9.733333 4.000749 1.163861 0.077470 1.486748 0.160931 -0.913725
9.766667 4.051315 1.168725 0.013387 1.459840 0.169121 -0.622655
9.800000 4.100938 1.173798 -0.037781 1.429381 0.178668 -0.248564
9.833333 4.149319 1.179262 -0.052259 1.395681 0.189334 0.173797
9.866667 4.196443 1.185296 -0.063927 1.359144 0.200707 0.604309
9.900000 4.242023 1.192043 -0.034580 1.320240 0.212311 1.004022
9.933333 4.285749 1.199532 0.037411 1.279238 0.223579 1.336284
9.966667 4.327355 1.207813 0.128008 1.236209 0.233855 1.565718
10.000000 4.366520 1.216793 0.249996 1.191219 0.242514 1.675395
10.033333 4.404820 1.225823 0.370819 1.143712 0.248921 1.660287
10.066667 4.442229 1.234901 0.481447 1.093301 0.252657 1.527548
10.100000 4.478722 1.244022 0.586086 1.039430 0.253432 1.292142
10.133333 4.514274 1.253185 0.629688 0.981868 0.251225 0.982850
10.166667 4.548863 1.262384 0.658792 0.920736 0.246322 0.633318
10.200000 4.580131 1.271153 0.636550 0.856108 0.239144 0.272865
10.233333 4.610392 1.279954 0.599629 0.788387 0.230210 -0.073989
10.266667 4.636624 1.287870 0.541246 0.718079 0.220034 -0.388166
10.300000 4.658267 1.294691 0.482087 0.646054 0.209169 -0.653688
10.333333 4.678860 1.301540 0.455311 0.572523 0.197961 -0.871343
10.366667 4.693309 1.306867 0.440352 0.497934 0.186729 -1.049277
10.400000 4.706694 1.312224 0.417902 0.422483 0.175661 -1.198457
10.433333 4.719010 1.317612 0.381873 0.346682 0.165076 -1.329884
10.466667 4.730257 1.323031 0.346755 0.270546 0.155140 -1.454239
10.500000 4.740431 1.328485 0.311369 0.193178 0.145839 -1.580209
10.533333 4.749534 1.333973 0.248659 0.114409 0.137327 -1.708911
10.566667 4.750708 1.337841 0.190829 0.033793 0.129636 -1.830879
10.600000 4.750818 1.341749 0.105809 -0.049119 0.122846 -1.931948
10.633333 4.749872 1.345701 0.023315 -0.134706 0.116931 -1.999526
10.666667 4.741873 1.348775 -0.039988 -0.222594 0.112018 -2.015314
10.700000 4.732845 1.351902 -0.131918 -0.311573 0.108284 -1.963247
10.733333 4.722805 1.355085 -0.218154 -0.400442 0.105758 -1.829360
10.766667 4.706965 1.358136 -0.292222 -0.488349 0.104281 -1.610455
10.800000 4.690156 1.361253 -0.375704 -0.574049 0.103622 -1.311677
10.833333 4.668577 1.364541 -0.421348 -0.656046 0.103456 -0.943982
10.866667 4.642755 1.368062 -0.491793 -0.733553 0.103239 -0.530986
10.900000 4.616053 1.371664 -0.525476 -0.805914 0.102436 -0.104383
10.933333 4.586087 1.375457 -0.527636 -0.872421 0.100563 0.295997
10.966667 4.553362 1.379366 -0.514172 -0.932354 0.097327 0.634547
11.000000 4.519868 1.383368 -0.427983 -0.985169 0.092557 0.874856
11.033333 4.484437 1.387150 -0.324335 -1.031028 0.086242 0.990113
11.066667 4.447556 1.390517 -0.221898 -1.070116 0.078636 0.966169
11.100000 4.409657 1.393350 -0.132361 -1.102648 0.070134 0.797029
11.133333 4.371076 1.395606 -0.048056 -1.129322 0.061241 0.496656
11.166667 4.332037 1.397275 0.004771 -1.150843 0.052530 0.084234
11.200000 4.292721 1.398419 -0.001706 -1.167996 0.044582 -0.403639
11.233333 4.252846 1.399061 -0.014313 -1.181460 0.037914 -0.926849
11.266667 4.212618 1.399391 -0.109350 -1.191724 0.032910 -1.448297
11.300000 4.172275 1.399628 -0.220106 -1.199424 0.029798 -1.926076
11.333333 4.131870 1.399946 -0.318129 -1.204934 0.028654 -2.332786
11.366667 4.091328 1.400415 -0.435230 -1.208324 0.029428 -2.642895
11.400000 4.050759 1.401143 -0.524154 -1.209629 0.031947 -2.852605
11.433333 4.010303 1.402150 -0.659959 -1.208633 0.036000 -2.963486
11.466667 3.969700 1.403352 -0.782541 -1.205164 0.041355 -2.983205
11.500000 3.928992 1.404759 -0.911542 -1.198950 0.047796 -2.924368
11.533333 3.888225 1.406379 -1.015055 -1.189862 0.055142 -2.796381
11.566667 3.847441 1.408219 -1.086269 -1.177659 0.063415 -2.612744
11.600000 3.807456 1.410259 -1.182802 -1.162156 0.072707 -2.370982
11.633333 3.767542 1.412534 -1.262449 -1.143082 0.083302 -2.074281
11.666667 3.728879 1.415114 -1.352550 -1.120207 0.095518 -1.723075
11.700000 3.691746 1.418142 -1.402711 -1.093441 0.109670 -1.316333
11.733333 3.654806 1.421428 -1.455914 -1.062624 0.126085 -0.848991
11.766667 3.620197 1.425616 -1.507028 -1.027934 0.144960 -0.315834
11.800000 3.585857 1.430075 -1.533252 -0.989058 0.166731 0.279328
11.833333 3.551819 1.434810 -1.525956 -0.946295 0.191413 0.931029
11.866667 3.518119 1.439825 -1.519613 -0.899381 0.219243 1.638566
11.900000 3.488685 1.447312 -1.437115 -0.847758 0.250508 2.377707
11.933333 3.459654 1.455087 -1.335472 -0.790459 0.285673 3.107998
11.966667 3.435582 1.465963 -1.225368 -0.726555 0.324901 3.788574
12.000000 3.411966 1.477127 -1.126450 -0.655953 0.367836 4.381724
12.033333 3.388830 1.488578 -0.922772 -0.578188 0.414353 4.856076
12.066667 3.366196 1.500313 -0.703399 -0.493652 0.463878 5.173897
12.100000 3.348748 1.515581 -0.451466 -0.403382 0.515510 5.333170
12.133333 3.336426 1.534216 -0.162780 -0.309634 0.567720 5.351941
12.166667 3.324655 1.553118 0.073754 -0.214595 0.619289 5.255198
12.200000 3.317949 1.574911 0.353324 -0.120448 0.669035 5.056684
12.233333 3.316529 1.599345 0.516423 -0.029765 0.715582 4.785996
12.266667 3.320652 1.626221 0.567923 0.054844 0.757589 4.482500
12.300000 3.330699 1.655553 0.640023 0.131597 0.794234 4.170411
12.333333 3.341289 1.685068 0.718046 0.200289 0.825519 3.868751
12.366667 3.352406 1.714746 0.813988 0.261145 0.851501 3.580892
12.400000 3.364035 1.744564 0.938012 0.315151 0.872680 3.326897
12.433333 3.376159 1.774500 1.073097 0.364087 0.889963 3.099159
12.466667 3.388762 1.804531 1.205460 0.410866 0.904674 2.869978
12.500000 3.401827 1.834636 1.362811 0.458292 0.917953 2.613106
12.533333 3.415334 1.864791 1.450588 0.508212 0.930410 2.300649
12.566667 3.429267 1.894974 1.524156 0.561760 0.942461 1.920361
12.600000 3.443606 1.925162 1.584105 0.619803 0.954213 1.460018
12.633333 3.463419 1.957014 1.632489 0.682386 0.965431 0.921999
12.666667 3.488223 1.990248 1.676279 0.748151 0.975490 0.327427
12.700000 3.517606 2.024550 1.692329 0.814898 0.983637 -0.305451
12.733333 3.547284 2.058755 1.694416 0.880420 0.989322 -0.954199
12.766667 3.577219 2.092833 1.666879 0.942721 0.991895 -1.601168
12.800000 3.610938 2.127288 1.579100 0.999070 0.990635 -2.238264
12.833333 3.647626 2.161468 1.490896 1.047359 0.985114 -2.863370
12.866667 3.686789 2.194956 1.331789 1.086360 0.975230 -3.473033
12.900000 3.726040 2.228206 1.177798 1.115372 0.960853 -4.060266
12.933333 3.766659 2.260072 1.039001 1.133785 0.941908 -4.626453
12.966667 3.807269 2.291647 0.880210 1.140723 0.918534 -5.176035
13.000000 3.847820 2.322904 0.728739 1.135824 0.891121 -5.706497
13.033333 3.888263 2.353818 0.496357 1.118782 0.859908 -6.194036
13.066667 3.928549 2.384363 0.308147 1.089308 0.824939 -6.641545
13.100000 3.966917 2.412144 0.117160 1.047768 0.786798 -7.045752
13.133333 4.002379 2.436923 -0.149024 0.994201 0.745982 -7.392071
13.166667 4.037541 2.461267 -0.463570 0.929646 0.703169 -7.653362
13.200000 4.072361 2.485158 -0.751609 0.855923 0.659139 -7.808045
13.233333 4.101670 2.505982 -1.073080 0.775056 0.614897 -7.857979
13.266667 4.130556 2.526318 -1.362170 0.688882 0.571484 -7.769845
13.300000 4.152185 2.543884 -1.673624 0.599098 0.529523 -7.514933
13.333333 4.165612 2.558796 -1.952965 0.508663 0.489587 -7.084204
13.366667 4.178527 2.573185 -2.145210 0.419972 0.452061 -6.490757
13.400000 4.190908 2.587043 -2.430763 0.334488 0.417001 -5.735005
13.433333 4.202737 2.600361 -2.668991 0.252815 0.384027 -4.828453
13.466667 4.204571 2.611698 -2.870440 0.176339 0.352875 -3.803785
13.500000 4.205825 2.622481 -3.001184 0.105262 0.322928 -2.711467
13.533333 4.206489 2.632703 -3.107596 0.038733 0.293550 -1.592900
13.566667 4.206556 2.642359 3.138431 -0.024251 0.263932 -0.478752
13.600000 4.206018 2.651443 -3.099789 -0.084237 0.233402 0.570344
13.633333 4.204869 2.659951 -2.993705 -0.141444 0.201358 1.510433
13.666667 4.198295 2.666412 -2.884819 -0.197343 0.166947 2.304544
13.700000 4.191102 2.672290 -2.714000 -0.252528 0.129741 2.929729
13.733333 4.179849 2.675827 -2.513366 -0.307098 0.089432 3.367339
13.766667 4.167981 2.678778 -2.361175 -0.360866 0.046000 3.607162
13.800000 4.155503 2.681145 -2.189371 -0.413675 -0.000412 3.660900
13.833333 4.140166 2.680853 -2.043400 -0.464943 -0.049163 3.549993
13.866667 4.124233 2.679981 -1.934894 -0.513938 -0.099464 3.306528
13.900000 4.105969 2.676481 -1.797759 -0.559743 -0.150191 2.973320
13.933333 4.085736 2.670516 -1.689614 -0.601836 -0.200179 2.601099
13.966667 4.063830 2.662236 -1.614496 -0.639741 -0.248182 2.238305
14.000000 4.040385 2.651785 -1.536796 -0.672926 -0.292761 1.939999
14.033333 4.015668 2.639438 -1.505454 -0.701382 -0.332922 1.760611
14.066667 3.990042 2.625514 -1.487014 -0.724753 -0.367599 1.731217
14.100000 3.963857 2.610449 -1.471848 -0.743256 -0.396350 1.871379
14.133333 3.937497 2.594746 -1.519433 -0.757041 -0.418863 2.192376
14.166667 3.911347 2.578939 -1.568530 -0.766460 -0.435129 2.677107
14.200000 3.884751 2.562682 -1.510622 -0.772275 -0.445771 3.282934
14.233333 3.859043 2.547289 -1.415368 -0.775244 -0.451551 3.934389
14.266667 3.832925 2.531482 -1.277768 -0.776190 -0.453413 4.553064
14.300000 3.806414 2.515280 -1.069707 -0.775772 -0.452171 5.054858
14.333333 3.781297 2.500994 -0.833236 -0.774866 -0.448998 5.344308
14.366667 3.755822 2.486345 -0.507918 -0.774251 -0.445020 5.355220
14.400000 3.730004 2.471350 -0.186553 -0.774628 -0.441175 5.056946
14.433333 3.703860 2.456024 0.119055 -0.776526 -0.438149 4.454067
14.466667 3.678281 2.441851 0.447924 -0.780512 -0.436661 3.580217
14.500000 3.653047 2.428328 0.596542 -0.787136 -0.437490 2.503140
14.533333 3.627820 2.414980 0.679700 -0.796518 -0.440977 1.309619
14.566667 3.602330 2.401359 0.652364 -0.808845 -0.447583 0.100073
14.600000 3.576593 2.387479 0.505532 -0.824071 -0.457605 -1.038159
14.633333 3.549731 2.372861 0.327130 -0.841960 -0.471246 -2.024924
14.666667 3.521531 2.357409 0.141514 -0.862036 -0.488410 -2.794139
14.700000 3.493134 2.341741 -0.065036 -0.883651 -0.508871 -3.320959
14.733333 3.463332 2.325147 -0.219695 -0.906136 -0.532434 -3.598893
14.766667 3.432036 2.307428 -0.398268 -0.928600 -0.558696 -3.647784
14.800000 3.400603 2.289543 -0.537600 -0.950256 -0.587308 -3.509286
14.833333 3.368005 2.270113 -0.639410 -0.970490 -0.617966 -3.234892
14.866667 3.334415 2.248808 -0.735470 -0.988895 -0.650625 -2.882489
14.900000 3.299923 2.225338 -0.819260 -1.005054 -0.684814 -2.498443
14.933333 3.265386 2.201784 -0.895296 -1.018789 -0.720051 -2.115574
14.966667 3.230830 2.178169 -0.957653 -1.030139 -0.755842 -1.763715
15.000000 3.196280 2.154519 -1.002220 -1.039124 -0.791744 -1.453060
15.033333 3.161250 2.128162 -1.025043 -1.045781 -0.827286 -1.190167
15.066667 3.125855 2.099163 -1.038159 -1.050067 -0.861601 -0.971789
15.100000 3.090154 2.067615 -1.035876 -1.052023 -0.894103 -0.794230
15.133333 3.054561 2.036144 -1.057452 -1.051530 -0.923981 -0.658728
15.166667 3.019103 2.004782 -1.060898 -1.048415 -0.950374 -0.559952
15.200000 2.983529 1.971321 -1.101310 -1.042378 -0.971881 -0.486144
15.233333 2.948142 1.938037 -1.123604 -1.033204 -0.987425 -0.417158
15.266667 2.912929 1.903412 -1.131167 -1.020606 -0.995998 -0.338419
15.300000 2.878096 1.867917 -1.133385 -1.004437 -0.996910 -0.225894
15.333333 2.843784 1.832085 -1.135531 -0.984516 -0.989348 -0.053974
15.366667 2.810278 1.796507 -1.156385 -0.960696 -0.972598 0.197778
15.400000 2.777791 1.761800 -1.160282 -0.933218 -0.946939 0.534285
15.433333 2.746431 1.728346 -1.174385 -0.902305 -0.912510 0.953902
15.466667 2.716515 1.696887 -1.215411 -0.868604 -0.870344 1.455334
15.500000 2.686984 1.665893 -1.215465 -0.832647 -0.821377 2.026633
15.533333 2.659648 1.638492 -1.147699 -0.795468 -0.767723 2.647457
15.566667 2.632737 1.611616 -1.022667 -0.758018 -0.711510 3.292514
15.600000 2.608780 1.589827 -0.892533 -0.720875 -0.654244 3.938654
15.633333 2.585282 1.568615 -0.700636 -0.684487 -0.597290 4.554217
15.666667 2.565173 1.553621 -0.502825 -0.648885 -0.541267 5.107974
15.700000 2.545552 1.539241 -0.331816 -0.614110 -0.486701 5.579491
15.733333 2.526429 1.525491 -0.102681 -0.579456 -0.432676 5.958304
15.766667 2.507816 1.512385 0.156145 -0.544256 -0.378271 6.247879
15.800000 2.489722 1.499938 0.365764 -0.508069 -0.322799 6.460080
15.833333 2.472158 1.488161 0.626950 -0.470339 -0.265340 6.615652
15.866667 2.455135 1.477070 0.869970 -0.430644 -0.205056 6.740865
15.900000 2.438661 1.466675 1.071836 -0.388566 -0.141115 6.848631
15.933333 2.426248 1.462670 1.282060 -0.344569 -0.073718 6.954579
15.966667 2.414400 1.459378 1.492555 -0.299119 -0.003068 7.064174
16.000000 2.406306 1.462133 1.679215 -0.252786 0.070747 7.175565
16.033333 2.398783 1.465601 1.933385 -0.206506 0.147021 7.285300
16.066667 2.394575 1.474615 2.187515 -0.161296 0.225047 7.381644
16.100000 2.390935 1.484329 2.449714 -0.118172 0.304117 7.456441
16.133333 2.387860 1.494736 2.728869 -0.077371 0.383852 7.496637
16.166667 2.387536 1.509501 3.003242 -0.039309 0.463571 7.500547
16.200000 2.387767 1.524932 -2.994615 -0.003909 0.542868 7.465993
16.233333 2.388547 1.541013 -2.732723 0.029199 0.621936 7.401185
16.266667 2.390082 1.563821 -2.460218 0.060676 0.700661 7.313446
16.300000 2.392151 1.587238 -2.254235 0.091184 0.778932 7.224377
16.333333 2.395708 1.616859 -2.030794 0.121033 0.856201 7.153132
16.366667 2.399783 1.647033 -1.810275 0.151005 0.932702 7.107828
16.400000 2.405866 1.682854 -1.601216 0.181333 1.007609 7.093737
16.433333 2.412445 1.719159 -1.399975 0.212033 1.079520 7.101219
16.466667 2.419509 1.755911 -1.177912 0.242854 1.147572 7.127468
16.500000 2.427045 1.793070 -0.936149 0.273547 1.210906 7.144746
16.533333 2.436488 1.834529 -0.672949 0.303902 1.269277 7.121595
16.566667 2.447663 1.879779 -0.393001 0.333202 1.321520 7.028050
16.600000 2.460456 1.928329 -0.165084 0.361115 1.367374 6.846626
16.633333 2.473662 1.977102 0.118170 0.387496 1.406815 6.561285
16.666667 2.487263 2.026048 0.394999 0.412325 1.439480 6.153434
16.700000 2.502537 2.077088 0.652215 0.435477 1.464731 5.615673
16.733333 2.518169 2.128194 0.843486 0.456939 1.481978 4.953609
16.766667 2.534140 2.179310 0.998814 0.476928 1.491222 4.176346
16.800000 2.550430 2.230382 1.143119 0.495376 1.492441 3.288921
16.833333 2.567018 2.281355 1.267504 0.511905 1.485586 2.304748
16.866667 2.583886 2.332173 1.317083 0.525877 1.470630 1.245122
16.900000 2.601012 2.382783 1.343470 0.536687 1.447962 0.140890
16.933333 2.619691 2.432745 1.348098 0.543420 1.417809 -0.976782
16.966667 2.639551 2.481682 1.329026 0.545172 1.380497 -2.063029
17.000000 2.660110 2.529172 1.271793 0.541133 1.336302 -3.067434
17.033333 2.680839 2.574820 1.128210 0.530885 1.285882 -3.931361
17.066667 2.701140 2.618249 0.906122 0.514353 1.230008 -4.605141
17.100000 2.720398 2.659225 0.626875 0.491826 1.169657 -5.048202
17.133333 2.738107 2.697589 0.402829 0.464203 1.105797 -5.232939
17.166667 2.754074 2.733457 0.129452 0.432603 1.039280 -5.157453
17.200000 2.767976 2.766749 -0.155791 0.398541 0.970843 -4.840729
17.233333 2.779705 2.797419 -0.443461 0.363544 0.900655 -4.324746
17.266667 2.789307 2.825383 -0.677945 0.329266 0.829142 -3.657742
17.300000 2.798937 2.852599 -0.774233 0.296981 0.756247 -2.897999
17.333333 2.806743 2.876576 -0.739861 0.267676 0.681920 -2.110402
17.366667 2.814562 2.899748 -0.673000 0.241938 0.605525 -1.355565
17.400000 2.821055 2.918822 -0.634666 0.219967 0.526615 -0.681173
17.433333 2.827549 2.937039 -0.654360 0.201619 0.444901 -0.118214
17.466667 2.833210 2.950708 -0.611998 0.186389 0.359946 0.304225
17.500000 2.838860 2.963480 -0.582449 0.173868 0.271478 0.583026
17.533333 2.844033 2.971326 -0.543947 0.163391 0.179384 0.732414
17.566667 2.848866 2.974154 -0.516726 0.154397 0.084421 0.773340
17.600000 2.853677 2.976051 -0.474401 0.146276 -0.012728 0.722891
17.633333 2.858465 2.977013 -0.436895 0.138471 -0.111161 0.586723
17.666667 2.863102 2.972983 -0.409234 0.130304 -0.210316 0.386001
17.700000 2.867543 2.964071 -0.386655 0.120913 -0.309523 0.127728
17.733333 2.871741 2.950383 -0.364672 0.109662 -0.407971 -0.180102
17.766667 2.875617 2.931938 -0.336865 0.096079 -0.504968 -0.527703
17.800000 2.879459 2.912585 -0.350369 0.079785 -0.599871 -0.896650
17.833333 2.883266 2.892340 -0.350203 0.060687 -0.691869 -1.266198
17.866667 2.886177 2.867497 -0.420809 0.039163 -0.779749 -1.620423
17.900000 2.887839 2.838351 -0.533684 0.015804 -0.862347 -1.941947
17.933333 2.889467 2.808377 -0.642755 -0.009118 -0.939201 -2.220920
17.966667 2.889242 2.774658 -0.757275 -0.035540 -1.010244 -2.449169
18.000000 2.886884 2.737403 -0.864154 -0.063221 -1.075183 -2.626430
18.033333 2.882128 2.696760 -0.950122 -0.092097 -1.133767 -2.749445
18.066667 2.877361 2.655419 -1.043704 -0.122606 -1.186238 -2.827543
18.100000 2.872592 2.613421 -1.134378 -0.155056 -1.233083 -2.873611
18.133333 2.867832 2.570803 -1.213227 -0.189371 -1.274232 -2.897862
18.166667 2.863091 2.527604 -1.315673 -0.225382 -1.309577 -2.908234
18.200000 2.858378 2.483865 -1.408400 -0.263342 -1.339333 -2.912637
18.233333 2.850585 2.438252 -1.500440 -0.303219 -1.363863 -2.914019
18.266667 2.839808 2.391209 -1.613363 -0.344255 -1.383190 -2.906831
18.300000 2.826221 2.343164 -1.726642 -0.385609 -1.397123 -2.880327
18.333333 2.812725 2.294748 -1.809671 -0.426300 -1.405501 -2.825925
18.366667 2.796677 2.245914 -1.909721 -0.464996 -1.408196 -2.737817
18.400000 2.778367 2.197092 -2.024965 -0.499846 -1.405169 -2.606609
18.433333 2.760219 2.148033 -2.120063 -0.529215 -1.396465 -2.429403
18.466667 2.740513 2.099790 -2.213601 -0.552034 -1.382354 -2.206539
18.500000 2.719718 2.052784 -2.290359 -0.567259 -1.363038 -1.948031
18.533333 2.698305 2.007394 -2.364927 -0.574133 -1.339229 -1.663062
18.566667 2.676854 1.964019 -2.417929 -0.572031 -1.311424 -1.366762
18.600000 2.655711 1.920616 -2.485459 -0.560809 -1.279934 -1.073419
18.633333 2.634906 1.877222 -2.499454 -0.540238 -1.245088 -0.804090
18.666667 2.615704 1.836548 -2.505033 -0.510238 -1.207193 -0.577080
18.700000 2.596900 1.795954 -2.485268 -0.471002 -1.166640 -0.402944
18.733333 2.578522 1.755476 -2.475287 -0.422366 -1.123116 -0.291132
18.766667 2.563980 1.718551 -2.443480 -0.365097 -1.076828 -0.243662
18.800000 2.549917 1.681805 -2.428631 -0.299393 -1.027859 -0.266280
18.833333 2.540591 1.648747 -2.422574 -0.226023 -0.976704 -0.348450
18.866667 2.531785 1.615924 -2.437744 -0.145075 -0.923379 -0.476665
18.900000 2.528385 1.586865 -2.458363 -0.057122 -0.868355 -0.636504
18.933333 2.525536 1.558087 -2.465057 0.036825 -0.812529 -0.814786
18.966667 2.528359 1.532758 -2.516974 0.136317 -0.756370 -0.994712
19.000000 2.531751 1.507747 -2.570817 0.240392 -0.700510 -1.157952
19.033333 2.540785 1.485733 -2.611368 0.348323 -0.645069 -1.292172
19.066667 2.555312 1.466380 -2.673453 0.458188 -0.590809 -1.385670
19.100000 2.570406 1.447385 -2.720907 0.568665 -0.537905 -1.427641
19.133333 2.590639 1.430515 -2.778556 0.677832 -0.486699 -1.399043
19.166667 2.615732 1.415546 -2.848820 0.783979 -0.437416 -1.285434
19.200000 2.645401 1.402348 -2.906825 0.884921 -0.390513 -1.077749
19.233333 2.679357 1.390835 -2.957839 0.978527 -0.346566 -0.764071
19.266667 2.717560 1.381005 -3.009892 1.063516 -0.305752 -0.343899
19.300000 2.756206 1.371563 -3.051117 1.138644 -0.268194 0.176837
19.333333 2.798385 1.364108 -3.090849 1.203592 -0.233519 0.775529
19.366667 2.843875 1.358784 -3.098091 1.258100 -0.201506 1.416926
19.400000 2.889699 1.353841 -3.057158 1.302853 -0.171566 2.073731
19.433333 2.935814 1.349274 -2.975452 1.339002 -0.142967 2.702568
19.466667 2.982179 1.345079 -2.823217 1.367924 -0.114953 3.265194
19.500000 3.028753 1.341251 -2.619551 1.390710 -0.087129 3.730756
19.533333 3.075495 1.337784 -2.468057 1.408405 -0.059431 4.081786
19.566667 3.122362 1.334672 -2.233125 1.422188 -0.031627 4.319978
19.600000 3.169313 1.331910 -2.030282 1.432786 -0.003622 4.454079
19.633333 3.217722 1.332304 -1.853959 1.440312 0.024263 4.507751
19.666667 3.267277 1.335712 -1.699881 1.444477 0.051378 4.516111
19.700000 3.316785 1.339441 -1.592942 1.444973 0.076970 4.509882
19.733333 3.366201 1.343477 -1.474694 1.441033 0.100237 4.509234
19.766667 3.415481 1.347808 -1.374919 1.431315 0.120090 4.522714
19.800000 3.464579 1.352420 -1.274815 1.414727 0.135483 4.537233
19.833333 3.512746 1.358548 -1.135477 1.390838 0.145881 4.526705
19.866667 3.560643 1.364929 -1.015833 1.359415 0.151206 4.454223
19.900000 3.608227 1.371547 -0.806148 1.320684 0.151743 4.281692
19.933333 3.653986 1.378158 -0.553213 1.275599 0.148083 3.977183
19.966667 3.697202 1.384102 -0.342771 1.225971 0.141187 3.519678
20.000000 3.739981 1.390239 -0.126409 1.173492 0.132000 2.906625
20.033333 3.779233 1.395016 0.002963 1.119696 0.121498 2.164394
20.066667 3.814371 1.398273 0.105772 1.065819 0.110533 1.322023
20.100000 3.844962 1.399934 0.143410 1.013176 0.099975 0.421784
20.133333 3.874988 1.401741 0.109332 0.962111 0.090483 -0.491929
20.166667 3.904423 1.403685 -0.014187 0.911882 0.082378 -1.378092
20.200000 3.933244 1.405757 -0.160746 0.861374 0.075916 -2.193093
20.233333 3.961426 1.407947 -0.299001 0.808658 0.070947 -2.924010
20.266667 3.988945 1.410247 -0.428245 0.751858 0.067091 -3.555161
20.300000 4.015780 1.412647 -0.569036 0.688439 0.063674 -4.083016
20.333333 4.041908 1.415139 -0.701771 0.616843 0.060106 -4.504256
20.366667 4.067307 1.417713 -0.815779 0.536176 0.055977 -4.831041
20.400000 4.085895 1.419845 -0.959205 0.446534 0.051081 -5.087677
20.433333 4.103719 1.422042 -1.132610 0.348759 0.045474 -5.280307
20.466667 4.115663 1.423921 -1.382888 0.244411 0.039459 -5.410911
20.500000 4.122144 1.425289 -1.654450 0.135778 0.033261 -5.471888
20.533333 4.123345 1.425956 -1.841667 0.025100 0.027133 -5.468491
20.566667 4.119388 1.426119 -2.048779 -0.084799 0.021294 -5.375753
20.600000 4.110399 1.425914 -2.216084 -0.191473 0.015450 -5.167619
20.633333 4.100657 1.425738 -2.388674 -0.292399 0.009133 -4.822415
20.666667 4.090176 1.425584 -2.531800 -0.385831 0.001603 -4.337360
20.700000 4.075328 1.425650 -2.736576 -0.470495 -0.007444 -3.715049
20.733333 4.056466 1.426139 -2.903904 -0.545555 -0.018600 -2.933549
20.766667 4.033966 1.427157 -3.045351 -0.610972 -0.032575 -2.008510
20.800000 4.008179 1.428797 3.133912 -0.667081 -0.049644 -0.962237
20.833333 3.981710 1.427155 3.101004 -0.714378 -0.069682 0.165312
20.866667 3.954664 1.425510 3.046165 -0.753150 -0.092328 1.349773
20.900000 3.927073 1.423857 3.105182 -0.783919 -0.117410 2.545163
20.933333 3.900130 1.418239 -3.039830 -0.807579 -0.144026 3.678535
20.966667 3.872161 1.412123 -2.819526 -0.825018 -0.171333 4.697165
21.000000 3.843685 1.405110 -2.598513 -0.837210 -0.198455 5.566248
21.033333 3.814801 1.398098 -2.325334 -0.845099 -0.225315 6.266019
21.066667 3.786084 1.389481 -1.954321 -0.849683 -0.251773 6.765417
21.100000 3.757029 1.380877 -1.660521 -0.851604 -0.277881 7.064860
21.133333 3.728763 1.370018 -1.397265 -0.851052 -0.304487 7.182649
21.166667 3.700227 1.359187 -1.155838 -0.848251 -0.332234 7.138499
21.200000 3.671458 1.348394 -0.921118 -0.843308 -0.361691 6.936790
21.233333 3.642489 1.337649 -0.696641 -0.836526 -0.392819 6.590061
21.266667 3.613355 1.326960 -0.489523 -0.828125 -0.425842 6.124073
21.300000 3.585244 1.313542 -0.297546 -0.818537 -0.460402 5.553384
21.333333 3.558098 1.297430 -0.065313 -0.808259 -0.495642 4.889556
21.366667 3.531972 1.278933 0.126450 -0.797733 -0.530393 4.153907
21.400000 3.505811 1.260550 0.339729 -0.787264 -0.563602 3.376432
21.433333 3.480356 1.240211 0.491503 -0.777079 -0.594094 2.582816
21.466667 3.455270 1.218141 0.573925 -0.767476 -0.620403 1.798515
21.500000 3.430304 1.194611 0.560014 -0.758358 -0.641522 1.057928
21.533333 3.405423 1.171285 0.502571 -0.749511 -0.656875 0.397654
21.566667 3.380366 1.147249 0.440343 -0.740536 -0.666417 -0.159199
21.600000 3.355453 1.123470 0.351564 -0.730886 -0.670110 -0.584675
21.633333 3.330714 1.099974 0.268721 -0.719923 -0.668352 -0.858882
21.666667 3.306178 1.076788 0.209104 -0.706707 -0.661751 -0.970769
21.700000 3.282024 1.054230 0.174318 -0.690446 -0.650972 -0.929962
21.733333 3.258634 1.032517 0.151998 -0.670240 -0.636352 -0.753168
21.766667 3.235533 1.011190 0.119983 -0.645081 -0.617989 -0.459285
21.800000 3.212749 0.990275 0.073839 -0.614379 -0.596099 -0.074993
21.833333 3.192102 0.970436 0.065096 -0.577762 -0.570782 0.376258
21.866667 3.171824 0.951056 0.043963 -0.535384 -0.542197 0.876950
21.900000 3.151940 0.932160 0.061294 -0.487733 -0.510513 1.422725
21.933333 3.135223 0.914694 0.128920 -0.435808 -0.475978 2.007828
21.966667 3.118944 0.897756 0.203934 -0.380971 -0.438910 2.634019
22.000000 3.106086 0.882652 0.315678 -0.324609 -0.399662 3.295484
22.033333 3.096682 0.869583 0.450542 -0.268015 -0.358462 3.988714
22.066667 3.090689 0.858800 0.592217 -0.212482 -0.315577 4.696385
22.100000 3.088077 0.850630 0.719081 -0.159307 -0.271343 5.408711
22.133333 3.085970 0.843076 0.901181 -0.109542 -0.225892 5.596176
22.166667 3.084374 0.836149 1.110563 -0.064187 -0.179565 5.241851
22.200000 3.083293 0.829862 1.350479 -0.023746 -0.132490 4.338778
22.233333 3.082732 0.824227 1.649667 0.011458 -0.084591 2.866583
22.266667 3.084223 0.821703 1.939899 0.041395 -0.035435 0.821415
22.300000 3.087388 0.822114 2.274233 0.066381 0.015822 -1.824467
22.333333 3.091080 0.823201 2.616297 0.086949 0.069679 -4.044790
22.366667 3.095768 0.826647 2.987438 0.103687 0.126919 -5.854299
22.400000 3.100982 0.830775 -3.011212 0.116943 0.188212 -7.254700
22.433333 3.106717 0.835586 -2.607727 0.127104 0.253870 -8.235255
22.466667 3.110993 0.845423 -2.215412 0.134878 0.323540 -8.262198
22.500000 3.115789 0.855941 -1.849416 0.141014 0.396547 -7.316484
22.533333 3.121105 0.867135 -1.460610 0.146329 0.472218 -5.917417
22.566667 3.125777 0.882524 -1.151455 0.151820 0.549389 -4.051083
22.600000 3.130136 0.901935 -0.882798 0.158829 0.626759 -1.731626
22.633333 3.134478 0.925168 -0.609943 0.168534 0.702634 1.039130
22.666667 3.139097 0.952083 -0.321156 0.181608 0.775867 3.199143
22.700000 3.144200 0.982463 -0.073060 0.198578 0.845149 4.755488
22.733333 3.149821 1.013424 0.258473 0.219943 0.909246 5.721834
22.766667 3.156591 1.047480 0.574475 0.245904 0.967405 6.100299
22.800000 3.163877 1.082062 0.902785 0.276356 1.019235 5.904493
22.833333 3.171676 1.117139 1.097741 0.311155 1.065094 5.145441
22.866667 3.182259 1.154529 1.221306 0.350454 1.105393 4.375907
22.900000 3.193345 1.192352 1.294732 0.394762 1.141053 3.604850
22.933333 3.208203 1.232355 1.338768 0.443757 1.172760 2.854353
22.966667 3.223548 1.272721 1.404788 0.497311 1.201335 2.149347
23.000000 3.239368 1.313415 1.409031 0.554872 1.227278 1.521405
23.033333 3.255651 1.354401 1.461407 0.616244 1.250783 0.975579
23.066667 3.276835 1.397117 1.479774 0.680516 1.271874 0.504176
23.100000 3.298453 1.440049 1.472776 0.746308 1.290185 0.102209
23.133333 3.325077 1.484309 1.468168 0.813007 1.305565 -0.247025
23.166667 3.352092 1.528708 1.469224 0.880142 1.317512 -0.560538
23.200000 3.383925 1.573823 1.437709 0.947416 1.325406 -0.859817
23.233333 3.420468 1.619361 1.398227 1.013529 1.328693 -1.150071
23.266667 3.457313 1.664915 1.346189 1.078219 1.326779 -1.434240
23.300000 3.494426 1.710445 1.301079 1.141065 1.319292 -1.721727
23.333333 3.531771 1.755907 1.243006 1.201709 1.305928 -2.020712
23.366667 3.573152 1.800728 1.175042 1.259078 1.286715 -2.337734
23.400000 3.614689 1.845399 1.075462 1.312454 1.261907 -2.687288
23.433333 3.659494 1.888781 0.978530 1.361909 1.231871 -3.074426
23.466667 3.707163 1.930563 0.894504 1.406680 1.197340 -3.503539
23.500000 3.757219 1.970385 0.792153 1.446076 1.159098 -3.957379
23.533333 3.809206 2.007935 0.711086 1.478812 1.118163 -4.425624
23.566667 3.861110 2.045148 0.562314 1.504184 1.075208 -4.892194
23.600000 3.914282 2.079784 0.394175 1.521002 1.031201 -5.327050
23.633333 3.967263 2.114021 0.169283 1.528245 0.986897 -5.709042
23.666667 4.020399 2.145327 -0.049719 1.525453 0.942846 -6.026404
23.700000 4.073233 2.176177 -0.291824 1.512569 0.899318 -6.287575
23.733333 4.124934 2.203987 -0.602155 1.490412 0.856543 -6.480389
23.766667 4.176223 2.231291 -0.857943 1.460012 0.815031 -6.605345
23.800000 4.227046 2.258065 -1.108899 1.422758 0.774946 -6.668816
23.833333 4.277348 2.284286 -1.273924 1.379555 0.736281 -6.689484
23.866667 4.324448 2.308211 -1.473562 1.331146 0.698600 -6.657448
23.900000 4.367786 2.330123 -1.674243 1.278342 0.661730 -6.558022
23.933333 4.406842 2.350221 -1.853869 1.221748 0.625186 -6.397559
23.966667 4.445184 2.369690 -2.033393 1.161532 0.588071 -6.170260
24.000000 4.482769 2.388511 -2.328943 1.098294 0.549492 -5.862457
24.033333 4.519558 2.406671 -2.617887 1.033088 0.509088 -5.440383
24.066667 4.555507 2.424153 -2.858434 0.966946 0.466946 -4.901773
24.100000 4.590578 2.440942 -3.049910 0.900099 0.422900 -4.248732
24.133333 4.619668 2.457490 3.093644 0.832393 0.376747 -3.488358
24.166667 4.645079 2.470138 2.954014 0.764257 0.329146 -2.642480
24.200000 4.666827 2.478901 2.887033 0.695923 0.281059 -1.761936
24.233333 4.687565 2.486925 2.831563 0.627116 0.233205 -0.906682
24.266667 4.707267 2.494203 2.833855 0.557555 0.186183 -0.125323
24.300000 4.723765 2.497158 2.904451 0.487678 0.141077 0.538670
24.333333 4.739179 2.499359 3.007039 0.417921 0.099172 1.060558
24.366667 4.753487 2.500806 3.128744 0.347819 0.060936 1.426602
24.400000 4.766667 2.501496 -3.025964 0.276461 0.026311 1.655338
24.433333 4.775354 2.501200 -2.905430 0.203536 -0.004806 1.765433
24.466667 4.779631 2.500002 -2.836196 0.128787 -0.032544 1.781779
24.500000 4.782733 2.498048 -2.801842 0.051668 -0.057762 1.740348
24.533333 4.784649 2.495342 -2.793910 -0.028417 -0.081445 1.673969
24.566667 4.782008 2.492139 -2.772974 -0.111216 -0.104458 1.611040
24.600000 4.778165 2.488186 -2.748536 -0.196246 -0.127406 1.565356
24.633333 4.769746 2.483866 -2.720793 -0.283279 -0.151028 1.551646
24.666667 4.760120 2.478800 -2.679250 -0.372183 -0.176023 1.577473
24.700000 4.746072 2.473199 -2.624564 -0.462227 -0.202671 1.634274
24.733333 4.730823 2.466858 -2.521972 -0.552271 -0.231113 1.703170
24.766667 4.711508 2.459580 -2.435278 -0.641369 -0.261234 1.770885
24.800000 4.688378 2.451186 -2.392060 -0.728452 -0.293029 1.827198
24.833333 4.661479 2.441438 -2.323771 -0.812471 -0.326270 1.860718
24.866667 4.630970 2.430134 -2.252828 -0.892128 -0.360678 1.862281
24.900000 4.596973 2.417047 -2.199156 -0.966684 -0.396009 1.828945
24.933333 4.561865 2.403252 -2.135854 -1.035583 -0.432169 1.768646
24.966667 4.523592 2.387328 -2.075449 -1.098491 -0.469089 1.682414
25.000000 4.484260 2.370716 -2.017322 -1.155235 -0.506511 1.570172
25.033333 4.443897 2.353426 -1.954684 -1.205848 -0.544161 1.435072
25.066667 4.402533 2.335471 -1.891570 -1.250622 -0.581912 1.282828
25.100000 4.360196 2.316862 -1.831686 -1.289974 -0.619619 1.112577
25.133333 4.315814 2.295871 -1.807507 -1.324136 -0.656790 0.919126
25.166667 4.269774 2.272627 -1.776756 -1.353279 -0.692979 0.703979
25.200000 4.222855 2.248771 -1.756590 -1.377593 -0.727726 0.469748
25.233333 4.175072 2.223045 -1.756257 -1.397118 -0.760549 0.217420
25.266667 4.126867 2.195734 -1.739676 -1.412045 -0.790719 -0.058929
25.300000 4.077886 2.167865 -1.753297 -1.422397 -0.817435 -0.349930
25.333333 4.029402 2.138995 -1.773004 -1.428848 -0.840213 -0.646857
25.366667 3.980210 2.109608 -1.780297 -1.432310 -0.858704 -0.948555
25.400000 3.932238 2.079619 -1.766754 -1.433953 -0.872575 -1.251593
25.433333 3.883626 2.049155 -1.831839 -1.434953 -0.881710 -1.546047
25.466667 3.836392 2.018647 -1.923971 -1.436424 -0.886368 -1.810198
25.500000 3.789908 1.988205 -1.996389 -1.439593 -0.886906 -2.031273
25.533333 3.743646 1.957953 -2.081513 -1.445167 -0.883818 -2.195429
25.566667 3.696865 1.927307 -2.171655 -1.453551 -0.877632 -2.274336
25.600000 3.649578 1.897228 -2.274542 -1.464622 -0.869162 -2.239365
25.633333 3.601536 1.867897 -2.372328 -1.478229 -0.859208 -2.076653
25.666667 3.552379 1.839321 -2.473226 -1.493860 -0.848433 -1.787008
25.700000 3.502044 1.811676 -2.598963 -1.510642 -0.837686 -1.376285
25.733333 3.450500 1.785144 -2.676993 -1.527681 -0.827694 -0.857840
25.766667 3.398625 1.758323 -2.734027 -1.544188 -0.819085 -0.268387
25.800000 3.346452 1.731225 -2.754874 -1.559666 -0.812222 0.341290
25.833333 3.293413 1.705409 -2.717391 -1.573695 -0.807442 0.922704
25.866667 3.240146 1.679343 -2.682464 -1.586140 -0.804934 1.435374
25.900000 3.186685 1.653040 -2.566364 -1.597156 -0.804587 1.838751
25.933333 3.133064 1.626512 -2.403555 -1.607061 -0.806126 2.099363
25.966667 3.079320 1.599773 -2.228417 -1.616221 -0.809295 2.202451
26.000000 3.025488 1.572834 -2.076975 -1.625010 -0.813909 2.154814
26.033333 2.971602 1.545708 -1.968995 -1.633825 -0.819572 1.976075
26.066667 2.917438 1.518542 -1.886018 -1.642982 -0.825987 1.689391
26.100000 2.862802 1.491125 -1.852673 -1.652692 -0.832956 1.332848
26.133333 2.807529 1.463320 -1.859971 -1.663118 -0.840362 0.956515
26.166667 2.751359 1.434987 -1.866544 -1.674158 -0.847968 0.604369
26.200000 2.695318 1.406531 -1.883978 -1.685521 -0.855473 0.309833
26.233333 2.639443 1.377964 -1.896950 -1.696733 -0.862676 0.095942
26.266667 2.583771 1.349300 -1.933821 -1.707336 -0.869324 -0.021689
26.300000 2.526790 1.320070 -1.961302 -1.716769 -0.875103 -0.041712
26.333333 2.468606 1.290404 -1.966850 -1.724339 -0.879715 0.015716
26.366667 2.409403 1.260408 -1.984432 -1.729467 -0.882970 0.131719
26.400000 2.350564 1.230369 -1.980641 -1.731692 -0.884759 0.281990
26.433333 2.292130 1.200303 -1.982121 -1.730477 -0.884943 0.444270
26.466667 2.233408 1.170261 -1.948961 -1.725042 -0.883349 0.596106
26.500000 2.174763 1.140368 -1.923428 -1.714671 -0.879856 0.721170
26.533333 2.116588 1.110788 -1.867305 -1.698638 -0.874284 0.815680
26.566667 2.058920 1.081418 -1.810943 -1.676092 -0.866339 0.876940
26.600000 2.002151 1.052414 -1.766419 -1.646217 -0.855729 0.914901
26.633333 1.946736 1.023928 -1.718323 -1.608626 -0.842360 0.941767
26.666667 1.892017 0.995506 -1.685143 -1.563457 -0.826316 0.977976
26.700000 1.838034 0.967160 -1.662428 -1.511219 -0.807807 1.042003
26.733333 1.784826 0.938901 -1.646197 -1.452482 -0.787070 1.149219
26.766667 1.734574 0.911775 -1.650557 -1.388498 -0.764649 1.312405
26.800000 1.687673 0.885992 -1.644875 -1.320687 -0.741141 1.528338
26.833333 1.644553 0.861708 -1.629269 -1.250127 -0.717035 1.793153
26.866667 1.605482 0.838983 -1.581569 -1.177621 -0.692813 2.087544
26.900000 1.570938 0.818028 -1.509035 -1.103759 -0.668998 2.384225
26.933333 1.537348 0.797205 -1.393804 -1.029357 -0.646321 2.651081
26.966667 1.504732 0.776516 -1.274329 -0.954377 -0.625272 2.855502
27.000000 1.473109 0.755966 -1.132268 -0.878211 -0.606229 2.979594
27.033333 1.442496 0.735557 -0.983269 -0.800410 -0.589492 3.003546
27.066667 1.417196 0.716925 -0.838167 -0.720760 -0.575407 2.927208
27.100000 1.392936 0.698438 -0.697104 -0.638926 -0.564032 2.765250
27.133333 1.369728 0.680096 -0.601113 -0.554659 -0.555222 2.545408
27.166667 1.351091 0.662593 -0.486273 -0.468493 -0.548956 2.292781
27.200000 1.336750 0.645555 -0.424983 -0.381730 -0.545284 2.027158
27.233333 1.326354 0.628593 -0.417405 -0.295828 -0.544370 1.773268
27.266667 1.319660 0.611405 -0.421371 -0.212011 -0.546037 1.543051
27.300000 1.316381 0.593706 -0.418561 -0.131756 -0.550189 1.339521
27.333333 1.316262 0.575310 -0.381302 -0.056492 -0.556690 1.150381
27.366667 1.317184 0.557058 -0.342950 0.012930 -0.565181 0.968720
27.400000 1.320840 0.537787 -0.281357 0.076115 -0.575055 0.786989
27.433333 1.325508 0.518662 -0.220437 0.133015 -0.585569 0.592264
27.466667 1.331174 0.499686 -0.158897 0.183701 -0.596133 0.376756
27.500000 1.338821 0.479773 -0.121602 0.228562 -0.606175 0.142707
27.533333 1.348160 0.459029 -0.122762 0.268286 -0.615182 -0.092780
27.566667 1.358861 0.437595 -0.138973 0.303402 -0.622673 -0.310962
27.600000 1.370662 0.415595 -0.180251 0.334511 -0.628410 -0.490415
27.633333 1.383366 0.393763 -0.236619 0.362083 -0.632191 -0.609400
27.666667 1.396951 0.372106 -0.296623 0.386550 -0.633885 -0.645913
27.700000 1.410888 0.350355 -0.379624 0.408301 -0.633434 -0.591993
27.733333 1.425663 0.328790 -0.428720 0.427676 -0.630875 -0.457117
27.766667 1.440401 0.307483 -0.459819 0.445069 -0.626404 -0.258098
27.800000 1.454978 0.286602 -0.482862 0.460801 -0.620253 -0.019879
27.833333 1.470328 0.265925 -0.456891 0.475256 -0.612734 0.228584
27.866667 1.486430 0.245457 -0.412869 0.488743 -0.604142 0.451783
27.900000 1.503262 0.225204 -0.369319 0.501469 -0.594788 0.620582
27.933333 1.520803 0.205170 -0.312463 0.513581 -0.584904 0.719423
27.966667 1.538211 0.185869 -0.268206 0.525170 -0.574700 0.740319
28.000000 1.556284 0.166796 -0.196001 0.536206 -0.564293 0.682541
28.033333 1.574331 0.148348 -0.146948 0.546647 -0.553791 0.557396
28.066667 1.593000 0.130137 -0.122138 0.556450 -0.543301 0.385742
28.100000 1.611723 0.112352 -0.114127 0.565659 -0.532862 0.190110
28.133333 1.630488 0.094917 -0.129525 0.574325 -0.522472 -0.006787
28.166667 1.649811 0.077729 -0.157740 0.582466 -0.512059 -0.183436
28.200000 1.669672 0.060793 -0.190838 0.590154 -0.501522 -0.317845
28.233333 1.689511 0.044173 -0.221484 0.597390 -0.490700 -0.396570
28.266667 1.709845 0.027809 -0.248682 0.604180 -0.479432 -0.413448
28.300000 1.730176 0.011834 -0.281812 0.610505 -0.467612 -0.366019
28.333333 1.750524 -0.003718 -0.301207 0.616332 -0.455196 -0.261384
28.366667 1.771307 -0.019005 -0.325465 0.621655 -0.442171 -0.111535
28.400000 1.792504 -0.034027 -0.336804 0.626547 -0.428640 0.066320
28.433333 1.813650 -0.048305 -0.338872 0.631063 -0.414779 0.254781
28.466667 1.834712 -0.061752 -0.323726 0.635275 -0.400824 0.436254
28.500000 1.856130 -0.074929 -0.287668 0.639164 -0.386993 0.589577
28.533333 1.877192 -0.087059 -0.247710 0.642785 -0.373562 0.701226
28.566667 1.898572 -0.098918 -0.209452 0.646177 -0.360838 0.757164
28.600000 1.920249 -0.110508 -0.157885 0.649301 -0.349087 0.749533
28.633333 1.942206 -0.121829 -0.107451 0.652109 -0.338509 0.674788
28.666667 1.963948 -0.132536 -0.066916 0.654551 -0.329201 0.534394
28.700000 1.985932 -0.142977 -0.029149 0.656615 -0.321219 0.342283
28.733333 2.008140 -0.153153 -0.009258 0.658114 -0.314459 0.113208
28.766667 2.030273 -0.163157 -0.009033 0.658913 -0.308743 -0.128688
28.800000 2.052369 -0.173106 -0.011323 0.658877 -0.303789 -0.359813
28.833333 2.074402 -0.183093 -0.051995 0.657965 -0.299298 -0.552870
28.866667 2.096588 -0.192820 -0.085020 0.656073 -0.294972 -0.684055
28.900000 2.118752 -0.202679 -0.155423 0.653181 -0.290510 -0.735058
28.933333 2.140790 -0.212599 -0.208754 0.649406 -0.285645 -0.695729
28.966667 2.162592 -0.222511 -0.265168 0.644782 -0.280113 -0.567271
29.000000 2.184479 -0.232166 -0.320693 0.639407 -0.273778 -0.357629
29.033333 2.205900 -0.241554 -0.352762 0.633325 -0.266579 -0.092610
29.066667 2.226732 -0.250522 -0.361744 0.626677 -0.258495 0.198058
29.100000 2.247603 -0.259235 -0.351145 0.619532 -0.249573 0.475692
29.133333 2.267807 -0.267314 -0.311342 0.612029 -0.239997 0.705085
29.166667 2.288022 -0.275141 -0.240467 0.604365 -0.230028 0.855183
29.200000 2.308235 -0.282717 -0.162506 0.596683 -0.219893 0.900751
29.233333 2.328431 -0.290042 -0.076134 0.589087 -0.209796 0.838188
29.266667 2.347964 -0.296725 0.007551 0.581593 -0.199949 0.674506
29.300000 2.366902 -0.302913 0.066136 0.574234 -0.190537 0.431799
29.333333 2.385788 -0.308857 0.104346 0.566841 -0.181604 0.141586
29.366667 2.404281 -0.314585 0.092533 0.559189 -0.173124 -0.157160
29.400000 2.422699 -0.320076 0.044855 0.551083 -0.165034 -0.422125
29.433333 2.441030 -0.325330 -0.025370 0.542396 -0.157263 -0.621731
29.466667 2.459263 -0.330352 -0.105136 0.532954 -0.149661 -0.730998
29.500000 2.477388 -0.335144 -0.187281 0.522527 -0.142045 -0.738332
29.533333 2.495200 -0.339900 -0.266773 0.511020 -0.134280 -0.645208
29.566667 2.512600 -0.344522 -0.294639 0.498419 -0.126283 -0.469114
29.600000 2.529470 -0.348922 -0.315192 0.484711 -0.117998 -0.237497
29.633333 2.545695 -0.352971 -0.309910 0.469899 -0.109388 0.015579
29.666667 2.561125 -0.356559 -0.269614 0.454179 -0.100538 0.251431
29.700000 2.575588 -0.359607 -0.234803 0.437922 -0.091602 0.434617
29.733333 2.589882 -0.362447 -0.183336 0.421499 -0.082777 0.535735
29.766667 2.604003 -0.365081 -0.123380 0.405253 -0.074261 0.541958
29.800000 2.617259 -0.367225 -0.073143 0.389545 -0.066258 0.449069
29.833333 2.629714 -0.368987 -0.041954 0.374697 -0.058966 0.270235
29.866667 2.641469 -0.370482 -0.015396 0.360906 -0.052480 0.031617
29.900000 2.652723 -0.371782 -0.006869 0.348206 -0.046828 -0.232871
29.933333 2.663577 -0.373027 -0.001030 0.336588 -0.041941 -0.488085
29.966667 2.674234 -0.374093 -0.029903 0.326033 -0.037722 -0.704506
30.000000 2.684713 -0.375229 -0.089585 0.316394 -0.033982 -0.854542
30.033333 2.694993 -0.376195 -0.200090 0.307445 -0.030509 -0.923351
30.066667 2.705102 -0.377249 -0.291438 0.298929 -0.027096 -0.909127
30.100000 2.715055 -0.378275 -0.359253 0.290571 -0.023558 -0.817535
30.133333 2.724754 -0.379228 -0.405963 0.282093 -0.019794 -0.663356
30.166667 2.734143 -0.380004 -0.415276 0.273205 -0.015739 -0.468535
30.200000 2.743325 -0.380632 -0.404733 0.263743 -0.011431 -0.262444
30.233333 2.752299 -0.381113 -0.393215 0.253647 -0.006944 -0.072234
30.266667 2.760739 -0.381239 -0.357321 0.242934 -0.002413 0.081414
30.300000 2.768972 -0.381228 -0.323906 0.231706 0.001978 0.181085
30.333333 2.776576 -0.380885 -0.272768 0.220138 0.006050 0.222038
30.366667 2.783603 -0.380306 -0.252007 0.208476 0.009661 0.206091
30.400000 2.790425 -0.379603 -0.253752 0.196943 0.012695 0.148649
30.433333 2.796684 -0.378847 -0.238251 0.185759 0.015052 0.063148
30.466667 2.802429 -0.378142 -0.259394 0.175141 0.016696 -0.032394
30.500000 2.807644 -0.377583 -0.279691 0.165314 0.017686 -0.122772
30.533333 2.812663 -0.376917 -0.303048 0.156402 0.018154 -0.199016
30.566667 2.817487 -0.376149 -0.314308 0.148445 0.018223 -0.251965
30.600000 2.822121 -0.375283 -0.331346 0.141490 0.018044 -0.284819
30.633333 2.826471 -0.374718 -0.343277 0.135528 0.017785 -0.297235
30.666667 2.830694 -0.374331 -0.327952 0.130504 0.017607 -0.300827
30.700000 2.834737 -0.373857 -0.369644 0.126300 0.017593 -0.298328
