t x y theta dxdt dydt dthetadt
0.000000 0.000000 0.000000 -3.016246 -0.064666 0.139508 0.118738
0.033333 -0.002188 0.004693 -2.997514 -0.067126 0.142650 0.102576
0.066667 -0.004465 0.009496 -2.980714 -0.069609 0.145825 0.081457
0.100000 -0.006823 0.014402 -2.982536 -0.072117 0.149033 0.055277
0.133333 -0.009262 0.019415 -2.963258 -0.074651 0.152277 0.026263
0.166667 -0.011783 0.024535 -2.970358 -0.077214 0.155559 -0.003599
0.200000 -0.014389 0.029764 -2.973914 -0.079809 0.158881 -0.035526
0.233333 -0.017087 0.035106 -2.976390 -0.082436 0.162242 -0.067481
0.266667 -0.019872 0.040561 -2.976611 -0.085096 0.165643 -0.099295
0.300000 -0.022744 0.046130 -2.996200 -0.087790 0.169086 -0.127989
0.333333 -0.025705 0.051814 -3.000128 -0.090518 0.172570 -0.151287
0.366667 -0.028762 0.057616 -3.011873 -0.093280 0.176095 -0.170871
0.400000 -0.031909 0.063536 -3.004365 -0.096073 0.179660 -0.184281
0.433333 -0.035154 0.069574 -3.014703 -0.098897 0.183265 -0.193064
0.466667 -0.038491 0.075735 -3.020349 -0.101752 0.186909 -0.196053
0.500000 -0.041922 0.082019 -3.022442 -0.104636 0.190592 -0.194585
0.533333 -0.045453 0.088424 -3.041204 -0.107547 0.194313 -0.192122
0.566667 -0.049080 0.094956 -3.037023 -0.110486 0.198071 -0.189748
0.600000 -0.052808 0.101610 -3.052468 -0.113452 0.201867 -0.186341
0.633333 -0.056633 0.108394 -3.064760 -0.116443 0.205701 -0.186147
0.666667 -0.060558 0.115310 -3.061720 -0.119462 0.209572 -0.190355
0.700000 -0.064585 0.122350 -3.076182 -0.122508 0.213477 -0.199683
0.733333 -0.068713 0.129525 -3.080969 -0.125587 0.217413 -0.212591
0.766667 -0.072945 0.136825 -3.066096 -0.128700 0.221379 -0.227443
0.800000 -0.077280 0.144264 -3.078876 -0.131857 0.225369 -0.244167
0.833333 -0.081719 0.151841 -3.073925 -0.135063 0.229378 -0.259466
0.866667 -0.086263 0.159545 -3.095345 -0.138325 0.233405 -0.269616
0.900000 -0.090913 0.167393 -3.114630 -0.141648 0.237446 -0.271993
0.933333 -0.095671 0.175385 -3.125985 -0.145038 0.241499 -0.266389
0.966667 -0.100534 0.183504 3.137710 -0.148497 0.245563 -0.249292
1.000000 -0.105527 0.191757 3.127439 -0.152026 0.249640 -0.223012
1.033333 -0.110626 0.200139 3.111161 -0.155621 0.253730 -0.186568
1.066667 -0.115856 0.208657 3.112579 -0.159277 0.257834 -0.145986
1.100000 -0.121217 0.217314 3.102848 -0.162986 0.261951 -0.103488
1.133333 -0.126710 0.226110 3.111416 -0.166736 0.266084 -0.062217
1.166667 -0.132336 0.235047 3.116323 -0.170510 0.270227 -0.027636
1.200000 -0.138070 0.244113 3.120096 -0.174292 0.274377 -0.000049
1.233333 -0.143939 0.253322 3.121642 -0.178066 0.278527 0.017006
1.266667 -0.149943 0.262677 3.127841 -0.181819 0.282673 0.026720
1.300000 -0.156083 0.272177 3.124740 -0.185541 0.286809 0.028104
1.333333 -0.162360 0.281824 3.125373 -0.189226 0.290932 0.024832
1.366667 -0.168745 0.291600 3.127964 -0.192875 0.295039 0.018716
1.400000 -0.175237 0.301503 3.120770 -0.196487 0.299130 0.011676
1.433333 -0.181868 0.311556 3.127852 -0.200066 0.303207 0.003547
1.466667 -0.188605 0.321736 3.127627 -0.203615 0.307269 -0.005239
1.500000 -0.195450 0.332043 3.124326 -0.207134 0.311316 -0.011414
1.533333 -0.202400 0.342477 3.124933 -0.210629 0.315350 -0.018359
1.566667 -0.209456 0.353036 3.121810 -0.214107 0.319374 -0.022889
1.600000 -0.216654 0.363750 3.123873 -0.217570 0.323391 -0.026649
1.633333 -0.223992 0.374622 3.121691 -0.221027 0.327406 -0.023914
1.666667 -0.231435 0.385617 3.131290 -0.224477 0.331420 -0.018069
1.700000 -0.238981 0.396736 3.122820 -0.227924 0.335432 -0.011294
1.733333 -0.246630 0.407977 3.121414 -0.231370 0.339448 -0.001419
1.766667 -0.254381 0.419341 3.098322 -0.234816 0.343469 0.002880
1.800000 -0.262275 0.430865 3.103606 -0.238265 0.347498 -0.009040
1.833333 -0.270270 0.442510 3.124563 -0.241715 0.351532 -0.054869
1.866667 -0.278365 0.454274 3.111315 -0.245168 0.355573 -0.142679
1.900000 -0.286603 0.466201 3.132501 -0.248622 0.359620 -0.287999
1.933333 -0.294939 0.478246 3.129558 -0.252067 0.363661 -0.500933
1.966667 -0.303419 0.490455 3.140417 -0.255483 0.367675 -0.781270
2.000000 -0.311994 0.502779 3.124522 -0.258861 0.371651 -1.110373
2.033333 -0.320665 0.515217 3.137513 -0.262190 0.375580 -1.466339
2.066667 -0.329479 0.527821 3.125455 -0.265461 0.379455 -1.830752
2.100000 -0.338437 0.540592 3.057930 -0.268673 0.383275 -2.171762
2.133333 -0.347486 0.553472 2.919708 -0.271834 0.387052 -2.460359
2.166667 -0.356624 0.566461 2.784647 -0.274963 0.390810 -2.672420
2.200000 -0.365850 0.579557 2.618014 -0.278071 0.394565 -2.800245
2.233333 -0.375163 0.592759 2.471539 -0.281170 0.398331 -2.836965
2.266667 -0.384561 0.606064 2.339889 -0.284271 0.402121 -2.778014
2.300000 -0.394043 0.619472 2.240098 -0.287379 0.405940 -2.635008
2.333333 -0.403663 0.633048 2.165860 -0.290491 0.409784 -2.434539
2.366667 -0.413363 0.646723 2.116586 -0.293599 0.413642 -2.204135
2.400000 -0.423198 0.660565 2.044275 -0.296686 0.417492 -1.967150
2.433333 -0.433166 0.674575 2.002137 -0.299734 0.421310 -1.749887
2.466667 -0.443264 0.688749 1.965281 -0.302725 0.425078 -1.573554
2.500000 -0.453435 0.703015 1.942843 -0.305645 0.428781 -1.453624
2.533333 -0.463732 0.717443 1.895408 -0.308483 0.432410 -1.385070
2.566667 -0.474098 0.731958 1.862871 -0.311231 0.435962 -1.361802
2.600000 -0.484531 0.746557 1.818879 -0.313896 0.439452 -1.379214
2.633333 -0.495029 0.761237 1.798140 -0.316488 0.442899 -1.428328
2.666667 -0.505640 0.776072 1.736227 -0.319018 0.446318 -1.499084
2.700000 -0.516312 0.790983 1.692518 -0.321486 0.449709 -1.580963
2.733333 -0.527042 0.805969 1.636693 -0.323900 0.453080 -1.674960
2.766667 -0.537873 0.821100 1.569064 -0.326259 0.456425 -1.780026
2.800000 -0.548800 0.836373 1.513289 -0.328552 0.459726 -1.893259
2.833333 -0.559818 0.851784 1.437879 -0.330764 0.462951 -2.011750
2.866667 -0.570923 0.867329 1.374051 -0.332882 0.466079 -2.141937
2.900000 -0.582110 0.883002 1.313110 -0.334894 0.469087 -2.283916
2.933333 -0.593340 0.898733 1.238166 -0.336786 0.471950 -2.435099
2.966667 -0.604642 0.914581 1.160230 -0.338546 0.474643 -2.591359
3.000000 -0.615983 0.930480 1.093559 -0.340171 0.477159 -2.752646
3.033333 -0.627359 0.946425 0.991057 -0.341666 0.479498 -2.916701
3.066667 -0.638794 0.962472 0.878211 -0.343034 0.481664 -3.071854
3.100000 -0.650282 0.978614 0.760774 -0.344283 0.483664 -3.211153
3.133333 -0.661797 0.994792 0.661443 -0.345420 0.485502 -3.329603
3.166667 -0.673357 1.011050 0.532047 -0.346455 0.487191 -3.425127
3.200000 -0.684939 1.027338 0.400340 -0.347394 0.488732 -3.488274
3.233333 -0.696557 1.043692 0.273662 -0.348238 0.490121 -3.514923
3.266667 -0.708207 1.060104 0.132094 -0.348988 0.491353 -3.506574
3.300000 -0.719870 1.076534 0.032501 -0.349647 0.492425 -3.468609
3.333333 -0.731558 1.093009 -0.089756 -0.350215 0.493333 -3.401885
3.366667 -0.743253 1.109495 -0.215896 -0.350690 0.494072 -3.310685
3.400000 -0.754966 1.126009 -0.319730 -0.351072 0.494640 -3.204391
3.433333 -0.766695 1.142546 -0.426415 -0.351361 0.495037 -3.091065
3.466667 -0.778435 1.159096 -0.542032 -0.351554 0.495265 -2.977204
3.500000 -0.790186 1.175654 -0.640006 -0.351646 0.495319 -2.863576
3.533333 -0.801927 1.192204 -0.725923 -0.351636 0.495202 -2.753540
3.566667 -0.813671 1.208747 -0.796434 -0.351520 0.494911 -2.648454
3.600000 -0.825413 1.225277 -0.870103 -0.351293 0.494447 -2.549208
3.633333 -0.837151 1.241788 -0.947035 -0.350954 0.493809 -2.455672
3.666667 -0.848868 1.258275 -1.045520 -0.350500 0.492998 -2.366743
3.700000 -0.860573 1.274731 -1.138573 -0.349930 0.492015 -2.279084
3.733333 -0.872251 1.291154 -1.207800 -0.349244 0.490865 -2.191246
3.766667 -0.883908 1.307533 -1.275277 -0.348440 0.489554 -2.099785
3.800000 -0.895531 1.323872 -1.342060 -0.347519 0.488089 -1.997680
3.833333 -0.907124 1.340155 -1.414689 -0.346481 0.486475 -1.876399
3.866667 -0.918684 1.356374 -1.477088 -0.345326 0.484723 -1.729248
3.900000 -0.930205 1.372525 -1.529116 -0.344055 0.482842 -1.553862
3.933333 -0.941678 1.388621 -1.590076 -0.342667 0.480838 -1.341455
3.966667 -0.953104 1.404635 -1.643174 -0.341166 0.478718 -1.083378
4.000000 -0.964475 1.420562 -1.698672 -0.339553 0.476490 -0.775234
4.033333 -0.975791 1.436423 -1.723643 -0.337827 0.474161 -0.421583
4.066667 -0.987047 1.452213 -1.752209 -0.335992 0.471729 -0.023533
4.100000 -0.998241 1.467928 -1.774491 -0.334050 0.469196 0.416467
4.133333 -1.009370 1.483566 -1.766212 -0.332000 0.466552 0.885738
4.166667 -1.020420 1.499081 -1.727997 -0.329842 0.463792 1.363263
4.200000 -1.031398 1.514511 -1.672908 -0.327577 0.460904 1.829722
4.233333 -1.042301 1.529853 -1.585764 -0.325205 0.457886 2.275882
4.266667 -1.053127 1.545102 -1.483477 -0.322729 0.454735 2.687005
4.300000 -1.063873 1.560256 -1.360869 -0.320151 0.451453 3.045655
4.333333 -1.074535 1.575311 -1.226209 -0.317471 0.448043 3.339889
4.366667 -1.085089 1.590201 -1.108037 -0.314689 0.444505 3.572853
4.400000 -1.095554 1.604985 -0.957897 -0.311800 0.440832 3.741076
4.433333 -1.105927 1.619661 -0.799332 -0.308796 0.437012 3.836321
4.466667 -1.116178 1.634151 -0.657349 -0.305672 0.433039 3.851435
4.500000 -1.126331 1.648526 -0.565120 -0.302419 0.428900 3.791791
4.533333 -1.136383 1.662783 -0.436633 -0.299028 0.424584 3.661885
4.566667 -1.146332 1.676917 -0.284817 -0.295489 0.420081 3.456057
4.600000 -1.156176 1.690928 -0.119489 -0.291796 0.415386 3.178256
4.633333 -1.165911 1.704810 0.016420 -0.287942 0.410496 2.837513
4.666667 -1.175492 1.718478 0.111923 -0.283914 0.405396 2.449821
4.700000 -1.184915 1.731928 0.200179 -0.279706 0.400087 2.020130
4.733333 -1.194173 1.745156 0.265304 -0.275318 0.394577 1.561726
4.766667 -1.203314 1.758246 0.311222 -0.270756 0.388884 1.094105
4.800000 -1.212333 1.771195 0.314733 -0.266035 0.383037 0.641133
4.833333 -1.221174 1.783916 0.317204 -0.261166 0.377061 0.223080
4.866667 -1.229832 1.796408 0.287630 -0.256176 0.370998 -0.147166
4.900000 -1.238300 1.808669 0.257673 -0.251085 0.364879 -0.454106
4.933333 -1.246577 1.820700 0.226960 -0.245922 0.358735 -0.691560
4.966667 -1.254722 1.832578 0.181271 -0.240708 0.352591 -0.857769
5.000000 -1.262667 1.844224 0.128714 -0.235461 0.346465 -0.964185
5.033333 -1.270409 1.855638 0.083551 -0.230206 0.340378 -1.024082
5.066667 -1.277944 1.866819 0.031143 -0.224957 0.334342 -1.046440
5.100000 -1.285342 1.877842 -0.022615 -0.219722 0.328360 -1.041378
5.133333 -1.292601 1.888705 -0.039787 -0.214493 0.322418 -1.019260
5.166667 -1.299648 1.899334 -0.044617 -0.209260 0.316501 -0.993743
5.200000 -1.306554 1.909802 -0.077186 -0.204017 0.310594 -0.971005
5.233333 -1.313248 1.920035 -0.098240 -0.198745 0.304675 -0.954839
5.266667 -1.319798 1.930105 -0.131788 -0.193430 0.298723 -0.950265
5.300000 -1.326204 1.940010 -0.173949 -0.188063 0.292728 -0.959074
5.333333 -1.332399 1.949683 -0.209268 -0.182655 0.286697 -0.977733
5.366667 -1.338449 1.959190 -0.246710 -0.177211 0.280637 -0.998245
5.400000 -1.344288 1.968465 -0.264814 -0.171741 0.274555 -1.026484
5.433333 -1.349917 1.977510 -0.288776 -0.166251 0.268458 -1.074100
5.466667 -1.355337 1.986325 -0.318441 -0.160765 0.262371 -1.157452
5.500000 -1.360548 1.994912 -0.380437 -0.155304 0.256316 -1.293351
5.533333 -1.365612 2.003330 -0.431977 -0.149880 0.250306 -1.500121
5.566667 -1.370526 2.011580 -0.475810 -0.144505 0.244352 -1.793452
5.600000 -1.375234 2.019604 -0.497978 -0.139190 0.238468 -2.166082
5.633333 -1.379792 2.027460 -0.510959 -0.133937 0.232658 -2.604704
5.666667 -1.384145 2.035093 -0.526030 -0.128732 0.226911 -3.091329
5.700000 -1.388350 2.042557 -0.585360 -0.123552 0.221209 -3.610729
5.733333 -1.392349 2.049802 -0.729146 -0.118385 0.215542 -4.141471
5.766667 -1.396200 2.056878 -0.946173 -0.113214 0.209899 -4.658482
5.800000 -1.399903 2.063787 -1.183703 -0.108022 0.204266 -5.147859
5.833333 -1.403458 2.070530 -1.418862 -0.102803 0.198640 -5.586923
5.866667 -1.406809 2.077059 -1.637298 -0.097558 0.193020 -5.953342
5.900000 -1.410014 2.083423 -1.856015 -0.092294 0.187410 -6.228870
5.933333 -1.413017 2.089580 -2.023439 -0.087016 0.181809 -6.412352
5.966667 -1.415820 2.095533 -2.240101 -0.081744 0.176227 -6.508750
6.000000 -1.418426 2.101286 -2.466378 -0.076498 0.170673 -6.523650
6.033333 -1.420886 2.106876 -2.718518 -0.071298 0.165160 -6.474764
6.066667 -1.423152 2.112273 -2.959114 -0.066163 0.159697 -6.378126
6.100000 -1.425222 2.117482 3.080006 -0.061114 0.154300 -6.239485
6.133333 -1.427152 2.122532 2.844516 -0.056163 0.148974 -6.051747
6.166667 -1.428909 2.127387 2.667194 -0.051310 0.143721 -5.816325
6.200000 -1.430497 2.132053 2.502182 -0.046551 0.138541 -5.535841
6.233333 -1.431947 2.136562 2.289977 -0.041881 0.133433 -5.205005
6.266667 -1.433261 2.140916 2.109688 -0.037293 0.128398 -4.822062
6.300000 -1.434440 2.145117 1.954274 -0.032769 0.123429 -4.391653
6.333333 -1.435457 2.149142 1.810312 -0.028302 0.118529 -3.920285
6.366667 -1.436315 2.152996 1.664988 -0.023889 0.113701 -3.404562
6.400000 -1.437018 2.156681 1.550027 -0.019528 0.108949 -2.838631
6.433333 -1.437592 2.160219 1.442820 -0.015218 0.104275 -2.226180
6.466667 -1.438017 2.163597 1.363523 -0.010964 0.099684 -1.579667
6.500000 -1.438295 2.166820 1.318787 -0.006779 0.095186 -0.901729
6.533333 -1.438432 2.169892 1.284910 -0.002675 0.090787 -0.205923
6.566667 -1.438429 2.172818 1.291960 0.001341 0.086490 0.495370
6.600000 -1.438291 2.175602 1.330599 0.005260 0.082298 1.191349
6.633333 -1.438021 2.178249 1.386692 0.009070 0.078216 1.870517
6.666667 -1.437624 2.180764 1.489882 0.012767 0.074244 2.539375
6.700000 -1.437112 2.183146 1.589245 0.016346 0.070380 3.190638
6.733333 -1.436481 2.185405 1.724484 0.019808 0.066624 3.831925
6.766667 -1.435736 2.187547 1.904698 0.023151 0.062974 4.464283
