t x y theta dxdt dydt dthetadt
0.000000 0.000000 0.000000 0.231659 0.140580 0.024826 1.952299
0.033333 0.005056 0.000992 0.249194 0.133408 0.022395 2.648273
0.066667 0.009758 0.001899 0.261510 0.125090 0.019433 3.446574
0.100000 0.014399 0.002790 0.327197 0.115862 0.015968 4.300400
0.133333 0.018398 0.003454 0.459522 0.105919 0.011963 5.156935
0.166667 0.021586 0.003803 0.647964 0.095491 0.007402 5.958714
0.200000 0.023897 0.003741 0.960844 0.084815 0.002288 6.639414
0.233333 0.026137 0.003662 1.323205 0.074094 -0.003252 7.137505
0.266667 0.028302 0.003565 1.648323 0.063340 -0.009119 7.404924
0.300000 0.030393 0.003452 1.978676 0.052511 -0.015192 7.419570
0.333333 0.032406 0.003322 2.308898 0.041563 -0.021193 7.183655
0.366667 0.033452 0.002324 2.632784 0.030368 -0.026793 6.713515
0.400000 0.034420 0.001310 2.928976 0.018670 -0.031734 6.055846
0.433333 0.035309 0.000283 3.135163 0.006299 -0.035855 5.272073
0.466667 0.035255 -0.001765 -3.038128 -0.006699 -0.038911 4.426667
0.500000 0.035122 -0.003824 -2.942816 -0.020168 -0.040701 3.576449
0.533333 0.034911 -0.005891 -2.897099 -0.033888 -0.041146 2.769041
0.566667 0.033749 -0.007771 -2.852586 -0.047556 -0.040319 2.044687
0.600000 0.031748 -0.009432 -2.836369 -0.060715 -0.038237 1.429220
0.633333 0.029032 -0.010819 -2.831752 -0.072923 -0.034925 0.929570
0.666667 0.025700 -0.011893 -2.828003 -0.083886 -0.030658 0.542019
0.700000 0.021880 -0.012625 -2.828052 -0.093330 -0.025715 0.255924
0.733333 0.017999 -0.013355 -2.831301 -0.101027 -0.020353 0.053627
0.766667 0.014061 -0.014083 -2.830091 -0.106835 -0.014730 -0.074955
0.800000 0.009967 -0.014380 -2.848192 -0.110789 -0.009089 -0.130119
0.833333 0.005827 -0.014674 -2.863017 -0.112973 -0.003587 -0.093374
0.866667 0.001644 -0.014965 -2.876344 -0.113499 0.001794 0.067384
0.900000 -0.002324 -0.014771 -2.903633 -0.112574 0.007087 0.397227
0.933333 -0.005985 -0.014069 -2.909166 -0.110375 0.012305 0.937956
0.966667 -0.009673 -0.013365 -2.913474 -0.107057 0.017414 1.702717
1.000000 -0.013385 -0.012659 -2.901441 -0.102642 0.022481 2.677783
1.033333 -0.017116 -0.011953 -2.923725 -0.097163 0.027476 3.298365
1.066667 -0.020862 -0.011248 -2.930510 -0.090609 0.032343 3.499669
1.100000 -0.023845 -0.010012 -2.869952 -0.082898 0.037029 3.191458
1.133333 -0.026835 -0.008778 -2.635682 -0.074008 0.041524 2.276256
1.166667 -0.029091 -0.007055 -2.241484 -0.063981 0.045781 0.678148
1.200000 -0.031348 -0.005339 -1.724994 -0.052910 0.049681 -1.158326
1.233333 -0.033604 -0.003632 -1.145760 -0.040894 0.053116 -2.258068
1.266667 -0.035153 -0.001671 -0.597711 -0.028091 0.055954 -2.675743
1.300000 -0.035978 0.000456 -0.253765 -0.014689 0.058067 -2.430485
1.333333 -0.036092 0.002687 0.120036 -0.000859 0.059263 -1.510774
1.366667 -0.035481 0.004965 0.430451 0.013235 0.059462 0.121599
1.400000 -0.034866 0.007222 0.697460 0.027377 0.058626 1.497308
1.433333 -0.033521 0.009433 0.910484 0.041239 0.056768 2.196090
1.466667 -0.032173 0.011617 1.085728 0.054609 0.053913 2.322441
1.500000 -0.030139 0.013657 1.206115 0.067239 0.050143 1.950676
1.533333 -0.027431 0.015480 1.245045 0.078821 0.045618 1.146305
1.566667 -0.024079 0.016996 1.215479 0.089062 0.040446 -0.050480
1.600000 -0.020737 0.018476 1.125313 0.097665 0.034695 -1.105042
1.633333 -0.016851 0.019509 0.938057 0.104462 0.028442 -2.026404
1.666667 -0.012463 0.020076 0.778465 0.109197 0.021853 -2.831970
1.700000 -0.008097 0.020602 0.651516 0.111631 0.015011 -3.528248
1.733333 -0.003760 0.021086 0.536083 0.111696 0.007992 -4.136533
1.766667 0.000544 0.021526 0.438854 0.109473 0.000882 -4.685021
1.800000 0.004750 0.021460 0.317826 0.105084 -0.006146 -5.187438
1.833333 0.008911 0.021350 0.115113 0.098601 -0.012996 -5.645681
1.866667 0.012598 0.020788 -0.067600 0.090135 -0.019657 -6.048617
1.900000 0.015639 0.019805 -0.215760 0.079885 -0.026053 -6.383970
1.933333 0.017895 0.018441 -0.460818 0.068022 -0.032102 -6.626576
1.966667 0.020090 0.017034 -0.768027 0.054615 -0.037727 -6.742304
2.000000 0.022221 0.015585 -1.090824 0.039792 -0.042947 -6.705841
2.033333 0.023264 0.013904 -1.410845 0.023850 -0.047719 -6.509256
2.066667 0.024238 0.012183 -1.691725 0.007108 -0.052026 -6.162199
2.100000 0.025142 0.010423 -1.927128 -0.010150 -0.055906 -5.676456
2.133333 0.024919 0.008505 -2.140204 -0.027684 -0.059453 -5.080170
2.166667 0.023600 0.006439 -2.295326 -0.045168 -0.062749 -4.413704
2.200000 0.021242 0.004236 -2.374605 -0.062183 -0.065824 -3.723865
2.233333 0.017907 0.001887 -2.438486 -0.078409 -0.068725 -3.051399
2.266667 0.014505 -0.000492 -2.490822 -0.093516 -0.071459 -2.424122
2.300000 0.011038 -0.002900 -2.546213 -0.107178 -0.074006 -1.865008
2.333333 0.006927 -0.005431 -2.594457 -0.119086 -0.076315 -1.389136
2.366667 0.002287 -0.008077 -2.604177 -0.129036 -0.078334 -0.998578
2.400000 -0.002766 -0.010832 -2.630784 -0.136971 -0.080016 -0.679168
2.433333 -0.007867 -0.013606 -2.645992 -0.142944 -0.081327 -0.418097
2.466667 -0.013169 -0.016453 -2.645885 -0.146983 -0.082213 -0.207103
2.500000 -0.018508 -0.019315 -2.643549 -0.149117 -0.082615 -0.042829
2.533333 -0.023881 -0.022190 -2.643371 -0.149455 -0.082497 0.083713
2.566667 -0.029283 -0.025075 -2.623192 -0.148121 -0.081835 0.178855
2.600000 -0.034708 -0.027968 -2.604189 -0.145290 -0.080635 0.238445
2.633333 -0.039908 -0.030803 -2.579183 -0.141083 -0.078903 0.264723
2.666667 -0.044810 -0.033547 -2.574711 -0.135759 -0.076699 0.265592
2.700000 -0.049382 -0.036171 -2.546211 -0.129642 -0.074116 0.248606
2.733333 -0.053550 -0.038631 -2.518458 -0.123014 -0.071246 0.215713
2.766667 -0.057719 -0.041087 -2.522144 -0.116158 -0.068199 0.171801
2.800000 -0.061373 -0.043302 -2.534487 -0.109318 -0.065073 0.124118
2.833333 -0.064544 -0.045273 -2.551254 -0.102736 -0.061974 0.081388
2.866667 -0.067707 -0.047235 -2.550988 -0.096527 -0.058959 0.043615
2.900000 -0.070453 -0.048971 -2.535837 -0.090799 -0.056090 0.012828
2.933333 -0.073187 -0.050696 -2.537384 -0.085574 -0.053392 -0.006190
2.966667 -0.075907 -0.052409 -2.546540 -0.080840 -0.050872 -0.016847
3.000000 -0.078610 -0.054109 -2.543443 -0.076540 -0.048522 -0.018041
3.033333 -0.080982 -0.055641 -2.542924 -0.072581 -0.046309 -0.017705
