t x y theta dxdt dydt dthetadt
0.000000 0.000000 0.000000 -0.040512 -0.004377 0.015386 -0.006645
0.033333 -0.000327 0.000800 -0.037572 -0.006016 0.019049 -0.007414
0.066667 -0.000566 0.001463 -0.036467 -0.008332 0.023745 -0.006830
0.100000 -0.000754 0.002044 -0.037872 -0.011522 0.029712 -0.005287
0.133333 -0.000809 0.002668 -0.039989 -0.015786 0.037179 -0.001843
0.166667 -0.000919 0.003315 -0.046912 -0.021426 0.046516 0.004080
0.200000 -0.001078 0.004066 -0.042015 -0.028814 0.058218 0.012286
0.233333 -0.001604 0.005436 -0.040079 -0.038249 0.072659 0.025558
0.266667 -0.002506 0.007445 -0.037569 -0.049904 0.090060 0.045284
0.300000 -0.003795 0.010110 -0.040094 -0.063919 0.110604 0.074320
0.333333 -0.005500 0.013301 -0.044169 -0.080445 0.134503 0.113741
0.366667 -0.007703 0.017255 -0.038771 -0.099433 0.161697 0.164729
0.400000 -0.010754 0.022284 -0.034732 -0.120680 0.191895 0.229940
0.433333 -0.014813 0.028635 -0.028449 -0.144098 0.224910 0.306262
0.466667 -0.019305 0.035731 -0.020419 -0.169790 0.260720 0.392704
0.500000 -0.025080 0.044624 -0.020336 -0.197676 0.299101 0.485956
0.533333 -0.032380 0.055483 -0.015754 -0.227450 0.339528 0.584223
0.566667 -0.040132 0.067128 0.022905 -0.259076 0.381720 0.685400
0.600000 -0.048342 0.079574 0.049879 -0.292644 0.425493 0.784733
0.633333 -0.058154 0.094144 0.090212 -0.328007 0.470468 0.879357
0.666667 -0.069499 0.110820 0.120384 -0.364823 0.516094 0.967459
0.700000 -0.081310 0.128326 0.153983 -0.402984 0.562102 1.046327
0.733333 -0.094975 0.147876 0.192114 -0.442534 0.608437 1.111031
0.766667 -0.110538 0.169355 0.232058 -0.483251 0.654901 1.158141
0.800000 -0.128078 0.192722 0.274179 -0.524522 0.701080 1.187736
0.833333 -0.146077 0.216942 0.312579 -0.565994 0.746821 1.200817
0.866667 -0.164532 0.242016 0.353965 -0.607318 0.792058 1.194912
0.900000 -0.185405 0.269147 0.416745 -0.647911 0.836536 1.168456
0.933333 -0.208791 0.298305 0.455181 -0.687284 0.880136 1.123985
0.966667 -0.232610 0.328319 0.491741 -0.725069 0.922841 1.064767
1.000000 -0.258647 0.360485 0.543870 -0.761173 0.964799 0.987588
1.033333 -0.285093 0.393502 0.578694 -0.795467 1.006151 0.893740
1.066667 -0.311936 0.427364 0.597033 -0.827988 1.047200 0.785307
1.100000 -0.341486 0.463853 0.615855 -0.858911 1.088298 0.667288
1.133333 -0.371404 0.501177 0.647757 -0.888446 1.129785 0.539824
1.166667 -0.401673 0.539328 0.656962 -0.916673 1.171824 0.402512
1.200000 -0.432278 0.578297 0.678509 -0.943844 1.214705 0.263883
1.233333 -0.463202 0.618076 0.686630 -0.970106 1.258506 0.127505
1.266667 -0.495921 0.660206 0.679135 -0.995266 1.302865 -0.001298
1.300000 -0.530174 0.704561 0.688524 -1.019255 1.347495 -0.117685
1.333333 -0.564691 0.749693 0.670187 -1.041844 1.391834 -0.214437
1.366667 -0.600099 0.796844 0.665921 -1.062777 1.435464 -0.287430
1.400000 -0.637008 0.846614 0.647597 -1.081418 1.477813 -0.338125
1.433333 -0.674115 0.897114 0.615893 -1.096972 1.518511 -0.368528
1.466667 -0.712057 0.950177 0.577399 -1.108652 1.557524 -0.383674
1.500000 -0.750151 1.003931 0.548565 -1.115691 1.594911 -0.392017
1.533333 -0.788374 1.058353 0.541748 -1.117380 1.630886 -0.403045
1.566667 -0.826700 1.113423 0.543716 -1.112893 1.665641 -0.426970
1.600000 -0.865107 1.169117 0.546620 -1.101526 1.699483 -0.470697
1.633333 -0.903571 1.225413 0.567719 -1.082675 1.732540 -0.541607
1.666667 -0.942068 1.282288 0.541128 -1.056322 1.764968 -0.639582
1.700000 -0.979631 1.341305 0.537441 -1.022247 1.796773 -0.763021
1.733333 -1.015638 1.402153 0.515350 -0.980266 1.827954 -0.905614
1.766667 -1.049066 1.464648 0.486329 -0.931055 1.858380 -1.056964
1.800000 -1.078876 1.528533 0.444900 -0.876152 1.887861 -1.208883
1.833333 -1.108617 1.592860 0.388549 -0.817556 1.916280 -1.347156
1.866667 -1.138275 1.657600 0.321757 -0.757185 1.943601 -1.467077
1.900000 -1.163170 1.723102 0.240402 -0.697557 1.969817 -1.556409
1.933333 -1.183725 1.789181 0.181261 -0.641496 1.994916 -1.608937
1.966667 -1.200161 1.855717 0.125303 -0.591340 2.019099 -1.616974
2.000000 -1.216487 1.922537 0.083871 -0.548762 2.042617 -1.574461
2.033333 -1.230518 1.990833 0.032646 -0.515271 2.065629 -1.484082
2.066667 -1.243174 2.060567 -0.025423 -0.491934 2.087880 -1.344762
2.100000 -1.255727 2.130483 -0.096903 -0.478928 2.109148 -1.164518
2.133333 -1.269172 2.201783 -0.160407 -0.476051 2.129146 -0.948114
2.166667 -1.282521 2.273192 -0.202951 -0.482637 2.147519 -0.707840
2.200000 -1.299005 2.346562 -0.240041 -0.497550 2.163581 -0.454149
2.233333 -1.315394 2.419965 -0.242108 -0.519560 2.176810 -0.193709
2.266667 -1.331689 2.493364 -0.238648 -0.547796 2.187061 0.063806
2.300000 -1.347888 2.566719 -0.203944 -0.582060 2.194149 0.307222
2.333333 -1.369387 2.640985 -0.154790 -0.621410 2.197984 0.525754
2.366667 -1.390783 2.715128 -0.133540 -0.665472 2.198420 0.715585
2.400000 -1.412071 2.789109 -0.104480 -0.714394 2.195711 0.872238
2.433333 -1.433243 2.862887 -0.066022 -0.767940 2.190102 0.998026
2.466667 -1.459123 2.936505 -0.025553 -0.825105 2.181608 1.096817
2.500000 -1.484869 3.009842 0.008237 -0.884399 2.170143 1.182144
2.533333 -1.514429 3.082482 0.048951 -0.945283 2.155571 1.263670
2.566667 -1.547193 3.154232 0.098003 -1.006552 2.137798 1.347748
2.600000 -1.583461 3.225745 0.129937 -1.066349 2.116653 1.444972
2.633333 -1.623030 3.296713 0.171131 -1.122763 2.091788 1.553241
2.666667 -1.662364 3.367208 0.236226 -1.174575 2.062925 1.672933
2.700000 -1.704290 3.436629 0.273669 -1.220420 2.030075 1.792660
2.733333 -1.748340 3.504768 0.314031 -1.258506 1.993282 1.901395
2.766667 -1.792063 3.572327 0.410011 -1.287668 1.952657 1.983615
2.800000 -1.837202 3.638111 0.466707 -1.307420 1.908382 2.018357
2.833333 -1.883174 3.701759 0.565941 -1.317395 1.860813 1.990592
2.866667 -1.929524 3.762933 0.650508 -1.317173 1.810662 1.890062
2.900000 -1.976471 3.822173 0.731871 -1.306830 1.758528 1.713152
2.933333 -2.022912 3.880676 0.835712 -1.286663 1.704879 1.462126
2.966667 -2.068276 3.936681 0.915623 -1.256829 1.650272 1.153430
3.000000 -2.111526 3.990064 0.989241 -1.216978 1.594868 0.807345
3.033333 -2.154161 4.042635 1.014413 -1.166925 1.538532 0.453349
3.066667 -2.192434 4.092115 0.994242 -1.106816 1.480865 0.115964
3.100000 -2.230028 4.140743 0.952344 -1.036745 1.421314 -0.174538
3.133333 -2.266910 4.188501 0.890009 -0.956774 1.359401 -0.390817
3.166667 -2.297533 4.232730 0.828809 -0.867348 1.294584 -0.512065
3.200000 -2.327395 4.276055 0.791099 -0.769791 1.226799 -0.525245
3.233333 -2.356471 4.318464 0.739101 -0.666135 1.156600 -0.431441
3.266667 -2.378107 4.356743 0.705181 -0.557794 1.084478 -0.233053
3.300000 -2.398924 4.394081 0.674383 -0.445662 1.010975 0.052041
3.333333 -2.411282 4.426352 0.681394 -0.331997 0.937373 0.400744
3.366667 -2.415222 4.453420 0.700740 -0.218813 0.865015 0.779407
3.400000 -2.418330 4.479536 0.721732 -0.107310 0.795043 1.157770
3.433333 -2.420611 4.504702 0.788652 0.002200 0.728212 1.507300
3.466667 -2.414414 4.524950 0.839409 0.108576 0.665469 1.793633
3.500000 -2.407411 4.544259 0.944374 0.209814 0.607861 1.988847
3.533333 -2.399617 4.562636 1.048924 0.305821 0.555411 2.070243
3.566667 -2.391047 4.580092 1.132696 0.397241 0.507516 2.030724
3.600000 -2.375802 4.595381 1.274563 0.483611 0.463686 1.865162
3.633333 -2.354604 4.609138 1.380253 0.563379 0.423401 1.579429
3.666667 -2.332698 4.622006 1.474024 0.636215 0.385638 1.190316
3.700000 -2.310114 4.633996 1.532644 0.702234 0.349318 0.727031
3.733333 -2.283171 4.645043 1.541617 0.760304 0.313640 0.227482
3.766667 -2.252629 4.654869 1.543519 0.808245 0.278429 -0.277076
3.800000 -2.221511 4.663859 1.492332 0.845188 0.243296 -0.746291
3.833333 -2.189856 4.672029 1.426365 0.871371 0.208046 -1.145468
3.866667 -2.157702 4.679396 1.318975 0.886068 0.172931 -1.443141
3.900000 -2.125996 4.684378 1.229953 0.888640 0.138336 -1.621289
3.933333 -2.093869 4.688590 1.143999 0.879372 0.104923 -1.679846
3.966667 -2.063292 4.690383 1.054340 0.859463 0.073503 -1.622847
4.000000 -2.032368 4.691447 0.969922 0.829632 0.044985 -1.470280
4.033333 -2.001133 4.691803 0.900694 0.790447 0.020223 -1.247754
4.066667 -1.973323 4.690607 0.853928 0.743475 -0.000092 -0.986755
4.100000 -1.949166 4.688470 0.846012 0.690464 -0.015513 -0.719388
4.133333 -1.924796 4.685696 0.835440 0.633124 -0.025884 -0.465792
4.166667 -1.904326 4.682961 0.860130 0.573271 -0.031689 -0.244973
4.200000 -1.887777 4.680990 0.875901 0.513043 -0.033462 -0.066581
4.233333 -1.871085 4.678450 0.918344 0.454729 -0.031907 0.062922
4.266667 -1.858177 4.677155 0.933682 0.399992 -0.027863 0.143765
4.300000 -1.849107 4.677205 0.948720 0.350250 -0.022184 0.185021
4.333333 -1.839935 4.676748 0.933529 0.306744 -0.015699 0.192332
4.366667 -1.833634 4.677476 0.933652 0.270105 -0.008972 0.174392
4.400000 -1.827248 4.677731 0.933549 0.240289 -0.002443 0.139972
4.433333 -1.820784 4.677530 0.931155 0.217000 0.003468 0.099848
4.466667 -1.815215 4.677872 0.937244 0.199658 0.008532 0.061717
4.500000 -1.809578 4.677791 0.953077 0.187309 0.012777 0.027264
4.533333 -1.804129 4.678136 0.950890 0.178946 0.016158 -0.001845
4.566667 -1.798646 4.678796 0.963823 0.173408 0.018800 -0.025187
4.600000 -1.793026 4.679683 0.952065 0.169902 0.020659 -0.042512
4.633333 -1.787312 4.680870 0.955582 0.167635 0.021732 -0.055028
4.666667 -1.781633 4.682214 0.940111 0.166000 0.022077 -0.063264
4.700000 -1.775914 4.683217 0.922163 0.164774 0.021588 -0.064420
4.733333 -1.770514 4.684337 0.922149 0.163721 0.020340 -0.059930
4.766667 -1.765083 4.685140 0.920716 0.162840 0.018417 -0.047899
4.800000 -1.759622 4.685637 0.918296 0.162108 0.016060 -0.031818
4.833333 -1.754455 4.686228 0.925796 0.161522 0.013539 -0.015009
4.866667 -1.749265 4.686536 0.926381 0.161115 0.011071 0.001594
4.900000 -1.744057 4.686572 0.917101 0.160896 0.008906 0.012806
4.933333 -1.738833 4.686348 0.926482 0.160822 0.007241 0.020770
4.966667 -1.733476 4.686320 0.946932 0.160852 0.006121 0.020965
5.000000 -1.728014 4.686482 0.935191 0.160940 0.005484 0.016698
5.033333 -1.722544 4.686415 0.945710 0.160994 0.005282 0.008492
5.066667 -1.717026 4.686569 0.934286 0.160961 0.005407 -0.004225
5.100000 -1.711563 4.686840 0.929262 0.160787 0.005746 -0.017882
5.133333 -1.706169 4.687157 0.927123 0.160461 0.006152 -0.031854
5.166667 -1.700748 4.687552 0.927679 0.159967 0.006585 -0.040041
5.200000 -1.695462 4.687945 0.933014 0.159316 0.007049 -0.045218
5.233333 -1.690184 4.688163 0.926786 0.158531 0.007504 -0.042703
5.266667 -1.684976 4.688410 0.936283 0.157628 0.007957 -0.033519
5.300000 -1.679779 4.688498 0.917525 0.156609 0.008462 -0.019983
5.333333 -1.674610 4.688642 0.924881 0.155479 0.009097 -0.005913
5.366667 -1.669373 4.688828 0.910848 0.154259 0.009896 0.005782
5.400000 -1.664085 4.689047 0.898350 0.152923 0.010906 0.018996
5.433333 -1.658876 4.689387 0.913803 0.151454 0.012197 0.027506
5.466667 -1.653777 4.689858 0.930809 0.149818 0.013845 0.032224
5.500000 -1.648877 4.690538 0.929733 0.148022 0.015820 0.032860
