t x y theta dxdt dydt dthetadt
0.000000 0.000000 0.000000 -1.851096 -0.130831 0.076435 -0.011569
0.033333 -0.004402 0.002569 -1.855252 -0.133427 0.077739 -0.009065
0.066667 -0.008887 0.005180 -1.851052 -0.136030 0.079040 -0.007264
0.100000 -0.013464 0.007837 -1.857324 -0.138641 0.080341 -0.006206
0.133333 -0.018134 0.010542 -1.854248 -0.141260 0.081641 -0.005198
0.166667 -0.022889 0.013288 -1.862355 -0.143888 0.082941 -0.003697
0.200000 -0.027727 0.016074 -1.858305 -0.146527 0.084243 -0.001676
0.233333 -0.032649 0.018901 -1.851444 -0.149178 0.085546 -0.000402
0.266667 -0.037655 0.021768 -1.858342 -0.151839 0.086851 0.002409
0.300000 -0.042757 0.024684 -1.855023 -0.154510 0.088157 0.004997
0.333333 -0.047943 0.027640 -1.852504 -0.157194 0.089466 0.007605
0.366667 -0.053227 0.030645 -1.854467 -0.159892 0.090778 0.007434
0.400000 -0.058610 0.033699 -1.860083 -0.162603 0.092093 0.006079
0.433333 -0.064076 0.036792 -1.854930 -0.165326 0.093412 0.004781
0.466667 -0.069626 0.039925 -1.852990 -0.168064 0.094734 0.002583
0.500000 -0.075276 0.043107 -1.852248 -0.170817 0.096060 0.000178
0.533333 -0.081009 0.046329 -1.850600 -0.173581 0.097388 -0.003113
0.566667 -0.086826 0.049588 -1.852693 -0.176357 0.098718 -0.004105
0.600000 -0.092744 0.052898 -1.857172 -0.179149 0.100054 -0.005461
0.633333 -0.098763 0.056258 -1.852970 -0.181960 0.101395 -0.006952
0.666667 -0.104885 0.059667 -1.851964 -0.184787 0.102742 -0.009198
0.700000 -0.111090 0.063114 -1.862633 -0.187627 0.104091 -0.010977
0.733333 -0.117375 0.066597 -1.857467 -0.190481 0.105444 -0.013350
0.766667 -0.123765 0.070131 -1.857537 -0.193344 0.106799 -0.019921
0.800000 -0.130257 0.073715 -1.852415 -0.196210 0.108149 -0.032042
0.833333 -0.136854 0.077348 -1.853027 -0.199072 0.109493 -0.056902
0.866667 -0.143530 0.081017 -1.861407 -0.201930 0.110829 -0.107679
0.900000 -0.150310 0.084736 -1.851543 -0.204784 0.112157 -0.200443
0.933333 -0.157195 0.088504 -1.864010 -0.207629 0.113476 -0.347840
0.966667 -0.164184 0.092322 -1.858555 -0.210460 0.114781 -0.559118
1.000000 -0.171250 0.096174 -1.861043 -0.213276 0.116071 -0.845370
1.033333 -0.178393 0.100058 -1.860642 -0.216073 0.117346 -1.215295
1.066667 -0.185641 0.103991 -1.886756 -0.218839 0.118597 -1.661797
1.100000 -0.192993 0.107973 -1.897433 -0.221568 0.119822 -2.173501
1.133333 -0.200420 0.111986 -1.935317 -0.224254 0.121018 -2.730508
1.166667 -0.207951 0.116047 -2.014461 -0.226894 0.122184 -3.320433
1.200000 -0.215587 0.120157 -2.191140 -0.229484 0.123319 -3.913391
1.233333 -0.223293 0.124295 -2.350623 -0.232020 0.124421 -4.470565
1.266667 -0.231105 0.128481 -2.567377 -0.234507 0.125494 -4.953706
1.300000 -0.238985 0.132694 -2.706080 -0.236945 0.126539 -5.335174
1.333333 -0.246933 0.136933 -2.919681 -0.239339 0.127558 -5.596787
1.366667 -0.254947 0.141199 3.101170 -0.241691 0.128553 -5.710602
1.400000 -0.263027 0.145490 2.827126 -0.244013 0.129528 -5.668513
1.433333 -0.271205 0.149829 2.603182 -0.246308 0.130485 -5.475187
1.466667 -0.279447 0.154191 2.426773 -0.248584 0.131427 -5.153069
1.500000 -0.287783 0.158598 2.218564 -0.250845 0.132353 -4.706746
1.533333 -0.296180 0.163026 2.021278 -0.253096 0.133263 -4.147154
1.566667 -0.304669 0.167495 1.880654 -0.255337 0.134154 -3.503991
1.600000 -0.313215 0.171984 1.795335 -0.257560 0.135020 -2.812670
1.633333 -0.321850 0.176511 1.731120 -0.259765 0.135859 -2.105524
1.666667 -0.330540 0.181055 1.662930 -0.261945 0.136665 -1.407216
1.700000 -0.339314 0.185633 1.621965 -0.264099 0.137437 -0.761540
1.733333 -0.348170 0.190241 1.615061 -0.266218 0.138170 -0.208836
1.766667 -0.357076 0.194864 1.635594 -0.268297 0.138864 0.231776
1.800000 -0.366060 0.199513 1.700632 -0.270332 0.139516 0.552211
1.833333 -0.375118 0.204185 1.799622 -0.272316 0.140126 0.747259
1.866667 -0.384249 0.208878 1.900455 -0.274237 0.140690 0.816815
1.900000 -0.393449 0.213591 1.975259 -0.276084 0.141207 0.777745
1.933333 -0.402691 0.218313 2.019856 -0.277848 0.141675 0.659639
1.966667 -0.411998 0.223053 2.037772 -0.279520 0.142092 0.486156
2.000000 -0.421367 0.227808 2.025054 -0.281093 0.142457 0.293087
2.033333 -0.430795 0.232576 1.998475 -0.282559 0.142767 0.121819
2.066667 -0.440279 0.237357 1.958338 -0.283918 0.143024 0.009831
2.100000 -0.449794 0.242142 1.958908 -0.285170 0.143227 -0.022070
2.133333 -0.459339 0.246930 1.919599 -0.286314 0.143377 0.033822
2.166667 -0.468928 0.251724 1.875884 -0.287354 0.143475 0.177900
2.200000 -0.478543 0.256520 1.844924 -0.288291 0.143522 0.389176
2.233333 -0.488181 0.261315 1.843727 -0.289132 0.143521 0.633095
2.266667 -0.497853 0.266108 1.878783 -0.289880 0.143474 0.871301
2.300000 -0.507543 0.270899 1.925280 -0.290542 0.143383 1.077490
2.333333 -0.517262 0.275684 2.003438 -0.291118 0.143250 1.222349
2.366667 -0.526995 0.280465 2.105955 -0.291612 0.143078 1.281799
2.400000 -0.536740 0.285240 2.196521 -0.292026 0.142865 1.244171
2.433333 -0.546497 0.290008 2.280369 -0.292356 0.142613 1.111715
2.466667 -0.556266 0.294765 2.347702 -0.292602 0.142321 0.895432
2.500000 -0.566042 0.299513 2.385809 -0.292760 0.141987 0.607194
2.533333 -0.575823 0.304250 2.389098 -0.292831 0.141611 0.275766
2.566667 -0.585604 0.308972 2.374144 -0.292814 0.141191 -0.067158
2.600000 -0.595385 0.313681 2.342134 -0.292707 0.140726 -0.389583
2.633333 -0.605163 0.318377 2.315521 -0.292512 0.140215 -0.668363
2.666667 -0.614938 0.323058 2.264756 -0.292225 0.139657 -0.880959
2.700000 -0.624696 0.327717 2.213388 -0.291845 0.139046 -1.013881
2.733333 -0.634434 0.332350 2.141551 -0.291369 0.138382 -1.071290
2.766667 -0.644148 0.336956 2.095788 -0.290797 0.137662 -1.065761
2.800000 -0.653849 0.341542 2.030300 -0.290131 0.136886 -1.006614
2.833333 -0.663534 0.346109 1.981365 -0.289370 0.136053 -0.898452
2.866667 -0.673203 0.350655 1.965343 -0.288515 0.135162 -0.759918
2.900000 -0.682831 0.355162 1.941141 -0.287575 0.134219 -0.604202
2.933333 -0.692415 0.359628 1.934016 -0.286554 0.133225 -0.432483
2.966667 -0.701976 0.364070 1.939673 -0.285453 0.132182 -0.234388
3.000000 -0.711484 0.368465 1.960812 -0.284276 0.131091 -0.013308
3.033333 -0.720937 0.372812 1.970348 -0.283027 0.129957 0.218393
3.066667 -0.730361 0.377131 1.938873 -0.281718 0.128786 0.469599
3.100000 -0.739754 0.381422 1.877612 -0.280350 0.127583 0.749402
3.133333 -0.749081 0.385655 1.912444 -0.278926 0.126348 1.049630
3.166667 -0.758373 0.389858 2.002433 -0.277450 0.125087 1.351003
3.200000 -0.767597 0.394001 2.039326 -0.275929 0.123806 1.642112
3.233333 -0.776782 0.398114 2.065683 -0.274363 0.122507 1.921835
3.266667 -0.785927 0.402194 2.144447 -0.272748 0.121189 2.169321
3.300000 -0.795000 0.406213 2.252842 -0.271084 0.119854 2.359861
3.333333 -0.804000 0.410171 2.409032 -0.269372 0.118505 2.485906
3.366667 -0.812955 0.414095 2.515795 -0.267615 0.117147 2.551115
3.400000 -0.821862 0.417983 2.624827 -0.265813 0.115780 2.553762
3.433333 -0.830721 0.421837 2.712915 -0.263961 0.114404 2.489787
3.466667 -0.839501 0.425630 2.781069 -0.262066 0.113023 2.369541
3.500000 -0.848201 0.429364 2.860706 -0.260126 0.111639 2.206174
3.533333 -0.856847 0.433061 2.930444 -0.258142 0.110251 2.014898
3.566667 -0.865439 0.436720 2.998875 -0.256109 0.108855 1.802446
3.600000 -0.873946 0.440321 3.055533 -0.254025 0.107452 1.581886
3.633333 -0.882395 0.443883 3.115557 -0.251890 0.106041 1.362521
3.666667 -0.890754 0.447390 -3.121275 -0.249698 0.104618 1.147889
3.700000 -0.899053 0.450857 -3.094047 -0.247447 0.103181 0.946915
3.733333 -0.907290 0.454284 -3.075083 -0.245133 0.101727 0.760349
3.766667 -0.915432 0.457653 -3.048810 -0.242761 0.100258 0.590496
3.800000 -0.923510 0.460980 -3.041135 -0.240333 0.098774 0.438862
3.833333 -0.931490 0.464250 -3.049817 -0.237855 0.097276 0.310547
3.866667 -0.939404 0.467478 -3.050518 -0.235333 0.095765 0.209360
3.900000 -0.947220 0.470649 -3.049998 -0.232773 0.094245 0.130910
3.933333 -0.954936 0.473764 -3.049532 -0.230181 0.092719 0.073733
3.966667 -0.962555 0.476822 -3.043543 -0.227560 0.091185 0.036720
4.000000 -0.970074 0.479824 -3.053618 -0.224916 0.089648 0.016252
4.033333 -0.977521 0.482782 -3.047530 -0.222254 0.088109 0.005045
4.066667 -0.984895 0.485697 -3.050623 -0.219580 0.086571 -0.000081
4.100000 -0.992196 0.488569 -3.052976 -0.216898 0.085035 -0.000354
4.133333 -0.999397 0.491385 -3.049537 -0.214211 0.083505 0.001096
4.166667 -1.006500 0.494145 -3.043276 -0.211522 0.081980 0.001664
4.200000 -1.013503 0.496849 -3.050648 -0.208828 0.080462 0.000541
4.233333 -1.020408 0.499498 -3.056790 -0.206127 0.078950 0.000269
4.266667 -1.027214 0.502092 -3.047555 -0.203420 0.077445 -0.001022
4.300000 -1.033942 0.504642 -3.044208 -0.200709 0.075949 -0.003162
4.333333 -1.040591 0.507147 -3.050015 -0.197994 0.074463 -0.004928
4.366667 -1.047161 0.509609 -3.047400 -0.195274 0.072987 -0.005373
4.400000 -1.053631 0.512017 -3.045566 -0.192548 0.071521 -0.004904
4.433333 -1.060002 0.514373 -3.054845 -0.189817 0.070066 -0.004034
4.466667 -1.066292 0.516685 -3.049373 -0.187075 0.068619 -0.001759
4.500000 -1.072483 0.518946 -3.051010 -0.184324 0.067180 0.002606
4.533333 -1.078592 0.521163 -3.055339 -0.181563 0.065749 0.008387
4.566667 -1.084601 0.523329 -3.052866 -0.178797 0.064327 0.015172
4.600000 -1.090511 0.525446 -3.049526 -0.176028 0.062916 0.023633
4.633333 -1.096322 0.527513 -3.051358 -0.173262 0.061517 0.033028
4.666667 -1.102051 0.529537 -3.047162 -0.170503 0.060131 0.042710
4.700000 -1.107680 0.531513 -3.046358 -0.167751 0.058760 0.051673
4.733333 -1.113226 0.533446 -3.047576 -0.165008 0.057403 0.058309
4.766667 -1.118673 0.535333 -3.042316 -0.162275 0.056061 0.062285
4.800000 -1.124037 0.537177 -3.041512 -0.159549 0.054732 0.063772
4.833333 -1.129317 0.538978 -3.038357 -0.156826 0.053415 0.061700
4.866667 -1.134499 0.540735 -3.032812 -0.154105 0.052111 0.057599
4.900000 -1.139585 0.542447 -3.030995 -0.151386 0.050817 0.052288
4.933333 -1.144587 0.544117 -3.028744 -0.148669 0.049534 0.047756
4.966667 -1.149505 0.545746 -3.019028 -0.145952 0.048260 0.043904
5.000000 -1.154328 0.547331 -3.026016 -0.143237 0.046997 0.041475
5.033333 -1.159056 0.548875 -3.022523 -0.140529 0.045744 0.043107
