t x y theta dxdt dydt dthetadt
0.000000 0.000000 0.000000 -0.527254 0.147545 0.036170 -1.661456
0.033333 0.004955 0.001205 -0.608797 0.149915 0.035859 -1.784861
0.066667 0.009987 0.002404 -0.706754 0.152298 0.035531 -1.913910
0.100000 0.015100 0.003586 -0.777188 0.154689 0.035189 -2.034719
0.133333 0.020297 0.004752 -0.849276 0.157087 0.034838 -2.129606
0.166667 0.025570 0.005912 -0.987675 0.159488 0.034484 -2.171185
0.200000 0.030925 0.007055 -1.107971 0.161889 0.034131 -2.142031
0.233333 0.036364 0.008182 -1.143073 0.164289 0.033784 -2.038529
0.266667 0.041885 0.009294 -1.192625 0.166685 0.033447 -1.875255
0.300000 0.047484 0.010399 -1.261670 0.169078 0.033122 -1.667357
0.333333 0.053165 0.011491 -1.331078 0.171472 0.032809 -1.433823
0.366667 0.058923 0.012575 -1.428440 0.173865 0.032510 -1.198335
0.400000 0.064757 0.013651 -1.470342 0.176260 0.032223 -0.982869
0.433333 0.070668 0.014720 -1.456954 0.178661 0.031947 -0.801759
0.466667 0.076656 0.015782 -1.448699 0.181070 0.031680 -0.665455
0.500000 0.082728 0.016833 -1.439903 0.183488 0.031419 -0.584900
0.533333 0.088876 0.017876 -1.434619 0.185917 0.031162 -0.562607
0.566667 0.095110 0.018910 -1.427240 0.188360 0.030908 -0.606814
0.600000 0.101430 0.019936 -1.439469 0.190815 0.030656 -0.713316
0.633333 0.107837 0.020952 -1.445422 0.193277 0.030404 -0.875174
0.666667 0.114319 0.021961 -1.495588 0.195741 0.030153 -1.072280
0.700000 0.120877 0.022962 -1.515143 0.198202 0.029902 -1.277566
0.733333 0.127522 0.023954 -1.560067 0.200651 0.029652 -1.465238
0.766667 0.134256 0.024939 -1.617917 0.203082 0.029402 -1.595961
0.800000 0.141078 0.025915 -1.716481 0.205488 0.029152 -1.634646
0.833333 0.147975 0.026884 -1.796629 0.207866 0.028901 -1.550226
0.866667 0.154961 0.027843 -1.863344 0.210214 0.028649 -1.330464
0.900000 0.162020 0.028794 -1.946434 0.212530 0.028394 -0.977611
0.933333 0.169153 0.029736 -2.039805 0.214820 0.028136 -0.501527
0.966667 0.176358 0.030670 -2.147451 0.217090 0.027874 0.076806
1.000000 0.183635 0.031596 -2.207274 0.219347 0.027605 0.724136
1.033333 0.190984 0.032513 -2.143012 0.221600 0.027330 1.402117
1.066667 0.198405 0.033421 -2.041633 0.223857 0.027047 2.085914
1.100000 0.205896 0.034321 -1.886224 0.226122 0.026758 2.756880
1.133333 0.213458 0.035212 -1.722971 0.228395 0.026463 3.393946
1.166667 0.221089 0.036095 -1.562461 0.230678 0.026163 3.984287
1.200000 0.228809 0.036963 -1.394823 0.232965 0.025860 4.522884
1.233333 0.236617 0.037818 -1.248373 0.235249 0.025556 5.016350
1.266667 0.244514 0.038661 -1.095429 0.237525 0.025255 5.457858
1.300000 0.252478 0.039495 -0.937892 0.239789 0.024957 5.840727
1.333333 0.260529 0.040319 -0.791948 0.242035 0.024665 6.165120
1.366667 0.268645 0.041134 -0.604825 0.244258 0.024382 6.414232
1.400000 0.276827 0.041940 -0.323123 0.246459 0.024108 6.559206
1.433333 0.285073 0.042737 -0.016209 0.248639 0.023844 6.557093
1.466667 0.293406 0.043526 0.240548 0.250802 0.023589 6.374260
1.500000 0.301801 0.044306 0.564276 0.252949 0.023342 5.977111
1.533333 0.310258 0.045077 0.821385 0.255089 0.023101 5.341965
1.566667 0.318801 0.045842 1.052251 0.257225 0.022862 4.469408
1.600000 0.327405 0.046599 1.249595 0.259359 0.022623 3.398270
1.633333 0.336096 0.047351 1.400391 0.261495 0.022380 2.191381
1.666667 0.344844 0.048094 1.489007 0.263635 0.022131 0.921180
1.700000 0.353681 0.048831 1.535718 0.265775 0.021871 -0.326295
1.733333 0.362573 0.049560 1.444310 0.267910 0.021598 -1.467738
1.766667 0.371520 0.050281 1.281815 0.270038 0.021309 -2.429920
1.800000 0.380555 0.050992 1.043433 0.272155 0.021004 -3.162916
1.833333 0.389678 0.051691 0.799046 0.274255 0.020681 -3.643062
1.866667 0.398853 0.052382 0.563811 0.276328 0.020342 -3.864942
1.900000 0.408115 0.053058 0.357665 0.278374 0.019987 -3.843235
1.933333 0.417425 0.053725 0.185284 0.280393 0.019618 -3.616862
1.966667 0.426820 0.054373 0.066808 0.282381 0.019236 -3.235390
2.000000 0.436299 0.055003 -0.009995 0.284335 0.018845 -2.760099
2.033333 0.445822 0.055624 -0.060320 0.286256 0.018447 -2.243707
2.066667 0.455388 0.056237 -0.079400 0.288142 0.018044 -1.734859
2.100000 0.465032 0.056830 -0.096777 0.289989 0.017640 -1.271566
2.133333 0.474715 0.057416 -0.102383 0.291786 0.017239 -0.874730
2.166667 0.484471 0.057984 -0.131953 0.293527 0.016844 -0.550450
2.200000 0.494297 0.058537 -0.137879 0.295206 0.016458 -0.293998
2.233333 0.504189 0.059074 -0.146138 0.296813 0.016082 -0.093176
2.266667 0.514143 0.059598 -0.148574 0.298338 0.015720 0.070194
2.300000 0.524154 0.060108 -0.134590 0.299771 0.015372 0.208607
2.333333 0.534196 0.060610 -0.111499 0.301105 0.015040 0.332626
2.366667 0.544286 0.061101 -0.095515 0.302336 0.014723 0.445118
2.400000 0.554403 0.061585 -0.074311 0.303460 0.014422 0.549987
2.433333 0.564561 0.062057 -0.055013 0.304476 0.014137 0.641599
2.466667 0.574740 0.062523 -0.043863 0.305391 0.013866 0.709315
2.500000 0.584953 0.062979 -0.026836 0.306210 0.013607 0.750312
2.533333 0.595193 0.063426 -0.008992 0.306938 0.013359 0.764603
2.566667 0.605458 0.063865 0.046898 0.307580 0.013122 0.749669
2.600000 0.615737 0.064296 0.113878 0.308140 0.012894 0.700894
2.633333 0.626036 0.064720 0.153251 0.308621 0.012675 0.619451
2.666667 0.636351 0.065136 0.166663 0.309022 0.012465 0.513080
2.700000 0.646675 0.065546 0.177808 0.309343 0.012264 0.385128
2.733333 0.657005 0.065950 0.193485 0.309585 0.012072 0.237523
2.766667 0.667349 0.066347 0.207173 0.309751 0.011887 0.083022
2.800000 0.677695 0.066738 0.189195 0.309839 0.011709 -0.063277
2.833333 0.688041 0.067125 0.186452 0.309852 0.011538 -0.192570
2.866667 0.698386 0.067505 0.168339 0.309790 0.011372 -0.300164
2.900000 0.708726 0.067881 0.137737 0.309654 0.011211 -0.381159
2.933333 0.719061 0.068252 0.114475 0.309441 0.011056 -0.429717
2.966667 0.729388 0.068618 0.092587 0.309152 0.010907 -0.449687
3.000000 0.739705 0.068978 0.071186 0.308788 0.010764 -0.449829
3.033333 0.750010 0.069332 0.057566 0.308347 0.010628 -0.440104
3.066667 0.760299 0.069681 0.034164 0.307829 0.010500 -0.434274
3.100000 0.770571 0.070027 0.032765 0.307234 0.010380 -0.445496
3.133333 0.780819 0.070368 0.021022 0.306560 0.010269 -0.482445
3.166667 0.791046 0.070706 0.007006 0.305806 0.010168 -0.546560
3.200000 0.801241 0.071041 0.004719 0.304970 0.010079 -0.633661
3.233333 0.811413 0.071373 0.003146 0.304050 0.010003 -0.726761
3.266667 0.821545 0.071704 0.007750 0.303045 0.009941 -0.804229
3.300000 0.831649 0.072031 -0.004017 0.301955 0.009893 -0.845432
3.333333 0.841723 0.072355 -0.027819 0.300782 0.009860 -0.841854
3.366667 0.851747 0.072680 -0.122252 0.299526 0.009843 -0.783826
3.400000 0.861738 0.073001 -0.244339 0.298186 0.009844 -0.664010
3.433333 0.871673 0.073325 -0.320805 0.296766 0.009861 -0.488881
3.466667 0.881551 0.073652 -0.341836 0.295270 0.009895 -0.269509
3.500000 0.891389 0.073976 -0.337783 0.293700 0.009945 -0.020397
3.533333 0.901165 0.074306 -0.300940 0.292059 0.010012 0.248054
3.566667 0.910874 0.074642 -0.249038 0.290357 0.010091 0.512490
3.600000 0.920540 0.074976 -0.198053 0.288602 0.010178 0.746844
3.633333 0.930158 0.075308 -0.141388 0.286803 0.010271 0.934078
3.666667 0.939703 0.075649 -0.109430 0.284964 0.010367 1.067137
3.700000 0.949173 0.075999 -0.061833 0.283091 0.010461 1.143944
3.733333 0.958564 0.076359 -0.015196 0.281188 0.010552 1.167713
3.766667 0.967902 0.076718 0.018404 0.279251 0.010639 1.149890
3.800000 0.977186 0.077075 0.055976 0.277274 0.010722 1.105575
3.833333 0.986413 0.077431 0.097928 0.275248 0.010803 1.045259
3.866667 0.995553 0.077798 0.130757 0.273169 0.010883 0.974924
3.900000 1.004633 0.078163 0.168414 0.271029 0.010963 0.912406
3.933333 1.013653 0.078528 0.204912 0.268823 0.011046 0.888049
3.966667 1.022611 0.078891 0.223765 0.266549 0.011132 0.943077
4.000000 1.031504 0.079253 0.241898 0.264212 0.011222 1.122633
4.033333 1.040301 0.079624 0.271936 0.261821 0.011312 1.477793
4.066667 1.048999 0.080003 0.293357 0.259383 0.011402 2.044083
4.100000 1.057596 0.080390 0.293789 0.256907 0.011492 2.835285
4.133333 1.066091 0.080784 0.314849 0.254405 0.011578 3.300489
4.166667 1.074516 0.081177 0.297016 0.251888 0.011657 3.376054
4.200000 1.082870 0.081569 0.315379 0.249361 0.011729 2.972754
4.233333 1.091151 0.081960 0.494045 0.246822 0.011793 1.977684
4.266667 1.099327 0.082359 0.848246 0.244267 0.011848 0.802737
4.300000 1.107428 0.082756 1.309705 0.241688 0.011893 -0.666468
4.333333 1.115453 0.083152 1.851022 0.239072 0.011928 -1.465715
4.366667 1.123402 0.083547 2.412203 0.236408 0.011955 -1.636675
4.400000 1.131272 0.083941 2.844836 0.233685 0.011973 -1.175214
4.433333 1.139039 0.084350 -2.972976 0.230898 0.011981 -0.035877
4.466667 1.146697 0.084756 -2.618991 0.228048 0.011978 0.822864
4.500000 1.154275 0.085160 -2.482174 0.225136 0.011964 1.525895
4.533333 1.161744 0.085563 -2.471616 0.222166 0.011938 1.684711
4.566667 1.169106 0.085963 -2.525756 0.219146 0.011898 1.421748
4.600000 1.176358 0.086361 -2.675120 0.216091 0.011845 0.830600
4.633333 1.183503 0.086757 -2.797372 0.213011 0.011781 -0.022007
4.666667 1.190563 0.087151 -2.903673 0.209919 0.011708 -0.587296
4.700000 1.197515 0.087541 -2.975863 0.206828 0.011629 -0.885066
4.733333 1.204358 0.087928 -3.032411 0.203751 0.011545 -0.965713
4.766667 1.211094 0.088312 -3.018332 0.200695 0.011458 -0.890153
4.800000 1.217723 0.088691 -3.017989 0.197662 0.011371 -0.724658
4.833333 1.224244 0.089068 -3.014881 0.194653 0.011284 -0.529122
4.866667 1.230657 0.089440 -3.011395 0.191670 0.011197 -0.350904
4.900000 1.236984 0.089811 -3.017668 0.188712 0.011111 -0.212451
4.933333 1.243222 0.090180 -3.014470 0.185776 0.011025 -0.119938
4.966667 1.249372 0.090547 -3.005792 0.182862 0.010940 -0.069117
5.000000 1.255433 0.090912 -3.013672 0.179965 0.010855 -0.048769
5.033333 1.261389 0.091273 -3.007163 0.177080 0.010769 -0.047333
5.066667 1.267240 0.091631 -3.034977 0.174198 0.010682 -0.052027
5.100000 1.272986 0.091985 -3.022797 0.171314 0.010593 -0.060088
5.133333 1.278643 0.092336 -3.023408 0.168425 0.010501 -0.067782
5.166667 1.284210 0.092686 -3.025867 0.165526 0.010406 -0.074699
5.200000 1.289688 0.093032 -3.040210 0.162618 0.010308 -0.076802
5.233333 1.295063 0.093375 -3.024742 0.159700 0.010207 -0.074573
5.266667 1.300348 0.093715 -3.031097 0.156776 0.010103 -0.072616
5.300000 1.305531 0.094051 -3.023117 0.153843 0.009996 -0.068321
5.333333 1.310613 0.094383 -3.050841 0.150904 0.009886 -0.060777
5.366667 1.315594 0.094712 -3.047651 0.147964 0.009774 -0.051108
