t x y theta dxdt dydt dthetadt
0.000000 0.000000 0.000000 0.579815 0.020919 -0.082071 0.513324
0.033333 0.000659 -0.004289 0.594510 0.027339 -0.083290 0.556968
0.066667 0.001180 -0.008355 0.620081 0.035284 -0.082000 0.598898
0.100000 0.001563 -0.012191 0.635663 0.044758 -0.078175 0.632576
0.133333 0.001807 -0.015787 0.648640 0.055803 -0.071805 0.656073
0.166667 0.003468 -0.018762 0.673891 0.068370 -0.062931 0.668522
0.200000 0.004987 -0.021480 0.692640 0.082607 -0.052105 0.670732
0.233333 0.009263 -0.022322 0.727475 0.098597 -0.039973 0.660174
0.266667 0.013390 -0.022890 0.759151 0.116105 -0.027259 0.635096
0.300000 0.017364 -0.023177 0.780150 0.134878 -0.014399 0.599609
0.333333 0.021179 -0.023178 0.805651 0.154615 -0.001805 0.553674
0.366667 0.024832 -0.022887 0.824028 0.175105 0.010159 0.500095
0.400000 0.031345 -0.021830 0.853033 0.195681 0.021307 0.437650
0.433333 0.038936 -0.020899 0.859743 0.215856 0.031736 0.372903
0.466667 0.046786 -0.019853 0.867367 0.234774 0.041591 0.311822
0.500000 0.054950 -0.018668 0.865442 0.251352 0.051049 0.254587
0.533333 0.063717 -0.016820 0.874676 0.264423 0.060263 0.204373
0.566667 0.073484 -0.014516 0.873242 0.272478 0.069603 0.163019
0.600000 0.085246 -0.011866 0.872619 0.274401 0.079544 0.135774
0.633333 0.096763 -0.008876 0.886408 0.268973 0.090662 0.118475
0.666667 0.108366 -0.005651 0.880585 0.255633 0.103517 0.108494
0.700000 0.118663 -0.002564 0.881280 0.234582 0.118575 0.105845
0.733333 0.128673 0.000876 0.884876 0.206202 0.136604 0.109023
0.766667 0.138381 0.004675 0.894142 0.171690 0.158344 0.111212
0.800000 0.145248 0.008781 0.905334 0.132578 0.184498 0.104102
0.833333 0.148302 0.013892 0.900030 0.090945 0.215152 0.088107
0.866667 0.151023 0.019366 0.890075 0.048950 0.250736 0.060373
0.900000 0.149477 0.027547 0.902513 0.008973 0.291847 0.019516
0.933333 0.147589 0.036092 0.923575 -0.026697 0.338522 -0.035080
0.966667 0.143214 0.048592 0.928795 -0.056099 0.389920 -0.098232
1.000000 0.138493 0.061452 0.930861 -0.077881 0.445186 -0.166830
1.033333 0.133428 0.074667 0.932184 -0.091461 0.503867 -0.241543
1.066667 0.128159 0.091386 0.910680 -0.096840 0.564538 -0.317049
1.100000 0.122955 0.113009 0.883542 -0.095228 0.625312 -0.389417
1.133333 0.117403 0.134963 0.863828 -0.087829 0.684562 -0.449744
1.166667 0.111506 0.157236 0.843782 -0.076291 0.741621 -0.490269
1.200000 0.108472 0.184114 0.811789 -0.062526 0.795287 -0.497695
1.233333 0.109877 0.215769 0.812260 -0.048778 0.843626 -0.463609
1.266667 0.110922 0.247695 0.794910 -0.037275 0.885216 -0.385813
1.300000 0.111597 0.279871 0.775655 -0.029851 0.919107 -0.262890
1.333333 0.111897 0.312272 0.731534 -0.028627 0.943904 -0.099674
1.366667 0.111813 0.344876 0.703922 -0.035309 0.957965 0.097776
1.400000 0.111341 0.377660 0.694331 -0.050914 0.960406 0.316450
1.433333 0.112884 0.413452 0.689771 -0.075642 0.951172 0.550350
1.466667 0.114019 0.449376 0.725201 -0.109131 0.930704 0.789489
1.500000 0.113373 0.485163 0.785717 -0.150730 0.899334 1.021661
1.533333 0.109840 0.518855 0.851841 -0.199090 0.858314 1.234017
1.566667 0.103254 0.548920 0.910123 -0.252753 0.809197 1.410906
1.600000 0.092886 0.574517 0.965015 -0.309932 0.753945 1.543089
1.633333 0.082102 0.600128 1.019890 -0.368609 0.694943 1.619599
1.666667 0.067401 0.620377 1.066469 -0.426827 0.634656 1.642175
1.700000 0.052300 0.640613 1.151737 -0.482883 0.575533 1.614109
1.733333 0.033584 0.656896 1.228441 -0.535305 0.519874 1.541757
1.766667 0.011787 0.669432 1.296475 -0.582826 0.469670 1.436594
1.800000 -0.010368 0.681936 1.344629 -0.624947 0.426028 1.308431
1.833333 -0.032867 0.694409 1.384343 -0.661606 0.389504 1.168655
1.866667 -0.056908 0.704866 1.422554 -0.692984 0.359889 1.019760
1.900000 -0.081258 0.715292 1.438212 -0.719155 0.336982 0.871646
1.933333 -0.106206 0.724631 1.456704 -0.740649 0.320052 0.733124
1.966667 -0.131427 0.733945 1.467371 -0.758264 0.308051 0.610095
2.000000 -0.157850 0.743248 1.488007 -0.772482 0.300201 0.506651
2.033333 -0.184725 0.752820 1.497051 -0.783759 0.295676 0.423051
2.066667 -0.211816 0.762374 1.503501 -0.792718 0.293813 0.362877
2.100000 -0.238899 0.771898 1.511111 -0.799939 0.293882 0.320966
2.133333 -0.266012 0.781687 1.517885 -0.805698 0.295222 0.292305
2.166667 -0.293282 0.791468 1.533261 -0.810025 0.297453 0.271404
2.200000 -0.319642 0.800949 1.536768 -0.813149 0.300142 0.254813
2.233333 -0.346592 0.810964 1.539583 -0.815320 0.302901 0.239334
2.266667 -0.374128 0.821302 1.551216 -0.816638 0.305474 0.222223
2.300000 -0.401743 0.831646 1.554466 -0.817212 0.307644 0.204211
2.333333 -0.429283 0.842452 1.577853 -0.817189 0.309323 0.181926
2.366667 -0.456736 0.853025 1.585541 -0.816739 0.310500 0.157071
2.400000 -0.484209 0.863610 1.591486 -0.815949 0.311217 0.127460
2.433333 -0.511684 0.874210 1.587715 -0.814957 0.311564 0.096007
2.466667 -0.538913 0.884812 1.590837 -0.813876 0.311645 0.061786
2.500000 -0.566044 0.895092 1.585937 -0.812848 0.311549 0.022801
2.533333 -0.592436 0.905109 1.594923 -0.812040 0.311443 -0.014109
2.566667 -0.618751 0.915153 1.581003 -0.811595 0.311423 -0.048375
2.600000 -0.645955 0.925448 1.593369 -0.811523 0.311511 -0.079114
2.633333 -0.673046 0.935775 1.595503 -0.811825 0.311666 -0.107909
2.666667 -0.700005 0.946138 1.577961 -0.812437 0.311814 -0.132247
2.700000 -0.726812 0.956539 1.572967 -0.813297 0.311911 -0.149773
2.733333 -0.754287 0.967216 1.560870 -0.814111 0.311797 -0.164652
2.766667 -0.781571 0.977935 1.559957 -0.814430 0.311343 -0.178568
2.800000 -0.809108 0.988676 1.553955 -0.813880 0.310512 -0.187831
2.833333 -0.836493 0.998926 1.534231 -0.812027 0.309352 -0.191631
2.866667 -0.863627 1.009227 1.547090 -0.808465 0.307964 -0.198913
2.900000 -0.890491 1.019582 1.534900 -0.802758 0.306435 -0.217179
2.933333 -0.917804 1.029805 1.516312 -0.794210 0.305228 -0.251802
2.966667 -0.945129 1.039840 1.521906 -0.782425 0.304804 -0.310720
3.000000 -0.972302 1.049639 1.515505 -0.766587 0.305854 -0.405096
3.033333 -0.999383 1.059465 1.510281 -0.745478 0.309233 -0.545284
3.066667 -1.025382 1.069229 1.496852 -0.717965 0.315782 -0.724140
3.100000 -1.049046 1.079204 1.491877 -0.682783 0.326597 -0.936505
3.133333 -1.072301 1.089257 1.486299 -0.639476 0.342375 -1.175734
3.166667 -1.095130 1.099391 1.480353 -0.587486 0.363776 -1.430987
3.200000 -1.117518 1.109611 1.417260 -0.527001 0.391201 -1.686406
3.233333 -1.139447 1.119918 1.329438 -0.458927 0.424857 -1.923834
3.266667 -1.154710 1.133580 1.239831 -0.384576 0.464653 -2.135787
3.300000 -1.169494 1.147336 1.140303 -0.305507 0.510318 -2.310578
3.333333 -1.178199 1.164137 1.031756 -0.223637 0.561197 -2.438756
3.366667 -1.181339 1.184287 0.926369 -0.141279 0.616377 -2.510165
3.400000 -1.183999 1.204529 0.835637 -0.060645 0.674645 -2.526438
3.433333 -1.182374 1.228140 0.741532 0.015835 0.734143 -2.492811
3.466667 -1.177507 1.254343 0.674998 0.086363 0.793709 -2.413724
3.500000 -1.172191 1.280608 0.592929 0.149165 0.851734 -2.296463
3.533333 -1.164187 1.310300 0.515417 0.203455 0.907030 -2.151507
3.566667 -1.153653 1.343879 0.431403 0.248900 0.958728 -1.991214
3.600000 -1.142725 1.377470 0.352920 0.285372 1.006245 -1.820227
3.633333 -1.130580 1.415303 0.291017 0.313488 1.049519 -1.640298
3.666667 -1.118083 1.453098 0.244994 0.333807 1.087791 -1.453444
3.700000 -1.105255 1.490831 0.214343 0.346965 1.120664 -1.266906
3.733333 -1.092117 1.528473 0.177345 0.353336 1.147954 -1.081960
3.766667 -1.078690 1.565998 0.128165 0.353538 1.169430 -0.901546
3.800000 -1.066336 1.607644 0.107912 0.348233 1.184215 -0.730695
3.833333 -1.053736 1.649114 0.102792 0.337861 1.191424 -0.575434
3.866667 -1.040912 1.690377 0.085545 0.323018 1.189956 -0.440093
3.900000 -1.030544 1.732577 0.078804 0.304527 1.178618 -0.322346
3.933333 -1.019989 1.774505 0.066515 0.283387 1.156172 -0.222058
3.966667 -1.009264 1.816128 0.069621 0.260480 1.121618 -0.139851
4.000000 -1.001298 1.855796 0.080841 0.236855 1.075416 -0.073248
4.033333 -0.993192 1.895096 0.079555 0.213595 1.018579 -0.017129
4.066667 -0.987123 1.932651 0.085258 0.191696 0.952691 0.029989
4.100000 -0.982589 1.967097 0.080605 0.171751 0.879306 0.068512
4.133333 -0.978821 1.997475 0.078643 0.154141 0.799790 0.094223
4.166667 -0.975592 2.022003 0.086290 0.139174 0.715446 0.108717
4.200000 -0.972170 2.038332 0.085283 0.126699 0.627300 0.114489
4.233333 -0.968654 2.054166 0.088230 0.116511 0.535932 0.110461
4.266667 -0.965053 2.069498 0.102708 0.108068 0.442470 0.100156
4.300000 -0.961376 2.084324 0.110122 0.101135 0.348213 0.087115
4.333333 -0.957631 2.098639 0.121469 0.095636 0.254534 0.081477
4.366667 -0.953828 2.112438 0.142143 0.091356 0.162497 0.085777
4.400000 -0.950101 2.117246 0.140876 0.088322 0.072690 0.098944
4.433333 -0.947421 2.116052 0.131095 0.086651 -0.013843 0.121365
4.466667 -0.945924 2.109706 0.089376 0.086638 -0.096297 0.154565
4.500000 -0.944201 2.099364 0.080245 0.088184 -0.173281 0.196656
4.533333 -0.942436 2.088555 0.091146 0.090858 -0.243285 0.241850
4.566667 -0.940636 2.077299 0.112315 0.094210 -0.304600 0.288409
4.600000 -0.938808 2.065618 0.138872 0.097645 -0.356154 0.334127
4.633333 -0.934816 2.051095 0.168853 0.100204 -0.397595 0.375822
4.666667 -0.929563 2.035050 0.195570 0.100634 -0.429076 0.406011
4.700000 -0.924303 2.018656 0.208818 0.098022 -0.451806 0.420077
4.733333 -0.919344 2.001614 0.218363 0.091774 -0.467113 0.418493
4.766667 -0.914397 1.984275 0.227733 0.081200 -0.476209 0.401070
4.800000 -0.910558 1.966285 0.235433 0.066024 -0.479788 0.368775
4.833333 -0.907548 1.949591 0.253916 0.046338 -0.478363 0.324023
4.866667 -0.905657 1.932921 0.265842 0.022892 -0.472553 0.268680
4.900000 -0.904839 1.916629 0.268094 -0.003604 -0.462472 0.207020
4.933333 -0.906038 1.901267 0.277888 -0.032413 -0.448362 0.138195
4.966667 -0.907288 1.885761 0.289774 -0.062346 -0.430857 0.063080
5.000000 -0.910639 1.871606 0.313449 -0.092389 -0.410687 -0.017419
5.033333 -0.914045 1.857352 0.303942 -0.121171 -0.388642 -0.099061
5.066667 -0.917506 1.843022 0.305857 -0.147459 -0.365203 -0.175476
5.100000 -0.924227 1.831238 0.282557 -0.169523 -0.341203 -0.241620
5.133333 -0.931002 1.819419 0.257503 -0.185612 -0.317217 -0.291148
5.166667 -0.939628 1.810749 0.249639 -0.194099 -0.293864 -0.321936
5.200000 -0.948302 1.802079 0.228452 -0.193249 -0.271387 -0.330446
5.233333 -0.957577 1.795050 0.208870 -0.182103 -0.250042 -0.319849
5.266667 -0.966890 1.788052 0.192198 -0.160266 -0.230207 -0.294949
5.300000 -0.976235 1.781102 0.168164 -0.128469 -0.211821 -0.261913
5.333333 -0.985605 1.774215 0.153970 -0.087944 -0.195007 -0.226634
5.366667 -0.990619 1.767493 0.160745 -0.040598 -0.179365 -0.188685
5.400000 -0.991786 1.761508 0.175917 0.010769 -0.164871 -0.152513
5.433333 -0.989267 1.756114 0.192250 0.063498 -0.151085 -0.120065
5.466667 -0.982850 1.751419 0.198006 0.114927 -0.137565 -0.092469
5.500000 -0.976475 1.746869 0.176477 0.162968 -0.124047 -0.068238
5.533333 -0.965746 1.743649 0.154764 0.205519 -0.110198 -0.047966
5.566667 -0.955088 1.740599 0.156034 0.241365 -0.095937 -0.035005
5.600000 -0.944519 1.737730 0.141350 0.270310 -0.080978 -0.020308
5.633333 -0.934055 1.735053 0.144403 0.292393 -0.065379 0.004154
5.666667 -0.923713 1.732578 0.147579 0.308316 -0.049099 0.044983
5.700000 -0.913509 1.730314 0.168075 0.318707 -0.032103 0.098775
5.733333 -0.903461 1.728272 0.166702 0.324885 -0.014401 0.164636
5.766667 -0.891355 1.728565 0.185084 0.327577 0.003848 0.239758
5.800000 -0.879441 1.729099 0.168026 0.327188 0.022429 0.312221
5.833333 -0.867739 1.729881 0.178883 0.324339 0.041144 0.369231
5.866667 -0.855983 1.732343 0.153967 0.319510 0.059649 0.406552
5.900000 -0.844479 1.735065 0.156114 0.313538 0.077676 0.427774
5.933333 -0.833243 1.738051 0.217458 0.307063 0.095148 0.432416
5.966667 -0.823061 1.742104 0.300080 0.301259 0.112214 0.420616
6.000000 -0.813185 1.746429 0.334860 0.297283 0.129305 0.392782
6.033333 -0.804609 1.750966 0.352223 0.295779 0.147229 0.356026
6.066667 -0.796374 1.755782 0.316308 0.296733 0.167285 0.313475
6.100000 -0.789088 1.761231 0.289061 0.299717 0.190597 0.268328
6.133333 -0.782175 1.766963 0.297543 0.304002 0.217955 0.230196
6.166667 -0.773191 1.773147 0.311973 0.308294 0.250119 0.208907
6.200000 -0.762085 1.779830 0.322236 0.310709 0.287446 0.208051
6.233333 -0.749138 1.787635 0.328818 0.309450 0.329567 0.222542
6.266667 -0.734870 1.797716 0.318500 0.303327 0.375253 0.240651
6.300000 -0.721075 1.808088 0.310657 0.291249 0.423403 0.253223
6.333333 -0.708005 1.822149 0.325376 0.272298 0.472791 0.249201
6.366667 -0.696835 1.840434 0.355661 0.245749 0.521931 0.220251
6.400000 -0.689612 1.862488 0.396026 0.212000 0.568979 0.164821
6.433333 -0.682957 1.884795 0.419174 0.171409 0.612505 0.088377
6.466667 -0.676885 1.907341 0.434200 0.123968 0.651587 0.000127
6.500000 -0.671414 1.930109 0.431256 0.069302 0.685162 -0.092944
6.533333 -0.671512 1.955373 0.418954 0.006953 0.712434 -0.180700
6.566667 -0.672238 1.980821 0.386772 -0.063157 0.733040 -0.253499
6.600000 -0.673602 2.006437 0.353071 -0.141485 0.747388 -0.302736
6.633333 -0.675612 2.032201 0.331749 -0.227891 0.755945 -0.325093
6.666667 -0.678278 2.058096 0.298507 -0.322315 0.759190 -0.316668
6.700000 -0.686433 2.085403 0.284518 -0.423441 0.757737 -0.278235
6.733333 -0.700059 2.112745 0.281197 -0.529420 0.752534 -0.215769
6.766667 -0.719020 2.139437 0.279458 -0.638295 0.744370 -0.139821
6.800000 -0.743320 2.164756 0.281955 -0.747835 0.733865 -0.059565
6.833333 -0.773325 2.188680 0.285479 -0.856215 0.721768 0.016853
6.866667 -0.809539 2.211254 0.292345 -0.960090 0.708948 0.080923
6.900000 -0.846338 2.233807 0.304683 -1.057348 0.696374 0.129971
6.933333 -0.883692 2.256323 0.309431 -1.146739 0.684705 0.161472
6.966667 -0.921574 2.278789 0.316931 -1.227800 0.674483 0.178714
7.000000 -0.968629 2.300468 0.328831 -1.300136 0.666069 0.180815
7.033333 -1.016143 2.322059 0.331961 -1.363323 0.659449 0.172167
7.066667 -1.064073 2.343549 0.343255 -1.418601 0.654321 0.154442
7.100000 -1.112381 2.364923 0.348204 -1.466819 0.650271 0.128828
7.133333 -1.161026 2.386168 0.361200 -1.508429 0.646888 0.097798
7.166667 -1.215264 2.408115 0.349504 -1.542962 0.643605 0.061071
7.200000 -1.269752 2.429899 0.357064 -1.570787 0.639661 0.022565
7.233333 -1.324442 2.451505 0.365068 -1.592280 0.634347 -0.020006
7.266667 -1.379286 2.472919 0.349607 -1.607186 0.626847 -0.062493
7.300000 -1.434237 2.494127 0.365400 -1.615256 0.616349 -0.104351
7.333333 -1.489247 2.515113 0.349273 -1.616246 0.602044 -0.142002
7.366667 -1.544268 2.535864 0.345835 -1.610542 0.583127 -0.175230
7.400000 -1.599252 2.556365 0.333448 -1.598254 0.559245 -0.202514
7.433333 -1.654151 2.576602 0.326853 -1.579539 0.530321 -0.219476
7.466667 -1.708916 2.596561 0.314515 -1.554224 0.496108 -0.226652
7.500000 -1.762298 2.614504 0.309319 -1.522244 0.456509 -0.222055
7.533333 -1.812781 2.629849 0.297371 -1.483761 0.411623 -0.207908
7.566667 -1.862779 2.643231 0.280000 -1.438676 0.361574 -0.184533
7.600000 -1.910388 2.653679 0.266278 -1.386846 0.306522 -0.155497
7.633333 -1.957634 2.663808 0.269868 -1.328116 0.246490 -0.125530
7.666667 -2.004477 2.673613 0.266218 -1.263525 0.182516 -0.097781
7.700000 -2.045332 2.677980 0.270055 -1.194152 0.115653 -0.074448
7.733333 -2.085706 2.682024 0.264960 -1.120583 0.046543 -0.057194
7.766667 -2.125564 2.685749 0.266705 -1.044254 -0.023361 -0.046207
7.800000 -2.156738 2.681801 0.275088 -0.967043 -0.092288 -0.038988
7.833333 -2.187334 2.677552 0.280890 -0.891040 -0.158347 -0.034266
7.866667 -2.217325 2.673011 0.292547 -0.817885 -0.220011 -0.034125
7.900000 -2.238649 2.659130 0.279352 -0.749751 -0.275096 -0.040240
7.933333 -2.259323 2.644995 0.256940 -0.689145 -0.321184 -0.053377
7.966667 -2.279335 2.630624 0.245796 -0.638115 -0.356054 -0.074244
8.000000 -2.298670 2.616037 0.244090 -0.597410 -0.378347 -0.103249
8.033333 -2.314629 2.599713 0.255731 -0.567631 -0.386420 -0.136807
8.066667 -2.329221 2.582887 0.265423 -0.548965 -0.379116 -0.167345
8.100000 -2.343103 2.565913 0.265979 -0.539829 -0.357006 -0.191063
8.133333 -2.357588 2.550481 0.279697 -0.538295 -0.320581 -0.207274
8.166667 -2.373815 2.536462 0.262920 -0.541591 -0.271144 -0.210447
8.200000 -2.392053 2.525364 0.232749 -0.546932 -0.210402 -0.199695
8.233333 -2.412476 2.518482 0.204062 -0.550450 -0.141560 -0.179145
8.266667 -2.432135 2.511531 0.178419 -0.548397 -0.067634 -0.154633
8.300000 -2.453466 2.509678 0.152245 -0.538071 0.008604 -0.133970
8.333333 -2.475325 2.512990 0.164981 -0.517228 0.083710 -0.125338
8.366667 -2.496998 2.521368 0.189224 -0.484635 0.154117 -0.145190
8.400000 -2.517843 2.529684 0.204201 -0.440326 0.217255 -0.203079
8.433333 -2.535831 2.540567 0.211556 -0.385702 0.271710 -0.302113
8.466667 -2.550913 2.554460 0.212286 -0.321970 0.315670 -0.443547
8.500000 -2.562491 2.570555 0.233000 -0.250802 0.348222 -0.627517
8.533333 -2.569054 2.586248 0.237012 -0.173769 0.369412 -0.843525
8.566667 -2.568868 2.600076 0.206606 -0.092614 0.380360 -1.073341
8.600000 -2.567790 2.613789 0.163305 -0.008514 0.381921 -1.302449
8.633333 -2.565821 2.627376 0.072512 0.077319 0.375275 -1.516444
8.666667 -2.562962 2.640824 -0.035699 0.163141 0.362481 -1.698459
8.700000 -2.559218 2.654121 -0.118863 0.247851 0.345555 -1.822295
8.733333 -2.554589 2.667254 -0.164619 0.330688 0.326385 -1.877555
8.766667 -2.542481 2.677915 -0.210589 0.411373 0.306328 -1.861275
8.800000 -2.524293 2.686246 -0.265516 0.489387 0.287129 -1.775665
8.833333 -2.505250 2.694392 -0.382478 0.564760 0.270333 -1.624235
8.866667 -2.480618 2.701590 -0.481400 0.637392 0.257113 -1.419902
8.900000 -2.455172 2.708593 -0.545333 0.706963 0.248445 -1.185050
8.933333 -2.428936 2.715395 -0.570113 0.772571 0.244993 -0.931255
8.966667 -2.401934 2.721989 -0.592959 0.833925 0.247177 -0.669348
9.000000 -2.374192 2.728367 -0.592426 0.891330 0.254837 -0.408028
9.033333 -2.345734 2.734525 -0.571943 0.944770 0.267378 -0.165434
9.066667 -2.312550 2.743162 -0.577848 0.994652 0.283976 0.050043
9.100000 -2.278708 2.751565 -0.547894 1.041385 0.303803 0.235341
9.133333 -2.241883 2.762172 -0.531582 1.085386 0.325749 0.386445
9.166667 -2.202516 2.775116 -0.501425 1.126229 0.348703 0.500720
9.200000 -2.162598 2.787795 -0.482223 1.162897 0.371512 0.580628
9.233333 -2.122164 2.800195 -0.469783 1.194349 0.393159 0.637478
9.266667 -2.080863 2.814453 -0.450848 1.219868 0.412603 0.676669
9.300000 -2.039122 2.828402 -0.418282 1.238641 0.428701 0.701363
9.333333 -1.995610 2.844334 -0.398189 1.250137 0.440428 0.715947
9.366667 -1.951737 2.859924 -0.369069 1.254428 0.447139 0.723557
9.400000 -1.907985 2.876712 -0.348183 1.251660 0.448095 0.725163
9.433333 -1.863952 2.893119 -0.305855 1.242364 0.442718 0.718077
9.466667 -1.820562 2.909803 -0.290157 1.226851 0.430846 0.707548
9.500000 -1.778555 2.926394 -0.256710 1.205776 0.412501 0.699392
9.533333 -1.737961 2.942058 -0.240082 1.179616 0.387868 0.693099
9.566667 -1.699487 2.956330 -0.221788 1.148744 0.357024 0.693415
9.600000 -1.660947 2.968910 -0.202604 1.113556 0.320383 0.701409
9.633333 -1.623584 2.979754 -0.183715 1.073840 0.277936 0.720489
9.666667 -1.588350 2.988081 -0.155926 1.029385 0.229681 0.744274
9.700000 -1.553098 2.995883 -0.138003 0.979617 0.175573 0.767474
9.733333 -1.521997 3.000212 -0.130194 0.925034 0.116297 0.792489
9.766667 -1.490926 3.003993 -0.117030 0.865761 0.052389 0.816439
9.800000 -1.459907 3.007219 -0.064664 0.802551 -0.015219 0.841747
9.833333 -1.428964 3.009882 -0.001125 0.736623 -0.085227 0.867395
9.866667 -1.405789 3.006452 0.025359 0.669547 -0.156256 0.901359
9.900000 -1.382720 3.002448 0.074950 0.602792 -0.227261 0.945950
9.933333 -1.365393 2.992077 0.083365 0.536967 -0.297930 0.999586
9.966667 -1.354550 2.975699 0.078982 0.473397 -0.367421 1.063663
10.000000 -1.343821 2.958758 0.103264 0.412853 -0.435510 1.136560
10.033333 -1.333205 2.941267 0.131581 0.356463 -0.501659 1.223850
10.066667 -1.322701 2.923240 0.180213 0.304284 -0.566259 1.318341
10.100000 -1.312308 2.904692 0.232598 0.256857 -0.629267 1.416094
10.133333 -1.302022 2.885638 0.305582 0.214389 -0.690737 1.507577
10.166667 -1.296547 2.862116 0.339514 0.176454 -0.751514 1.586331
10.200000 -1.291166 2.838121 0.418052 0.142907 -0.812131 1.645941
10.233333 -1.288669 2.810028 0.486042 0.113572 -0.873255 1.675973
10.266667 -1.287817 2.777769 0.547283 0.089108 -0.934496 1.676417
10.300000 -1.287022 2.745108 0.606790 0.070057 -0.995474 1.653384
10.333333 -1.287283 2.709259 0.663626 0.057376 -1.055403 1.618200
10.366667 -1.287572 2.673071 0.722884 0.051673 -1.113275 1.575052
10.400000 -1.287444 2.634479 0.792810 0.053519 -1.167979 1.531415
10.433333 -1.287068 2.593580 0.824357 0.063016 -1.218777 1.498307
10.466667 -1.286672 2.552450 0.847759 0.080087 -1.265813 1.481355
10.500000 -1.285697 2.508540 0.892758 0.104294 -1.309098 1.475953
10.533333 -1.283327 2.462638 0.938809 0.134913 -1.348959 1.481688
10.566667 -1.279275 2.415320 0.973077 0.171512 -1.385505 1.498978
10.600000 -1.273477 2.367170 1.024722 0.213372 -1.419213 1.525221
10.633333 -1.265637 2.318457 1.097489 0.259424 -1.450360 1.548763
10.666667 -1.257707 2.269784 1.138251 0.308195 -1.478558 1.562387
10.700000 -1.249682 2.221198 1.205997 0.358463 -1.503903 1.564623
10.733333 -1.237705 2.171032 1.268088 0.409053 -1.526440 1.548261
10.766667 -1.222104 2.119222 1.333474 0.458841 -1.546436 1.507724
10.800000 -1.202366 2.065149 1.383904 0.506280 -1.563655 1.440449
10.833333 -1.182527 2.011374 1.421003 0.550334 -1.577818 1.349102
10.866667 -1.162593 1.957952 1.479533 0.590154 -1.588586 1.230466
10.900000 -1.142571 1.904937 1.524716 0.624850 -1.595410 1.078362
10.933333 -1.118719 1.849806 1.561955 0.653630 -1.597630 0.887063
10.966667 -1.094793 1.795195 1.596278 0.675719 -1.593932 0.652818
11.000000 -1.070804 1.741159 1.614082 0.691081 -1.583102 0.367880
11.033333 -1.046764 1.687754 1.635143 0.699503 -1.563634 0.026285
11.066667 -1.021945 1.634835 1.651723 0.701020 -1.534558 -0.369873
11.100000 -0.996222 1.580817 1.663555 0.695323 -1.494196 -0.810110
11.133333 -0.970766 1.527197 1.662222 0.682232 -1.440592 -1.275670
11.166667 -0.946422 1.475887 1.620609 0.661795 -1.372525 -1.742184
11.200000 -0.923902 1.428734 1.567584 0.633895 -1.289266 -2.177720
11.233333 -0.901397 1.382541 1.453129 0.598444 -1.190601 -2.541503
11.266667 -0.878917 1.337359 1.318172 0.555333 -1.076096 -2.795525
11.300000 -0.860040 1.299773 1.189454 0.505458 -0.947305 -2.910556
11.333333 -0.843076 1.268207 1.025150 0.449905 -0.806982 -2.868095
11.366667 -0.828674 1.243687 0.855705 0.389992 -0.658572 -2.667026
11.400000 -0.814326 1.220330 0.697229 0.327195 -0.505307 -2.316846
11.433333 -0.803368 1.204892 0.562278 0.263870 -0.351103 -1.851784
11.466667 -0.795648 1.197411 0.487161 0.202896 -0.200282 -1.317425
11.500000 -0.790953 1.197008 0.465414 0.146454 -0.055845 -0.761477
11.533333 -0.789593 1.203081 0.483156 0.096737 0.079789 -0.233695
11.566667 -0.791936 1.214760 0.555673 0.055659 0.205202 0.223045
11.600000 -0.794302 1.227653 0.638265 0.024874 0.318859 0.571306
11.633333 -0.796673 1.241753 0.726385 0.004781 0.420490 0.788587
11.666667 -0.800766 1.259474 0.808711 -0.004712 0.510558 0.871649
11.700000 -0.804826 1.278385 0.855430 -0.003375 0.589953 0.828494
11.733333 -0.808024 1.300234 0.906642 0.008402 0.660097 0.676694
11.766667 -0.808886 1.324672 0.925383 0.029631 0.722542 0.446273
11.800000 -0.805827 1.351907 0.913410 0.059429 0.778757 0.169161
11.833333 -0.802671 1.380281 0.899625 0.097635 0.829653 -0.118700
11.866667 -0.799408 1.409774 0.887337 0.143293 0.875983 -0.391566
11.900000 -0.796024 1.440369 0.857828 0.194879 0.918019 -0.633436
11.933333 -0.792508 1.472046 0.839755 0.251423 0.955884 -0.832053
11.966667 -0.788849 1.504784 0.778313 0.312633 0.989577 -0.982901
12.000000 -0.778542 1.539415 0.730467 0.377771 1.019661 -1.089176
12.033333 -0.761683 1.574876 0.672329 0.445031 1.046964 -1.159547
12.066667 -0.744669 1.611344 0.627701 0.513343 1.072213 -1.200628
12.100000 -0.727503 1.648795 0.586505 0.581644 1.096173 -1.215494
12.133333 -0.705705 1.686034 0.546690 0.648127 1.119581 -1.208923
12.166667 -0.680600 1.722738 0.511395 0.710673 1.143370 -1.189331
12.200000 -0.655367 1.760364 0.484537 0.767824 1.167962 -1.159760
12.233333 -0.626887 1.798550 0.429358 0.819256 1.193778 -1.117851
12.266667 -0.596483 1.837526 0.396729 0.864322 1.221002 -1.065287
12.300000 -0.565998 1.877359 0.371637 0.902841 1.250088 -1.005443
12.333333 -0.532965 1.919967 0.330411 0.935249 1.281114 -0.938271
12.366667 -0.499894 1.963386 0.274802 0.962154 1.313519 -0.861889
12.400000 -0.466191 2.007921 0.251809 0.983916 1.346989 -0.774674
12.433333 -0.432496 2.053217 0.227248 1.000766 1.380919 -0.683441
12.466667 -0.398830 2.099245 0.196830 1.013219 1.414996 -0.590496
12.500000 -0.363525 2.148345 0.193172 1.021262 1.448112 -0.498109
12.533333 -0.329087 2.196985 0.170893 1.025014 1.479718 -0.407532
12.566667 -0.293999 2.247789 0.170592 1.024418 1.509405 -0.322864
12.600000 -0.259950 2.296988 0.175598 1.019287 1.536819 -0.245391
12.633333 -0.223699 2.350356 0.168957 1.009044 1.561462 -0.172835
12.666667 -0.188572 2.404207 0.161650 0.993423 1.582845 -0.103170
12.700000 -0.154628 2.458560 0.155557 0.972382 1.600990 -0.031161
12.733333 -0.120914 2.513402 0.154570 0.945734 1.615505 0.042886
12.766667 -0.087458 2.568699 0.155458 0.913668 1.626366 0.123377
12.800000 -0.057009 2.623352 0.151003 0.876891 1.633432 0.213227
12.833333 -0.026861 2.678391 0.140369 0.836297 1.637036 0.314863
12.866667 0.001343 2.734125 0.161519 0.792383 1.637283 0.425590
12.900000 0.027278 2.789513 0.179420 0.746114 1.634393 0.539611
12.933333 0.049899 2.844048 0.208415 0.698599 1.628677 0.651889
12.966667 0.072148 2.898835 0.225141 0.650721 1.620265 0.757367
13.000000 0.094011 2.953843 0.256440 0.602728 1.609014 0.846618
13.033333 0.111349 3.006787 0.280755 0.555443 1.594928 0.911374
13.066667 0.128280 3.059889 0.329034 0.509806 1.578143 0.948277
13.100000 0.144797 3.113121 0.369701 0.466330 1.558742 0.958012
13.133333 0.160892 3.166453 0.426166 0.425035 1.536629 0.941121
13.166667 0.173991 3.218319 0.465970 0.386155 1.511838 0.898915
13.200000 0.184842 3.269008 0.506007 0.350306 1.484601 0.834996
13.233333 0.194321 3.318283 0.522155 0.317280 1.454770 0.754747
13.266667 0.202893 3.365961 0.545801 0.286871 1.422471 0.662583
13.300000 0.211026 3.413610 0.563203 0.259154 1.387549 0.560793
13.333333 0.218582 3.458912 0.579221 0.234566 1.350514 0.452975
13.366667 0.225701 3.504142 0.581837 0.213428 1.311671 0.339167
13.400000 0.232483 3.547642 0.588978 0.195761 1.271827 0.222743
13.433333 0.238829 3.591033 0.603955 0.181771 1.231736 0.100528
13.466667 0.243863 3.631246 0.606963 0.171899 1.192186 -0.026682
13.500000 0.248463 3.671319 0.624084 0.166402 1.154620 -0.164502
13.533333 0.252469 3.706701 0.615837 0.165449 1.120220 -0.310851
13.566667 0.256046 3.741921 0.602758 0.168784 1.090193 -0.463829
13.600000 0.259196 3.776970 0.578219 0.176303 1.065190 -0.622122
13.633333 0.264352 3.809190 0.573474 0.187769 1.046198 -0.778838
13.666667 0.269083 3.841228 0.531089 0.202356 1.033465 -0.929071
13.700000 0.277167 3.873676 0.488120 0.218671 1.026529 -1.059540
13.733333 0.284820 3.905936 0.454470 0.235305 1.024357 -1.168558
13.766667 0.292036 3.938000 0.394586 0.251126 1.026177 -1.248206
13.800000 0.301691 3.972003 0.351911 0.264752 1.031167 -1.297652
13.833333 0.313586 4.008372 0.283059 0.274986 1.037847 -1.313359
13.866667 0.325017 4.044528 0.236429 0.280950 1.045164 -1.298422
13.900000 0.335973 4.080462 0.177665 0.282422 1.052479 -1.256936
13.933333 0.346442 4.116162 0.135589 0.279001 1.059746 -1.188736
13.966667 0.356415 4.151621 0.093046 0.270212 1.066609 -1.101623
14.000000 0.365881 4.186828 0.066375 0.256067 1.073070 -0.999141
14.033333 0.374829 4.221774 0.032970 0.236648 1.079863 -0.887254
14.066667 0.383251 4.256451 0.001182 0.212044 1.087718 -0.769538
14.100000 0.390654 4.293440 -0.009434 0.182377 1.096872 -0.654915
14.133333 0.397509 4.330139 -0.036416 0.148081 1.107036 -0.549271
14.166667 0.403807 4.366536 -0.063554 0.109874 1.117880 -0.455929
14.200000 0.409537 4.402619 -0.070228 0.068199 1.128645 -0.374102
14.233333 0.412273 4.439592 -0.073029 0.023838 1.138091 -0.308729
14.266667 0.412042 4.478774 -0.070998 -0.022232 1.144510 -0.258985
14.300000 0.409311 4.519119 -0.062954 -0.068932 1.146343 -0.219536
14.333333 0.405991 4.559091 -0.083212 -0.115131 1.142058 -0.185706
14.366667 0.399924 4.599645 -0.066974 -0.159676 1.130176 -0.156320
14.400000 0.393269 4.639791 -0.077467 -0.201237 1.109431 -0.128484
14.433333 0.384843 4.679184 -0.092789 -0.238928 1.078617 -0.095885
14.466667 0.374732 4.716955 -0.104053 -0.272152 1.037577 -0.059826
14.500000 0.364046 4.754270 -0.119166 -0.300746 0.986806 -0.020177
14.533333 0.352314 4.788048 -0.119247 -0.324829 0.927814 0.017104
14.566667 0.340021 4.821344 -0.123756 -0.344885 0.862391 0.054761
14.600000 0.327034 4.851041 -0.109182 -0.361633 0.792947 0.084052
14.633333 0.313840 4.876451 -0.102515 -0.375837 0.722685 0.098611
14.666667 0.300854 4.896693 -0.079314 -0.388260 0.654715 0.101398
14.700000 0.287343 4.916438 -0.075530 -0.399482 0.591701 0.091799
14.733333 0.274526 4.932046 -0.044527 -0.410010 0.535571 0.070354
14.766667 0.261674 4.943979 -0.037130 -0.420038 0.488416 0.036299
14.800000 0.248319 4.955435 -0.060262 -0.429495 0.451700 -0.000482
14.833333 0.234467 4.966427 -0.071849 -0.438134 0.425974 -0.033436
14.866667 0.218952 4.977773 -0.072222 -0.445408 0.410874 -0.064126
14.900000 0.202946 4.990035 -0.080754 -0.450763 0.406060 -0.091295
14.933333 0.186459 5.001862 -0.094666 -0.453648 0.411006 -0.106330
14.966667 0.170289 5.014475 -0.117270 -0.454154 0.424214 -0.103153
15.000000 0.154410 5.028891 -0.094806 -0.452800 0.443853 -0.086745
15.033333 0.138066 5.042896 -0.089970 -0.450300 0.468150 -0.056886
15.066667 0.121263 5.056496 -0.096525 -0.448340 0.495388 -0.009660
15.100000 0.106111 5.072281 -0.093890 -0.448792 0.523555 0.053772
15.133333 0.092759 5.090075 -0.096881 -0.453525 0.550528 0.126513
15.166667 0.080354 5.109570 -0.111092 -0.463647 0.574711 0.197684
15.200000 0.068857 5.131194 -0.119825 -0.480055 0.594875 0.267631
15.233333 0.056996 5.154227 -0.114705 -0.503533 0.609815 0.332697
15.266667 0.042933 5.178159 -0.100073 -0.533399 0.618826 0.387201
15.300000 0.024788 5.201541 -0.055249 -0.568576 0.621545 0.425958
15.333333 0.006187 5.224508 -0.023792 -0.607858 0.617970 0.445191
15.366667 -0.012865 5.247055 0.007715 -0.650261 0.608190 0.446067
15.400000 -0.038951 5.266430 0.032159 -0.694087 0.592763 0.426597
15.433333 -0.065467 5.285369 0.047127 -0.737758 0.572416 0.384965
15.466667 -0.092402 5.303871 0.056012 -0.780526 0.547719 0.322325
15.500000 -0.119742 5.321933 0.050856 -0.821881 0.519293 0.247114
15.533333 -0.147473 5.339552 0.044146 -0.861291 0.487871 0.170037
15.566667 -0.175583 5.356726 0.061330 -0.897868 0.454305 0.095889
15.600000 -0.204057 5.373454 0.078160 -0.931940 0.418776 0.026971
15.633333 -0.236160 5.388018 0.071772 -0.963300 0.381749 -0.031170
15.666667 -0.269852 5.400275 0.053115 -0.991506 0.344030 -0.075874
15.700000 -0.305017 5.410249 0.049290 -1.015994 0.306454 -0.110155
15.733333 -0.340471 5.419776 0.044947 -1.036310 0.269699 -0.140790
15.766667 -0.377817 5.427167 0.035576 -1.052529 0.234470 -0.167499
15.800000 -0.415347 5.432322 0.031688 -1.063844 0.201937 -0.187911
15.833333 -0.453099 5.437047 0.013025 -1.069871 0.172907 -0.204702
15.866667 -0.491051 5.441353 0.022673 -1.070194 0.147779 -0.221710
15.900000 -0.525796 5.445004 0.017693 -1.064881 0.126663 -0.241013
15.933333 -0.560699 5.448255 0.002516 -1.053796 0.109737 -0.261990
15.966667 -0.595742 5.451117 0.001966 -1.036799 0.096873 -0.285645
16.000000 -0.630906 5.453598 -0.012530 -1.014432 0.087471 -0.312145
16.033333 -0.666171 5.455707 -0.028308 -0.987399 0.081049 -0.340951
16.066667 -0.701520 5.457456 -0.031162 -0.956656 0.077278 -0.367150
16.100000 -0.736933 5.458852 -0.046158 -0.922314 0.076057 -0.382833
16.133333 -0.768264 5.460925 -0.056822 -0.885083 0.077164 -0.384065
16.166667 -0.796449 5.463485 -0.071589 -0.845669 0.080525 -0.369849
16.200000 -0.821771 5.466369 -0.086889 -0.804687 0.086245 -0.339839
16.233333 -0.847110 5.468943 -0.127218 -0.762875 0.094322 -0.287798
16.266667 -0.869959 5.472098 -0.148319 -0.721193 0.104515 -0.210645
16.300000 -0.892814 5.474959 -0.150000 -0.681260 0.116368 -0.113540
16.333333 -0.915670 5.477533 -0.148036 -0.644333 0.129370 0.002917
16.366667 -0.937281 5.481257 -0.155412 -0.611627 0.142705 0.140099
16.400000 -0.957392 5.485982 -0.153358 -0.584190 0.155307 0.296267
16.433333 -0.975216 5.491859 -0.132182 -0.563026 0.165731 0.461207
16.466667 -0.991057 5.498870 -0.108973 -0.548755 0.172668 0.625512
16.500000 -1.005299 5.506539 -0.108423 -0.542202 0.174661 0.789897
16.533333 -1.019550 5.513945 -0.079857 -0.544245 0.170251 0.946482
16.566667 -1.036033 5.521877 -0.032430 -0.555787 0.158414 1.084552
16.600000 -1.052535 5.529543 0.018183 -0.577321 0.138787 1.195144
16.633333 -1.069059 5.536944 0.062285 -0.608641 0.111822 1.274472
16.666667 -1.088066 5.543366 0.130730 -0.649206 0.078195 1.318536
16.700000 -1.108560 5.547516 0.171583 -0.697529 0.039305 1.317083
16.733333 -1.131418 5.548411 0.224044 -0.751544 -0.002946 1.270529
16.766667 -1.157229 5.546034 0.289763 -0.808445 -0.046373 1.170097
16.800000 -1.183046 5.543399 0.338605 -0.865788 -0.088866 1.025060
16.833333 -1.212128 5.538166 0.403140 -0.921290 -0.128485 0.838827
16.866667 -1.244701 5.530839 0.436218 -0.973304 -0.163288 0.619654
16.900000 -1.283729 5.522206 0.436218 -1.020487 -0.191752 0.377732
16.933333 -1.322703 5.513353 0.436218 -1.062183 -0.213007 0.120567
16.966667 -1.361601 5.504295 0.436218 -1.098614 -0.226760 -0.115448
17.000000 -1.400401 5.495047 0.436218 -1.129930 -0.233285 -0.327756
17.033333 -1.439080 5.485623 0.436218 -1.156830 -0.233254 -0.506460
17.066667 -1.477616 5.476038 0.436218 -1.179695 -0.227763 -0.645835
17.100000 -1.515987 5.466307 0.253529 -1.199328 -0.218042 -0.729852
17.133333 -1.554651 5.459808 0.262002 -1.216011 -0.205230 -0.760979
17.166667 -1.593108 5.453189 0.234715 -1.229729 -0.190401 -0.757060
17.200000 -1.635538 5.447446 0.204345 -1.240159 -0.174429 -0.720664
17.233333 -1.679960 5.442876 0.180927 -1.246521 -0.158103 -0.655865
17.266667 -1.724098 5.438209 0.161565 -1.247796 -0.141801 -0.569026
17.300000 -1.768252 5.434544 0.148911 -1.242927 -0.125981 -0.494244
17.333333 -1.812062 5.430798 0.149465 -1.231125 -0.110724 -0.431797
17.366667 -1.855501 5.426980 0.128681 -1.211635 -0.096019 -0.382003
17.400000 -1.898538 5.423096 0.138934 -1.184080 -0.081642 -0.346967
17.433333 -1.939142 5.420292 0.142606 -1.148275 -0.067203 -0.329814
17.466667 -1.975845 5.418984 0.135205 -1.104578 -0.052796 -0.330427
17.500000 -2.012070 5.417633 0.116890 -1.052853 -0.038269 -0.329525
17.533333 -2.047796 5.416241 0.097152 -0.993429 -0.023777 -0.326245
17.566667 -2.083001 5.414814 0.075129 -0.926318 -0.009554 -0.323202
17.600000 -2.114076 5.415445 0.063350 -0.852158 0.003816 -0.317270
17.633333 -2.144593 5.416049 0.037666 -0.771784 0.015736 -0.304226
17.666667 -2.169854 5.417536 0.022505 -0.686137 0.026084 -0.283595
17.700000 -2.194530 5.419001 0.028497 -0.596765 0.034925 -0.260404
17.733333 -2.214609 5.420995 0.034210 -0.505162 0.042352 -0.236505
17.766667 -2.229803 5.423552 0.023958 -0.413824 0.048580 -0.211662
17.800000 -2.240171 5.426025 0.022848 -0.324548 0.054327 -0.190290
17.833333 -2.245275 5.428086 0.023513 -0.239328 0.060301 -0.176571
17.866667 -2.249789 5.430135 -0.001434 -0.159648 0.066928 -0.168714
17.900000 -2.249858 5.431178 -0.010251 -0.087388 0.074096 -0.164108
17.933333 -2.249361 5.432211 -0.004254 -0.023982 0.081626 -0.162266
17.966667 -2.248313 5.433236 -0.008474 0.029987 0.089277 -0.160869
18.000000 -2.245261 5.435516 -0.012953 0.073842 0.096211 -0.155088
18.033333 -2.239889 5.440310 -0.016301 0.107476 0.101217 -0.143958
18.066667 -2.234021 5.445090 -0.027491 0.130722 0.103286 -0.129489
18.100000 -2.227677 5.449854 -0.035305 0.144543 0.101638 -0.109554
18.133333 -2.219415 5.455897 -0.049279 0.149930 0.095660 -0.079583
18.166667 -2.210719 5.461915 -0.041953 0.147893 0.084624 -0.042213
18.200000 -2.202769 5.466891 -0.030340 0.139820 0.068165 -0.000584
18.233333 -2.196393 5.469843 -0.045483 0.127316 0.046739 0.046494
18.266667 -2.192452 5.470848 -0.062240 0.112130 0.020880 0.096436
18.300000 -2.190451 5.470926 -0.046953 0.095718 -0.008582 0.144070
18.333333 -2.189832 5.469885 -0.037001 0.079521 -0.040615 0.180349
18.366667 -2.189700 5.467654 -0.036902 0.064881 -0.073724 0.206014
18.400000 -2.189242 5.465380 -0.009773 0.052597 -0.106239 0.219784
18.433333 -2.188475 5.461268 0.004608 0.042921 -0.136975 0.219108
18.466667 -2.187402 5.457119 0.016895 0.035640 -0.164769 0.204719
18.500000 -2.186198 5.450286 0.029134 0.030181 -0.188201 0.177382
18.533333 -2.185109 5.440695 0.044804 0.025914 -0.205619 0.142305
18.566667 -2.183741 5.431088 0.044161 0.022052 -0.215789 0.098921
18.600000 -2.182105 5.421475 0.036477 0.017981 -0.217326 0.051853
18.633333 -2.180212 5.411865 0.040402 0.013245 -0.208986 0.002972
18.666667 -2.180143 5.402822 0.017078 0.007776 -0.190025 -0.042869
18.700000 -2.179836 5.393800 0.016388 0.001642 -0.160747 -0.079812
18.733333 -2.181067 5.385758 0.021816 -0.004987 -0.122642 -0.104544
18.766667 -2.182075 5.377753 0.031147 -0.011873 -0.077118 -0.116639
18.800000 -2.182751 5.373392 0.032053 -0.018659 -0.026605 -0.118707
18.833333 -2.183053 5.373092 0.008560 -0.025027 0.026324 -0.109283
18.866667 -2.183449 5.377515 -0.006102 -0.030973 0.079074 -0.093134
18.900000 -2.183661 5.381982 -0.020027 -0.036462 0.129603 -0.075462
18.933333 -2.185935 5.392031 -0.019686 -0.041485 0.176130 -0.062473
18.966667 -2.188040 5.402106 -0.017932 -0.046055 0.216819 -0.051649
19.000000 -2.189980 5.412195 -0.014840 -0.050095 0.250577 -0.043917
19.033333 -2.191760 5.422287 -0.005340 -0.053440 0.276887 -0.044635
19.066667 -2.193384 5.432370 0.012458 -0.055801 0.296024 -0.054147
19.100000 -2.194857 5.442433 0.001128 -0.056840 0.307856 -0.070593
19.133333 -2.197382 5.453983 0.008464 -0.056484 0.313089 -0.089987
19.166667 -2.200108 5.466086 0.003251 -0.054593 0.312510 -0.113242
19.200000 -2.202703 5.477832 -0.004392 -0.051252 0.306900 -0.137906
19.233333 -2.205160 5.489505 -0.024632 -0.046593 0.296764 -0.155584
19.266667 -2.206646 5.500421 -0.043705 -0.040592 0.281638 -0.160295
19.300000 -2.208253 5.510506 -0.039747 -0.033310 0.261951 -0.149570
19.333333 -2.209043 5.519645 -0.042964 -0.024755 0.237556 -0.121561
19.366667 -2.209707 5.528664 -0.059022 -0.015016 0.208349 -0.077427
19.400000 -2.210250 5.537551 -0.057736 -0.004237 0.173924 -0.020605
19.433333 -2.210059 5.541334 -0.069558 0.007281 0.134208 0.040764
19.466667 -2.209752 5.544970 -0.065587 0.018973 0.090251 0.098711
19.500000 -2.209332 5.548454 -0.056699 0.030223 0.042493 0.143774
19.533333 -2.208804 5.551780 -0.053962 0.040484 -0.008117 0.169446
19.566667 -2.208173 5.554944 -0.042849 0.049228 -0.060719 0.173835
19.600000 -2.205025 5.550583 -0.030207 0.055930 -0.113465 0.159345
19.633333 -2.201779 5.546059 0.008726 0.060378 -0.165164 0.127406
19.666667 -2.197800 5.536733 0.040360 0.062441 -0.214797 0.081712
19.700000 -2.193736 5.527257 0.036383 0.062097 -0.261106 0.033685
19.733333 -2.190910 5.515379 0.023513 0.059518 -0.302958 -0.010614
19.766667 -2.189269 5.502352 0.002251 0.054970 -0.338968 -0.046290
19.800000 -2.187557 5.489203 -0.009464 0.049034 -0.369090 -0.072289
19.833333 -2.186474 5.475054 -0.043665 0.042152 -0.392791 -0.081381
19.866667 -2.185828 5.460745 -0.045958 0.034916 -0.410163 -0.071392
19.900000 -2.185210 5.445858 -0.047495 0.027921 -0.421401 -0.048543
19.933333 -2.184746 5.430567 -0.044676 0.021517 -0.427060 -0.019749
19.966667 -2.184229 5.415219 -0.038828 0.015888 -0.428084 0.010120
20.000000 -2.183662 5.399827 -0.025958 0.011012 -0.424633 0.037067
20.033333 -2.183367 5.384779 -0.014010 0.006862 -0.417235 0.052380
20.066667 -2.183027 5.369716 0.000930 0.003305 -0.406102 0.052545
20.100000 -2.182941 5.355698 0.001024 0.000176 -0.391426 0.039252
20.133333 -2.182997 5.341992 -0.003521 -0.002600 -0.373291 0.018548
20.166667 -2.183518 5.329415 -0.007697 -0.004977 -0.351709 -0.007165
20.200000 -2.183995 5.318641 -0.005742 -0.006896 -0.327325 -0.034231
20.233333 -2.184441 5.307910 -0.007003 -0.008332 -0.300557 -0.057462
20.266667 -2.184855 5.297231 -0.026494 -0.009290 -0.272151 -0.073275
20.300000 -2.185240 5.286614 -0.023753 -0.009785 -0.242967 -0.083311
20.333333 -2.185783 5.279122 -0.034650 -0.009822 -0.213982 -0.087861
20.366667 -2.186301 5.271706 -0.034145 -0.009484 -0.185967 -0.088748
20.400000 -2.186377 5.267224 -0.034078 -0.008879 -0.159348 -0.085577
20.433333 -2.186630 5.264808 -0.029110 -0.008071 -0.134743 -0.081417
20.466667 -2.186866 5.262476 -0.033505 -0.007088 -0.112534 -0.078240
20.500000 -2.187085 5.260231 -0.036420 -0.005985 -0.093048 -0.073908
20.533333 -2.187289 5.258072 -0.045306 -0.004846 -0.076254 -0.070984
20.566667 -2.187479 5.255999 -0.037231 -0.003727 -0.062245 -0.067710
20.600000 -2.187655 5.254013 -0.047705 -0.002665 -0.050854 -0.064780
20.633333 -2.187819 5.252113 -0.055191 -0.001723 -0.041596 -0.059386
20.666667 -2.187925 5.251048 -0.046963 -0.000969 -0.034046 -0.054116
20.700000 -2.187929 5.250298 -0.062710 -0.000403 -0.027719 -0.047240
20.733333 -2.187634 5.250047 -0.055820 -0.000004 -0.022375 -0.039743
20.766667 -2.187331 5.249879 -0.057568 0.000259 -0.017754 -0.031908
20.800000 -2.187022 5.249792 -0.052705 0.000380 -0.013787 -0.025499
