t x y theta dxdt dydt dthetadt
0.000000 0.000000 0.000000 0.351667 -0.127971 -0.080818 4.403452
0.033333 -0.004308 -0.002724 0.525947 -0.131113 -0.082818 5.158722
0.066667 -0.008718 -0.005514 0.766422 -0.134291 -0.084831 5.824025
0.100000 -0.013236 -0.008372 0.944951 -0.137505 -0.086856 6.356923
0.133333 -0.017864 -0.011299 1.192855 -0.140751 -0.088893 6.716669
0.166667 -0.022602 -0.014294 1.516251 -0.144025 -0.090942 6.863941
0.200000 -0.027453 -0.017358 1.904303 -0.147321 -0.093001 6.788730
0.233333 -0.032417 -0.020491 2.193361 -0.150637 -0.095072 6.510423
0.266667 -0.037495 -0.023693 2.461941 -0.153966 -0.097153 6.064605
0.300000 -0.042688 -0.026964 2.696863 -0.157304 -0.099247 5.476748
0.333333 -0.047988 -0.030305 2.892206 -0.160650 -0.101353 4.786075
0.366667 -0.053395 -0.033715 2.966565 -0.164004 -0.103474 4.049918
0.400000 -0.058920 -0.037195 3.063116 -0.167365 -0.105612 3.320782
0.433333 -0.064552 -0.040746 3.121583 -0.170736 -0.107767 2.629032
0.466667 -0.070293 -0.044368 -3.109959 -0.174121 -0.109942 2.004918
0.500000 -0.076152 -0.048066 -3.090580 -0.177521 -0.112135 1.472442
0.533333 -0.082119 -0.051835 -3.071584 -0.180938 -0.114347 1.047163
0.566667 -0.088196 -0.055676 -3.044943 -0.184371 -0.116577 0.717573
0.600000 -0.094392 -0.059594 -3.055307 -0.187822 -0.118824 0.471397
0.633333 -0.100706 -0.063590 -3.042189 -0.191287 -0.121084 0.296112
0.666667 -0.107140 -0.067663 -3.038550 -0.194763 -0.123356 0.174686
0.700000 -0.113694 -0.071814 -3.053974 -0.198247 -0.125636 0.093379
0.733333 -0.120359 -0.076038 -3.061755 -0.201733 -0.127922 0.034762
0.766667 -0.127145 -0.080341 -3.063835 -0.205219 -0.130210 -0.008791
0.800000 -0.134042 -0.084718 -3.063141 -0.208701 -0.132499 -0.047636
0.833333 -0.141061 -0.089174 -3.079293 -0.212179 -0.134788 -0.079764
0.866667 -0.148192 -0.093705 -3.060727 -0.215653 -0.137077 -0.099848
0.900000 -0.155445 -0.098316 -3.047743 -0.219124 -0.139365 -0.106090
0.933333 -0.162810 -0.103002 -3.045002 -0.222596 -0.141654 -0.087353
0.966667 -0.170288 -0.107761 -3.040847 -0.226071 -0.143947 -0.031971
1.000000 -0.177877 -0.112596 -3.064547 -0.229551 -0.146244 0.066558
1.033333 -0.185579 -0.117504 -3.094104 -0.233038 -0.148548 0.202371
1.066667 -0.193392 -0.122488 -3.120188 -0.236535 -0.150862 0.364511
1.100000 -0.201332 -0.127555 3.131863 -0.240046 -0.153190 0.543738
1.133333 -0.209399 -0.132701 3.138847 -0.243573 -0.155539 0.714204
1.166667 -0.217579 -0.137921 -3.093775 -0.247117 -0.157911 0.845370
1.200000 -0.225869 -0.143216 -3.015009 -0.250678 -0.160308 0.905740
1.233333 -0.234272 -0.148585 -2.973192 -0.254256 -0.162733 0.874820
1.266667 -0.242802 -0.154042 -2.872978 -0.257847 -0.165184 0.729636
1.300000 -0.251462 -0.159589 -2.773273 -0.261444 -0.167656 0.453212
1.333333 -0.260232 -0.165210 -2.719480 -0.265042 -0.170143 0.050885
1.366667 -0.269113 -0.170904 -2.677013 -0.268640 -0.172641 -0.460148
1.400000 -0.278126 -0.176695 -2.686825 -0.272236 -0.175147 -1.045696
1.433333 -0.287270 -0.182583 -2.757050 -0.275830 -0.177656 -1.675524
1.466667 -0.296549 -0.188572 -2.846980 -0.279423 -0.180166 -2.298932
1.500000 -0.305936 -0.194635 -2.942738 -0.283015 -0.182675 -2.864404
1.533333 -0.315430 -0.200769 -3.093247 -0.286611 -0.185184 -3.330356
1.566667 -0.325032 -0.206976 3.063187 -0.290212 -0.187692 -3.661259
1.600000 -0.334741 -0.213254 2.860048 -0.293812 -0.190195 -3.830591
1.633333 -0.344591 -0.219634 2.649024 -0.297409 -0.192690 -3.815403
1.666667 -0.354547 -0.226085 2.475569 -0.301003 -0.195178 -3.617483
1.700000 -0.364645 -0.232636 2.336186 -0.304589 -0.197658 -3.249218
1.733333 -0.374884 -0.239286 2.200647 -0.308153 -0.200119 -2.737417
1.766667 -0.385227 -0.246006 2.084056 -0.311688 -0.202556 -2.117405
1.800000 -0.395671 -0.252794 1.979585 -0.315191 -0.204967 -1.440008
1.833333 -0.406252 -0.259679 1.919613 -0.318660 -0.207351 -0.762615
1.866667 -0.416968 -0.266660 1.910562 -0.322094 -0.209703 -0.128213
1.900000 -0.427783 -0.273707 1.992762 -0.325494 -0.212026 0.420155
1.933333 -0.438696 -0.280820 2.085711 -0.328879 -0.214328 0.854994
1.966667 -0.449706 -0.287998 2.225901 -0.332259 -0.216619 1.152194
2.000000 -0.460812 -0.295239 2.305288 -0.335642 -0.218901 1.312168
2.033333 -0.472050 -0.302572 2.399537 -0.339032 -0.221178 1.347558
2.066667 -0.483382 -0.309968 2.452466 -0.342435 -0.223453 1.277510
2.100000 -0.494846 -0.317452 2.511721 -0.345847 -0.225727 1.133540
2.133333 -0.506442 -0.325024 2.515240 -0.349251 -0.227988 0.951038
2.166667 -0.518127 -0.332656 2.515404 -0.352632 -0.230227 0.772317
2.200000 -0.529942 -0.340372 2.510728 -0.355970 -0.232435 0.624778
2.233333 -0.541886 -0.348172 2.507893 -0.359251 -0.234603 0.530592
2.266667 -0.553955 -0.356053 2.506369 -0.362459 -0.236725 0.496814
2.300000 -0.566149 -0.364015 2.499995 -0.365581 -0.238796 0.531495
2.333333 -0.578424 -0.372031 2.504221 -0.368615 -0.240816 0.625396
2.366667 -0.590779 -0.380100 2.519237 -0.371556 -0.242785 0.764074
2.400000 -0.603212 -0.388221 2.557823 -0.374408 -0.244708 0.933376
2.433333 -0.615756 -0.396418 2.591560 -0.377171 -0.246585 1.123587
2.466667 -0.628375 -0.404663 2.642365 -0.379849 -0.248421 1.326604
2.500000 -0.641098 -0.412982 2.681300 -0.382447 -0.250220 1.526338
2.533333 -0.653892 -0.421348 2.747109 -0.384968 -0.251985 1.717686
2.566667 -0.666781 -0.429783 2.791749 -0.387413 -0.253718 1.896259
2.600000 -0.679764 -0.438288 2.841812 -0.389779 -0.255420 2.064743
2.633333 -0.692837 -0.446861 2.966043 -0.392065 -0.257091 2.214767
2.666667 -0.705973 -0.455474 3.048466 -0.394265 -0.258726 2.348533
2.700000 -0.719169 -0.464127 3.114251 -0.396376 -0.260322 2.462559
2.733333 -0.732425 -0.472818 -3.084045 -0.398392 -0.261871 2.554747
2.766667 -0.745752 -0.481572 -2.992711 -0.400313 -0.263369 2.630005
2.800000 -0.759146 -0.490386 -2.921611 -0.402138 -0.264808 2.684104
2.833333 -0.772604 -0.499257 -2.789033 -0.403870 -0.266183 2.720500
2.866667 -0.786121 -0.508182 -2.675335 -0.405511 -0.267484 2.737605
2.900000 -0.799686 -0.517136 -2.620616 -0.407059 -0.268703 2.741215
2.933333 -0.813302 -0.526137 -2.516172 -0.408514 -0.269831 2.732591
2.966667 -0.826966 -0.535179 -2.424705 -0.409876 -0.270859 2.702960
3.000000 -0.840673 -0.544258 -2.326828 -0.411141 -0.271778 2.648307
3.033333 -0.854420 -0.553361 -2.246161 -0.412308 -0.272583 2.571609
3.066667 -0.868203 -0.562484 -2.168866 -0.413376 -0.273270 2.467496
3.100000 -0.882021 -0.571627 -2.049248 -0.414342 -0.273836 2.323448
3.133333 -0.895871 -0.580788 -1.966421 -0.415207 -0.274282 2.135906
3.166667 -0.909745 -0.589960 -1.915515 -0.415971 -0.274611 1.909428
3.200000 -0.923648 -0.599146 -1.810257 -0.416636 -0.274828 1.645416
3.233333 -0.937575 -0.608345 -1.749860 -0.417207 -0.274942 1.342410
3.266667 -0.951518 -0.617542 -1.693355 -0.417687 -0.274963 1.009711
3.300000 -0.965471 -0.626732 -1.660694 -0.418085 -0.274904 0.668077
3.333333 -0.979432 -0.635912 -1.641907 -0.418406 -0.274777 0.332175
3.366667 -0.993396 -0.645075 -1.656113 -0.418658 -0.274595 0.013003
3.400000 -1.007360 -0.654219 -1.675574 -0.418844 -0.274366 -0.265954
3.433333 -1.021335 -0.663365 -1.709739 -0.418968 -0.274097 -0.486606
3.466667 -1.035303 -0.672484 -1.757877 -0.419029 -0.273792 -0.635707
3.500000 -1.049279 -0.681603 -1.798207 -0.419026 -0.273449 -0.707122
3.533333 -1.063259 -0.690718 -1.845992 -0.418955 -0.273068 -0.695463
3.566667 -1.077243 -0.699829 -1.911219 -0.418811 -0.272642 -0.601595
3.600000 -1.091228 -0.708935 -1.928170 -0.418588 -0.272164 -0.440084
3.633333 -1.105211 -0.718032 -1.959642 -0.418277 -0.271625 -0.223321
3.666667 -1.119168 -0.727092 -1.978856 -0.417872 -0.271017 0.031840
3.700000 -1.133120 -0.736140 -1.984749 -0.417366 -0.270334 0.306427
3.733333 -1.147038 -0.745148 -1.949380 -0.416760 -0.269574 0.576833
3.766667 -1.160947 -0.754141 -1.922854 -0.416052 -0.268739 0.825285
3.800000 -1.174817 -0.763091 -1.862177 -0.415244 -0.267830 1.031914
3.833333 -1.188673 -0.772025 -1.803383 -0.414343 -0.266856 1.166753
3.866667 -1.202485 -0.780912 -1.731549 -0.413359 -0.265828 1.200802
3.900000 -1.216279 -0.789780 -1.699291 -0.412301 -0.264757 1.114855
3.933333 -1.230023 -0.798599 -1.628332 -0.411176 -0.263646 0.903714
3.966667 -1.243716 -0.807368 -1.561494 -0.409997 -0.262509 0.554572
4.000000 -1.257353 -0.816086 -1.491853 -0.408780 -0.261357 0.075194
4.033333 -1.270965 -0.824779 -1.463048 -0.407537 -0.260200 -0.501562
4.066667 -1.284550 -0.833446 -1.433715 -0.406272 -0.259041 -1.131797
4.100000 -1.298071 -0.842058 -1.433814 -0.404994 -0.257886 -1.777599
4.133333 -1.311529 -0.850616 -1.490572 -0.403708 -0.256739 -2.408133
4.166667 -1.324953 -0.859144 -1.655442 -0.402410 -0.255597 -2.963369
4.200000 -1.338342 -0.867642 -1.862734 -0.401092 -0.254454 -3.402540
4.233333 -1.351695 -0.876106 -2.090653 -0.399746 -0.253301 -3.704750
4.266667 -1.365010 -0.884538 -2.213779 -0.398368 -0.252135 -3.867151
4.300000 -1.378285 -0.892934 -2.451366 -0.396950 -0.250949 -3.879356
4.333333 -1.391519 -0.901295 -2.611298 -0.395481 -0.249735 -3.745102
4.366667 -1.404709 -0.909620 -2.733849 -0.393952 -0.248482 -3.509746
4.400000 -1.417825 -0.917888 -2.824845 -0.392356 -0.247187 -3.214016
4.433333 -1.430895 -0.926118 -2.925036 -0.390685 -0.245839 -2.895343
4.466667 -1.443888 -0.934290 -2.993925 -0.388934 -0.244433 -2.578338
4.500000 -1.456831 -0.942421 -3.020643 -0.387102 -0.242967 -2.302716
4.533333 -1.469724 -0.950511 -3.080446 -0.385193 -0.241441 -2.080876
4.566667 -1.482565 -0.958558 -3.136670 -0.383211 -0.239858 -1.895253
4.600000 -1.495322 -0.966543 3.096044 -0.381162 -0.238224 -1.732486
4.633333 -1.508025 -0.974484 3.043087 -0.379054 -0.236542 -1.589776
4.666667 -1.520644 -0.982356 3.008142 -0.376888 -0.234817 -1.468655
4.700000 -1.533178 -0.990160 2.922027 -0.374665 -0.233050 -1.374518
4.733333 -1.545625 -0.997893 2.866848 -0.372389 -0.231248 -1.332133
4.766667 -1.557983 -1.005555 2.812227 -0.370068 -0.229416 -1.389852
4.800000 -1.570280 -1.013168 2.713660 -0.367709 -0.227562 -1.573091
4.833333 -1.582513 -1.020731 2.679693 -0.365321 -0.225696 -1.887213
4.866667 -1.594683 -1.028244 2.733229 -0.362915 -0.223824 -2.327284
4.900000 -1.606759 -1.035685 2.822481 -0.360495 -0.221950 -2.858195
4.933333 -1.618739 -1.043053 2.856509 -0.358066 -0.220078 -3.431683
4.966667 -1.630623 -1.050349 2.756568 -0.355626 -0.218205 -3.949185
5.000000 -1.642411 -1.057572 2.571240 -0.353176 -0.216331 -4.345180
5.033333 -1.654129 -1.064743 2.221247 -0.350717 -0.214455 -4.541677
5.066667 -1.665778 -1.071859 1.970562 -0.348251 -0.212576 -4.471079
5.100000 -1.677356 -1.078920 1.590205 -0.345780 -0.210695 -4.079791
5.133333 -1.688863 -1.085927 1.319847 -0.343303 -0.208810 -3.352494
5.166667 -1.700276 -1.092864 1.081985 -0.340820 -0.206917 -2.345365
5.200000 -1.711595 -1.099730 0.923636 -0.338328 -0.205016 -1.101272
5.233333 -1.722822 -1.106527 0.913694 -0.335826 -0.203103 0.280704
5.266667 -1.733974 -1.113267 1.022518 -0.333312 -0.201179 1.689051
5.300000 -1.745051 -1.119951 1.308401 -0.330789 -0.199244 2.979709
5.333333 -1.756039 -1.126565 1.481227 -0.328263 -0.197304 4.059972
5.366667 -1.766939 -1.133111 1.706316 -0.325738 -0.195365 4.875401
5.400000 -1.777751 -1.139587 1.993425 -0.323220 -0.193430 5.372630
5.433333 -1.788477 -1.145996 2.321698 -0.320708 -0.191504 5.544376
5.466667 -1.799116 -1.152337 2.580253 -0.318205 -0.189590 5.424945
5.500000 -1.809678 -1.158619 2.765658 -0.315710 -0.187690 5.094735
5.533333 -1.820160 -1.164843 2.980986 -0.313222 -0.185803 4.601458
5.566667 -1.830558 -1.170999 3.136139 -0.310737 -0.183930 3.999650
5.600000 -1.840876 -1.177096 -3.088897 -0.308254 -0.182070 3.358253
5.633333 -1.851114 -1.183134 -3.015284 -0.305771 -0.180220 2.741174
5.666667 -1.861267 -1.189110 -2.971889 -0.303285 -0.178377 2.178962
5.700000 -1.871338 -1.195027 -2.939373 -0.300792 -0.176538 1.681011
5.733333 -1.881324 -1.200880 -2.903435 -0.298292 -0.174700 1.268412
5.766667 -1.891228 -1.206674 -2.907469 -0.295783 -0.172861 0.951968
5.800000 -1.901045 -1.212405 -2.876378 -0.293265 -0.171020 0.714969
5.833333 -1.910781 -1.218077 -2.859362 -0.290740 -0.169178 0.538644
5.866667 -1.920434 -1.223689 -2.859279 -0.288209 -0.167335 0.410512
5.900000 -1.930001 -1.229237 -2.858089 -0.285675 -0.165492 0.317997
5.933333 -1.939482 -1.234722 -2.848669 -0.283137 -0.163650 0.248970
5.966667 -1.948876 -1.240144 -2.837886 -0.280597 -0.161811 0.184101
6.000000 -1.958184 -1.245503 -2.832137 -0.278057 -0.159975 0.121557
6.033333 -1.967409 -1.250802 -2.811404 -0.275516 -0.158144 0.054398
6.066667 -1.976551 -1.256042 -2.823447 -0.272976 -0.156320 -0.020091
6.100000 -1.985609 -1.261222 -2.813188 -0.270438 -0.154502 -0.102492
6.133333 -1.994581 -1.266341 -2.828916 -0.267902 -0.152691 -0.191301
6.166667 -2.003469 -1.271400 -2.830490 -0.265367 -0.150889 -0.276771
6.200000 -2.012271 -1.276397 -2.828014 -0.262835 -0.149094 -0.351614
6.233333 -2.020990 -1.281335 -2.832913 -0.260304 -0.147305 -0.406809
6.266667 -2.029624 -1.286213 -2.849754 -0.257775 -0.145523 -0.441335
6.300000 -2.038173 -1.291031 -2.888381 -0.255246 -0.143747 -0.451170
6.333333 -2.046639 -1.295792 -2.949556 -0.252718 -0.141976 -0.435340
6.366667 -2.055020 -1.300494 -2.986425 -0.250190 -0.140210 -0.394438
6.400000 -2.063319 -1.305139 -2.988641 -0.247664 -0.138450 -0.335169
6.433333 -2.071533 -1.309725 -2.985737 -0.245140 -0.136697 -0.264489
6.466667 -2.079663 -1.314252 -2.987979 -0.242617 -0.134950 -0.185639
6.500000 -2.087707 -1.318719 -2.985687 -0.240097 -0.133210 -0.106856
6.533333 -2.095667 -1.323128 -2.982795 -0.237581 -0.131478 -0.039295
6.566667 -2.103542 -1.327478 -2.976051 -0.235068 -0.129756 0.007983
6.600000 -2.111335 -1.331772 -2.963365 -0.232560 -0.128043 0.036811
6.633333 -2.119043 -1.336008 -2.962377 -0.230058 -0.126342 0.046007
6.666667 -2.126669 -1.340189 -2.958613 -0.227562 -0.124654 0.035687
6.700000 -2.134211 -1.344313 -2.945458 -0.225074 -0.122978 0.010853
6.733333 -2.141671 -1.348381 -2.960385 -0.222593 -0.121316 -0.019196
6.766667 -2.149047 -1.352394 -2.960054 -0.220120 -0.119668 -0.049099
6.800000 -2.156341 -1.356353 -2.951975 -0.217655 -0.118033 -0.080217
6.833333 -2.163554 -1.360257 -2.961926 -0.215200 -0.116413 -0.106141
6.866667 -2.170684 -1.364107 -2.976524 -0.212753 -0.114806 -0.123995
6.900000 -2.177732 -1.367904 -2.982303 -0.210315 -0.113213 -0.134748
6.933333 -2.184700 -1.371648 -2.973477 -0.207888 -0.111634 -0.143297
6.966667 -2.191587 -1.375340 -3.003462 -0.205470 -0.110069 -0.145962
7.000000 -2.198393 -1.378980 -3.007182 -0.203063 -0.108518 -0.142051
7.033333 -2.205120 -1.382567 -2.998099 -0.200667 -0.106979 -0.136601
7.066667 -2.211766 -1.386104 -3.001375 -0.198281 -0.105454 -0.130850
7.100000 -2.218333 -1.389592 -3.011770 -0.195907 -0.103943 -0.123401
7.133333 -2.224821 -1.393030 -3.015031 -0.193545 -0.102445 -0.111180
7.166667 -2.231231 -1.396417 -3.007460 -0.191195 -0.100962 -0.102326
7.200000 -2.237562 -1.399755 -3.012820 -0.188858 -0.099495 -0.096080
7.233333 -2.243815 -1.403043 -3.026137 -0.186534 -0.098044 -0.089739
7.266667 -2.249991 -1.406282 -3.035269 -0.184223 -0.096611 -0.085231
7.300000 -2.256090 -1.409475 -3.030046 -0.181927 -0.095195 -0.085556
7.333333 -2.262113 -1.412619 -3.044261 -0.179645 -0.093796 -0.089775
7.366667 -2.268059 -1.415716 -3.029630 -0.177377 -0.092415 -0.094701
7.400000 -2.273930 -1.418768 -3.021770 -0.175123 -0.091050 -0.101199
7.433333 -2.279727 -1.421777 -3.026430 -0.172883 -0.089700 -0.112297
7.466667 -2.285449 -1.424742 -3.040357 -0.170657 -0.088365 -0.125732
7.500000 -2.291099 -1.427665 -3.049310 -0.168444 -0.087043 -0.139119
7.533333 -2.296674 -1.430543 -3.055230 -0.166246 -0.085735 -0.156427
7.566667 -2.302177 -1.433379 -3.042517 -0.164062 -0.084440 -0.174961
7.600000 -2.307606 -1.436170 -3.061765 -0.161893 -0.083158 -0.192950
7.633333 -2.312963 -1.438917 -3.073530 -0.159739 -0.081889 -0.209604
7.666667 -2.318247 -1.441621 -3.079841 -0.157601 -0.080634 -0.223398
7.700000 -2.323460 -1.444281 -3.095237 -0.155481 -0.079393 -0.233122
7.733333 -2.328604 -1.446903 -3.088365 -0.153378 -0.078165 -0.234674
7.766667 -2.333676 -1.449482 -3.082869 -0.151295 -0.076952 -0.228222
7.800000 -2.338680 -1.452025 -3.100997 -0.149231 -0.075753 -0.215900
7.833333 -2.343617 -1.454531 -3.121040 -0.147188 -0.074568 -0.193721
7.866667 -2.348484 -1.456996 3.135071 -0.145164 -0.073398 -0.162675
7.900000 -2.353283 -1.459421 3.136600 -0.143160 -0.072241 -0.124421
7.933333 -2.358018 -1.461806 3.137172 -0.141173 -0.071097 -0.078246
7.966667 -2.362685 -1.464152 3.129180 -0.139204 -0.069968 -0.024519
8.000000 -2.367289 -1.466459 -3.140311 -0.137250 -0.068855 0.035042
8.033333 -2.371829 -1.468734 3.136819 -0.135312 -0.067758 0.093755
8.066667 -2.376307 -1.470972 -3.140496 -0.133389 -0.066680 0.147183
