t x y theta dxdt dydt dthetadt
0.000000 0.000000 0.000000 -2.014307 0.134974 0.067614 -0.001013
0.033333 0.004545 0.002276 -2.014114 0.137862 0.068921 0.000420
0.066667 0.009191 0.004599 -2.007725 0.140756 0.070227 0.001863
0.100000 0.013940 0.006970 -2.005834 0.143650 0.071529 0.004099
0.133333 0.018792 0.009391 -2.003700 0.146541 0.072823 0.004570
0.166667 0.023732 0.011847 -2.010597 0.149428 0.074110 0.005525
0.200000 0.028761 0.014340 -2.011086 0.152313 0.075389 0.006718
0.233333 0.033880 0.016869 -2.006528 0.155201 0.076667 0.004291
0.266667 0.039105 0.019448 -2.004640 0.158096 0.077948 -0.000463
0.300000 0.044418 0.022064 -2.010751 0.161005 0.079237 -0.009023
0.333333 0.049821 0.024717 -2.010930 0.163932 0.080539 -0.018989
0.366667 0.055312 0.027407 -1.995851 0.166882 0.081858 -0.032793
0.400000 0.060912 0.030148 -2.008305 0.169855 0.083196 -0.048743
0.433333 0.066623 0.032943 -2.009442 0.172849 0.084550 -0.061069
0.466667 0.072446 0.035792 -2.010052 0.175860 0.085917 -0.066515
0.500000 0.078356 0.038677 -2.010654 0.178882 0.087290 -0.062147
0.533333 0.084354 0.041599 -2.007278 0.181909 0.088664 -0.051556
0.566667 0.090465 0.044576 -2.015436 0.184935 0.090030 -0.034276
0.600000 0.096690 0.047607 -2.031240 0.187962 0.091381 -0.016773
0.633333 0.103030 0.050694 -2.055053 0.190990 0.092706 -0.007102
0.666667 0.109455 0.053818 -2.045429 0.194026 0.093999 -0.016566
0.700000 0.115966 0.056979 -2.039956 0.197077 0.095250 -0.053113
0.733333 0.122561 0.060177 -2.029815 0.200151 0.096453 -0.121433
0.766667 0.129275 0.063423 -2.002037 0.203253 0.097601 -0.226913
0.800000 0.136108 0.066713 -1.980109 0.206382 0.098692 -0.368032
0.833333 0.143024 0.070041 -1.977888 0.209539 0.099726 -0.541684
0.866667 0.150022 0.073406 -1.995247 0.212715 0.100708 -0.735362
0.900000 0.157146 0.076799 -2.023319 0.215901 0.101641 -0.937108
0.933333 0.164395 0.080215 -2.075392 0.219085 0.102529 -1.128225
0.966667 0.171774 0.083650 -2.125318 0.222249 0.103383 -1.289591
1.000000 0.179284 0.087099 -2.188564 0.225385 0.104210 -1.405883
1.033333 0.186870 0.090585 -2.255105 0.228476 0.105019 -1.464830
1.066667 0.194533 0.094109 -2.352546 0.231518 0.105815 -1.459304
1.100000 0.202327 0.097642 -2.419611 0.234508 0.106600 -1.386180
1.133333 0.210195 0.101213 -2.474568 0.237448 0.107380 -1.251835
1.166667 0.218190 0.104793 -2.516223 0.240346 0.108153 -1.069180
1.200000 0.226257 0.108412 -2.551774 0.243211 0.108916 -0.850840
1.233333 0.234393 0.112069 -2.583189 0.246049 0.109666 -0.612041
1.266667 0.242648 0.115738 -2.605350 0.248861 0.110404 -0.371308
1.300000 0.250969 0.119447 -2.595566 0.251645 0.111130 -0.146261
1.333333 0.259400 0.123172 -2.592456 0.254394 0.111844 0.050006
1.366667 0.267934 0.126915 -2.573357 0.257101 0.112549 0.213032
1.400000 0.276570 0.130677 -2.548785 0.259752 0.113248 0.337573
1.433333 0.285301 0.134458 -2.513041 0.262331 0.113946 0.424392
1.466667 0.294124 0.138258 -2.477080 0.264829 0.114648 0.474949
1.500000 0.303034 0.142079 -2.459435 0.267227 0.115363 0.499453
1.533333 0.311998 0.145941 -2.436879 0.269514 0.116097 0.506224
1.566667 0.321041 0.149823 -2.435841 0.271680 0.116859 0.500116
1.600000 0.330158 0.153728 -2.418108 0.273716 0.117659 0.487769
1.633333 0.339344 0.157656 -2.410770 0.275621 0.118502 0.473832
1.666667 0.348595 0.161607 -2.412890 0.277394 0.119390 0.466997
1.700000 0.357906 0.165582 -2.388434 0.279041 0.120327 0.463325
1.733333 0.367272 0.169582 -2.376916 0.280562 0.121314 0.462753
1.766667 0.376678 0.173627 -2.352762 0.281960 0.122349 0.460715
1.800000 0.386123 0.177718 -2.341493 0.283238 0.123421 0.456012
1.833333 0.395610 0.181834 -2.309056 0.284400 0.124525 0.445330
1.866667 0.405131 0.185997 -2.288040 0.285451 0.125655 0.422852
1.900000 0.414684 0.190207 -2.277320 0.286394 0.126800 0.390710
1.933333 0.424266 0.194467 -2.264134 0.287239 0.127952 0.348184
1.966667 0.433874 0.198749 -2.256645 0.287991 0.129109 0.302315
2.000000 0.443507 0.203082 -2.243724 0.288657 0.130274 0.252729
2.033333 0.453162 0.207465 -2.234522 0.289239 0.131444 0.202417
2.066667 0.462832 0.211869 -2.221600 0.289740 0.132621 0.153351
2.100000 0.472513 0.216294 -2.238240 0.290162 0.133809 0.108956
2.133333 0.482201 0.220739 -2.237394 0.290506 0.135016 0.068907
2.166667 0.491903 0.225238 -2.232832 0.290774 0.136244 0.030360
2.200000 0.501616 0.229792 -2.226843 0.290963 0.137488 -0.004225
2.233333 0.511339 0.234402 -2.235840 0.291075 0.138755 -0.034425
2.266667 0.521069 0.239069 -2.226948 0.291108 0.140043 -0.058997
2.300000 0.530789 0.243751 -2.226252 0.291061 0.141347 -0.083265
2.333333 0.540511 0.248491 -2.234097 0.290928 0.142654 -0.105441
2.366667 0.550217 0.253246 -2.244902 0.290711 0.143964 -0.124612
2.400000 0.559920 0.258061 -2.253435 0.290413 0.145285 -0.140882
2.433333 0.569620 0.262938 -2.253125 0.290033 0.146618 -0.154235
2.466667 0.579314 0.267877 -2.266191 0.289573 0.147965 -0.162903
2.500000 0.588977 0.272829 -2.268553 0.289032 0.149334 -0.162863
2.533333 0.598606 0.277792 -2.264137 0.288413 0.150737 -0.154776
2.566667 0.608222 0.282821 -2.280202 0.287707 0.152170 -0.138066
2.600000 0.617823 0.287918 -2.284286 0.286902 0.153622 -0.114944
2.633333 0.627379 0.293028 -2.293843 0.285988 0.155091 -0.085444
2.666667 0.636915 0.298208 -2.303780 0.284959 0.156575 -0.050781
2.700000 0.646431 0.303460 -2.310677 0.283803 0.158068 -0.010603
2.733333 0.655924 0.308783 -2.302833 0.282515 0.159561 0.034470
2.766667 0.665355 0.314131 -2.296469 0.281097 0.161057 0.082267
2.800000 0.674759 0.319554 -2.292818 0.279554 0.162567 0.132799
2.833333 0.684093 0.325008 -2.284359 0.277892 0.164092 0.183261
2.866667 0.693354 0.330495 -2.278123 0.276117 0.165637 0.230167
2.900000 0.702539 0.336021 -2.272575 0.274246 0.167216 0.267497
2.933333 0.711645 0.341588 -2.268827 0.272297 0.168849 0.296511
2.966667 0.720670 0.347200 -2.259648 0.270287 0.170548 0.317160
3.000000 0.729658 0.352895 -2.237728 0.268237 0.172330 0.327419
3.033333 0.738563 0.358642 -2.208518 0.266166 0.174206 0.326353
3.066667 0.747426 0.364475 -2.202384 0.264087 0.176185 0.315498
3.100000 0.756207 0.370367 -2.182757 0.262010 0.178270 0.297707
3.133333 0.764903 0.376322 -2.179674 0.259936 0.180457 0.270564
3.166667 0.773516 0.382344 -2.173471 0.257863 0.182738 0.233165
3.200000 0.782046 0.388435 -2.162064 0.255792 0.185111 0.189171
3.233333 0.790527 0.394620 -2.167361 0.253722 0.187569 0.143186
3.266667 0.798958 0.400901 -2.153737 0.251659 0.190113 0.093933
3.300000 0.807339 0.407278 -2.140229 0.249603 0.192738 0.043227
3.333333 0.815637 0.413738 -2.151578 0.247555 0.195444 -0.007599
3.366667 0.823854 0.420281 -2.156845 0.245515 0.198229 -0.055618
3.400000 0.831989 0.426912 -2.153771 0.243477 0.201090 -0.101376
3.433333 0.840068 0.433646 -2.157728 0.241434 0.204021 -0.145574
3.466667 0.848066 0.440473 -2.162168 0.239381 0.207020 -0.183706
3.500000 0.856006 0.447406 -2.171414 0.237316 0.210085 -0.214369
3.533333 0.863888 0.454446 -2.182045 0.235239 0.213216 -0.235890
3.566667 0.871709 0.461594 -2.198799 0.233147 0.216410 -0.247663
3.600000 0.879469 0.468854 -2.211779 0.231042 0.219667 -0.248140
3.633333 0.887150 0.476220 -2.212839 0.228923 0.222985 -0.237896
3.666667 0.894750 0.483696 -2.233079 0.226788 0.226362 -0.218240
3.700000 0.902270 0.491284 -2.238480 0.224636 0.229797 -0.191337
3.733333 0.909710 0.498988 -2.252748 0.222468 0.233286 -0.158785
3.766667 0.917085 0.506809 -2.253544 0.220288 0.236829 -0.123996
3.800000 0.924394 0.514748 -2.254090 0.218101 0.240425 -0.088912
3.833333 0.931635 0.522806 -2.252026 0.215910 0.244076 -0.049406
3.866667 0.938798 0.530991 -2.252854 0.213717 0.247783 -0.004229
3.900000 0.945882 0.539306 -2.247136 0.211522 0.251549 0.047887
3.933333 0.952897 0.547744 -2.254216 0.209321 0.255379 0.108802
3.966667 0.959842 0.556305 -2.244375 0.207110 0.259282 0.178609
4.000000 0.966708 0.565005 -2.245931 0.204885 0.263263 0.258284
4.033333 0.973503 0.573831 -2.240132 0.202644 0.267326 0.334910
4.066667 0.980226 0.582783 -2.245084 0.200384 0.271475 0.400012
4.100000 0.986877 0.591863 -2.241737 0.198105 0.275713 0.448796
4.133333 0.993450 0.601093 -2.236444 0.195806 0.280043 0.474195
4.166667 0.999946 0.610475 -2.166224 0.193490 0.284457 0.470338
4.200000 1.006362 0.620011 -2.118578 0.191158 0.288947 0.428300
4.233333 1.012698 0.629705 -2.086560 0.188811 0.293507 0.355596
4.266667 1.018953 0.639557 -2.062499 0.186453 0.298128 0.255569
4.300000 1.025128 0.649572 -2.065719 0.184088 0.302794 0.130675
4.333333 1.031222 0.659751 -2.049780 0.181719 0.307490 -0.014696
4.366667 1.037239 0.670062 -2.073583 0.179351 0.312212 -0.165543
4.400000 1.043177 0.680541 -2.101960 0.176987 0.316959 -0.308017
4.433333 1.049035 0.691192 -2.114756 0.174627 0.321723 -0.440327
4.466667 1.054815 0.702017 -2.141300 0.172273 0.326497 -0.556160
4.500000 1.060517 0.712974 -2.171773 0.169924 0.331283 -0.652979
4.533333 1.066140 0.724063 -2.202114 0.167580 0.336086 -0.726505
4.566667 1.071685 0.735334 -2.207243 0.165240 0.340894 -0.786395
4.600000 1.077155 0.746787 -2.238407 0.162901 0.345697 -0.837181
4.633333 1.082545 0.758372 -2.270739 0.160563 0.350492 -0.877881
4.666667 1.087858 0.770145 -2.296921 0.158224 0.355276 -0.910528
4.700000 1.093097 0.782109 -2.329063 0.155882 0.360046 -0.934493
4.733333 1.098256 0.794201 -2.364699 0.153538 0.364789 -0.948948
4.766667 1.103334 0.806422 -2.400707 0.151190 0.369503 -0.944142
4.800000 1.108337 0.818840 -2.438516 0.148839 0.374198 -0.917992
4.833333 1.113258 0.831384 -2.480630 0.146484 0.378877 -0.867653
4.866667 1.118106 0.844130 -2.512021 0.144127 0.383547 -0.791476
4.900000 1.122872 0.857000 -2.549015 0.141765 0.388205 -0.688484
4.933333 1.127556 0.869992 -2.571112 0.139399 0.392859 -0.563352
4.966667 1.132158 0.883105 -2.600924 0.137029 0.397519 -0.421700
5.000000 1.136687 0.896427 -2.618809 0.134653 0.402189 -0.263110
5.033333 1.141142 0.909960 -2.637566 0.132270 0.406874 -0.092108
5.066667 1.145515 0.923609 -2.623260 0.129877 0.411575 0.086633
5.100000 1.149805 0.937372 -2.597632 0.127476 0.416308 0.267768
5.133333 1.154019 0.951351 -2.585065 0.125063 0.421085 0.449759
5.166667 1.158151 0.965440 -2.564777 0.122638 0.425910 0.623520
5.200000 1.162203 0.979749 -2.548525 0.120199 0.430776 0.779233
5.233333 1.166172 0.994163 -2.535383 0.117748 0.435679 0.913352
5.266667 1.170058 1.008681 -2.512645 0.115285 0.440618 1.026418
5.300000 1.173862 1.023415 -2.454766 0.112811 0.445573 1.115643
5.333333 1.177584 1.038362 -2.375952 0.110328 0.450520 1.176608
5.366667 1.181221 1.053519 -2.326730 0.107837 0.455424 1.212423
5.400000 1.184776 1.068768 -2.281500 0.105341 0.460272 1.224516
5.433333 1.188246 1.084217 -2.233153 0.102840 0.465034 1.209902
5.466667 1.191632 1.099858 -2.199284 0.100336 0.469676 1.166860
5.500000 1.194934 1.115685 -2.174304 0.097830 0.474177 1.103010
5.533333 1.198152 1.131592 -2.132831 0.095320 0.478525 1.026031
5.566667 1.201288 1.147670 -2.088697 0.092808 0.482720 0.939299
5.600000 1.204341 1.163820 -2.045261 0.090292 0.486760 0.845289
5.633333 1.207310 1.180128 -2.025522 0.087771 0.490652 0.750894
5.666667 1.210195 1.196587 -2.001974 0.085243 0.494407 0.656243
5.700000 1.212996 1.213190 -1.993753 0.082708 0.498034 0.558101
5.733333 1.215714 1.229848 -1.977631 0.080163 0.501530 0.455348
5.766667 1.218347 1.246636 -1.971097 0.077609 0.504896 0.348271
5.800000 1.220895 1.263545 -1.947411 0.075045 0.508116 0.240976
5.833333 1.223357 1.280569 -1.930003 0.072472 0.511173 0.131986
5.866667 1.225732 1.297701 -1.928187 0.069890 0.514047 0.024732
5.900000 1.228021 1.314936 -1.930266 0.067300 0.516731 -0.079194
5.933333 1.230221 1.332267 -1.940544 0.064704 0.519205 -0.176541
5.966667 1.232334 1.349686 -1.952726 0.062104 0.521446 -0.262717
6.000000 1.234358 1.367187 -1.968676 0.059503 0.523438 -0.335040
6.033333 1.236302 1.384699 -1.976288 0.056901 0.525177 -0.387768
6.066667 1.238156 1.402280 -1.997654 0.054301 0.526658 -0.416503
6.100000 1.239921 1.419922 -2.039100 0.051706 0.527865 -0.416387
6.133333 1.241596 1.437618 -2.044460 0.049118 0.528797 -0.388703
6.166667 1.243192 1.455303 -2.066814 0.046536 0.529465 -0.335202
6.200000 1.244697 1.473026 -2.092623 0.043959 0.529880 -0.258371
6.233333 1.246111 1.490780 -2.099709 0.041390 0.530035 -0.164020
6.266667 1.247447 1.508505 -2.106275 0.038829 0.529933 -0.058686
6.300000 1.248704 1.526194 -2.113118 0.036273 0.529588 0.047985
6.333333 1.249870 1.543891 -2.101259 0.033721 0.529009 0.151565
6.366667 1.250943 1.561586 -2.087564 0.031178 0.528189 0.244514
6.400000 1.251940 1.579227 -2.071903 0.028640 0.527132 0.319558
6.433333 1.252860 1.596809 -2.049242 0.026108 0.525850 0.374054
6.466667 1.253688 1.614362 -2.025085 0.023580 0.524346 0.404580
6.500000 1.254423 1.631879 -2.009791 0.021060 0.522612 0.411951
6.533333 1.255084 1.649317 -1.980789 0.018547 0.520648 0.393801
6.566667 1.255653 1.666700 -1.975198 0.016044 0.518457 0.355701
6.600000 1.256148 1.683992 -1.958539 0.013555 0.516037 0.300413
6.633333 1.256552 1.701210 -1.947929 0.011086 0.513382 0.231900
6.666667 1.256884 1.718324 -1.933849 0.008642 0.510488 0.155664
6.700000 1.257126 1.735345 -1.940709 0.006227 0.507358 0.075177
6.733333 1.257279 1.752262 -1.930510 0.003849 0.503987 -0.000479
6.766667 1.257362 1.769057 -1.935521 0.001510 0.500369 -0.071695
6.800000 1.257359 1.785730 -1.942998 -0.000789 0.496495 -0.133621
6.833333 1.257271 1.802269 -1.947137 -0.003048 0.492363 -0.185189
6.866667 1.257116 1.818669 -1.971597 -0.005264 0.487965 -0.225011
6.900000 1.256894 1.834921 -1.977904 -0.007437 0.483298 -0.252962
6.933333 1.256607 1.851020 -1.993852 -0.009570 0.478361 -0.272492
6.966667 1.256255 1.866961 -2.003694 -0.011662 0.473151 -0.281694
7.000000 1.255828 1.882717 -2.010086 -0.013711 0.467669 -0.281378
7.033333 1.255330 1.898278 -2.031601 -0.015717 0.461911 -0.270716
7.066667 1.254762 1.913634 -2.021568 -0.017681 0.455880 -0.251417
7.100000 1.254126 1.928776 -2.034503 -0.019599 0.449572 -0.219956
7.133333 1.253425 1.943693 -2.043543 -0.021466 0.442988 -0.174553
7.166667 1.252664 1.958416 -2.048094 -0.023277 0.436124 -0.117189
7.200000 1.251842 1.972894 -2.065203 -0.025029 0.428988 -0.048250
7.233333 1.250963 1.987166 -2.079894 -0.026719 0.421586 0.029584
7.266667 1.250029 2.001173 -2.084104 -0.028344 0.413919 0.114293
7.300000 1.249042 2.014905 -2.075012 -0.029905 0.406003 0.199579
7.333333 1.248006 2.028351 -2.061648 -0.031404 0.397852 0.279225
7.366667 1.246923 2.041501 -2.053601 -0.032844 0.389488 0.349703
7.400000 1.245787 2.054419 -2.028895 -0.034226 0.380919 0.405323
7.433333 1.244609 2.067021 -2.001656 -0.035555 0.372176 0.442834
7.466667 1.243393 2.079298 -1.965676 -0.036834 0.363288 0.461379
7.500000 1.242142 2.091239 -1.948215 -0.038065 0.354266 0.459749
7.533333 1.240840 2.102930 -1.928884 -0.039247 0.345116 0.438476
7.566667 1.239510 2.114267 -1.916201 -0.040380 0.335839 0.399232
7.600000 1.238132 2.125344 -1.922650 -0.041463 0.326440 0.350505
7.633333 1.236706 2.136160 -1.900399 -0.042490 0.316894 0.297945
7.666667 1.235262 2.146594 -1.883349 -0.043451 0.307161 0.249629
7.700000 1.233803 2.156638 -1.892538 -0.044343 0.297226 0.218400
7.733333 1.232300 2.166408 -1.883001 -0.045170 0.287095 0.212907
7.766667 1.230752 2.175901 -1.869571 -0.045935 0.276774 0.241354
7.800000 1.229160 2.185114 -1.863040 -0.046640 0.266262 0.300039
7.833333 1.227568 2.193903 -1.873917 -0.047296 0.255588 0.389631
7.866667 1.225975 2.202265 -1.885890 -0.047918 0.244804 0.502572
7.900000 1.224383 2.210196 -1.909590 -0.048517 0.233940 0.622954
7.933333 1.222750 2.217834 -1.880987 -0.049099 0.223016 0.735224
7.966667 1.221118 2.225041 -1.845910 -0.049669 0.212051 0.821036
8.000000 1.219486 2.231818 -1.788606 -0.050237 0.201085 0.861273
8.033333 1.217815 2.238296 -1.713510 -0.050812 0.190144 0.829994
8.066667 1.216104 2.244474 -1.666484 -0.051392 0.179229 0.705777
8.100000 1.214355 2.250350 -1.610117 -0.051976 0.168342 0.472562
8.133333 1.212603 2.255805 -1.562768 -0.052565 0.157490 0.123264
8.166667 1.210848 2.260843 -1.526134 -0.053160 0.146672 -0.339913
8.200000 1.209055 2.265574 -1.518852 -0.053755 0.135866 -0.901974
8.233333 1.207261 2.269895 -1.536545 -0.054346 0.125051 -1.537026
8.266667 1.205430 2.273908 -1.588280 -0.054934 0.114219 -2.211171
8.300000 1.203597 2.277512 -1.651114 -0.055523 0.103373 -2.887411
8.333333 1.201762 2.280707 -1.776634 -0.056117 0.092520 -3.522064
8.366667 1.199892 2.283593 -1.930615 -0.056721 0.081670 -4.079943
8.400000 1.197985 2.286170 -2.142411 -0.057343 0.070836 -4.522748
8.433333 1.196044 2.288438 -2.351031 -0.057989 0.060018 -4.819659
8.466667 1.194095 2.290298 -2.586868 -0.058668 0.049208 -4.950369
8.500000 1.192135 2.291752 -2.762551 -0.059386 0.038379 -4.900634
8.533333 1.190163 2.292800 -2.981782 -0.060144 0.027483 -4.673938
8.566667 1.188174 2.293445 3.088762 -0.060947 0.016482 -4.274999
8.600000 1.186151 2.293784 2.906889 -0.061798 0.005342 -3.725371
8.633333 1.184092 2.293817 2.752055 -0.062700 -0.005953 -3.050043
8.666667 1.182000 2.293545 2.664705 -0.063649 -0.017416 -2.279655
8.700000 1.179873 2.292969 2.606210 -0.064640 -0.029047 -1.448865
8.733333 1.177707 2.291928 2.583848 -0.065665 -0.040820 -0.595807
8.766667 1.175502 2.290424 2.584213 -0.066713 -0.052710 0.239939
8.800000 1.173259 2.288462 2.590639 -0.067770 -0.064669 1.025664
8.833333 1.170978 2.286044 2.666845 -0.068823 -0.076621 1.728660
8.866667 1.168659 2.283176 2.765357 -0.069865 -0.088476 2.328621
8.900000 1.166306 2.280017 2.899356 -0.070890 -0.100143 2.812592
8.933333 1.163916 2.276416 3.064249 -0.071897 -0.111542 3.176203
8.966667 1.161488 2.272377 -3.060746 -0.072889 -0.122599 3.419795
9.000000 1.159036 2.267981 -2.901098 -0.073867 -0.133274 3.544220
9.033333 1.156559 2.263235 -2.779706 -0.074838 -0.143561 3.566025
9.066667 1.154056 2.258143 -2.662378 -0.075807 -0.153474 3.496421
9.100000 1.151519 2.252780 -2.539164 -0.076782 -0.163025 3.350564
9.133333 1.148950 2.247149 -2.421149 -0.077769 -0.172242 3.146532
9.166667 1.146349 2.241255 -2.320382 -0.078775 -0.181163 2.903086
9.200000 1.143713 2.235042 -2.213804 -0.079811 -0.189825 2.639546
9.233333 1.141040 2.228519 -2.127381 -0.080884 -0.198261 2.360305
9.266667 1.138327 2.221692 -2.053286 -0.082000 -0.206496 2.073806
9.300000 1.135582 2.214619 -1.991954 -0.083164 -0.214556 1.784263
9.333333 1.132806 2.207304 -1.945675 -0.084376 -0.222455 1.495434
9.366667 1.129998 2.199753 -1.889611 -0.085640 -0.230188 1.206785
9.400000 1.127142 2.191932 -1.868619 -0.086951 -0.237748 0.921927
9.433333 1.124238 2.183848 -1.838571 -0.088305 -0.245125 0.647546
9.466667 1.121283 2.175510 -1.824905 -0.089694 -0.252310 0.388483
9.500000 1.118275 2.166927 -1.815580 -0.091112 -0.259294 0.148401
9.533333 1.115214 2.158109 -1.815486 -0.092549 -0.266066 -0.072545
9.566667 1.112098 2.149065 -1.831557 -0.093990 -0.272618 -0.268576
9.600000 1.108926 2.139805 -1.856885 -0.095428 -0.278938 -0.439120
9.633333 1.105724 2.130347 -1.883745 -0.096853 -0.285020 -0.581700
9.666667 1.102465 2.120691 -1.910270 -0.098257 -0.290858 -0.696431
9.700000 1.099149 2.110845 -1.946631 -0.099632 -0.296454 -0.782089
9.733333 1.095804 2.100819 -1.981922 -0.100971 -0.301814 -0.834498
9.766667 1.092402 2.090620 -2.011297 -0.102273 -0.306946 -0.854882
9.800000 1.088974 2.080253 -2.042039 -0.103535 -0.311861 -0.845839
9.833333 1.085489 2.069731 -2.071983 -0.104755 -0.316562 -0.812544
9.866667 1.081978 2.059051 -2.111294 -0.105935 -0.321055 -0.756827
9.900000 1.078414 2.048235 -2.151422 -0.107078 -0.325340 -0.682459
9.933333 1.074795 2.037289 -2.175964 -0.108186 -0.329419 -0.599096
9.966667 1.071153 2.026203 -2.189462 -0.109264 -0.333287 -0.512515
10.000000 1.067487 2.014982 -2.206739 -0.110312 -0.336944 -0.426629
10.033333 1.063799 2.003632 -2.218765 -0.111334 -0.340392 -0.343192
10.066667 1.060089 1.992158 -2.209962 -0.112333 -0.343624 -0.269692
10.100000 1.056332 1.980593 -2.209713 -0.113312 -0.346635 -0.212076
10.133333 1.052531 1.968947 -2.213756 -0.114275 -0.349419 -0.168633
10.166667 1.048686 1.957225 -2.219675 -0.115220 -0.351984 -0.138227
10.200000 1.044822 1.945403 -2.218032 -0.116147 -0.354326 -0.118814
10.233333 1.040939 1.933485 -2.215473 -0.117054 -0.356445 -0.110001
10.266667 1.037018 1.921516 -2.228294 -0.117935 -0.358346 -0.103494
10.300000 1.033060 1.909502 -2.227822 -0.118783 -0.360039 -0.092454
10.333333 1.029085 1.897410 -2.239430 -0.119593 -0.361522 -0.073376
10.366667 1.025077 1.885288 -2.237817 -0.120367 -0.362782 -0.046200
10.400000 1.021036 1.873142 -2.246206 -0.121101 -0.363816 -0.010148
10.433333 1.016966 1.860981 -2.256299 -0.121791 -0.364628 0.036468
10.466667 1.012884 1.848763 -2.260456 -0.122437 -0.365217 0.089783
10.500000 1.008790 1.836495 -2.254412 -0.123040 -0.365578 0.147235
10.533333 1.004673 1.824232 -2.243620 -0.123597 -0.365716 0.203411
10.566667 1.000535 1.811979 -2.233092 -0.124103 -0.365640 0.257777
10.600000 0.996379 1.799742 -2.221700 -0.124556 -0.365363 0.307167
10.633333 0.992206 1.787529 -2.202555 -0.124959 -0.364882 0.347698
10.666667 0.988020 1.775345 -2.184048 -0.125309 -0.364211 0.377297
10.700000 0.983822 1.763196 -2.171754 -0.125605 -0.363375 0.394534
10.733333 0.979614 1.751088 -2.158173 -0.125845 -0.362400 0.401585
10.766667 0.975403 1.738972 -2.145718 -0.126031 -0.361310 0.399462
10.800000 0.971187 1.726908 -2.130639 -0.126161 -0.360121 0.389813
10.833333 0.966968 1.714903 -2.107652 -0.126237 -0.358856 0.375256
10.866667 0.962748 1.702961 -2.101458 -0.126259 -0.357526 0.359574
10.900000 0.958528 1.691088 -2.087952 -0.126231 -0.356132 0.344598
10.933333 0.954311 1.679230 -2.079759 -0.126152 -0.354654 0.333515
10.966667 0.950099 1.667451 -2.070083 -0.126025 -0.353089 0.325920
11.000000 0.945891 1.655695 -2.062194 -0.125849 -0.351422 0.323588
11.033333 0.941688 1.643967 -2.051843 -0.125624 -0.349635 0.329184
11.066667 0.937491 1.632269 -2.051468 -0.125351 -0.347701 0.342482
11.100000 0.933307 1.620674 -2.031582 -0.125028 -0.345600 0.363219
11.133333 0.929131 1.609118 -2.025110 -0.124658 -0.343332 0.387256
11.166667 0.924973 1.597675 -2.012170 -0.124240 -0.340877 0.415620
11.200000 0.920824 1.586279 -2.001083 -0.123776 -0.338235 0.446376
11.233333 0.916696 1.575008 -1.986414 -0.123269 -0.335417 0.475460
11.266667 0.912590 1.563868 -1.961797 -0.122720 -0.332440 0.499549
11.300000 0.908497 1.552786 -1.945086 -0.122131 -0.329315 0.518958
11.333333 0.904429 1.541844 -1.929921 -0.121502 -0.326048 0.535005
11.366667 0.900387 1.531045 -1.898219 -0.120834 -0.322652 0.542605
11.400000 0.896361 1.520315 -1.880145 -0.120126 -0.319135 0.542054
11.433333 0.892364 1.509735 -1.859156 -0.119381 -0.315504 0.532785
11.466667 0.888385 1.499231 -1.856283 -0.118597 -0.311759 0.517505
11.500000 0.884437 1.488881 -1.824382 -0.117778 -0.307916 0.493364
11.533333 0.880508 1.478613 -1.813378 -0.116925 -0.303983 0.460538
11.566667 0.876613 1.468503 -1.794707 -0.116040 -0.299971 0.424014
11.600000 0.872752 1.458552 -1.779455 -0.115126 -0.295894 0.383136
11.633333 0.868927 1.448762 -1.757943 -0.114185 -0.291760 0.339683
11.666667 0.865138 1.439133 -1.750580 -0.113221 -0.287585 0.292479
11.700000 0.861387 1.429665 -1.748989 -0.112236 -0.283383 0.246508
11.733333 0.857660 1.420293 -1.734830 -0.111234 -0.279170 0.201809
11.766667 0.853957 1.411019 -1.733990 -0.110216 -0.274949 0.158713
11.800000 0.850293 1.401907 -1.735037 -0.109180 -0.270720 0.119378
11.833333 0.846669 1.392955 -1.728868 -0.108128 -0.266482 0.086045
11.866667 0.843084 1.384164 -1.727731 -0.107057 -0.262227 0.059750
11.900000 0.839527 1.375479 -1.728411 -0.105966 -0.257945 0.038193
11.933333 0.836010 1.366953 -1.728777 -0.104854 -0.253633 0.022457
11.966667 0.832522 1.358535 -1.730221 -0.103724 -0.249300 0.011817
12.000000 0.829075 1.350276 -1.735453 -0.102578 -0.244956 0.005410
12.033333 0.825669 1.342175 -1.730296 -0.101423 -0.240616 0.000556
12.066667 0.822306 1.334232 -1.727609 -0.100259 -0.236291 -0.003370
12.100000 0.818986 1.326446 -1.731402 -0.099091 -0.231992 -0.005717
12.133333 0.815708 1.318815 -1.733863 -0.097919 -0.227725 -0.007276
12.166667 0.812474 1.311339 -1.726566 -0.096744 -0.223495 -0.008946
12.200000 0.809271 1.303979 -1.734275 -0.095566 -0.219299 -0.010854
12.233333 0.806101 1.296737 -1.729672 -0.094382 -0.215132 -0.012220
12.266667 0.802976 1.289645 -1.730134 -0.093192 -0.210991 -0.011805
12.300000 0.799883 1.282672 -1.730180 -0.091994 -0.206869 -0.011624
12.333333 0.796824 1.275817 -1.732997 -0.090786 -0.202758 -0.011636
12.366667 0.793810 1.269111 -1.734772 -0.089565 -0.198648 -0.011132
12.400000 0.790840 1.262553 -1.744693 -0.088331 -0.194535 -0.009743
12.433333 0.787915 1.256140 -1.733656 -0.087085 -0.190424 -0.008356
12.466667 0.785034 1.249872 -1.734358 -0.085829 -0.186315 -0.007761
12.500000 0.782198 1.243748 -1.730393 -0.084567 -0.182221 -0.006575
12.533333 0.779398 1.237744 -1.733404 -0.083303 -0.178151 -0.004906
12.566667 0.776642 1.231881 -1.734405 -0.082042 -0.174118 -0.003077
12.600000 0.773931 1.226157 -1.736405 -0.080787 -0.170128 -0.002584
12.633333 0.771265 1.220572 -1.736230 -0.079539 -0.166186 -0.001530
12.666667 0.768635 1.215107 -1.734937 -0.078300 -0.162295 -0.000010
12.700000 0.766050 1.209777 -1.736291 -0.077067 -0.158451 0.001816
12.733333 0.763502 1.204567 -1.734769 -0.075840 -0.154653 0.003579
12.766667 0.760999 1.199489 -1.738684 -0.074619 -0.150897 0.005770
12.800000 0.758532 1.194530 -1.739308 -0.073400 -0.147181 0.008618
12.833333 0.756104 1.189690 -1.733156 -0.072184 -0.143500 0.011760
12.866667 0.753712 1.184968 -1.730986 -0.070967 -0.139854 0.013666
12.900000 0.751366 1.180372 -1.731696 -0.069748 -0.136240 0.014504
12.933333 0.749063 1.175899 -1.733468 -0.068526 -0.132658 0.014511
