t x y theta dxdt dydt dthetadt
0.000000 0.000000 0.000000 -0.030332 0.006872 0.002647 -0.014411
0.033333 0.000435 0.000075 -0.030401 0.010842 0.003527 -0.013674
0.066667 0.000625 -0.000001 -0.023750 0.016400 0.004685 -0.012718
0.100000 0.000290 0.000000 -0.028896 0.024431 0.006183 -0.012042
0.133333 0.000616 0.000040 -0.019361 0.035573 0.008067 -0.007756
0.166667 0.000728 0.000315 -0.020643 0.050484 0.010309 0.000748
0.200000 0.001543 0.000630 -0.016136 0.069885 0.012880 0.013644
0.233333 0.003083 0.000986 -0.017404 0.094351 0.015760 0.032969
0.266667 0.005369 0.001383 -0.022962 0.124814 0.018979 0.063751
0.300000 0.008599 0.002196 -0.021711 0.161335 0.022560 0.106839
0.333333 0.012613 0.003053 -0.030491 0.204513 0.026549 0.161264
0.366667 0.017432 0.003953 -0.022444 0.254805 0.031053 0.225452
0.400000 0.023073 0.004897 -0.026897 0.312661 0.036181 0.298474
0.433333 0.036081 0.006183 -0.019625 0.378041 0.042021 0.372626
0.466667 0.049940 0.007514 0.001026 0.450227 0.048435 0.439178
0.500000 0.064658 0.008892 0.013116 0.528292 0.055237 0.490891
0.533333 0.080246 0.010315 0.036713 0.610768 0.062124 0.522281
0.566667 0.096710 0.011784 0.080974 0.696462 0.068729 0.527404
0.600000 0.120125 0.014306 0.114177 0.783860 0.074559 0.500376
0.633333 0.149632 0.017647 0.143840 0.872100 0.079106 0.442820
0.666667 0.185101 0.021288 0.156510 0.959870 0.082079 0.355873
0.700000 0.221435 0.024972 0.174974 1.046419 0.083213 0.246828
0.733333 0.258620 0.028696 0.184955 1.130799 0.082408 0.120639
0.766667 0.296642 0.032457 0.182735 1.211651 0.079672 -0.013613
0.800000 0.338663 0.035342 0.187253 1.288317 0.075392 -0.146416
0.833333 0.381487 0.038260 0.156877 1.360463 0.070060 -0.268006
0.866667 0.428833 0.040348 0.146449 1.428564 0.064211 -0.367855
0.900000 0.479403 0.041857 0.126854 1.492609 0.058445 -0.442091
0.933333 0.532964 0.042914 0.099212 1.552898 0.053426 -0.485655
0.966667 0.587225 0.044005 0.083839 1.610044 0.049849 -0.495336
1.000000 0.642153 0.045128 0.039145 1.664229 0.048018 -0.468633
1.033333 0.699413 0.046185 0.031769 1.715084 0.048241 -0.414647
1.066667 0.757274 0.047275 0.011696 1.762387 0.050692 -0.340871
1.100000 0.815701 0.048400 -0.019680 1.806742 0.055461 -0.252403
1.133333 0.878546 0.050227 -0.037135 1.848631 0.062297 -0.156527
1.166667 0.941882 0.052089 -0.030938 1.888331 0.070787 -0.062585
1.200000 1.005666 0.053985 -0.013606 1.926182 0.080647 0.018764
1.233333 1.069860 0.055915 0.004034 1.962841 0.091425 0.086908
1.266667 1.136615 0.059011 0.011032 1.998589 0.102576 0.139690
1.300000 1.204939 0.063114 0.039715 2.032830 0.113427 0.171559
1.333333 1.273540 0.067246 0.041939 2.065234 0.123571 0.182029
1.366667 1.342661 0.072128 0.043547 2.095553 0.132625 0.173815
1.400000 1.411255 0.077454 0.046414 2.123598 0.140169 0.150433
1.433333 1.483256 0.083106 0.054195 2.148584 0.145823 0.117008
1.466667 1.557606 0.088655 0.048661 2.169849 0.149441 0.075812
1.500000 1.631992 0.094213 0.060017 2.187261 0.151158 0.031031
1.533333 1.706362 0.099776 0.065254 2.200274 0.151000 -0.014468
1.566667 1.781651 0.104989 0.056949 2.207876 0.149100 -0.059644
1.600000 1.856817 0.110198 0.056186 2.208942 0.145666 -0.101515
1.633333 1.931506 0.114871 0.059315 2.203097 0.141099 -0.142172
1.666667 2.005964 0.119531 0.044937 2.190165 0.135691 -0.179179
1.700000 2.080140 0.124175 0.045366 2.169183 0.129564 -0.208824
1.733333 2.153979 0.128800 0.019328 2.139766 0.122932 -0.227245
1.766667 2.226891 0.132628 0.027729 2.102594 0.116041 -0.233515
1.800000 2.299363 0.136430 0.011000 2.058416 0.109105 -0.224746
1.833333 2.371343 0.140204 -0.017672 2.007619 0.102155 -0.196271
1.866667 2.439362 0.143413 -0.023163 1.950697 0.095281 -0.149375
1.900000 2.501566 0.146064 -0.026505 1.888756 0.088637 -0.082725
1.933333 2.563140 0.148679 -0.037168 1.822625 0.082334 -0.001343
1.966667 2.624045 0.151255 -0.031972 1.752529 0.076336 0.093369
2.000000 2.684241 0.153793 -0.031740 1.678697 0.070610 0.198760
2.033333 2.735675 0.155781 -0.041273 1.602056 0.065208 0.310250
2.066667 2.786333 0.157726 -0.025811 1.522964 0.060093 0.427580
2.100000 2.836186 0.159629 0.004818 1.441659 0.055186 0.545159
2.133333 2.885207 0.161487 0.031830 1.358380 0.050407 0.661087
2.166667 2.933368 0.163301 0.062706 1.272735 0.045783 0.770225
2.200000 2.980643 0.165070 0.082196 1.184332 0.041340 0.860895
2.233333 3.013066 0.166046 0.114937 1.092219 0.037134 0.922008
2.266667 3.044568 0.166974 0.137773 0.995483 0.033290 0.944600
2.300000 3.075141 0.167855 0.165606 0.894242 0.030014 0.921541
2.333333 3.104777 0.168690 0.231434 0.788738 0.027509 0.844662
2.366667 3.133469 0.169479 0.283953 0.680574 0.025890 0.715286
2.400000 3.161211 0.170224 0.331663 0.571358 0.025276 0.540935
2.433333 3.177092 0.170477 0.377342 0.462735 0.025637 0.332206
2.466667 3.192025 0.170684 0.407023 0.357208 0.026831 0.097855
2.500000 3.197866 0.171359 0.399310 0.257182 0.028595 -0.146575
2.533333 3.202785 0.171990 0.366079 0.165037 0.030644 -0.378259
2.566667 3.202091 0.173174 0.330335 0.083005 0.032659 -0.584788
2.600000 3.197576 0.174669 0.285119 0.013680 0.034284 -0.752833
2.633333 3.191401 0.176378 0.221382 -0.041341 0.035181 -0.870845
2.666667 3.185820 0.178035 0.161045 -0.081445 0.035152 -0.928716
2.700000 3.179453 0.179647 0.129629 -0.107379 0.034106 -0.929175
2.733333 3.172327 0.181213 0.096545 -0.120225 0.031993 -0.882651
2.766667 3.164474 0.182733 0.070375 -0.122079 0.028920 -0.797465
2.800000 3.160315 0.183583 0.036773 -0.116082 0.025127 -0.687017
2.833333 3.155485 0.184389 0.017395 -0.104609 0.020933 -0.565867
