t x y theta dxdt dydt dthetadt
0.000000 0.000000 0.000000 -1.888552 -0.004835 0.000322 -0.006715
0.033333 0.000187 -0.000019 -1.889563 -0.008338 -0.000398 -0.007641
0.066667 -0.000235 -0.000155 -1.897356 -0.013751 -0.001534 0.002278
0.100000 -0.000485 -0.000003 -1.900321 -0.021840 -0.003332 0.030621
0.133333 -0.000646 0.000184 -1.896065 -0.033694 -0.006193 0.086491
0.166667 -0.001091 0.000052 -1.884837 -0.050293 -0.010404 0.178737
0.200000 -0.001626 -0.000086 -1.897291 -0.072508 -0.016264 0.315659
0.233333 -0.002872 -0.000361 -1.897035 -0.100716 -0.024012 0.499752
0.266667 -0.004847 -0.000777 -1.896376 -0.135292 -0.033865 0.725486
0.300000 -0.007572 -0.001337 -1.897342 -0.176176 -0.045665 0.983086
0.333333 -0.011067 -0.002045 -1.886884 -0.222769 -0.058905 1.259614
0.366667 -0.017698 -0.003398 -1.854362 -0.274286 -0.073101 1.539423
0.400000 -0.025134 -0.004908 -1.792715 -0.330082 -0.087628 1.801747
0.433333 -0.037136 -0.008251 -1.689713 -0.389583 -0.101626 2.030626
0.466667 -0.054064 -0.013446 -1.584832 -0.451868 -0.114095 2.209102
0.500000 -0.071831 -0.018808 -1.469405 -0.515869 -0.124302 2.325797
0.533333 -0.090442 -0.024335 -1.356010 -0.580551 -0.131748 2.372875
0.566667 -0.109904 -0.030027 -1.274757 -0.645550 -0.135979 2.349762
0.600000 -0.130221 -0.035884 -1.174035 -0.710148 -0.136780 2.263137
0.633333 -0.154535 -0.041352 -1.088503 -0.773678 -0.134527 2.124800
0.666667 -0.182371 -0.046284 -1.028912 -0.835935 -0.129940 1.951831
0.700000 -0.211066 -0.051385 -0.970586 -0.896976 -0.123697 1.760477
0.733333 -0.243060 -0.055334 -0.921642 -0.956730 -0.116609 1.568474
0.766667 -0.277768 -0.057858 -0.881692 -1.014292 -0.109723 1.389053
0.800000 -0.313319 -0.060562 -0.849630 -1.068965 -0.103975 1.233051
0.833333 -0.349705 -0.063448 -0.803709 -1.120335 -0.100020 1.106259
0.866667 -0.387792 -0.066039 -0.786710 -1.168161 -0.098374 1.010771
0.900000 -0.429718 -0.068577 -0.764910 -1.212039 -0.099670 0.948005
0.933333 -0.472443 -0.071314 -0.735319 -1.252050 -0.104274 0.915328
0.966667 -0.515951 -0.074256 -0.715289 -1.288798 -0.112061 0.907481
1.000000 -0.560226 -0.077408 -0.696424 -1.322894 -0.122899 0.919738
1.033333 -0.605254 -0.080774 -0.668654 -1.354890 -0.136576 0.945900
1.066667 -0.651016 -0.084360 -0.648805 -1.384988 -0.152693 0.980644
1.100000 -0.697735 -0.089392 -0.594791 -1.413705 -0.170511 1.013499
1.133333 -0.745155 -0.094652 -0.562240 -1.441293 -0.189415 1.039435
1.166667 -0.792272 -0.101170 -0.514779 -1.468153 -0.208969 1.053620
1.200000 -0.841725 -0.108884 -0.481298 -1.494700 -0.228715 1.051508
1.233333 -0.892844 -0.118008 -0.434073 -1.521215 -0.248116 1.030875
1.266667 -0.944586 -0.127366 -0.397878 -1.548048 -0.266755 0.990311
1.300000 -0.996928 -0.136957 -0.353370 -1.575504 -0.284580 0.934470
1.333333 -1.049851 -0.146780 -0.319119 -1.604084 -0.301498 0.865158
1.366667 -1.103780 -0.157382 -0.297148 -1.633687 -0.317482 0.787365
1.400000 -1.158243 -0.168213 -0.267486 -1.664190 -0.332546 0.704111
1.433333 -1.213218 -0.179272 -0.257724 -1.695439 -0.346862 0.622007
1.466667 -1.267944 -0.190763 -0.243206 -1.727571 -0.360636 0.543284
1.500000 -1.325530 -0.202833 -0.218870 -1.760337 -0.373860 0.472847
1.533333 -1.385368 -0.215848 -0.209640 -1.793120 -0.386502 0.412999
1.566667 -1.446955 -0.229359 -0.202236 -1.825552 -0.398540 0.364309
1.600000 -1.508925 -0.243086 -0.179824 -1.857388 -0.409952 0.329045
1.633333 -1.572236 -0.257521 -0.193394 -1.888411 -0.420673 0.305467
1.666667 -1.636777 -0.272057 -0.180152 -1.917741 -0.430548 0.294250
1.700000 -1.701605 -0.286797 -0.169010 -1.944982 -0.439523 0.291818
1.733333 -1.766689 -0.301736 -0.167020 -1.970338 -0.447682 0.295386
1.766667 -1.831874 -0.316388 -0.151745 -1.994210 -0.455152 0.301178
1.800000 -1.899991 -0.331841 -0.147853 -2.016648 -0.461997 0.307584
1.833333 -1.968262 -0.347481 -0.136539 -2.037802 -0.468350 0.310609
1.866667 -2.036651 -0.363302 -0.123683 -2.058275 -0.474424 0.308155
1.900000 -2.105121 -0.379298 -0.107967 -2.078425 -0.480369 0.300758
1.933333 -2.175028 -0.395643 -0.089441 -2.097897 -0.486206 0.289444
1.966667 -2.245680 -0.412110 -0.073049 -2.115934 -0.491815 0.276298
2.000000 -2.316220 -0.428340 -0.059156 -2.132232 -0.497203 0.260181
2.033333 -2.386691 -0.444725 -0.058907 -2.146339 -0.502304 0.244042
2.066667 -2.459709 -0.461582 -0.062081 -2.157418 -0.506967 0.230148
2.100000 -2.532576 -0.478585 -0.064647 -2.164733 -0.511115 0.219725
2.133333 -2.606546 -0.495938 -0.060192 -2.167694 -0.514620 0.212502
2.166667 -2.681076 -0.513627 -0.042405 -2.166000 -0.517392 0.210188
2.200000 -2.755328 -0.531448 -0.042783 -2.158723 -0.519146 0.214296
2.233333 -2.828674 -0.548958 -0.029406 -2.145053 -0.519652 0.222572
2.266667 -2.901657 -0.566586 -0.012531 -2.124793 -0.518791 0.234556
2.300000 -2.971687 -0.583818 -0.015102 -2.097745 -0.516442 0.246054
2.333333 -3.042373 -0.601342 -0.009876 -2.064138 -0.512672 0.257347
2.366667 -3.112573 -0.618969 0.008764 -2.024255 -0.507615 0.264635
2.400000 -3.181285 -0.636340 0.005660 -1.978973 -0.501551 0.264832
2.433333 -3.249434 -0.653801 0.024018 -1.928901 -0.494675 0.255518
2.466667 -3.314524 -0.670255 0.027091 -1.874416 -0.487290 0.233801
2.500000 -3.376538 -0.686054 0.045302 -1.815899 -0.479815 0.200769
2.533333 -3.434076 -0.701148 0.045177 -1.753807 -0.472922 0.155908
2.566667 -3.490919 -0.716313 0.061825 -1.688767 -0.467309 0.100835
2.600000 -3.547038 -0.731546 0.086538 -1.621374 -0.463675 0.037822
2.633333 -3.600403 -0.746737 0.077831 -1.552802 -0.462784 -0.025295
2.666667 -3.652995 -0.761989 0.085327 -1.483980 -0.465377 -0.082879
2.700000 -3.702168 -0.776663 0.078177 -1.415767 -0.472116 -0.128594
2.733333 -3.747851 -0.790652 0.047193 -1.348757 -0.483054 -0.157231
2.766667 -3.790558 -0.804537 0.024689 -1.283501 -0.498194 -0.162297
2.800000 -3.830747 -0.819299 0.008651 -1.220303 -0.517442 -0.138767
2.833333 -3.868738 -0.835600 0.006726 -1.159069 -0.540542 -0.094724
2.866667 -3.904440 -0.855106 0.006345 -1.099780 -0.566359 -0.037149
2.900000 -3.939263 -0.874644 -0.009602 -1.042368 -0.593402 0.022769
2.933333 -3.973201 -0.894206 -0.013622 -0.986161 -0.620232 0.071587
2.966667 -4.006248 -0.913784 -0.013319 -0.930129 -0.645384 0.098638
3.000000 -4.037056 -0.936907 0.015776 -0.873554 -0.667226 0.091035
3.033333 -4.065173 -0.962610 0.050516 -0.815550 -0.684123 0.053143
3.066667 -4.092384 -0.988291 0.079273 -0.755541 -0.695637 -0.011924
3.100000 -4.118689 -1.013937 0.095260 -0.692875 -0.701764 -0.093936
3.133333 -4.141226 -1.039597 0.109959 -0.628080 -0.702867 -0.180282
3.166667 -4.162860 -1.065189 0.069906 -0.561863 -0.699329 -0.258246
3.200000 -4.179674 -1.088495 0.048074 -0.494921 -0.692399 -0.311102
3.233333 -4.195600 -1.111703 0.001754 -0.428369 -0.683817 -0.329088
3.266667 -4.206367 -1.132972 -0.043820 -0.363467 -0.675034 -0.305253
3.300000 -4.216270 -1.154115 -0.061954 -0.301765 -0.667171 -0.244225
3.333333 -4.225325 -1.175123 -0.097290 -0.244245 -0.661037 -0.147767
3.366667 -4.230431 -1.195412 -0.095446 -0.192444 -0.657332 -0.031142
3.400000 -4.234723 -1.215542 -0.093821 -0.147379 -0.655789 0.093307
3.433333 -4.236483 -1.237466 -0.057697 -0.109929 -0.655540 0.205148
3.466667 -4.237470 -1.259208 -0.034532 -0.080249 -0.655407 0.290661
3.500000 -4.237707 -1.280755 0.002653 -0.058343 -0.654381 0.346344
3.533333 -4.237041 -1.303918 0.021919 -0.043914 -0.651638 0.364557
3.566667 -4.236672 -1.327909 0.065100 -0.035455 -0.646484 0.349071
3.600000 -4.235620 -1.351663 0.070110 -0.031937 -0.637996 0.302108
3.633333 -4.233907 -1.375165 0.067088 -0.032121 -0.625673 0.235670
3.666667 -4.234833 -1.396317 0.069091 -0.034847 -0.609340 0.159310
3.700000 -4.238730 -1.415363 0.060689 -0.038627 -0.588597 0.078591
3.733333 -4.242027 -1.434124 0.060824 -0.042220 -0.563175 0.000436
3.766667 -4.244739 -1.452588 0.063653 -0.045163 -0.532734 -0.067786
3.800000 -4.246883 -1.470747 0.050499 -0.046656 -0.498061 -0.121225
3.833333 -4.248475 -1.488591 0.055719 -0.046103 -0.459736 -0.160073
3.866667 -4.249531 -1.506111 0.049542 -0.043506 -0.418005 -0.184253
3.900000 -4.250068 -1.523296 0.040240 -0.039551 -0.373587 -0.195310
3.933333 -4.252160 -1.533406 0.027820 -0.034767 -0.327612 -0.192362
3.966667 -4.253766 -1.543173 0.012745 -0.029502 -0.281445 -0.178211
4.000000 -4.254903 -1.552596 0.006155 -0.024333 -0.235928 -0.158875
4.033333 -4.255292 -1.557055 -0.014522 -0.019734 -0.192381 -0.133861
4.066667 -4.255242 -1.561175 -0.019548 -0.015842 -0.152298 -0.104506
4.100000 -4.255446 -1.563185 -0.022998 -0.012345 -0.117079 -0.072081
4.133333 -4.255242 -1.564866 -0.011346 -0.009299 -0.087038 -0.042167
4.166667 -4.255389 -1.565658 0.000793 -0.006747 -0.062350 -0.017081
4.200000 -4.255737 -1.566262 0.014641 -0.004622 -0.043116 0.004940
4.233333 -4.256121 -1.566597 -0.005766 -0.002850 -0.028650 0.020814
4.266667 -4.256150 -1.566635 0.007506 -0.001398 -0.018257 0.024188
4.300000 -4.256022 -1.566673 -0.001251 -0.000368 -0.010930 0.021470
4.333333 -4.256225 -1.566886 -0.013030 0.000412 -0.006101 0.016789
4.366667 -4.256108 -1.566827 -0.001886 0.001027 -0.003092 0.011267
4.400000 -4.256067 -1.566768 0.025670 0.001535 -0.001231 0.004241
