t x y theta dxdt dydt dthetadt
0.000000 0.000000 0.000000 -0.459626 -0.008226 0.001092 0.013998
0.033333 -0.001214 0.000205 -0.467784 -0.003037 -0.000735 0.010728
0.066667 -0.001855 0.000264 -0.447227 0.003578 -0.002821 0.005891
0.100000 -0.001904 0.000172 -0.454836 0.011698 -0.005193 0.001644
0.133333 -0.001342 -0.000076 -0.459824 0.021485 -0.007968 -0.001895
0.166667 -0.000150 -0.000484 -0.464675 0.033380 -0.011373 -0.006370
0.200000 0.001691 -0.001055 -0.456344 0.047695 -0.015632 -0.020879
0.233333 0.003083 -0.001459 -0.462462 0.064872 -0.020988 -0.053013
0.266667 0.005161 -0.002036 -0.454960 0.085351 -0.027627 -0.105666
0.300000 0.007089 -0.002601 -0.464804 0.110200 -0.035959 -0.186218
0.333333 0.009308 -0.003097 -0.459423 0.140223 -0.046254 -0.299573
0.366667 0.012411 -0.003966 -0.456355 0.175670 -0.058540 -0.446885
0.400000 0.016678 -0.005416 -0.457596 0.216818 -0.072811 -0.619053
0.433333 0.021727 -0.007059 -0.460983 0.263761 -0.089018 -0.809422
0.466667 0.029781 -0.009837 -0.463049 0.316438 -0.107064 -1.011175
0.500000 0.041996 -0.014222 -0.506463 0.373054 -0.126235 -1.216471
0.533333 0.055038 -0.018806 -0.578987 0.432339 -0.146108 -1.413920
0.566667 0.068917 -0.023589 -0.655698 0.493646 -0.166603 -1.594623
0.600000 0.083644 -0.028571 -0.730691 0.556389 -0.187705 -1.754010
0.633333 0.107063 -0.036550 -0.803433 0.619425 -0.209194 -1.883399
0.666667 0.131341 -0.044723 -0.864193 0.682106 -0.231042 -1.979527
0.700000 0.156476 -0.053088 -0.938989 0.745156 -0.253709 -2.038700
0.733333 0.182468 -0.061641 -1.001363 0.808491 -0.277163 -2.065422
0.766667 0.209316 -0.070378 -1.077279 0.871490 -0.300930 -2.061516
0.800000 0.237019 -0.079295 -1.140764 0.933500 -0.324506 -2.030185
0.833333 0.265574 -0.088389 -1.220083 0.995223 -0.347800 -1.976963
0.866667 0.300018 -0.100720 -1.291151 1.056508 -0.370239 -1.901540
0.900000 0.339157 -0.115561 -1.378212 1.116458 -0.390873 -1.805644
0.933333 0.379123 -0.130555 -1.439789 1.174566 -0.408984 -1.686496
0.966667 0.419904 -0.145693 -1.482822 1.230414 -0.424119 -1.547853
1.000000 0.463093 -0.161423 -1.544751 1.283377 -0.435824 -1.393287
1.033333 0.508072 -0.177297 -1.584143 1.332003 -0.443512 -1.228964
1.066667 0.553815 -0.193281 -1.631513 1.375793 -0.447356 -1.063644
1.100000 0.601706 -0.208964 -1.672131 1.414856 -0.448120 -0.906321
1.133333 0.650323 -0.224734 -1.686100 1.449363 -0.446621 -0.765119
1.166667 0.700207 -0.239980 -1.699869 1.479558 -0.443696 -0.643452
1.200000 0.751049 -0.254403 -1.708140 1.506074 -0.440269 -0.544029
1.233333 0.802740 -0.268151 -1.709217 1.529695 -0.437261 -0.467113
1.266667 0.854728 -0.281647 -1.708917 1.550797 -0.435174 -0.412025
1.300000 0.907327 -0.295181 -1.716062 1.569635 -0.434106 -0.377553
1.333333 0.959608 -0.309152 -1.735239 1.586515 -0.434096 -0.359335
1.366667 1.012452 -0.323143 -1.747255 1.601874 -0.435043 -0.353479
1.400000 1.066087 -0.337812 -1.772968 1.615998 -0.436633 -0.354259
1.433333 1.120554 -0.352975 -1.784956 1.629236 -0.438384 -0.357547
1.466667 1.175510 -0.368127 -1.787653 1.641905 -0.439822 -0.359394
1.500000 1.230932 -0.383257 -1.805911 1.654228 -0.440545 -0.352739
1.533333 1.286618 -0.398395 -1.810722 1.666329 -0.440166 -0.339354
1.566667 1.342124 -0.413270 -1.825730 1.678257 -0.438393 -0.317116
1.600000 1.398018 -0.428090 -1.836766 1.690051 -0.435116 -0.289487
1.633333 1.454276 -0.442846 -1.858110 1.701648 -0.430420 -0.254224
1.666667 1.510872 -0.457528 -1.864260 1.713123 -0.424439 -0.210665
1.700000 1.568235 -0.471701 -1.874444 1.724515 -0.417340 -0.163086
1.733333 1.625884 -0.485779 -1.867272 1.735919 -0.409381 -0.108643
1.766667 1.684316 -0.499305 -1.884966 1.747317 -0.400865 -0.050572
1.800000 1.742978 -0.512717 -1.884614 1.758743 -0.392092 0.010196
1.833333 1.801843 -0.526003 -1.875146 1.770284 -0.383269 0.069649
1.866667 1.861281 -0.538521 -1.886469 1.781792 -0.374652 0.124593
1.900000 1.920903 -0.550397 -1.867810 1.793187 -0.366467 0.173456
1.933333 1.980429 -0.561967 -1.858115 1.804303 -0.358878 0.213922
1.966667 2.040043 -0.573377 -1.850004 1.815253 -0.352004 0.243710
2.000000 2.101064 -0.584834 -1.830786 1.825946 -0.345894 0.263803
2.033333 2.162115 -0.596115 -1.822621 1.836320 -0.340647 0.274285
2.066667 2.224087 -0.607322 -1.807387 1.846453 -0.336219 0.273653
2.100000 2.286026 -0.618338 -1.798380 1.856387 -0.332519 0.265233
2.133333 2.348329 -0.629398 -1.800660 1.866173 -0.329417 0.253101
2.166667 2.411005 -0.640146 -1.774704 1.875499 -0.326719 0.238648
2.200000 2.473786 -0.651016 -1.776662 1.884286 -0.324274 0.224414
2.233333 2.536406 -0.661661 -1.767889 1.892275 -0.321852 0.211848
2.266667 2.598831 -0.672075 -1.763372 1.899333 -0.319344 0.206124
2.300000 2.662680 -0.682905 -1.762897 1.905188 -0.316629 0.206222
2.333333 2.726267 -0.693486 -1.757857 1.909711 -0.313596 0.208151
2.366667 2.790858 -0.704220 -1.745180 1.912927 -0.310122 0.216691
2.400000 2.856001 -0.714842 -1.754613 1.914759 -0.306054 0.233939
2.433333 2.920774 -0.725188 -1.743809 1.915240 -0.301251 0.262727
2.466667 2.985140 -0.735248 -1.715621 1.914114 -0.295460 0.302374
2.500000 3.049063 -0.745015 -1.714910 1.911401 -0.288544 0.355111
2.533333 3.112366 -0.754668 -1.712139 1.906993 -0.280409 0.421430
2.566667 3.175154 -0.764010 -1.693433 1.900930 -0.271094 0.496168
2.600000 3.238991 -0.773592 -1.685530 1.893196 -0.260648 0.571685
2.633333 3.302238 -0.782846 -1.683821 1.883784 -0.249153 0.641250
2.666667 3.365488 -0.791271 -1.660536 1.872775 -0.236779 0.700834
2.700000 3.428664 -0.799127 -1.633375 1.860068 -0.223657 0.744518
2.733333 3.491352 -0.806379 -1.593990 1.845461 -0.209873 0.769541
2.766667 3.553310 -0.812945 -1.533860 1.828565 -0.195454 0.774971
2.800000 3.614257 -0.818927 -1.482406 1.809157 -0.180438 0.760988
2.833333 3.674387 -0.824534 -1.454257 1.786877 -0.164807 0.728864
2.866667 3.733664 -0.829759 -1.439547 1.761512 -0.148523 0.679942
2.900000 3.792834 -0.834797 -1.428584 1.732883 -0.131493 0.619517
2.933333 3.851078 -0.839441 -1.419453 1.700794 -0.113553 0.554005
2.966667 3.908414 -0.843430 -1.409814 1.665111 -0.094521 0.489658
3.000000 3.964406 -0.846549 -1.391722 1.625349 -0.074167 0.433216
3.033333 4.019366 -0.849259 -1.381937 1.580896 -0.052240 0.387841
3.066667 4.071936 -0.850833 -1.370061 1.530796 -0.028372 0.356413
3.100000 4.123407 -0.851991 -1.351084 1.474181 -0.002246 0.334768
3.133333 4.172927 -0.851920 -1.343822 1.410232 0.026309 0.317525
3.166667 4.219736 -0.850568 -1.333895 1.337771 0.057553 0.298879
3.200000 4.265357 -0.848795 -1.336707 1.256223 0.091582 0.277153
3.233333 4.309762 -0.846599 -1.324398 1.165685 0.128275 0.251163
3.266667 4.349415 -0.842328 -1.305235 1.066608 0.167186 0.216954
3.300000 4.387804 -0.837636 -1.295130 0.958957 0.207921 0.178118
3.333333 4.420719 -0.830826 -1.285764 0.843593 0.249885 0.135711
3.366667 4.447589 -0.821870 -1.282417 0.722521 0.292176 0.092659
3.400000 4.468643 -0.810326 -1.265842 0.597807 0.333813 0.044321
3.433333 4.488383 -0.798384 -1.276753 0.470838 0.373952 -0.008174
3.466667 4.500997 -0.784071 -1.286489 0.343376 0.411842 -0.060160
3.500000 4.506285 -0.767679 -1.304127 0.218550 0.446512 -0.110470
3.533333 4.510273 -0.750926 -1.300347 0.098371 0.477376 -0.155840
3.566667 4.512971 -0.733824 -1.296884 -0.016315 0.504213 -0.194982
3.600000 4.508670 -0.715665 -1.298264 -0.124945 0.527109 -0.221792
3.633333 4.497932 -0.696727 -1.306180 -0.225949 0.546124 -0.236563
3.666667 4.485967 -0.677489 -1.328158 -0.318493 0.561627 -0.240792
3.700000 4.472802 -0.657964 -1.345318 -0.403186 0.574315 -0.236204
3.733333 4.458467 -0.638170 -1.362505 -0.480174 0.584613 -0.222003
3.766667 4.439509 -0.618178 -1.371131 -0.548927 0.592809 -0.199329
3.800000 4.416888 -0.598255 -1.370662 -0.609291 0.599158 -0.171517
3.833333 4.393196 -0.578112 -1.380439 -0.662273 0.603990 -0.139599
3.866667 4.368472 -0.557764 -1.383182 -0.708382 0.607397 -0.104933
3.900000 4.342753 -0.537228 -1.377732 -0.747631 0.609332 -0.069555
3.933333 4.316078 -0.516520 -1.379955 -0.780117 0.610031 -0.037709
3.966667 4.288487 -0.495657 -1.377989 -0.806425 0.609805 -0.011414
4.000000 4.260019 -0.474654 -1.376975 -0.827091 0.608856 0.010438
4.033333 4.230713 -0.453529 -1.381081 -0.842119 0.607388 0.028309
4.066667 4.202071 -0.433866 -1.370424 -0.851917 0.605771 0.039982
4.100000 4.172672 -0.414111 -1.368256 -0.856899 0.604374 0.048021
4.133333 4.142555 -0.394280 -1.375720 -0.857570 0.603379 0.054226
4.166667 4.111758 -0.374386 -1.380401 -0.854355 0.602807 0.059993
4.200000 4.083170 -0.355007 -1.363674 -0.847472 0.602610 0.064701
4.233333 4.053979 -0.335595 -1.364403 -0.837361 0.602656 0.068493
4.266667 4.026235 -0.315911 -1.355343 -0.824549 0.602606 0.075656
4.300000 3.999182 -0.295213 -1.358003 -0.809663 0.602035 0.085555
4.333333 3.971632 -0.274525 -1.358710 -0.793420 0.600564 0.098775
4.366667 3.944944 -0.253372 -1.356976 -0.776546 0.597859 0.116351
4.400000 3.920178 -0.232981 -1.356957 -0.759959 0.593830 0.139406
4.433333 3.895009 -0.212646 -1.349447 -0.744098 0.588119 0.166730
4.466667 3.870986 -0.192528 -1.340599 -0.728853 0.580245 0.197045
4.500000 3.846618 -0.172495 -1.348550 -0.713908 0.569896 0.230294
4.533333 3.824756 -0.154232 -1.334791 -0.699055 0.556887 0.261888
4.566667 3.802601 -0.136081 -1.327230 -0.683903 0.541059 0.289297
4.600000 3.780178 -0.118055 -1.307465 -0.667668 0.522037 0.309419
4.633333 3.757511 -0.100166 -1.300876 -0.650304 0.500076 0.323656
4.666667 3.734625 -0.082426 -1.273238 -0.632337 0.475907 0.327310
4.700000 3.711543 -0.064848 -1.260975 -0.614394 0.450180 0.317433
4.733333 3.688291 -0.047443 -1.251717 -0.596716 0.423281 0.297576
4.766667 3.669307 -0.033950 -1.247974 -0.579976 0.395955 0.268487
4.800000 3.653377 -0.023664 -1.222407 -0.565307 0.369260 0.232117
4.833333 3.637336 -0.013575 -1.217907 -0.553471 0.343940 0.187257
4.866667 3.621199 -0.003685 -1.218824 -0.544839 0.320462 0.143576
4.900000 3.604536 0.005228 -1.217312 -0.539736 0.299355 0.105188
4.933333 3.587808 0.013934 -1.213295 -0.538426 0.281121 0.074198
4.966667 3.571029 0.022432 -1.205736 -0.540218 0.265482 0.053064
5.000000 3.552706 0.030950 -1.211722 -0.543763 0.251634 0.046328
5.033333 3.534363 0.039254 -1.219194 -0.547710 0.238773 0.055758
5.066667 3.515007 0.047481 -1.225011 -0.550439 0.225974 0.074633
5.100000 3.495323 0.055020 -1.234911 -0.550375 0.212223 0.104597
5.133333 3.475673 0.062339 -1.226697 -0.546294 0.196797 0.142662
5.166667 3.456072 0.069436 -1.230970 -0.537747 0.179589 0.188226
5.200000 3.436538 0.076311 -1.199838 -0.524488 0.160772 0.233205
5.233333 3.417088 0.082961 -1.200872 -0.506278 0.140527 0.276462
5.266667 3.399295 0.087711 -1.187086 -0.483797 0.119447 0.316920
5.300000 3.383897 0.090199 -1.171242 -0.457939 0.098285 0.347819
5.333333 3.368627 0.092467 -1.141709 -0.429473 0.077652 0.368570
5.366667 3.353497 0.094519 -1.146458 -0.398982 0.057991 0.376409
5.400000 3.342223 0.094842 -1.135228 -0.367727 0.039923 0.374482
5.433333 3.331107 0.094959 -1.110730 -0.336884 0.024125 0.359141
5.466667 3.320156 0.094876 -1.103786 -0.306975 0.010853 0.334070
5.500000 3.309376 0.094599 -1.085043 -0.278113 0.000058 0.301170
5.533333 3.302620 0.094054 -1.062546 -0.250729 -0.008302 0.262010
5.566667 3.296042 0.093326 -1.063007 -0.225228 -0.014233 0.219394
5.600000 3.289645 0.092424 -1.060090 -0.201364 -0.018124 0.174165
5.633333 3.283430 0.091354 -1.054026 -0.179066 -0.020478 0.132510
5.666667 3.277397 0.090121 -1.043878 -0.158388 -0.021658 0.091334
5.700000 3.271547 0.088733 -1.044045 -0.139575 -0.021863 0.055778
5.733333 3.267627 0.087936 -1.047836 -0.122392 -0.021353 0.027878
5.766667 3.264939 0.087660 -1.068713 -0.106773 -0.020506 0.005605
5.800000 3.262431 0.087248 -1.056342 -0.092816 -0.019512 -0.011632
5.833333 3.260096 0.086704 -1.068736 -0.080543 -0.018486 -0.024390
5.866667 3.257933 0.086035 -1.064906 -0.069971 -0.017542 -0.029458
5.900000 3.256247 0.085749 -1.045588 -0.061146 -0.016839 -0.031163
5.933333 3.254724 0.085348 -1.053952 -0.054081 -0.016440 -0.030524
5.966667 3.253358 0.084837 -1.064974 -0.048524 -0.016304 -0.026933
6.000000 3.252146 0.084222 -1.070232 -0.044220 -0.016391 -0.019748
6.033333 3.251083 0.083508 -1.061208 -0.040885 -0.016699 -0.012091
