t x y theta dxdt dydt dthetadt
0.000000 0.000000 0.000000 0.849686 0.028164 0.008280 0.238826
0.033333 0.000645 0.000415 0.844126 0.021914 0.008861 0.051470
0.066667 0.001533 0.000046 0.831494 0.015000 0.010792 -0.113503
0.100000 0.002042 0.000119 0.824692 0.007397 0.014129 -0.249395
0.133333 0.002161 0.000647 0.828031 -0.000965 0.018636 -0.362118
0.166667 0.001878 0.001640 0.813175 -0.010158 0.024078 -0.454224
0.200000 0.001816 0.002008 0.802502 -0.020441 0.030441 -0.536640
0.233333 0.001329 0.002864 0.792213 -0.032308 0.038012 -0.617000
0.266667 0.000406 0.004220 0.783710 -0.046270 0.047107 -0.703556
0.300000 -0.000966 0.006086 0.728357 -0.062732 0.058111 -0.795770
0.333333 -0.002502 0.007751 0.683777 -0.082049 0.071791 -0.887297
0.366667 -0.004486 0.009449 0.630460 -0.104569 0.088952 -0.969548
0.400000 -0.007080 0.011577 0.617348 -0.130500 0.110161 -1.027319
0.433333 -0.010811 0.014351 0.609035 -0.159781 0.135866 -1.050725
0.466667 -0.016306 0.017970 0.609706 -0.192118 0.166378 -1.030138
0.500000 -0.022310 0.022169 0.557743 -0.227266 0.202010 -0.965868
0.533333 -0.028831 0.026961 0.460937 -0.264942 0.242664 -0.857984
0.566667 -0.037999 0.034261 0.381402 -0.304680 0.287993 -0.714477
0.600000 -0.049755 0.044740 0.325422 -0.346139 0.337688 -0.544375
0.633333 -0.062041 0.055836 0.309811 -0.388965 0.391104 -0.354144
0.666667 -0.076429 0.070707 0.321759 -0.432743 0.447135 -0.150738
0.700000 -0.091348 0.086200 0.351535 -0.477054 0.504669 0.056692
0.733333 -0.106797 0.102313 0.393891 -0.521596 0.562621 0.253164
0.766667 -0.124542 0.122065 0.413463 -0.566273 0.620014 0.428498
0.800000 -0.144680 0.145163 0.435191 -0.610718 0.675714 0.572924
0.833333 -0.165335 0.168871 0.460499 -0.654657 0.728832 0.681343
0.866667 -0.188559 0.195811 0.478607 -0.698239 0.779084 0.756244
0.900000 -0.212285 0.223342 0.506448 -0.741870 0.826248 0.805429
0.933333 -0.239191 0.253650 0.539230 -0.785301 0.869861 0.838449
0.966667 -0.266577 0.284522 0.571003 -0.828403 0.909804 0.861705
1.000000 -0.294430 0.315943 0.589132 -0.871570 0.946407 0.880452
1.033333 -0.322737 0.347899 0.623878 -0.915303 0.980000 0.895327
1.066667 -0.355091 0.382080 0.659753 -0.959454 1.010776 0.897290
1.100000 -0.387868 0.416761 0.688817 -1.003361 1.038803 0.877191
1.133333 -0.421049 0.451926 0.715375 -1.047054 1.064693 0.829562
1.166667 -0.454615 0.487554 0.746365 -1.090308 1.088860 0.750529
1.200000 -0.491894 0.524684 0.785658 -1.131972 1.111428 0.635238
1.233333 -0.532620 0.562995 0.839781 -1.170422 1.132463 0.478715
1.266667 -0.573663 0.601709 0.859307 -1.204745 1.152182 0.290038
1.300000 -0.614998 0.640806 0.879491 -1.234291 1.170868 0.074520
1.333333 -0.658503 0.680470 0.881597 -1.258140 1.188538 -0.161343
1.366667 -0.703546 0.720468 0.887936 -1.275264 1.205296 -0.410931
1.400000 -0.748794 0.760779 0.851551 -1.285704 1.221316 -0.661397
1.433333 -0.794215 0.801381 0.818391 -1.290133 1.236899 -0.894992
1.466667 -0.839132 0.842638 0.759303 -1.288857 1.252351 -1.104841
1.500000 -0.882858 0.884741 0.711145 -1.282228 1.268099 -1.277824
1.533333 -0.924596 0.927797 0.655309 -1.271030 1.284736 -1.401388
1.566667 -0.966390 0.971043 0.587237 -1.256606 1.302532 -1.464421
1.600000 -1.008211 1.014451 0.550007 -1.239978 1.321938 -1.465854
1.633333 -1.050032 1.057995 0.483223 -1.222069 1.343527 -1.405169
1.666667 -1.091826 1.101647 0.405227 -1.204148 1.367728 -1.283747
1.700000 -1.130912 1.147609 0.344316 -1.187615 1.394549 -1.105561
1.733333 -1.169919 1.193621 0.287854 -1.173629 1.423887 -0.880865
1.766667 -1.208822 1.239655 0.251695 -1.163249 1.455904 -0.618999
1.800000 -1.246054 1.287865 0.233857 -1.157669 1.490198 -0.327155
1.833333 -1.282339 1.338044 0.231430 -1.157824 1.525830 -0.022010
1.866667 -1.318346 1.390104 0.251665 -1.164406 1.561494 0.282363
1.900000 -1.354156 1.442050 0.261590 -1.177698 1.596375 0.570632
1.933333 -1.391312 1.496351 0.292168 -1.197761 1.629334 0.830912
1.966667 -1.430112 1.552678 0.347777 -1.224008 1.658889 1.048847
2.000000 -1.470963 1.610711 0.392492 -1.255101 1.683841 1.216027
2.033333 -1.511517 1.668468 0.462313 -1.289719 1.703516 1.327426
2.066667 -1.554637 1.727261 0.515059 -1.325983 1.717564 1.380286
2.100000 -1.600281 1.786671 0.590060 -1.361991 1.725374 1.370603
2.133333 -1.648716 1.846157 0.641612 -1.395345 1.726605 1.300676
2.166667 -1.696722 1.905184 0.686843 -1.423836 1.721141 1.180997
2.200000 -1.746818 1.963396 0.742378 -1.445259 1.708964 1.019475
2.233333 -1.796409 2.021058 0.784052 -1.457481 1.689895 0.833310
2.266667 -1.848240 2.078272 0.814357 -1.458500 1.663754 0.645678
2.300000 -1.899484 2.134843 0.842017 -1.446295 1.630252 0.483704
2.333333 -1.951332 2.190160 0.856770 -1.419362 1.589137 0.369638
2.366667 -2.002509 2.244745 0.839222 -1.376792 1.540456 0.320857
2.400000 -2.052189 2.297260 0.806746 -1.318821 1.484523 0.356578
2.433333 -2.101113 2.348955 0.766467 -1.245186 1.421273 0.487223
2.466667 -2.146005 2.397431 0.735863 -1.157032 1.351150 0.701197
2.500000 -2.185653 2.442145 0.739937 -1.056283 1.274878 0.979231
2.533333 -2.220072 2.483448 0.761065 -0.946038 1.193660 1.291705
2.566667 -2.253603 2.523779 0.786739 -0.829042 1.108465 1.596767
2.600000 -2.280432 2.560102 0.889405 -0.707736 1.019660 1.836403
2.633333 -2.300200 2.592079 0.980276 -0.586122 0.928239 1.953505
2.666667 -2.312250 2.619430 1.097979 -0.467513 0.834842 1.912808
2.700000 -2.323358 2.645706 1.234589 -0.354862 0.739948 1.695525
2.733333 -2.333521 2.670890 1.393864 -0.249804 0.643130 1.295485
2.766667 -2.336536 2.690315 1.534020 -0.154527 0.544182 0.730732
2.800000 -2.338611 2.708618 1.594210 -0.070451 0.443313 0.053996
2.833333 -2.335106 2.720554 1.608779 0.002291 0.341030 -0.668177
2.866667 -2.330681 2.731352 1.562516 0.064593 0.237432 -1.369136
2.900000 -2.325346 2.741012 1.435424 0.117831 0.133003 -1.987284
2.933333 -2.318132 2.743998 1.259843 0.163367 0.029425 -2.456342
2.966667 -2.310159 2.740691 1.042294 0.203698 -0.071618 -2.722799
3.000000 -2.301322 2.736258 0.846034 0.241149 -0.168343 -2.770506
3.033333 -2.293040 2.727313 0.714975 0.278213 -0.259594 -2.609884
3.066667 -2.284953 2.714359 0.562481 0.316589 -0.343658 -2.265921
3.100000 -2.276536 2.698247 0.459461 0.357652 -0.418919 -1.784484
3.133333 -2.267080 2.679738 0.404182 0.402327 -0.484917 -1.228050
3.166667 -2.255624 2.659445 0.420020 0.450854 -0.541783 -0.672908
3.200000 -2.241482 2.638037 0.454841 0.502809 -0.589938 -0.174439
3.233333 -2.224038 2.615838 0.521083 0.556939 -0.630022 0.226786
3.266667 -2.202807 2.593254 0.584715 0.611575 -0.663235 0.499599
3.300000 -2.180870 2.569749 0.675697 0.664822 -0.691224 0.632264
3.333333 -2.155135 2.546401 0.720537 0.714735 -0.715445 0.628136
3.366667 -2.128749 2.522187 0.775395 0.759406 -0.737099 0.511474
3.400000 -2.101742 2.497133 0.799164 0.797317 -0.757354 0.306785
3.433333 -2.071983 2.471931 0.800078 0.827515 -0.777116 0.043430
3.466667 -2.041667 2.445946 0.785265 0.849930 -0.796936 -0.250474
3.500000 -2.010825 2.419205 0.745887 0.864579 -0.817149 -0.546139
3.533333 -1.979492 2.391737 0.713800 0.871872 -0.837791 -0.821250
3.566667 -1.948854 2.363537 0.663760 0.872585 -0.858745 -1.057775
3.600000 -1.919498 2.334578 0.624805 0.867782 -0.879785 -1.245423
3.633333 -1.889748 2.304981 0.589499 0.858551 -0.900612 -1.383753
3.666667 -1.859634 2.274775 0.516311 0.845554 -0.920996 -1.470616
3.700000 -1.831358 2.243456 0.443324 0.829885 -0.940640 -1.510396
3.733333 -1.805056 2.211176 0.386260 0.812738 -0.959288 -1.510628
3.766667 -1.778476 2.178381 0.321011 0.794935 -0.976733 -1.482880
3.800000 -1.751644 2.145102 0.262181 0.776947 -0.992842 -1.436513
3.833333 -1.726337 2.111290 0.211728 0.759241 -1.007489 -1.374171
3.866667 -1.702169 2.077120 0.170929 0.742432 -1.020514 -1.307147
3.900000 -1.677823 2.042561 0.136766 0.726621 -1.031735 -1.244778
3.933333 -1.654318 2.007951 0.126571 0.711614 -1.041119 -1.191711
3.966667 -1.631042 1.972719 0.080511 0.697208 -1.048411 -1.147358
4.000000 -1.608088 1.937097 0.047649 0.683229 -1.053135 -1.112522
4.033333 -1.585576 1.901258 0.026201 0.669103 -1.054567 -1.088801
4.066667 -1.563649 1.865527 -0.020685 0.653889 -1.051692 -1.067725
4.100000 -1.541668 1.829599 -0.065139 0.636968 -1.043703 -1.040681
4.133333 -1.520188 1.793828 -0.097954 0.617737 -1.029712 -1.000269
4.166667 -1.499057 1.757864 -0.135484 0.595825 -1.009272 -0.946516
4.200000 -1.478346 1.722075 -0.187121 0.570764 -0.981850 -0.874594
4.233333 -1.458754 1.687720 -0.219185 0.542569 -0.947605 -0.780570
4.266667 -1.439191 1.653319 -0.256085 0.511692 -0.907360 -0.666603
4.300000 -1.421243 1.621239 -0.269341 0.478359 -0.861512 -0.539742
4.333333 -1.405233 1.591982 -0.288608 0.442950 -0.810671 -0.404093
4.366667 -1.391488 1.566183 -0.292606 0.405869 -0.755527 -0.262785
4.400000 -1.380602 1.544801 -0.299865 0.368230 -0.698001 -0.124076
4.433333 -1.369792 1.523480 -0.288296 0.330783 -0.639334 -0.000100
4.466667 -1.359065 1.502234 -0.295905 0.294096 -0.580362 0.100594
4.500000 -1.348424 1.481074 -0.288954 0.259004 -0.522536 0.175506
4.533333 -1.341898 1.466916 -0.281461 0.226454 -0.467468 0.218797
4.566667 -1.335459 1.452862 -0.244373 0.197096 -0.416224 0.226474
4.600000 -1.329107 1.438913 -0.217069 0.170846 -0.368613 0.200322
4.633333 -1.326026 1.431076 -0.204986 0.148097 -0.325391 0.149960
4.666667 -1.323025 1.423345 -0.196398 0.129239 -0.287445 0.082968
4.700000 -1.320098 1.415715 -0.181797 0.114506 -0.255329 0.006438
4.733333 -1.317240 1.408181 -0.183460 0.103523 -0.228610 -0.069455
4.766667 -1.314995 1.402535 -0.196674 0.096055 -0.207225 -0.132981
4.800000 -1.312831 1.397794 -0.218070 0.091974 -0.191412 -0.177684
4.833333 -1.310716 1.393129 -0.246479 0.090519 -0.180209 -0.203024
4.866667 -1.308105 1.388129 -0.278524 0.090846 -0.172491 -0.207935
4.900000 -1.305011 1.382838 -0.296664 0.092083 -0.167102 -0.193760
4.933333 -1.301522 1.377225 -0.295861 0.093688 -0.163439 -0.166040
4.966667 -1.297725 1.371380 -0.287081 0.095048 -0.160614 -0.132022
5.000000 -1.293950 1.365570 -0.279296 0.095708 -0.157795 -0.098245
5.033333 -1.290398 1.360017 -0.275659 0.095575 -0.154758 -0.069274
5.066667 -1.286856 1.354482 -0.262155 0.094772 -0.151553 -0.049669
5.100000 -1.283318 1.348958 -0.263667 0.093605 -0.148448 -0.039603
5.133333 -1.280369 1.344164 -0.266170 0.092532 -0.145880 -0.036912
5.166667 -1.277410 1.339363 -0.269949 0.092094 -0.144458 -0.038523
5.200000 -1.274797 1.335202 -0.276994 0.092770 -0.144831 -0.038609
5.233333 -1.272400 1.331436 -0.297841 0.094916 -0.147508 -0.031534
5.266667 -1.270138 1.327905 -0.293637 0.098670 -0.152719 -0.014714
5.300000 -1.267757 1.324195 -0.293212 0.103896 -0.160351 0.010560
5.333333 -1.265009 1.319929 -0.299585 0.110236 -0.170007 0.041603
5.366667 -1.261598 1.314794 -0.298182 0.117208 -0.181137 0.075786
5.400000 -1.257364 1.308416 -0.288592 0.124223 -0.192913 0.106188
5.433333 -1.252153 1.300650 -0.286620 0.130644 -0.204410 0.126177
5.466667 -1.246871 1.292783 -0.271530 0.135945 -0.214781 0.133459
5.500000 -1.241512 1.284806 -0.266846 0.139813 -0.223430 0.128045
5.533333 -1.236026 1.276020 -0.251173 0.142177 -0.230046 0.109612
5.566667 -1.230454 1.267110 -0.233484 0.143176 -0.234590 0.077321
5.600000 -1.225173 1.258290 -0.231096 0.143145 -0.237349 0.036892
5.633333 -1.220382 1.249927 -0.236493 0.142640 -0.238914 -0.008371
5.666667 -1.216014 1.242209 -0.243309 0.142297 -0.240094 -0.053020
5.700000 -1.212192 1.235162 -0.248151 0.142772 -0.241798 -0.093590
5.733333 -1.208251 1.227952 -0.262044 0.144614 -0.244907 -0.124555
5.766667 -1.204185 1.220570 -0.260334 0.148302 -0.250257 -0.139807
5.800000 -1.199877 1.213118 -0.272502 0.154178 -0.258555 -0.140580
5.833333 -1.195114 1.205247 -0.282794 0.162440 -0.270385 -0.127027
5.866667 -1.189590 1.196361 -0.289502 0.173010 -0.285861 -0.103937
5.900000 -1.183914 1.187268 -0.302813 0.185572 -0.304719 -0.075743
5.933333 -1.178079 1.177958 -0.301483 0.199826 -0.326608 -0.048190
5.966667 -1.172079 1.168426 -0.306288 0.215391 -0.350994 -0.026630
6.000000 -1.165054 1.157105 -0.300419 0.231859 -0.377212 -0.012954
6.033333 -1.156940 1.144033 -0.287825 0.248878 -0.404550 -0.010876
6.066667 -1.147987 1.129490 -0.279711 0.266254 -0.432527 -0.019121
6.100000 -1.138355 1.113637 -0.260463 0.284065 -0.460983 -0.036195
6.133333 -1.128541 1.097540 -0.266082 0.302282 -0.489643 -0.056064
6.166667 -1.117849 1.079930 -0.276759 0.320854 -0.518213 -0.073498
6.200000 -1.106971 1.062076 -0.288306 0.339979 -0.546800 -0.082044
6.233333 -1.095905 1.043978 -0.304962 0.359750 -0.575433 -0.071124
6.266667 -1.083668 1.024326 -0.306175 0.380306 -0.604272 -0.040256
6.300000 -1.071243 1.004434 -0.309135 0.401517 -0.633276 0.008525
6.333333 -1.058631 0.984305 -0.311809 0.423312 -0.662543 0.064243
6.366667 -1.044114 0.961447 -0.345136 0.445563 -0.692181 0.117384
6.400000 -1.029413 0.938361 -0.344083 0.467806 -0.721878 0.155493
6.433333 -1.012360 0.912435 -0.331036 0.489409 -0.751141 0.165033
6.466667 -0.995130 0.886296 -0.291336 0.509658 -0.779332 0.143655
6.500000 -0.977730 0.859954 -0.253099 0.527968 -0.805821 0.096854
6.533333 -0.958830 0.831853 -0.210858 0.543683 -0.829726 0.036051
6.566667 -0.939772 0.803570 -0.192020 0.556434 -0.850461 -0.027872
6.600000 -0.919708 0.773889 -0.196745 0.565997 -0.867504 -0.082454
6.633333 -0.899409 0.743329 -0.233172 0.572609 -0.880801 -0.116407
6.666667 -0.879219 0.712301 -0.274381 0.576630 -0.890365 -0.127230
6.700000 -0.859225 0.681040 -0.325905 0.578456 -0.896263 -0.117077
6.733333 -0.839659 0.649999 -0.358164 0.578735 -0.899018 -0.088412
6.766667 -0.820608 0.619403 -0.390679 0.578011 -0.899020 -0.044588
6.800000 -0.802021 0.589424 -0.379121 0.576950 -0.896948 0.008358
6.833333 -0.783333 0.559374 -0.335672 0.576001 -0.893344 0.063506
6.866667 -0.764551 0.530093 -0.278774 0.575493 -0.888859 0.117307
6.900000 -0.745680 0.500767 -0.214649 0.575705 -0.884163 0.159187
6.933333 -0.726602 0.471700 -0.190271 0.576679 -0.879731 0.177411
6.966667 -0.707447 0.442615 -0.217853 0.578321 -0.875939 0.162735
7.000000 -0.688055 0.413796 -0.281820 0.580373 -0.872925 0.117959
7.033333 -0.668598 0.384983 -0.315297 0.582569 -0.870769 0.050503
7.066667 -0.649086 0.356188 -0.309287 0.584678 -0.869360 -0.028721
7.100000 -0.629343 0.327251 -0.273256 0.586479 -0.868564 -0.103057
7.133333 -0.609604 0.298284 -0.242631 0.587894 -0.868117 -0.153815
7.166667 -0.589830 0.269372 -0.218958 0.588920 -0.867777 -0.172071
7.200000 -0.570025 0.240528 -0.222045 0.589625 -0.867323 -0.163863
7.233333 -0.550198 0.211765 -0.253900 0.590076 -0.866531 -0.136195
7.266667 -0.530581 0.182657 -0.308479 0.590360 -0.865213 -0.094460
7.300000 -0.510995 0.153449 -0.355184 0.590618 -0.863184 -0.041714
7.333333 -0.491406 0.124360 -0.376499 0.590897 -0.860401 0.009988
7.366667 -0.471822 0.095404 -0.369358 0.591236 -0.856864 0.058003
7.400000 -0.452250 0.066594 -0.329612 0.591659 -0.852596 0.102747
7.433333 -0.432695 0.037942 -0.303697 0.592189 -0.847620 0.142912
7.466667 -0.412764 0.009831 -0.244988 0.592781 -0.842066 0.167034
7.500000 -0.392865 -0.018097 -0.221032 0.593318 -0.836192 0.166619
7.533333 -0.373005 -0.045827 -0.230307 0.593701 -0.830208 0.147910
7.566667 -0.353191 -0.073348 -0.245227 0.593837 -0.824276 0.117697
7.600000 -0.333430 -0.100647 -0.237056 0.593629 -0.818579 0.086076
7.633333 -0.313503 -0.127640 -0.244679 0.592958 -0.813306 0.058175
7.666667 -0.293491 -0.154452 -0.275530 0.591774 -0.808467 0.048470
7.700000 -0.273630 -0.181315 -0.280428 0.590098 -0.803755 0.059847
7.733333 -0.253851 -0.207908 -0.290705 0.587967 -0.798870 0.081432
7.766667 -0.234162 -0.234219 -0.287233 0.585412 -0.793331 0.099218
7.800000 -0.214570 -0.260236 -0.274347 0.582487 -0.786615 0.102004
7.833333 -0.195171 -0.287124 -0.264013 0.579291 -0.778085 0.089766
7.866667 -0.175883 -0.313694 -0.245547 0.575909 -0.767043 0.057194
7.900000 -0.156715 -0.339931 -0.203338 0.572328 -0.752847 0.009487
7.933333 -0.137792 -0.366113 -0.167865 0.568465 -0.734571 -0.039409
7.966667 -0.119001 -0.391936 -0.175796 0.564227 -0.711700 -0.075584
8.000000 -0.100407 -0.416493 -0.187323 0.559520 -0.683823 -0.088776
8.033333 -0.081627 -0.439813 -0.223902 0.554144 -0.650661 -0.081256
8.066667 -0.063000 -0.462740 -0.299661 0.547893 -0.612267 -0.050552
8.100000 -0.044482 -0.482836 -0.337959 0.540638 -0.569238 0.000371
8.133333 -0.026131 -0.502523 -0.354893 0.532392 -0.522740 0.065589
8.166667 -0.007952 -0.521794 -0.322990 0.523172 -0.473741 0.133195
8.200000 0.009861 -0.537579 -0.283776 0.513001 -0.423318 0.190214
8.233333 0.027206 -0.550033 -0.228935 0.502035 -0.372936 0.230382
8.266667 0.043398 -0.558953 -0.184793 0.490534 -0.324265 0.241571
8.300000 0.059395 -0.567451 -0.166498 0.478747 -0.278436 0.218746
8.333333 0.075194 -0.575532 -0.141805 0.466765 -0.236369 0.156646
8.366667 0.090284 -0.581428 -0.162195 0.454626 -0.199172 0.067647
8.400000 0.104907 -0.585692 -0.186114 0.442364 -0.167614 -0.034439
8.433333 0.119309 -0.588914 -0.203064 0.429856 -0.141776 -0.134270
8.466667 0.133499 -0.591747 -0.208246 0.416668 -0.121116 -0.215365
8.500000 0.147473 -0.594201 -0.225004 0.402362 -0.105234 -0.269718
8.533333 0.161227 -0.596286 -0.239246 0.386673 -0.093573 -0.287185
8.566667 0.174252 -0.599074 -0.248762 0.369487 -0.085098 -0.276543
8.600000 0.187052 -0.601511 -0.267205 0.350666 -0.078821 -0.245060
8.633333 0.199624 -0.603607 -0.279293 0.330298 -0.073969 -0.202940
8.666667 0.210929 -0.606279 -0.302870 0.308835 -0.069941 -0.156701
8.700000 0.220857 -0.609168 -0.298319 0.286818 -0.066091 -0.111745
8.733333 0.230555 -0.611739 -0.299610 0.264703 -0.061849 -0.075307
8.766667 0.238539 -0.614021 -0.277358 0.242929 -0.057013 -0.045989
8.800000 0.244740 -0.616043 -0.261800 0.222125 -0.051506 -0.026011
8.833333 0.250718 -0.617771 -0.264580 0.202841 -0.045350 -0.014196
8.866667 0.256476 -0.619212 -0.265381 0.185494 -0.038774 -0.012513
8.900000 0.262019 -0.620374 -0.281692 0.170328 -0.032092 -0.016611
8.933333 0.267351 -0.621267 -0.288647 0.157613 -0.025669 -0.022329
8.966667 0.272476 -0.621897 -0.280407 0.147421 -0.019828 -0.027360
9.000000 0.276623 -0.622195 -0.278134 0.139555 -0.014853 -0.027920
9.033333 0.280471 -0.622285 -0.280066 0.133728 -0.010989 -0.024640
9.066667 0.284128 -0.622138 -0.293034 0.129552 -0.008346 -0.016696
9.100000 0.287601 -0.621762 -0.292546 0.126722 -0.006992 -0.011277
