t x y theta dxdt dydt dthetadt
0.000000 0.000000 0.000000 -1.973446 -0.122768 0.086350 0.001176
0.033333 -0.004152 0.002909 -1.968756 -0.126546 0.087141 0.001000
0.066667 -0.008438 0.005858 -1.973648 -0.130347 0.087887 0.000633
0.100000 -0.012842 0.008813 -1.974868 -0.134172 0.088592 0.000333
0.133333 -0.017368 0.011772 -1.982934 -0.138022 0.089264 -0.000194
0.166667 -0.022014 0.014735 -1.972696 -0.141897 0.089904 -0.001137
0.200000 -0.026798 0.017739 -1.969194 -0.145794 0.090513 -0.003799
0.233333 -0.031705 0.020744 -1.977410 -0.149711 0.091091 -0.004567
0.266667 -0.036753 0.023790 -1.972993 -0.153651 0.091644 -0.004921
0.300000 -0.041945 0.026877 -1.975868 -0.157613 0.092176 -0.004943
0.333333 -0.047282 0.030004 -1.977772 -0.161595 0.092682 -0.005850
0.366667 -0.052742 0.033129 -1.980007 -0.165595 0.093158 -0.005655
0.400000 -0.058324 0.036249 -1.974697 -0.169619 0.093613 -0.003522
0.433333 -0.064029 0.039363 -1.976524 -0.173666 0.094047 -0.004874
0.466667 -0.069885 0.042517 -1.975502 -0.177735 0.094456 -0.015630
0.500000 -0.075864 0.045663 -1.969925 -0.181827 0.094844 -0.042782
0.533333 -0.081966 0.048799 -1.986229 -0.185947 0.095220 -0.091853
0.566667 -0.088222 0.051975 -1.975718 -0.190098 0.095592 -0.174665
0.600000 -0.094635 0.055189 -1.973612 -0.194271 0.095948 -0.293698
0.633333 -0.101171 0.058390 -1.978150 -0.198464 0.096286 -0.449955
0.666667 -0.107865 0.061629 -1.980333 -0.202672 0.096599 -0.634116
0.700000 -0.114681 0.064851 -1.964947 -0.206886 0.096875 -0.837184
0.733333 -0.121659 0.068111 -1.981175 -0.211088 0.097091 -1.047928
0.766667 -0.128758 0.071352 -2.003721 -0.215272 0.097234 -1.248123
0.800000 -0.136021 0.074628 -2.088522 -0.219439 0.097301 -1.424801
0.833333 -0.143404 0.077883 -2.169594 -0.223588 0.097283 -1.560999
0.866667 -0.150952 0.081170 -2.261808 -0.227726 0.097179 -1.645171
0.900000 -0.158619 0.084432 -2.353262 -0.231862 0.096986 -1.663137
0.933333 -0.166405 0.087667 -2.404188 -0.236018 0.096719 -1.611426
0.966667 -0.174357 0.090923 -2.480924 -0.240201 0.096376 -1.489745
1.000000 -0.182426 0.094148 -2.540605 -0.244419 0.095957 -1.307884
1.033333 -0.190612 0.097342 -2.588875 -0.248672 0.095464 -1.079902
1.066667 -0.198913 0.100502 -2.621893 -0.252961 0.094899 -0.824415
1.100000 -0.207383 0.103660 -2.647280 -0.257282 0.094261 -0.565418
1.133333 -0.216023 0.106811 -2.660991 -0.261618 0.093542 -0.316967
1.166667 -0.224833 0.109947 -2.662180 -0.265964 0.092742 -0.094980
1.200000 -0.233815 0.113062 -2.645022 -0.270300 0.091856 0.090936
1.233333 -0.242906 0.116135 -2.606983 -0.274612 0.090880 0.234330
1.266667 -0.252168 0.119177 -2.573919 -0.278873 0.089806 0.332529
1.300000 -0.261536 0.122174 -2.550869 -0.283062 0.088633 0.388523
1.333333 -0.271071 0.125131 -2.532790 -0.287162 0.087363 0.404629
1.366667 -0.280710 0.128039 -2.517838 -0.291155 0.086000 0.385168
1.400000 -0.290512 0.130901 -2.497981 -0.295035 0.084549 0.341818
1.433333 -0.300414 0.133711 -2.488666 -0.298799 0.083014 0.283966
1.466667 -0.310472 0.136467 -2.486296 -0.302453 0.081404 0.221643
1.500000 -0.320682 0.139164 -2.476077 -0.305996 0.079722 0.161711
1.533333 -0.330988 0.141806 -2.489771 -0.309443 0.077968 0.109680
1.566667 -0.341388 0.144389 -2.482592 -0.312802 0.076140 0.070550
1.600000 -0.351880 0.146913 -2.485210 -0.316083 0.074238 0.040983
1.633333 -0.362463 0.149377 -2.486389 -0.319293 0.072258 0.019919
1.666667 -0.373133 0.151778 -2.492323 -0.322450 0.070195 0.005040
1.700000 -0.383936 0.154102 -2.502499 -0.325567 0.068048 -0.005095
1.733333 -0.394867 0.156345 -2.481947 -0.328647 0.065818 -0.014500
1.766667 -0.405881 0.158523 -2.484955 -0.331689 0.063508 -0.025223
1.800000 -0.416974 0.160633 -2.486438 -0.334688 0.061121 -0.037000
1.833333 -0.428184 0.162654 -2.477039 -0.337637 0.058664 -0.050033
1.866667 -0.439506 0.164583 -2.488727 -0.340514 0.056146 -0.064701
1.900000 -0.450937 0.166417 -2.483192 -0.343301 0.053580 -0.083264
1.933333 -0.462472 0.168155 -2.493650 -0.345986 0.050973 -0.101537
1.966667 -0.474076 0.169819 -2.501313 -0.348560 0.048332 -0.119749
2.000000 -0.485776 0.171382 -2.507098 -0.351011 0.045662 -0.137228
2.033333 -0.497540 0.172870 -2.511979 -0.353337 0.042964 -0.154434
2.066667 -0.509391 0.174252 -2.511570 -0.355539 0.040228 -0.171639
2.100000 -0.521302 0.175558 -2.517295 -0.357625 0.037446 -0.184322
2.133333 -0.533291 0.176753 -2.532010 -0.359598 0.034609 -0.194437
2.166667 -0.545333 0.177870 -2.525671 -0.361463 0.031719 -0.202832
2.200000 -0.557427 0.178911 -2.537758 -0.363226 0.028772 -0.207094
2.233333 -0.569570 0.179874 -2.547925 -0.364892 0.025773 -0.206532
2.266667 -0.581775 0.180717 -2.550453 -0.366461 0.022731 -0.200918
2.300000 -0.594037 0.181440 -2.564679 -0.367932 0.019656 -0.192835
2.333333 -0.606351 0.182039 -2.580988 -0.369302 0.016547 -0.183979
2.366667 -0.618713 0.182514 -2.591058 -0.370568 0.013401 -0.170083
2.400000 -0.631118 0.182862 -2.594838 -0.371725 0.010220 -0.155994
2.433333 -0.643557 0.183132 -2.583010 -0.372767 0.007002 -0.142978
2.466667 -0.656026 0.183324 -2.585191 -0.373691 0.003743 -0.131269
2.500000 -0.668524 0.183438 -2.599417 -0.374492 0.000434 -0.122391
2.533333 -0.681047 0.183419 -2.590366 -0.375170 -0.002923 -0.114067
2.566667 -0.693593 0.183323 -2.599568 -0.375726 -0.006330 -0.109371
2.600000 -0.706155 0.183092 -2.607319 -0.376163 -0.009783 -0.104564
2.633333 -0.718729 0.182726 -2.601759 -0.376486 -0.013277 -0.097656
2.666667 -0.731309 0.182223 -2.621268 -0.376700 -0.016795 -0.085122
2.700000 -0.743891 0.181582 -2.614707 -0.376810 -0.020313 -0.064733
2.733333 -0.756470 0.180804 -2.623858 -0.376818 -0.023811 -0.037136
2.766667 -0.769057 0.179953 -2.620075 -0.376729 -0.027264 -0.002772
2.800000 -0.781632 0.178964 -2.631347 -0.376542 -0.030662 0.036742
2.833333 -0.794190 0.177835 -2.641837 -0.376256 -0.033997 0.081690
2.866667 -0.806750 0.176637 -2.624397 -0.375872 -0.037266 0.124754
2.900000 -0.819285 0.175301 -2.616650 -0.375397 -0.040460 0.163434
2.933333 -0.831816 0.173900 -2.611411 -0.374833 -0.043581 0.195290
2.966667 -0.844342 0.172435 -2.599049 -0.374184 -0.046627 0.217276
3.000000 -0.856829 0.170834 -2.589193 -0.373456 -0.049591 0.227071
3.033333 -0.869275 0.169095 -2.568211 -0.372648 -0.052477 0.218083
3.066667 -0.881708 0.167299 -2.565136 -0.371761 -0.055285 0.195583
3.100000 -0.894091 0.165368 -2.549399 -0.370787 -0.058033 0.160716
3.133333 -0.906419 0.163303 -2.548699 -0.369717 -0.060733 0.116105
3.166667 -0.918729 0.161188 -2.534147 -0.368543 -0.063399 0.067058
3.200000 -0.931019 0.159024 -2.536702 -0.367252 -0.066052 0.017615
3.233333 -0.943286 0.156814 -2.533847 -0.365833 -0.068711 -0.024109
3.266667 -0.955529 0.154561 -2.541824 -0.364273 -0.071397 -0.058247
3.300000 -0.967698 0.152182 -2.559059 -0.362565 -0.074126 -0.081177
3.333333 -0.979788 0.149677 -2.566087 -0.360708 -0.076901 -0.093890
3.366667 -0.991795 0.147047 -2.580945 -0.358706 -0.079718 -0.094958
3.400000 -1.003772 0.144386 -2.583959 -0.356567 -0.082569 -0.085497
3.433333 -1.015660 0.141603 -2.578689 -0.354310 -0.085418 -0.067828
3.466667 -1.027455 0.138701 -2.585184 -0.351962 -0.088226 -0.041735
3.500000 -1.039153 0.135678 -2.578069 -0.349555 -0.090939 -0.013393
3.533333 -1.050752 0.132539 -2.577887 -0.347112 -0.093524 0.017458
3.566667 -1.062247 0.129282 -2.574389 -0.344651 -0.095951 0.043750
3.600000 -1.073704 0.126016 -2.576131 -0.342197 -0.098182 0.062608
3.633333 -1.085051 0.122638 -2.565943 -0.339760 -0.100200 0.071148
3.666667 -1.096358 0.119258 -2.586033 -0.337340 -0.102009 0.068133
3.700000 -1.107550 0.115770 -2.569058 -0.334933 -0.103617 0.054219
3.733333 -1.118624 0.112177 -2.563071 -0.332544 -0.105015 0.029962
3.766667 -1.129656 0.108595 -2.548551 -0.330177 -0.106201 0.000379
3.800000 -1.140646 0.105029 -2.533882 -0.327828 -0.107182 -0.031544
3.833333 -1.151594 0.101484 -2.535554 -0.325491 -0.107964 -0.061615
3.866667 -1.162416 0.097848 -2.551193 -0.323175 -0.108537 -0.089391
3.900000 -1.173112 0.094128 -2.561395 -0.320885 -0.108887 -0.107765
3.933333 -1.183764 0.090444 -2.582382 -0.318608 -0.109031 -0.114121
3.966667 -1.194292 0.086692 -2.588941 -0.316350 -0.108960 -0.107672
4.000000 -1.204776 0.082986 -2.587786 -0.314114 -0.108667 -0.086339
4.033333 -1.215217 0.079331 -2.607924 -0.311917 -0.108130 -0.050369
4.066667 -1.225615 0.075733 -2.613860 -0.309764 -0.107350 -0.001229
4.100000 -1.235889 0.072108 -2.598360 -0.307657 -0.106326 0.054074
4.133333 -1.246122 0.068550 -2.595345 -0.305618 -0.105043 0.110167
4.166667 -1.256232 0.064987 -2.589473 -0.303654 -0.103500 0.162653
4.200000 -1.266300 0.061502 -2.578454 -0.301769 -0.101701 0.205730
4.233333 -1.276328 0.058101 -2.568814 -0.299956 -0.099656 0.233839
4.266667 -1.286237 0.054727 -2.566451 -0.298221 -0.097359 0.247442
4.300000 -1.296107 0.051449 -2.547892 -0.296557 -0.094810 0.245193
4.333333 -1.305938 0.048272 -2.525849 -0.294950 -0.092016 0.226245
4.366667 -1.315731 0.045201 -2.517118 -0.293371 -0.088984 0.191895
4.400000 -1.325486 0.042242 -2.508593 -0.291803 -0.085721 0.142861
4.433333 -1.335206 0.039401 -2.500373 -0.290231 -0.082231 0.081662
4.466667 -1.344890 0.036684 -2.503210 -0.288631 -0.078529 0.006797
4.500000 -1.354540 0.034096 -2.500865 -0.286986 -0.074621 -0.075639
4.533333 -1.364085 0.031627 -2.506015 -0.285293 -0.070510 -0.158940
4.566667 -1.373598 0.029298 -2.512899 -0.283560 -0.066194 -0.241615
4.600000 -1.383010 0.027112 -2.502728 -0.281792 -0.061666 -0.316904
4.633333 -1.392393 0.025077 -2.534720 -0.279987 -0.056922 -0.369941
4.666667 -1.401678 0.023207 -2.557902 -0.278158 -0.051951 -0.387280
4.700000 -1.410868 0.021513 -2.565772 -0.276323 -0.046746 -0.363633
4.733333 -1.420033 0.019988 -2.601858 -0.274493 -0.041306 -0.296601
4.766667 -1.429175 0.018638 -2.625335 -0.272684 -0.035634 -0.184311
4.800000 -1.438229 0.017493 -2.645018 -0.270910 -0.029740 -0.029731
4.833333 -1.447263 0.016534 -2.663367 -0.269195 -0.023636 0.141578
4.866667 -1.456215 0.015795 -2.672635 -0.267557 -0.017337 0.307186
4.900000 -1.465090 0.015283 -2.691296 -0.266006 -0.010860 0.452937
4.933333 -1.473890 0.015003 -2.673066 -0.264562 -0.004221 0.563584
4.966667 -1.482622 0.014959 -2.573540 -0.263239 0.002568 0.625319
5.000000 -1.491294 0.015157 -2.476865 -0.262051 0.009493 0.624435
5.033333 -1.499957 0.015573 -2.412108 -0.261015 0.016537 0.565962
5.066667 -1.508614 0.016209 -2.382436 -0.260138 0.023695 0.459449
5.100000 -1.517266 0.017073 -2.390374 -0.259418 0.030964 0.310997
5.133333 -1.525877 0.018199 -2.384952 -0.258847 0.038348 0.131448
5.166667 -1.534450 0.019589 -2.415296 -0.258413 0.045850 -0.056952
5.200000 -1.543025 0.021221 -2.437157 -0.258100 0.053479 -0.229784
5.233333 -1.551606 0.023099 -2.459755 -0.257884 0.061249 -0.370847
5.266667 -1.560194 0.025228 -2.488853 -0.257751 0.069169 -0.473821
5.300000 -1.568760 0.027637 -2.512161 -0.257701 0.077243 -0.535482
5.333333 -1.577339 0.030306 -2.537822 -0.257727 0.085475 -0.553002
5.366667 -1.585932 0.033239 -2.568216 -0.257823 0.093872 -0.534093
5.400000 -1.594515 0.036467 -2.568994 -0.257995 0.102434 -0.493618
5.433333 -1.603092 0.039995 -2.584231 -0.258247 0.111155 -0.440986
5.466667 -1.611691 0.043799 -2.609112 -0.258586 0.120026 -0.381406
5.500000 -1.620293 0.047915 -2.633715 -0.259016 0.129038 -0.317138
5.533333 -1.628901 0.052348 -2.632311 -0.259545 0.138175 -0.254185
5.566667 -1.637540 0.057070 -2.638821 -0.260186 0.147413 -0.199253
5.600000 -1.646195 0.062119 -2.640365 -0.260943 0.156736 -0.148492
5.633333 -1.654871 0.067501 -2.635679 -0.261821 0.166127 -0.103353
5.666667 -1.663585 0.073182 -2.640653 -0.262821 0.175571 -0.064693
5.700000 -1.672329 0.079206 -2.629285 -0.263944 0.185063 -0.037930
5.733333 -1.681118 0.085538 -2.639546 -0.265188 0.194602 -0.019728
5.766667 -1.689954 0.092179 -2.640383 -0.266550 0.204196 -0.006078
5.800000 -1.698839 0.099134 -2.642191 -0.268026 0.213857 0.001944
5.833333 -1.707777 0.106404 -2.630645 -0.269615 0.223608 0.005600
5.866667 -1.716770 0.113995 -2.629598 -0.271315 0.233469 0.006406
5.900000 -1.725821 0.121907 -2.638790 -0.273121 0.243457 0.010769
5.933333 -1.734932 0.130144 -2.636364 -0.275034 0.253591 0.014001
5.966667 -1.744106 0.138708 -2.636387 -0.277051 0.263879 0.016628
6.000000 -1.753347 0.147603 -2.633039 -0.279173 0.274334 0.017357
6.033333 -1.762665 0.156893 -2.642393 -0.281401 0.284957 0.018216
6.066667 -1.772055 0.166518 -2.634023 -0.283740 0.295755 0.017601
6.100000 -1.781533 0.176549 -2.633874 -0.286198 0.306742 0.013785
6.133333 -1.791087 0.186919 -2.631170 -0.288777 0.317917 0.011366
6.166667 -1.800739 0.197705 -2.628311 -0.291485 0.329287 0.006785
6.200000 -1.810471 0.208834 -2.615480 -0.294326 0.340854 0.001253
6.233333 -1.820288 0.220307 -2.625405 -0.297308 0.352631 -0.006504
6.266667 -1.830215 0.232211 -2.641587 -0.300433 0.364615 -0.014967
6.300000 -1.840232 0.244462 -2.630668 -0.303706 0.376812 -0.027756
6.333333 -1.850369 0.257155 -2.637773 -0.307129 0.389222 -0.051111
6.366667 -1.860631 0.270294 -2.635460 -0.310698 0.401835 -0.085703
6.400000 -1.871024 0.283885 -2.631085 -0.314402 0.414616 -0.138032
6.433333 -1.881552 0.297931 -2.632410 -0.318224 0.427519 -0.217634
6.466667 -1.892179 0.312326 -2.630370 -0.322154 0.440510 -0.334396
6.500000 -1.902951 0.327187 -2.649328 -0.326168 0.453525 -0.490163
6.533333 -1.913871 0.342517 -2.647381 -0.330255 0.466522 -0.685866
6.566667 -1.924944 0.358321 -2.640573 -0.334416 0.479479 -0.921562
6.600000 -1.936175 0.374602 -2.658292 -0.338657 0.492391 -1.193103
6.633333 -1.947568 0.391364 -2.693049 -0.342981 0.505244 -1.491221
6.666667 -1.959071 0.408473 -2.757739 -0.347378 0.518003 -1.799644
6.700000 -1.970687 0.425927 -2.818059 -0.351854 0.530664 -2.105584
6.733333 -1.982416 0.443724 -2.902990 -0.356398 0.543208 -2.390477
6.766667 -1.994323 0.462013 -2.996965 -0.360982 0.555589 -2.635960
6.800000 -2.006413 0.480794 -3.112640 -0.365588 0.567777 -2.819448
6.833333 -2.018621 0.499912 3.039577 -0.370208 0.579768 -2.918099
6.866667 -2.031059 0.519523 2.915827 -0.374834 0.591556 -2.918666
6.900000 -2.043731 0.539625 2.818531 -0.379453 0.603128 -2.806621
6.933333 -2.056523 0.560056 2.682839 -0.384060 0.614476 -2.572713
6.966667 -2.069437 0.580813 2.557267 -0.388666 0.625616 -2.211626
7.000000 -2.082472 0.601893 2.453961 -0.393279 0.636567 -1.728771
7.033333 -2.095630 0.623293 2.368736 -0.397902 0.647337 -1.138463
7.066667 -2.108910 0.645009 2.312774 -0.402558 0.657960 -0.453764
7.100000 -2.122315 0.667037 2.293567 -0.407274 0.668480 0.303129
7.133333 -2.135980 0.689544 2.302291 -0.412065 0.678931 1.102417
7.166667 -2.149769 0.712356 2.356441 -0.416951 0.689344 1.906234
7.200000 -2.163683 0.735467 2.432134 -0.421932 0.699727 2.683842
7.233333 -2.177871 0.759046 2.571368 -0.426995 0.710071 3.403535
7.266667 -2.192182 0.782915 2.730335 -0.432129 0.720370 4.033396
7.300000 -2.206619 0.807071 2.922192 -0.437312 0.730606 4.546523
7.333333 -2.221339 0.831676 3.120719 -0.442535 0.740773 4.923084
7.366667 -2.236183 0.856557 -2.958409 -0.447767 0.750841 5.158279
7.400000 -2.251151 0.881708 -2.733634 -0.452990 0.760789 5.242836
7.433333 -2.266366 0.907292 -2.521211 -0.458208 0.770630 5.182720
7.466667 -2.281703 0.933136 -2.309749 -0.463408 0.780345 4.988239
7.500000 -2.297287 0.959401 -2.149895 -0.468562 0.789902 4.682354
7.533333 -2.312991 0.985914 -1.963788 -0.473660 0.799283 4.288365
7.566667 -2.328815 1.012668 -1.811587 -0.478707 0.808498 3.828448
7.600000 -2.344880 1.039830 -1.673577 -0.483708 0.817557 3.331929
7.633333 -2.361184 1.067396 -1.577837 -0.488647 0.826439 2.821973
7.666667 -2.377604 1.095184 -1.506458 -0.493525 0.835154 2.320917
7.700000 -2.394139 1.123185 -1.466025 -0.498357 0.843721 1.840179
7.733333 -2.410787 1.151393 -1.433516 -0.503143 0.852147 1.392462
7.766667 -2.427655 1.179980 -1.412876 -0.507863 0.860394 0.986076
7.800000 -2.444632 1.208759 -1.400344 -0.512496 0.868426 0.619625
7.833333 -2.461820 1.237902 -1.388851 -0.517042 0.876231 0.288896
7.866667 -2.479114 1.267221 -1.380160 -0.521485 0.883772 -0.012576
7.900000 -2.496606 1.296885 -1.394801 -0.525805 0.891009 -0.292303
7.933333 -2.514289 1.326884 -1.399831 -0.529976 0.897899 -0.556001
7.966667 -2.532072 1.357034 -1.422640 -0.534001 0.904445 -0.806009
8.000000 -2.550031 1.387496 -1.460116 -0.537876 0.910644 -1.035804
8.033333 -2.568086 1.418092 -1.483292 -0.541599 0.916497 -1.238469
8.066667 -2.586232 1.448811 -1.526009 -0.545175 0.922026 -1.403545
8.100000 -2.604468 1.479645 -1.575717 -0.548619 0.927259 -1.520237
8.133333 -2.622791 1.510585 -1.673760 -0.551957 0.932240 -1.578064
8.166667 -2.641257 1.541775 -1.758117 -0.555199 0.936983 -1.570853
8.200000 -2.659804 1.573052 -1.845805 -0.558362 0.941513 -1.497692
8.233333 -2.678481 1.604550 -1.929427 -0.561451 0.945822 -1.356758
8.266667 -2.697281 1.636252 -1.976099 -0.564465 0.949882 -1.156124
8.300000 -2.716154 1.668012 -2.000837 -0.567396 0.953658 -0.904362
8.333333 -2.735139 1.699944 -2.038130 -0.570227 0.957094 -0.617507
8.366667 -2.754234 1.732037 -2.051459 -0.572949 0.960146 -0.314841
8.400000 -2.773433 1.764271 -2.052580 -0.575547 0.962763 -0.012183
8.433333 -2.792692 1.796521 -2.047089 -0.578012 0.964915 0.271419
8.466667 -2.812047 1.828874 -2.027428 -0.580339 0.966584 0.526825
8.500000 -2.831456 1.861221 -1.971199 -0.582520 0.967754 0.744836
8.533333 -2.850915 1.893551 -1.937032 -0.584556 0.968427 0.922786
8.566667 -2.870457 1.925930 -1.883225 -0.586445 0.968607 1.060276
8.600000 -2.890078 1.958342 -1.847175 -0.588186 0.968306 1.158109
8.633333 -2.909739 1.990703 -1.795432 -0.589776 0.967530 1.219987
8.666667 -2.929470 2.023062 -1.748082 -0.591216 0.966289 1.248316
8.700000 -2.949234 2.055350 -1.709698 -0.592509 0.964594 1.248150
8.733333 -2.969056 2.087599 -1.657105 -0.593651 0.962449 1.216457
8.766667 -2.988905 2.119754 -1.615199 -0.594642 0.959854 1.160003
8.800000 -3.008776 2.151802 -1.581358 -0.595483 0.956815 1.080621
8.833333 -3.028665 2.183733 -1.537762 -0.596175 0.953338 0.979071
8.866667 -3.048570 2.215535 -1.484003 -0.596717 0.949428 0.853507
8.900000 -3.068497 2.247203 -1.472127 -0.597109 0.945089 0.707985
8.933333 -3.088432 2.278720 -1.440896 -0.597355 0.940336 0.552285
8.966667 -3.108381 2.310078 -1.409307 -0.597453 0.935175 0.389595
9.000000 -3.128336 2.341258 -1.387447 -0.597404 0.929614 0.223929
9.033333 -3.148290 2.372244 -1.390170 -0.597205 0.923661 0.064615
9.066667 -3.168236 2.403034 -1.419428 -0.596855 0.917318 -0.072923
9.100000 -3.188164 2.433595 -1.431885 -0.596353 0.910590 -0.188899
9.133333 -3.208064 2.463906 -1.439427 -0.595693 0.903474 -0.278424
9.166667 -3.227945 2.493989 -1.463398 -0.594878 0.895975 -0.339706
9.200000 -3.247783 2.523792 -1.496983 -0.593910 0.888098 -0.367738
9.233333 -3.267595 2.553344 -1.506003 -0.592787 0.879836 -0.366627
9.266667 -3.287378 2.582636 -1.540709 -0.591508 0.871183 -0.346199
9.300000 -3.307096 2.611599 -1.537649 -0.590067 0.862121 -0.308631
9.333333 -3.326778 2.640280 -1.545582 -0.588458 0.852634 -0.259524
9.366667 -3.346420 2.668670 -1.551343 -0.586665 0.842685 -0.202685
9.400000 -3.365975 2.696676 -1.544723 -0.584667 0.832227 -0.147490
9.433333 -3.385484 2.724370 -1.560408 -0.582444 0.821218 -0.093364
9.466667 -3.404891 2.751646 -1.559313 -0.579983 0.809625 -0.042706
9.500000 -3.424245 2.778590 -1.564486 -0.577268 0.797413 0.007419
9.533333 -3.443542 2.805191 -1.556187 -0.574294 0.784570 0.056779
9.566667 -3.462720 2.831324 -1.552995 -0.571063 0.771099 0.105075
9.600000 -3.481771 2.856970 -1.546518 -0.567592 0.757033 0.157326
9.633333 -3.500690 2.882112 -1.555128 -0.563911 0.742434 0.211839
9.666667 -3.519469 2.906732 -1.547080 -0.560058 0.727380 0.270980
9.700000 -3.538104 2.930814 -1.532392 -0.556086 0.711986 0.332636
9.733333 -3.556586 2.954339 -1.524729 -0.552050 0.696367 0.396271
9.766667 -3.574912 2.977294 -1.506036 -0.548002 0.680637 0.461472
9.800000 -3.593075 2.999661 -1.487258 -0.543979 0.664875 0.526057
9.833333 -3.611069 3.021426 -1.477322 -0.539998 0.649120 0.589494
9.866667 -3.628979 3.042767 -1.448467 -0.536052 0.633363 0.649263
9.900000 -3.646711 3.063480 -1.426781 -0.532114 0.617549 0.704382
9.933333 -3.664355 3.083755 -1.399856 -0.528133 0.601579 0.753549
9.966667 -3.681907 3.103586 -1.372260 -0.524053 0.585337 0.797430
10.000000 -3.699368 3.122966 -1.341630 -0.519826 0.568724 0.836158
10.033333 -3.716733 3.141890 -1.310390 -0.515412 0.551663 0.868088
10.066667 -3.734003 3.160351 -1.284052 -0.510796 0.534126 0.897461
10.100000 -3.751068 3.178118 -1.253767 -0.505974 0.516105 0.925578
10.133333 -3.767927 3.195184 -1.221315 -0.500967 0.497646 0.950737
10.166667 -3.784577 3.211544 -1.179745 -0.495821 0.478849 0.963348
10.200000 -3.801015 3.227191 -1.153630 -0.490584 0.459809 0.952890
10.233333 -3.817239 3.242119 -1.125736 -0.485309 0.440639 0.909193
10.266667 -3.833245 3.256325 -1.097655 -0.480051 0.421454 0.813256
10.300000 -3.849034 3.269805 -1.057358 -0.474866 0.402364 0.646248
10.333333 -3.864717 3.282788 -1.018250 -0.469793 0.383447 0.400289
10.366667 -3.880293 3.295273 -0.979681 -0.464839 0.364705 0.073647
10.400000 -3.895761 3.307255 -0.930506 -0.460002 0.346124 -0.332591
10.433333 -3.911018 3.318515 -0.888748 -0.455270 0.327669 -0.812904
10.466667 -3.926070 3.329054 -0.893088 -0.450618 0.309270 -1.349803
10.500000 -3.941013 3.339086 -0.952789 -0.446009 0.290839 -1.915874
10.533333 -3.955760 3.348405 -1.049645 -0.441424 0.272337 -2.490633
10.566667 -3.970399 3.357215 -1.160755 -0.436865 0.253772 -3.044412
10.600000 -3.984929 3.365513 -1.312288 -0.432341 0.235172 -3.545366
10.633333 -3.999279 3.373114 -1.481206 -0.427860 0.216563 -3.960969
10.666667 -4.013456 3.380023 -1.611419 -0.423432 0.197989 -4.273458
10.700000 -4.027464 3.386247 -1.808861 -0.419082 0.179524 -4.472605
10.733333 -4.041309 3.391793 -2.001077 -0.414821 0.161209 -4.551143
10.766667 -4.055046 3.396828 -2.178378 -0.410652 0.143062 -4.514835
10.800000 -4.068630 3.401204 -2.354952 -0.406588 0.125115 -4.373648
10.833333 -4.082063 3.404929 -2.515558 -0.402642 0.107395 -4.148959
10.866667 -4.095392 3.408148 -2.668466 -0.398825 0.089925 -3.851610
10.900000 -4.108616 3.410862 -2.794316 -0.395139 0.072695 -3.501632
10.933333 -4.121702 3.412955 -2.923506 -0.391588 0.055694 -3.116817
10.966667 -4.134685 3.414547 -3.001246 -0.388176 0.038922 -2.713830
11.000000 -4.147537 3.415538 -3.083142 -0.384894 0.022365 -2.310682
11.033333 -4.160260 3.415938 3.132744 -0.381735 0.006007 -1.916136
11.066667 -4.172884 3.415843 3.084939 -0.378697 -0.010162 -1.542702
11.100000 -4.185426 3.415173 3.045025 -0.375777 -0.026132 -1.193660
11.133333 -4.197891 3.413938 3.034912 -0.372970 -0.041895 -0.875261
11.166667 -4.210259 3.412218 3.019197 -0.370269 -0.057439 -0.586265
11.200000 -4.222532 3.410018 3.005059 -0.367665 -0.072769 -0.325392
11.233333 -4.234735 3.407280 3.000018 -0.365149 -0.087886 -0.092992
11.266667 -4.246845 3.404068 3.002216 -0.362704 -0.102790 0.110454
11.300000 -4.258893 3.400336 3.013994 -0.360311 -0.117489 0.283014
11.333333 -4.270849 3.396139 3.026556 -0.357959 -0.131994 0.428979
11.366667 -4.282716 3.391481 3.052703 -0.355636 -0.146319 0.544798
11.400000 -4.294529 3.386330 3.083991 -0.353333 -0.160461 0.631586
11.433333 -4.306291 3.380696 3.116193 -0.351044 -0.174418 0.690471
11.466667 -4.317967 3.374614 -3.133739 -0.348762 -0.188187 0.724549
11.500000 -4.329558 3.368068 -3.092939 -0.346490 -0.201767 0.737182
11.533333 -4.341067 3.361068 -3.069254 -0.344226 -0.215148 0.729158
11.566667 -4.352498 3.353621 -3.036485 -0.341969 -0.228323 0.706726
11.600000 -4.363854 3.345736 -3.020666 -0.339721 -0.241290 0.673576
11.633333 -4.375129 3.337428 -3.008624 -0.337491 -0.254045 0.633971
11.666667 -4.386336 3.328699 -2.989244 -0.335288 -0.266587 0.590286
11.700000 -4.397465 3.319557 -2.982186 -0.333123 -0.278911 0.548423
11.733333 -4.408530 3.310011 -2.956337 -0.331001 -0.291016 0.510842
11.766667 -4.419519 3.300064 -2.928434 -0.328933 -0.302904 0.477273
11.800000 -4.430434 3.289722 -2.909858 -0.326928 -0.314573 0.447149
11.833333 -4.441275 3.278991 -2.900307 -0.324989 -0.326021 0.418835
11.866667 -4.452064 3.267887 -2.896913 -0.323118 -0.337249 0.392804
11.900000 -4.462782 3.256406 -2.883830 -0.321310 -0.348261 0.364893
11.933333 -4.473430 3.244553 -2.872443 -0.319567 -0.359057 0.335041
11.966667 -4.484033 3.232351 -2.855646 -0.317887 -0.369635 0.303704
12.000000 -4.494592 3.219809 -2.850745 -0.316265 -0.379998 0.270956
12.033333 -4.505111 3.206933 -2.835631 -0.314691 -0.390149 0.236812
12.066667 -4.515565 3.193711 -2.827648 -0.313167 -0.400083 0.199740
12.100000 -4.525982 3.180172 -2.823278 -0.311693 -0.409793 0.161032
12.133333 -4.536337 3.166299 -2.814936 -0.310267 -0.419275 0.120943
12.166667 -4.546657 3.152127 -2.811177 -0.308885 -0.428528 0.080787
12.200000 -4.556916 3.137632 -2.816404 -0.307548 -0.437548 0.043436
12.233333 -4.567116 3.122822 -2.805916 -0.306262 -0.446329 0.009794
12.266667 -4.577285 3.107736 -2.810701 -0.305022 -0.454874 -0.017764
12.300000 -4.587426 3.092383 -2.815808 -0.303823 -0.463188 -0.038363
12.333333 -4.597510 3.076734 -2.826055 -0.302661 -0.471279 -0.050799
12.366667 -4.607567 3.060834 -2.827107 -0.301537 -0.479145 -0.055712
12.400000 -4.617599 3.044690 -2.840261 -0.300446 -0.486792 -0.056273
12.433333 -4.627605 3.028310 -2.833633 -0.299381 -0.494228 -0.050706
12.466667 -4.637586 3.011703 -2.836725 -0.298339 -0.501453 -0.039723
12.500000 -4.647515 2.994831 -2.837451 -0.297319 -0.508469 -0.026800
12.533333 -4.657392 2.977701 -2.828285 -0.296319 -0.515280 -0.015307
12.566667 -4.667247 2.960363 -2.833499 -0.295331 -0.521894 -0.006846
12.600000 -4.677052 2.942781 -2.843421 -0.294359 -0.528309 0.000633
12.633333 -4.686836 2.925005 -2.830911 -0.293404 -0.534522 0.003716
12.666667 -4.696599 2.907043 -2.833438 -0.292463 -0.540540 0.000525
12.700000 -4.706341 2.888902 -2.829211 -0.291532 -0.546369 -0.006207
12.733333 -4.716036 2.870542 -2.836476 -0.290612 -0.552009 -0.013662
12.766667 -4.725712 2.852018 -2.823806 -0.289700 -0.557463 -0.022319
12.800000 -4.735370 2.833335 -2.824542 -0.288789 -0.562748 -0.034904
12.833333 -4.744982 2.814452 -2.834031 -0.287873 -0.567869 -0.048141
12.866667 -4.754548 2.795375 -2.838434 -0.286954 -0.572823 -0.059040
12.900000 -4.764098 2.776160 -2.847805 -0.286034 -0.577608 -0.067986
12.933333 -4.773631 2.756814 -2.835750 -0.285114 -0.582221 -0.077891
12.966667 -4.783120 2.737292 -2.836432 -0.284198 -0.586657 -0.086853
13.000000 -4.792565 2.717601 -2.851648 -0.283298 -0.590891 -0.092758
13.033333 -4.801995 2.697800 -2.849755 -0.282418 -0.594917 -0.097720
13.066667 -4.811381 2.677841 -2.858065 -0.281563 -0.598728 -0.103554
13.100000 -4.820752 2.657782 -2.864733 -0.280734 -0.602318 -0.109576
13.133333 -4.830081 2.637578 -2.860125 -0.279939 -0.605675 -0.112994
13.166667 -4.839395 2.617287 -2.862727 -0.279174 -0.608801 -0.114011
13.200000 -4.848666 2.596862 -2.858973 -0.278436 -0.611707 -0.115128
13.233333 -4.857923 2.576362 -2.868880 -0.277720 -0.614395 -0.115809
13.266667 -4.867165 2.555793 -2.880296 -0.277022 -0.616876 -0.116461
13.300000 -4.876394 2.535160 -2.892654 -0.276332 -0.619165 -0.116672
13.333333 -4.885607 2.514470 -2.893799 -0.275634 -0.621291 -0.116061
13.366667 -4.894778 2.493676 -2.890324 -0.274921 -0.623263 -0.115937
13.400000 -4.903934 2.472834 -2.891388 -0.274183 -0.625101 -0.113178
13.433333 -4.913075 2.451950 -2.888592 -0.273411 -0.626821 -0.108303
13.466667 -4.922199 2.431030 -2.896374 -0.272598 -0.628434 -0.098751
13.500000 -4.931280 2.410027 -2.905441 -0.271741 -0.629942 -0.086845
13.533333 -4.940342 2.388997 -2.908893 -0.270844 -0.631340 -0.072325
13.566667 -4.949359 2.367896 -2.916091 -0.269904 -0.632633 -0.050979
13.600000 -4.958357 2.346778 -2.926056 -0.268924 -0.633814 -0.023083
13.633333 -4.967310 2.325599 -2.913999 -0.267906 -0.634879 0.012139
13.666667 -4.976217 2.304363 -2.911898 -0.266857 -0.635817 0.050864
13.700000 -4.985101 2.283125 -2.925364 -0.265777 -0.636623 0.095152
13.733333 -4.993939 2.261841 -2.917454 -0.264674 -0.637283 0.140369
13.766667 -5.002751 2.240561 -2.917057 -0.263551 -0.637787 0.180986
13.800000 -5.011536 2.219291 -2.898454 -0.262410 -0.638126 0.212132
13.833333 -5.020272 2.197990 -2.896007 -0.261253 -0.638305 0.233177
13.866667 -5.028961 2.176662 -2.877493 -0.260074 -0.638331 0.243429
13.900000 -5.037601 2.155311 -2.861530 -0.258872 -0.638212 0.237832
13.933333 -5.046208 2.133986 -2.849680 -0.257640 -0.637969 0.222124
13.966667 -5.054781 2.112690 -2.835801 -0.256373 -0.637612 0.197535
14.000000 -5.063317 2.091427 -2.828255 -0.255069 -0.637148 0.168800
14.033333 -5.071814 2.070201 -2.818414 -0.253723 -0.636583 0.134609
14.066667 -5.080272 2.049015 -2.825397 -0.252334 -0.635919 0.098227
14.100000 -5.088678 2.027833 -2.828094 -0.250898 -0.635156 0.063258
14.133333 -5.097030 2.006660 -2.833285 -0.249414 -0.634289 0.024487
14.166667 -5.105327 1.985499 -2.832359 -0.247880 -0.633314 -0.017131
14.200000 -5.113570 1.964356 -2.837652 -0.246298 -0.632227 -0.060867
14.233333 -5.121758 1.943233 -2.847234 -0.244668 -0.631018 -0.104002
14.266667 -5.129893 1.922171 -2.818308 -0.242994 -0.629678 -0.149506
14.300000 -5.137974 1.901173 -2.819013 -0.241280 -0.628206 -0.194935
14.333333 -5.145999 1.880243 -2.824034 -0.239529 -0.626608 -0.236688
14.366667 -5.153964 1.859348 -2.834791 -0.237741 -0.624887 -0.273454
14.400000 -5.161869 1.838526 -2.855654 -0.235919 -0.623057 -0.305990
14.433333 -5.169711 1.817779 -2.889495 -0.234063 -0.621134 -0.331737
14.466667 -5.177488 1.797111 -2.908227 -0.232171 -0.619132 -0.343101
14.500000 -5.185202 1.776494 -2.921908 -0.230246 -0.617059 -0.340241
14.533333 -5.192850 1.755959 -2.919782 -0.228287 -0.614915 -0.325370
14.566667 -5.200433 1.735481 -2.936433 -0.226296 -0.612704 -0.298830
14.600000 -5.207951 1.715064 -2.947093 -0.224273 -0.610420 -0.262727
14.633333 -5.215399 1.694739 -2.955214 -0.222219 -0.608057 -0.223360
14.666667 -5.222781 1.674480 -2.961175 -0.220133 -0.605604 -0.188401
14.700000 -5.230090 1.654318 -2.970825 -0.218016 -0.603058 -0.159581
14.733333 -5.237330 1.634228 -2.973391 -0.215867 -0.600416 -0.133607
14.766667 -5.244496 1.614241 -2.970029 -0.213687 -0.597678 -0.112437
14.800000 -5.251591 1.594333 -2.962953 -0.211476 -0.594846 -0.095356
14.833333 -5.258611 1.574530 -2.962227 -0.209235 -0.591927 -0.081471
14.866667 -5.265553 1.554837 -2.974983 -0.206965 -0.588932 -0.067333
14.900000 -5.272422 1.535231 -2.978931 -0.204667 -0.585865 -0.054194
14.933333 -5.279212 1.515738 -2.985681 -0.202342 -0.582729 -0.045118
14.966667 -5.285922 1.496364 -2.987909 -0.199988 -0.579522 -0.039704
15.000000 -5.292551 1.477109 -2.994745 -0.197605 -0.576245 -0.037215
15.033333 -5.299103 1.457950 -2.988924 -0.195193 -0.572891 -0.035097
15.066667 -5.305576 1.438889 -2.980799 -0.192750 -0.569451 -0.036309
15.100000 -5.311971 1.419929 -2.976641 -0.190276 -0.565923 -0.040046
15.133333 -5.318280 1.401098 -2.971473 -0.187769 -0.562305 -0.046357
15.166667 -5.324509 1.382372 -2.985425 -0.185232 -0.558599 -0.052926
15.200000 -5.330650 1.363780 -2.984364 -0.182665 -0.554809 -0.060905
15.233333 -5.336704 1.345325 -2.986786 -0.180069 -0.550947 -0.069908
15.266667 -5.342668 1.327011 -2.994065 -0.177447 -0.547026 -0.078832
15.300000 -5.348542 1.308839 -3.002572 -0.174802 -0.543064 -0.086903
15.333333 -5.354327 1.290811 -3.008291 -0.172137 -0.539075 -0.092582
15.366667 -5.360020 1.272931 -3.007082 -0.169454 -0.535078 -0.099462
15.400000 -5.365626 1.255167 -3.005963 -0.166755 -0.531085 -0.106769
15.433333 -5.371142 1.237553 -3.004541 -0.164041 -0.527104 -0.115774
15.466667 -5.376568 1.220058 -3.011724 -0.161312 -0.523140 -0.123807
15.500000 -5.381903 1.202685 -3.011238 -0.158567 -0.519191 -0.130559
15.533333 -5.387147 1.185433 -3.019852 -0.155805 -0.515251 -0.134020
15.566667 -5.392299 1.168305 -3.012197 -0.153025 -0.511305 -0.131411
15.600000 -5.397361 1.151335 -3.034059 -0.150226 -0.507341 -0.119488
15.633333 -5.402328 1.134491 -3.040273 -0.147408 -0.503339 -0.096992
15.666667 -5.407200 1.117773 -3.051716 -0.144570 -0.499285 -0.065258
15.700000 -5.411976 1.101183 -3.058463 -0.141712 -0.495169 -0.023614
15.733333 -5.416654 1.084720 -3.068501 -0.138835 -0.490982 0.024710
15.766667 -5.421235 1.068387 -3.057591 -0.135939 -0.486723 0.077839
15.800000 -5.425724 1.052224 -3.054879 -0.133020 -0.482393 0.129995
15.833333 -5.430113 1.036191 -3.043379 -0.130079 -0.478005 0.177283
15.866667 -5.434401 1.020289 -3.026943 -0.127112 -0.473564 0.215607
15.900000 -5.438595 1.004562 -3.016317 -0.124118 -0.469077 0.239896
15.933333 -5.442692 0.989011 -3.011878 -0.121094 -0.464554 0.247003
15.966667 -5.446691 0.973638 -2.994083 -0.118038 -0.460009 0.236264
16.000000 -5.450585 0.958397 -2.987187 -0.114949 -0.455451 0.210081
16.033333 -5.454373 0.943290 -2.966117 -0.111826 -0.450881 0.168412
16.066667 -5.458055 0.928316 -2.959091 -0.108669 -0.446308 0.115310
16.100000 -5.461633 0.913525 -2.956796 -0.105479 -0.441739 0.056221
16.133333 -5.465102 0.898869 -2.959650 -0.102256 -0.437182 -0.002277
16.166667 -5.468462 0.884345 -2.956367 -0.099004 -0.432635 -0.055457
16.200000 -5.471714 0.870011 -2.962304 -0.095723 -0.428097 -0.100746
16.233333 -5.474854 0.855809 -2.967899 -0.092417 -0.423572 -0.131177
16.266667 -5.477885 0.841795 -2.992139 -0.089085 -0.419064 -0.143457
16.300000 -5.480803 0.827913 -3.002543 -0.085731 -0.414567 -0.136889
16.333333 -5.483607 0.814164 -3.004227 -0.082356 -0.410072 -0.113234
16.366667 -5.486306 0.800600 -3.024120 -0.078963 -0.405569 -0.073787
16.400000 -5.488889 0.787167 -3.031530 -0.075551 -0.401047 -0.020343
16.433333 -5.491354 0.773865 -3.024161 -0.072120 -0.396499 0.040561
16.466667 -5.493701 0.760692 -3.022480 -0.068672 -0.391903 0.103900
16.500000 -5.495928 0.747649 -3.010280 -0.065204 -0.387253 0.163094
16.533333 -5.498047 0.734791 -2.996909 -0.061714 -0.382555 0.213335
16.566667 -5.500055 0.722117 -2.992635 -0.058199 -0.377817 0.250062
16.600000 -5.501941 0.709570 -2.983832 -0.054655 -0.373057 0.267752
16.633333 -5.503712 0.697204 -2.959517 -0.051080 -0.368291 0.268269
16.666667 -5.505366 0.685021 -2.944581 -0.047470 -0.363552 0.249948
16.700000 -5.506900 0.673017 -2.933991 -0.043821 -0.358868 0.218163
16.733333 -5.508313 0.661191 -2.915722 -0.040131 -0.354261 0.177716
16.766667 -5.509599 0.649487 -2.926125 -0.036400 -0.349746 0.133613
16.800000 -5.510761 0.637958 -2.904194 -0.032627 -0.345339 0.090234
16.833333 -5.511795 0.626547 -2.906600 -0.028814 -0.341047 0.051154
16.866667 -5.512699 0.615253 -2.922241 -0.024963 -0.336870 0.022090
16.900000 -5.513474 0.604125 -2.920617 -0.021076 -0.332805 0.001723
16.933333 -5.514117 0.593111 -2.946064 -0.017157 -0.328847 -0.006578
16.966667 -5.514628 0.582209 -2.944774 -0.013208 -0.324992 -0.008220
17.000000 -5.515008 0.571457 -2.942386 -0.009230 -0.321232 0.000069
17.033333 -5.515256 0.560849 -2.931214 -0.005226 -0.317566 0.012922
17.066667 -5.515369 0.550348 -2.929983 -0.001196 -0.313995 0.025632
17.100000 -5.515348 0.539980 -2.916084 0.002859 -0.310518 0.036729
17.133333 -5.515191 0.529715 -2.935785 0.006939 -0.307139 0.040154
17.166667 -5.514897 0.519552 -2.923561 0.011044 -0.303863 0.038944
17.200000 -5.514464 0.509489 -2.915946 0.015174 -0.300691 0.030617
17.233333 -5.513895 0.499537 -2.914380 0.019329 -0.297624 0.016819
17.266667 -5.513187 0.489692 -2.904461 0.023510 -0.294662 -0.001954
17.300000 -5.512340 0.479941 -2.916789 0.027717 -0.291803 -0.021402
17.333333 -5.511352 0.470287 -2.924179 0.031951 -0.289048 -0.041380
17.366667 -5.510223 0.460723 -2.925106 0.036211 -0.286398 -0.060442
17.400000 -5.508951 0.451245 -2.921289 0.040500 -0.283859 -0.078156
17.433333 -5.507536 0.441853 -2.925753 0.044818 -0.281436 -0.092450
17.466667 -5.505977 0.432538 -2.930386 0.049165 -0.279134 -0.099032
17.500000 -5.504271 0.423294 -2.933253 0.053542 -0.276954 -0.101721
17.533333 -5.502421 0.414130 -2.933340 0.057948 -0.274892 -0.097739
17.566667 -5.500422 0.405028 -2.950856 0.062381 -0.272943 -0.087260
17.600000 -5.498277 0.396002 -2.953075 0.066838 -0.271091 -0.070914
17.633333 -5.495982 0.387028 -2.950468 0.071316 -0.269320 -0.050575
17.666667 -5.493535 0.378102 -2.961344 0.075812 -0.267611 -0.030653
17.700000 -5.490936 0.369218 -2.961475 0.080324 -0.265954 -0.008803
17.733333 -5.488184 0.360373 -2.958109 0.084849 -0.264335 0.011943
17.766667 -5.485276 0.351561 -2.963779 0.089385 -0.262746 0.028158
17.800000 -5.482220 0.342814 -2.943757 0.093930 -0.261178 0.039353
17.833333 -5.479014 0.334130 -2.944218 0.098487 -0.259636 0.046465
17.866667 -5.475657 0.325507 -2.933028 0.103055 -0.258128 0.049451
17.900000 -5.472150 0.316943 -2.935931 0.107637 -0.256663 0.045404
17.933333 -5.468491 0.308437 -2.938919 0.112238 -0.255259 0.037186
17.966667 -5.464681 0.299986 -2.942128 0.116862 -0.253946 0.028090
18.000000 -5.460720 0.291590 -2.944476 0.121521 -0.252761 0.020338
18.033333 -5.456593 0.283192 -2.926584 0.126219 -0.251727 0.011596
18.066667 -5.452314 0.274845 -2.933577 0.130966 -0.250875 0.004386
18.100000 -5.447882 0.266546 -2.951928 0.135766 -0.250224 0.001752
18.133333 -5.443298 0.258295 -2.938866 0.140622 -0.249780 0.000739
18.166667 -5.438544 0.250026 -2.938519 0.145531 -0.249526 -0.000034
18.200000 -5.433636 0.241800 -2.935421 0.150483 -0.249434 -0.005530
18.233333 -5.428555 0.233548 -2.939582 0.155469 -0.249470 -0.012630
18.266667 -5.423300 0.225265 -2.940226 0.160472 -0.249582 -0.024856
18.300000 -5.417870 0.216947 -2.943881 0.165478 -0.249724 -0.044146
18.333333 -5.412262 0.208593 -2.932717 0.170476 -0.249858 -0.068102
18.366667 -5.406475 0.200200 -2.935417 0.175459 -0.249961 -0.094753
18.400000 -5.400509 0.191765 -2.936841 0.180423 -0.250019 -0.118288
18.433333 -5.394389 0.183367 -2.939207 0.185368 -0.250030 -0.139184
18.466667 -5.388117 0.175005 -2.946570 0.190304 -0.250020 -0.152300
18.500000 -5.381692 0.166678 -2.950980 0.195238 -0.250017 -0.158392
18.533333 -5.375115 0.158385 -2.973479 0.200180 -0.250051 -0.155111
18.566667 -5.368385 0.150125 -2.982194 0.205135 -0.250149 -0.144912
18.600000 -5.361504 0.141899 -3.005876 0.210112 -0.250339 -0.129997
18.633333 -5.354440 0.133621 -2.999547 0.215113 -0.250643 -0.111660
18.666667 -5.347192 0.125292 -3.002825 0.220137 -0.251060 -0.095003
18.700000 -5.339761 0.116909 -2.990918 0.225172 -0.251572 -0.078106
18.733333 -5.332150 0.108474 -2.987312 0.230209 -0.252153 -0.065247
18.766667 -5.324389 0.100070 -2.983940 0.235232 -0.252770 -0.056558
18.800000 -5.316450 0.091616 -2.981257 0.240226 -0.253384 -0.053131
18.833333 -5.308336 0.083111 -2.990731 0.245176 -0.253956 -0.052707
18.866667 -5.300074 0.074638 -2.993515 0.250069 -0.254455 -0.049640
18.900000 -5.291639 0.066116 -2.997724 0.254901 -0.254864 -0.044087
18.933333 -5.283058 0.057626 -3.012168 0.259671 -0.255180 -0.031325
18.966667 -5.274308 0.049090 -3.005337 0.264376 -0.255395 -0.010742
19.000000 -5.265391 0.040512 -3.026714 0.269017 -0.255512 0.020824
19.033333 -5.256332 0.031967 -3.011867 0.273599 -0.255541 0.059117
19.066667 -5.247130 0.023456 -3.005731 0.278126 -0.255491 0.098209
19.100000 -5.237768 0.014909 -3.009537 0.282600 -0.255377 0.138628
19.133333 -5.228265 0.006396 -3.006520 0.287026 -0.255206 0.173528
19.166667 -5.218607 -0.002147 -2.993615 0.291405 -0.254989 0.204808
19.200000 -5.208811 -0.010654 -2.974886 0.295740 -0.254731 0.227153
19.233333 -5.198878 -0.019123 -2.970039 0.300033 -0.254433 0.243130
19.266667 -5.188809 -0.027554 -2.942459 0.304284 -0.254094 0.254196
19.300000 -5.178591 -0.036005 -2.947151 0.308491 -0.253707 0.258053
19.333333 -5.168226 -0.044476 -2.939158 0.312653 -0.253262 0.258816
19.366667 -5.157716 -0.052962 -2.931125 0.316769 -0.252753 0.252322
19.400000 -5.147075 -0.061405 -2.934991 0.320838 -0.252175 0.243000
19.433333 -5.136293 -0.069856 -2.917282 0.324859 -0.251516 0.229953
19.466667 -5.125383 -0.078262 -2.914926 0.328828 -0.250766 0.215769
19.500000 -5.114347 -0.086620 -2.895086 0.332746 -0.249916 0.199874
19.533333 -5.103185 -0.094930 -2.881720 0.336613 -0.248969 0.179638
19.566667 -5.091890 -0.103235 -2.882096 0.340433 -0.247929 0.160376
19.600000 -5.080472 -0.111489 -2.878530 0.344210 -0.246796 0.139185
19.633333 -5.068922 -0.119729 -2.876838 0.347946 -0.245579 0.118739
19.666667 -5.057252 -0.127914 -2.862815 0.351651 -0.244288 0.096184
19.700000 -5.045466 -0.136043 -2.879324 0.355329 -0.242929 0.077636
19.733333 -5.033550 -0.144144 -2.870152 0.358986 -0.241498 0.067098
19.766667 -5.021519 -0.152186 -2.866840 0.362626 -0.239992 0.061012
19.800000 -5.009376 -0.160167 -2.871459 0.366248 -0.238410 0.062560
19.833333 -4.997104 -0.168107 -2.867245 0.369854 -0.236751 0.068848
19.866667 -4.984723 -0.175982 -2.872710 0.373442 -0.235009 0.085369
19.900000 -4.972213 -0.183806 -2.865355 0.377007 -0.233183 0.104313
19.933333 -4.959575 -0.191574 -2.865146 0.380536 -0.231272 0.124400
19.966667 -4.946834 -0.199272 -2.854977 0.384023 -0.229276 0.145451
20.000000 -4.933965 -0.206905 -2.865108 0.387456 -0.227192 0.165861
20.033333 -4.920969 -0.214466 -2.845867 0.390828 -0.225019 0.184794
20.066667 -4.907846 -0.221950 -2.832360 0.394126 -0.222756 0.195412
20.100000 -4.894626 -0.229356 -2.831738 0.397346 -0.220406 0.201760
20.133333 -4.881311 -0.236684 -2.817915 0.400486 -0.217969 0.199051
20.166667 -4.867904 -0.243930 -2.817093 0.403548 -0.215446 0.188779
20.200000 -4.854371 -0.251079 -2.797958 0.406532 -0.212841 0.166436
20.233333 -4.840749 -0.258143 -2.797208 0.409440 -0.210156 0.134938
20.266667 -4.827041 -0.265120 -2.784847 0.412280 -0.207393 0.096924
20.300000 -4.813248 -0.272009 -2.789951 0.415055 -0.204558 0.052285
20.333333 -4.799373 -0.278808 -2.779103 0.417764 -0.201652 0.007402
20.366667 -4.785384 -0.285493 -2.785147 0.420405 -0.198682 -0.036756
20.400000 -4.771317 -0.292084 -2.780342 0.422981 -0.195648 -0.073924
20.433333 -4.757142 -0.298555 -2.780141 0.425488 -0.192553 -0.103076
20.466667 -4.742893 -0.304929 -2.803790 0.427920 -0.189403 -0.121817
20.500000 -4.728572 -0.311204 -2.812900 0.430275 -0.186198 -0.128757
20.533333 -4.714182 -0.317378 -2.824356 0.432551 -0.182937 -0.123310
20.566667 -4.699696 -0.323421 -2.835774 0.434750 -0.179618 -0.105704
20.600000 -4.685144 -0.329360 -2.833750 0.436870 -0.176240 -0.077298
20.633333 -4.670530 -0.335192 -2.834403 0.438916 -0.172798 -0.042054
20.666667 -4.655856 -0.340916 -2.834087 0.440892 -0.169286 -0.002655
20.700000 -4.641124 -0.346531 -2.833086 0.442800 -0.165703 0.037011
20.733333 -4.626312 -0.352003 -2.835254 0.444640 -0.162051 0.072835
20.766667 -4.611447 -0.357363 -2.821815 0.446412 -0.158332 0.101638
20.800000 -4.596531 -0.362608 -2.828660 0.448114 -0.154547 0.125510
20.833333 -4.581546 -0.367706 -2.811799 0.449742 -0.150703 0.147353
20.866667 -4.566516 -0.372686 -2.799816 0.451291 -0.146804 0.166153
20.900000 -4.551424 -0.377518 -2.789924 0.452756 -0.142852 0.184293
20.933333 -4.536275 -0.382199 -2.787569 0.454136 -0.138851 0.201493
20.966667 -4.521087 -0.386758 -2.797144 0.455425 -0.134804 0.223355
21.000000 -4.505863 -0.391193 -2.785058 0.456621 -0.130720 0.243708
21.033333 -4.490604 -0.395502 -2.783229 0.457723 -0.126598 0.261330
21.066667 -4.475313 -0.399686 -2.777296 0.458729 -0.122443 0.277262
21.100000 -4.459987 -0.403712 -2.766432 0.459639 -0.118253 0.290345
21.133333 -4.444628 -0.407580 -2.740559 0.460454 -0.114029 0.302284
21.166667 -4.429246 -0.411317 -2.719952 0.461174 -0.109764 0.304170
21.200000 -4.413841 -0.414894 -2.713414 0.461798 -0.105455 0.303579
21.233333 -4.398416 -0.418339 -2.699216 0.462326 -0.101103 0.302104
21.266667 -4.382973 -0.421649 -2.707478 0.462756 -0.096706 0.304476
21.300000 -4.367516 -0.424824 -2.676280 0.463088 -0.092265 0.310336
21.333333 -4.352052 -0.427837 -2.673144 0.463322 -0.087777 0.321977
21.366667 -4.336577 -0.430712 -2.669566 0.463459 -0.083240 0.348137
21.400000 -4.321105 -0.433424 -2.673809 0.463502 -0.078652 0.382823
21.433333 -4.305637 -0.435970 -2.669054 0.463455 -0.074007 0.422245
21.466667 -4.290166 -0.438377 -2.652066 0.463323 -0.069301 0.456061
21.500000 -4.274708 -0.440617 -2.654241 0.463108 -0.064527 0.485102
21.533333 -4.259265 -0.442691 -2.607406 0.462819 -0.059685 0.498671
21.566667 -4.243825 -0.444623 -2.574357 0.462459 -0.054778 0.487218
21.600000 -4.228406 -0.446379 -2.540735 0.462033 -0.049802 0.446865
21.633333 -4.212994 -0.447991 -2.530374 0.461543 -0.044757 0.377311
21.666667 -4.197606 -0.449419 -2.506880 0.460995 -0.039654 0.284471
21.700000 -4.182240 -0.450659 -2.484780 0.460391 -0.034505 0.166689
21.733333 -4.166889 -0.451753 -2.471402 0.459731 -0.029317 0.035026
21.766667 -4.151563 -0.452655 -2.476156 0.459016 -0.024103 -0.101137
21.800000 -4.136264 -0.453362 -2.489344 0.458246 -0.018883 -0.232441
21.833333 -4.120993 -0.453877 -2.517105 0.457421 -0.013678 -0.351988
21.866667 -4.105745 -0.454246 -2.549043 0.456539 -0.008497 -0.456178
21.900000 -4.090529 -0.454424 -2.570742 0.455596 -0.003347 -0.537752
21.933333 -4.075348 -0.454415 -2.588750 0.454593 0.001752 -0.595847
21.966667 -4.060197 -0.454258 -2.619830 0.453525 0.006796 -0.630597
22.000000 -4.045075 -0.453955 -2.627626 0.452386 0.011790 -0.644361
22.033333 -4.029998 -0.453470 -2.655714 0.451171 0.016740 -0.640502
22.066667 -4.014969 -0.452806 -2.687499 0.449877 0.021641 -0.621159
22.100000 -3.999976 -0.451995 -2.707729 0.448504 0.026498 -0.590770
22.133333 -3.985020 -0.451038 -2.729459 0.447048 0.031319 -0.551380
22.166667 -3.970121 -0.449910 -2.747845 0.445509 0.036106 -0.505960
22.200000 -3.955282 -0.448612 -2.768968 0.443891 0.040852 -0.454740
22.233333 -3.940486 -0.447170 -2.778350 0.442198 0.045552 -0.400198
22.266667 -3.925754 -0.445565 -2.797565 0.440430 0.050207 -0.343856
22.300000 -3.911090 -0.443799 -2.806447 0.438588 0.054812 -0.287908
22.333333 -3.896497 -0.441876 -2.808002 0.436673 0.059359 -0.235748
22.366667 -3.881976 -0.439798 -2.816277 0.434688 0.063841 -0.188770
22.400000 -3.867505 -0.437578 -2.820781 0.432634 0.068258 -0.148168
22.433333 -3.853087 -0.435217 -2.819469 0.430511 0.072605 -0.112074
22.466667 -3.838748 -0.432711 -2.822982 0.428323 0.076879 -0.079652
22.500000 -3.824492 -0.430061 -2.817140 0.426077 0.081079 -0.048745
22.533333 -3.810322 -0.427271 -2.820001 0.423781 0.085210 -0.016371
22.566667 -3.796209 -0.424344 -2.828883 0.421443 0.089275 0.020634
22.600000 -3.782185 -0.421283 -2.822589 0.419066 0.093276 0.061172
22.633333 -3.768252 -0.418092 -2.827059 0.416655 0.097213 0.106897
22.666667 -3.754414 -0.414776 -2.831687 0.414211 0.101089 0.155074
22.700000 -3.740672 -0.411338 -2.830436 0.411732 0.104905 0.205785
22.733333 -3.726991 -0.407767 -2.818984 0.409202 0.108662 0.255903
22.766667 -3.713374 -0.404064 -2.814065 0.406614 0.112359 0.301378
22.800000 -3.699858 -0.400251 -2.783810 0.403966 0.116002 0.342065
22.833333 -3.686407 -0.396308 -2.764805 0.401257 0.119597 0.370567
22.866667 -3.673021 -0.392237 -2.756245 0.398485 0.123150 0.385903
22.900000 -3.659743 -0.388058 -2.732325 0.395652 0.126671 0.383082
22.933333 -3.646576 -0.383772 -2.725574 0.392773 0.130171 0.364276
22.966667 -3.633523 -0.379377 -2.703476 0.389866 0.133663 0.327578
23.000000 -3.620587 -0.374871 -2.698890 0.386944 0.137152 0.275279
23.033333 -3.607769 -0.370253 -2.674749 0.384021 0.140652 0.211335
23.066667 -3.595072 -0.365519 -2.674916 0.381117 0.144175 0.144077
23.100000 -3.582442 -0.360666 -2.662491 0.378251 0.147734 0.077774
23.133333 -3.569881 -0.355694 -2.649030 0.375428 0.151337 0.010079
23.166667 -3.557388 -0.350604 -2.669268 0.372647 0.154990 -0.047716
23.200000 -3.545016 -0.345384 -2.687821 0.369900 0.158701 -0.092324
23.233333 -3.532764 -0.340028 -2.691163 0.367185 0.162469 -0.116929
23.266667 -3.520580 -0.334559 -2.693010 0.364489 0.166288 -0.125095
23.300000 -3.508464 -0.328978 -2.711601 0.361805 0.170148 -0.111064
23.333333 -3.496416 -0.323287 -2.713541 0.359124 0.174044 -0.064742
23.366667 -3.484480 -0.317440 -2.747012 0.356446 0.177968 0.008304
23.400000 -3.472655 -0.311433 -2.710627 0.353775 0.181908 0.102494
23.433333 -3.460939 -0.305262 -2.724387 0.351102 0.185856 0.213981
23.466667 -3.449289 -0.298988 -2.744691 0.348431 0.189803 0.339234
23.500000 -3.437705 -0.292612 -2.718283 0.345757 0.193744 0.464816
23.533333 -3.426231 -0.286068 -2.693655 0.343088 0.197661 0.571536
23.566667 -3.414823 -0.279426 -2.691192 0.340422 0.201546 0.649242
23.600000 -3.403529 -0.272619 -2.635598 0.337759 0.205394 0.693521
23.633333 -3.392298 -0.265718 -2.610177 0.335107 0.209195 0.698233
23.666667 -3.381183 -0.258657 -2.549954 0.332471 0.212946 0.658394
23.700000 -3.370129 -0.251508 -2.516214 0.329862 0.216633 0.583013
23.733333 -3.359188 -0.244206 -2.453916 0.327284 0.220256 0.484673
23.766667 -3.348357 -0.236757 -2.444631 0.324753 0.223802 0.372676
23.800000 -3.337584 -0.229226 -2.428956 0.322280 0.227265 0.255827
23.833333 -3.326912 -0.221556 -2.449588 0.319882 0.230639 0.145274
23.866667 -3.316297 -0.213810 -2.497165 0.317569 0.233924 0.053546
23.900000 -3.305772 -0.205934 -2.528753 0.315351 0.237124 -0.016990
23.933333 -3.295333 -0.197931 -2.517462 0.313241 0.240241 -0.065291
23.966667 -3.284948 -0.189862 -2.525443 0.311241 0.243287 -0.091656
24.000000 -3.274638 -0.181678 -2.510496 0.309361 0.246265 -0.101536
24.033333 -3.264379 -0.173432 -2.506760 0.307602 0.249178 -0.107174
24.066667 -3.254184 -0.165081 -2.500031 0.305967 0.252022 -0.119769
24.100000 -3.244044 -0.156627 -2.514436 0.304457 0.254790 -0.145550
24.133333 -3.233953 -0.148074 -2.507616 0.303069 0.257474 -0.186890
24.166667 -3.223905 -0.139424 -2.484328 0.301802 0.260059 -0.248233
24.200000 -3.213895 -0.130681 -2.508078 0.300646 0.262527 -0.323344
24.233333 -3.203917 -0.121850 -2.524249 0.299597 0.264860 -0.407718
24.266667 -3.193968 -0.112936 -2.539342 0.298643 0.267038 -0.492192
24.300000 -3.184042 -0.103945 -2.564284 0.297770 0.269042 -0.571085
24.333333 -3.174139 -0.094882 -2.588119 0.296962 0.270851 -0.642591
24.366667 -3.164273 -0.085792 -2.610069 0.296203 0.272455 -0.695704
24.400000 -3.154423 -0.076645 -2.644800 0.295482 0.273845 -0.731777
24.433333 -3.144589 -0.067446 -2.673118 0.294785 0.275019 -0.746919
24.466667 -3.134767 -0.058203 -2.691967 0.294104 0.275978 -0.741347
24.500000 -3.124959 -0.048923 -2.732240 0.293435 0.276730 -0.714642
24.533333 -3.115181 -0.039634 -2.749887 0.292780 0.277283 -0.664799
24.566667 -3.105432 -0.030340 -2.807275 0.292138 0.277646 -0.592953
24.600000 -3.095712 -0.021045 -2.819168 0.291513 0.277826 -0.498845
24.633333 -3.086018 -0.011752 -2.819168 0.290914 0.277832 -0.381596
24.666667 -3.076350 -0.002467 -2.846319 0.290349 0.277674 -0.240358
24.700000 -3.066688 0.006818 -2.846319 0.289826 0.277359 -0.084521
24.733333 -3.057050 0.016089 -2.846319 0.289351 0.276892 0.083702
24.766667 -3.047433 0.025341 -2.884693 0.288930 0.276281 0.254774
24.800000 -3.037822 0.034574 -2.858279 0.288563 0.275529 0.420702
24.833333 -3.028218 0.043779 -2.829735 0.288246 0.274642 0.574734
24.866667 -3.018633 0.052955 -2.804276 0.287971 0.273622 0.701878
24.900000 -3.009049 0.062092 -2.767828 0.287735 0.272469 0.804462
24.933333 -2.999466 0.071184 -2.713250 0.287532 0.271188 0.869521
24.966667 -2.989881 0.080225 -2.681612 0.287354 0.269781 0.893720
25.000000 -2.980310 0.089221 -2.611238 0.287204 0.268249 0.872547
25.033333 -2.970731 0.098153 -2.611238 0.287084 0.266592 0.809943
25.066667 -2.961163 0.107032 -2.548269 0.286996 0.264810 0.711483
25.100000 -2.951604 0.115855 -2.535360 0.286941 0.262905 0.584700
25.133333 -2.942055 0.124618 -2.506651 0.286919 0.260880 0.442632
25.166667 -2.932513 0.133316 -2.485800 0.286939 0.258728 0.293865
25.200000 -2.922979 0.141948 -2.490454 0.287002 0.256453 0.158039
25.233333 -2.913412 0.150479 -2.494885 0.287112 0.254050 0.031768
25.266667 -2.903851 0.158936 -2.513067 0.287278 0.251509 -0.073303
25.300000 -2.894294 0.167315 -2.512724 0.287510 0.248821 -0.161334
25.333333 -2.884695 0.175574 -2.558347 0.287815 0.245976 -0.227355
25.366667 -2.875097 0.183748 -2.558115 0.288189 0.242979 -0.272787
25.400000 -2.865501 0.191834 -2.585962 0.288630 0.239828 -0.307234
25.433333 -2.855906 0.199828 -2.564443 0.289137 0.236523 -0.328516
25.466667 -2.846309 0.207726 -2.587752 0.289701 0.233073 -0.340111
25.500000 -2.836657 0.215474 -2.577740 0.290307 0.229493 -0.344157
25.533333 -2.827003 0.223120 -2.581016 0.290946 0.225792 -0.349815
25.566667 -2.817289 0.230598 -2.617906 0.291611 0.221979 -0.354824
25.600000 -2.807512 0.237902 -2.647881 0.292289 0.218069 -0.356478
25.633333 -2.797731 0.245094 -2.639348 0.292958 0.214089 -0.353461
25.666667 -2.787945 0.252173 -2.656610 0.293601 0.210062 -0.350219
25.700000 -2.778155 0.259136 -2.663811 0.294208 0.205999 -0.345486
25.733333 -2.768359 0.265980 -2.688164 0.294774 0.201905 -0.335884
25.766667 -2.758490 0.272613 -2.705632 0.295304 0.197773 -0.326051
25.800000 -2.748615 0.279121 -2.703440 0.295818 0.193573 -0.324199
25.833333 -2.738734 0.285503 -2.711307 0.296340 0.189266 -0.328629
25.866667 -2.728845 0.291755 -2.715799 0.296898 0.184815 -0.339803
25.900000 -2.718949 0.297875 -2.729559 0.297517 0.180177 -0.356084
25.933333 -2.709046 0.303861 -2.721470 0.298218 0.175318 -0.381520
25.966667 -2.699135 0.309710 -2.742658 0.299018 0.170206 -0.412858
26.000000 -2.689216 0.315419 -2.750459 0.299921 0.164838 -0.442094
26.033333 -2.679290 0.320988 -2.786446 0.300933 0.159200 -0.468021
26.066667 -2.669281 0.326289 -2.801030 0.302060 0.153279 -0.484828
26.100000 -2.659192 0.331316 -2.820466 0.303296 0.147084 -0.487911
26.133333 -2.649023 0.336069 -2.844187 0.304627 0.140640 -0.468312
26.166667 -2.638846 0.340672 -2.852131 0.306037 0.133978 -0.424508
26.200000 -2.628661 0.345126 -2.868732 0.307516 0.127110 -0.357280
26.233333 -2.618404 0.349299 -2.902550 0.309043 0.120081 -0.269379
26.266667 -2.608075 0.353195 -2.922270 0.310591 0.112942 -0.165585
26.300000 -2.597676 0.356813 -2.931505 0.312136 0.105741 -0.052661
26.333333 -2.587271 0.360276 -2.933140 0.313662 0.098515 0.060510
26.366667 -2.576799 0.363466 -2.925070 0.315144 0.091316 0.167977
26.400000 -2.566263 0.366387 -2.903608 0.316547 0.084213 0.263822
26.433333 -2.555665 0.369040 -2.879128 0.317847 0.077258 0.341393
26.466667 -2.545007 0.371429 -2.860734 0.319029 0.070481 0.398658
26.500000 -2.534290 0.373558 -2.824528 0.320080 0.063904 0.431429
26.533333 -2.523518 0.375428 -2.812265 0.320984 0.057558 0.441042
26.566667 -2.512746 0.377143 -2.790903 0.321741 0.051439 0.427674
26.600000 -2.501974 0.378702 -2.783764 0.322360 0.045531 0.396454
26.633333 -2.491203 0.380105 -2.766290 0.322853 0.039809 0.354116
26.666667 -2.480435 0.381353 -2.762471 0.323233 0.034248 0.302455
26.700000 -2.469670 0.382447 -2.749447 0.323517 0.028811 0.250211
26.733333 -2.458870 0.383306 -2.747479 0.323730 0.023452 0.199244
26.766667 -2.448075 0.384011 -2.736477 0.323887 0.018141 0.154422
26.800000 -2.437250 0.384489 -2.724833 0.323998 0.012858 0.114172
26.833333 -2.426434 0.384816 -2.729353 0.324071 0.007585 0.077633
26.866667 -2.415628 0.384992 -2.732279 0.324108 0.002319 0.049009
26.900000 -2.404803 0.384953 -2.743030 0.324101 -0.002929 0.027013
26.933333 -2.393990 0.384766 -2.742203 0.324046 -0.008152 0.012172
26.966667 -2.383192 0.384433 -2.726046 0.323938 -0.013342 0.003537
27.000000 -2.372386 0.383897 -2.741054 0.323777 -0.018499 0.003396
27.033333 -2.361574 0.383164 -2.731310 0.323558 -0.023613 0.009948
27.066667 -2.350782 0.382289 -2.742851 0.323277 -0.028676 0.018101
27.100000 -2.339992 0.381226 -2.742615 0.322934 -0.033682 0.022371
27.133333 -2.329224 0.380023 -2.742977 0.322523 -0.038618 0.020660
27.166667 -2.318465 0.378641 -2.746985 0.322040 -0.043469 0.012047
27.200000 -2.307718 0.377084 -2.730363 0.321480 -0.048221 -0.008340
27.233333 -2.296989 0.375357 -2.722399 0.320842 -0.052865 -0.037048
27.266667 -2.286281 0.373466 -2.727066 0.320123 -0.057390 -0.070525
27.300000 -2.275603 0.371446 -2.711721 0.319325 -0.061789 -0.103937
27.333333 -2.264956 0.369298 -2.716978 0.318446 -0.066057 -0.131951
27.366667 -2.254340 0.366999 -2.726509 0.317489 -0.070192 -0.153168
27.400000 -2.243757 0.364554 -2.741212 0.316456 -0.074193 -0.158607
27.433333 -2.233210 0.361989 -2.766086 0.315348 -0.078064 -0.147674
27.466667 -2.222703 0.359287 -2.789113 0.314170 -0.081811 -0.120525
27.500000 -2.212236 0.356470 -2.795013 0.312923 -0.085437 -0.076774
27.533333 -2.201810 0.353539 -2.805363 0.311608 -0.088947 -0.020921
27.566667 -2.191428 0.350497 -2.795012 0.310223 -0.092346 0.044336
27.600000 -2.181100 0.347338 -2.782927 0.308768 -0.095637 0.107495
27.633333 -2.170819 0.344073 -2.778521 0.307241 -0.098821 0.162839
27.666667 -2.160585 0.340704 -2.759614 0.305637 -0.101897 0.203795
27.700000 -2.150403 0.337235 -2.755324 0.303950 -0.104867 0.226609
27.733333 -2.140285 0.333667 -2.725957 0.302177 -0.107729 0.227377
27.766667 -2.130221 0.330004 -2.719641 0.300318 -0.110483 0.207610
27.800000 -2.120212 0.326248 -2.707881 0.298375 -0.113132 0.172846
27.833333 -2.110279 0.322408 -2.705925 0.296350 -0.115676 0.126630
27.866667 -2.100405 0.318480 -2.699268 0.294253 -0.118118 0.074986
27.900000 -2.090613 0.314477 -2.691773 0.292092 -0.120464 0.020843
27.933333 -2.080908 0.310405 -2.702585 0.289878 -0.122716 -0.027260
27.966667 -2.071266 0.306253 -2.706795 0.287619 -0.124880 -0.069430
28.000000 -2.061717 0.302039 -2.713960 0.285323 -0.126958 -0.103059
28.033333 -2.052263 0.297770 -2.728041 0.282999 -0.128956 -0.126643
28.066667 -2.042877 0.293429 -2.735687 0.280649 -0.130871 -0.139862
28.100000 -2.033560 0.289019 -2.730757 0.278275 -0.132706 -0.142275
28.133333 -2.024313 0.284543 -2.742428 0.275876 -0.134460 -0.137319
28.166667 -2.015138 0.280004 -2.746343 0.273453 -0.136132 -0.123744
28.200000 -2.006036 0.275405 -2.754313 0.270994 -0.137715 -0.103046
28.233333 -1.997049 0.270780 -2.756294 0.268486 -0.139196 -0.076585
28.266667 -1.988137 0.266100 -2.755661 0.265923 -0.140569 -0.044012
28.300000 -1.979303 0.261367 -2.761066 0.263291 -0.141824 -0.005166
28.333333 -1.970547 0.256585 -2.760915 0.260576 -0.142944 0.038135
28.366667 -1.961870 0.251756 -2.760048 0.257761 -0.143911 0.084176
28.400000 -1.953322 0.246926 -2.767065 0.254843 -0.144720 0.132303
28.433333 -1.944856 0.242055 -2.757405 0.251822 -0.145368 0.179359
28.466667 -1.936473 0.237145 -2.750414 0.248689 -0.145843 0.221688
28.500000 -1.928174 0.232199 -2.740346 0.245445 -0.146146 0.256368
28.533333 -1.920014 0.227275 -2.728199 0.242107 -0.146292 0.283041
28.566667 -1.911996 0.222378 -2.710736 0.238693 -0.146301 0.300066
28.600000 -1.904065 0.217453 -2.690036 0.235219 -0.146187 0.302575
28.633333 -1.896280 0.212565 -2.674555 0.231695 -0.145963 0.292671
28.666667 -1.888641 0.207719 -2.670346 0.228151 -0.145656 0.272866
28.700000 -1.881092 0.202851 -2.660908 0.224606 -0.145285 0.244546
28.733333 -1.873692 0.198033 -2.642853 0.221064 -0.144855 0.210034
28.766667 -1.866384 0.193198 -2.647139 0.217522 -0.144355 0.174251
28.800000 -1.859224 0.188419 -2.644504 0.213984 -0.143789 0.143200
28.833333 -1.852157 0.183628 -2.632462 0.210452 -0.143158 0.118922
28.866667 -1.845183 0.178826 -2.635169 0.206911 -0.142442 0.100400
28.900000 -1.838302 0.174016 -2.634220 0.203348 -0.141627 0.088139
28.933333 -1.831564 0.169268 -2.641911 0.199755 -0.140703 0.082892
28.966667 -1.824968 0.164585 -2.648553 0.196138 -0.139678 0.081107
29.000000 -1.818467 0.159899 -2.642958 0.192483 -0.138536 0.080190
29.033333 -1.812105 0.155276 -2.633827 0.188788 -0.137274 0.078469
29.066667 -1.805879 0.150717 -2.621663 0.185063 -0.135909 0.075608
29.100000 -1.799790 0.146221 -2.608501 0.181323 -0.134460 0.070298
29.133333 -1.793795 0.141729 -2.615687 0.177577 -0.132943 0.060773
29.166667 -1.787933 0.137300 -2.609443 0.173833 -0.131367 0.045492
29.200000 -1.782201 0.132934 -2.617237 0.170107 -0.129759 0.027866
29.233333 -1.776599 0.128630 -2.612798 0.166417 -0.128144 0.009315
29.266667 -1.771124 0.124390 -2.608405 0.162767 -0.126533 -0.008228
29.300000 -1.765777 0.120212 -2.606249 0.159162 -0.124929 -0.024019
29.333333 -1.760553 0.116096 -2.623020 0.155611 -0.123351 -0.038004
29.366667 -1.755453 0.112042 -2.623445 0.152126 -0.121816 -0.046884
29.400000 -1.750446 0.108002 -2.626877 0.148707 -0.120329 -0.052495
29.433333 -1.745558 0.104022 -2.622111 0.145355 -0.118889 -0.056358
29.466667 -1.740789 0.100102 -2.620449 0.142073 -0.117503 -0.060105
29.500000 -1.736135 0.096243 -2.632553 0.138863 -0.116178 -0.061196
29.533333 -1.731573 0.092401 -2.634312 0.135723 -0.114907 -0.059813
29.566667 -1.727102 0.088576 -2.626148 0.132647 -0.113685 -0.057279
29.600000 -1.722741 0.084810 -2.624684 0.129635 -0.112513 -0.056350
29.633333 -1.718490 0.081102 -2.633854 0.126685 -0.111389 -0.054902
29.666667 -1.714327 0.077414 -2.644389 0.123792 -0.110304 -0.051320
29.700000 -1.710270 0.073781 -2.650708 0.120951 -0.109248 -0.048939
29.733333 -1.706300 0.070170 -2.641730 0.118158 -0.108215 -0.048056
29.766667 -1.702415 0.066579 -2.638226 0.115410 -0.107195 -0.048586
29.800000 -1.698617 0.063011 -2.646391 0.112700 -0.106175 -0.045498
29.833333 -1.694916 0.059496 -2.642290 0.110022 -0.105142 -0.042540
29.866667 -1.691299 0.056003 -2.642591 0.107376 -0.104091 -0.041503
