t x y theta dxdt dydt dthetadt
0.000000 0.000000 0.000000 -0.773882 -0.000860 0.002133 -0.014457
0.033333 0.000314 -0.000485 -0.776652 -0.002283 0.005292 -0.011210
0.066667 0.000663 -0.000691 -0.775643 -0.004494 0.009931 -0.004967
0.100000 0.000724 -0.000627 -0.779867 -0.007781 0.016440 0.006346
0.133333 0.000487 -0.000286 -0.788521 -0.012337 0.025173 0.023449
0.166667 -0.000056 0.000338 -0.780399 -0.018347 0.036482 0.043603
0.200000 -0.000401 0.001073 -0.771043 -0.025916 0.050434 0.062303
0.233333 -0.000753 0.002189 -0.779070 -0.035282 0.067501 0.077261
0.266667 -0.001438 0.003609 -0.778426 -0.046427 0.087663 0.084019
0.300000 -0.002464 0.005337 -0.776530 -0.059427 0.111259 0.075787
0.333333 -0.004145 0.008705 -0.772212 -0.074483 0.138845 0.047797
0.366667 -0.006185 0.012392 -0.763831 -0.091919 0.171319 -0.000548
0.400000 -0.009726 0.019445 -0.736802 -0.111938 0.209438 -0.070284
0.433333 -0.013640 0.026824 -0.720424 -0.134374 0.253041 -0.164955
0.466667 -0.017933 0.034527 -0.725110 -0.159299 0.302565 -0.284525
0.500000 -0.022611 0.042554 -0.745207 -0.186657 0.357996 -0.422426
0.533333 -0.027680 0.050906 -0.769483 -0.216214 0.418929 -0.572051
0.566667 -0.035216 0.065373 -0.790212 -0.247517 0.483986 -0.723699
0.600000 -0.043153 0.080157 -0.804099 -0.280340 0.552305 -0.866309
0.633333 -0.052923 0.099546 -0.834648 -0.314694 0.623251 -0.984747
0.666667 -0.064437 0.122853 -0.878450 -0.350410 0.695229 -1.067765
0.700000 -0.077583 0.150362 -0.932983 -0.387110 0.766124 -1.112207
0.733333 -0.091129 0.178132 -0.992035 -0.424500 0.834016 -1.115603
0.766667 -0.105072 0.206140 -1.054758 -0.462616 0.897980 -1.079495
0.800000 -0.120845 0.238532 -1.114084 -0.501278 0.956492 -1.004800
0.833333 -0.138353 0.274395 -1.140860 -0.540193 1.008081 -0.901186
0.866667 -0.156244 0.310419 -1.186058 -0.579075 1.051848 -0.774104
0.900000 -0.176399 0.348584 -1.187982 -0.617799 1.087659 -0.632672
0.933333 -0.196922 0.386848 -1.207664 -0.656123 1.114840 -0.481570
0.966667 -0.219704 0.426519 -1.202116 -0.693168 1.131649 -0.333959
1.000000 -0.244892 0.466685 -1.205683 -0.728125 1.137011 -0.203187
1.033333 -0.270411 0.506849 -1.203250 -0.760127 1.129995 -0.091757
1.066667 -0.296249 0.546977 -1.226405 -0.788185 1.109612 -0.004069
1.100000 -0.324748 0.587446 -1.207093 -0.811326 1.074859 0.063031
1.133333 -0.353533 0.627810 -1.202944 -0.828819 1.025853 0.108007
1.166667 -0.383519 0.665953 -1.194434 -0.840430 0.964134 0.139356
1.200000 -0.413852 0.700205 -1.169932 -0.846138 0.891243 0.163585
1.233333 -0.444415 0.734255 -1.160664 -0.846256 0.809362 0.180146
1.266667 -0.473789 0.761458 -1.143797 -0.841570 0.721783 0.184153
1.300000 -0.502526 0.781455 -1.150901 -0.833178 0.632284 0.174428
1.333333 -0.531440 0.801188 -1.181902 -0.822063 0.544093 0.151724
1.366667 -0.558511 0.814462 -1.175028 -0.809564 0.460313 0.113224
1.400000 -0.583668 0.822307 -1.151833 -0.797151 0.383978 0.060336
1.433333 -0.608957 0.829867 -1.129250 -0.786065 0.317510 -0.002129
1.466667 -0.634365 0.837145 -1.106316 -0.777137 0.261695 -0.067777
1.500000 -0.658913 0.841958 -1.103205 -0.770909 0.216159 -0.134982
1.533333 -0.683420 0.845874 -1.118940 -0.767790 0.180544 -0.201851
1.566667 -0.708366 0.850050 -1.142677 -0.767364 0.153345 -0.261689
1.600000 -0.733380 0.853951 -1.161406 -0.768443 0.132417 -0.309368
1.633333 -0.758451 0.857580 -1.187333 -0.769865 0.115654 -0.343909
1.666667 -0.783564 0.860940 -1.208253 -0.770592 0.101676 -0.360713
1.700000 -0.809872 0.864474 -1.233345 -0.769310 0.089870 -0.352576
1.733333 -0.837278 0.868487 -1.246280 -0.764848 0.079875 -0.314064
1.766667 -0.864684 0.872239 -1.236430 -0.756578 0.071933 -0.241534
1.800000 -0.892038 0.874639 -1.254285 -0.744805 0.067087 -0.131816
1.833333 -0.918936 0.875138 -1.272615 -0.729875 0.066515 0.020054
1.866667 -0.944155 0.875098 -1.264222 -0.712761 0.071792 0.216570
1.900000 -0.968007 0.875063 -1.266174 -0.695103 0.083962 0.455023
1.933333 -0.989083 0.875896 -1.255390 -0.678861 0.103368 0.730108
1.966667 -1.010076 0.876496 -1.262011 -0.665854 0.130321 1.033379
2.000000 -1.030977 0.876868 -1.273756 -0.657239 0.164215 1.355900
2.033333 -1.049894 0.880755 -1.236423 -0.654254 0.203854 1.686896
2.066667 -1.068459 0.888932 -1.146007 -0.657496 0.246846 2.013570
2.100000 -1.086908 0.896882 -1.016889 -0.667085 0.291112 2.319762
2.133333 -1.107804 0.909500 -0.901540 -0.682358 0.334663 2.590743
2.166667 -1.128568 0.921878 -0.808972 -0.702647 0.375510 2.817582
2.200000 -1.155110 0.939654 -0.711505 -0.727000 0.411694 2.991147
2.233333 -1.181493 0.957165 -0.599678 -0.754182 0.442025 3.107429
2.266667 -1.207698 0.974395 -0.469987 -0.782608 0.466070 3.168405
2.300000 -1.233709 0.991329 -0.361183 -0.810977 0.483195 3.188867
2.333333 -1.259509 1.007951 -0.243292 -0.838639 0.493500 3.186689
2.366667 -1.285082 1.024247 -0.132763 -0.864948 0.497089 3.170199
2.400000 -1.317688 1.042352 -0.026930 -0.889715 0.494467 3.146419
2.433333 -1.350024 1.060099 0.073406 -0.912910 0.485836 3.119832
2.466667 -1.382067 1.077470 0.146445 -0.934757 0.471118 3.095783
2.500000 -1.413792 1.094448 0.243444 -0.955131 0.450619 3.066118
2.533333 -1.445173 1.111016 0.357395 -0.973870 0.424002 3.020584
2.566667 -1.476187 1.127158 0.456609 -0.990815 0.390938 2.955296
2.600000 -1.510133 1.141252 0.551772 -1.006092 0.351861 2.869344
2.633333 -1.545766 1.152629 0.666739 -1.019680 0.307307 2.762325
2.666667 -1.580948 1.163537 0.795601 -1.031477 0.258390 2.628260
2.700000 -1.615649 1.173965 0.899488 -1.041449 0.206034 2.473511
2.733333 -1.650778 1.179470 0.992928 -1.048990 0.152004 2.303135
2.766667 -1.685366 1.184477 1.048644 -1.053495 0.098068 2.125065
2.800000 -1.721539 1.184722 1.101336 -1.054072 0.045539 1.943067
2.833333 -1.757108 1.184461 1.141600 -1.049916 -0.004416 1.761948
2.866667 -1.794169 1.180806 1.196767 -1.039903 -0.050662 1.586266
2.900000 -1.830560 1.176646 1.231641 -1.023130 -0.092048 1.410039
2.933333 -1.866245 1.171985 1.274620 -0.999317 -0.128385 1.229352
2.966667 -1.901489 1.165657 1.308133 -0.968166 -0.159392 1.033082
3.000000 -1.935960 1.158836 1.359072 -0.929747 -0.185385 0.811928
3.033333 -1.968322 1.151419 1.419675 -0.884075 -0.206663 0.557811
3.066667 -1.998154 1.143379 1.445248 -0.831989 -0.224244 0.270059
3.100000 -2.027118 1.134861 1.474137 -0.774029 -0.239251 -0.047821
3.133333 -2.053535 1.125953 1.480035 -0.710521 -0.252560 -0.390454
3.166667 -2.076424 1.117020 1.459691 -0.641911 -0.265321 -0.746219
3.200000 -2.094429 1.108669 1.434071 -0.568565 -0.278445 -1.097902
3.233333 -2.111468 1.099861 1.367323 -0.491320 -0.292812 -1.429102
3.266667 -2.127522 1.090599 1.286358 -0.410849 -0.308923 -1.730997
3.300000 -2.142575 1.080891 1.197100 -0.328222 -0.327089 -1.991486
3.333333 -2.156610 1.070740 1.095003 -0.244507 -0.347410 -2.200650
3.366667 -2.164209 1.060090 1.018914 -0.161077 -0.369716 -2.357012
3.400000 -2.166690 1.048176 0.952755 -0.079176 -0.393528 -2.465120
3.433333 -2.165761 1.034715 0.863781 0.000097 -0.418269 -2.530335
3.466667 -2.162152 1.019664 0.754154 0.075593 -0.443188 -2.554417
3.500000 -2.155612 1.003663 0.654550 0.146405 -0.467704 -2.544535
3.533333 -2.146899 0.986890 0.576220 0.211745 -0.491384 -2.510239
3.566667 -2.137143 0.969732 0.493507 0.271791 -0.513895 -2.451916
3.600000 -2.125626 0.951406 0.415718 0.327334 -0.535213 -2.370513
3.633333 -2.113078 0.932721 0.337588 0.379782 -0.555581 -2.271868
3.666667 -2.099508 0.913688 0.247408 0.430880 -0.575505 -2.164908
3.700000 -2.084923 0.894322 0.153284 0.482500 -0.595363 -2.054588
3.733333 -2.069331 0.874635 0.080167 0.536296 -0.615447 -1.942052
3.766667 -2.052743 0.854640 0.031628 0.593373 -0.635968 -1.834646
3.800000 -2.035169 0.834352 -0.001035 0.654306 -0.656897 -1.736787
3.833333 -2.014166 0.812305 -0.046545 0.719083 -0.677801 -1.648136
3.866667 -1.989754 0.789104 -0.100133 0.787351 -0.698077 -1.566954
3.900000 -1.962896 0.765571 -0.144277 0.858431 -0.717087 -1.493466
3.933333 -1.932488 0.740432 -0.194658 0.931534 -0.734120 -1.426064
3.966667 -1.898503 0.714103 -0.245988 1.005457 -0.748517 -1.359232
4.000000 -1.863639 0.687578 -0.292559 1.079037 -0.759735 -1.288082
4.033333 -1.825253 0.660569 -0.349073 1.151134 -0.767576 -1.208101
4.066667 -1.786044 0.633404 -0.398349 1.221096 -0.771979 -1.118055
4.100000 -1.744165 0.606840 -0.439869 1.288237 -0.773069 -1.014342
4.133333 -1.699978 0.581056 -0.463770 1.352205 -0.771257 -0.899635
4.166667 -1.651893 0.555434 -0.492033 1.412937 -0.767044 -0.778534
4.200000 -1.603123 0.529731 -0.514500 1.470219 -0.761023 -0.657326
4.233333 -1.551255 0.504626 -0.540237 1.523860 -0.753764 -0.542285
4.266667 -1.498783 0.479475 -0.548358 1.573304 -0.745786 -0.437294
4.300000 -1.445749 0.454295 -0.558047 1.618281 -0.737486 -0.346192
4.333333 -1.390505 0.430103 -0.555825 1.658400 -0.729167 -0.270324
4.366667 -1.333090 0.405972 -0.550514 1.693544 -0.721086 -0.210645
4.400000 -1.274269 0.382025 -0.566330 1.723431 -0.713411 -0.163768
4.433333 -1.214400 0.358464 -0.565428 1.748056 -0.706197 -0.130172
4.466667 -1.153931 0.335192 -0.560730 1.767482 -0.699505 -0.105926
4.500000 -1.093802 0.312436 -0.567917 1.781722 -0.693463 -0.091190
4.533333 -1.033442 0.289760 -0.577024 1.790932 -0.687993 -0.083896
4.566667 -0.972899 0.267178 -0.571627 1.795236 -0.682989 -0.081465
4.600000 -0.912223 0.244704 -0.590557 1.795381 -0.678357 -0.085061
4.633333 -0.851463 0.222354 -0.579878 1.792026 -0.674001 -0.092835
4.666667 -0.790410 0.199563 -0.578842 1.785040 -0.669569 -0.105937
4.700000 -0.729371 0.176923 -0.584504 1.774192 -0.664638 -0.122153
4.733333 -0.671121 0.154689 -0.581719 1.759362 -0.658934 -0.142718
4.766667 -0.612981 0.132634 -0.586154 1.740293 -0.652189 -0.167632
4.800000 -0.554995 0.110773 -0.589333 1.715934 -0.643978 -0.198901
4.833333 -0.497210 0.089118 -0.600143 1.685182 -0.633909 -0.233191
4.866667 -0.439671 0.067685 -0.615408 1.648105 -0.621935 -0.271855
4.900000 -0.382423 0.046485 -0.622076 1.604421 -0.607884 -0.318865
4.933333 -0.325511 0.025532 -0.631141 1.553092 -0.591425 -0.372121
4.966667 -0.268980 0.004840 -0.640070 1.492758 -0.572009 -0.431631
5.000000 -0.222671 -0.013608 -0.657781 1.423864 -0.549555 -0.491633
5.033333 -0.176819 -0.031772 -0.664504 1.346393 -0.523689 -0.552659
5.066667 -0.131457 -0.049643 -0.687655 1.260478 -0.494027 -0.605282
5.100000 -0.086618 -0.067210 -0.705247 1.166617 -0.460291 -0.639704
5.133333 -0.048205 -0.082654 -0.731375 1.066640 -0.422619 -0.653171
5.166667 -0.010371 -0.097777 -0.736055 0.963049 -0.381597 -0.641970
5.200000 0.020980 -0.111376 -0.797177 0.856715 -0.337433 -0.604368
5.233333 0.046789 -0.122661 -0.849991 0.749842 -0.291159 -0.538136
5.266667 0.068310 -0.132163 -0.879590 0.644448 -0.243832 -0.450048
5.300000 0.085214 -0.138671 -0.902842 0.543511 -0.197179 -0.345124
5.333333 0.101477 -0.144839 -0.907189 0.448719 -0.152505 -0.227407
5.366667 0.111447 -0.147103 -0.888427 0.361892 -0.111189 -0.103683
5.400000 0.120779 -0.149036 -0.871419 0.284680 -0.074573 0.013466
5.433333 0.123896 -0.147919 -0.862658 0.217939 -0.043468 0.114603
5.466667 0.126393 -0.146486 -0.870874 0.161996 -0.018520 0.195650
5.500000 0.128280 -0.144746 -0.846506 0.115916 0.000587 0.250116
5.533333 0.129572 -0.142708 -0.837126 0.079243 0.014021 0.277645
5.566667 0.130012 -0.141116 -0.818372 0.050659 0.022559 0.280612
5.600000 0.129884 -0.139246 -0.803065 0.029330 0.026879 0.267481
5.633333 0.130508 -0.139033 -0.787722 0.013796 0.028032 0.242226
5.666667 0.130590 -0.138559 -0.784228 0.002771 0.027075 0.208513
5.700000 0.130145 -0.137830 -0.774477 -0.004782 0.024764 0.172902
5.733333 0.129187 -0.136855 -0.780794 -0.009831 0.021855 0.137461
5.766667 0.127731 -0.135642 -0.767653 -0.012973 0.018763 0.103694
5.800000 0.126888 -0.135135 -0.775129 -0.014904 0.015981 0.073171
