t x y theta dxdt dydt dthetadt
0.000000 0.000000 0.000000 0.130411 -0.000598 0.001276 0.015419
0.033333 0.000209 0.000209 0.117560 -0.003930 0.001210 0.012684
0.066667 -0.000164 0.000437 0.131841 -0.008241 0.001006 0.006665
0.100000 -0.001136 0.000683 0.130496 -0.014207 0.000665 0.001147
0.133333 -0.001282 0.000663 0.129906 -0.022613 0.000222 -0.001710
0.166667 -0.002063 0.000663 0.125221 -0.034307 -0.000287 0.002345
0.200000 -0.002612 0.000395 0.126938 -0.050322 -0.000868 0.016021
0.233333 -0.003369 0.000108 0.128205 -0.072165 -0.001600 0.040187
0.266667 -0.003981 0.000002 0.131687 -0.101507 -0.002547 0.080639
0.300000 -0.005303 -0.000083 0.120612 -0.139205 -0.003719 0.134693
0.333333 -0.007353 -0.000147 0.127677 -0.185869 -0.005175 0.196902
0.366667 -0.010600 -0.000025 0.126853 -0.242701 -0.006822 0.256805
0.400000 -0.016367 0.000128 0.104239 -0.309873 -0.008489 0.310404
0.433333 -0.027529 -0.000068 0.118598 -0.386287 -0.009865 0.353747
0.466667 -0.039481 -0.000241 0.154421 -0.470004 -0.010702 0.379403
0.500000 -0.052234 -0.000392 0.200515 -0.559465 -0.010781 0.384320
0.533333 -0.070785 -0.001329 0.236246 -0.652808 -0.009796 0.368209
0.566667 -0.095174 -0.002850 0.259812 -0.746546 -0.007692 0.337414
0.600000 -0.125376 -0.003809 0.265364 -0.837555 -0.004500 0.291167
0.633333 -0.156381 -0.004741 0.264546 -0.924389 -0.000224 0.234845
0.666667 -0.188180 -0.005645 0.268840 -1.006473 0.005261 0.177023
0.700000 -0.228431 -0.004543 0.252864 -1.082598 0.011919 0.123911
0.733333 -0.269449 -0.003414 0.249947 -1.152393 0.019574 0.080713
0.766667 -0.311217 -0.002258 0.249442 -1.216934 0.028099 0.045699
0.800000 -0.353715 -0.001077 0.237131 -1.278144 0.037575 0.022228
0.833333 -0.396925 0.000128 0.251419 -1.336672 0.047831 0.004265
0.866667 -0.440827 0.001356 0.241723 -1.392388 0.058543 -0.014659
0.900000 -0.485401 0.002606 0.260335 -1.446367 0.069729 -0.038055
0.933333 -0.530627 0.003877 0.262039 -1.499266 0.081475 -0.067503
0.966667 -0.581844 0.006835 0.273742 -1.550882 0.093779 -0.103482
1.000000 -0.638251 0.011020 0.282563 -1.599899 0.106257 -0.150126
1.033333 -0.695232 0.015216 0.267268 -1.645387 0.118594 -0.201075
1.066667 -0.752754 0.019420 0.238704 -1.686717 0.130386 -0.249980
1.100000 -0.810784 0.023626 0.222681 -1.722594 0.140877 -0.294524
1.133333 -0.871160 0.029233 0.223294 -1.751212 0.148963 -0.333546
1.166667 -0.931976 0.034833 0.205058 -1.771663 0.153822 -0.360094
1.200000 -0.992998 0.040988 0.174935 -1.783982 0.154903 -0.365440
1.233333 -1.053456 0.047300 0.184567 -1.788422 0.151789 -0.351340
1.266667 -1.114250 0.053584 0.161452 -1.785463 0.144302 -0.321655
1.300000 -1.175344 0.059834 0.141332 -1.775943 0.132581 -0.275949
1.333333 -1.236704 0.066042 0.130225 -1.761807 0.117494 -0.213970
1.366667 -1.297534 0.071363 0.113700 -1.744693 0.099890 -0.143021
1.400000 -1.357114 0.075478 0.115930 -1.725989 0.080781 -0.073023
1.433333 -1.414675 0.077644 0.109075 -1.706998 0.061367 -0.005169
1.466667 -1.467982 0.076958 0.099634 -1.689489 0.043059 0.056884
1.500000 -1.521396 0.076211 0.116675 -1.675037 0.027241 0.106803
1.533333 -1.574893 0.075403 0.138534 -1.664619 0.014951 0.140730
1.566667 -1.628445 0.074533 0.157126 -1.658942 0.006988 0.157253
1.600000 -1.682027 0.073603 0.169725 -1.658332 0.003836 0.158465
1.633333 -1.736319 0.072360 0.182130 -1.662740 0.005590 0.142360
1.666667 -1.791347 0.071387 0.178772 -1.670688 0.011775 0.110357
1.700000 -1.847139 0.070929 0.176975 -1.680150 0.021715 0.067234
1.733333 -1.903363 0.071228 0.184070 -1.689023 0.034558 0.014210
1.766667 -1.958920 0.072287 0.182011 -1.695157 0.049564 -0.044405
1.800000 -2.016940 0.074227 0.169360 -1.696489 0.065945 -0.105765
1.833333 -2.076156 0.077119 0.166261 -1.690987 0.082915 -0.166150
1.866667 -2.135757 0.080704 0.167381 -1.677296 0.099864 -0.222388
1.900000 -2.195130 0.084212 0.163222 -1.654927 0.116287 -0.273307
1.933333 -2.253425 0.088415 0.158668 -1.623148 0.131834 -0.314336
1.966667 -2.310048 0.093283 0.147634 -1.581224 0.146067 -0.343938
2.000000 -2.363959 0.099093 0.119188 -1.528995 0.158688 -0.359390
2.033333 -2.413851 0.105264 0.101895 -1.467121 0.169490 -0.359844
2.066667 -2.463373 0.111324 0.074414 -1.396886 0.178358 -0.345095
2.100000 -2.509826 0.118033 0.063839 -1.319571 0.185043 -0.318790
2.133333 -2.555867 0.124615 0.046164 -1.237431 0.189310 -0.286922
2.166667 -2.597367 0.131378 0.036037 -1.153893 0.191063 -0.256852
2.200000 -2.633743 0.138597 0.028238 -1.072495 0.190199 -0.236826
2.233333 -2.669665 0.145661 0.027316 -0.996174 0.186775 -0.232377
2.266667 -2.699662 0.152795 0.029185 -0.927877 0.180813 -0.246059
2.300000 -2.723437 0.159338 0.042327 -0.870475 0.172481 -0.276848
2.333333 -2.746750 0.165697 0.053644 -0.825964 0.161921 -0.322018
2.366667 -2.766804 0.171045 0.055918 -0.795132 0.149220 -0.376451
2.400000 -2.786409 0.176190 0.038153 -0.777495 0.134586 -0.433470
2.433333 -2.807216 0.180392 0.005767 -0.772492 0.118185 -0.487509
2.466667 -2.830434 0.184265 -0.036378 -0.778399 0.100232 -0.535524
2.500000 -2.856451 0.187579 -0.077988 -0.792325 0.080875 -0.573026
2.533333 -2.886084 0.190021 -0.100186 -0.811271 0.060311 -0.598090
2.566667 -2.915281 0.192227 -0.121340 -0.832139 0.038526 -0.610933
2.600000 -2.944038 0.194189 -0.121758 -0.852553 0.015410 -0.616854
2.633333 -2.974417 0.194164 -0.143196 -0.870243 -0.009129 -0.618978
2.666667 -3.004347 0.193886 -0.154532 -0.883868 -0.035214 -0.622643
2.700000 -3.035728 0.191693 -0.177977 -0.893010 -0.062615 -0.630975
2.733333 -3.066647 0.189242 -0.184177 -0.897789 -0.091563 -0.646983
2.766667 -3.097096 0.186532 -0.209819 -0.898567 -0.121771 -0.667578
2.800000 -3.127070 0.183563 -0.229705 -0.895706 -0.152951 -0.685719
2.833333 -3.157257 0.178035 -0.264811 -0.889726 -0.184853 -0.697674
2.866667 -3.186953 0.172247 -0.284739 -0.880909 -0.217215 -0.697274
2.900000 -3.217097 0.162689 -0.328450 -0.869570 -0.249922 -0.681401
2.933333 -3.246737 0.152878 -0.354933 -0.855966 -0.282092 -0.646973
2.966667 -3.275865 0.142821 -0.380144 -0.840436 -0.313136 -0.595755
3.000000 -3.304473 0.132523 -0.408743 -0.823319 -0.342466 -0.529096
3.033333 -3.332555 0.121991 -0.422093 -0.804901 -0.369735 -0.448485
3.066667 -3.358436 0.106947 -0.437232 -0.785157 -0.394348 -0.357186
3.100000 -3.383779 0.091685 -0.445189 -0.764063 -0.416162 -0.257131
3.133333 -3.408579 0.076217 -0.444280 -0.741145 -0.435379 -0.151035
3.166667 -3.432832 0.060554 -0.448873 -0.715633 -0.452159 -0.043129
3.200000 -3.456533 0.044707 -0.451586 -0.686547 -0.466572 0.059966
3.233333 -3.479680 0.028687 -0.444178 -0.652857 -0.478501 0.153316
3.266667 -3.502267 0.012506 -0.453836 -0.614155 -0.488327 0.236524
3.300000 -3.524293 -0.003825 -0.442291 -0.569965 -0.496131 0.303214
3.333333 -3.545753 -0.020293 -0.419421 -0.520437 -0.502024 0.352814
3.366667 -3.566645 -0.036888 -0.385842 -0.466403 -0.506288 0.384530
3.400000 -3.581564 -0.054907 -0.388466 -0.409707 -0.509253 0.400883
3.433333 -3.595917 -0.073028 -0.327453 -0.352178 -0.511122 0.397235
3.466667 -3.605954 -0.091074 -0.316536 -0.295566 -0.511582 0.369711
3.500000 -3.611872 -0.108636 -0.316084 -0.241917 -0.510383 0.320170
3.533333 -3.614711 -0.125184 -0.316084 -0.193150 -0.507085 0.246588
3.566667 -3.617021 -0.141782 -0.304570 -0.150848 -0.500850 0.153688
3.600000 -3.618817 -0.158419 -0.311160 -0.115550 -0.490894 0.043640
3.633333 -3.620114 -0.174987 -0.289309 -0.088165 -0.476722 -0.063291
3.666667 -3.620927 -0.191571 -0.270106 -0.069130 -0.458380 -0.157138
3.700000 -3.622232 -0.209080 -0.272726 -0.058201 -0.435743 -0.234693
3.733333 -3.624683 -0.226276 -0.291140 -0.054617 -0.409074 -0.289776
3.766667 -3.626520 -0.241933 -0.324497 -0.057711 -0.379403 -0.319142
3.800000 -3.626932 -0.254159 -0.366470 -0.067059 -0.348337 -0.318541
3.833333 -3.626932 -0.266349 -0.392056 -0.081526 -0.317298 -0.300372
3.866667 -3.626268 -0.275262 -0.433677 -0.100281 -0.287852 -0.264770
3.900000 -3.626727 -0.281721 -0.442954 -0.122842 -0.262126 -0.207585
3.933333 -3.630941 -0.286625 -0.457785 -0.148836 -0.242139 -0.127299
3.966667 -3.638916 -0.291727 -0.385611 -0.177115 -0.229115 -0.032980
4.000000 -3.646539 -0.296785 -0.355621 -0.205985 -0.223342 0.062617
4.033333 -3.653813 -0.301799 -0.382157 -0.234095 -0.225134 0.163980
4.066667 -3.660746 -0.306771 -0.405984 -0.259661 -0.234000 0.266292
4.100000 -3.670491 -0.313604 -0.405775 -0.280509 -0.248547 0.368386
4.133333 -3.683099 -0.322453 -0.397437 -0.294479 -0.266985 0.468782
4.166667 -3.695370 -0.331255 -0.376801 -0.300151 -0.287901 0.581161
4.200000 -3.707962 -0.341710 -0.345590 -0.296643 -0.309829 0.717098
4.233333 -3.720507 -0.354093 -0.326839 -0.283058 -0.331141 0.865188
4.266667 -3.732709 -0.366415 -0.292671 -0.259135 -0.350467 1.017152
4.300000 -3.744567 -0.378669 -0.241379 -0.225550 -0.366986 1.159367
4.333333 -3.753843 -0.392193 -0.255593 -0.183920 -0.380141 1.282080
4.366667 -3.762773 -0.405633 -0.186162 -0.136116 -0.389193 1.362556
4.400000 -3.767985 -0.419348 -0.132904 -0.084500 -0.394041 1.388796
4.433333 -3.769856 -0.433801 -0.066731 -0.031734 -0.394849 1.363613
4.466667 -3.768041 -0.448237 0.027267 0.019280 -0.391928 1.280626
4.500000 -3.763129 -0.463187 0.136738 0.065797 -0.385340 1.147071
4.533333 -3.756240 -0.476390 0.168122 0.105625 -0.375418 0.962432
4.566667 -3.749059 -0.489455 0.195729 0.136989 -0.362564 0.742965
4.600000 -3.741445 -0.501304 0.211903 0.158845 -0.346991 0.503711
4.633333 -3.733573 -0.513000 0.203598 0.170657 -0.328786 0.254591
4.666667 -3.725411 -0.523603 0.194673 0.172855 -0.308059 0.022672
4.700000 -3.718553 -0.533314 0.189838 0.166732 -0.285301 -0.179080
4.733333 -3.711484 -0.542855 0.143675 0.154129 -0.260721 -0.331761
4.766667 -3.704218 -0.552222 0.165312 0.136906 -0.234706 -0.438348
4.800000 -3.699286 -0.560676 0.069699 0.116873 -0.207658 -0.495517
4.833333 -3.695737 -0.567658 0.080842 0.095781 -0.180238 -0.511769
4.866667 -3.694708 -0.573402 0.030927 0.075201 -0.153193 -0.492580
4.900000 -3.694432 -0.577708 0.016259 0.056151 -0.127101 -0.449088
4.933333 -3.694257 -0.581015 0.013908 0.039294 -0.102656 -0.396119
4.966667 -3.694269 -0.582887 0.026715 0.025270 -0.080494 -0.332512
5.000000 -3.694536 -0.583328 -0.018617 0.014387 -0.061206 -0.271845
5.033333 -3.694626 -0.583554 -0.004936 0.006635 -0.045061 -0.210709
5.066667 -3.694596 -0.583608 0.007882 0.001504 -0.032091 -0.161911
5.100000 -3.694632 -0.583825 -0.016510 -0.001523 -0.022145 -0.119089
5.133333 -3.695140 -0.584203 -0.009844 -0.002983 -0.014940 -0.085083
5.166667 -3.695456 -0.584541 -0.013959 -0.003436 -0.009997 -0.057321
5.200000 -3.695580 -0.584923 -0.012801 -0.003336 -0.006689 -0.036827
5.233333 -3.695608 -0.585152 -0.025753 -0.002977 -0.004455 -0.018002
