t x y theta dxdt dydt dthetadt
0.000000 0.000000 0.000000 -2.955847 0.034403 -0.149298 -0.771195
0.033333 0.001157 -0.005012 -2.979097 0.035159 -0.153405 -0.786827
0.066667 0.002342 -0.010187 -3.022196 0.035915 -0.157577 -0.778350
0.100000 0.003555 -0.015524 -3.069857 0.036669 -0.161814 -0.748034
0.133333 0.004792 -0.020983 -3.095430 0.037420 -0.166109 -0.701118
0.166667 0.006054 -0.026564 -3.127429 0.038168 -0.170464 -0.645198
0.200000 0.007339 -0.032268 3.118213 0.038912 -0.174868 -0.580105
0.233333 0.008649 -0.038142 3.103873 0.039651 -0.179308 -0.509155
0.266667 0.009984 -0.044185 3.104764 0.040386 -0.183765 -0.434459
0.300000 0.011343 -0.050397 3.116573 0.041115 -0.188233 -0.363440
0.333333 0.012727 -0.056779 3.111097 0.041839 -0.192707 -0.298017
0.366667 0.014134 -0.063287 3.100316 0.042557 -0.197175 -0.236386
0.400000 0.015566 -0.069964 3.079357 0.043270 -0.201626 -0.182204
0.433333 0.017021 -0.076768 3.075744 0.043976 -0.206059 -0.135698
0.466667 0.018501 -0.083699 3.069671 0.044676 -0.210478 -0.104606
0.500000 0.020003 -0.090797 3.056836 0.045368 -0.214878 -0.084697
0.533333 0.021529 -0.098024 3.058928 0.046054 -0.219260 -0.082777
0.566667 0.023079 -0.105378 3.053382 0.046732 -0.223627 -0.110946
0.600000 0.024651 -0.112897 3.086656 0.047403 -0.227990 -0.183216
0.633333 0.026243 -0.120579 3.075104 0.048066 -0.232348 -0.307867
0.666667 0.027855 -0.128423 3.073514 0.048725 -0.236691 -0.481238
0.700000 0.029492 -0.136395 3.090592 0.049378 -0.241016 -0.704543
0.733333 0.031152 -0.144495 3.087626 0.050028 -0.245321 -0.962172
0.766667 0.032831 -0.152752 3.086438 0.050675 -0.249596 -1.231719
0.800000 0.034528 -0.161164 3.030109 0.051323 -0.253829 -1.473896
0.833333 0.036249 -0.169704 2.977289 0.051973 -0.258017 -1.657741
0.866667 0.037995 -0.178372 2.885976 0.052626 -0.262165 -1.754372
0.900000 0.039758 -0.187189 2.771799 0.053284 -0.266269 -1.733187
0.933333 0.041541 -0.196153 2.633260 0.053947 -0.270325 -1.575473
0.966667 0.043347 -0.205244 2.518409 0.054617 -0.274334 -1.272678
1.000000 0.045178 -0.214462 2.427863 0.055292 -0.278298 -0.835197
1.033333 0.047029 -0.223819 2.373756 0.055971 -0.282214 -0.285595
1.066667 0.048905 -0.233301 2.367415 0.056652 -0.286076 0.340416
1.100000 0.050806 -0.242909 2.389980 0.057335 -0.289879 0.996441
1.133333 0.052728 -0.252648 2.443498 0.058015 -0.293626 1.627817
1.166667 0.054676 -0.262510 2.553178 0.058690 -0.297315 2.186151
1.200000 0.056645 -0.272497 2.680812 0.059359 -0.300944 2.625483
1.233333 0.058640 -0.282607 2.831462 0.060018 -0.304512 2.919521
1.266667 0.060654 -0.292834 3.004138 0.060664 -0.308026 3.052308
1.300000 0.062692 -0.303182 -3.135139 0.061297 -0.311486 3.020091
1.333333 0.064752 -0.313637 -2.958923 0.061916 -0.314897 2.831164
1.366667 0.066828 -0.324194 -2.855492 0.062520 -0.318263 2.507047
1.400000 0.068919 -0.334852 -2.763548 0.063112 -0.321593 2.077826
1.433333 0.071034 -0.345629 -2.696870 0.063699 -0.324895 1.571791
1.466667 0.073175 -0.356522 -2.673519 0.064283 -0.328176 1.023819
1.500000 0.075340 -0.367532 -2.650772 0.064865 -0.331439 0.465451
1.533333 0.077511 -0.378637 -2.650980 0.065444 -0.334688 -0.063981
1.566667 0.079685 -0.389835 -2.663269 0.066025 -0.337924 -0.545897
1.600000 0.081885 -0.401148 -2.704452 0.066603 -0.341144 -0.964433
1.633333 0.084109 -0.412573 -2.782178 0.067173 -0.344341 -1.307383
1.666667 0.086359 -0.424110 -2.877977 0.067733 -0.347512 -1.567814
1.700000 0.088635 -0.435759 -2.948941 0.068287 -0.350657 -1.741480
1.733333 0.090936 -0.447517 -3.018424 0.068832 -0.353772 -1.837637
1.766667 0.093262 -0.459385 -3.095654 0.069362 -0.356848 -1.856826
1.800000 0.095589 -0.471339 3.103391 0.069878 -0.359886 -1.802817
1.833333 0.097913 -0.483384 3.017241 0.070382 -0.362884 -1.681033
1.866667 0.100263 -0.495535 2.975155 0.070878 -0.365842 -1.509736
1.900000 0.102639 -0.507791 2.923981 0.071369 -0.368760 -1.300549
1.933333 0.105020 -0.520137 2.878149 0.071864 -0.371644 -1.062040
1.966667 0.107428 -0.532586 2.822014 0.072375 -0.374501 -0.806198
2.000000 0.109846 -0.545125 2.808290 0.072910 -0.377336 -0.547151
2.033333 0.112277 -0.557754 2.792130 0.073475 -0.380153 -0.300168
2.066667 0.114724 -0.570473 2.799817 0.074074 -0.382955 -0.064621
2.100000 0.117188 -0.583282 2.812724 0.074712 -0.385745 0.152460
2.133333 0.119672 -0.596183 2.835482 0.075387 -0.388527 0.342566
2.166667 0.122185 -0.609179 2.871328 0.076101 -0.391303 0.498533
2.200000 0.124725 -0.622271 2.881756 0.076849 -0.394074 0.622352
2.233333 0.127294 -0.635455 2.909604 0.077632 -0.396843 0.717059
2.266667 0.129891 -0.648732 2.957173 0.078446 -0.399611 0.779284
2.300000 0.132517 -0.662100 2.976331 0.079285 -0.402376 0.812314
2.333333 0.135172 -0.675562 3.011511 0.080145 -0.405135 0.819301
2.366667 0.137856 -0.689112 3.034533 0.081022 -0.407881 0.808314
2.400000 0.140569 -0.702749 3.072698 0.081912 -0.410608 0.772788
2.433333 0.143312 -0.716481 3.104503 0.082814 -0.413309 0.706649
2.466667 0.146084 -0.730310 3.134769 0.083723 -0.415977 0.606224
2.500000 0.148886 -0.744234 -3.138083 0.084640 -0.418608 0.466493
2.533333 0.151721 -0.758251 -3.112842 0.085564 -0.421202 0.281077
2.566667 0.154587 -0.772348 -3.092225 0.086492 -0.423762 0.046366
2.600000 0.157487 -0.786537 -3.076617 0.087425 -0.426288 -0.231197
2.633333 0.160418 -0.800803 -3.059278 0.088360 -0.428783 -0.535891
2.666667 0.163379 -0.815144 -3.064637 0.089297 -0.431251 -0.852050
2.700000 0.166372 -0.829557 -3.071102 0.090235 -0.433693 -1.169554
2.733333 0.169396 -0.844041 -3.131009 0.091176 -0.436106 -1.461579
2.766667 0.172451 -0.858595 3.057465 0.092118 -0.438486 -1.711587
2.800000 0.175536 -0.873247 2.949245 0.093063 -0.440830 -1.897903
2.833333 0.178652 -0.887999 2.876808 0.094012 -0.443134 -2.013983
2.866667 0.181800 -0.902850 2.736899 0.094966 -0.445392 -2.049506
2.900000 0.184979 -0.917763 2.680752 0.095927 -0.447597 -1.996839
2.933333 0.188190 -0.932735 2.562721 0.096897 -0.449750 -1.862507
2.966667 0.191434 -0.947766 2.522894 0.097878 -0.451852 -1.660774
3.000000 0.194712 -0.962893 2.460540 0.098870 -0.453902 -1.412663
3.033333 0.198022 -0.978074 2.411764 0.099873 -0.455900 -1.133523
3.066667 0.201365 -0.993306 2.384002 0.100887 -0.457850 -0.850804
3.100000 0.204740 -1.008588 2.363707 0.101911 -0.459759 -0.582777
3.133333 0.208147 -1.023917 2.346368 0.102945 -0.461631 -0.351711
3.166667 0.211593 -1.039338 2.364656 0.103988 -0.463470 -0.164829
3.200000 0.215079 -1.054850 2.373080 0.105039 -0.465278 -0.027140
3.233333 0.218597 -1.070402 2.406699 0.106100 -0.467065 0.054687
3.266667 0.222155 -1.086041 2.439798 0.107169 -0.468832 0.082753
3.300000 0.225746 -1.101715 2.454396 0.108247 -0.470570 0.059430
3.333333 0.229368 -1.117423 2.455162 0.109330 -0.472271 -0.006430
3.366667 0.233023 -1.133161 2.460827 0.110418 -0.473923 -0.102809
3.400000 0.236717 -1.148975 2.457319 0.111507 -0.475516 -0.221531
3.433333 0.240451 -1.164862 2.439609 0.112595 -0.477032 -0.346362
3.466667 0.244224 -1.180818 2.425178 0.113679 -0.478455 -0.459551
3.500000 0.248037 -1.196840 2.391195 0.114757 -0.479769 -0.546320
3.533333 0.251882 -1.212880 2.374892 0.115828 -0.480966 -0.595015
3.566667 0.255766 -1.228978 2.346644 0.116890 -0.482034 -0.600404
3.600000 0.259690 -1.245131 2.305107 0.117943 -0.482961 -0.553539
3.633333 0.263645 -1.261294 2.263587 0.118988 -0.483745 -0.456015
3.666667 0.267630 -1.277462 2.225255 0.120025 -0.484389 -0.311988
3.700000 0.271645 -1.293632 2.216182 0.121057 -0.484899 -0.133356
3.733333 0.275690 -1.309801 2.198210 0.122084 -0.485283 0.069860
3.766667 0.279776 -1.326006 2.197121 0.123109 -0.485549 0.282512
3.800000 0.283892 -1.342205 2.222190 0.124134 -0.485707 0.485539
3.833333 0.288051 -1.358429 2.250703 0.125160 -0.485763 0.665152
3.866667 0.292237 -1.374640 2.293170 0.126186 -0.485717 0.802789
3.900000 0.296467 -1.390866 2.350483 0.127213 -0.485565 0.892116
3.933333 0.300724 -1.407073 2.412111 0.128239 -0.485302 0.923308
3.966667 0.305023 -1.423284 2.446595 0.129262 -0.484922 0.898276
4.000000 0.309348 -1.439469 2.511985 0.130279 -0.484412 0.815768
4.033333 0.313700 -1.455625 2.541286 0.131287 -0.483768 0.673292
4.066667 0.318092 -1.471766 2.559668 0.132285 -0.482981 0.472264
4.100000 0.322523 -1.487887 2.562682 0.133270 -0.482045 0.216173
4.133333 0.326991 -1.503981 2.579801 0.134237 -0.480953 -0.093339
4.166667 0.331484 -1.520032 2.578239 0.135184 -0.479704 -0.473014
4.200000 0.336012 -1.536041 2.565912 0.136109 -0.478295 -0.921625
4.233333 0.340574 -1.552000 2.561464 0.137008 -0.476720 -1.443433
4.266667 0.345167 -1.567904 2.519138 0.137880 -0.474977 -2.039634
4.300000 0.349782 -1.583751 2.499180 0.138724 -0.473065 -2.720956
4.333333 0.354426 -1.599529 2.430486 0.139546 -0.470983 -3.481562
4.366667 0.359097 -1.615229 2.293744 0.140349 -0.468727 -4.287372
4.400000 0.363795 -1.630845 2.115799 0.141138 -0.466298 -5.112896
4.433333 0.368519 -1.646369 1.998779 0.141918 -0.463704 -5.909885
4.466667 0.373261 -1.661820 1.791333 0.142692 -0.460952 -6.618881
4.500000 0.378020 -1.677196 1.475903 0.143464 -0.458050 -7.167529
4.533333 0.382807 -1.692462 1.218072 0.144237 -0.455011 -7.502855
4.566667 0.387622 -1.707613 0.860475 0.145010 -0.451849 -7.585788
4.600000 0.392467 -1.722645 0.465946 0.145787 -0.448576 -7.380880
4.633333 0.397342 -1.737555 0.138934 0.146573 -0.445198 -6.886843
4.666667 0.402250 -1.752338 -0.204881 0.147370 -0.441728 -6.132399
4.700000 0.407190 -1.766993 -0.505962 0.148174 -0.438181 -5.169029
4.733333 0.412141 -1.781551 -0.734948 0.148986 -0.434570 -4.038576
4.766667 0.417100 -1.796009 -0.813235 0.149804 -0.430902 -2.809481
4.800000 0.422094 -1.810333 -0.815265 0.150620 -0.427189 -1.572904
4.833333 0.427122 -1.824525 -0.756508 0.151422 -0.423440 -0.392557
4.866667 0.432185 -1.838584 -0.704329 0.152200 -0.419661 0.687860
4.900000 0.437280 -1.852510 -0.607896 0.152946 -0.415850 1.631995
4.933333 0.442409 -1.866305 -0.433610 0.153649 -0.412012 2.401198
4.966667 0.447571 -1.879968 -0.314546 0.154299 -0.408154 2.996784
5.000000 0.452735 -1.893512 -0.240012 0.154896 -0.404278 3.463117
5.033333 0.457932 -1.906926 -0.103431 0.155447 -0.400388 3.824316
5.066667 0.463162 -1.920211 0.060628 0.155961 -0.396488 4.099803
5.100000 0.468390 -1.933369 0.233424 0.156446 -0.392579 4.315775
5.133333 0.473613 -1.946396 0.326149 0.156917 -0.388658 4.508293
5.166667 0.478829 -1.959289 0.473780 0.157386 -0.384720 4.683450
5.200000 0.484038 -1.972047 0.632856 0.157860 -0.380759 4.815906
5.233333 0.489280 -1.984675 0.794191 0.158338 -0.376770 4.905193
5.266667 0.494554 -1.997173 0.980758 0.158814 -0.372746 4.949479
5.300000 0.499859 -2.009539 1.163746 0.159281 -0.368680 4.946799
5.333333 0.505194 -2.021774 1.391336 0.159718 -0.364563 4.876413
5.366667 0.510556 -2.033874 1.549013 0.160099 -0.360384 4.746224
5.400000 0.515943 -2.045841 1.741585 0.160396 -0.356133 4.573011
5.433333 0.521310 -2.057653 1.920894 0.160583 -0.351797 4.353776
5.466667 0.526698 -2.069328 2.077855 0.160638 -0.347370 4.090062
5.500000 0.532104 -2.080865 2.175369 0.160548 -0.342845 3.783234
5.533333 0.537485 -2.092240 2.241731 0.160306 -0.338218 3.450052
5.566667 0.542878 -2.103473 2.350763 0.159917 -0.333491 3.079876
5.600000 0.548243 -2.114540 2.465477 0.159392 -0.328670 2.668118
5.633333 0.553576 -2.125438 2.573009 0.158745 -0.323763 2.217006
5.666667 0.558876 -2.136164 2.667890 0.157989 -0.318777 1.734499
5.700000 0.564140 -2.146717 2.756277 0.157141 -0.313724 1.220893
5.733333 0.569368 -2.157093 2.811697 0.156217 -0.308615 0.676479
5.766667 0.574555 -2.167291 2.829335 0.155231 -0.303463 0.126885
5.800000 0.579730 -2.177335 2.832585 0.154195 -0.298274 -0.401876
5.833333 0.584861 -2.187196 2.789058 0.153116 -0.293053 -0.879208
5.866667 0.589946 -2.196871 2.726886 0.151999 -0.287804 -1.287889
5.900000 0.595007 -2.206388 2.619762 0.150845 -0.282524 -1.594877
5.933333 0.600018 -2.215714 2.497859 0.149651 -0.277207 -1.774365
5.966667 0.604999 -2.224877 2.361068 0.148405 -0.271841 -1.817964
6.000000 0.609945 -2.233873 2.315887 0.147103 -0.266417 -1.732473
6.033333 0.614835 -2.242672 2.201193 0.145735 -0.260923 -1.528056
6.066667 0.619687 -2.251298 2.135773 0.144293 -0.255345 -1.214970
6.100000 0.624497 -2.259749 2.097904 0.142767 -0.249672 -0.821582
6.133333 0.629246 -2.267996 2.077221 0.141153 -0.243896 -0.382048
6.166667 0.633949 -2.276058 2.073902 0.139447 -0.238014 0.075702
6.200000 0.638603 -2.283934 2.091953 0.137646 -0.232020 0.540163
6.233333 0.643189 -2.291600 2.116219 0.135748 -0.225915 0.981721
6.266667 0.647704 -2.299053 2.190862 0.133752 -0.219702 1.375895
6.300000 0.652148 -2.306293 2.259864 0.131661 -0.213385 1.709067
6.333333 0.656517 -2.313316 2.321868 0.129474 -0.206970 1.976283
6.366667 0.660810 -2.320121 2.409928 0.127192 -0.200461 2.162489
6.400000 0.665030 -2.326711 2.521944 0.124818 -0.193865 2.245791
6.433333 0.669172 -2.333081 2.609523 0.122350 -0.187186 2.228962
6.466667 0.673232 -2.339227 2.692909 0.119784 -0.180429 2.115657
6.500000 0.677207 -2.345148 2.821508 0.117112 -0.173590 1.904227
6.533333 0.681088 -2.350836 2.939809 0.114325 -0.166669 1.595730
6.566667 0.684881 -2.356295 2.974017 0.111416 -0.159664 1.210672
6.600000 0.688567 -2.361515 3.029522 0.108375 -0.152570 0.775687
6.633333 0.692162 -2.366503 3.054629 0.105201 -0.145390 0.309431
6.666667 0.695663 -2.371257 3.068771 0.101900 -0.138126 -0.164157
6.700000 0.699038 -2.375760 3.034207 0.098487 -0.130786 -0.611411
6.733333 0.702316 -2.380027 2.976844 0.094979 -0.123380 -1.004105
6.766667 0.705453 -2.384036 2.914809 0.091401 -0.115920 -1.328822
6.800000 0.708445 -2.387783 2.826340 0.087773 -0.108418 -1.573683
6.833333 0.711286 -2.391264 2.721919 0.084116 -0.100882 -1.729585
6.866667 0.714024 -2.394504 2.653124 0.080442 -0.093320 -1.797839
6.900000 0.716601 -2.397470 2.556242 0.076753 -0.085728 -1.787646
6.933333 0.719074 -2.400191 2.492336 0.073045 -0.078104 -1.711363
6.966667 0.721440 -2.402668 2.432156 0.069298 -0.070434 -1.577849
7.000000 0.723699 -2.404899 2.408983 0.065492 -0.062705 -1.407375
7.033333 0.725849 -2.406883 2.356276 0.061592 -0.054897 -1.217772
7.066667 0.727890 -2.408619 2.311293 0.057568 -0.046991 -1.021863
7.100000 0.729821 -2.410108 2.270706 0.053391 -0.038973 -0.832681
7.133333 0.731574 -2.411303 2.255337 0.049046 -0.030835 -0.657440
7.166667 0.733216 -2.412249 2.239202 0.044535 -0.022581 -0.504233
7.200000 0.734678 -2.412900 2.251884 0.039873 -0.014224 -0.372580
7.233333 0.735962 -2.413257 2.241329 0.035090 -0.005787 -0.259979
7.266667 0.737066 -2.413318 2.241003 0.030229 0.002700 -0.170825
7.300000 0.737991 -2.413084 2.248503 0.025346 0.011198 -0.102016
7.333333 0.738735 -2.412555 2.247669 0.020483 0.019677 -0.053957
7.366667 0.739299 -2.411731 2.242869 0.015680 0.028109 -0.022046
7.400000 0.739683 -2.410612 2.244277 0.010961 0.036477 -0.001999
7.433333 0.739887 -2.409197 2.238090 0.006347 0.044766 0.003962
7.466667 0.739976 -2.407533 2.250922 0.001833 0.052979 0.007047
7.500000 0.739950 -2.405620 2.251596 -0.002606 0.061132 0.007068
7.533333 0.739809 -2.403458 2.241609 -0.006987 0.069238 0.009139
7.566667 0.739488 -2.401003 2.268616 -0.011343 0.077318 0.010100
7.600000 0.739054 -2.398300 2.226842 -0.015703 0.085393 0.015854
7.633333 0.738506 -2.395351 2.254042 -0.020102 0.093488 0.027174
7.666667 0.737779 -2.392110 2.241172 -0.024555 0.101611 0.048459
7.700000 0.736941 -2.388624 2.257540 -0.029065 0.109764 0.082405
7.733333 0.735925 -2.384848 2.242670 -0.033629 0.117944 0.132659
7.766667 0.734733 -2.380781 2.237031 -0.038239 0.126145 0.208263
7.800000 0.733366 -2.376425 2.255117 -0.042875 0.134353 0.300448
7.833333 0.731824 -2.371780 2.258506 -0.047502 0.142540 0.415190
7.866667 0.730174 -2.366898 2.257635 -0.052103 0.150696 0.538337
7.900000 0.728352 -2.361730 2.272250 -0.056653 0.158802 0.665605
7.933333 0.726357 -2.356276 2.291419 -0.061135 0.166846 0.784828
7.966667 0.724193 -2.350538 2.291419 -0.065534 0.174818 0.883408
8.000000 0.721926 -2.344570 2.383307 -0.069837 0.182709 0.951843
8.033333 0.719493 -2.338320 2.417754 -0.074049 0.190523 0.980730
8.066667 0.716960 -2.331844 2.476915 -0.078159 0.198252 0.967718
8.100000 0.714267 -2.325091 2.533832 -0.082171 0.205902 0.909851
8.133333 0.711417 -2.318063 2.584844 -0.086081 0.213467 0.807750
8.166667 0.708473 -2.310815 2.605007 -0.089888 0.220947 0.666247
8.200000 0.705379 -2.303297 2.638567 -0.093589 0.228340 0.500242
8.233333 0.702196 -2.295564 2.635227 -0.097178 0.235636 0.319227
8.266667 0.698872 -2.287567 2.647345 -0.100650 0.242832 0.133111
8.300000 0.695410 -2.279307 2.633656 -0.103995 0.249916 -0.043228
8.333333 0.691866 -2.270842 2.616456 -0.107216 0.256889 -0.196702
8.366667 0.688195 -2.262120 2.598803 -0.110302 0.263738 -0.321507
8.400000 0.684447 -2.253198 2.593852 -0.113257 0.270467 -0.415053
8.433333 0.680580 -2.244027 2.561304 -0.116078 0.277075 -0.475390
8.466667 0.676642 -2.234662 2.531652 -0.118768 0.283565 -0.497721
8.500000 0.672596 -2.225054 2.519862 -0.121337 0.289948 -0.490346
8.533333 0.668483 -2.215260 2.481104 -0.123781 0.296221 -0.457063
8.566667 0.664306 -2.205284 2.470711 -0.126114 0.302397 -0.399680
8.600000 0.660037 -2.195075 2.439070 -0.128334 0.308480 -0.318563
8.633333 0.655709 -2.184692 2.442945 -0.130446 0.314470 -0.224254
8.666667 0.651299 -2.174082 2.428537 -0.132453 0.320367 -0.123243
8.700000 0.646836 -2.163305 2.430294 -0.134352 0.326167 -0.017560
8.733333 0.642301 -2.152312 2.420899 -0.136145 0.331868 0.088361
8.766667 0.637698 -2.141104 2.449725 -0.137824 0.337452 0.187077
8.800000 0.633052 -2.129743 2.454228 -0.139386 0.342909 0.269030
8.833333 0.628347 -2.118177 2.467442 -0.140827 0.348227 0.339777
8.866667 0.623606 -2.106467 2.469365 -0.142143 0.353393 0.397078
8.900000 0.618816 -2.094562 2.508023 -0.143330 0.358393 0.439821
8.933333 0.613984 -2.082469 2.535448 -0.144383 0.363222 0.465370
8.966667 0.609125 -2.070245 2.542598 -0.145303 0.367884 0.480683
9.000000 0.604234 -2.057845 2.562390 -0.146086 0.372372 0.488089
9.033333 0.599321 -2.045322 2.572227 -0.146732 0.376690 0.486963
9.066667 0.594391 -2.032681 2.588187 -0.147240 0.380840 0.476764
9.100000 0.589445 -2.019883 2.606408 -0.147608 0.384828 0.461467
9.133333 0.584488 -2.006935 2.618784 -0.147840 0.388651 0.447728
9.166667 0.579524 -1.993883 2.643853 -0.147939 0.392300 0.429464
9.200000 0.574555 -1.980734 2.653141 -0.147909 0.395776 0.410411
9.233333 0.569592 -1.967456 2.669618 -0.147754 0.399069 0.389259
9.266667 0.564642 -1.954055 2.675433 -0.147479 0.402170 0.372301
9.300000 0.559710 -1.940539 2.695816 -0.147087 0.405068 0.356433
9.333333 0.554800 -1.926915 2.700243 -0.146579 0.407756 0.340209
9.366667 0.549902 -1.913220 2.723020 -0.145955 0.410230 0.330664
9.400000 0.545019 -1.899459 2.712999 -0.145212 0.412485 0.329453
9.433333 0.540176 -1.885614 2.726489 -0.144355 0.414519 0.338185
9.466667 0.535354 -1.871715 2.750169 -0.143384 0.416334 0.352250
9.500000 0.530556 -1.857767 2.739299 -0.142303 0.417937 0.378184
9.533333 0.525786 -1.843774 2.754827 -0.141120 0.419334 0.413774
9.566667 0.521076 -1.829731 2.769601 -0.139842 0.420531 0.455994
9.600000 0.516400 -1.815655 2.791621 -0.138481 0.421533 0.498955
9.633333 0.511795 -1.801545 2.787448 -0.137042 0.422349 0.544612
9.666667 0.507264 -1.787409 2.818763 -0.135536 0.422981 0.593681
9.700000 0.502776 -1.773256 2.840835 -0.133969 0.423431 0.640330
9.733333 0.498334 -1.759094 2.878536 -0.132340 0.423695 0.683367
9.766667 0.493941 -1.744926 2.894973 -0.130641 0.423769 0.724630
9.800000 0.489600 -1.730759 2.921733 -0.128860 0.423651 0.765066
9.833333 0.485313 -1.716599 2.944903 -0.126975 0.423332 0.801249
9.866667 0.481084 -1.702451 2.976357 -0.124962 0.422808 0.833735
9.900000 0.476916 -1.688321 2.989348 -0.122801 0.422076 0.863446
9.933333 0.472810 -1.674214 3.029897 -0.120477 0.421136 0.892750
9.966667 0.468771 -1.660136 3.056789 -0.117987 0.419989 0.920076
10.000000 0.464801 -1.646093 3.086644 -0.115329 0.418635 0.946801
10.033333 0.460945 -1.632109 3.131380 -0.112513 0.417080 0.969650
10.066667 0.457205 -1.618190 -3.123459 -0.109557 0.415327 0.986302
10.100000 0.453589 -1.604339 -3.087823 -0.106478 0.413382 0.988834
10.133333 0.450098 -1.590563 -3.060368 -0.103298 0.411250 0.967091
10.166667 0.446735 -1.576867 -3.019108 -0.100038 0.408938 0.906305
10.200000 0.443456 -1.563239 -2.987010 -0.096721 0.406453 0.794236
10.233333 0.440264 -1.549685 -2.951642 -0.093360 0.403798 0.620429
10.266667 0.437204 -1.536232 -2.917325 -0.089968 0.400977 0.380305
10.300000 0.434235 -1.522863 -2.869088 -0.086547 0.397988 0.071288
10.333333 0.431399 -1.509610 -2.839877 -0.083097 0.394833 -0.298134
10.366667 0.428699 -1.496479 -2.829302 -0.079613 0.391509 -0.707344
10.400000 0.426097 -1.483449 -2.826071 -0.076089 0.388017 -1.134380
10.433333 0.423594 -1.470524 -2.863412 -0.072521 0.384357 -1.546429
10.466667 0.421229 -1.457739 -2.960943 -0.068903 0.380530 -1.922297
10.500000 0.418968 -1.445069 -3.073381 -0.065231 0.376536 -2.223817
10.533333 0.416849 -1.432550 3.093015 -0.061502 0.372377 -2.424947
10.566667 0.414868 -1.420192 2.916528 -0.057706 0.368051 -2.506106
10.600000 0.412996 -1.407964 2.845008 -0.053840 0.363559 -2.461954
10.633333 0.411234 -1.395870 2.694003 -0.049903 0.358905 -2.291807
10.666667 0.409618 -1.383950 2.581341 -0.045895 0.354097 -2.002617
10.700000 0.408115 -1.372175 2.510574 -0.041817 0.349137 -1.621985
10.733333 0.406764 -1.360581 2.480224 -0.037666 0.344032 -1.179884
10.766667 0.405568 -1.349173 2.447067 -0.033451 0.338788 -0.712468
10.800000 0.404529 -1.337954 2.417334 -0.029175 0.333414 -0.243109
10.833333 0.403608 -1.326899 2.437373 -0.024839 0.327912 0.192842
10.866667 0.402850 -1.316041 2.474338 -0.020446 0.322286 0.571707
10.900000 0.402257 -1.305383 2.523837 -0.016009 0.316546 0.880042
10.933333 0.401786 -1.294902 2.598114 -0.011541 0.310699 1.107683
10.966667 0.401437 -1.284602 2.675554 -0.007044 0.304746 1.248726
11.000000 0.401258 -1.274512 2.720887 -0.002529 0.298691 1.301089
11.033333 0.401250 -1.264636 2.783110 0.001992 0.292538 1.271652
11.066667 0.401415 -1.254976 2.842462 0.006506 0.286292 1.173615
11.100000 0.401705 -1.245514 2.908772 0.011009 0.279951 1.015776
11.133333 0.402168 -1.236275 2.923764 0.015491 0.273518 0.821530
11.166667 0.402756 -1.227240 2.972278 0.019938 0.266998 0.610841
11.200000 0.403519 -1.218437 2.973305 0.024342 0.260394 0.404948
11.233333 0.404408 -1.209845 2.994976 0.028703 0.253703 0.225086
11.266667 0.405470 -1.201491 2.972950 0.033019 0.246927 0.093646
11.300000 0.406658 -1.193356 2.952472 0.037282 0.240070 0.035837
11.333333 0.407972 -1.185443 2.916477 0.041502 0.233126 0.058730
11.366667 0.409413 -1.177757 2.889771 0.045681 0.226095 0.174606
11.400000 0.411022 -1.170323 2.877664 0.049824 0.218975 0.381396
11.433333 0.412758 -1.163122 2.860880 0.053934 0.211762 0.673628
11.466667 0.414619 -1.156156 2.874311 0.058026 0.204446 1.022333
11.500000 0.416644 -1.149454 2.867097 0.062112 0.197021 1.398067
11.533333 0.418794 -1.142993 2.915614 0.066193 0.189482 1.768832
11.566667 0.421069 -1.136778 2.985758 0.070281 0.181819 2.104821
11.600000 0.423467 -1.130810 3.125451 0.074384 0.174022 2.373508
11.633333 0.425989 -1.125093 -3.014061 0.078508 0.166082 2.546371
11.666667 0.428668 -1.119655 -2.872029 0.082651 0.157995 2.615149
11.700000 0.431470 -1.114473 -2.764899 0.086817 0.149753 2.571183
11.733333 0.434425 -1.109580 -2.625521 0.091005 0.141350 2.418787
11.766667 0.437533 -1.104978 -2.522099 0.095213 0.132787 2.162722
11.800000 0.440792 -1.100674 -2.461398 0.099427 0.124071 1.826573
11.833333 0.444169 -1.096635 -2.410545 0.103633 0.115216 1.436934
11.866667 0.447693 -1.092903 -2.388395 0.107817 0.106243 1.017177
11.900000 0.451364 -1.089481 -2.352520 0.111958 0.097174 0.585503
11.933333 0.455180 -1.086377 -2.347674 0.116040 0.088036 0.158381
11.966667 0.459139 -1.083593 -2.354309 0.120047 0.078857 -0.255787
12.000000 0.463241 -1.081136 -2.378606 0.123971 0.069658 -0.655946
12.033333 0.467453 -1.078955 -2.423399 0.127807 0.060453 -1.044580
12.066667 0.471805 -1.077111 -2.463000 0.131551 0.051254 -1.424293
12.100000 0.476296 -1.075606 -2.504819 0.135203 0.042071 -1.784935
12.133333 0.480892 -1.074382 -2.582301 0.138761 0.032915 -2.119430
12.166667 0.485593 -1.073438 -2.633113 0.142231 0.023779 -2.413841
12.200000 0.490396 -1.072778 -2.710455 0.145618 0.014658 -2.653794
12.233333 0.495299 -1.072400 -2.818050 0.148928 0.005545 -2.825895
12.266667 0.500336 -1.072371 -2.947194 0.152168 -0.003574 -2.915337
12.300000 0.505470 -1.072627 -3.109202 0.155351 -0.012726 -2.918171
12.333333 0.510734 -1.073235 3.020820 0.158491 -0.021938 -2.832179
12.366667 0.516091 -1.074127 2.893195 0.161594 -0.031224 -2.659593
12.400000 0.521538 -1.075306 2.789688 0.164658 -0.040585 -2.411715
12.433333 0.527074 -1.076770 2.734667 0.167685 -0.050024 -2.105780
12.466667 0.532696 -1.078520 2.653084 0.170675 -0.059543 -1.765532
12.500000 0.538435 -1.080628 2.604005 0.173621 -0.069125 -1.414633
12.533333 0.544288 -1.083095 2.579626 0.176514 -0.078750 -1.075967
12.566667 0.550221 -1.085846 2.568734 0.179349 -0.088406 -0.770821
12.600000 0.556263 -1.088956 2.588960 0.182124 -0.098090 -0.514099
12.633333 0.562412 -1.092424 2.591425 0.184836 -0.107794 -0.309257
12.666667 0.568666 -1.096250 2.590644 0.187472 -0.117488 -0.157104
12.700000 0.574988 -1.100358 2.595087 0.190025 -0.127156 -0.054031
12.733333 0.581378 -1.104748 2.590740 0.192496 -0.136803 0.005364
12.766667 0.587831 -1.109420 2.605143 0.194882 -0.146425 0.030046
12.800000 0.594377 -1.114447 2.601269 0.197183 -0.156019 0.033446
12.833333 0.601013 -1.119829 2.610394 0.199400 -0.165593 0.020235
12.866667 0.607705 -1.125488 2.620296 0.201546 -0.175175 -0.002551
12.900000 0.614480 -1.131500 2.616333 0.203624 -0.184773 -0.029789
12.933333 0.621338 -1.137864 2.603078 0.205629 -0.194375 -0.054703
12.966667 0.628241 -1.144501 2.606225 0.207557 -0.203970 -0.076277
13.000000 0.635188 -1.151406 2.601775 0.209403 -0.213546 -0.094988
13.033333 0.642206 -1.158660 2.601468 0.211159 -0.223086 -0.110809
13.066667 0.649292 -1.166258 2.578102 0.212816 -0.232562 -0.122902
13.100000 0.656441 -1.174198 2.581914 0.214371 -0.241971 -0.132483
13.133333 0.663652 -1.182479 2.573050 0.215822 -0.251313 -0.140206
13.166667 0.670920 -1.191097 2.570203 0.217167 -0.260575 -0.144563
13.200000 0.678211 -1.199969 2.579460 0.218401 -0.269752 -0.150679
13.233333 0.685522 -1.209093 2.569288 0.219522 -0.278837 -0.155734
13.266667 0.692877 -1.218544 2.565019 0.220527 -0.287820 -0.161708
13.300000 0.700274 -1.228320 2.552253 0.221408 -0.296675 -0.164961
13.333333 0.707680 -1.238337 2.565572 0.222159 -0.305380 -0.170826
13.366667 0.715119 -1.248671 2.540960 0.222776 -0.313925 -0.177280
13.400000 0.722586 -1.259317 2.530035 0.223255 -0.322286 -0.180120
13.433333 0.730076 -1.270269 2.511593 0.223588 -0.330438 -0.178433
13.466667 0.737585 -1.281524 2.531877 0.223770 -0.338369 -0.172127
13.500000 0.745086 -1.293001 2.525863 0.223801 -0.346083 -0.163607
13.533333 0.752596 -1.304770 2.514181 0.223681 -0.353577 -0.147014
13.566667 0.760090 -1.316752 2.501181 0.223410 -0.360860 -0.126976
13.600000 0.767564 -1.328945 2.498705 0.222993 -0.367952 -0.102918
13.633333 0.775014 -1.341343 2.491298 0.222438 -0.374879 -0.081354
13.666667 0.782437 -1.353942 2.489948 0.221751 -0.381660 -0.059522
13.700000 0.789828 -1.366737 2.499188 0.220936 -0.388302 -0.039682
13.733333 0.797198 -1.379784 2.479033 0.219998 -0.394818 -0.024401
13.766667 0.804543 -1.393077 2.490225 0.218938 -0.401202 -0.013685
13.800000 0.811855 -1.406607 2.502726 0.217754 -0.407439 -0.011399
13.833333 0.819130 -1.420367 2.500851 0.216443 -0.413508 -0.011974
13.866667 0.826355 -1.434300 2.500994 0.214997 -0.419388 -0.018904
13.900000 0.833532 -1.448446 2.503299 0.213412 -0.425057 -0.028076
13.933333 0.840655 -1.462798 2.510226 0.211679 -0.430496 -0.040929
13.966667 0.847716 -1.477307 2.486743 0.209793 -0.435697 -0.053510
14.000000 0.854711 -1.491967 2.501171 0.207750 -0.440660 -0.065806
14.033333 0.861636 -1.506772 2.486218 0.205547 -0.445393 -0.079870
14.066667 0.868488 -1.521718 2.473568 0.203182 -0.449902 -0.094308
14.100000 0.875257 -1.536825 2.481467 0.200652 -0.454195 -0.114686
14.133333 0.881937 -1.552085 2.475597 0.197955 -0.458277 -0.139559
14.166667 0.888533 -1.567469 2.478788 0.195091 -0.462149 -0.177075
14.200000 0.895029 -1.582986 2.476329 0.192058 -0.465808 -0.223380
14.233333 0.901420 -1.598627 2.475467 0.188860 -0.469246 -0.282153
14.266667 0.907701 -1.614385 2.468305 0.185505 -0.472454 -0.351616
14.300000 0.913865 -1.630248 2.470380 0.182000 -0.475428 -0.425716
14.333333 0.919908 -1.646208 2.438802 0.178357 -0.478164 -0.498233
14.366667 0.925823 -1.662253 2.425446 0.174595 -0.480668 -0.555851
14.400000 0.931605 -1.678374 2.408512 0.170726 -0.482941 -0.595254
14.433333 0.937248 -1.694560 2.367506 0.166759 -0.484985 -0.602899
14.466667 0.942746 -1.710799 2.343270 0.162704 -0.486807 -0.575747
14.500000 0.948096 -1.727085 2.303104 0.158568 -0.488411 -0.508958
14.533333 0.953323 -1.743432 2.273262 0.154348 -0.489793 -0.409743
14.566667 0.958422 -1.759834 2.226358 0.150037 -0.490945 -0.286663
14.600000 0.963360 -1.776252 2.234592 0.145632 -0.491868 -0.148555
14.633333 0.968165 -1.792714 2.214640 0.141130 -0.492564 -0.009537
14.666667 0.972833 -1.809215 2.235067 0.136524 -0.493026 0.116296
14.700000 0.977363 -1.825747 2.269222 0.131802 -0.493251 0.211381
14.733333 0.981713 -1.842257 2.283328 0.126965 -0.493240 0.271311
14.766667 0.985881 -1.858734 2.311169 0.122010 -0.492994 0.291751
14.800000 0.989900 -1.875227 2.358442 0.116931 -0.492505 0.271474
14.833333 0.993729 -1.891671 2.381244 0.111730 -0.491779 0.209643
14.866667 0.997362 -1.908059 2.387227 0.106412 -0.490820 0.120082
14.900000 1.000840 -1.924445 2.375980 0.100989 -0.489643 0.018790
14.933333 1.004158 -1.940826 2.367614 0.095465 -0.488255 -0.086197
14.966667 1.007270 -1.957126 2.362006 0.089849 -0.486665 -0.186459
15.000000 1.010219 -1.973409 2.340898 0.084150 -0.484887 -0.264935
15.033333 1.012953 -1.989595 2.312270 0.078366 -0.482915 -0.310781
15.066667 1.015472 -2.005676 2.293124 0.072499 -0.480750 -0.325245
15.100000 1.017770 -2.021646 2.292768 0.066543 -0.478382 -0.312425
15.133333 1.019897 -2.037578 2.261058 0.060499 -0.475808 -0.270957
15.166667 1.021848 -2.053469 2.233662 0.054365 -0.473027 -0.202541
15.200000 1.023573 -2.069229 2.250969 0.048140 -0.470036 -0.123561
15.233333 1.025120 -2.084938 2.243153 0.041823 -0.466831 -0.040571
15.266667 1.026435 -2.100503 2.228905 0.035417 -0.463419 0.038956
15.300000 1.027517 -2.115919 2.232287 0.028930 -0.459813 0.112016
15.333333 1.028416 -2.131271 2.274528 0.022374 -0.456036 0.167160
15.366667 1.029078 -2.146464 2.261311 0.015765 -0.452116 0.202159
15.400000 1.029501 -2.161494 2.291363 0.009120 -0.448084 0.218975
15.433333 1.029684 -2.176356 2.311467 0.002468 -0.443990 0.216818
15.466667 1.029625 -2.191045 2.317631 -0.004165 -0.439878 0.201933
15.500000 1.029377 -2.205651 2.316000 -0.010763 -0.435774 0.177003
15.533333 1.028883 -2.220078 2.342372 -0.017309 -0.431707 0.153302
15.566667 1.028145 -2.234323 2.336936 -0.023798 -0.427688 0.132043
15.600000 1.027213 -2.248473 2.320095 -0.030220 -0.423729 0.119098
15.633333 1.026088 -2.262525 2.324895 -0.036582 -0.419818 0.118129
15.666667 1.024769 -2.276476 2.311395 -0.042895 -0.415935 0.127910
15.700000 1.023255 -2.290323 2.313974 -0.049165 -0.412069 0.146668
15.733333 1.021491 -2.303976 2.322327 -0.055408 -0.408193 0.170923
15.766667 1.019532 -2.317518 2.322327 -0.061639 -0.404280 0.196941
15.800000 1.017376 -2.330947 2.349035 -0.067874 -0.400303 0.221593
15.833333 1.015024 -2.344258 2.361982 -0.074126 -0.396244 0.240085
15.866667 1.012475 -2.357451 2.374274 -0.080400 -0.392091 0.251430
15.900000 1.009673 -2.370441 2.389224 -0.086705 -0.387835 0.254325
15.933333 1.006674 -2.383307 2.390399 -0.093044 -0.383471 0.251275
15.966667 1.003478 -2.396045 2.396547 -0.099408 -0.379007 0.247226
16.000000 1.000085 -2.408652 2.411997 -0.105797 -0.374446 0.241083
16.033333 0.996495 -2.421127 2.421064 -0.112208 -0.369790 0.239709
16.066667 0.992650 -2.433394 2.415228 -0.118640 -0.365046 0.240917
16.100000 0.988551 -2.445452 2.395397 -0.125085 -0.360218 0.250996
16.133333 0.984255 -2.457371 2.442283 -0.131538 -0.355318 0.263329
16.166667 0.979764 -2.469147 2.420506 -0.137995 -0.350347 0.277381
16.200000 0.975078 -2.480779 2.458312 -0.144445 -0.345320 0.290133
16.233333 0.970137 -2.492200 2.456021 -0.150871 -0.340254 0.296497
16.266667 0.965002 -2.503472 2.472959 -0.157254 -0.335168 0.297319
16.300000 0.959674 -2.514594 2.478403 -0.163591 -0.330061 0.285902
16.333333 0.954092 -2.525502 2.503073 -0.169874 -0.324941 0.264577
16.366667 0.948318 -2.536257 2.523676 -0.176102 -0.319811 0.228604
16.400000 0.942290 -2.546797 2.513696 -0.182273 -0.314673 0.182370
16.433333 0.936074 -2.557180 2.528357 -0.188398 -0.309514 0.124640
16.466667 0.929669 -2.567404 2.541537 -0.194498 -0.304319 0.057209
16.500000 0.923077 -2.577470 2.531790 -0.200579 -0.299083 -0.017993
16.533333 0.916300 -2.587374 2.531614 -0.206662 -0.293791 -0.092927
16.566667 0.909339 -2.597115 2.526055 -0.212757 -0.288433 -0.161668
16.600000 0.902195 -2.606693 2.519361 -0.218888 -0.282987 -0.220935
16.633333 0.894803 -2.616054 2.530652 -0.225057 -0.277453 -0.269272
16.666667 0.887231 -2.625249 2.500134 -0.231254 -0.271835 -0.311941
16.700000 0.879415 -2.634227 2.488599 -0.237465 -0.266143 -0.349402
16.733333 0.871423 -2.643038 2.446102 -0.243674 -0.260388 -0.389699
16.766667 0.863192 -2.651631 2.427849 -0.249859 -0.254587 -0.434484
16.800000 0.854725 -2.660008 2.419477 -0.255988 -0.248763 -0.489531
16.833333 0.846026 -2.668170 2.410061 -0.262041 -0.242933 -0.551701
16.866667 0.837158 -2.676161 2.429707 -0.268005 -0.237105 -0.613237
16.900000 0.828064 -2.683937 2.418927 -0.273874 -0.231285 -0.674923
16.933333 0.818806 -2.691541 2.424562 -0.279634 -0.225483 -0.739540
16.966667 0.809387 -2.698972 2.390767 -0.285279 -0.219703 -0.805998
17.000000 0.799809 -2.706231 2.277635 -0.290820 -0.213937 -0.864676
17.033333 0.790020 -2.713278 2.255375 -0.296264 -0.208178 -0.913803
17.066667 0.780026 -2.720115 2.211202 -0.301613 -0.202425 -0.949015
17.100000 0.769830 -2.726742 2.194807 -0.306865 -0.196680 -0.965909
17.133333 0.759485 -2.733196 2.174338 -0.312022 -0.190940 -0.951698
17.166667 0.748995 -2.739477 2.145317 -0.317082 -0.185208 -0.907611
17.200000 0.738320 -2.745554 2.114376 -0.322030 -0.179493 -0.843560
17.233333 0.727463 -2.751427 2.072417 -0.326853 -0.173804 -0.759484
17.266667 0.716470 -2.757127 2.021483 -0.331544 -0.168147 -0.658238
17.300000 0.705306 -2.762628 2.009733 -0.336103 -0.162521 -0.540406
17.333333 0.693979 -2.767930 1.975500 -0.340525 -0.156930 -0.416989
17.366667 0.682524 -2.773061 1.980400 -0.344805 -0.151378 -0.293536
17.400000 0.670917 -2.777997 1.970010 -0.348942 -0.145869 -0.174378
17.433333 0.659189 -2.782762 1.954829 -0.352933 -0.140403 -0.074970
17.466667 0.647344 -2.787357 1.976333 -0.356778 -0.134983 -0.016822
17.500000 0.635362 -2.791761 1.974810 -0.360471 -0.129609 -0.011284
17.533333 0.623247 -2.795977 1.994813 -0.364014 -0.124276 -0.070903
17.566667 0.611006 -2.800005 2.027508 -0.367409 -0.118980 -0.205413
17.600000 0.598662 -2.803865 2.060472 -0.370660 -0.113712 -0.426144
17.633333 0.586218 -2.807559 2.075315 -0.373765 -0.108467 -0.739107
17.666667 0.573677 -2.811086 2.049590 -0.376725 -0.103241 -1.132247
17.700000 0.561044 -2.814448 2.020861 -0.379538 -0.098033 -1.603093
17.733333 0.548323 -2.817646 1.981466 -0.382205 -0.092843 -2.132988
17.766667 0.535509 -2.820662 1.902996 -0.384727 -0.087674 -2.698434
17.800000 0.522610 -2.823497 1.800379 -0.387101 -0.082528 -3.265614
17.833333 0.509633 -2.826152 1.714625 -0.389324 -0.077415 -3.804896
17.866667 0.496582 -2.828630 1.559128 -0.391397 -0.072342 -4.290532
17.900000 0.483465 -2.830932 1.380240 -0.393317 -0.067320 -4.698776
17.933333 0.470281 -2.833077 1.168291 -0.395080 -0.062360 -5.008260
17.966667 0.457046 -2.835052 0.909776 -0.396680 -0.057475 -5.197737
18.000000 0.443768 -2.836861 0.696578 -0.398121 -0.052673 -5.252361
18.033333 0.430435 -2.838516 0.502420 -0.399405 -0.047960 -5.152606
18.066667 0.417050 -2.840018 0.327439 -0.400531 -0.043342 -4.894461
18.100000 0.403642 -2.841366 0.141371 -0.401498 -0.038822 -4.466487
18.133333 0.390217 -2.842565 -0.016242 -0.402309 -0.034406 -3.876915
18.166667 0.376780 -2.843619 -0.229848 -0.402966 -0.030098 -3.137502
18.200000 0.363307 -2.844526 -0.327185 -0.403469 -0.025900 -2.284616
18.233333 0.349800 -2.845287 -0.467754 -0.403815 -0.021817 -1.340519
18.266667 0.336297 -2.845917 -0.518960 -0.404012 -0.017849 -0.338813
18.300000 0.322801 -2.846422 -0.526122 -0.404067 -0.013994 0.678407
18.333333 0.309284 -2.846785 -0.426246 -0.403986 -0.010246 1.674645
18.366667 0.295781 -2.847032 -0.368440 -0.403779 -0.006593 2.601452
18.400000 0.282297 -2.847167 -0.191493 -0.403458 -0.003024 3.450285
18.433333 0.268835 -2.847194 0.001772 -0.403043 0.000482 4.178976
18.466667 0.255399 -2.847118 0.202452 -0.402546 0.003942 4.776035
18.500000 0.241994 -2.846942 0.458078 -0.401985 0.007378 5.229945
18.533333 0.228588 -2.846634 0.605460 -0.401373 0.010808 5.552903
18.566667 0.215222 -2.846232 0.829548 -0.400722 0.014243 5.759827
18.600000 0.201862 -2.845700 1.020779 -0.400033 0.017690 5.853019
18.633333 0.188552 -2.845080 1.228854 -0.399302 0.021149 5.857618
18.666667 0.175254 -2.844331 1.446603 -0.398518 0.024610 5.781571
18.700000 0.161972 -2.843456 1.610137 -0.397663 0.028058 5.643145
18.733333 0.148710 -2.842455 1.860934 -0.396726 0.031483 5.426752
18.766667 0.135470 -2.841331 2.025536 -0.395690 0.034866 5.133334
18.800000 0.122256 -2.840083 2.221283 -0.394545 0.038199 4.754315
18.833333 0.109072 -2.838715 2.389832 -0.393280 0.041469 4.284530
18.866667 0.095953 -2.837259 2.561031 -0.391895 0.044675 3.715741
18.900000 0.082869 -2.835684 2.706376 -0.390391 0.047819 3.037112
18.933333 0.069854 -2.834023 2.828203 -0.388765 0.050897 2.273461
18.966667 0.056912 -2.832277 2.915964 -0.387025 0.053916 1.436441
19.000000 0.044043 -2.830446 2.976774 -0.385173 0.056880 0.557088
19.033333 0.031223 -2.828501 2.970122 -0.383219 0.059797 -0.337075
19.066667 0.018453 -2.826443 2.963619 -0.381164 0.062671 -1.195252
19.100000 0.005766 -2.824303 2.876327 -0.379016 0.065505 -1.965880
19.133333 -0.006865 -2.822053 2.756479 -0.376778 0.068304 -2.621332
19.166667 -0.019408 -2.819720 2.651102 -0.374455 0.071068 -3.127305
19.200000 -0.031888 -2.817280 2.414505 -0.372047 0.073798 -3.457363
19.233333 -0.044276 -2.814759 2.176497 -0.369556 0.076491 -3.593362
19.266667 -0.056567 -2.812159 2.057751 -0.366988 0.079151 -3.548485
19.300000 -0.068761 -2.809481 1.860281 -0.364350 0.081782 -3.335238
19.333333 -0.080855 -2.806725 1.731747 -0.361653 0.084395 -2.973799
19.366667 -0.092873 -2.803867 1.627836 -0.358903 0.086993 -2.487659
19.400000 -0.104814 -2.800906 1.572212 -0.356110 0.089585 -1.918731
19.433333 -0.116649 -2.797873 1.507188 -0.353280 0.092177 -1.311188
19.466667 -0.128376 -2.794768 1.494996 -0.350415 0.094769 -0.684313
19.500000 -0.140019 -2.791564 1.482693 -0.347512 0.097359 -0.076737
19.533333 -0.151550 -2.788291 1.500227 -0.344560 0.099934 0.486616
19.566667 -0.162991 -2.784922 1.559372 -0.341558 0.102491 0.979489
19.600000 -0.174340 -2.781457 1.591974 -0.338496 0.105022 1.389308
19.633333 -0.185595 -2.777896 1.672318 -0.335369 0.107520 1.706859
19.666667 -0.196753 -2.774241 1.757551 -0.332171 0.109980 1.915865
19.700000 -0.207789 -2.770525 1.843104 -0.328899 0.112399 2.018377
19.733333 -0.218725 -2.766715 1.982131 -0.325554 0.114778 2.015300
19.766667 -0.229534 -2.762846 2.078620 -0.322130 0.117115 1.917876
19.800000 -0.240239 -2.758885 2.186825 -0.318628 0.119410 1.734236
19.833333 -0.250814 -2.754863 2.244317 -0.315048 0.121667 1.486410
19.866667 -0.261259 -2.750781 2.282638 -0.311390 0.123889 1.198370
19.900000 -0.271593 -2.746610 2.312567 -0.307653 0.126076 0.893219
19.933333 -0.281792 -2.742379 2.329440 -0.303838 0.128234 0.599405
19.966667 -0.291876 -2.738060 2.325091 -0.299951 0.130367 0.336170
20.000000 -0.301844 -2.733653 2.304438 -0.295993 0.132479 0.127485
20.033333 -0.311670 -2.729187 2.276395 -0.291967 0.134572 -0.019299
20.066667 -0.321350 -2.724663 2.254074 -0.287879 0.136649 -0.103466
20.100000 -0.330883 -2.720079 2.237582 -0.283740 0.138720 -0.130768
20.133333 -0.340294 -2.715410 2.217254 -0.279556 0.140788 -0.111829
20.166667 -0.349551 -2.710684 2.208181 -0.275332 0.142855 -0.060736
20.200000 -0.358652 -2.705900 2.202027 -0.271075 0.144927 0.004210
20.233333 -0.367596 -2.701060 2.212195 -0.266795 0.147010 0.070153
20.266667 -0.376412 -2.696136 2.226949 -0.262494 0.149104 0.127475
20.300000 -0.385098 -2.691130 2.256776 -0.258173 0.151207 0.171482
20.333333 -0.393652 -2.686041 2.282425 -0.253831 0.153317 0.194808
20.366667 -0.402045 -2.680896 2.294163 -0.249468 0.155431 0.196900
20.400000 -0.410305 -2.675669 2.297377 -0.245078 0.157542 0.180810
20.433333 -0.418402 -2.670385 2.285914 -0.240658 0.159645 0.152695
20.466667 -0.426364 -2.665020 2.295231 -0.236204 0.161735 0.117332
20.500000 -0.434163 -2.659597 2.298436 -0.231717 0.163813 0.079765
20.533333 -0.441826 -2.654094 2.293808 -0.227203 0.165882 0.046685
20.566667 -0.449325 -2.648532 2.295824 -0.222668 0.167947 0.021836
20.600000 -0.456686 -2.642889 2.290719 -0.218119 0.170014 0.006516
20.633333 -0.463885 -2.637187 2.294043 -0.213561 0.172086 -0.002754
20.666667 -0.470921 -2.631425 2.292679 -0.209004 0.174172 -0.005915
20.700000 -0.477795 -2.625603 2.288186 -0.204453 0.176275 -0.005705
20.733333 -0.484527 -2.619701 2.284774 -0.199911 0.178397 -0.004260
20.766667 -0.491117 -2.613719 2.291096 -0.195379 0.180541 -0.002576
20.800000 -0.497546 -2.607676 2.292494 -0.190861 0.182707 -0.001635
20.833333 -0.503831 -2.601553 2.298198 -0.186360 0.184898 -0.001614
20.866667 -0.509972 -2.595351 2.290179 -0.181871 0.187108 -0.002533
20.900000 -0.515953 -2.589085 2.292371 -0.177392 0.189337 -0.003190
20.933333 -0.521789 -2.582741 2.288100 -0.172922 0.191581 -0.002869
20.966667 -0.527480 -2.576317 2.293368 -0.168459 0.193838 -0.003149
21.000000 -0.533026 -2.569816 2.296752 -0.164000 0.196105 -0.003945
21.033333 -0.538412 -2.563247 2.290881 -0.159543 0.198378 -0.001324
21.066667 -0.543653 -2.556599 2.282094 -0.155090 0.200659 0.003999
21.100000 -0.548749 -2.549874 2.293043 -0.150639 0.202946 0.008008
21.133333 -0.553698 -2.543070 2.290927 -0.146190 0.205238 0.010263
21.166667 -0.558500 -2.536188 2.280640 -0.141741 0.207534 0.013277
21.200000 -0.563147 -2.529235 2.289773 -0.137292 0.209835 0.017560
21.233333 -0.567646 -2.522204 2.301148 -0.132842 0.212138 0.018067
21.266667 -0.572000 -2.515096 2.298105 -0.128389 0.214444 0.012902
21.300000 -0.576207 -2.507909 2.293497 -0.123932 0.216753 0.008347
21.333333 -0.580267 -2.500645 2.290043 -0.119473 0.219065 0.004491
21.366667 -0.584182 -2.493303 2.297451 -0.115013 0.221380 -0.001215
21.400000 -0.587943 -2.485886 2.309624 -0.110553 0.223699 -0.009452
21.433333 -0.591551 -2.478392 2.292143 -0.106095 0.226022 -0.015143
21.466667 -0.595013 -2.470822 2.292557 -0.101643 0.228349 -0.016338
21.500000 -0.598323 -2.463173 2.288067 -0.097198 0.230682 -0.016672
21.533333 -0.601483 -2.455446 2.293140 -0.092763 0.233022 -0.018216
21.566667 -0.604497 -2.447641 2.286547 -0.088341 0.235370 -0.016728
21.600000 -0.607362 -2.439757 2.285495 -0.083934 0.237728 -0.011867
21.633333 -0.610082 -2.431796 2.290248 -0.079544 0.240097 -0.007508
21.666667 -0.612658 -2.423758 2.291685 -0.075172 0.242478 -0.004418
21.700000 -0.615087 -2.415637 2.289983 -0.070818 0.244871 -0.002003
21.733333 -0.617372 -2.407441 2.292696 -0.066482 0.247273 0.002100
21.766667 -0.619512 -2.399160 2.286913 -0.062165 0.249684 0.003442
21.800000 -0.621509 -2.390803 2.293759 -0.057867 0.252100 0.002733
21.833333 -0.623362 -2.382361 2.292813 -0.053589 0.254518 0.001672
21.866667 -0.625071 -2.373832 2.280264 -0.049331 0.256933 0.001766
21.900000 -0.626640 -2.365228 2.300577 -0.045094 0.259343 0.000321
21.933333 -0.628066 -2.356536 2.288731 -0.040879 0.261749 -0.001682
21.966667 -0.629354 -2.347769 2.288388 -0.036686 0.264154 -0.002956
22.000000 -0.630501 -2.338913 2.291454 -0.032518 0.266563 -0.003433
22.033333 -0.631510 -2.329983 2.294634 -0.028372 0.268981 -0.003944
22.066667 -0.632381 -2.320979 2.285540 -0.024251 0.271420 -0.006451
22.100000 -0.633116 -2.311902 2.289329 -0.020154 0.273886 -0.005831
22.133333 -0.633714 -2.302752 2.292543 -0.016081 0.276383 -0.005004
22.166667 -0.634177 -2.293509 2.290093 -0.012033 0.278911 -0.003578
22.200000 -0.634506 -2.284194 2.292461 -0.008009 0.281468 -0.002882
22.233333 -0.634700 -2.274785 2.286664 -0.004010 0.284047 -0.001838
22.266667 -0.634761 -2.265281 2.280601 -0.000038 0.286639 0.001035
22.300000 -0.634690 -2.255682 2.287932 0.003908 0.289230 0.001723
22.333333 -0.634488 -2.245986 2.295360 0.007827 0.291812 0.003038
22.366667 -0.634155 -2.236194 2.290634 0.011718 0.294378 0.004234
22.400000 -0.633693 -2.226304 2.286227 0.015580 0.296915 0.006247
22.433333 -0.633103 -2.216347 2.294366 0.019413 0.299416 0.008788
22.466667 -0.632385 -2.206322 2.285933 0.023217 0.301877 0.014189
22.500000 -0.631541 -2.196230 2.293949 0.026990 0.304300 0.027286
22.533333 -0.630572 -2.186040 2.292726 0.030733 0.306680 0.048564
22.566667 -0.629478 -2.175785 2.285559 0.034445 0.309016 0.080749
22.600000 -0.628261 -2.165430 2.291734 0.038125 0.311317 0.125065
22.633333 -0.626922 -2.155011 2.285687 0.041773 0.313587 0.184706
22.666667 -0.625461 -2.144493 2.297808 0.045390 0.315823 0.252788
22.700000 -0.623880 -2.133912 2.297369 0.048973 0.318023 0.323928
22.733333 -0.622181 -2.123271 2.292654 0.052524 0.320196 0.393153
22.766667 -0.620364 -2.112571 2.302482 0.056044 0.322353 0.447784
22.800000 -0.618429 -2.101769 2.341843 0.059531 0.324496 0.477219
22.833333 -0.616379 -2.090910 2.376766 0.062986 0.326628 0.466652
22.866667 -0.614215 -2.079994 2.402415 0.066409 0.328762 0.411504
22.900000 -0.611938 -2.069023 2.426041 0.069800 0.330906 0.308735
22.933333 -0.609548 -2.057951 2.449903 0.073158 0.333055 0.157171
22.966667 -0.607047 -2.046825 2.486928 0.076483 0.335193 -0.027692
23.000000 -0.604437 -2.035648 2.499791 0.079772 0.337316 -0.230683
23.033333 -0.601715 -2.024372 2.501932 0.083024 0.339412 -0.431694
23.066667 -0.598884 -2.012998 2.486611 0.086239 0.341467 -0.612103
23.100000 -0.595944 -2.001526 2.401585 0.089414 0.343461 -0.754382
23.133333 -0.592899 -1.990007 2.349404 0.092547 0.345386 -0.843682
23.166667 -0.589753 -1.978444 2.291098 0.095638 0.347240 -0.876874
23.200000 -0.586505 -1.966836 2.215513 0.098686 0.349017 -0.850253
23.233333 -0.583153 -1.955137 2.180881 0.101691 0.350717 -0.768431
23.266667 -0.579703 -1.943396 2.142607 0.104651 0.352336 -0.638793
23.300000 -0.576156 -1.931616 2.145052 0.107567 0.353887 -0.480354
23.333333 -0.572513 -1.919799 2.139204 0.110438 0.355371 -0.307712
23.366667 -0.568777 -1.907946 2.153121 0.113265 0.356790 -0.134684
23.400000 -0.564944 -1.896010 2.158045 0.116046 0.358146 0.019618
23.433333 -0.561019 -1.884041 2.164257 0.118782 0.359443 0.146708
23.466667 -0.557002 -1.871995 2.176612 0.121474 0.360684 0.237434
23.500000 -0.552896 -1.859920 2.181533 0.124120 0.361866 0.297707
23.533333 -0.548704 -1.847818 2.204537 0.126719 0.362983 0.327830
23.566667 -0.544426 -1.835689 2.231333 0.129272 0.364032 0.331409
23.600000 -0.540066 -1.823537 2.246175 0.131778 0.365010 0.320230
23.633333 -0.535623 -1.811362 2.261172 0.134236 0.365911 0.298796
23.666667 -0.531097 -1.799131 2.271346 0.136645 0.366736 0.275721
23.700000 -0.526492 -1.786881 2.280511 0.139005 0.367484 0.252977
23.733333 -0.521806 -1.774583 2.271960 0.141317 0.368158 0.242425
23.766667 -0.517044 -1.762270 2.287424 0.143581 0.368758 0.249298
23.800000 -0.512209 -1.749944 2.275957 0.145796 0.369286 0.271358
23.833333 -0.507301 -1.737608 2.285655 0.147964 0.369744 0.307322
23.866667 -0.502322 -1.725262 2.279812 0.150085 0.370135 0.358067
23.900000 -0.497274 -1.712908 2.277162 0.152161 0.370459 0.420178
23.933333 -0.492159 -1.700550 2.307877 0.154192 0.370723 0.477840
23.966667 -0.486977 -1.688188 2.333990 0.156179 0.370934 0.524499
24.000000 -0.481728 -1.675805 2.346769 0.158124 0.371092 0.559766
24.033333 -0.476417 -1.663424 2.376621 0.160026 0.371198 0.586348
24.066667 -0.471044 -1.651044 2.436669 0.161884 0.371251 0.597355
24.100000 -0.465608 -1.638655 2.460788 0.163697 0.371250 0.599538
24.133333 -0.460109 -1.626261 2.467692 0.165466 0.371187 0.604936
24.166667 -0.454550 -1.613865 2.474973 0.167186 0.371054 0.622685
24.200000 -0.448937 -1.601479 2.508679 0.168856 0.370850 0.651772
24.233333 -0.443271 -1.589106 2.501665 0.170477 0.370571 0.692151
24.266667 -0.437550 -1.576740 2.508621 0.172044 0.370213 0.749871
24.300000 -0.431775 -1.564387 2.502855 0.173558 0.369774 0.821349
24.333333 -0.425953 -1.552052 2.531840 0.175017 0.369254 0.903532
24.366667 -0.420082 -1.539735 2.578218 0.176422 0.368657 0.992320
24.400000 -0.414165 -1.527438 2.632079 0.177771 0.367982 1.091275
24.433333 -0.408205 -1.515166 2.707788 0.179065 0.367233 1.194938
24.466667 -0.402202 -1.502921 2.743058 0.180303 0.366412 1.301748
24.500000 -0.396160 -1.490704 2.787548 0.181487 0.365524 1.403467
24.533333 -0.390079 -1.478520 2.823137 0.182616 0.364569 1.494237
24.566667 -0.383960 -1.466371 2.851058 0.183690 0.363552 1.564882
24.600000 -0.377806 -1.454259 2.878658 0.184711 0.362474 1.607483
24.633333 -0.371619 -1.442184 2.937447 0.185681 0.361338 1.619717
24.666667 -0.365403 -1.430147 3.010287 0.186598 0.360145 1.591925
24.700000 -0.359158 -1.418151 3.113770 0.187465 0.358897 1.524755
24.733333 -0.352885 -1.406197 -3.085263 0.188282 0.357593 1.416898
24.766667 -0.346583 -1.394285 -3.021701 0.189049 0.356235 1.275841
24.800000 -0.340258 -1.382420 -2.957704 0.189765 0.354819 1.106974
24.833333 -0.333910 -1.370604 -2.934554 0.190430 0.353345 0.926520
24.866667 -0.327543 -1.358837 -2.909902 0.191044 0.351811 0.752730
24.900000 -0.321152 -1.347122 -2.915105 0.191605 0.350216 0.602890
24.933333 -0.314741 -1.335460 -2.923820 0.192112 0.348560 0.491552
24.966667 -0.308315 -1.323855 -2.952142 0.192564 0.346843 0.424636
25.000000 -0.301876 -1.312307 -2.958411 0.192962 0.345064 0.404229
25.033333 -0.295425 -1.300818 -2.954372 0.193304 0.343224 0.415966
25.066667 -0.288963 -1.289395 -2.951659 0.193589 0.341321 0.445541
25.100000 -0.282493 -1.278036 -2.921619 0.193817 0.339355 0.473724
25.133333 -0.276017 -1.266748 -2.895837 0.193990 0.337325 0.484341
25.166667 -0.269536 -1.255526 -2.840116 0.194106 0.335228 0.461207
25.200000 -0.263052 -1.244373 -2.783369 0.194167 0.333063 0.396381
25.233333 -0.256566 -1.233290 -2.758709 0.194173 0.330829 0.292376
25.266667 -0.250080 -1.222279 -2.744727 0.194123 0.328523 0.154555
25.300000 -0.243597 -1.211341 -2.735937 0.194017 0.326138 -0.002508
25.333333 -0.237119 -1.200492 -2.757281 0.193855 0.323672 -0.163757
25.366667 -0.230650 -1.189736 -2.773355 0.193635 0.321121 -0.309135
25.400000 -0.224187 -1.179057 -2.799031 0.193356 0.318482 -0.421930
25.433333 -0.217733 -1.168459 -2.840579 0.193016 0.315751 -0.491997
25.466667 -0.211291 -1.157960 -2.882038 0.192615 0.312926 -0.511099
25.500000 -0.204861 -1.147544 -2.912811 0.192149 0.310010 -0.479731
25.533333 -0.198448 -1.137233 -2.943276 0.191618 0.307001 -0.401246
25.566667 -0.192054 -1.127031 -2.961265 0.191019 0.303900 -0.283339
25.600000 -0.185682 -1.116939 -2.971786 0.190353 0.300712 -0.141559
25.633333 -0.179335 -1.106960 -2.961166 0.189622 0.297449 0.006988
25.666667 -0.173007 -1.097072 -2.959004 0.188827 0.294119 0.146029
25.700000 -0.166708 -1.087302 -2.944499 0.187973 0.290732 0.260389
25.733333 -0.160442 -1.077655 -2.928983 0.187060 0.287298 0.336398
25.766667 -0.154211 -1.068131 -2.913969 0.186092 0.283824 0.364331
25.800000 -0.148017 -1.058733 -2.877197 0.185069 0.280313 0.347586
25.833333 -0.141864 -1.049464 -2.838667 0.183991 0.276764 0.294122
25.866667 -0.135738 -1.040291 -2.795126 0.182857 0.273177 0.207934
25.900000 -0.129657 -1.031252 -2.757786 0.181668 0.269552 0.099685
25.933333 -0.123605 -1.022311 -2.785313 0.180426 0.265889 -0.014090
25.966667 -0.117585 -1.013469 -2.824187 0.179128 0.262185 -0.120445
26.000000 -0.111615 -1.004764 -2.836336 0.177777 0.258441 -0.214462
26.033333 -0.105697 -0.996197 -2.867151 0.176370 0.254654 -0.289979
26.066667 -0.099833 -0.987768 -2.891178 0.174911 0.250830 -0.338399
26.100000 -0.094023 -0.979476 -2.912776 0.173401 0.246970 -0.355687
26.133333 -0.088268 -0.971323 -2.910435 0.171845 0.243083 -0.354817
26.166667 -0.082551 -0.963272 -2.931954 0.170249 0.239180 -0.343457
26.200000 -0.076891 -0.955357 -2.947306 0.168619 0.235274 -0.325482
26.233333 -0.071289 -0.947579 -2.941969 0.166964 0.231381 -0.308373
26.266667 -0.065746 -0.939936 -2.924169 0.165290 0.227509 -0.298732
26.300000 -0.060263 -0.932427 -2.936242 0.163602 0.223666 -0.304244
26.333333 -0.054841 -0.925052 -2.941215 0.161904 0.219856 -0.317077
26.366667 -0.049480 -0.917809 -2.968710 0.160199 0.216084 -0.332566
26.400000 -0.044163 -0.910670 -2.993052 0.158490 0.212351 -0.348471
26.433333 -0.038907 -0.903661 -2.984898 0.156776 0.208654 -0.361108
26.466667 -0.033713 -0.896782 -3.008047 0.155057 0.204991 -0.364154
26.500000 -0.028582 -0.890031 -3.031383 0.153333 0.201361 -0.352643
26.533333 -0.023497 -0.883384 -3.044455 0.151605 0.197763 -0.326653
26.566667 -0.018459 -0.876839 -3.062182 0.149867 0.194189 -0.288397
26.600000 -0.013484 -0.870420 -3.065359 0.148122 0.190641 -0.239326
26.633333 -0.008571 -0.864125 -3.078135 0.146371 0.187120 -0.176672
26.666667 -0.003720 -0.857953 -3.085441 0.144615 0.183628 -0.105738
26.700000 0.001069 -0.851902 -3.087386 0.142856 0.180167 -0.027203
26.733333 0.005795 -0.845973 -3.087454 0.141097 0.176743 0.056361
26.766667 0.010471 -0.840144 -3.084551 0.139343 0.173362 0.142921
26.800000 0.015084 -0.834434 -3.073463 0.137597 0.170029 0.231931
26.833333 0.019633 -0.828842 -3.068366 0.135860 0.166747 0.313764
26.866667 0.024131 -0.823349 -3.061551 0.134134 0.163516 0.383914
26.900000 0.028565 -0.817971 -3.052912 0.132417 0.160336 0.432591
26.933333 0.032947 -0.812692 -3.027225 0.130710 0.157204 0.456536
26.966667 0.037277 -0.807510 -2.994243 0.129010 0.154118 0.450154
27.000000 0.041555 -0.802424 -2.975713 0.127314 0.151073 0.406501
27.033333 0.045768 -0.797449 -2.928248 0.125620 0.148065 0.324794
27.066667 0.049929 -0.792569 -2.917073 0.123930 0.145096 0.209230
27.100000 0.054036 -0.787784 -2.911377 0.122240 0.142161 0.066835
27.133333 0.058080 -0.783104 -2.873399 0.120551 0.139262 -0.102034
27.166667 0.062071 -0.778517 -2.887056 0.118862 0.136397 -0.284559
27.200000 0.066000 -0.774032 -2.916875 0.117175 0.133570 -0.464659
27.233333 0.069875 -0.769638 -2.955325 0.115490 0.130782 -0.623657
27.266667 0.073696 -0.765335 -2.966152 0.113806 0.128034 -0.753098
27.300000 0.077463 -0.761120 -3.021093 0.112126 0.125329 -0.838062
27.333333 0.081172 -0.756997 -3.060971 0.110449 0.122670 -0.862388
27.366667 0.084827 -0.752962 -3.106166 0.108776 0.120057 -0.823100
27.400000 0.088426 -0.749012 3.139448 0.107107 0.117492 -0.727361
27.433333 0.091965 -0.745150 3.085874 0.105442 0.114975 -0.587240
27.466667 0.095450 -0.741372 3.043866 0.103784 0.112506 -0.410583
27.500000 0.098882 -0.737678 3.005387 0.102131 0.110087 -0.217641
27.533333 0.102257 -0.734061 3.024822 0.100487 0.107722 -0.028137
