t x y theta dxdt dydt dthetadt
0.000000 0.000000 0.000000 0.331016 -0.088353 0.011986 -0.007367
0.033333 -0.002611 0.000342 0.328182 -0.090087 0.014849 -0.006155
0.066667 -0.005306 0.000939 0.328166 -0.091143 0.018701 -0.004853
0.100000 -0.008069 0.001518 0.317741 -0.091232 0.023821 -0.002106
0.133333 -0.012300 0.001800 0.330290 -0.089342 0.031174 -0.000051
0.166667 -0.016126 0.002531 0.333393 -0.084492 0.041682 0.000055
0.200000 -0.019204 0.003867 0.329253 -0.074428 0.057456 0.001807
0.233333 -0.022344 0.005182 0.331872 -0.056777 0.080683 0.002996
0.266667 -0.025542 0.006477 0.325867 -0.025456 0.116807 0.004413
0.300000 -0.028801 0.007747 0.330056 0.026872 0.172369 0.009002
0.333333 -0.030923 0.010664 0.322117 0.087231 0.235433 0.015152
0.366667 -0.033102 0.013548 0.327753 0.148908 0.299747 0.021956
0.400000 -0.032652 0.019784 0.329852 0.201921 0.355952 0.027605
0.433333 -0.032238 0.025977 0.329154 0.238536 0.396875 0.034532
0.466667 -0.024521 0.039816 0.326006 0.243911 0.408949 0.039974
0.500000 -0.016812 0.053576 0.332596 0.200686 0.376424 0.034932
0.533333 0.010537 0.085797 0.333133 0.128301 0.316976 0.027423
0.566667 0.037953 0.117860 0.326402 0.033779 0.237057 0.020505
0.600000 0.114414 0.194594 0.336858 -0.077925 0.141419 0.012732
0.633333 0.205963 0.284404 0.395241 -0.207710 0.029337 -0.001889
0.666667 0.072405 0.170037 0.328322 -0.335310 -0.080765 -0.015192
0.700000 0.013106 0.122791 0.327307 -0.445385 -0.174974 -0.021893
0.733333 -0.046230 0.075671 0.332636 -0.538093 -0.253293 -0.026161
0.766667 -0.077918 0.054752 0.333992 -0.609630 -0.312199 -0.032321
0.800000 -0.092140 0.051011 0.328480 -0.649751 -0.342375 -0.036814
0.833333 -0.106331 0.047247 0.325742 -0.643389 -0.330137 -0.029431
0.866667 -0.120487 0.043458 0.320216 -0.612148 -0.295031 -0.022801
0.900000 -0.134604 0.039643 0.333411 -0.565259 -0.245408 -0.017366
0.933333 -0.148662 0.035807 0.328282 -0.513756 -0.191472 -0.012416
0.966667 -0.162656 0.031951 0.328213 -0.464267 -0.139340 -0.005237
1.000000 -0.176575 0.028075 0.338086 -0.424497 -0.096073 0.000421
1.033333 -0.190403 0.024186 0.327643 -0.403522 -0.069893 0.000273
1.066667 -0.203191 0.022293 0.329792 -0.391829 -0.052257 -0.000886
1.100000 -0.215202 0.022041 0.325764 -0.386432 -0.040586 -0.000428
1.133333 -0.227715 0.022299 0.328526 -0.384555 -0.032531 -0.000212
1.166667 -0.240083 0.022538 0.329378 -0.385505 -0.027749 -0.000827
1.200000 -0.252293 0.022760 0.328230 -0.390099 -0.027284 0.000508
1.233333 -0.264329 0.022963 0.326589 -0.398931 -0.032042 0.001612
1.266667 -0.276179 0.023146 0.329699 -0.413811 -0.043956 0.004878
1.300000 -0.288840 0.023104 0.331496 -0.435792 -0.064192 0.006055
1.333333 -0.301279 0.023048 0.328499 -0.465357 -0.093138 0.007240
1.366667 -0.314833 0.022184 0.332277 -0.507357 -0.135362 0.007675
1.400000 -0.329202 0.020328 0.323918 -0.566570 -0.195331 0.006989
1.433333 -0.346694 0.015702 0.331195 -0.647627 -0.277324 0.006889
1.466667 -0.368033 0.006973 0.331289 -0.751913 -0.382447 0.001663
1.500000 -0.389090 -0.001725 0.334208 -0.882954 -0.513825 -0.001977
1.533333 -0.409849 -0.010388 0.332400 -1.044590 -0.674951 -0.011828
1.566667 -0.430297 -0.019012 0.329453 -1.226324 -0.855864 -0.027414
1.600000 -0.468961 -0.045949 0.335880 -1.416291 -1.045277 -0.050537
1.633333 -0.507327 -0.072765 0.324115 -1.603186 -1.232404 -0.080478
1.666667 -0.545397 -0.099456 0.332706 -1.776036 -1.407112 -0.109267
1.700000 -0.635879 -0.176837 0.329661 -1.914825 -1.550683 -0.144365
1.733333 -0.726178 -0.253873 0.328384 -1.998062 -1.643299 -0.174980
1.766667 -0.816322 -0.330541 0.339326 -2.020096 -1.679585 -0.199917
1.800000 -0.906329 -0.406815 0.288002 -1.975765 -1.655006 -0.213719
1.833333 -1.015634 -0.502180 0.333062 -1.857967 -1.563201 -0.222054
1.866667 -1.124913 -0.597036 0.263511 -1.662979 -1.400720 -0.221734
1.900000 -1.164550 -0.630250 0.250570 -1.405881 -1.181578 -0.210126
1.933333 -1.204157 -0.663194 0.250199 -1.104598 -0.922110 -0.188792
1.966667 -1.243746 -0.695851 0.255690 -0.761106 -0.624333 -0.156981
2.000000 -1.260682 -0.708905 0.253783 -0.381437 -0.293561 -0.118995
2.033333 -1.261731 -0.708239 0.259045 0.016842 0.054116 -0.067630
2.066667 -1.245579 -0.693201 0.240189 0.413014 0.399726 -0.013319
2.100000 -1.229335 -0.678038 0.252309 0.801810 0.738113 0.042298
2.133333 -1.183368 -0.636726 0.245799 1.175885 1.062157 0.096597
2.166667 -1.137234 -0.595392 0.253692 1.507081 1.345885 0.145061
2.200000 -1.090912 -0.554035 0.252803 1.770625 1.566204 0.184357
2.233333 -1.044393 -0.512665 0.245943 1.959907 1.716818 0.212339
2.266667 -0.997673 -0.471293 0.259410 2.078319 1.800568 0.230144
2.300000 -0.829009 -0.319890 0.286258 2.116961 1.809632 0.238341
2.333333 -0.645448 -0.155553 0.329169 2.072476 1.741319 0.231831
2.366667 -0.545177 -0.068712 0.329268 1.959610 1.609630 0.214818
2.400000 -0.487584 -0.022566 0.333054 1.796650 1.432098 0.189639
2.433333 -0.451686 0.001866 0.329339 1.595427 1.220466 0.156444
2.466667 -0.427643 0.014295 0.336601 1.363768 0.982886 0.118132
2.500000 -0.409298 0.020229 0.331823 1.128393 0.744559 0.078931
2.533333 -0.395233 0.021675 0.335757 0.915696 0.530288 0.047488
2.566667 -0.380834 0.023138 0.330005 0.737607 0.351423 0.022464
2.600000 -0.366120 0.024612 0.333711 0.598720 0.212252 0.005031
2.633333 -0.351105 0.026094 0.329661 0.499915 0.113444 -0.005719
2.666667 -0.337998 0.026070 0.325073 0.440241 0.053796 -0.009373
2.700000 -0.324631 0.026051 0.328931 0.407623 0.021856 -0.009503
2.733333 -0.312572 0.025393 0.325575 0.388037 0.004277 -0.008328
2.766667 -0.300282 0.024741 0.331051 0.374505 -0.005848 -0.007051
2.800000 -0.287773 0.024095 0.330933 0.363627 -0.012064 -0.005593
2.833333 -0.275717 0.023339 0.330932 0.354014 -0.016105 -0.004191
2.866667 -0.263934 0.022560 0.329858 0.344895 -0.018945 -0.002880
2.900000 -0.252378 0.021915 0.328225 0.336184 -0.021012 -0.000880
2.933333 -0.241347 0.021148 0.326901 0.327938 -0.022456 -0.000250
2.966667 -0.230868 0.020409 0.329210 0.320237 -0.023422 0.000774
3.000000 -0.220248 0.019674 0.324588 0.313074 -0.024064 0.002456
3.033333 -0.210700 0.018775 0.326037 0.306343 -0.024531 0.005292
3.066667 -0.201037 0.017879 0.333536 0.300210 -0.024845 0.006979
3.100000 -0.191267 0.016989 0.329046 0.294671 -0.025017 0.007967
3.133333 -0.181403 0.016099 0.326972 0.289738 -0.025026 0.008723
3.166667 -0.171457 0.015208 0.327638 0.285305 -0.024848 0.008425
3.200000 -0.162368 0.014371 0.333466 0.281311 -0.024486 0.006341
3.233333 -0.153212 0.013536 0.331604 0.277605 -0.023971 0.002385
3.266667 -0.144000 0.012702 0.332275 0.273954 -0.023358 -0.000329
3.300000 -0.134743 0.011868 0.331703 0.270155 -0.022708 -0.003277
3.333333 -0.125828 0.011045 0.331374 0.266096 -0.022073 -0.006088
3.366667 -0.117231 0.010281 0.333757 0.261751 -0.021515 -0.007804
3.400000 -0.108486 0.009748 0.327442 0.257103 -0.021034 -0.008495
3.433333 -0.099732 0.009211 0.330300 0.252206 -0.020612 -0.008463
3.466667 -0.090975 0.008671 0.326985 0.247172 -0.020235 -0.008101
3.500000 -0.082223 0.008126 0.321983 0.242188 -0.019821 -0.006502
3.533333 -0.074634 0.007316 0.329566 0.237471 -0.019268 -0.004313
3.566667 -0.067064 0.006505 0.327874 0.233245 -0.018373 -0.002503
3.600000 -0.059820 0.005819 0.331378 0.229848 -0.016840 -0.001158
3.633333 -0.052609 0.005132 0.328035 0.227836 -0.014121 0.000914
3.666667 -0.045439 0.004442 0.327662 0.228220 -0.009170 0.002399
3.700000 -0.038317 0.003747 0.333105 0.232972 -0.000108 0.002222
3.733333 -0.031078 0.003341 0.325151 0.245821 0.016609 0.004143
3.766667 -0.023902 0.002927 0.323787 0.264282 0.038795 0.006514
3.800000 -0.016795 0.002504 0.335249 0.285597 0.064016 0.009216
3.833333 -0.008899 0.002866 0.328240 0.308386 0.091026 0.011638
3.866667 -0.001078 0.003217 0.329207 0.332147 0.119323 0.013185
3.900000 0.007425 0.004626 0.327681 0.354189 0.146443 0.015730
3.933333 0.017217 0.007703 0.325110 0.367973 0.166379 0.013991
3.966667 0.029509 0.013839 0.327465 0.379044 0.184044 0.011523
4.000000 0.047501 0.025772 0.338045 0.392615 0.203974 0.008935
4.033333 0.078617 0.049293 0.329331 0.409396 0.226597 0.009175
4.066667 0.132806 0.093606 0.353327 0.416811 0.240242 0.008394
4.100000 0.113513 0.071327 0.329469 0.413457 0.243391 0.008272
4.133333 0.094107 0.049109 0.328954 0.400061 0.236537 0.009219
4.166667 0.097201 0.048021 0.330271 0.371193 0.214755 0.009879
4.200000 0.122290 0.067491 0.331202 0.320524 0.172402 0.011599
4.233333 0.147332 0.086859 0.325853 0.246381 0.108098 0.007553
4.266667 0.172332 0.106118 0.330413 0.169090 0.040487 0.006609
4.300000 0.197305 0.125264 0.330265 0.089260 -0.029595 0.004478
4.333333 0.222260 0.144293 0.330294 0.007391 -0.101454 0.003365
4.366667 0.247208 0.163201 0.367903 -0.075318 -0.173863 0.000005
4.400000 0.174224 0.093080 0.334671 -0.146300 -0.235247 -0.004913
4.433333 0.147159 0.064315 0.337494 -0.199129 -0.279596 -0.008191
4.466667 0.119954 0.035625 0.324220 -0.237445 -0.310077 -0.012334
4.500000 0.109701 0.023341 0.326738 -0.256808 -0.322753 -0.016024
4.533333 0.099309 0.011076 0.334719 -0.252763 -0.313707 -0.020326
4.566667 0.096724 0.006097 0.331769 -0.221929 -0.280016 -0.018843
4.600000 0.094013 0.001117 0.328337 -0.179069 -0.235304 -0.015927
4.633333 0.094243 -0.000643 0.333885 -0.131079 -0.186136 -0.012323
4.666667 0.094354 -0.002411 0.327747 -0.084864 -0.139052 -0.009708
4.700000 0.094344 -0.004189 0.331074 -0.044328 -0.097640 -0.007316
4.733333 0.094214 -0.005975 0.330758 -0.013386 -0.065474 -0.004281
4.766667 0.095195 -0.006697 0.330437 0.005199 -0.045046 -0.004577
4.800000 0.096060 -0.007430 0.328352 0.016825 -0.031409 -0.006034
4.833333 0.097359 -0.007804 0.331380 0.023681 -0.022434 -0.006412
4.866667 0.098547 -0.008189 0.327023 0.027955 -0.015999 -0.006066
4.900000 0.099966 -0.008258 0.331062 0.030432 -0.011346 -0.005863
4.933333 0.101278 -0.008337 0.334184 0.032017 -0.007613 -0.005862
4.966667 0.102487 -0.008425 0.322116 0.033349 -0.004194 -0.004313
5.000000 0.103585 -0.008525 0.326218 0.035040 -0.000529 -0.002526
5.033333 0.104576 -0.008636 0.334061 0.037797 0.004023 -0.002279
5.066667 0.105468 -0.008754 0.325622 0.042908 0.010681 -0.002045
5.100000 0.106254 -0.008882 0.325886 0.053024 0.021840 -0.001263
5.133333 0.107101 -0.008765 0.330030 0.070538 0.039651 0.002197
5.166667 0.108564 -0.008297 0.327847 0.091139 0.060136 0.003876
5.200000 0.109928 -0.007841 0.328516 0.112486 0.081074 0.006037
5.233333 0.111194 -0.007397 0.330673 0.132684 0.100582 0.010458
5.266667 0.113854 -0.005666 0.329198 0.149485 0.116302 0.014237
5.300000 0.118326 -0.002214 0.332286 0.158886 0.124324 0.017607
5.333333 0.122714 0.001214 0.326590 0.158780 0.122316 0.018687
5.366667 0.131531 0.008814 0.320286 0.152746 0.112923 0.020942
5.400000 0.147251 0.023315 0.329979 0.141405 0.095810 0.022300
5.433333 0.178522 0.051311 0.328693 0.122630 0.067842 0.022610
5.466667 0.209788 0.079176 0.357325 0.093240 0.025115 0.000775
5.500000 0.166226 0.038390 0.331373 0.055800 -0.030875 -0.042694
5.533333 0.146099 0.018422 0.333361 0.010300 -0.097183 -0.089082
5.566667 0.140108 0.010818 0.333775 -0.037374 -0.165852 -0.137621
5.600000 0.145273 0.012675 0.328726 -0.082744 -0.230063 -0.185413
5.633333 0.162836 0.024944 0.333374 -0.119678 -0.280660 -0.234274
5.666667 0.201423 0.054050 0.358691 -0.142965 -0.309241 -0.240620
5.700000 0.159883 0.007364 0.331265 -0.152253 -0.311812 -0.203222
5.733333 0.136782 -0.026537 0.328527 -0.148874 -0.292611 -0.163423
5.766667 0.120193 -0.059975 0.336107 -0.137928 -0.257455 -0.122364
5.800000 0.103454 -0.093314 0.086279 -0.120657 -0.208063 -0.060995
5.833333 0.086365 -0.126636 0.071131 -0.096778 -0.145537 0.022866
5.866667 0.104129 -0.087675 0.335235 -0.065417 -0.074183 0.088994
5.900000 0.113060 -0.067097 0.326412 -0.032107 -0.003690 0.132795
5.933333 0.115808 -0.059798 0.329920 0.002163 0.063776 0.176869
5.966667 0.118490 -0.052463 0.332288 0.036278 0.124111 0.221872
6.000000 0.121105 -0.045098 0.327243 0.068747 0.172607 0.226239
6.033333 0.123650 -0.037711 0.334630 0.096648 0.203733 0.187666
6.066667 0.126131 -0.030306 0.328970 0.118100 0.219802 0.147320
6.100000 0.128541 -0.022894 0.325542 0.136431 0.226385 0.108149
6.133333 0.130906 -0.017584 0.333819 0.152405 0.225959 0.068611
6.166667 0.135296 -0.012555 0.331466 0.164679 0.219883 0.028596
6.200000 0.139608 -0.007541 0.330577 0.169743 0.207491 0.008063
6.233333 0.143842 -0.002546 0.325467 0.164942 0.188703 0.007947
6.266667 0.147994 0.002425 0.332207 0.150756 0.163019 0.006878
6.300000 0.160371 0.014042 0.329668 0.127706 0.130916 0.004213
6.333333 0.185725 0.036778 0.333500 0.095926 0.092865 0.001863
6.366667 0.211053 0.059407 0.341100 0.056781 0.049991 -0.001683
6.400000 0.200010 0.048425 0.329833 0.015752 0.007133 -0.004767
6.433333 0.188877 0.037460 0.334381 -0.023013 -0.032061 -0.007413
6.466667 0.177650 0.026514 0.333552 -0.058386 -0.066756 -0.009217
6.500000 0.166318 0.015588 0.331061 -0.087703 -0.094885 -0.010604
6.533333 0.154872 0.004683 0.329336 -0.106503 -0.112699 -0.011969
6.566667 0.151329 0.000852 0.323072 -0.111314 -0.117129 -0.011267
6.600000 0.147666 -0.002988 0.327164 -0.104462 -0.110426 -0.009743
6.633333 0.143883 -0.006834 0.329133 -0.087599 -0.094248 -0.007327
6.666667 0.142269 -0.008624 0.334459 -0.061712 -0.069640 -0.005701
6.700000 0.142844 -0.008699 0.328567 -0.028966 -0.038592 -0.003027
6.733333 0.143296 -0.008794 0.326624 0.007578 -0.003846 0.000969
6.766667 0.143623 -0.008909 0.328392 0.042807 0.029965 0.003454
6.800000 0.143823 -0.009044 0.332693 0.076005 0.062189 0.004414
6.833333 0.145682 -0.007731 0.326168 0.106307 0.092051 0.005744
6.866667 0.147411 -0.006445 0.331775 0.133788 0.119572 0.007850
6.900000 0.151750 -0.002894 0.323223 0.158829 0.144990 0.011876
6.933333 0.158941 0.003947 0.331844 0.176090 0.163281 0.012903
6.966667 0.166015 0.010741 0.330264 0.186023 0.174718 0.015275
7.000000 0.183237 0.026825 0.328296 0.186392 0.177104 0.019042
7.033333 0.200364 0.042819 0.331893 0.176210 0.169407 0.020317
7.066667 0.217405 0.058720 0.346407 0.150596 0.147197 0.020098
7.100000 0.196887 0.040494 0.323090 0.108650 0.109713 0.014975
7.133333 0.198727 0.042995 0.326971 0.059731 0.065659 0.011188
7.166667 0.200442 0.045451 0.338858 0.011124 0.021832 0.005223
7.200000 0.229327 0.071913 0.329611 -0.031909 -0.016683 -0.001737
7.233333 0.258147 0.098228 0.357816 -0.066159 -0.046760 -0.006809
7.266667 0.221259 0.064588 0.332973 -0.086751 -0.063867 -0.009522
7.300000 0.184186 0.031036 0.335659 -0.094582 -0.068852 -0.011342
7.333333 0.167002 0.015359 0.328910 -0.094810 -0.066453 -0.012697
7.366667 0.161134 0.010605 0.326228 -0.095452 -0.064070 -0.011875
7.400000 0.155092 0.005833 0.330328 -0.099661 -0.064786 -0.010940
7.433333 0.156183 0.007939 0.330096 -0.107250 -0.068623 -0.010554
7.466667 0.165573 0.017915 0.325485 -0.118292 -0.075780 -0.010818
7.500000 0.187262 0.039361 0.328812 -0.133976 -0.087319 -0.008641
7.533333 0.208841 0.060686 0.324609 -0.154885 -0.103829 -0.006612
7.566667 0.230320 0.081884 0.356471 -0.179013 -0.123435 -0.008024
7.600000 0.178614 0.036087 0.331276 -0.199702 -0.139986 -0.008742
7.633333 0.149511 0.010284 0.325790 -0.217050 -0.153380 -0.008838
7.666667 0.129610 -0.006848 0.330396 -0.229560 -0.162107 -0.010246
7.700000 0.111642 -0.022052 0.326870 -0.231965 -0.161274 -0.012667
7.733333 0.087542 -0.042354 0.321061 -0.219346 -0.146338 -0.014903
7.766667 0.099201 -0.029979 0.326480 -0.190554 -0.116272 -0.011511
7.800000 0.101158 -0.026049 0.330366 -0.156007 -0.080654 -0.008571
7.833333 0.102924 -0.022159 0.331374 -0.119775 -0.043407 -0.006225
7.866667 0.104501 -0.018309 0.327281 -0.085861 -0.008362 -0.001102
7.900000 0.105886 -0.014501 0.326516 -0.058898 0.020075 0.003806
7.933333 0.105277 -0.012393 0.326057 -0.044425 0.036789 0.008269
7.966667 0.103471 -0.011320 0.327378 -0.041863 0.042268 0.009011
8.000000 0.101466 -0.010281 0.326114 -0.046284 0.041057 0.010902
8.033333 0.098914 -0.009605 0.329696 -0.054707 0.035979 0.012679
