t x y theta dxdt dydt dthetadt
0.000000 0.000000 0.000000 -0.673619 -0.014074 0.000257 0.018671
0.033333 -0.000242 -0.000038 -0.663864 -0.017908 -0.001164 0.013991
0.066667 -0.000521 0.000064 -0.668271 -0.023474 -0.004093 0.010272
0.100000 -0.001104 0.000404 -0.673999 -0.031042 -0.008997 0.008307
0.133333 -0.001461 0.000148 -0.672540 -0.040996 -0.016325 0.005938
0.166667 -0.002221 0.000053 -0.673989 -0.053748 -0.026763 0.002082
0.200000 -0.003259 0.000167 -0.671255 -0.069431 -0.040909 -0.003352
0.233333 -0.005065 0.000197 -0.670441 -0.087840 -0.059104 -0.008727
0.266667 -0.007536 -0.000671 -0.675142 -0.108678 -0.081807 -0.012014
0.300000 -0.010259 -0.001355 -0.673325 -0.131724 -0.109458 -0.011998
0.333333 -0.014448 -0.004684 -0.663800 -0.156276 -0.142032 -0.005390
0.366667 -0.020840 -0.010608 -0.663479 -0.181299 -0.178892 0.009038
0.400000 -0.027453 -0.016361 -0.669604 -0.205752 -0.219105 0.033725
0.433333 -0.034272 -0.021946 -0.680470 -0.228864 -0.261523 0.068057
0.466667 -0.043241 -0.030081 -0.688554 -0.249676 -0.304305 0.110070
0.500000 -0.053491 -0.040852 -0.686389 -0.267136 -0.345376 0.158072
0.533333 -0.064340 -0.054137 -0.679154 -0.280569 -0.383070 0.207794
0.566667 -0.075255 -0.070075 -0.671687 -0.289581 -0.415544 0.255202
0.600000 -0.086154 -0.088144 -0.653750 -0.293715 -0.440685 0.292676
0.633333 -0.097168 -0.106011 -0.650681 -0.292258 -0.456199 0.317722
0.666667 -0.108281 -0.123665 -0.619705 -0.285074 -0.460855 0.328815
0.700000 -0.118690 -0.142408 -0.595342 -0.272283 -0.453792 0.329510
0.733333 -0.128309 -0.160517 -0.572113 -0.253965 -0.434157 0.323465
0.766667 -0.137980 -0.178376 -0.567606 -0.230461 -0.402128 0.313781
0.800000 -0.145936 -0.192970 -0.552272 -0.202666 -0.359162 0.308813
0.833333 -0.153915 -0.207292 -0.562759 -0.171948 -0.307443 0.312174
0.866667 -0.161903 -0.221332 -0.554308 -0.139479 -0.248640 0.324292
0.900000 -0.166635 -0.230134 -0.550776 -0.106656 -0.184864 0.343067
0.933333 -0.168247 -0.234168 -0.570076 -0.075321 -0.118908 0.366444
0.966667 -0.167305 -0.233063 -0.572841 -0.047355 -0.053634 0.393396
1.000000 -0.166335 -0.231675 -0.535980 -0.024130 0.008994 0.417841
1.033333 -0.165332 -0.230010 -0.495496 -0.006649 0.066884 0.433430
1.066667 -0.163292 -0.225053 -0.447401 0.004227 0.117609 0.438337
1.100000 -0.160638 -0.217972 -0.437593 0.008418 0.159596 0.429320
1.133333 -0.157789 -0.209624 -0.425812 0.006760 0.192347 0.402841
1.166667 -0.155398 -0.199923 -0.420007 0.000609 0.216246 0.354544
1.200000 -0.154312 -0.189469 -0.418053 -0.008695 0.231473 0.287982
1.233333 -0.155243 -0.179209 -0.394829 -0.019530 0.238754 0.204760
1.266667 -0.158495 -0.169885 -0.390278 -0.029833 0.239239 0.106463
1.300000 -0.161689 -0.160382 -0.390818 -0.037789 0.233804 -0.005039
1.333333 -0.164819 -0.150715 -0.396820 -0.042047 0.222922 -0.124801
1.366667 -0.167103 -0.145074 -0.394094 -0.041698 0.207155 -0.243782
1.400000 -0.169312 -0.139293 -0.386816 -0.036062 0.187159 -0.359402
1.433333 -0.171440 -0.133380 -0.392617 -0.025404 0.163870 -0.460879
1.466667 -0.173479 -0.127346 -0.400472 -0.010841 0.138235 -0.541127
1.500000 -0.175425 -0.121200 -0.447807 0.006258 0.111339 -0.591605
1.533333 -0.177272 -0.114952 -0.485352 0.024573 0.084410 -0.609348
1.566667 -0.175666 -0.112061 -0.534709 0.042770 0.058783 -0.592762
1.600000 -0.171749 -0.111779 -0.586267 0.059448 0.035970 -0.535297
1.633333 -0.166513 -0.113155 -0.615268 0.073781 0.017528 -0.438831
1.666667 -0.161577 -0.115814 -0.625068 0.085365 0.004988 -0.306207
1.700000 -0.157490 -0.118927 -0.622338 0.093979 -0.000222 -0.149050
1.733333 -0.153305 -0.121960 -0.620246 0.099496 0.003212 0.022568
1.766667 -0.150250 -0.123544 -0.604050 0.102601 0.015195 0.194271
1.800000 -0.147099 -0.125048 -0.598303 0.104350 0.035174 0.344156
1.833333 -0.143851 -0.126471 -0.584434 0.105851 0.061649 0.455995
1.866667 -0.140507 -0.127816 -0.574367 0.108166 0.092854 0.520085
1.900000 -0.137814 -0.122870 -0.551450 0.112160 0.126399 0.533852
1.933333 -0.135022 -0.117853 -0.495286 0.118243 0.159883 0.498805
1.966667 -0.131839 -0.108196 -0.430234 0.125571 0.191544 0.420545
2.000000 -0.128553 -0.098487 -0.390851 0.133110 0.219847 0.313706
2.033333 -0.125165 -0.088741 -0.376740 0.139323 0.243859 0.189143
2.066667 -0.120173 -0.078868 -0.396502 0.142540 0.262815 0.056781
2.100000 -0.113099 -0.068720 -0.408267 0.140796 0.277104 -0.071527
2.133333 -0.105929 -0.058573 -0.444722 0.132661 0.287107 -0.182635
2.166667 -0.098665 -0.048440 -0.459494 0.117733 0.293820 -0.266779
2.200000 -0.091075 -0.038694 -0.481087 0.095599 0.298271 -0.323853
2.233333 -0.084593 -0.029152 -0.527501 0.066962 0.301068 -0.351713
2.266667 -0.080446 -0.019537 -0.544549 0.033271 0.302338 -0.356035
2.300000 -0.080462 -0.009611 -0.540482 -0.002797 0.301570 -0.350596
2.333333 -0.080393 0.000242 -0.517617 -0.038766 0.298263 -0.355199
2.366667 -0.085389 0.010862 -0.524585 -0.072110 0.291497 -0.389384
2.400000 -0.090285 0.021386 -0.537752 -0.100264 0.280294 -0.465036
2.433333 -0.098508 0.032523 -0.557313 -0.120983 0.264015 -0.591488
2.466667 -0.106608 0.043539 -0.560594 -0.132733 0.242874 -0.768528
2.500000 -0.114575 0.054419 -0.552200 -0.135150 0.217190 -0.981579
2.533333 -0.122395 0.065149 -0.563352 -0.127543 0.187446 -1.211915
2.566667 -0.128271 0.072176 -0.597584 -0.109978 0.154855 -1.433047
2.600000 -0.130737 0.073526 -0.637857 -0.082822 0.121118 -1.620823
2.633333 -0.133032 0.074697 -0.745397 -0.047428 0.088259 -1.750201
2.666667 -0.135146 0.075685 -0.820602 -0.005418 0.057987 -1.803496
2.700000 -0.137075 0.076488 -0.954733 0.041938 0.031981 -1.768196
2.733333 -0.138811 0.077100 -1.073120 0.092692 0.011598 -1.637884
2.766667 -0.136418 0.074659 -1.159235 0.144769 -0.002810 -1.419657
2.800000 -0.129458 0.071066 -1.213015 0.195932 -0.011639 -1.127981
2.833333 -0.122302 0.067278 -1.245114 0.244219 -0.015515 -0.789598
2.866667 -0.110934 0.065205 -1.260879 0.287703 -0.015306 -0.427199
2.900000 -0.096239 0.066392 -1.254722 0.324199 -0.012174 -0.072562
2.933333 -0.081369 0.067377 -1.226065 0.351862 -0.007122 0.245843
2.966667 -0.066333 0.068158 -1.178372 0.369627 -0.001048 0.506342
3.000000 -0.051145 0.068731 -1.119142 0.377573 0.005257 0.701580
3.033333 -0.035816 0.069092 -1.072504 0.376460 0.010857 0.840690
3.066667 -0.020359 0.069239 -1.025038 0.367765 0.015047 0.933681
3.100000 -0.004786 0.069168 -0.988386 0.353574 0.017503 0.999955
3.133333 0.006825 0.070005 -0.972683 0.336498 0.017558 1.063958
3.166667 0.014505 0.071506 -0.948652 0.319157 0.014709 1.153989
3.200000 0.022279 0.072781 -0.917342 0.303694 0.008355 1.285289
3.233333 0.030141 0.073826 -0.890499 0.291913 -0.002026 1.457087
3.266667 0.038088 0.074638 -0.867155 0.285475 -0.017233 1.667797
3.300000 0.046116 0.075211 -0.874408 0.285616 -0.037955 1.913210
3.333333 0.054220 0.075541 -0.833404 0.292669 -0.064394 2.179271
3.366667 0.062397 0.075625 -0.720146 0.306406 -0.096761 2.442579
3.400000 0.071078 0.074427 -0.592850 0.326153 -0.134775 2.684456
3.433333 0.080773 0.070622 -0.462766 0.351153 -0.177951 2.896243
3.466667 0.092659 0.063566 -0.330209 0.379991 -0.225252 3.066879
3.500000 0.104589 0.056260 -0.199224 0.411329 -0.275831 3.180567
3.533333 0.119259 0.045412 -0.090976 0.443699 -0.328577 3.230660
3.566667 0.133951 0.034326 0.003725 0.475740 -0.382126 3.225720
3.600000 0.151873 0.019529 0.120641 0.505945 -0.435080 3.175600
3.633333 0.169787 0.004512 0.229040 0.532862 -0.486495 3.084938
3.666667 0.189392 -0.013210 0.340400 0.555423 -0.535602 2.958540
3.700000 0.210315 -0.033054 0.441725 0.572447 -0.581477 2.808703
3.733333 0.231803 -0.054877 0.516965 0.583535 -0.623506 2.647418
3.766667 0.253208 -0.076856 0.612239 0.588382 -0.661067 2.472828
3.800000 0.274851 -0.101338 0.719388 0.587331 -0.693528 2.285494
3.833333 0.296369 -0.125936 0.798673 0.580823 -0.719664 2.090948
3.866667 0.316150 -0.151647 0.851024 0.569673 -0.738551 1.902039
3.900000 0.335768 -0.177427 0.917634 0.554894 -0.749270 1.724281
3.933333 0.354290 -0.204573 0.971759 0.537394 -0.751168 1.557986
3.966667 0.371406 -0.232467 0.998311 0.518088 -0.743549 1.411789
4.000000 0.387704 -0.260228 1.022962 0.497573 -0.726082 1.291591
4.033333 0.403772 -0.287958 1.052819 0.476410 -0.699080 1.201165
4.066667 0.419173 -0.314093 1.089777 0.454660 -0.662701 1.129673
4.100000 0.434033 -0.338057 1.118517 0.432329 -0.617617 1.072555
4.133333 0.448187 -0.359055 1.158893 0.409223 -0.564691 1.026688
4.166667 0.461683 -0.376496 1.175669 0.385246 -0.505703 0.985600
4.200000 0.474884 -0.393803 1.234189 0.360442 -0.442680 0.938632
4.233333 0.487349 -0.407025 1.275733 0.335036 -0.377578 0.879443
4.266667 0.499497 -0.420087 1.312946 0.309513 -0.312503 0.811150
4.300000 0.509557 -0.428911 1.338126 0.284490 -0.249550 0.734479
4.333333 0.517456 -0.433385 1.362845 0.260735 -0.190573 0.650420
4.366667 0.525014 -0.437682 1.394807 0.238777 -0.136547 0.558399
4.400000 0.531268 -0.438866 1.400745 0.218958 -0.088400 0.471195
4.433333 0.536775 -0.437895 1.396121 0.201193 -0.046905 0.394697
4.466667 0.541925 -0.436752 1.403454 0.185264 -0.012718 0.331616
4.500000 0.546712 -0.435442 1.406373 0.170649 0.014180 0.285115
4.533333 0.551133 -0.433971 1.403894 0.156688 0.034285 0.262138
4.566667 0.557284 -0.430978 1.436058 0.142946 0.047832 0.265764
4.600000 0.563560 -0.427788 1.442473 0.129101 0.055657 0.289239
4.633333 0.569452 -0.424455 1.434691 0.115052 0.058945 0.326140
4.666667 0.574953 -0.420986 1.422140 0.100762 0.058687 0.377247
4.700000 0.578470 -0.418527 1.420836 0.086474 0.055636 0.440019
4.733333 0.579694 -0.416601 1.458089 0.072475 0.050236 0.501430
4.766667 0.580047 -0.415900 1.503254 0.059100 0.043288 0.554060
4.800000 0.579991 -0.415083 1.512548 0.046692 0.035307 0.587423
4.833333 0.579526 -0.414153 1.520856 0.035587 0.026530 0.594105
4.866667 0.580245 -0.413000 1.560203 0.025715 0.017312 0.559118
4.900000 0.581789 -0.412422 1.576661 0.016638 0.007877 0.473691
4.933333 0.582915 -0.411743 1.625627 0.007733 -0.001653 0.338498
4.966667 0.583621 -0.410968 1.649753 -0.002051 -0.011828 0.161570
5.000000 0.584136 -0.412491 1.681272 -0.014154 -0.023286 -0.047124
5.033333 0.584223 -0.413921 1.693225 -0.030008 -0.036665 -0.276763
5.066667 0.583878 -0.415258 1.695066 -0.050620 -0.052459 -0.513091
5.100000 0.583098 -0.416504 1.653073 -0.076938 -0.071340 -0.742405
5.133333 0.581881 -0.417660 1.590300 -0.109994 -0.094016 -0.949109
5.166667 0.580225 -0.418725 1.523674 -0.150567 -0.120654 -1.130455
5.200000 0.575340 -0.422964 1.469341 -0.198851 -0.151046 -1.283108
5.233333 0.570015 -0.427109 1.401694 -0.255031 -0.184981 -1.403975
5.266667 0.564250 -0.431158 1.346064 -0.319193 -0.221969 -1.491287
5.300000 0.554652 -0.438481 1.307972 -0.390662 -0.260864 -1.550426
5.333333 0.540752 -0.449093 1.272430 -0.467940 -0.300038 -1.595394
5.366667 0.526429 -0.459586 1.232459 -0.549102 -0.337581 -1.629821
5.400000 0.507793 -0.472677 1.173947 -0.632132 -0.371561 -1.653795
5.433333 0.485325 -0.487515 1.114914 -0.714728 -0.399894 -1.671721
5.466667 0.459522 -0.503383 1.065510 -0.794275 -0.420832 -1.687389
5.500000 0.429020 -0.520688 0.994599 -0.868651 -0.433224 -1.698517
5.533333 0.394148 -0.538643 0.918208 -0.936293 -0.436522 -1.695594
5.566667 0.358975 -0.556383 0.858785 -0.995967 -0.430910 -1.680424
5.600000 0.321202 -0.572667 0.797352 -1.046525 -0.417226 -1.657720
5.633333 0.283196 -0.588700 0.744684 -1.087401 -0.396634 -1.630588
5.666667 0.244994 -0.604466 0.672482 -1.118412 -0.370177 -1.599876
5.700000 0.206384 -0.616433 0.642571 -1.139486 -0.338986 -1.570738
5.733333 0.166363 -0.624680 0.605958 -1.150438 -0.304202 -1.553288
5.766667 0.126256 -0.632622 0.562446 -1.151115 -0.266671 -1.548295
5.800000 0.086100 -0.640252 0.516289 -1.141663 -0.226864 -1.556490
5.833333 0.045933 -0.647560 0.460676 -1.121956 -0.185098 -1.574112
5.866667 0.005791 -0.654540 0.411710 -1.091884 -0.141728 -1.600421
5.900000 -0.034289 -0.661183 0.355042 -1.051659 -0.096784 -1.629279
5.933333 -0.071071 -0.664139 0.302923 -1.002148 -0.049876 -1.652931
5.966667 -0.107720 -0.666748 0.235797 -0.943969 -0.000317 -1.665766
6.000000 -0.140415 -0.666304 0.165701 -0.878429 0.052085 -1.661007
6.033333 -0.169101 -0.663168 0.119130 -0.807161 0.107325 -1.638020
6.066667 -0.193128 -0.657964 0.052659 -0.732617 0.164853 -1.594959
6.100000 -0.216910 -0.652423 -0.004646 -0.656797 0.224158 -1.535141
6.133333 -0.235482 -0.643887 -0.062832 -0.581528 0.284306 -1.458989
6.166667 -0.253774 -0.635027 -0.117755 -0.509131 0.343762 -1.369202
6.200000 -0.267213 -0.622108 -0.156876 -0.441257 0.401349 -1.273201
6.233333 -0.280348 -0.608887 -0.188506 -0.378922 0.456286 -1.173810
6.266667 -0.290254 -0.591249 -0.234711 -0.322270 0.507984 -1.071908
6.300000 -0.296778 -0.569740 -0.264828 -0.271890 0.555157 -0.968204
6.333333 -0.302979 -0.547982 -0.286989 -0.227692 0.596885 -0.865529
6.366667 -0.308857 -0.525996 -0.310118 -0.189259 0.632312 -0.767907
6.400000 -0.314410 -0.503804 -0.336826 -0.155723 0.660982 -0.672209
6.433333 -0.318238 -0.479776 -0.367223 -0.126465 0.681902 -0.577343
6.466667 -0.320975 -0.454696 -0.388794 -0.100783 0.694687 -0.489701
6.500000 -0.323172 -0.429528 -0.388303 -0.077287 0.699818 -0.412202
6.533333 -0.325048 -0.404247 -0.408547 -0.054819 0.697527 -0.347283
6.566667 -0.326607 -0.378878 -0.427899 -0.032351 0.688482 -0.293215
6.600000 -0.328016 -0.354238 -0.414972 -0.009222 0.672987 -0.252950
6.633333 -0.328644 -0.331037 -0.424806 0.015001 0.652038 -0.225909
6.666667 -0.328966 -0.307817 -0.413621 0.040509 0.626197 -0.207217
6.700000 -0.327770 -0.287637 -0.411231 0.066902 0.596121 -0.187938
6.733333 -0.326280 -0.267479 -0.410564 0.093558 0.562681 -0.162540
6.766667 -0.322343 -0.249934 -0.426751 0.119664 0.526867 -0.129083
6.800000 -0.318128 -0.232445 -0.446511 0.144149 0.489647 -0.081612
6.833333 -0.311799 -0.216632 -0.467409 0.165863 0.451705 -0.018745
6.866667 -0.303870 -0.202159 -0.486797 0.183709 0.414102 0.062094
6.900000 -0.295039 -0.188718 -0.489797 0.196749 0.377226 0.152643
6.933333 -0.285989 -0.176842 -0.476406 0.204163 0.341482 0.245897
6.966667 -0.277464 -0.166816 -0.463153 0.205612 0.306911 0.337532
7.000000 -0.270092 -0.159023 -0.448983 0.201296 0.273949 0.418767
7.033333 -0.262531 -0.151363 -0.402424 0.191969 0.242951 0.480691
7.066667 -0.254790 -0.143843 -0.367002 0.178476 0.213842 0.514921
7.100000 -0.246884 -0.136467 -0.352736 0.161920 0.186818 0.522163
7.133333 -0.241662 -0.130834 -0.327464 0.143641 0.161964 0.505854
7.166667 -0.238590 -0.126714 -0.299829 0.124839 0.139408 0.467475
7.200000 -0.235380 -0.122746 -0.284137 0.106357 0.118784 0.411888
7.233333 -0.233606 -0.120336 -0.276551 0.088881 0.099932 0.348083
7.266667 -0.231706 -0.118078 -0.278577 0.073036 0.082881 0.284752
7.300000 -0.229686 -0.115971 -0.272660 0.059283 0.067750 0.225469
7.333333 -0.228374 -0.113891 -0.274254 0.047678 0.054501 0.172600
7.366667 -0.227420 -0.112170 -0.260633 0.038052 0.043018 0.128257
7.400000 -0.226678 -0.111152 -0.258667 0.030349 0.033423 0.094237
7.433333 -0.226016 -0.110953 -0.258904 0.024253 0.025600 0.068384
7.466667 -0.225253 -0.110899 -0.257969 0.019419 0.019382 0.048399
7.500000 -0.224776 -0.110927 -0.257709 0.015538 0.014507 0.032345
7.533333 -0.224566 -0.110891 -0.260218 0.012412 0.010834 0.019110
7.566667 -0.224525 -0.110621 -0.259157 0.009953 0.008273 0.009547
