t x y theta dxdt dydt dthetadt
0.000000 0.000000 0.000000 -1.061404 0.011681 0.017851 0.005365
0.033333 0.000452 0.000544 -1.051965 0.014944 0.021750 0.011091
0.066667 0.000747 0.001147 -1.042641 0.018695 0.026355 0.011099
0.100000 0.001525 0.001951 -1.058931 0.023041 0.031817 0.012721
0.133333 0.002243 0.002907 -1.057119 0.028081 0.038236 0.018271
0.166667 0.002949 0.004007 -1.045510 0.034016 0.045684 0.029007
0.200000 0.003686 0.005293 -1.049537 0.041187 0.054285 0.053588
0.233333 0.004969 0.006801 -1.048049 0.049882 0.064137 0.103064
0.266667 0.006440 0.008731 -1.044597 0.060274 0.075298 0.185441
0.300000 0.008133 0.011079 -1.050268 0.072599 0.087711 0.296709
0.333333 0.010177 0.013974 -1.052131 0.087129 0.101338 0.434619
0.366667 0.012656 0.017498 -1.073330 0.104097 0.116111 0.593194
0.400000 0.015762 0.021269 -1.062887 0.123605 0.131809 0.762990
0.433333 0.019626 0.025960 -1.034085 0.145707 0.148025 0.929187
0.466667 0.024151 0.030904 -0.999660 0.170531 0.164371 1.079785
0.500000 0.029350 0.036104 -0.925100 0.198253 0.180521 1.206001
0.533333 0.035852 0.042553 -0.861237 0.228835 0.196081 1.299535
0.566667 0.043853 0.050191 -0.788105 0.262156 0.210620 1.353252
0.600000 0.052572 0.058089 -0.708325 0.298154 0.223786 1.360244
0.633333 0.062021 0.066247 -0.658395 0.336815 0.235437 1.322289
0.666667 0.073207 0.074907 -0.625486 0.377990 0.245425 1.241281
0.700000 0.085988 0.083825 -0.603088 0.421355 0.253631 1.128786
0.733333 0.100379 0.092910 -0.560904 0.466779 0.260106 0.996214
0.766667 0.116325 0.101996 -0.536025 0.514142 0.265114 0.856588
0.800000 0.134064 0.111070 -0.494053 0.563186 0.269012 0.725071
0.833333 0.153801 0.120072 -0.458792 0.613494 0.272179 0.610221
0.866667 0.174324 0.129335 -0.457591 0.664830 0.275078 0.519711
0.900000 0.196992 0.138510 -0.445821 0.716934 0.278197 0.448534
0.933333 0.221754 0.147628 -0.453374 0.769414 0.281957 0.396412
0.966667 0.248495 0.156749 -0.461573 0.821876 0.286666 0.362633
1.000000 0.277062 0.165917 -0.467186 0.874038 0.292583 0.346157
1.033333 0.307289 0.175222 -0.440182 0.925660 0.299850 0.343347
1.066667 0.338993 0.184751 -0.421191 0.976377 0.308570 0.349843
1.100000 0.372554 0.194710 -0.406333 1.025963 0.318763 0.365349
1.133333 0.407966 0.205199 -0.388840 1.074309 0.330379 0.383858
1.166667 0.445236 0.216253 -0.363196 1.121227 0.343246 0.396736
1.200000 0.484443 0.227980 -0.354517 1.166522 0.357120 0.395359
1.233333 0.524373 0.239972 -0.354325 1.210242 0.371845 0.378003
1.266667 0.565013 0.252226 -0.348925 1.252491 0.387203 0.342384
1.300000 0.607604 0.265245 -0.324365 1.293436 0.403050 0.290735
1.333333 0.652076 0.279133 -0.304067 1.333215 0.419261 0.225731
1.366667 0.697208 0.293276 -0.281830 1.372158 0.435822 0.153043
1.400000 0.744518 0.308475 -0.261670 1.410459 0.452680 0.076275
1.433333 0.792449 0.323923 -0.278127 1.448135 0.469743 0.002223
1.466667 0.840979 0.339615 -0.283616 1.485179 0.486946 -0.061591
1.500000 0.890087 0.355546 -0.286045 1.521603 0.504239 -0.113861
1.533333 0.941090 0.372373 -0.304560 1.557498 0.521654 -0.148574
1.566667 0.993875 0.390096 -0.324959 1.592840 0.539212 -0.161133
1.600000 1.048302 0.408635 -0.352110 1.627849 0.557108 -0.147098
1.633333 1.104354 0.428077 -0.351819 1.662545 0.575410 -0.111985
1.666667 1.160855 0.447726 -0.358315 1.696849 0.594120 -0.061191
1.700000 1.217776 0.467574 -0.356954 1.730498 0.613142 0.004445
1.733333 1.275088 0.487613 -0.373824 1.763181 0.632313 0.078475
1.766667 1.334036 0.508570 -0.345161 1.794536 0.651387 0.151663
1.800000 1.394458 0.530393 -0.326649 1.824107 0.670062 0.219094
1.833333 1.456240 0.553063 -0.330636 1.851644 0.688153 0.278356
1.866667 1.519297 0.576621 -0.307588 1.876967 0.705572 0.327196
1.900000 1.583515 0.601120 -0.286525 1.899907 0.722219 0.364434
1.933333 1.648812 0.626565 -0.307234 1.920195 0.737936 0.390017
1.966667 1.714261 0.652121 -0.262324 1.937751 0.752697 0.405146
2.000000 1.779824 0.677774 -0.253012 1.952495 0.766402 0.411791
2.033333 1.845462 0.703508 -0.240583 1.964433 0.779010 0.411237
2.066667 1.911138 0.729309 -0.224907 1.973654 0.790468 0.407297
2.100000 1.976814 0.755163 -0.203273 1.980408 0.800862 0.396787
2.133333 2.043485 0.782321 -0.193838 1.985007 0.810307 0.379293
2.166667 2.110078 0.809499 -0.182622 1.987601 0.818858 0.359562
2.200000 2.177184 0.837865 -0.179023 1.988187 0.826497 0.337847
2.233333 2.244132 0.866218 -0.148408 1.986564 0.833112 0.313096
2.266667 2.310882 0.894542 -0.146240 1.982459 0.838499 0.284666
2.300000 2.377394 0.922818 -0.142432 1.975388 0.842328 0.258708
2.333333 2.443629 0.951029 -0.134074 1.964968 0.844416 0.234921
2.366667 2.509547 0.979158 -0.120433 1.950748 0.844493 0.210562
2.400000 2.575348 1.007963 -0.113706 1.932311 0.842355 0.183641
2.433333 2.640754 1.036650 -0.122266 1.909197 0.837751 0.159748
2.466667 2.705726 1.065200 -0.104564 1.880971 0.830495 0.137034
2.500000 2.769489 1.093569 -0.111574 1.847538 0.820526 0.112075
2.533333 2.831683 1.121502 -0.097759 1.808806 0.807701 0.086315
2.566667 2.891948 1.148789 -0.092551 1.765136 0.792098 0.063131
2.600000 2.951631 1.175868 -0.096562 1.716875 0.773852 0.043440
2.633333 3.009067 1.202011 -0.088869 1.664547 0.753190 0.021607
2.666667 3.065855 1.227913 -0.090455 1.608685 0.730344 0.000768
2.700000 3.119639 1.252464 -0.105107 1.549336 0.705380 -0.018409
2.733333 3.169933 1.275412 -0.100851 1.486609 0.678436 -0.037106
2.766667 3.216179 1.296542 -0.094369 1.420470 0.649612 -0.060204
2.800000 3.261673 1.317376 -0.102265 1.350937 0.618991 -0.087965
2.833333 3.306396 1.337905 -0.112393 1.278286 0.586785 -0.117291
2.866667 3.350328 1.358118 -0.109405 1.202796 0.553206 -0.150231
2.900000 3.393450 1.378004 -0.102046 1.125261 0.518672 -0.189249
2.933333 3.431207 1.395408 -0.110181 1.046479 0.483582 -0.230290
2.966667 3.463313 1.410237 -0.114653 0.967210 0.448302 -0.266212
3.000000 3.494572 1.424717 -0.123598 0.888493 0.413317 -0.293788
3.033333 3.519947 1.436536 -0.140373 0.811518 0.379178 -0.310262
3.066667 3.544468 1.447999 -0.161998 0.737356 0.346378 -0.309625
3.100000 3.568134 1.459106 -0.181501 0.666782 0.315274 -0.281930
3.133333 3.585516 1.467451 -0.198310 0.600465 0.286156 -0.228447
3.166667 3.602052 1.475440 -0.210633 0.538552 0.259071 -0.153670
3.200000 3.617749 1.483074 -0.221358 0.481252 0.234070 -0.060748
3.233333 3.632616 1.490356 -0.244697 0.427978 0.210826 0.044999
3.266667 3.646661 1.497288 -0.245113 0.378365 0.189123 0.153333
3.300000 3.659893 1.503872 -0.217982 0.332237 0.168816 0.250089
3.333333 3.669296 1.508872 -0.201925 0.289184 0.149682 0.329474
3.366667 3.677910 1.513532 -0.177847 0.249192 0.131674 0.386786
3.400000 3.684362 1.517170 -0.147419 0.212126 0.114718 0.417324
3.433333 3.689195 1.520096 -0.106841 0.178250 0.098950 0.418045
3.466667 3.692992 1.522450 -0.097577 0.147802 0.084492 0.394279
3.500000 3.696088 1.524535 -0.074633 0.120904 0.071431 0.351124
3.533333 3.698726 1.526329 -0.064222 0.097581 0.059822 0.294215
3.566667 3.701185 1.527892 -0.067501 0.077811 0.049717 0.230142
3.600000 3.702975 1.529160 -0.072973 0.061301 0.041032 0.167754
3.633333 3.704656 1.530254 -0.064937 0.047668 0.033639 0.114581
3.666667 3.705703 1.531066 -0.073980 0.036407 0.027339 0.069695
3.700000 3.706134 1.531604 -0.067388 0.026948 0.021913 0.037663
3.733333 3.706691 1.532145 -0.076119 0.019011 0.017245 0.018220
3.766667 3.706668 1.532427 -0.072770 0.012396 0.013236 0.007503
3.800000 3.706848 1.532755 -0.061728 0.006890 0.009787 0.000415
3.833333 3.707164 1.533067 -0.075862 0.002316 0.006810 -0.003345
3.866667 3.706953 1.533142 -0.074123 -0.001488 0.004241 -0.004150
3.900000 3.706232 1.532987 -0.068546 -0.004581 0.002048 -0.006015
