t x y theta dxdt dydt dthetadt
0.000000 0.000000 0.000000 -0.283271 0.008170 0.000293 0.005995
0.033333 0.000143 0.000059 -0.278556 0.011501 0.000321 0.007414
0.066667 0.000445 0.000188 -0.283182 0.015877 0.000063 0.007898
0.100000 0.001018 0.000322 -0.283070 0.021851 -0.000637 0.008784
0.133333 0.001689 0.000333 -0.286592 0.029954 -0.001903 0.005058
0.166667 0.002501 0.000312 -0.285382 0.041087 -0.003834 -0.005750
0.200000 0.003459 0.000261 -0.279931 0.056310 -0.006553 -0.027741
0.233333 0.004564 0.000179 -0.282523 0.077129 -0.010147 -0.065457
0.266667 0.005819 0.000068 -0.277106 0.104619 -0.014605 -0.123184
0.300000 0.007227 -0.000071 -0.281781 0.139296 -0.019787 -0.202901
0.333333 0.010252 -0.000535 -0.280425 0.181561 -0.025547 -0.299497
0.366667 0.013432 -0.001025 -0.280644 0.231098 -0.031710 -0.408831
0.400000 0.019425 -0.001967 -0.277945 0.286976 -0.037860 -0.522429
0.433333 0.028968 -0.003763 -0.284309 0.347095 -0.043583 -0.630427
0.466667 0.038659 -0.005580 -0.326046 0.409363 -0.048396 -0.720018
0.500000 0.052798 -0.007687 -0.358356 0.471598 -0.051863 -0.783207
0.533333 0.071767 -0.010410 -0.411558 0.531098 -0.053486 -0.816130
0.566667 0.096094 -0.012694 -0.474862 0.585086 -0.052824 -0.816445
0.600000 0.120511 -0.014987 -0.516797 0.630667 -0.049773 -0.784812
0.633333 0.144992 -0.017287 -0.549036 0.665633 -0.044293 -0.726098
0.666667 0.169516 -0.019590 -0.567640 0.687982 -0.036586 -0.651290
0.700000 0.194060 -0.021892 -0.582187 0.696348 -0.026936 -0.569751
0.733333 0.221866 -0.022603 -0.595229 0.690438 -0.015989 -0.488023
0.766667 0.249643 -0.023309 -0.599691 0.670848 -0.004317 -0.411458
0.800000 0.274851 -0.022606 -0.589779 0.639282 0.007450 -0.343124
0.833333 0.299979 -0.021894 -0.574801 0.597822 0.018676 -0.283402
0.866667 0.320507 -0.020462 -0.583350 0.548777 0.028940 -0.228100
0.900000 0.340913 -0.019022 -0.613668 0.494298 0.037918 -0.168765
0.933333 0.356203 -0.016915 -0.636377 0.436897 0.045671 -0.097468
0.966667 0.367420 -0.014365 -0.662481 0.378978 0.052186 -0.004483
1.000000 0.375813 -0.011856 -0.662287 0.322334 0.057746 0.113604
1.033333 0.382857 -0.009778 -0.667046 0.268528 0.062705 0.260440
1.066667 0.388767 -0.008086 -0.649334 0.219201 0.067090 0.432109
1.100000 0.394504 -0.006392 -0.637719 0.176136 0.070704 0.619202
1.133333 0.400064 -0.004696 -0.610434 0.140236 0.073031 0.805899
1.166667 0.405446 -0.003000 -0.589645 0.111743 0.073630 0.975309
1.200000 0.405875 0.000493 -0.561952 0.091056 0.071788 1.120728
1.233333 0.406125 0.003983 -0.518543 0.078365 0.066721 1.233756
1.266667 0.406202 0.007470 -0.429253 0.073317 0.058029 1.312209
1.300000 0.406108 0.010949 -0.339472 0.075057 0.045693 1.352610
1.333333 0.405846 0.014420 -0.282797 0.082521 0.030172 1.359490
1.366667 0.405421 0.017879 -0.238291 0.094965 0.011891 1.335950
1.400000 0.406948 0.019207 -0.213905 0.110889 -0.008242 1.279055
1.433333 0.411278 0.018247 -0.177516 0.128641 -0.029091 1.186135
1.466667 0.419148 0.014114 -0.146836 0.146516 -0.049400 1.058766
1.500000 0.426852 0.009977 -0.113051 0.163054 -0.068102 0.904850
1.533333 0.434385 0.005840 -0.070189 0.176867 -0.084683 0.730384
1.566667 0.441742 0.001710 -0.034895 0.186445 -0.098840 0.543377
1.600000 0.448916 -0.002405 0.005302 0.191073 -0.110895 0.352850
1.633333 0.455903 -0.006500 0.029200 0.190536 -0.121552 0.171086
1.666667 0.462699 -0.010569 0.035015 0.185240 -0.132045 0.001913
1.700000 0.469298 -0.014604 0.026854 0.175841 -0.143474 -0.157968
1.733333 0.475695 -0.018599 -0.010141 0.163720 -0.156189 -0.314846
1.766667 0.481887 -0.022547 -0.071270 0.150502 -0.170127 -0.473511
1.800000 0.487869 -0.026442 -0.126540 0.137801 -0.184685 -0.635016
1.833333 0.493637 -0.030277 -0.154474 0.127183 -0.199055 -0.802503
1.866667 0.496288 -0.037513 -0.144768 0.120143 -0.211873 -0.972092
1.900000 0.497278 -0.047131 -0.131680 0.117804 -0.221834 -1.130834
1.933333 0.498508 -0.058141 -0.121187 0.120528 -0.228150 -1.259744
1.966667 0.499521 -0.069045 -0.136794 0.128521 -0.230154 -1.343760
2.000000 0.500317 -0.079829 -0.207849 0.141436 -0.227410 -1.366474
2.033333 0.503829 -0.088904 -0.313168 0.158140 -0.219557 -1.307129
2.066667 0.509987 -0.095741 -0.441078 0.176605 -0.206889 -1.147471
2.100000 0.515924 -0.102418 -0.551430 0.194802 -0.189982 -0.881143
2.133333 0.524515 -0.107566 -0.617353 0.210696 -0.169515 -0.517252
2.166667 0.535249 -0.112301 -0.664497 0.222111 -0.146374 -0.069959
2.200000 0.545738 -0.116849 -0.676023 0.227302 -0.121518 0.428870
2.233333 0.555973 -0.121199 -0.640131 0.225429 -0.095786 0.935586
2.266667 0.565945 -0.125344 -0.550497 0.216594 -0.069607 1.404544
2.300000 0.575281 -0.128184 -0.461593 0.200805 -0.043401 1.799287
2.333333 0.583078 -0.129371 -0.327369 0.178799 -0.017527 2.095705
2.366667 0.588913 -0.129109 -0.182516 0.151458 0.007528 2.280218
2.400000 0.592394 -0.127364 -0.056967 0.119799 0.031191 2.358237
2.433333 0.595580 -0.125382 0.051734 0.084283 0.052646 2.348887
2.466667 0.597442 -0.122118 0.125725 0.045070 0.070859 2.278206
2.500000 0.599006 -0.118613 0.166884 0.002562 0.085055 2.172598
2.533333 0.599916 -0.114240 0.194184 -0.043341 0.094624 2.065822
2.566667 0.599756 -0.109065 0.225835 -0.092604 0.099306 1.986377
2.600000 0.597764 -0.103897 0.295882 -0.145614 0.099080 1.948809
2.633333 0.592462 -0.099706 0.362606 -0.201954 0.094322 1.959008
2.666667 0.586874 -0.095270 0.408201 -0.261240 0.085790 2.014815
2.700000 0.576655 -0.092414 0.462186 -0.322723 0.074534 2.105662
2.733333 0.566171 -0.089306 0.525038 -0.385607 0.061592 2.208861
2.766667 0.551785 -0.087410 0.604595 -0.448773 0.048163 2.301900
2.800000 0.534302 -0.086510 0.698387 -0.510594 0.035499 2.372555
2.833333 0.514171 -0.086893 0.792997 -0.570047 0.024652 2.410010
2.866667 0.493849 -0.087001 0.908228 -0.625970 0.016622 2.402411
2.900000 0.471153 -0.088013 1.011836 -0.677682 0.012097 2.347707
2.933333 0.446191 -0.089291 1.092205 -0.724364 0.011893 2.249922
2.966667 0.421118 -0.090269 1.175569 -0.765946 0.016562 2.116432
3.000000 0.393428 -0.090798 1.254442 -0.802693 0.026549 1.954991
3.033333 0.363436 -0.090140 1.310688 -0.834825 0.042187 1.775754
3.066667 0.333431 -0.089157 1.365781 -0.862495 0.063647 1.593403
3.100000 0.303449 -0.087841 1.409988 -0.885789 0.090923 1.418501
3.133333 0.273526 -0.086185 1.440405 -0.905041 0.123889 1.257866
3.166667 0.243696 -0.084181 1.467670 -0.920257 0.162283 1.116372
3.200000 0.212446 -0.079861 1.487399 -0.931441 0.205771 0.993259
3.233333 0.180090 -0.073141 1.517461 -0.938639 0.254141 0.884675
3.266667 0.147133 -0.064366 1.542681 -0.941886 0.307105 0.786910
3.300000 0.114247 -0.053706 1.571891 -0.941239 0.364226 0.694197
3.333333 0.081467 -0.040941 1.606738 -0.936582 0.424583 0.603224
3.366667 0.049221 -0.026340 1.633516 -0.927705 0.487562 0.512280
3.400000 0.017604 -0.009488 1.640525 -0.914548 0.552319 0.429934
3.433333 -0.012935 0.009421 1.662117 -0.897245 0.617728 0.364771
3.466667 -0.043350 0.031802 1.671816 -0.876262 0.682387 0.327803
3.500000 -0.073279 0.054504 1.684622 -0.851859 0.745279 0.332270
3.533333 -0.102316 0.080670 1.670546 -0.824231 0.805598 0.391749
3.566667 -0.130031 0.110321 1.662789 -0.793647 0.861702 0.513730
3.600000 -0.155702 0.142956 1.642819 -0.760059 0.911863 0.690561
3.633333 -0.180738 0.175837 1.631157 -0.722895 0.954350 0.914975
3.666667 -0.205102 0.208942 1.639968 -0.681211 0.987661 1.170483
3.700000 -0.227221 0.245920 1.671438 -0.634311 1.009410 1.433401
3.733333 -0.248602 0.283069 1.757702 -0.581746 1.017770 1.670095
3.766667 -0.269212 0.320363 1.836135 -0.523104 1.011564 1.852880
3.800000 -0.289020 0.357774 1.935699 -0.458098 0.990058 1.959360
3.833333 -0.305833 0.395128 2.048232 -0.387131 0.952793 1.968918
3.866667 -0.319877 0.431559 2.165741 -0.311228 0.899933 1.874730
3.900000 -0.330472 0.465595 2.271708 -0.231706 0.833150 1.688038
3.933333 -0.337302 0.496206 2.352237 -0.150019 0.753852 1.439865
3.966667 -0.340258 0.522187 2.404852 -0.067997 0.664112 1.161883
4.000000 -0.339369 0.543443 2.440717 0.012171 0.566556 0.894335
4.033333 -0.334752 0.558883 2.428326 0.088580 0.464651 0.683294
4.066667 -0.329174 0.574288 2.400168 0.159972 0.361021 0.562116
4.100000 -0.320720 0.583870 2.369132 0.225742 0.257747 0.547788
4.133333 -0.309658 0.588112 2.321711 0.286005 0.156641 0.639120
4.166667 -0.297065 0.587781 2.258539 0.341413 0.059099 0.829938
4.200000 -0.283499 0.587441 2.258401 0.393164 -0.034274 1.099062
4.233333 -0.269562 0.583831 2.311823 0.442382 -0.122257 1.409284
4.266667 -0.254892 0.577573 2.404212 0.489898 -0.202753 1.725652
4.300000 -0.238824 0.568621 2.504202 0.536201 -0.273715 2.017191
4.333333 -0.221294 0.557081 2.628539 0.580982 -0.331642 2.256765
4.366667 -0.202795 0.545640 2.753330 0.623816 -0.373644 2.418225
4.400000 -0.182367 0.530857 2.863102 0.664084 -0.395788 2.490344
4.433333 -0.158823 0.511650 2.974657 0.701607 -0.396810 2.475341
4.466667 -0.130352 0.485653 3.051129 0.736016 -0.375354 2.383157
4.500000 -0.100942 0.459895 3.118079 0.767034 -0.330445 2.226797
4.533333 -0.070605 0.434417 -3.095492 0.794895 -0.263522 2.025845
4.566667 -0.044803 0.429371 -3.038486 0.820244 -0.177343 1.804358
4.600000 -0.018093 0.424672 -2.972010 0.843933 -0.076406 1.577434
4.633333 0.009516 0.420343 -2.905992 0.866860 0.035236 1.358033
4.666667 0.036640 0.427232 -2.871370 0.890657 0.151137 1.154258
4.700000 0.064647 0.434520 -2.847489 0.917043 0.265028 0.971349
4.733333 0.094558 0.449473 -2.821425 0.947594 0.371127 0.809857
4.766667 0.125806 0.469441 -2.813235 0.982987 0.466628 0.668164
4.800000 0.159059 0.493016 -2.807232 1.023367 0.549224 0.548245
4.833333 0.193153 0.516988 -2.794763 1.068538 0.617445 0.449969
4.866667 0.228075 0.541350 -2.793460 1.117578 0.672490 0.372539
4.900000 0.263810 0.566092 -2.779714 1.169426 0.715789 0.316624
4.933333 0.302947 0.592032 -2.769231 1.222849 0.750087 0.282708
4.966667 0.344876 0.618829 -2.758011 1.276874 0.777191 0.269614
5.000000 0.389104 0.645972 -2.741158 1.330914 0.799551 0.274040
5.033333 0.435557 0.672866 -2.729405 1.384150 0.819437 0.295053
5.066667 0.483970 0.699687 -2.743635 1.435935 0.838227 0.330105
5.100000 0.533687 0.726821 -2.740472 1.485512 0.856997 0.373595
5.133333 0.584062 0.754263 -2.739048 1.532411 0.876132 0.424793
5.166667 0.636736 0.783669 -2.734375 1.576533 0.895630 0.480346
5.200000 0.690011 0.813358 -2.707709 1.617732 0.915154 0.536640
5.233333 0.745235 0.844737 -2.655714 1.656252 0.934339 0.585233
5.266667 0.801991 0.877516 -2.651698 1.692485 0.952735 0.622550
5.300000 0.859250 0.910534 -2.621387 1.726956 0.970044 0.646512
5.333333 0.918259 0.944190 -2.597335 1.760016 0.985997 0.653430
5.366667 0.977701 0.978052 -2.557559 1.791800 1.000451 0.642337
5.400000 1.037975 1.011807 -2.533874 1.822407 1.013322 0.615481
5.433333 1.099127 1.045522 -2.509312 1.851761 1.024710 0.579650
5.466667 1.160598 1.079392 -2.489259 1.879702 1.034867 0.536546
5.500000 1.224292 1.114062 -2.481643 1.905902 1.043971 0.490675
5.533333 1.288226 1.148853 -2.479350 1.930214 1.052277 0.442655
5.566667 1.353802 1.184367 -2.464819 1.952396 1.059906 0.395070
5.600000 1.420626 1.220275 -2.453241 1.972201 1.066980 0.348765
5.633333 1.487561 1.256248 -2.443323 1.989466 1.073548 0.303179
5.666667 1.555340 1.292688 -2.419823 2.004028 1.079637 0.258009
5.700000 1.623140 1.329154 -2.404848 2.016046 1.085386 0.210553
5.733333 1.691128 1.365575 -2.410146 2.025408 1.090802 0.164338
5.766667 1.759076 1.401809 -2.407062 2.032243 1.096012 0.121166
5.800000 1.826908 1.438010 -2.389382 2.036901 1.101183 0.081251
5.833333 1.894578 1.474159 -2.389866 2.039796 1.106563 0.045434
5.866667 1.963201 1.511151 -2.399924 2.041281 1.112233 0.017270
5.900000 2.031569 1.548050 -2.406896 2.041609 1.118248 0.001628
5.933333 2.100175 1.585652 -2.418783 2.041159 1.124642 -0.004519
5.966667 2.168432 1.623120 -2.421100 2.040191 1.131364 -0.002672
6.000000 2.236873 1.661421 -2.413527 2.038585 1.138117 0.007790
6.033333 2.304871 1.699544 -2.426789 2.036009 1.144444 0.026606
6.066667 2.372131 1.737683 -2.413913 2.032321 1.150095 0.049882
6.100000 2.438853 1.775600 -2.407412 2.027203 1.154720 0.073408
6.133333 2.506720 1.814524 -2.405110 2.020257 1.158001 0.096689
6.166667 2.575219 1.854137 -2.398505 2.010784 1.159407 0.118852
6.200000 2.643036 1.893459 -2.395361 1.998004 1.158456 0.139317
6.233333 2.710868 1.932885 -2.392296 1.981185 1.154716 0.154607
6.266667 2.777856 1.972109 -2.391793 1.958865 1.147220 0.166768
6.300000 2.844013 2.010969 -2.383803 1.929109 1.134593 0.175793
6.333333 2.909291 2.049441 -2.376063 1.890225 1.115619 0.181330
6.366667 2.973641 2.087502 -2.366041 1.841129 1.089547 0.181911
6.400000 3.036927 2.125465 -2.357562 1.781352 1.055960 0.175807
6.433333 3.098565 2.162574 -2.353273 1.710616 1.014551 0.168080
6.466667 3.159134 2.199201 -2.350302 1.629883 0.965916 0.161445
6.500000 3.216282 2.233530 -2.336973 1.541561 0.911792 0.160813
6.533333 3.268382 2.264714 -2.325088 1.448245 0.854041 0.174686
6.566667 3.319290 2.295356 -2.324257 1.352240 0.794295 0.210952
6.600000 3.361609 2.320283 -2.321195 1.254806 0.733305 0.280310
6.633333 3.394897 2.338516 -2.327762 1.157685 0.672234 0.386410
6.666667 3.426910 2.356177 -2.335302 1.062010 0.611800 0.532874
6.700000 3.457631 2.373263 -2.339730 0.967880 0.551915 0.721047
6.733333 3.487042 2.389771 -2.334711 0.874743 0.492050 0.939753
6.766667 3.515128 2.405698 -2.297426 0.782047 0.431677 1.174004
6.800000 3.541874 2.421041 -2.252336 0.690660 0.371686 1.396861
6.833333 3.567266 2.435799 -2.207005 0.599817 0.311702 1.584780
6.866667 3.591291 2.449970 -2.124316 0.508557 0.251189 1.711351
6.900000 3.613935 2.463552 -2.064446 0.415905 0.189666 1.755145
6.933333 3.619338 2.462717 -1.948665 0.322409 0.127981 1.706429
6.966667 3.623355 2.461308 -1.843210 0.228559 0.066977 1.566112
7.000000 3.625993 2.459341 -1.725579 0.134084 0.006789 1.344931
7.033333 3.627259 2.456830 -1.635337 0.040110 -0.051369 1.055863
7.066667 3.627163 2.453790 -1.607539 -0.051866 -0.105941 0.722357
7.100000 3.625714 2.450238 -1.617561 -0.139916 -0.155132 0.365955
7.133333 3.622923 2.446190 -1.666859 -0.224516 -0.199315 0.012485
7.166667 3.614147 2.438330 -1.713004 -0.305640 -0.238582 -0.318443
7.200000 3.601721 2.428117 -1.739012 -0.383031 -0.272893 -0.606977
7.233333 3.585491 2.416302 -1.778959 -0.456624 -0.302399 -0.837907
7.266667 3.566543 2.403560 -1.805203 -0.526405 -0.327436 -1.011396
7.300000 3.545643 2.390350 -1.842511 -0.592654 -0.348512 -1.129135
7.333333 3.522861 2.377012 -1.897528 -0.654404 -0.365155 -1.199156
7.366667 3.498565 2.363450 -1.946532 -0.711645 -0.377396 -1.229953
7.400000 3.472927 2.349950 -1.979904 -0.764662 -0.385628 -1.230577
7.433333 3.446307 2.336757 -2.025735 -0.814066 -0.390508 -1.204007
7.466667 3.418607 2.323934 -2.071923 -0.860730 -0.392804 -1.144845
7.500000 3.389848 2.310874 -2.120960 -0.905590 -0.393076 -1.049004
7.533333 3.359217 2.297789 -2.159663 -0.949619 -0.391808 -0.916672
7.566667 3.326785 2.284660 -2.204106 -0.993248 -0.389087 -0.743399
7.600000 3.293396 2.271365 -2.245932 -1.036814 -0.384763 -0.526893
7.633333 3.257648 2.258169 -2.275354 -1.080366 -0.378500 -0.273185
7.666667 3.221018 2.244855 -2.278495 -1.123832 -0.369817 0.008052
7.700000 3.181782 2.232325 -2.292462 -1.166669 -0.358711 0.309376
7.733333 3.141743 2.219724 -2.287174 -1.208420 -0.345169 0.624829
7.766667 3.100943 2.207072 -2.238517 -1.248589 -0.329619 0.936847
7.800000 3.059424 2.194393 -2.189903 -1.286776 -0.312043 1.230817
7.833333 3.014929 2.184291 -2.138332 -1.322648 -0.292646 1.495826
7.866667 2.969803 2.174203 -2.078633 -1.355871 -0.271690 1.723943
7.900000 2.922320 2.167313 -1.996726 -1.386453 -0.249339 1.902499
7.933333 2.874298 2.160473 -1.921033 -1.414333 -0.225774 2.024669
7.966667 2.825786 2.153701 -1.829337 -1.439534 -0.200929 2.095499
8.000000 2.776832 2.147011 -1.743375 -1.461871 -0.175265 2.117493
8.033333 2.727483 2.140419 -1.653329 -1.481428 -0.148839 2.094911
8.066667 2.677788 2.133941 -1.574586 -1.498175 -0.121453 2.034441
8.100000 2.627796 2.127592 -1.519057 -1.512232 -0.092235 1.949443
8.133333 2.576178 2.127161 -1.449410 -1.523604 -0.060793 1.850871
8.166667 2.524362 2.126883 -1.381042 -1.532173 -0.026631 1.744141
8.200000 2.472397 2.126766 -1.333110 -1.537724 0.010431 1.637016
8.233333 2.420334 2.126820 -1.295835 -1.539599 0.050411 1.536591
8.266667 2.368223 2.127052 -1.253504 -1.537048 0.092850 1.445740
8.300000 2.316114 2.127469 -1.213889 -1.529186 0.136573 1.364826
8.333333 2.263796 2.133249 -1.173318 -1.514847 0.180898 1.289639
8.366667 2.211579 2.139225 -1.119675 -1.493123 0.224925 1.221139
8.400000 2.160870 2.148421 -1.073315 -1.463593 0.267800 1.157001
8.433333 2.110413 2.160508 -1.050744 -1.425760 0.308397 1.097028
8.466667 2.060203 2.172786 -0.989841 -1.379670 0.345785 1.040010
8.500000 2.011796 2.186535 -0.967483 -1.325498 0.379153 0.987123
8.533333 1.965790 2.201279 -0.938239 -1.263758 0.408080 0.941642
8.566667 1.923199 2.216855 -0.905412 -1.194252 0.432155 0.902249
8.600000 1.884907 2.232956 -0.881608 -1.116711 0.451510 0.868436
8.633333 1.847071 2.249210 -0.858903 -1.031799 0.466665 0.833505
8.666667 1.815644 2.265134 -0.852978 -0.940360 0.478211 0.796987
8.700000 1.784734 2.281194 -0.827769 -0.842992 0.486959 0.751380
8.733333 1.754368 2.297379 -0.801283 -0.740950 0.493399 0.693541
8.766667 1.731680 2.314437 -0.753574 -0.637284 0.498171 0.620461
8.800000 1.709578 2.331601 -0.711870 -0.534512 0.501721 0.530413
8.833333 1.688079 2.348862 -0.676242 -0.434564 0.504340 0.428814
8.866667 1.676262 2.366138 -0.668254 -0.339133 0.506244 0.319025
8.900000 1.675284 2.382904 -0.662110 -0.250883 0.507593 0.210672
8.933333 1.674926 2.399736 -0.665451 -0.171813 0.508438 0.110780
8.966667 1.675181 2.416623 -0.668396 -0.102116 0.508820 0.031135
9.000000 1.676041 2.433557 -0.687986 -0.042299 0.508745 -0.017180
9.033333 1.677500 2.450527 -0.709338 0.007078 0.508143 -0.030417
9.066667 1.679549 2.467523 -0.728425 0.046418 0.506884 -0.009014
9.100000 1.682180 2.484537 -0.741784 0.077783 0.504635 0.045061
9.133333 1.685385 2.501559 -0.755196 0.103011 0.501023 0.129560
9.166667 1.689154 2.518578 -0.731016 0.123336 0.495687 0.230629
9.200000 1.693477 2.535586 -0.714508 0.139960 0.488122 0.334930
9.233333 1.698344 2.552573 -0.699275 0.154196 0.477904 0.435099
9.266667 1.704673 2.569137 -0.688178 0.166679 0.464757 0.527469
9.300000 1.711616 2.585201 -0.645149 0.177293 0.448708 0.603700
9.333333 1.719069 2.601217 -0.614843 0.186184 0.429865 0.656486
9.366667 1.726270 2.616219 -0.588463 0.193588 0.408267 0.692101
9.400000 1.733134 2.630113 -0.570232 0.199871 0.384212 0.715345
9.433333 1.739835 2.642670 -0.542491 0.205425 0.358189 0.726045
9.466667 1.746042 2.653848 -0.508418 0.210701 0.330657 0.721054
9.500000 1.752701 2.664948 -0.497457 0.216115 0.301895 0.707956
9.533333 1.759312 2.674206 -0.486128 0.221990 0.272426 0.691110
9.566667 1.766157 2.682405 -0.452321 0.228384 0.242804 0.665065
9.600000 1.773589 2.689724 -0.419135 0.235201 0.213573 0.625367
9.633333 1.781430 2.696960 -0.403070 0.242221 0.184982 0.573319
9.666667 1.789971 2.702883 -0.379894 0.248963 0.157230 0.513871
9.700000 1.799081 2.707312 -0.350647 0.254922 0.130669 0.442361
9.733333 1.808327 2.710205 -0.335068 0.259442 0.105252 0.359708
9.766667 1.817936 2.713029 -0.319983 0.262174 0.080987 0.272411
9.800000 1.826958 2.714328 -0.316824 0.262925 0.057836 0.189736
9.833333 1.836318 2.715571 -0.309875 0.261557 0.035863 0.116727
9.866667 1.846006 2.716766 -0.307978 0.258289 0.015209 0.055154
9.900000 1.854455 2.716385 -0.320647 0.253398 -0.004107 0.012965
9.933333 1.863210 2.715973 -0.341015 0.247254 -0.021980 -0.006100
9.966667 1.872261 2.715539 -0.353214 0.239925 -0.038454 0.001620
10.000000 1.879544 2.713314 -0.354540 0.231479 -0.053601 0.031656
10.033333 1.887105 2.711088 -0.362300 0.221835 -0.067565 0.081194
10.066667 1.893554 2.707395 -0.347441 0.210914 -0.080412 0.146448
10.100000 1.900266 2.703725 -0.350185 0.198568 -0.092323 0.220155
10.133333 1.907234 2.700092 -0.340272 0.184837 -0.103355 0.291702
10.166667 1.914453 2.696510 -0.316680 0.170067 -0.113193 0.344110
10.200000 1.921430 2.692970 -0.311634 0.154195 -0.121479 0.373131
10.233333 1.927414 2.689382 -0.298931 0.137562 -0.127709 0.373043
10.266667 1.931935 2.685100 -0.266418 0.119967 -0.131440 0.343195
10.300000 1.934393 2.679748 -0.223872 0.101428 -0.132020 0.283088
10.333333 1.937079 2.674514 -0.211767 0.081823 -0.128863 0.201707
10.366667 1.938175 2.668575 -0.191742 0.061146 -0.121764 0.116110
10.400000 1.939499 2.662785 -0.191528 0.039708 -0.110820 0.031603
10.433333 1.941053 2.657160 -0.193647 0.017403 -0.096215 -0.044533
10.466667 1.942837 2.651717 -0.204629 -0.005111 -0.078371 -0.109134
10.500000 1.943929 2.648559 -0.257468 -0.027298 -0.058037 -0.158046
10.533333 1.942990 2.648220 -0.283274 -0.048220 -0.036138 -0.200702
10.566667 1.942289 2.648100 -0.300325 -0.067141 -0.013482 -0.249746
10.600000 1.936859 2.649652 -0.308061 -0.082617 0.009370 -0.310855
10.633333 1.931683 2.651443 -0.295610 -0.092880 0.032025 -0.389091
10.666667 1.926769 2.653481 -0.270369 -0.096564 0.054396 -0.484744
10.700000 1.922128 2.655773 -0.253249 -0.092496 0.076899 -0.597848
10.733333 1.915960 2.658227 -0.264505 -0.079936 0.100394 -0.714653
10.766667 1.909317 2.661031 -0.266538 -0.058063 0.125725 -0.822571
10.800000 1.904233 2.664302 -0.305417 -0.027438 0.153684 -0.911671
10.833333 1.901655 2.668390 -0.369213 0.010934 0.184681 -0.973838
10.866667 1.901938 2.673313 -0.461037 0.055755 0.218789 -1.003042
10.900000 1.904731 2.679523 -0.559217 0.105719 0.255664 -0.995877
10.933333 1.909575 2.687645 -0.627154 0.159017 0.294455 -0.957975
10.966667 1.915878 2.698105 -0.645516 0.213324 0.334056 -0.895649
11.000000 1.923591 2.710686 -0.639313 0.267056 0.373309 -0.819087
11.033333 1.933305 2.725328 -0.614401 0.319061 0.411291 -0.740029
11.066667 1.946081 2.741347 -0.605852 0.368531 0.447376 -0.672574
11.100000 1.962000 2.758720 -0.616163 0.414556 0.481121 -0.625960
11.133333 1.978226 2.776372 -0.644820 0.456911 0.512591 -0.601201
11.166667 1.994750 2.794296 -0.672932 0.495859 0.542276 -0.593459
11.200000 2.011559 2.812483 -0.702583 0.531606 0.570976 -0.591940
11.233333 2.031088 2.832006 -0.733338 0.564020 0.599399 -0.582551
11.266667 2.050876 2.851775 -0.763259 0.593108 0.628110 -0.551476
11.300000 2.070911 2.871780 -0.792773 0.619277 0.657630 -0.493497
11.333333 2.091951 2.892655 -0.828196 0.642700 0.688014 -0.407943
11.366667 2.114581 2.915236 -0.841979 0.663338 0.719124 -0.299449
11.400000 2.138088 2.939712 -0.859242 0.681100 0.750327 -0.174783
11.433333 2.162195 2.966045 -0.853348 0.696215 0.781007 -0.045685
11.466667 2.186658 2.994218 -0.837930 0.708728 0.810457 0.076484
11.500000 2.211265 3.022544 -0.822031 0.718534 0.837919 0.188068
11.533333 2.235859 3.052516 -0.815622 0.725626 0.862679 0.283543
11.566667 2.260560 3.082602 -0.790343 0.730236 0.884069 0.358971
11.600000 2.285348 3.112782 -0.768255 0.732692 0.901792 0.410705
11.633333 2.309924 3.143662 -0.770173 0.733262 0.915648 0.442682
11.666667 2.334551 3.174593 -0.747404 0.732222 0.925634 0.458258
11.700000 2.359172 3.206758 -0.717649 0.729798 0.931580 0.457754
11.733333 2.383806 3.238930 -0.702380 0.726183 0.933542 0.442959
11.766667 2.408102 3.271043 -0.686581 0.721484 0.931563 0.417346
11.800000 2.432374 3.303118 -0.677688 0.715769 0.925636 0.386389
11.833333 2.456605 3.335131 -0.666669 0.708933 0.915540 0.348027
11.866667 2.480066 3.366106 -0.654229 0.700936 0.900906 0.305965
11.900000 2.503450 3.396974 -0.633155 0.691795 0.881822 0.266454
11.933333 2.526622 3.427174 -0.625821 0.681617 0.858484 0.237865
11.966667 2.549640 3.456656 -0.616716 0.670371 0.830725 0.225780
12.000000 2.572194 3.484954 -0.618729 0.657951 0.798079 0.232692
12.033333 2.594222 3.511560 -0.622495 0.644353 0.760441 0.264335
12.066667 2.615335 3.536372 -0.631862 0.629417 0.718034 0.318272
12.100000 2.636273 3.560964 -0.626366 0.612763 0.670912 0.387894
12.133333 2.657021 3.585318 -0.613800 0.593720 0.619102 0.462569
12.166667 2.676677 3.606085 -0.615386 0.571729 0.563890 0.534193
12.200000 2.695697 3.623473 -0.601525 0.546401 0.507333 0.592769
12.233333 2.714485 3.640590 -0.567596 0.517344 0.451655 0.627449
12.266667 2.733030 3.657428 -0.515106 0.484349 0.398802 0.630837
12.300000 2.750273 3.669063 -0.455435 0.447684 0.351023 0.598890
12.333333 2.766141 3.676323 -0.405429 0.408099 0.310690 0.531079
12.366667 2.780501 3.680570 -0.376597 0.366530 0.278987 0.424823
12.400000 2.792899 3.683518 -0.387613 0.323735 0.256545 0.287940
12.433333 2.802682 3.686808 -0.402191 0.280742 0.243358 0.135034
12.466667 2.809630 3.692143 -0.402232 0.238712 0.239266 -0.014640
12.500000 2.814410 3.700143 -0.389661 0.198595 0.243085 -0.144783
12.533333 2.818897 3.707880 -0.395389 0.160922 0.253022 -0.243001
12.566667 2.822224 3.718196 -0.413830 0.125926 0.267192 -0.296360
12.600000 2.825263 3.728249 -0.454816 0.093964 0.283497 -0.303260
12.633333 2.828020 3.738035 -0.496668 0.064993 0.300097 -0.273664
12.666667 2.829910 3.749069 -0.523378 0.038596 0.315409 -0.224306
12.700000 2.831527 3.759832 -0.547757 0.014292 0.328518 -0.169732
12.733333 2.830642 3.772093 -0.556174 -0.007936 0.338550 -0.120655
12.766667 2.829496 3.784074 -0.532822 -0.027826 0.344929 -0.092912
12.800000 2.828095 3.795771 -0.487130 -0.045164 0.347315 -0.098607
12.833333 2.826448 3.807180 -0.461923 -0.059554 0.345306 -0.136896
12.866667 2.823156 3.819972 -0.459750 -0.070338 0.338287 -0.200439
12.900000 2.818663 3.833448 -0.443577 -0.077022 0.325701 -0.284382
12.933333 2.813952 3.846618 -0.440563 -0.079718 0.307385 -0.386135
12.966667 2.809815 3.858498 -0.473747 -0.079065 0.283602 -0.492846
13.000000 2.805483 3.870057 -0.516312 -0.075710 0.254619 -0.589624
13.033333 2.802981 3.878494 -0.588458 -0.070664 0.221227 -0.669173
13.066667 2.800302 3.886602 -0.632920 -0.065193 0.184651 -0.729821
13.100000 2.799408 3.891477 -0.677157 -0.060511 0.146518 -0.758585
13.133333 2.798351 3.896022 -0.691320 -0.057232 0.108457 -0.743221
13.166667 2.798605 3.898101 -0.676582 -0.055376 0.071864 -0.683615
13.200000 2.799096 3.898201 -0.663768 -0.054830 0.038256 -0.586869
13.233333 2.798735 3.896933 -0.697521 -0.054808 0.008515 -0.461128
13.266667 2.796881 3.894782 -0.743404 -0.054168 -0.016775 -0.313891
13.300000 2.793375 3.892438 -0.792173 -0.051423 -0.037841 -0.163066
13.333333 2.789741 3.889798 -0.819746 -0.045541 -0.055084 -0.024045
13.366667 2.785780 3.886969 -0.833941 -0.035761 -0.069204 0.095559
13.400000 2.781707 3.883859 -0.821226 -0.021573 -0.081198 0.194981
13.433333 2.778640 3.881105 -0.761722 -0.003098 -0.091941 0.269002
13.466667 2.777714 3.878702 -0.690720 0.018900 -0.102288 0.315452
13.500000 2.778731 3.876195 -0.638207 0.043013 -0.112627 0.333940
13.533333 2.781642 3.873242 -0.620750 0.067787 -0.123250 0.326614
13.566667 2.785885 3.869385 -0.625897 0.091666 -0.134180 0.298759
13.600000 2.791164 3.864468 -0.658046 0.113084 -0.145160 0.256722
13.633333 2.797036 3.858886 -0.664312 0.130692 -0.155504 0.216722
13.666667 2.803182 3.852889 -0.657341 0.143765 -0.164485 0.188545
13.700000 2.809231 3.846681 -0.671772 0.152177 -0.171588 0.179330
13.733333 2.815456 3.839712 -0.673942 0.156005 -0.176079 0.187652
13.766667 2.821575 3.832553 -0.677801 0.155425 -0.177117 0.208263
13.800000 2.827157 3.825573 -0.662550 0.150865 -0.174079 0.230467
13.833333 2.832190 3.819544 -0.633455 0.142915 -0.166930 0.239864
13.866667 2.837108 3.813356 -0.606328 0.132011 -0.155692 0.229312
13.900000 2.841909 3.807016 -0.586261 0.118395 -0.140422 0.196301
13.933333 2.846589 3.800535 -0.576698 0.102527 -0.121924 0.146986
13.966667 2.850037 3.796973 -0.543641 0.085165 -0.101664 0.083039
14.000000 2.853360 3.793285 -0.544483 0.066994 -0.081245 0.014786
14.033333 2.856558 3.789476 -0.562581 0.048642 -0.062081 -0.048367
14.066667 2.857943 3.788191 -0.597071 0.030961 -0.045963 -0.095920
14.100000 2.857277 3.789535 -0.613214 0.014943 -0.034693 -0.126043
14.133333 2.856487 3.790767 -0.628038 0.001372 -0.029368 -0.143003
14.166667 2.854589 3.793609 -0.629702 -0.009234 -0.030484 -0.144299
14.200000 2.852573 3.796337 -0.648183 -0.016513 -0.037976 -0.135624
14.233333 2.850554 3.797649 -0.642128 -0.020162 -0.051612 -0.122517
14.266667 2.849073 3.796110 -0.633032 -0.020499 -0.070083 -0.116701
14.300000 2.847485 3.794457 -0.629689 -0.018242 -0.091693 -0.120472
14.333333 2.846888 3.789510 -0.608485 -0.014383 -0.114601 -0.130331
14.366667 2.846190 3.784456 -0.614534 -0.009987 -0.136932 -0.144461
14.400000 2.846742 3.777195 -0.606453 -0.006207 -0.156937 -0.160316
14.433333 2.847194 3.769842 -0.624967 -0.004227 -0.173000 -0.171402
14.466667 2.848331 3.762104 -0.659624 -0.004817 -0.184435 -0.169114
14.500000 2.849369 3.754291 -0.678420 -0.008443 -0.190762 -0.150038
14.533333 2.850224 3.747085 -0.691043 -0.015103 -0.192219 -0.114677
14.566667 2.850979 3.739818 -0.696616 -0.024704 -0.189085 -0.067263
14.600000 2.850946 3.733109 -0.697421 -0.036697 -0.182050 -0.011414
14.633333 2.849810 3.726782 -0.712370 -0.050346 -0.171836 0.044195
14.666667 2.847318 3.721034 -0.688373 -0.064823 -0.158915 0.088512
14.700000 2.844731 3.715253 -0.677179 -0.079348 -0.143931 0.117631
14.733333 2.841132 3.710377 -0.648882 -0.093244 -0.127194 0.125752
14.766667 2.836820 3.706511 -0.624748 -0.105759 -0.109348 0.113266
14.800000 2.832426 3.702626 -0.618540 -0.116425 -0.090897 0.082413
14.833333 2.827667 3.699937 -0.630564 -0.124979 -0.072434 0.038878
14.866667 2.822837 3.697234 -0.623826 -0.131237 -0.054601 -0.007271
14.900000 2.817985 3.695816 -0.628539 -0.135014 -0.038046 -0.053777
14.933333 2.813380 3.695534 -0.638212 -0.136361 -0.023382 -0.091233
14.966667 2.808757 3.696112 -0.660322 -0.135502 -0.010950 -0.115973
15.000000 2.803705 3.697560 -0.677307 -0.132689 -0.001076 -0.124289
15.033333 2.798423 3.698966 -0.681183 -0.128069 0.006125 -0.118645
15.066667 2.793474 3.700198 -0.686519 -0.121968 0.010639 -0.101410
15.100000 2.788873 3.701010 -0.673246 -0.114753 0.012704 -0.073305
15.133333 2.785088 3.701558 -0.678084 -0.106725 0.012693 -0.041541
15.166667 2.781274 3.702078 -0.678876 -0.098093 0.011009 -0.009698
15.200000 2.779072 3.702192 -0.674147 -0.089213 0.008190 0.016544
15.233333 2.776847 3.702274 -0.688688 -0.080554 0.004738 0.039641
15.266667 2.774600 3.702321 -0.672104 -0.072506 0.001087 0.057413
15.300000 2.772332 3.702333 -0.672795 -0.065395 -0.002504 0.070711
15.333333 2.770046 3.702307 -0.658523 -0.059400 -0.005983 0.080701
15.366667 2.768374 3.701833 -0.662324 -0.054752 -0.009336 0.086485
15.400000 2.767328 3.701350 -0.659148 -0.051394 -0.012642 0.089628
15.433333 2.766266 3.700825 -0.659095 -0.049224 -0.016077 0.086781
