t x y theta dxdt dydt dthetadt
0.000000 0.000000 0.000000 -0.212071 0.036219 -0.146546 -1.141550
0.033333 0.001093 -0.004901 -0.255189 0.037587 -0.151433 -0.854783
0.066667 0.002206 -0.009853 -0.273506 0.039251 -0.156144 -0.509151
0.100000 0.003439 -0.015059 -0.271371 0.041173 -0.160648 -0.121505
0.133333 0.004812 -0.020523 -0.266290 0.043298 -0.164924 0.287302
0.166667 0.006339 -0.026244 -0.238553 0.045592 -0.168983 0.692113
0.200000 0.008038 -0.032217 -0.205746 0.048041 -0.172837 1.066042
0.233333 0.009758 -0.038225 -0.166395 0.050650 -0.176504 1.394932
0.266667 0.011500 -0.044264 -0.100160 0.053423 -0.179990 1.667794
0.300000 0.013264 -0.050329 -0.023465 0.056366 -0.183297 1.876622
0.333333 0.015049 -0.056416 0.071120 0.059526 -0.186461 2.017052
0.366667 0.016856 -0.062522 0.162047 0.062954 -0.189519 2.091804
0.400000 0.018893 -0.068841 0.258577 0.066685 -0.192504 2.107541
0.433333 0.021167 -0.075363 0.354212 0.070755 -0.195439 2.064721
0.466667 0.023462 -0.081890 0.431625 0.075180 -0.198340 1.972769
0.500000 0.025996 -0.088593 0.491694 0.079946 -0.201186 1.840773
0.533333 0.028769 -0.095455 0.538833 0.084975 -0.203908 1.683331
0.566667 0.031561 -0.102306 0.606443 0.090162 -0.206417 1.507179
0.600000 0.034588 -0.109284 0.647914 0.095390 -0.208629 1.321286
0.633333 0.037845 -0.116367 0.686087 0.100527 -0.210473 1.134376
0.666667 0.041329 -0.123535 0.710868 0.105452 -0.211874 0.948150
0.700000 0.045034 -0.130763 0.730525 0.110049 -0.212787 0.764971
0.733333 0.048954 -0.138029 0.756382 0.114242 -0.213200 0.582268
0.766667 0.053079 -0.145305 0.779963 0.117963 -0.213090 0.405541
0.800000 0.057212 -0.152531 0.806107 0.121175 -0.212451 0.236272
0.833333 0.061522 -0.159713 0.804677 0.123866 -0.211285 0.082127
0.866667 0.065836 -0.166832 0.815073 0.126042 -0.209612 -0.047478
0.900000 0.070151 -0.173883 0.788630 0.127738 -0.207454 -0.143848
0.933333 0.074467 -0.180858 0.782051 0.129009 -0.204835 -0.200769
0.966667 0.078780 -0.187753 0.752543 0.129925 -0.201790 -0.210507
1.000000 0.083183 -0.194481 0.719970 0.130522 -0.198335 -0.170961
1.033333 0.087580 -0.201116 0.683499 0.130838 -0.194459 -0.089075
1.066667 0.091967 -0.207652 0.674829 0.130901 -0.190164 0.020830
1.100000 0.096399 -0.213952 0.647561 0.130701 -0.185436 0.146233
1.133333 0.100817 -0.220141 0.666087 0.130213 -0.180255 0.276209
1.166667 0.105221 -0.226214 0.693328 0.129392 -0.174601 0.392877
1.200000 0.109606 -0.231999 0.753257 0.128225 -0.168489 0.480180
1.233333 0.113973 -0.237657 0.780429 0.126709 -0.161970 0.529696
1.266667 0.118318 -0.243181 0.816102 0.124816 -0.155060 0.542326
1.300000 0.122568 -0.248369 0.871734 0.122568 -0.147811 0.514712
1.333333 0.126695 -0.253206 0.897195 0.119991 -0.140290 0.445564
1.366667 0.130668 -0.257682 0.902436 0.117139 -0.132586 0.339611
1.400000 0.134614 -0.262005 0.878329 0.114024 -0.124734 0.211687
1.433333 0.138345 -0.265950 0.864148 0.110665 -0.116772 0.068536
1.466667 0.142046 -0.269733 0.870625 0.107105 -0.108756 -0.085611
1.500000 0.145479 -0.273124 0.904409 0.103373 -0.100723 -0.245088
1.533333 0.148882 -0.276345 0.895353 0.099484 -0.092674 -0.400129
1.566667 0.152253 -0.279394 0.876196 0.095456 -0.084591 -0.549253
1.600000 0.155324 -0.282043 0.842302 0.091352 -0.076506 -0.697412
1.633333 0.158364 -0.284513 0.830168 0.087205 -0.068416 -0.843121
1.666667 0.161372 -0.286799 0.773826 0.083050 -0.060315 -0.976731
1.700000 0.164084 -0.288695 0.763741 0.078910 -0.052194 -1.090010
1.733333 0.166502 -0.290205 0.721640 0.074818 -0.044063 -1.178990
1.766667 0.168890 -0.291523 0.654026 0.070799 -0.035934 -1.231041
1.800000 0.170994 -0.292463 0.587568 0.066868 -0.027808 -1.234228
1.833333 0.173071 -0.293207 0.540737 0.063059 -0.019704 -1.177807
1.866667 0.175122 -0.293753 0.497300 0.059422 -0.011651 -1.067024
1.900000 0.177149 -0.294099 0.458728 0.055965 -0.003654 -0.902408
1.933333 0.178917 -0.294079 0.398417 0.052708 0.004279 -0.688261
1.966667 0.180663 -0.293855 0.343553 0.049659 0.012149 -0.439751
2.000000 0.182163 -0.293267 0.326708 0.046800 0.019971 -0.171443
2.033333 0.183646 -0.292472 0.321927 0.044101 0.027770 0.101210
2.066667 0.184894 -0.291313 0.340483 0.041512 0.035583 0.368078
2.100000 0.186131 -0.289945 0.400944 0.039024 0.043417 0.613790
2.133333 0.187360 -0.288368 0.442856 0.036576 0.051313 0.823245
2.166667 0.188586 -0.286580 0.492926 0.034119 0.059300 0.989215
2.200000 0.189810 -0.284582 0.538461 0.031575 0.067429 1.104864
2.233333 0.190840 -0.282228 0.584761 0.028894 0.075729 1.164247
2.266667 0.191875 -0.279663 0.628538 0.026005 0.084243 1.163592
2.300000 0.192728 -0.276747 0.667217 0.022853 0.093001 1.102377
2.333333 0.193593 -0.273620 0.718740 0.019434 0.102000 0.981940
2.366667 0.194285 -0.270149 0.765050 0.015780 0.111214 0.795909
2.400000 0.194808 -0.266335 0.800517 0.011973 0.120579 0.541525
2.433333 0.195163 -0.262180 0.840945 0.008098 0.130036 0.218470
2.466667 0.195354 -0.257683 0.849171 0.004275 0.139499 -0.167586
2.500000 0.195382 -0.252847 0.871521 0.000610 0.148893 -0.610309
2.533333 0.195249 -0.247671 0.863378 -0.002809 0.158153 -1.094665
2.566667 0.194960 -0.242161 0.843631 -0.005926 0.167236 -1.593930
2.600000 0.194524 -0.236318 0.786995 -0.008681 0.176101 -2.079395
2.633333 0.193941 -0.230149 0.694458 -0.011032 0.184719 -2.519492
2.666667 0.193427 -0.223781 0.590587 -0.012953 0.193074 -2.889013
2.700000 0.192986 -0.217216 0.411442 -0.014416 0.201155 -3.155064
2.733333 0.192422 -0.210338 0.238086 -0.015375 0.208942 -3.296157
2.766667 0.191946 -0.203269 0.091504 -0.015823 0.216438 -3.298611
2.800000 0.191362 -0.195903 -0.049953 -0.015786 0.223669 -3.160610
2.833333 0.190671 -0.188241 -0.194000 -0.015308 0.230673 -2.895130
2.866667 0.189875 -0.180286 -0.298851 -0.014433 0.237486 -2.521490
2.900000 0.189199 -0.172153 -0.421072 -0.013205 0.244145 -2.072440
2.933333 0.188649 -0.163844 -0.497192 -0.011717 0.250715 -1.581605
2.966667 0.188234 -0.155364 -0.518877 -0.010006 0.257229 -1.081622
3.000000 0.187962 -0.146715 -0.519215 -0.008093 0.263706 -0.598124
3.033333 0.187842 -0.137903 -0.505191 -0.005988 0.270160 -0.144923
3.066667 0.187881 -0.128930 -0.458721 -0.003707 0.276604 0.272138
3.100000 0.187867 -0.119672 -0.420630 -0.001248 0.283038 0.649099
3.133333 0.187818 -0.110132 -0.370447 0.001451 0.289421 0.983814
3.166667 0.187756 -0.100313 -0.341463 0.004452 0.295717 1.282556
3.200000 0.187703 -0.090218 -0.321424 0.007835 0.301884 1.549815
3.233333 0.187853 -0.079984 -0.283880 0.011689 0.307859 1.783884
3.266667 0.188070 -0.069482 -0.227176 0.016128 0.313577 1.979139
3.300000 0.188509 -0.058852 -0.168650 0.021239 0.318999 2.130294
3.333333 0.189179 -0.048098 -0.073840 0.027069 0.324128 2.234914
3.366667 0.190019 -0.037097 0.049657 0.033643 0.328966 2.277608
3.400000 0.191110 -0.025983 0.172244 0.040961 0.333543 2.245879
3.433333 0.192460 -0.014763 0.289195 0.049016 0.337901 2.133891
3.466667 0.194079 -0.003441 0.359446 0.057760 0.342090 1.951967
3.500000 0.196021 0.008082 0.439435 0.067137 0.346130 1.714291
3.533333 0.198251 0.019696 0.512031 0.077094 0.350020 1.441860
3.566667 0.200777 0.031394 0.574999 0.087568 0.353775 1.168399
3.600000 0.203721 0.043251 0.591543 0.098490 0.357380 0.927306
3.633333 0.207098 0.055258 0.584622 0.109778 0.360818 0.749416
3.666667 0.210920 0.067406 0.557507 0.121361 0.364059 0.646618
3.700000 0.215193 0.079687 0.518118 0.133177 0.367093 0.629830
3.733333 0.219916 0.092098 0.500706 0.145153 0.369900 0.697866
3.766667 0.224987 0.104556 0.488989 0.157225 0.372444 0.842749
3.800000 0.230413 0.117057 0.526694 0.169350 0.374703 1.046652
3.833333 0.236202 0.129592 0.567137 0.181503 0.376665 1.287722
3.866667 0.242427 0.142222 0.627760 0.193679 0.378326 1.547506
3.900000 0.249078 0.154934 0.718673 0.205880 0.379675 1.800960
3.933333 0.256150 0.167715 0.803418 0.218131 0.380716 2.031799
3.966667 0.263616 0.180505 0.883768 0.230461 0.381457 2.217348
4.000000 0.271482 0.193297 0.974389 0.242902 0.381900 2.347959
4.033333 0.279758 0.206116 1.052371 0.255489 0.382032 2.417319
4.066667 0.288450 0.218922 1.118709 0.268256 0.381843 2.421750
4.100000 0.297563 0.231711 1.230025 0.281253 0.381326 2.363213
4.133333 0.307097 0.244473 1.330232 0.294544 0.380465 2.244725
4.166667 0.317066 0.257203 1.411637 0.308216 0.379236 2.076176
4.200000 0.327476 0.269895 1.518850 0.322338 0.377627 1.860663
4.233333 0.338333 0.282543 1.583506 0.336954 0.375642 1.606316
4.266667 0.349644 0.295140 1.652329 0.352103 0.373281 1.320852
4.300000 0.361415 0.307679 1.678675 0.367787 0.370554 1.017516
4.333333 0.373760 0.320088 1.710330 0.383953 0.367490 0.695152
4.366667 0.386715 0.332351 1.707223 0.400534 0.364126 0.356422
4.400000 0.400147 0.344538 1.704858 0.417505 0.360475 0.004925
4.433333 0.414257 0.356551 1.669814 0.434877 0.356535 -0.363093
4.466667 0.429085 0.368372 1.690650 0.452682 0.352293 -0.756377
4.500000 0.444666 0.379983 1.659673 0.470987 0.347725 -1.178686
4.533333 0.460741 0.391493 1.623633 0.489940 0.342767 -1.611791
4.566667 0.477312 0.402896 1.582703 0.509659 0.337372 -2.038961
4.600000 0.494385 0.414188 1.560140 0.530184 0.331525 -2.433694
4.633333 0.511961 0.425361 1.478944 0.551508 0.325231 -2.760432
4.666667 0.530044 0.436411 1.353920 0.573583 0.318512 -2.970721
4.700000 0.549078 0.447132 1.212008 0.596281 0.311422 -3.033311
4.733333 0.569083 0.457513 1.025266 0.619343 0.304069 -2.935451
4.766667 0.590075 0.467548 0.815102 0.642497 0.296569 -2.668167
4.800000 0.612066 0.477236 0.616946 0.665505 0.289022 -2.235755
4.833333 0.635069 0.486579 0.472104 0.688114 0.281537 -1.661152
4.866667 0.659091 0.495580 0.420851 0.710048 0.274231 -0.989195
4.900000 0.683624 0.504425 0.415466 0.731128 0.267177 -0.261376
4.933333 0.708666 0.513112 0.485401 0.751291 0.260401 0.478198
4.966667 0.734214 0.521637 0.586274 0.770593 0.253877 1.181405
5.000000 0.760267 0.529997 0.696090 0.789126 0.247559 1.803095
5.033333 0.786821 0.538187 0.808981 0.807066 0.241364 2.312624
5.066667 0.813875 0.546207 0.901510 0.824706 0.235165 2.702380
5.100000 0.841424 0.554051 1.008944 0.842339 0.228831 2.970010
5.133333 0.869950 0.561556 1.128579 0.860177 0.222265 3.127588
5.166667 0.898966 0.568881 1.247780 0.878319 0.215414 3.190322
5.200000 0.928466 0.576022 1.347143 0.896794 0.208262 3.178626
5.233333 0.958447 0.582977 1.467323 0.915588 0.200808 3.109593
5.266667 0.988904 0.589744 1.581719 0.934607 0.193080 2.991193
5.300000 1.020267 0.596145 1.704800 0.953654 0.185157 2.828135
5.333333 1.052523 0.602171 1.815899 0.972578 0.177104 2.620907
5.366667 1.085239 0.608003 1.907063 0.991290 0.168955 2.375054
5.400000 1.118814 0.613445 1.974649 1.009728 0.160727 2.092859
5.433333 1.153232 0.618490 2.050174 1.027823 0.152435 1.778780
5.466667 1.188089 0.623337 2.124351 1.045479 0.144117 1.439729
5.500000 1.223377 0.627984 2.152851 1.062731 0.135747 1.087928
5.533333 1.259089 0.632431 2.181972 1.079666 0.127266 0.735172
5.566667 1.295215 0.636677 2.199774 1.096338 0.118638 0.393281
5.600000 1.332109 0.640501 2.209293 1.112790 0.109846 0.073324
5.633333 1.369401 0.644124 2.199524 1.129078 0.100877 -0.211042
5.666667 1.407081 0.647545 2.181070 1.145291 0.091699 -0.450210
5.700000 1.445462 0.650547 2.135180 1.161422 0.082332 -0.635252
5.733333 1.484521 0.653136 2.088393 1.177360 0.072864 -0.757469
5.766667 1.524234 0.655316 2.034388 1.192953 0.063408 -0.812900
5.800000 1.564295 0.657296 2.006692 1.208101 0.054044 -0.799254
5.833333 1.604984 0.658877 1.948079 1.222672 0.044863 -0.719371
5.866667 1.646262 0.660072 1.905072 1.236529 0.035964 -0.576135
5.900000 1.688103 0.660890 1.881321 1.249555 0.027429 -0.381508
5.933333 1.730246 0.661515 1.865159 1.261710 0.019293 -0.151830
5.966667 1.772679 0.661948 1.862599 1.273024 0.011538 0.096483
6.000000 1.815387 0.662192 1.860548 1.283507 0.004153 0.348801
6.033333 1.858560 0.662098 1.880422 1.293215 -0.002905 0.586998
6.066667 1.901983 0.661819 1.923328 1.302228 -0.009699 0.791753
6.100000 1.945644 0.661359 1.970805 1.310657 -0.016317 0.952324
6.133333 1.989529 0.660720 2.033588 1.318590 -0.022830 1.062479
6.166667 2.033624 0.659905 2.084873 1.326097 -0.029303 1.116444
6.200000 2.078085 0.658778 2.141910 1.333220 -0.035776 1.109168
6.233333 2.122729 0.657481 2.193272 1.339994 -0.042289 1.044443
6.266667 2.167543 0.656018 2.232538 1.346435 -0.048865 0.933137
6.300000 2.212512 0.654392 2.277514 1.352535 -0.055509 0.782311
6.333333 2.257757 0.652470 2.306526 1.358278 -0.062220 0.601769
6.366667 2.303255 0.650255 2.321478 1.363620 -0.068957 0.405260
6.400000 2.348979 0.647752 2.316230 1.368532 -0.075682 0.207346
6.433333 2.394799 0.645101 2.319258 1.372968 -0.082344 0.016274
6.466667 2.440703 0.642307 2.328417 1.376886 -0.088890 -0.167552
6.500000 2.486772 0.639237 2.304001 1.380231 -0.095254 -0.332081
6.533333 2.532981 0.635896 2.272091 1.382970 -0.101392 -0.472573
6.566667 2.579300 0.632292 2.249197 1.385090 -0.107283 -0.586285
6.600000 2.625704 0.628431 2.222528 1.386589 -0.112924 -0.669578
6.633333 2.672115 0.624451 2.188233 1.387466 -0.118313 -0.715403
6.666667 2.718519 0.620357 2.172220 1.387727 -0.123439 -0.711513
6.700000 2.764900 0.616154 2.153203 1.387391 -0.128313 -0.666371
6.733333 2.811242 0.611846 2.113770 1.386478 -0.132945 -0.577392
6.766667 2.857544 0.607327 2.072138 1.385011 -0.137341 -0.448464
6.800000 2.903796 0.602601 2.002451 1.383008 -0.141498 -0.284697
6.833333 2.949964 0.597788 2.008554 1.380488 -0.145413 -0.101520
6.866667 2.996049 0.592794 1.997085 1.377467 -0.149084 0.086252
6.900000 3.042019 0.587725 2.014885 1.373957 -0.152498 0.274388
6.933333 3.087874 0.582497 2.052460 1.369957 -0.155640 0.444179
6.966667 3.133587 0.577122 2.087679 1.365463 -0.158491 0.582417
7.000000 3.179139 0.571689 2.126874 1.360471 -0.161051 0.672164
7.033333 3.224516 0.566206 2.146627 1.354982 -0.163314 0.717487
7.066667 3.269702 0.560678 2.224100 1.348998 -0.165289 0.714581
7.100000 3.314683 0.555112 2.251176 1.342522 -0.166987 0.664532
7.133333 3.359444 0.549514 2.282844 1.335556 -0.168422 0.576425
7.166667 3.403945 0.543811 2.287493 1.328083 -0.169605 0.467350
7.200000 3.448196 0.538088 2.287493 1.320091 -0.170540 0.357351
7.233333 3.492184 0.532353 2.301545 1.311544 -0.171232 0.249342
7.266667 3.535850 0.526546 2.327988 1.302389 -0.171668 0.156983
7.300000 3.579223 0.520740 2.301435 1.292575 -0.171839 0.089188
7.333333 3.622288 0.514939 2.275830 1.282072 -0.171730 0.053465
7.366667 3.665033 0.509152 2.271966 1.270852 -0.171330 0.042678
7.400000 3.707442 0.503384 2.271516 1.258886 -0.170627 0.049215
7.433333 3.749501 0.497642 2.265364 1.246182 -0.169615 0.072689
7.466667 3.791038 0.491934 2.266878 1.232763 -0.168297 0.105180
7.500000 3.832015 0.486277 2.284339 1.218631 -0.166664 0.135045
7.533333 3.872604 0.480665 2.293930 1.203738 -0.164696 0.153346
7.566667 3.912575 0.475140 2.297165 1.188058 -0.162367 0.163323
7.600000 3.951892 0.469722 2.320206 1.171583 -0.159658 0.170785
7.633333 3.990784 0.464366 2.337927 1.154245 -0.156531 0.180022
7.666667 4.029237 0.459081 2.353222 1.135999 -0.152959 0.198845
7.700000 4.066927 0.453963 2.351150 1.116821 -0.148931 0.241940
7.733333 4.104157 0.448926 2.343315 1.096761 -0.144460 0.317910
7.766667 4.140915 0.443977 2.334510 1.075834 -0.139556 0.431652
7.800000 4.176796 0.439253 2.312094 1.053994 -0.134217 0.584592
7.833333 4.211761 0.434776 2.311639 1.031320 -0.128481 0.773709
7.866667 4.245788 0.430557 2.325899 1.007851 -0.122374 0.992355
7.900000 4.278840 0.426616 2.358804 0.983628 -0.115921 1.231024
7.933333 4.311376 0.422789 2.427188 0.958659 -0.109136 1.481779
7.966667 4.342864 0.419272 2.501899 0.933073 -0.102076 1.732324
8.000000 4.373822 0.415877 2.566465 0.907012 -0.094781 1.971502
8.033333 4.403676 0.412815 2.660510 0.880548 -0.087272 2.187898
8.066667 4.432987 0.409883 2.724373 0.853798 -0.079579 2.375498
8.100000 4.461142 0.407302 2.831870 0.826898 -0.071723 2.515608
8.133333 4.488099 0.405080 2.924628 0.800036 -0.063740 2.595710
8.166667 4.514500 0.403001 3.004567 0.773263 -0.055619 2.603152
8.200000 4.539652 0.401296 3.061517 0.746774 -0.047422 2.528000
8.233333 4.563552 0.399967 -3.092688 0.720722 -0.039178 2.365418
8.266667 4.586888 0.398788 -2.980820 0.695205 -0.030880 2.109432
8.300000 4.609661 0.397762 -2.850727 0.670293 -0.022540 1.768924
8.333333 4.631237 0.397271 -2.735030 0.646005 -0.014168 1.347664
8.366667 4.652248 0.396937 -2.674180 0.622364 -0.005770 0.858125
8.400000 4.672694 0.396761 -2.646374 0.599199 0.002739 0.315374
8.433333 4.692006 0.397119 -2.667156 0.576363 0.011385 -0.259865
8.466667 4.710756 0.397638 -2.709373 0.553755 0.020154 -0.846491
8.500000 4.728945 0.398320 -2.786771 0.531257 0.029062 -1.416795
8.533333 4.746576 0.399165 -2.861941 0.508698 0.038166 -1.937202
8.566667 4.763200 0.400544 -2.937805 0.486012 0.047461 -2.381226
8.600000 4.778852 0.402459 -3.012397 0.463289 0.056849 -2.732213
8.633333 4.793954 0.404538 -3.128359 0.440596 0.066273 -2.973892
8.666667 4.808510 0.406780 3.002312 0.418013 0.075672 -3.092551
8.700000 4.822121 0.409408 2.842794 0.395697 0.084940 -3.084946
8.733333 4.834831 0.412419 2.736037 0.373891 0.093936 -2.960057
8.766667 4.846678 0.415811 2.587430 0.352758 0.102578 -2.726376
8.800000 4.857713 0.419576 2.461583 0.332392 0.110859 -2.397047
8.833333 4.867982 0.423709 2.352857 0.312929 0.118740 -2.006668
8.866667 4.877739 0.427998 2.279141 0.294480 0.126201 -1.600242
8.900000 4.886990 0.432441 2.237704 0.277084 0.133260 -1.228618
8.933333 4.895744 0.437035 2.225949 0.260713 0.139948 -0.928864
8.966667 4.904007 0.441779 2.254450 0.245316 0.146304 -0.741822
9.000000 4.911786 0.446669 2.285663 0.230812 0.152353 -0.687892
9.033333 4.919106 0.451848 2.348489 0.217071 0.158143 -0.763235
9.066667 4.926008 0.457303 2.405076 0.203961 0.163711 -0.941218
9.100000 4.932449 0.462896 2.443793 0.191342 0.169074 -1.178049
9.133333 4.938572 0.468733 2.420459 0.179096 0.174236 -1.429892
9.166667 4.944251 0.474702 2.313298 0.167132 0.179178 -1.635088
9.200000 4.949495 0.480799 2.150633 0.155416 0.183879 -1.740283
9.233333 4.954568 0.487101 1.975039 0.143916 0.188316 -1.703734
9.266667 4.959222 0.493524 1.843673 0.132626 0.192492 -1.501147
9.300000 4.963467 0.500065 1.722320 0.121562 0.196413 -1.126172
9.333333 4.967309 0.506720 1.650906 0.110762 0.200108 -0.591215
9.366667 4.970757 0.513484 1.618483 0.100263 0.203603 0.064157
9.400000 4.973820 0.520354 1.633017 0.090075 0.206918 0.786913
9.433333 4.976507 0.527327 1.706591 0.080262 0.210066 1.523401
9.466667 4.978827 0.534397 1.806727 0.070865 0.213059 2.222949
9.500000 4.980787 0.541562 1.952445 0.061926 0.215906 2.837913
9.533333 4.982657 0.548848 2.122240 0.053472 0.218611 3.332223
9.566667 4.984186 0.556219 2.255534 0.045550 0.221180 3.687934
9.600000 4.985614 0.563682 2.420499 0.038194 0.223633 3.896741
9.633333 4.986718 0.571223 2.579250 0.031393 0.225990 3.958313
9.666667 4.987506 0.578837 2.725497 0.025109 0.228259 3.876317
9.700000 4.987988 0.586520 2.873891 0.019323 0.230448 3.664306
9.733333 4.988349 0.594227 3.019602 0.014022 0.232562 3.342862
9.766667 4.988588 0.601940 -3.120824 0.009144 0.234602 2.928210
9.800000 4.988794 0.609794 -2.994030 0.004636 0.236555 2.444876
9.833333 4.988727 0.617699 -2.894676 0.000461 0.238399 1.915313
9.866667 4.988623 0.625708 -2.845894 -0.003410 0.240102 1.368315
9.900000 4.988485 0.633808 -2.819162 -0.007050 0.241609 0.834072
9.933333 4.988316 0.641979 -2.823962 -0.010559 0.242862 0.338398
9.966667 4.987905 0.650183 -2.839721 -0.013982 0.243779 -0.093488
10.000000 4.987259 0.658417 -2.892467 -0.017357 0.244302 -0.443921
10.033333 4.986593 0.666671 -2.954284 -0.020735 0.244355 -0.701238
10.066667 4.985912 0.674930 -3.021260 -0.024160 0.243907 -0.866540
10.100000 4.985018 0.683204 -3.077746 -0.027630 0.242952 -0.952585
10.133333 4.984115 0.691455 -3.127358 -0.031116 0.241482 -0.975705
10.166667 4.983013 0.699711 3.106424 -0.034615 0.239527 -0.953483
10.200000 4.981816 0.707772 3.076079 -0.038135 0.237127 -0.906840
10.233333 4.980525 0.715626 3.091044 -0.041663 0.234356 -0.857271
10.266667 4.979055 0.723473 3.091649 -0.045154 0.231256 -0.820594
10.300000 4.977493 0.731098 3.086579 -0.048593 0.227896 -0.807198
10.333333 4.975765 0.738708 3.062768 -0.051955 0.224355 -0.824353
10.366667 4.973950 0.746096 3.017924 -0.055212 0.220713 -0.873908
10.400000 4.971982 0.753461 2.978447 -0.058314 0.217008 -0.952885
10.433333 4.969944 0.760613 2.955566 -0.061213 0.213260 -1.049036
10.466667 4.967844 0.767556 2.933443 -0.063905 0.209530 -1.152385
10.500000 4.965610 0.774466 2.893683 -0.066354 0.205819 -1.250078
10.533333 4.963248 0.781341 2.846570 -0.068542 0.202131 -1.329481
10.566667 4.960856 0.788023 2.786272 -0.070436 0.198442 -1.381324
10.600000 4.958447 0.794519 2.731206 -0.072030 0.194767 -1.398247
10.633333 4.955928 0.800971 2.680441 -0.073325 0.191112 -1.377635
10.666667 4.953414 0.807251 2.618963 -0.074301 0.187443 -1.314106
10.700000 4.950802 0.813481 2.560530 -0.074957 0.183755 -1.207971
10.733333 4.948219 0.819551 2.494308 -0.075307 0.180048 -1.062036
10.766667 4.945674 0.825465 2.450913 -0.075379 0.176331 -0.884149
10.800000 4.943046 0.831324 2.409666 -0.075189 0.172587 -0.679433
10.833333 4.940470 0.837036 2.399152 -0.074761 0.168816 -0.457386
10.866667 4.937948 0.842602 2.400812 -0.074134 0.165027 -0.231525
10.900000 4.935489 0.848023 2.414951 -0.073365 0.161241 -0.015091
10.933333 4.933094 0.853300 2.411484 -0.072505 0.157467 0.180015
10.966667 4.930642 0.858512 2.426333 -0.071591 0.153714 0.347366
11.000000 4.928252 0.863583 2.446840 -0.070683 0.150010 0.478842
11.033333 4.925923 0.868514 2.488885 -0.069823 0.146371 0.569092
11.066667 4.923648 0.873306 2.524206 -0.069038 0.142806 0.617760
11.100000 4.921424 0.877961 2.549075 -0.068338 0.139318 0.627190
11.133333 4.919246 0.882479 2.576309 -0.067722 0.135903 0.598876
11.166667 4.917034 0.886926 2.603568 -0.067197 0.132566 0.535774
