t x y theta dxdt dydt dthetadt
0.000000 0.000000 0.000000 0.951321 -0.124114 -0.086190 -0.008400
0.033333 -0.004592 -0.002992 0.956506 -0.123375 -0.087800 -0.014658
0.066667 -0.008954 -0.005969 0.947768 -0.121402 -0.089246 -0.026035
0.100000 -0.013079 -0.008928 0.948158 -0.118021 -0.090453 -0.037832
0.133333 -0.016958 -0.011866 0.939275 -0.113038 -0.091309 -0.048320
0.166667 -0.020908 -0.014971 0.936962 -0.106293 -0.091706 -0.054747
0.200000 -0.024747 -0.018171 0.940553 -0.097494 -0.091548 -0.055679
0.233333 -0.028316 -0.021344 0.929627 -0.086337 -0.090748 -0.045084
0.266667 -0.031561 -0.024654 0.923609 -0.072646 -0.089261 -0.024354
0.300000 -0.034521 -0.027932 0.921442 -0.055988 -0.087038 0.005115
0.333333 -0.037007 -0.031078 0.931293 -0.036126 -0.084096 0.040402
0.366667 -0.039194 -0.034185 0.920123 -0.012838 -0.080471 0.080523
0.400000 -0.040425 -0.036999 0.926962 0.014106 -0.076249 0.123384
0.433333 -0.040393 -0.039480 0.926793 0.044854 -0.071540 0.163318
0.466667 -0.038714 -0.041619 0.927256 0.079894 -0.066495 0.201108
0.500000 -0.036718 -0.043711 0.938950 0.119038 -0.061319 0.237212
0.533333 -0.032035 -0.045549 0.963193 0.162437 -0.056221 0.272197
0.566667 -0.027033 -0.047337 0.990311 0.210265 -0.051393 0.301462
0.600000 -0.021713 -0.049074 0.993686 0.262139 -0.046970 0.324454
0.633333 -0.011574 -0.050282 0.993350 0.317800 -0.043118 0.339313
0.666667 -0.001125 -0.051436 0.994981 0.376745 -0.039972 0.344772
0.700000 0.009626 -0.052537 1.003965 0.438846 -0.037627 0.338885
0.733333 0.025882 -0.053509 1.025144 0.503114 -0.036109 0.322999
0.766667 0.042420 -0.054427 1.049432 0.568559 -0.035439 0.302878
0.800000 0.063956 -0.055390 1.062479 0.634173 -0.035645 0.278843
0.833333 0.085739 -0.056297 1.083902 0.699230 -0.036679 0.254736
0.866667 0.112549 -0.057448 1.089164 0.762488 -0.038454 0.230462
0.900000 0.139562 -0.058541 1.087352 0.822709 -0.040886 0.207230
0.933333 0.166751 -0.059576 1.092144 0.879729 -0.043917 0.185173
0.966667 0.198201 -0.061031 1.080355 0.933042 -0.047451 0.163864
1.000000 0.233787 -0.063036 1.082542 0.982604 -0.051354 0.143643
1.033333 0.269457 -0.064978 1.085802 1.027879 -0.055516 0.123857
1.066667 0.305175 -0.066855 1.093425 1.068926 -0.059804 0.105188
1.100000 0.340906 -0.068665 1.108843 1.105959 -0.064143 0.085160
1.133333 0.376614 -0.070405 1.114252 1.138905 -0.068511 0.060705
1.166667 0.415782 -0.072768 1.134395 1.168087 -0.072907 0.026548
1.200000 0.458123 -0.075780 1.127074 1.193833 -0.077363 -0.019300
1.233333 0.500321 -0.078713 1.118571 1.216600 -0.081878 -0.078636
1.266667 0.542332 -0.081563 1.116841 1.236756 -0.086493 -0.150999
1.300000 0.584113 -0.084328 1.111105 1.254347 -0.091113 -0.232391
1.333333 0.625618 -0.087004 1.100690 1.269035 -0.095501 -0.318434
1.366667 0.668323 -0.090270 1.105001 1.280398 -0.099362 -0.406514
1.400000 0.710665 -0.093438 1.095089 1.287923 -0.102368 -0.493068
1.433333 0.754438 -0.097182 1.073146 1.290902 -0.104146 -0.575014
1.466667 0.799444 -0.101378 1.042230 1.288031 -0.104149 -0.648603
1.500000 0.843945 -0.105460 1.020061 1.277768 -0.101829 -0.709191
1.533333 0.887894 -0.109424 0.971305 1.258422 -0.096702 -0.747323
1.566667 0.932258 -0.113533 0.944620 1.228600 -0.088470 -0.746571
1.600000 0.976420 -0.117602 0.925933 1.187222 -0.076983 -0.692971
1.633333 1.019624 -0.121244 0.900156 1.133638 -0.062251 -0.573809
1.666667 1.060860 -0.124175 0.876117 1.067856 -0.044678 -0.377099
1.700000 1.098854 -0.126037 0.821155 0.990454 -0.024964 -0.092281
1.733333 1.132309 -0.126496 0.783703 0.902727 -0.004076 0.277606
1.766667 1.164892 -0.126801 0.761354 0.805328 0.017029 0.725534
1.800000 1.191928 -0.125568 0.759025 0.699072 0.037365 1.238501
1.833333 1.212726 -0.122908 0.789871 0.585027 0.055949 1.800255
1.866667 1.226569 -0.119096 0.863649 0.465131 0.071992 2.386159
1.900000 1.239426 -0.115127 0.957888 0.341495 0.085029 2.964503
1.933333 1.251281 -0.111002 1.093089 0.215812 0.094838 3.505882
1.966667 1.262116 -0.106725 1.237279 0.090389 0.101282 3.977004
2.000000 1.265363 -0.102423 1.431176 -0.032726 0.104474 4.345661
2.033333 1.261458 -0.098330 1.629030 -0.152074 0.104745 4.582941
2.066667 1.250527 -0.094574 1.813791 -0.267140 0.102580 4.668939
2.100000 1.232635 -0.091625 2.008227 -0.377226 0.098437 4.592343
2.133333 1.213719 -0.088528 2.185193 -0.481221 0.092890 4.357414
2.166667 1.193793 -0.085282 2.361354 -0.577995 0.086813 3.977055
2.200000 1.172874 -0.081889 2.546762 -0.667131 0.080942 3.475021
2.233333 1.150977 -0.078349 2.713113 -0.748317 0.076030 2.883806
2.266667 1.124465 -0.076209 2.817351 -0.821461 0.072966 2.237492
2.300000 1.093571 -0.075165 2.874659 -0.887188 0.072744 1.573914
2.333333 1.061763 -0.073973 2.886784 -0.946433 0.076369 0.922678
2.366667 1.026318 -0.072639 2.858358 -1.000084 0.084402 0.313352
2.400000 0.990016 -0.071151 2.809562 -1.048492 0.097407 -0.226797
2.433333 0.952886 -0.069509 2.759676 -1.091774 0.115617 -0.682025
2.466667 0.914961 -0.067710 2.703639 -1.130136 0.138774 -1.044031
2.500000 0.875616 -0.063706 2.644070 -1.163811 0.166065 -1.314681
2.533333 0.835541 -0.059545 2.571722 -1.193038 0.196384 -1.496702
2.566667 0.795031 -0.053099 2.530102 -1.218600 0.228609 -1.606309
2.600000 0.753633 -0.044381 2.464594 -1.241292 0.261486 -1.662561
2.633333 0.711532 -0.033617 2.415168 -1.261907 0.293806 -1.683466
2.666667 0.668856 -0.020953 2.347512 -1.280939 0.324355 -1.679999
2.700000 0.625625 -0.008160 2.289331 -1.298673 0.352384 -1.661270
2.733333 0.581873 0.004750 2.234008 -1.315395 0.377294 -1.640609
2.766667 0.537636 0.017766 2.183367 -1.331120 0.398846 -1.615508
2.800000 0.492854 0.031874 2.121029 -1.345735 0.416941 -1.587752
2.833333 0.447537 0.046902 2.069908 -1.359091 0.431676 -1.554478
2.866667 0.401847 0.062001 2.038272 -1.370981 0.443478 -1.520886
2.900000 0.355820 0.077159 1.978309 -1.381112 0.452610 -1.488135
2.933333 0.309107 0.092895 1.928787 -1.389157 0.459297 -1.451097
2.966667 0.261903 0.109004 1.869718 -1.394794 0.463557 -1.412705
3.000000 0.214476 0.125132 1.827521 -1.397777 0.465446 -1.374561
3.033333 0.167076 0.141268 1.783634 -1.397731 0.464936 -1.339166
3.066667 0.119530 0.157395 1.729572 -1.394417 0.461953 -1.303154
3.100000 0.071879 0.173499 1.702072 -1.387738 0.456553 -1.267172
3.133333 0.025270 0.189050 1.656841 -1.377498 0.448792 -1.233292
3.166667 -0.021368 0.204551 1.621532 -1.363300 0.438638 -1.204938
3.200000 -0.067224 0.219381 1.584713 -1.344728 0.425997 -1.183114
3.233333 -0.112078 0.233378 1.530992 -1.321763 0.410967 -1.172146
3.266667 -0.156853 0.247287 1.504803 -1.294042 0.393431 -1.176996
3.300000 -0.201513 0.261097 1.475166 -1.261129 0.373213 -1.195661
3.333333 -0.244307 0.273764 1.431980 -1.223047 0.350365 -1.227002
3.366667 -0.284763 0.285146 1.399341 -1.180269 0.325237 -1.264940
3.400000 -0.325006 0.296396 1.349844 -1.133380 0.298291 -1.299147
3.433333 -0.365004 0.307508 1.312784 -1.082474 0.269751 -1.318105
3.466667 -0.401558 0.316849 1.288091 -1.028350 0.240296 -1.311969
3.500000 -0.434961 0.324294 1.247404 -0.971916 0.210750 -1.279222
3.533333 -0.464717 0.329633 1.179453 -0.913792 0.181840 -1.221711
3.566667 -0.494129 0.334808 1.080511 -0.854325 0.154084 -1.139073
3.600000 -0.519791 0.337840 1.009107 -0.794275 0.128123 -1.039267
3.633333 -0.545075 0.340706 0.978111 -0.734828 0.104694 -0.929794
3.666667 -0.569966 0.343406 0.966351 -0.676617 0.084118 -0.817230
3.700000 -0.592185 0.345191 0.966484 -0.620245 0.066486 -0.706733
3.733333 -0.611879 0.346446 0.979625 -0.566410 0.051713 -0.600364
3.766667 -0.629069 0.347362 0.979110 -0.516213 0.039805 -0.509504
3.800000 -0.644271 0.347969 0.977555 -0.470158 0.030385 -0.440774
3.833333 -0.657483 0.348412 0.961916 -0.428871 0.023134 -0.395077
3.866667 -0.668930 0.348763 0.914111 -0.393219 0.017844 -0.371055
3.900000 -0.679264 0.348986 0.890454 -0.363847 0.014327 -0.365321
3.933333 -0.689049 0.349247 0.879937 -0.340995 0.012390 -0.374539
3.966667 -0.698390 0.349359 0.877255 -0.324229 0.011715 -0.392620
4.000000 -0.707286 0.349325 0.878058 -0.313123 0.012137 -0.413874
4.033333 -0.715738 0.349149 0.867763 -0.306644 0.013345 -0.439539
4.066667 -0.725081 0.349374 0.865038 -0.303421 0.014991 -0.474389
4.100000 -0.735574 0.350052 0.845744 -0.302024 0.016745 -0.518714
4.133333 -0.745620 0.350594 0.823863 -0.301334 0.018402 -0.573436
4.166667 -0.757271 0.351877 0.817491 -0.300417 0.019761 -0.635296
4.200000 -0.768468 0.353028 0.787954 -0.298537 0.020644 -0.701512
4.233333 -0.779208 0.354049 0.759043 -0.295372 0.020948 -0.769223
4.266667 -0.789486 0.354940 0.736689 -0.290934 0.020658 -0.832622
4.300000 -0.799299 0.355703 0.694222 -0.285742 0.019874 -0.894139
4.333333 -0.808644 0.356340 0.661773 -0.280456 0.018666 -0.953883
4.366667 -0.817516 0.356852 0.626843 -0.276203 0.017265 -1.012380
4.400000 -0.825913 0.357240 0.590777 -0.273976 0.015879 -1.068915
4.433333 -0.833831 0.357506 0.567957 -0.274539 0.014710 -1.121220
4.466667 -0.841762 0.357903 0.527194 -0.278720 0.013883 -1.166754
4.500000 -0.849863 0.358293 0.499126 -0.286959 0.013383 -1.200281
4.533333 -0.858285 0.358714 0.456809 -0.299388 0.013081 -1.217001
4.566667 -0.867557 0.359049 0.403686 -0.315435 0.012708 -1.215429
4.600000 -0.876328 0.359271 0.366069 -0.334672 0.011870 -1.198125
4.633333 -0.886822 0.359629 0.292639 -0.356626 0.009964 -1.164082
4.666667 -0.899359 0.360174 0.232953 -0.380256 0.006434 -1.114355
4.700000 -0.914197 0.361027 0.188112 -0.404228 0.000803 -1.048424
4.733333 -0.928493 0.361773 0.168321 -0.427252 -0.007202 -0.966110
4.766667 -0.942234 0.362410 0.148920 -0.448503 -0.017811 -0.865074
4.800000 -0.958033 0.362800 0.141472 -0.466776 -0.030957 -0.741116
4.833333 -0.975345 0.362624 0.117824 -0.480997 -0.046115 -0.593441
4.866667 -0.993857 0.361436 0.097529 -0.490320 -0.062787 -0.426280
4.900000 -1.011744 0.360147 0.064094 -0.494300 -0.080511 -0.241251
4.933333 -1.029939 0.357057 0.041082 -0.492347 -0.098773 -0.047051
4.966667 -1.047897 0.351639 0.010787 -0.483727 -0.116877 0.145960
5.000000 -1.065168 0.346135 0.020342 -0.468149 -0.134193 0.328300
5.033333 -1.081730 0.340552 0.021545 -0.445526 -0.150376 0.488432
5.066667 -1.097561 0.334898 0.075162 -0.416326 -0.165023 0.619491
5.100000 -1.112640 0.329180 0.133145 -0.381177 -0.177642 0.710201
5.133333 -1.126948 0.323405 0.189010 -0.341177 -0.187929 0.762740
5.166667 -1.140464 0.317580 0.257757 -0.297503 -0.195954 0.779079
5.200000 -1.150422 0.310303 0.291872 -0.251537 -0.201763 0.765692
5.233333 -1.157222 0.302239 0.326680 -0.204682 -0.205305 0.730960
5.266667 -1.161300 0.294119 0.324091 -0.158119 -0.206568 0.691473
5.300000 -1.164526 0.285984 0.304556 -0.112920 -0.205473 0.665479
5.333333 -1.165880 0.279017 0.312350 -0.070089 -0.201936 0.658692
5.366667 -1.166361 0.272052 0.316778 -0.030593 -0.195689 0.679527
5.400000 -1.165960 0.265099 0.327571 0.005197 -0.186785 0.729505
5.433333 -1.164668 0.258167 0.340710 0.037320 -0.175310 0.810614
5.466667 -1.162399 0.252391 0.390131 0.066193 -0.161393 0.909307
5.500000 -1.159224 0.246652 0.426666 0.092405 -0.145431 1.012999
5.533333 -1.155420 0.242049 0.471636 0.117043 -0.127941 1.114739
5.566667 -1.150696 0.237496 0.521079 0.141365 -0.109479 1.206210
5.600000 -1.145045 0.232997 0.577497 0.166548 -0.090451 1.279164
5.633333 -1.139470 0.230161 0.619018 0.193774 -0.071606 1.326868
5.666667 -1.133839 0.229235 0.662070 0.224021 -0.053779 1.351863
5.700000 -1.127261 0.228377 0.692296 0.258180 -0.037667 1.352345
5.733333 -1.119729 0.227587 0.744804 0.296783 -0.023798 1.327104
5.766667 -1.110985 0.228030 0.807849 0.340000 -0.012714 1.276280
5.800000 -1.100490 0.229254 0.855540 0.387817 -0.004928 1.205766
5.833333 -1.089024 0.230548 0.908014 0.439995 -0.000423 1.118778
5.866667 -1.074761 0.231846 0.946531 0.496051 0.001103 1.024225
5.900000 -1.057532 0.232732 0.979970 0.555542 0.000078 0.936102
5.933333 -1.037256 0.233026 1.010007 0.617716 -0.002949 0.869614
5.966667 -1.014118 0.232418 1.055891 0.682067 -0.007049 0.837229
6.000000 -0.990020 0.231878 1.066963 0.747937 -0.011175 0.845875
6.033333 -0.964971 0.231408 1.046381 0.814602 -0.014380 0.904916
6.066667 -0.937136 0.230049 1.036202 0.881757 -0.015703 1.010446
6.100000 -0.908369 0.228764 1.043115 0.949298 -0.014356 1.152920
6.133333 -0.875958 0.227239 1.067056 1.017393 -0.009718 1.319166
6.166667 -0.839667 0.225838 1.116919 1.086184 -0.001725 1.493102
6.200000 -0.802489 0.224516 1.200141 1.155970 0.009596 1.658147
6.233333 -0.761936 0.224283 1.283946 1.226711 0.023886 1.790460
6.266667 -0.720538 0.224134 1.377527 1.298129 0.040437 1.872711
6.300000 -0.675922 0.225773 1.476772 1.369208 0.058364 1.893593
6.333333 -0.630512 0.227497 1.549852 1.439520 0.076646 1.845254
6.366667 -0.582072 0.230793 1.632062 1.508337 0.094387 1.729437
6.400000 -0.530537 0.235333 1.696397 1.574735 0.110593 1.553433
6.433333 -0.474830 0.240873 1.740314 1.638110 0.124485 1.332571
6.466667 -0.418456 0.246483 1.795948 1.698167 0.135330 1.084512
6.500000 -0.357553 0.252065 1.815703 1.755211 0.142645 0.827858
6.533333 -0.296064 0.257708 1.847708 1.808710 0.146249 0.576935
6.566667 -0.234031 0.263405 1.853622 1.858766 0.146114 0.344065
6.600000 -0.171497 0.269152 1.843569 1.906018 0.142336 0.138136
6.633333 -0.108506 0.274943 1.830755 1.951476 0.135089 -0.034438
6.666667 -0.041427 0.279152 1.809468 1.995411 0.124922 -0.166879
6.700000 0.026017 0.283396 1.799015 2.038078 0.112469 -0.257988
6.733333 0.093777 0.287672 1.786397 2.080190 0.098226 -0.302964
6.766667 0.161804 0.291978 1.755698 2.121916 0.082746 -0.301669
6.800000 0.233218 0.294658 1.741460 2.162685 0.066765 -0.255221
6.833333 0.307586 0.295940 1.723329 2.201402 0.051062 -0.162066
6.866667 0.382063 0.297246 1.706827 2.237668 0.036079 -0.029752
6.900000 0.458716 0.297504 1.705385 2.270816 0.022235 0.135083
6.933333 0.537058 0.296935 1.699286 2.299784 0.010065 0.325855
6.966667 0.615334 0.296392 1.692111 2.323661 0.000048 0.534657
7.000000 0.694594 0.295451 1.716040 2.342041 -0.007620 0.754576
7.033333 0.773668 0.294540 1.756266 2.354834 -0.012961 0.971948
7.066667 0.854282 0.293616 1.798624 2.361592 -0.015896 1.177803
7.100000 0.934586 0.292728 1.847519 2.362227 -0.016528 1.367141
7.133333 1.014518 0.291878 1.904728 2.356707 -0.015228 1.532852
7.166667 1.094015 0.291070 1.991148 2.345063 -0.012444 1.663427
7.200000 1.173017 0.290305 2.044361 2.326957 -0.008694 1.751183
7.233333 1.251461 0.289586 2.102509 2.301613 -0.004508 1.792583
7.266667 1.329775 0.289373 2.175869 2.268520 -0.000463 1.786394
7.300000 1.407067 0.289632 2.240352 2.226370 0.002870 1.725778
7.333333 1.482681 0.290296 2.320259 2.174439 0.005096 1.603325
7.366667 1.555640 0.291273 2.399983 2.112138 0.005832 1.427648
7.400000 1.627746 0.292305 2.428921 2.038943 0.004902 1.208903
7.433333 1.698942 0.293393 2.486312 1.954531 0.002297 0.960161
7.466667 1.765588 0.293978 2.562140 1.858825 -0.001863 0.695833
7.500000 1.831221 0.294620 2.574186 1.753017 -0.007289 0.437451
7.533333 1.890341 0.294361 2.575691 1.637674 -0.013560 0.204329
7.566667 1.942123 0.293148 2.565862 1.513585 -0.020124 0.003088
7.600000 1.992764 0.292003 2.527858 1.381932 -0.026343 -0.175956
7.633333 2.034345 0.290345 2.467688 1.244938 -0.031404 -0.346064
7.666667 2.074728 0.288763 2.416456 1.103737 -0.034428 -0.522448
7.700000 2.113889 0.287261 2.379129 0.958839 -0.034623 -0.729690
7.733333 2.143564 0.285579 2.370541 0.811880 -0.031446 -0.988050
7.766667 2.163699 0.283685 2.409350 0.663984 -0.024232 -1.318694
7.800000 2.182575 0.281887 2.448782 0.516658 -0.012588 -1.718433
7.833333 2.200192 0.280188 2.461419 0.370142 0.003741 -2.184664
7.866667 2.208951 0.279064 2.413785 0.226382 0.024940 -2.708390
7.900000 2.216460 0.278048 2.323690 0.087323 0.051185 -3.268979
7.933333 2.216304 0.278634 2.146140 -0.046100 0.082906 -3.835045
7.966667 2.209110 0.281270 1.957646 -0.172596 0.120084 -4.364283
8.000000 2.195229 0.286394 1.762428 -0.290959 0.162621 -4.835880
8.033333 2.180186 0.291629 1.555966 -0.399358 0.209995 -5.226501
8.066667 2.164013 0.296972 1.337122 -0.497414 0.261309 -5.531145
8.100000 2.142874 0.305954 1.078444 -0.584316 0.315344 -5.743438
8.133333 2.120679 0.315033 0.914587 -0.659678 0.370538 -5.891545
8.166667 2.094684 0.327963 0.720396 -0.723681 0.425105 -6.000477
8.200000 2.066047 0.344846 0.529147 -0.777408 0.477098 -6.079587
8.233333 2.036486 0.361790 0.347772 -0.822305 0.524587 -6.136141
8.266667 2.006225 0.382421 0.175484 -0.859475 0.565279 -6.156467
8.300000 1.976246 0.406391 -0.020050 -0.891126 0.596843 -6.142907
8.333333 1.945485 0.430360 -0.232562 -0.918923 0.617143 -6.056366
8.366667 1.913990 0.454302 -0.444325 -0.944423 0.624794 -5.874553
8.400000 1.881808 0.478193 -0.746400 -0.968778 0.619347 -5.582281
8.433333 1.850478 0.501710 -0.942019 -0.993027 0.600984 -5.179996
8.466667 1.818555 0.525126 -1.223071 -1.017894 0.570790 -4.673488
8.500000 1.786088 0.548418 -1.433986 -1.043162 0.530528 -4.068887
8.533333 1.751772 0.568733 -1.568777 -1.068353 0.481888 -3.401307
8.566667 1.715548 0.585317 -1.641101 -1.092393 0.426283 -2.707999
8.600000 1.677452 0.597505 -1.672205 -1.113723 0.364719 -2.032742
8.633333 1.637655 0.604644 -1.678419 -1.130547 0.298265 -1.401438
8.666667 1.597565 0.611580 -1.661456 -1.140789 0.228122 -0.849867
8.700000 1.557236 0.618307 -1.632128 -1.142208 0.155565 -0.400670
8.733333 1.516722 0.624818 -1.621746 -1.132546 0.082082 -0.054219
8.766667 1.476080 0.631109 -1.599322 -1.110287 0.009106 0.206619
8.800000 1.435806 0.632102 -1.584252 -1.074270 -0.061618 0.407654
8.833333 1.396484 0.628345 -1.553151 -1.023784 -0.128760 0.575732
8.866667 1.358971 0.620551 -1.533153 -0.959236 -0.190966 0.745842
8.900000 1.324457 0.609291 -1.553584 -0.881725 -0.246660 0.951961
8.933333 1.294074 0.595355 -1.541586 -0.793531 -0.294237 1.208247
8.966667 1.263859 0.581235 -1.531595 -0.696095 -0.331696 1.526555
9.000000 1.239835 0.566183 -1.492921 -0.591573 -0.357652 1.910003
9.033333 1.222492 0.550946 -1.440573 -0.482387 -0.371079 2.343608
9.066667 1.212011 0.536108 -1.354548 -0.370720 -0.371706 2.799658
9.100000 1.201825 0.521150 -1.263844 -0.258858 -0.360486 3.239644
9.133333 1.199216 0.508185 -1.165319 -0.148045 -0.338715 3.635613
9.166667 1.196933 0.495130 -0.997669 -0.040495 -0.308457 3.939999
9.200000 1.194988 0.482000 -0.810527 0.062498 -0.271973 4.114224
9.233333 1.200143 0.472788 -0.619191 0.160237 -0.231452 4.137495
9.266667 1.205652 0.463526 -0.440816 0.252980 -0.188679 4.009925
9.300000 1.217335 0.458751 -0.203901 0.340642 -0.145264 3.741559
9.333333 1.235069 0.458535 -0.003989 0.422324 -0.103129 3.345860
9.366667 1.253146 0.458283 0.125453 0.497617 -0.063820 2.867027
9.400000 1.271554 0.457995 0.191512 0.565497 -0.028641 2.352862
9.433333 1.290284 0.457671 0.220614 0.624630 0.001599 1.849242
9.466667 1.314490 0.459843 0.240810 0.672712 0.025846 1.388859
9.500000 1.338988 0.461975 0.223265 0.708332 0.043821 1.004001
9.533333 1.367361 0.465332 0.186461 0.730914 0.056016 0.718806
9.566667 1.397954 0.469125 0.145924 0.739490 0.062827 0.532146
9.600000 1.428775 0.472866 0.118604 0.733303 0.064737 0.430643
9.633333 1.457587 0.476007 0.141054 0.712553 0.062167 0.385103
9.666667 1.482272 0.478313 0.179521 0.678805 0.056062 0.360531
9.700000 1.507119 0.480555 0.242004 0.633882 0.047094 0.312094
9.733333 1.532110 0.482731 0.272580 0.580136 0.035830 0.198395
9.766667 1.550287 0.483755 0.311348 0.521485 0.023130 -0.013465
9.800000 1.568579 0.484709 0.332437 0.462072 0.009909 -0.342873
9.833333 1.581491 0.484708 0.335026 0.405648 -0.003037 -0.795565
9.866667 1.590028 0.483863 0.343299 0.354929 -0.015251 -1.356061
9.900000 1.595789 0.482225 0.340522 0.312343 -0.026273 -1.996562
9.933333 1.600352 0.480190 0.305624 0.279555 -0.035723 -2.691742
9.966667 1.605025 0.478086 0.228970 0.256307 -0.043504 -3.406711
10.000000 1.611347 0.476280 0.054971 0.241694 -0.049415 -4.107653
10.033333 1.617788 0.474407 -0.165815 0.233879 -0.053331 -4.751770
10.066667 1.624350 0.472466 -0.380392 0.230758 -0.055165 -5.311747
10.100000 1.633129 0.470450 -0.593938 0.229322 -0.054834 -5.763699
10.133333 1.642035 0.468366 -0.785175 0.226386 -0.052301 -6.076439
10.166667 1.652230 0.466077 -1.059280 0.219135 -0.047341 -6.230961
10.200000 1.662552 0.463722 -1.291072 0.205577 -0.039963 -6.222685
10.233333 1.672224 0.461510 -1.546936 0.184185 -0.030134 -6.059431
10.266667 1.679727 0.459984 -1.813311 0.153970 -0.017851 -5.750313
10.300000 1.687360 0.458393 -2.013668 0.115223 -0.003345 -5.313585
10.333333 1.690309 0.458728 -2.198951 0.069250 0.012812 -4.781049
10.366667 1.693400 0.458995 -2.360446 0.018129 0.029838 -4.189549
10.400000 1.696642 0.459192 -2.514895 -0.036100 0.047011 -3.569563
10.433333 1.695564 0.461166 -2.664738 -0.090755 0.063338 -2.954335
10.466667 1.690537 0.464631 -2.699537 -0.143134 0.077748 -2.374988
10.500000 1.682280 0.469123 -2.740651 -0.190944 0.089101 -1.846315
10.533333 1.671327 0.473977 -2.727714 -0.233005 0.096587 -1.381774
10.566667 1.658710 0.478728 -2.682166 -0.268615 0.099428 -0.990910
10.600000 1.645914 0.483028 -2.697578 -0.297522 0.096848 -0.676118
10.633333 1.633410 0.487214 -2.736479 -0.320675 0.088621 -0.433761
10.666667 1.621225 0.491278 -2.759050 -0.339624 0.074947 -0.253459
10.700000 1.609388 0.495212 -2.772984 -0.356202 0.056482 -0.134454
10.733333 1.597924 0.499009 -2.792424 -0.371735 0.034028 -0.061924
10.766667 1.587828 0.500874 -2.797668 -0.387170 0.008745 -0.013902
10.800000 1.577922 0.500980 -2.764141 -0.403032 -0.017992 0.020680
10.833333 1.566772 0.499361 -2.723554 -0.418410 -0.044814 0.048326
10.866667 1.553647 0.496424 -2.703140 -0.431657 -0.070475 0.074264
10.900000 1.538055 0.492366 -2.710001 -0.440252 -0.093811 0.103091
10.933333 1.520131 0.487349 -2.728854 -0.441266 -0.113748 0.130257
10.966667 1.500499 0.481665 -2.736326 -0.431593 -0.129644 0.147439
11.000000 1.480253 0.475552 -2.748645 -0.408275 -0.141147 0.154215
11.033333 1.460779 0.469384 -2.751549 -0.369318 -0.148450 0.151673
11.066667 1.444198 0.463478 -2.740878 -0.313439 -0.152003 0.134484
11.100000 1.431695 0.457990 -2.734898 -0.240695 -0.152738 0.103002
11.133333 1.419943 0.452357 -2.710440 -0.152452 -0.151787 0.059353
11.166667 1.414508 0.447529 -2.673550 -0.051260 -0.150382 0.007438
11.200000 1.409879 0.442557 -2.638224 0.060134 -0.149670 -0.048875
11.233333 1.412181 0.438372 -2.649557 0.178170 -0.150500 -0.099216
11.266667 1.421322 0.434630 -2.670267 0.299735 -0.153650 -0.127202
11.300000 1.437141 0.430745 -2.702757 0.421961 -0.159407 -0.119583
11.333333 1.453812 0.426711 -2.734841 0.542717 -0.167941 -0.068886
11.366667 1.476829 0.421665 -2.763520 0.660113 -0.178885 0.031827
11.400000 1.500691 0.416467 -2.797204 0.772688 -0.191806 0.187198
11.433333 1.530948 0.409650 -2.806955 0.880276 -0.206021 0.386368
11.466667 1.562027 0.402682 -2.790824 0.983010 -0.220653 0.612258
11.500000 1.599322 0.394013 -2.768379 1.081262 -0.234785 0.842408
11.533333 1.637403 0.385199 -2.717089 1.175600 -0.247467 1.063235
11.566667 1.676248 0.376242 -2.651838 1.267502 -0.258102 1.255334
11.600000 1.720429 0.366652 -2.579579 1.357666 -0.266129 1.398873
11.633333 1.769449 0.356771 -2.480050 1.446290 -0.271390 1.486146
11.666667 1.819147 0.346759 -2.437261 1.533179 -0.273909 1.519401
11.700000 1.869488 0.336620 -2.386563 1.618457 -0.274087 1.507143
11.733333 1.924332 0.326885 -2.312837 1.701657 -0.272434 1.453436
11.766667 1.983193 0.317563 -2.273944 1.781651 -0.269431 1.373192
11.800000 2.045493 0.308742 -2.232500 1.857696 -0.265669 1.280404
11.833333 2.110908 0.300404 -2.199778 1.929338 -0.261644 1.189361
11.866667 2.179023 0.292372 -2.153427 1.995687 -0.257852 1.099640
11.900000 2.247509 0.284232 -2.147823 2.055613 -0.254611 1.014662
11.933333 2.319328 0.276134 -2.114712 2.108360 -0.252139 0.935928
11.966667 2.391405 0.267931 -2.086933 2.153424 -0.250565 0.858805
12.000000 2.466143 0.259752 -2.059512 2.190115 -0.249862 0.782514
12.033333 2.541019 0.251472 -2.018234 2.217871 -0.249906 0.701854
12.066667 2.617309 0.243150 -1.980478 2.236226 -0.250448 0.625520
12.100000 2.694576 0.234797 -1.961305 2.243944 -0.251160 0.552645
12.133333 2.772273 0.226379 -1.937674 2.240050 -0.251729 0.492119
12.166667 2.849726 0.217982 -1.925607 2.222742 -0.251810 0.455760
12.200000 2.926035 0.209507 -1.940398 2.189886 -0.251000 0.447367
12.233333 3.001920 0.200928 -1.922847 2.139146 -0.248936 0.467383
12.266667 3.077497 0.192261 -1.938722 2.069245 -0.245385 0.515368
12.300000 3.150724 0.183627 -1.946341 1.980699 -0.240281 0.593639
12.333333 3.220340 0.175104 -1.924741 1.874137 -0.233583 0.693468
12.366667 3.289466 0.166499 -1.915451 1.751326 -0.225386 0.799678
12.400000 3.351528 0.158443 -1.880241 1.616294 -0.216069 0.908562
12.433333 3.404225 0.151301 -1.838173 1.473786 -0.206097 1.024349
12.466667 3.456285 0.144083 -1.769876 1.327898 -0.195890 1.136020
12.500000 3.496025 0.138004 -1.667053 1.182624 -0.185859 1.226890
12.533333 3.521062 0.133262 -1.630094 1.042693 -0.176485 1.289986
12.566667 3.545388 0.128446 -1.650536 0.913311 -0.168227 1.328486
12.600000 3.568994 0.123553 -1.615647 0.797670 -0.161343 1.328994
12.633333 3.591870 0.118580 -1.561623 0.697641 -0.155969 1.275579
12.666667 3.614007 0.113524 -1.506442 0.615163 -0.152317 1.162637
12.700000 3.627748 0.108826 -1.462361 0.550889 -0.150464 1.001873
12.733333 3.640743 0.104041 -1.362320 0.503139 -0.150438 0.790034
12.766667 3.652992 0.099167 -1.313496 0.469242 -0.152235 0.519192
12.800000 3.664496 0.094201 -1.273358 0.446782 -0.156045 0.201247
12.833333 3.676039 0.089293 -1.270348 0.433830 -0.162283 -0.143127
12.866667 3.688506 0.084514 -1.294597 0.428130 -0.171227 -0.492966
12.900000 3.702236 0.079686 -1.298047 0.427010 -0.183171 -0.847142
12.933333 3.717297 0.074501 -1.346023 0.429088 -0.198507 -1.182467
12.966667 3.733274 0.068671 -1.431658 0.433259 -0.217859 -1.487173
13.000000 3.749553 0.061818 -1.550808 0.438359 -0.241420 -1.754005
13.033333 3.765071 0.054855 -1.627529 0.443579 -0.269256 -1.996285
13.066667 3.780248 0.046203 -1.722524 0.448439 -0.301333 -2.221408
13.100000 3.794650 0.037440 -1.769640 0.453434 -0.337641 -2.422371
13.133333 3.809132 0.026340 -1.817275 0.459243 -0.377786 -2.604499
13.166667 3.824168 0.012477 -1.852237 0.466200 -0.420667 -2.755947
13.200000 3.838407 -0.001485 -1.945432 0.474886 -0.465523 -2.866739
13.233333 3.851841 -0.015536 -2.077135 0.485300 -0.511215 -2.905890
13.266667 3.867227 -0.033141 -2.175700 0.497321 -0.556464 -2.857134
13.300000 3.884866 -0.054221 -2.329027 0.510402 -0.599706 -2.710256
13.333333 3.901667 -0.075358 -2.453767 0.523429 -0.639405 -2.462468
13.366667 3.921364 -0.100160 -2.626654 0.535144 -0.674200 -2.121871
13.400000 3.940194 -0.124984 -2.773935 0.543986 -0.702471 -1.708045
13.433333 3.958139 -0.149812 -2.872738 0.548709 -0.722907 -1.253720
13.466667 3.979267 -0.177139 -2.890398 0.547483 -0.734521 -0.786665
13.500000 3.999473 -0.204428 -2.822671 0.538995 -0.736902 -0.337941
13.533333 4.018738 -0.231656 -2.719564 0.522052 -0.729935 0.067317
13.566667 4.037044 -0.258800 -2.633794 0.496026 -0.714216 0.408203
13.600000 4.056497 -0.284182 -2.572808 0.460268 -0.690815 0.674521
13.633333 4.074950 -0.309437 -2.578667 0.413874 -0.660844 0.872514
13.666667 4.091372 -0.332151 -2.559421 0.357069 -0.626091 1.018067
13.700000 4.104632 -0.352225 -2.556453 0.289777 -0.588428 1.141679
13.733333 4.114266 -0.369865 -2.540479 0.212713 -0.549989 1.277152
13.766667 4.122834 -0.387309 -2.500953 0.126599 -0.512846 1.452318
13.800000 4.126464 -0.402169 -2.480436 0.033136 -0.479190 1.692913
13.833333 4.129010 -0.416811 -2.438836 -0.065440 -0.451147 1.999696
13.866667 4.126550 -0.429586 -2.379330 -0.166918 -0.429999 2.368302
13.900000 4.119279 -0.440997 -2.295438 -0.268658 -0.416392 2.775757
13.933333 4.107522 -0.451599 -2.226564 -0.368493 -0.410500 3.197203
13.966667 4.091501 -0.462320 -2.098344 -0.463660 -0.412103 3.606798
14.000000 4.071577 -0.473786 -1.971666 -0.552152 -0.420000 3.982252
14.033333 4.047771 -0.486846 -1.802443 -0.631564 -0.432990 4.310949
14.066667 4.022923 -0.499630 -1.612023 -0.700300 -0.449879 4.579474
14.100000 3.995438 -0.515192 -1.418117 -0.757321 -0.469385 4.784771
14.133333 3.966245 -0.533968 -1.236255 -0.801893 -0.490027 4.921237
14.166667 3.936072 -0.552431 -1.055728 -0.834702 -0.510137 4.992834
14.200000 3.904940 -0.570564 -0.871894 -0.856368 -0.528320 4.993195
14.233333 3.872873 -0.588353 -0.705076 -0.868640 -0.542759 4.922719
14.266667 3.839894 -0.605781 -0.541981 -0.872952 -0.551774 4.781083
14.300000 3.810483 -0.625830 -0.413248 -0.871075 -0.554046 4.572720
14.333333 3.780203 -0.645486 -0.239240 -0.864624 -0.548897 4.298591
14.366667 3.754321 -0.666326 -0.077638 -0.855017 -0.535740 3.957294
14.400000 3.727603 -0.686735 0.093027 -0.844016 -0.514688 3.557161
14.433333 3.700064 -0.706695 0.249877 -0.833236 -0.486301 3.105915
14.466667 3.671718 -0.726185 0.378470 -0.824374 -0.450733 2.616170
14.500000 3.642581 -0.745188 0.453192 -0.818250 -0.408389 2.096503
14.533333 3.616134 -0.759051 0.493963 -0.816072 -0.359428 1.569372
14.566667 3.591637 -0.766752 0.511368 -0.818391 -0.304750 1.063558
14.600000 3.566389 -0.773927 0.506763 -0.825467 -0.244876 0.605717
14.633333 3.540399 -0.780572 0.531661 -0.837192 -0.180818 0.216745
14.666667 3.513677 -0.786679 0.516441 -0.853277 -0.114420 -0.087955
14.700000 3.486233 -0.792243 0.449074 -0.873953 -0.047157 -0.299150
14.733333 3.458078 -0.797259 0.386295 -0.898683 0.019672 -0.418787
14.766667 3.428410 -0.796000 0.344601 -0.926844 0.085365 -0.460250
14.800000 3.397002 -0.789202 0.308918 -0.957719 0.148806 -0.438202
14.833333 3.364922 -0.781859 0.315957 -0.990799 0.209413 -0.372186
14.866667 3.330270 -0.769805 0.301029 -1.025625 0.266718 -0.276583
14.900000 3.294979 -0.757228 0.311673 -1.061543 0.320046 -0.173878
14.933333 3.259063 -0.744142 0.303117 -1.098184 0.368512 -0.077819
14.966667 3.222541 -0.730560 0.331099 -1.135655 0.411720 0.002004
15.000000 3.185430 -0.716497 0.339850 -1.174237 0.450111 0.058534
15.033333 3.145906 -0.700461 0.351759 -1.213895 0.483891 0.097031
15.066667 3.104224 -0.682780 0.343438 -1.254661 0.513766 0.113855
15.100000 3.062014 -0.664666 0.356590 -1.296627 0.540455 0.124919
15.133333 3.019297 -0.646137 0.370493 -1.339812 0.564742 0.135473
15.166667 2.974410 -0.626537 0.347729 -1.383791 0.586875 0.152678
15.200000 2.927547 -0.606051 0.372442 -1.427922 0.606645 0.177327
15.233333 2.878867 -0.584709 0.339506 -1.471846 0.624108 0.210740
15.266667 2.828548 -0.562784 0.330579 -1.515235 0.639220 0.253122
15.300000 2.776453 -0.540514 0.359935 -1.557481 0.652036 0.296038
15.333333 2.724015 -0.517951 0.387135 -1.598189 0.662618 0.335604
15.366667 2.669817 -0.495158 0.399473 -1.637305 0.671104 0.364849
15.400000 2.613737 -0.472327 0.402777 -1.674891 0.677677 0.383899
15.433333 2.555716 -0.449628 0.440446 -1.710688 0.682526 0.381577
15.466667 2.497492 -0.426722 0.462154 -1.744298 0.685788 0.358441
15.500000 2.439102 -0.403632 0.473215 -1.775701 0.687575 0.317595
15.533333 2.380585 -0.380379 0.494780 -1.804551 0.687919 0.260867
15.566667 2.319703 -0.357111 0.508328 -1.830295 0.686882 0.194175
15.600000 2.256703 -0.333852 0.485465 -1.852129 0.684418 0.123879
15.633333 2.193696 -0.310496 0.506225 -1.869612 0.680368 0.058374
15.666667 2.129373 -0.287292 0.502795 -1.881924 0.674353 0.004420
15.700000 2.064394 -0.264544 0.497756 -1.888070 0.666031 -0.037246
15.733333 1.999587 -0.242489 0.477830 -1.887384 0.655353 -0.058486
15.766667 1.934951 -0.220421 0.473909 -1.879190 0.642016 -0.058363
15.800000 1.870530 -0.198358 0.462820 -1.863480 0.625987 -0.041323
15.833333 1.806370 -0.176322 0.469421 -1.839782 0.607108 -0.004366
15.866667 1.743734 -0.155804 0.443865 -1.808638 0.585728 0.048492
15.900000 1.681446 -0.135352 0.459829 -1.770439 0.562041 0.114260
15.933333 1.622279 -0.116977 0.469979 -1.725451 0.536131 0.183005
15.966667 1.563542 -0.098701 0.461829 -1.674215 0.508520 0.246368
16.000000 1.509354 -0.083093 0.487853 -1.617002 0.479878 0.298561
16.033333 1.455667 -0.067614 0.491333 -1.554582 0.451337 0.334053
16.066667 1.402516 -0.052276 0.505448 -1.487071 0.423592 0.345588
16.100000 1.353964 -0.039425 0.534996 -1.415431 0.397727 0.331043
16.133333 1.306010 -0.026738 0.559779 -1.340670 0.374616 0.274101
16.166667 1.262686 -0.016161 0.586191 -1.264230 0.355027 0.178704
16.200000 1.220011 -0.005766 0.604107 -1.187304 0.339120 0.049401
16.233333 1.181393 0.003505 0.605716 -1.111402 0.326933 -0.115361
16.266667 1.146450 0.012204 0.611850 -1.038465 0.318834 -0.310223
16.300000 1.114804 0.021110 0.567907 -0.969817 0.314800 -0.523024
16.333333 1.086452 0.030905 0.563224 -0.906969 0.314849 -0.713195
16.366667 1.060946 0.042136 0.568868 -0.850721 0.318564 -0.873814
16.400000 1.036176 0.053143 0.553381 -0.801990 0.325832 -0.996435
16.433333 1.012147 0.063920 0.520222 -0.760911 0.336030 -1.070152
16.466667 0.988866 0.074456 0.307158 -0.727044 0.347864 -1.070353
16.500000 0.966337 0.084746 0.275780 -0.699601 0.360078 -1.000960
16.533333 0.944564 0.094782 0.251026 -0.677354 0.371596 -0.879014
16.566667 0.923351 0.107477 0.218515 -0.659037 0.381535 -0.699832
16.600000 0.901912 0.122066 0.186264 -0.643138 0.388435 -0.463793
16.633333 0.879758 0.137729 0.177200 -0.628119 0.390642 -0.173716
16.666667 0.858382 0.153093 0.187688 -0.612577 0.387202 0.136496
16.700000 0.837788 0.168146 0.196583 -0.595239 0.376885 0.462451
16.733333 0.817981 0.182873 0.227819 -0.575046 0.358374 0.797149
16.766667 0.798968 0.197262 0.255141 -0.551044 0.330411 1.118066
16.800000 0.779576 0.208408 0.290247 -0.522664 0.293148 1.398115
16.833333 0.760986 0.219193 0.344262 -0.490048 0.247548 1.607320
16.866667 0.743203 0.229610 0.383219 -0.453559 0.194137 1.731342
16.900000 0.726231 0.239648 0.471183 -0.413992 0.134172 1.748549
16.933333 0.711959 0.244504 0.570504 -0.372487 0.069147 1.643681
16.966667 0.700876 0.244132 0.682697 -0.330777 0.001185 1.417561
17.000000 0.690608 0.243373 0.821069 -0.290546 -0.068648 1.085224
17.033333 0.683694 0.237886 0.913169 -0.253249 -0.138978 0.678062
17.066667 0.677588 0.232023 0.972661 -0.220089 -0.208015 0.229821
17.100000 0.673592 0.222164 0.967393 -0.192195 -0.274032 -0.220983
17.133333 0.670390 0.211949 0.893863 -0.169993 -0.335721 -0.632945
17.166667 0.667249 0.198622 0.770211 -0.152959 -0.392376 -0.967542
17.200000 0.663409 0.182482 0.644702 -0.140343 -0.442852 -1.193120
17.233333 0.660344 0.166035 0.554095 -0.131027 -0.486960 -1.300423
17.266667 0.655774 0.147254 0.463097 -0.123823 -0.524559 -1.285078
17.300000 0.649720 0.126526 0.399500 -0.116952 -0.555767 -1.159322
17.333333 0.644430 0.105558 0.369461 -0.108902 -0.580327 -0.950737
17.366667 0.639902 0.084375 0.361666 -0.098594 -0.597941 -0.697162
17.400000 0.636134 0.063002 0.369294 -0.085151 -0.608482 -0.440191
17.433333 0.632704 0.041447 0.385878 -0.067878 -0.611468 -0.206920
17.466667 0.630122 0.020234 0.400315 -0.046537 -0.606528 -0.022549
17.500000 0.628295 -0.001097 0.419948 -0.021749 -0.593430 0.097926
17.533333 0.627221 -0.022520 0.446091 0.005678 -0.572383 0.152931
17.566667 0.626896 -0.044011 0.444443 0.034717 -0.543647 0.152431
17.600000 0.627317 -0.065547 0.466649 0.064298 -0.507604 0.112699
17.633333 0.629827 -0.084612 0.478499 0.093149 -0.464717 0.047991
17.666667 0.634233 -0.100841 0.483715 0.120238 -0.415995 -0.028745
17.700000 0.640255 -0.114103 0.484218 0.144984 -0.362884 -0.101127
17.733333 0.647546 -0.124311 0.464433 0.167014 -0.306833 -0.157702
17.766667 0.655556 -0.134473 0.433679 0.186283 -0.249488 -0.194165
17.800000 0.663486 -0.141233 0.423984 0.203229 -0.192945 -0.210032
17.833333 0.670768 -0.144763 0.392711 0.218707 -0.139425 -0.206517
17.866667 0.678746 -0.148223 0.382509 0.233899 -0.090557 -0.184188
17.900000 0.685906 -0.148975 0.373748 0.250146 -0.047431 -0.150778
17.933333 0.692839 -0.147488 0.384744 0.268649 -0.010836 -0.115841
17.966667 0.700215 -0.144266 0.384060 0.290501 0.018528 -0.085706
18.000000 0.708266 -0.140975 0.383150 0.316218 0.040692 -0.063627
18.033333 0.716987 -0.137618 0.402997 0.345955 0.056151 -0.054752
18.066667 0.728205 -0.134035 0.412700 0.379225 0.065311 -0.062002
18.100000 0.740081 -0.130395 0.411088 0.415184 0.068716 -0.083582
18.133333 0.755257 -0.127432 0.412183 0.452722 0.067099 -0.115329
18.166667 0.771071 -0.124420 0.388610 0.490579 0.061483 -0.150972
18.200000 0.790008 -0.122855 0.383485 0.527422 0.052955 -0.189404
18.233333 0.809558 -0.121248 0.371517 0.561923 0.042390 -0.223542
18.266667 0.829708 -0.119599 0.363172 0.593216 0.030764 -0.248620
18.300000 0.850442 -0.117911 0.351959 0.620619 0.018956 -0.262816
18.333333 0.872666 -0.117840 0.344777 0.643895 0.007684 -0.264694
18.366667 0.895444 -0.117733 0.330782 0.662918 -0.002392 -0.257101
18.400000 0.919086 -0.118756 0.321730 0.678032 -0.010903 -0.238871
18.433333 0.942928 -0.120490 0.315871 0.689827 -0.017513 -0.214660
18.466667 0.967276 -0.122186 0.298774 0.698665 -0.021924 -0.187287
18.500000 0.990833 -0.123777 0.300241 0.704987 -0.023905 -0.160655
18.533333 1.014865 -0.125327 0.285075 0.709172 -0.023444 -0.134656
18.566667 1.038069 -0.126263 0.282714 0.711811 -0.020721 -0.110976
18.600000 1.061719 -0.127156 0.288982 0.713327 -0.015966 -0.091294
18.633333 1.085802 -0.128003 0.294344 0.713963 -0.009485 -0.074813
18.666667 1.110305 -0.128806 0.287340 0.714195 -0.001753 -0.061483
18.700000 1.133705 -0.128450 0.299801 0.714410 0.006671 -0.049185
18.733333 1.157498 -0.128050 0.290930 0.714920 0.015367 -0.040341
18.766667 1.181673 -0.127605 0.282252 0.715786 0.023982 -0.033366
18.800000 1.204918 -0.126180 0.279312 0.717183 0.032144 -0.026880
18.833333 1.228521 -0.124713 0.271334 0.719353 0.039472 -0.020590
18.866667 1.252472 -0.123206 0.276004 0.722396 0.045686 -0.015845
18.900000 1.276284 -0.121184 0.281293 0.726300 0.050591 -0.011804
18.933333 1.300216 -0.118891 0.277822 0.731058 0.053912 -0.008216
18.966667 1.324215 -0.116508 0.277492 0.736724 0.055440 -0.005715
19.000000 1.348722 -0.114226 0.284793 0.743103 0.055156 -0.005803
19.033333 1.373523 -0.111917 0.287224 0.749962 0.053140 -0.007929
19.066667 1.398610 -0.109584 0.288769 0.757037 0.049443 -0.011810
19.100000 1.424111 -0.107699 0.287965 0.764104 0.044253 -0.017507
19.133333 1.449876 -0.105796 0.281931 0.770866 0.037925 -0.025799
19.166667 1.475882 -0.104615 0.268899 0.776999 0.030845 -0.035648
19.200000 1.502132 -0.103420 0.271823 0.782278 0.023308 -0.045419
19.233333 1.528580 -0.102890 0.276597 0.786511 0.015668 -0.056890
19.266667 1.555072 -0.103094 0.277149 0.789629 0.008389 -0.068437
19.300000 1.581777 -0.103286 0.277284 0.791626 0.001782 -0.080501
19.333333 1.608682 -0.103466 0.270128 0.792632 -0.003921 -0.090618
19.366667 1.635600 -0.103998 0.274753 0.792801 -0.008557 -0.101152
19.400000 1.662108 -0.104777 0.261884 0.792406 -0.011951 -0.110103
19.433333 1.688787 -0.105544 0.269364 0.791677 -0.014042 -0.115323
19.466667 1.714822 -0.106332 0.251605 0.790804 -0.014897 -0.116193
19.500000 1.741011 -0.107105 0.244087 0.789964 -0.014583 -0.114611
19.533333 1.766847 -0.107758 0.240813 0.789324 -0.013167 -0.110488
19.566667 1.792822 -0.108395 0.233678 0.789070 -0.010753 -0.099364
19.600000 1.819035 -0.108928 0.226662 0.789236 -0.007489 -0.085489
19.633333 1.845371 -0.109210 0.238558 0.789901 -0.003546 -0.071243
19.666667 1.871822 -0.109477 0.233523 0.791052 0.000906 -0.058406
19.700000 1.898265 -0.109402 0.220332 0.792685 0.005678 -0.043323
19.733333 1.924809 -0.109311 0.233526 0.794685 0.010572 -0.030459
19.766667 1.951184 -0.108839 0.240762 0.796902 0.015383 -0.023688
19.800000 1.977516 -0.107968 0.229724 0.799299 0.019878 -0.020528
19.833333 2.003925 -0.107083 0.214660 0.801854 0.023854 -0.016954
19.866667 2.030580 -0.106016 0.228411 0.804593 0.027130 -0.013167
19.900000 2.057648 -0.104743 0.233674 0.807509 0.029543 -0.013549
19.933333 2.084773 -0.103460 0.233957 0.810660 0.030905 -0.012477
19.966667 2.111905 -0.102142 0.228725 0.814086 0.031074 -0.009529
20.000000 2.139078 -0.100817 0.223342 0.817729 0.030038 -0.007915
20.033333 2.166291 -0.099588 0.227167 0.821461 0.027842 -0.011368
20.066667 2.193529 -0.098355 0.218688 0.825158 0.024540 -0.018552
20.100000 2.220787 -0.097121 0.222055 0.828753 0.020232 -0.027151
20.133333 2.248433 -0.096291 0.229352 0.832180 0.015092 -0.039832
20.166667 2.276511 -0.095876 0.228559 0.835366 0.009359 -0.054948
20.200000 2.304586 -0.095461 0.232490 0.838331 0.003212 -0.069918
20.233333 2.332921 -0.095493 0.226739 0.841138 -0.003183 -0.083627
20.266667 2.361305 -0.095912 0.234133 0.843869 -0.009595 -0.096949
20.300000 2.389570 -0.096659 0.213829 0.846543 -0.015763 -0.108088
20.333333 2.417797 -0.097405 0.199296 0.849167 -0.021450 -0.117063
20.366667 2.445978 -0.098152 0.203981 0.851815 -0.026514 -0.123431
20.400000 2.473874 -0.099174 0.192269 0.854482 -0.030801 -0.125684
20.433333 2.502087 -0.100520 0.184367 0.857155 -0.034159 -0.122321
20.466667 2.530760 -0.102130 0.195543 0.859773 -0.036504 -0.114174
20.500000 2.559353 -0.103736 0.188270 0.862288 -0.037834 -0.102960
20.533333 2.588445 -0.105292 0.186512 0.864619 -0.038179 -0.089879
20.566667 2.617813 -0.106803 0.181603 0.866625 -0.037521 -0.075356
20.600000 2.647074 -0.108303 0.181861 0.868176 -0.035884 -0.063498
20.633333 2.676220 -0.109792 0.171586 0.869128 -0.033391 -0.055597
20.666667 2.705317 -0.110847 0.157474 0.869414 -0.030211 -0.045015
20.700000 2.734280 -0.111888 0.169581 0.868975 -0.026486 -0.034546
20.733333 2.763099 -0.112912 0.173734 0.867860 -0.022403 -0.021672
20.766667 2.792271 -0.113434 0.184687 0.866128 -0.018216 -0.008195
20.800000 2.821281 -0.113938 0.174812 0.863857 -0.014160 0.008642
20.833333 2.850118 -0.114423 0.178292 0.861131 -0.010430 0.025722
20.866667 2.878958 -0.114518 0.159069 0.857986 -0.007163 0.035796
20.900000 2.907679 -0.114374 0.170389 0.854456 -0.004512 0.040539
20.933333 2.936198 -0.114210 0.158797 0.850410 -0.002581 0.040575
20.966667 2.964507 -0.114027 0.169881 0.845702 -0.001393 0.034516
21.000000 2.992596 -0.113825 0.200455 0.840188 -0.000971 0.019806
21.033333 3.020455 -0.113603 0.190501 0.833662 -0.001277 0.001209
21.066667 3.048499 -0.113613 0.189537 0.825910 -0.002224 -0.021832
21.100000 3.076294 -0.113603 0.203895 0.816730 -0.003687 -0.046169
21.133333 3.103832 -0.113573 0.187533 0.806075 -0.005521 -0.072853
21.166667 3.131044 -0.113905 0.177476 0.793890 -0.007514 -0.097149
21.200000 3.157982 -0.114217 0.181693 0.780019 -0.009407 -0.115188
21.233333 3.184634 -0.114507 0.158232 0.764315 -0.010914 -0.127573
21.266667 3.210296 -0.115024 0.161373 0.746615 -0.011746 -0.132598
21.300000 3.234749 -0.115714 0.146369 0.726825 -0.011618 -0.129141
21.333333 3.258893 -0.116380 0.145148 0.704677 -0.010215 -0.120115
21.366667 3.281883 -0.117064 0.143930 0.680130 -0.007384 -0.106970
21.400000 3.304554 -0.117722 0.138471 0.653358 -0.003067 -0.090001
21.433333 3.326900 -0.118352 0.143118 0.624616 0.002685 -0.072200
21.466667 3.348916 -0.118954 0.148717 0.594280 0.009688 -0.052924
21.500000 3.369157 -0.119019 0.139897 0.562653 0.017628 -0.036138
21.533333 3.387780 -0.118488 0.133448 0.530389 0.026038 -0.018074
21.566667 3.404581 -0.117316 0.133753 0.498007 0.034467 -0.000469
21.600000 3.419422 -0.115450 0.124928 0.466057 0.042457 0.015879
21.633333 3.433928 -0.113555 0.138764 0.435164 0.049601 0.032738
21.666667 3.446666 -0.111023 0.131767 0.406156 0.055356 0.051601
21.700000 3.459075 -0.108466 0.141704 0.379776 0.059395 0.071239
21.733333 3.471160 -0.105887 0.143185 0.356430 0.061538 0.089028
21.766667 3.481725 -0.103289 0.150707 0.336446 0.061714 0.106499
21.800000 3.491976 -0.100672 0.144594 0.319876 0.059961 0.122890
21.833333 3.501430 -0.098719 0.155589 0.306708 0.056380 0.135952
21.866667 3.510584 -0.096752 0.160838 0.296366 0.051494 0.143540
21.900000 3.519445 -0.094771 0.161380 0.288350 0.045731 0.147794
21.933333 3.528020 -0.092780 0.167498 0.282485 0.039453 0.148168
21.966667 3.536316 -0.090779 0.184568 0.278672 0.032985 0.141747
22.000000 3.546279 -0.090700 0.184012 0.276786 0.026757 0.126958
22.033333 3.555977 -0.090613 0.189990 0.276616 0.021088 0.106821
22.066667 3.565413 -0.090518 0.189156 0.278233 0.016081 0.081959
22.100000 3.574594 -0.090414 0.204369 0.281703 0.011842 0.052044
22.133333 3.583526 -0.090300 0.212058 0.286727 0.008589 0.020657
22.166667 3.592215 -0.090176 0.199667 0.292883 0.006576 -0.006150
22.200000 3.600665 -0.090041 0.203761 0.300070 0.005733 -0.026659
22.233333 3.608883 -0.089895 0.202246 0.308348 0.006073 -0.040830
22.266667 3.619525 -0.089961 0.185501 0.317665 0.007633 -0.046645
22.300000 3.631824 -0.089855 0.182722 0.327880 0.010414 -0.042762
22.333333 3.643902 -0.089737 0.175950 0.338944 0.014215 -0.031951
22.366667 3.655759 -0.089606 0.168175 0.350768 0.018665 -0.019138
22.400000 3.667396 -0.089462 0.166040 0.363047 0.023477 -0.004986
22.433333 3.678814 -0.089304 0.177187 0.375235 0.028307 0.008143
22.466667 3.690931 -0.088198 0.184434 0.386930 0.032690 0.014151
22.500000 3.703942 -0.086328 0.197272 0.397815 0.036160 0.008718
22.533333 3.716735 -0.084445 0.195745 0.407600 0.038385 -0.006259
22.566667 3.730752 -0.082217 0.190588 0.415813 0.039123 -0.030421
22.600000 3.745880 -0.079933 0.196619 0.421984 0.038280 -0.062085
22.633333 3.761597 -0.077857 0.203883 0.425516 0.035787 -0.098326
22.666667 3.777390 -0.076110 0.185819 0.425836 0.031782 -0.130794
22.700000 3.792829 -0.075044 0.189262 0.422313 0.026551 -0.154922
22.733333 3.807376 -0.074891 0.174148 0.414400 0.020432 -0.170318
22.766667 3.821682 -0.074734 0.163402 0.402136 0.013886 -0.176190
22.800000 3.835740 -0.074571 0.144340 0.385730 0.007308 -0.171990
22.833333 3.849548 -0.074401 0.129474 0.365784 0.001120 -0.158831
22.866667 3.863102 -0.074225 0.128591 0.342810 -0.004381 -0.142450
22.900000 3.874307 -0.074792 0.124934 0.317663 -0.009007 -0.122320
22.933333 3.885254 -0.075350 0.130812 0.291061 -0.012717 -0.102330
22.966667 3.893808 -0.076198 0.133062 0.263585 -0.015548 -0.082599
23.000000 3.902103 -0.077033 0.139776 0.235706 -0.017538 -0.066280
23.033333 3.908153 -0.077894 0.132590 0.208006 -0.018771 -0.053435
23.066667 3.913950 -0.078737 0.134757 0.181183 -0.019317 -0.043367
23.100000 3.919499 -0.079561 0.125289 0.155526 -0.019330 -0.038417
23.133333 3.924803 -0.080365 0.125489 0.131432 -0.018909 -0.034975
23.166667 3.928633 -0.080979 0.109128 0.109077 -0.018220 -0.030350
23.200000 3.931373 -0.081460 0.115258 0.088692 -0.017464 -0.023027
23.233333 3.933275 -0.081907 0.124373 0.070126 -0.016844 -0.013786
23.266667 3.934574 -0.082281 0.117504 0.053151 -0.016584 -0.001028
23.300000 3.935401 -0.082718 0.119381 0.037635 -0.016862 0.014719
23.333333 3.936025 -0.083124 0.126942 0.023364 -0.017867 0.030704
23.366667 3.936255 -0.083606 0.121038 0.010108 -0.019696 0.042435
23.400000 3.936300 -0.084055 0.120801 -0.002475 -0.022377 0.049312
23.433333 3.936106 -0.084546 0.119424 -0.014697 -0.025922 0.052903
23.466667 3.935623 -0.085160 0.120181 -0.026844 -0.030262 0.053017
23.500000 3.934876 -0.085984 0.134065 -0.039146 -0.035246 0.050077
23.533333 3.933787 -0.087046 0.140809 -0.051646 -0.040577 0.047680
23.566667 3.932231 -0.088377 0.144636 -0.064298 -0.045982 0.047611
23.600000 3.930084 -0.090011 0.145137 -0.076837 -0.051079 0.050679
23.633333 3.927158 -0.092013 0.144070 -0.088630 -0.055273 0.055915
23.666667 3.923290 -0.094521 0.132494 -0.098831 -0.057803 0.061386
23.700000 3.919327 -0.096976 0.133547 -0.106450 -0.057802 0.065800
23.733333 3.915279 -0.099372 0.126480 -0.110676 -0.054585 0.065239
23.766667 3.910257 -0.102138 0.132074 -0.110666 -0.047476 0.058404
23.800000 3.905176 -0.104839 0.147677 -0.105778 -0.035902 0.044843
23.833333 3.899933 -0.107318 0.152664 -0.095746 -0.019510 0.022861
23.866667 3.895126 -0.109204 0.163743 -0.080811 0.001565 -0.007181
23.900000 3.890299 -0.111015 0.172645 -0.061580 0.026809 -0.041159
23.933333 3.886982 -0.111351 0.168587 -0.038696 0.055750 -0.075373
23.966667 3.885470 -0.109888 0.175131 -0.013049 0.087774 -0.107936
24.000000 3.885978 -0.106193 0.162670 0.014211 0.121845 -0.136662
24.033333 3.888676 -0.099976 0.133371 0.041744 0.156558 -0.156324
24.066667 3.891400 -0.093690 0.107087 0.068514 0.190716 -0.161314
24.100000 3.894156 -0.087342 0.100314 0.093651 0.223163 -0.152842
24.133333 3.898527 -0.078621 0.108174 0.116321 0.252591 -0.133126
24.166667 3.904137 -0.067664 0.101081 0.135913 0.277732 -0.101053
24.200000 3.909787 -0.056671 0.099879 0.152235 0.297589 -0.059623
24.233333 3.915478 -0.045655 0.106468 0.165565 0.311746 -0.014846
24.266667 3.921739 -0.033460 0.104031 0.176109 0.319863 0.024859
24.300000 3.928337 -0.020666 0.103412 0.184090 0.321885 0.057042
24.333333 3.935161 -0.007859 0.106261 0.189917 0.317890 0.082055
24.366667 3.942025 0.004919 0.107923 0.194077 0.308233 0.097339
24.400000 3.948893 0.016392 0.125235 0.196999 0.293622 0.102937
24.433333 3.955575 0.025848 0.129680 0.198950 0.274731 0.100918
24.466667 3.962297 0.035239 0.133382 0.200314 0.252264 0.095021
24.500000 3.969057 0.044555 0.137687 0.201509 0.226864 0.086633
24.533333 3.975546 0.050362 0.138859 0.202866 0.199729 0.075792
24.566667 3.982072 0.056079 0.147311 0.204653 0.171874 0.063453
24.600000 3.988635 0.061698 0.143323 0.207032 0.144118 0.053219
24.633333 3.995234 0.067214 0.138065 0.210127 0.116955 0.047763
24.666667 4.002099 0.069757 0.135179 0.213938 0.091148 0.046991
24.700000 4.008997 0.072188 0.136118 0.218439 0.067407 0.050493
24.733333 4.016365 0.072682 0.143370 0.223460 0.045826 0.058744
24.766667 4.023765 0.073060 0.145416 0.228727 0.026551 0.070877
24.800000 4.031564 0.072554 0.147273 0.233971 0.009745 0.082463
24.833333 4.039393 0.071930 0.147746 0.238825 -0.004216 0.087926
24.866667 4.047604 0.070926 0.142043 0.242816 -0.015427 0.087504
24.900000 4.056251 0.069742 0.149112 0.245270 -0.023932 0.081155
24.933333 4.064922 0.068442 0.165882 0.245642 -0.029816 0.067932
24.966667 4.073614 0.067027 0.186028 0.243500 -0.033267 0.047612
25.000000 4.082325 0.065498 0.179883 0.238477 -0.034603 0.023409
25.033333 4.091053 0.063856 0.172855 0.230337 -0.034220 0.000751
25.066667 4.099794 0.062101 0.177827 0.219181 -0.032426 -0.021245
25.100000 4.108088 0.060797 0.167397 0.205554 -0.029685 -0.040048
25.133333 4.116392 0.059381 0.167684 0.189905 -0.026288 -0.055190
25.166667 4.123284 0.058484 0.154478 0.172714 -0.022509 -0.062017
25.200000 4.128434 0.058084 0.146931 0.154546 -0.018590 -0.061587
25.233333 4.131580 0.058182 0.141399 0.136197 -0.014807 -0.057469
25.266667 4.134739 0.058166 0.149133 0.118287 -0.011362 -0.048380
25.300000 4.137916 0.058035 0.143021 0.101160 -0.008308 -0.037146
25.333333 4.141116 0.057788 0.151550 0.085255 -0.005722 -0.022799
25.366667 4.143058 0.057767 0.156894 0.070981 -0.003645 -0.011588
25.400000 4.145032 0.057625 0.150839 0.058521 -0.002058 -0.004611
25.433333 4.147043 0.057362 0.153554 0.047650 -0.000827 0.000227
25.466667 4.148332 0.057282 0.143667 0.038205 0.000156 0.003210
25.500000 4.149064 0.057353 0.146261 0.030112 0.000930 0.004587
25.533333 4.149460 0.057520 0.156923 0.023322 0.001481 0.002846
25.566667 4.149526 0.057823 0.147015 0.017670 0.001802 0.002861
25.600000 4.149664 0.057992 0.149917 0.013087 0.001880 0.005087
