t x y theta dxdt dydt dthetadt
0.000000 0.000000 0.000000 -3.064890 -0.049999 -0.144018 3.003433
0.033333 -0.001700 -0.004854 -2.933425 -0.051594 -0.148426 2.727837
0.066667 -0.003450 -0.009870 -2.832587 -0.053172 -0.152824 2.386278
0.100000 -0.005251 -0.015048 -2.748521 -0.054734 -0.157207 1.993610
0.133333 -0.007100 -0.020386 -2.690202 -0.056278 -0.161570 1.570145
0.166667 -0.009003 -0.025860 -2.663413 -0.057803 -0.165909 1.133046
0.200000 -0.010961 -0.031469 -2.642138 -0.059304 -0.170222 0.698336
0.233333 -0.012963 -0.037233 -2.628271 -0.060780 -0.174502 0.286729
0.266667 -0.015019 -0.043130 -2.628516 -0.062229 -0.178746 -0.087158
0.300000 -0.017130 -0.049160 -2.633817 -0.063649 -0.182952 -0.411772
0.333333 -0.019294 -0.055321 -2.679792 -0.065037 -0.187121 -0.680307
0.366667 -0.021498 -0.061629 -2.732295 -0.066393 -0.191252 -0.890379
0.400000 -0.023742 -0.068081 -2.783736 -0.067717 -0.195342 -1.038907
0.433333 -0.026022 -0.074675 -2.841264 -0.069010 -0.199393 -1.131179
0.466667 -0.028340 -0.081408 -2.896890 -0.070275 -0.203400 -1.172665
0.500000 -0.030711 -0.088267 -2.943893 -0.071513 -0.207359 -1.165967
0.533333 -0.033117 -0.095261 -3.002636 -0.072734 -0.211262 -1.118324
0.566667 -0.035576 -0.102379 -3.026433 -0.073940 -0.215102 -1.038429
0.600000 -0.038067 -0.109626 -3.054689 -0.075136 -0.218875 -0.935220
0.633333 -0.040589 -0.117000 -3.087486 -0.076327 -0.222577 -0.815244
0.666667 -0.043141 -0.124499 -3.109099 -0.077518 -0.226208 -0.682271
0.700000 -0.045748 -0.132117 -3.130183 -0.078715 -0.229769 -0.542465
0.733333 -0.048383 -0.139855 3.131889 -0.079923 -0.233265 -0.401783
0.766667 -0.051074 -0.147710 3.119531 -0.081148 -0.236698 -0.257895
0.800000 -0.053798 -0.155672 3.094543 -0.082393 -0.240074 -0.104776
0.833333 -0.056555 -0.163741 3.102888 -0.083660 -0.243399 0.057166
0.866667 -0.059347 -0.171913 3.119980 -0.084948 -0.246679 0.225730
0.900000 -0.062195 -0.180196 3.128474 -0.086254 -0.249919 0.399690
0.933333 -0.065078 -0.188581 3.133639 -0.087574 -0.253122 0.581155
0.966667 -0.068017 -0.197075 -3.132910 -0.088905 -0.256293 0.765529
1.000000 -0.071013 -0.205676 -3.110453 -0.090244 -0.259435 0.940254
1.033333 -0.074044 -0.214383 -3.067333 -0.091589 -0.262545 1.103683
1.066667 -0.077132 -0.223195 -3.032616 -0.092940 -0.265624 1.257243
1.100000 -0.080258 -0.232110 -2.983850 -0.094301 -0.268670 1.398974
1.133333 -0.083423 -0.241127 -2.900026 -0.095675 -0.271679 1.524420
1.166667 -0.086628 -0.250243 -2.842878 -0.097065 -0.274648 1.636984
1.200000 -0.089875 -0.259458 -2.794697 -0.098480 -0.277576 1.738582
1.233333 -0.093164 -0.268768 -2.727847 -0.099925 -0.280459 1.821812
1.266667 -0.096511 -0.278176 -2.661565 -0.101405 -0.283295 1.874696
1.300000 -0.099903 -0.287676 -2.610121 -0.102921 -0.286083 1.887945
1.333333 -0.103341 -0.297267 -2.554137 -0.104475 -0.288821 1.854734
1.366667 -0.106838 -0.306950 -2.482637 -0.106065 -0.291508 1.756940
1.400000 -0.110395 -0.316725 -2.412658 -0.107687 -0.294142 1.590533
1.433333 -0.114013 -0.326588 -2.334919 -0.109335 -0.296722 1.356131
1.466667 -0.117692 -0.336539 -2.238176 -0.111006 -0.299247 1.058184
1.500000 -0.121421 -0.346571 -2.131680 -0.112696 -0.301716 0.698505
1.533333 -0.125201 -0.356680 -2.102264 -0.114399 -0.304130 0.285614
1.566667 -0.129033 -0.366865 -2.116306 -0.116116 -0.306490 -0.158646
1.600000 -0.132928 -0.377132 -2.154305 -0.117846 -0.308798 -0.625530
1.633333 -0.136886 -0.387480 -2.214733 -0.119589 -0.311056 -1.100956
1.666667 -0.140899 -0.397898 -2.275956 -0.121347 -0.313266 -1.571250
1.700000 -0.144968 -0.408385 -2.358020 -0.123121 -0.315432 -2.010974
1.733333 -0.149094 -0.418940 -2.407452 -0.124914 -0.317556 -2.413117
1.766667 -0.153284 -0.429570 -2.512492 -0.126726 -0.319640 -2.778220
1.800000 -0.157534 -0.440266 -2.606139 -0.128559 -0.321685 -3.099641
1.833333 -0.161848 -0.451033 -2.730627 -0.130413 -0.323694 -3.369535
1.866667 -0.166223 -0.461865 -2.846306 -0.132287 -0.325665 -3.579761
1.900000 -0.170657 -0.472760 -2.954680 -0.134182 -0.327598 -3.733856
1.933333 -0.175153 -0.483717 -3.107827 -0.136097 -0.329494 -3.814581
1.966667 -0.179715 -0.494740 2.999274 -0.138031 -0.331352 -3.806205
2.000000 -0.184345 -0.505828 2.825616 -0.139981 -0.333171 -3.694835
2.033333 -0.189042 -0.516977 2.698722 -0.141944 -0.334948 -3.480380
2.066667 -0.193802 -0.528177 2.560445 -0.143918 -0.336684 -3.163162
2.100000 -0.198631 -0.539437 2.413812 -0.145899 -0.338376 -2.743999
2.133333 -0.203529 -0.550755 2.288974 -0.147882 -0.340024 -2.240226
2.166667 -0.208495 -0.562130 2.210112 -0.149866 -0.341624 -1.671347
2.200000 -0.213523 -0.573552 2.157618 -0.151849 -0.343179 -1.060119
2.233333 -0.218620 -0.585028 2.148149 -0.153830 -0.344687 -0.425387
2.266667 -0.223787 -0.596557 2.169247 -0.155811 -0.346147 0.206447
2.300000 -0.229015 -0.608130 2.193112 -0.157794 -0.347558 0.809376
2.333333 -0.234303 -0.619748 2.238920 -0.159783 -0.348922 1.365182
2.366667 -0.239662 -0.631413 2.320014 -0.161783 -0.350239 1.859386
2.400000 -0.245083 -0.643120 2.416708 -0.163796 -0.351509 2.279012
2.433333 -0.250567 -0.654866 2.502868 -0.165826 -0.352733 2.621585
2.466667 -0.256123 -0.666655 2.607374 -0.167879 -0.353914 2.891242
2.500000 -0.261744 -0.678481 2.735930 -0.169956 -0.355055 3.094104
2.533333 -0.267438 -0.690347 2.880496 -0.172057 -0.356157 3.227858
2.566667 -0.273202 -0.702247 3.015227 -0.174184 -0.357224 3.292370
2.600000 -0.279037 -0.714178 3.126253 -0.176336 -0.358256 3.293406
2.633333 -0.284948 -0.726140 -3.078465 -0.178512 -0.359256 3.227980
2.666667 -0.290931 -0.738136 -2.966824 -0.180710 -0.360224 3.094712
2.700000 -0.296987 -0.750165 -2.844600 -0.182928 -0.361159 2.894517
2.733333 -0.303117 -0.762225 -2.728954 -0.185166 -0.362063 2.637049
2.766667 -0.309321 -0.774316 -2.592108 -0.187427 -0.362933 2.325667
2.800000 -0.315606 -0.786438 -2.493037 -0.189710 -0.363768 1.955590
2.833333 -0.321964 -0.798588 -2.414654 -0.192019 -0.364565 1.526128
2.866667 -0.328397 -0.810763 -2.395494 -0.194355 -0.365321 1.040366
2.900000 -0.334903 -0.822963 -2.387533 -0.196720 -0.366034 0.504485
2.933333 -0.341497 -0.835187 -2.366481 -0.199112 -0.366702 -0.070258
2.966667 -0.348164 -0.847432 -2.366667 -0.201528 -0.367321 -0.658816
3.000000 -0.354905 -0.859697 -2.372388 -0.203965 -0.367888 -1.229573
3.033333 -0.361736 -0.871981 -2.394121 -0.206420 -0.368400 -1.752573
3.066667 -0.368656 -0.884283 -2.479289 -0.208884 -0.368856 -2.199523
3.100000 -0.375665 -0.896599 -2.596789 -0.211351 -0.369253 -2.543716
3.133333 -0.382764 -0.908927 -2.753994 -0.213818 -0.369586 -2.762210
3.166667 -0.389937 -0.921268 -2.891892 -0.216283 -0.369851 -2.847178
3.200000 -0.397198 -0.933615 -3.065005 -0.218738 -0.370048 -2.792176
3.233333 -0.404531 -0.945973 3.062592 -0.221182 -0.370175 -2.596450
3.266667 -0.411938 -0.958339 2.942484 -0.223619 -0.370227 -2.270436
3.300000 -0.419433 -0.970696 2.860956 -0.226050 -0.370204 -1.836869
3.333333 -0.427017 -0.983044 2.812055 -0.228478 -0.370110 -1.329597
3.366667 -0.434672 -0.995395 2.795863 -0.230904 -0.369948 -0.780150
3.400000 -0.442399 -1.007749 2.783034 -0.233338 -0.369719 -0.228308
3.433333 -0.450212 -1.020087 2.802895 -0.235783 -0.369430 0.289174
3.466667 -0.458111 -1.032406 2.839463 -0.238242 -0.369089 0.745052
3.500000 -0.466097 -1.044705 2.887165 -0.240718 -0.368702 1.121634
3.533333 -0.474153 -1.057001 2.961288 -0.243214 -0.368275 1.413112
3.566667 -0.482297 -1.069274 3.042127 -0.245733 -0.367811 1.622192
3.600000 -0.490532 -1.081523 3.133711 -0.248270 -0.367319 1.752816
3.633333 -0.498834 -1.093765 -3.065522 -0.250825 -0.366803 1.813459
3.666667 -0.507227 -1.105989 -2.991921 -0.253397 -0.366266 1.808962
3.700000 -0.515710 -1.118194 -2.933905 -0.255983 -0.365709 1.749517
3.733333 -0.524284 -1.130380 -2.886458 -0.258579 -0.365135 1.641293
3.766667 -0.532951 -1.142545 -2.840342 -0.261179 -0.364545 1.483698
3.800000 -0.541710 -1.154689 -2.779651 -0.263782 -0.363938 1.286690
3.833333 -0.550560 -1.166810 -2.750650 -0.266379 -0.363313 1.058398
3.866667 -0.559473 -1.178917 -2.695006 -0.268964 -0.362671 0.808757
3.900000 -0.568477 -1.191001 -2.618873 -0.271526 -0.362014 0.536168
3.933333 -0.577572 -1.203061 -2.606657 -0.274054 -0.361341 0.245183
3.966667 -0.586759 -1.215097 -2.604938 -0.276541 -0.360653 -0.059149
4.000000 -0.596036 -1.227109 -2.636684 -0.278973 -0.359951 -0.373924
4.033333 -0.605403 -1.239097 -2.659253 -0.281337 -0.359234 -0.695930
4.066667 -0.614824 -1.251064 -2.697231 -0.283623 -0.358503 -1.021006
4.100000 -0.624334 -1.263005 -2.741833 -0.285825 -0.357756 -1.334341
4.133333 -0.633930 -1.274921 -2.780673 -0.287939 -0.356992 -1.631543
4.166667 -0.643611 -1.286811 -2.844840 -0.289959 -0.356209 -1.903538
4.200000 -0.653341 -1.298676 -2.904797 -0.291885 -0.355406 -2.149548
4.233333 -0.663119 -1.310514 -2.990307 -0.293723 -0.354580 -2.368062
4.266667 -0.672941 -1.322325 -3.075841 -0.295474 -0.353729 -2.552637
4.300000 -0.682840 -1.334111 3.092903 -0.297141 -0.352852 -2.700117
4.333333 -0.692782 -1.345866 2.976341 -0.298726 -0.351949 -2.800427
4.366667 -0.702764 -1.357592 2.888180 -0.300235 -0.351018 -2.850927
4.400000 -0.712819 -1.369283 2.774305 -0.301670 -0.350060 -2.838016
4.433333 -0.722910 -1.380941 2.664720 -0.303032 -0.349076 -2.750855
4.466667 -0.733070 -1.392565 2.568519 -0.304320 -0.348067 -2.588954
4.500000 -0.743262 -1.404155 2.471633 -0.305534 -0.347035 -2.353604
4.533333 -0.753485 -1.415709 2.350903 -0.306673 -0.345981 -2.047114
4.566667 -0.763737 -1.427227 2.245510 -0.307733 -0.344905 -1.666482
4.600000 -0.774017 -1.438708 2.201114 -0.308717 -0.343809 -1.220842
4.633333 -0.784347 -1.450157 2.156211 -0.309624 -0.342695 -0.724276
4.666667 -0.794701 -1.461567 2.143578 -0.310458 -0.341562 -0.184540
4.700000 -0.805076 -1.472937 2.137818 -0.311224 -0.340412 0.388578
4.733333 -0.815470 -1.484265 2.150421 -0.311927 -0.339248 0.979399
4.766667 -0.825903 -1.495564 2.196738 -0.312572 -0.338073 1.566312
4.800000 -0.836351 -1.506819 2.264589 -0.313156 -0.336891 2.130644
4.833333 -0.846811 -1.518030 2.356274 -0.313682 -0.335702 2.656495
4.866667 -0.857282 -1.529196 2.473058 -0.314149 -0.334507 3.116996
4.900000 -0.867761 -1.540316 2.601190 -0.314556 -0.333309 3.484571
4.933333 -0.878265 -1.551405 2.760935 -0.314902 -0.332105 3.731287
4.966667 -0.888791 -1.562464 2.878720 -0.315180 -0.330889 3.838903
5.000000 -0.899319 -1.573473 3.059992 -0.315389 -0.329656 3.790176
5.033333 -0.909847 -1.584432 -3.038804 -0.315526 -0.328403 3.574276
5.066667 -0.920386 -1.595367 -2.843266 -0.315590 -0.327127 3.194427
5.100000 -0.930934 -1.606276 -2.671614 -0.315573 -0.325818 2.662279
5.133333 -0.941475 -1.617133 -2.546055 -0.315476 -0.324474 2.004818
5.166667 -0.952007 -1.627935 -2.475672 -0.315300 -0.323095 1.245888
5.200000 -0.962526 -1.638682 -2.457568 -0.315048 -0.321681 0.425144
5.233333 -0.973044 -1.649397 -2.468625 -0.314718 -0.320231 -0.412076
5.266667 -0.983546 -1.660055 -2.515717 -0.314312 -0.318738 -1.223301
5.300000 -0.994028 -1.670655 -2.599684 -0.313834 -0.317209 -1.969645
5.333333 -1.004489 -1.681195 -2.714031 -0.313284 -0.315643 -2.625282
5.366667 -1.014937 -1.691697 -2.864926 -0.312661 -0.314041 -3.165249
5.400000 -1.025368 -1.702158 -3.021947 -0.311961 -0.312397 -3.582971
5.433333 -1.035771 -1.712557 3.104173 -0.311185 -0.310713 -3.885915
5.466667 -1.046154 -1.722903 2.956930 -0.310329 -0.308992 -4.082585
5.500000 -1.056502 -1.733184 2.784620 -0.309389 -0.307233 -4.183203
5.533333 -1.066823 -1.743408 2.629631 -0.308362 -0.305432 -4.195633
5.566667 -1.077106 -1.753566 2.513357 -0.307243 -0.303591 -4.131851
5.600000 -1.087347 -1.763656 2.369500 -0.306033 -0.301714 -3.995934
5.633333 -1.097549 -1.773686 2.233894 -0.304728 -0.299804 -3.785170
5.666667 -1.107707 -1.783656 2.090715 -0.303330 -0.297861 -3.496095
5.700000 -1.117817 -1.793555 1.955727 -0.301838 -0.295885 -3.128132
5.733333 -1.127874 -1.803393 1.827040 -0.300255 -0.293878 -2.681592
5.766667 -1.137879 -1.813157 1.705229 -0.298583 -0.291840 -2.157778
5.800000 -1.147823 -1.822860 1.614968 -0.296823 -0.289766 -1.565699
5.833333 -1.157703 -1.832501 1.545417 -0.294980 -0.287653 -0.921883
5.866667 -1.167522 -1.842065 1.511214 -0.293054 -0.285500 -0.250999
5.900000 -1.177278 -1.851551 1.525728 -0.291047 -0.283304 0.417592
5.933333 -1.186960 -1.860974 1.562713 -0.288963 -0.281064 1.052456
5.966667 -1.196573 -1.870315 1.635364 -0.286805 -0.278778 1.625161
6.000000 -1.206117 -1.879575 1.744507 -0.284572 -0.276445 2.106449
6.033333 -1.215577 -1.888766 1.873574 -0.282268 -0.274068 2.474702
6.066667 -1.224962 -1.897874 2.011559 -0.279896 -0.271644 2.714336
6.100000 -1.234270 -1.906896 2.119807 -0.277457 -0.269173 2.825935
6.133333 -1.243498 -1.915831 2.254763 -0.274951 -0.266655 2.814134
6.166667 -1.252635 -1.924688 2.368156 -0.272378 -0.264090 2.691114
6.200000 -1.261680 -1.933463 2.485569 -0.269741 -0.261477 2.480576
6.233333 -1.270638 -1.942149 2.573112 -0.267038 -0.258816 2.208916
6.266667 -1.279507 -1.950744 2.645439 -0.264268 -0.256107 1.907958
6.300000 -1.288285 -1.959246 2.706251 -0.261431 -0.253352 1.601184
6.333333 -1.296969 -1.967655 2.733871 -0.258528 -0.250549 1.315910
6.366667 -1.305558 -1.975971 2.761158 -0.255560 -0.247702 1.070990
6.400000 -1.314045 -1.984189 2.763067 -0.252523 -0.244811 0.880211
6.433333 -1.322427 -1.992310 2.760293 -0.249418 -0.241878 0.749687
6.466667 -1.330703 -2.000332 2.754897 -0.246243 -0.238904 0.677568
6.500000 -1.338869 -2.008252 2.760723 -0.242998 -0.235890 0.658819
6.533333 -1.346929 -2.016072 2.774286 -0.239679 -0.232836 0.678969
6.566667 -1.354880 -2.023792 2.792074 -0.236286 -0.229741 0.724601
6.600000 -1.362714 -2.031406 2.822533 -0.232819 -0.226606 0.775743
6.633333 -1.370436 -2.038917 2.870039 -0.229278 -0.223431 0.815451
6.666667 -1.378042 -2.046325 2.909427 -0.225666 -0.220216 0.831311
6.700000 -1.385523 -2.053623 2.959640 -0.221981 -0.216963 0.812809
6.733333 -1.392876 -2.060808 3.000831 -0.218229 -0.213673 0.758787
6.766667 -1.400107 -2.067887 3.033708 -0.214409 -0.210349 0.669201
6.800000 -1.407205 -2.074851 3.058417 -0.210525 -0.206991 0.553640
6.833333 -1.414166 -2.081698 3.088267 -0.206578 -0.203601 0.423872
6.866667 -1.420987 -2.088426 3.092043 -0.202569 -0.200180 0.290614
6.900000 -1.427680 -2.095044 3.102257 -0.198502 -0.196729 0.166465
6.933333 -1.434242 -2.101551 3.075458 -0.194378 -0.193252 0.062000
6.966667 -1.440673 -2.107946 3.060711 -0.190202 -0.189749 -0.011378
7.000000 -1.446970 -2.114228 3.053184 -0.185971 -0.186220 -0.045956
7.033333 -1.453112 -2.120384 3.038606 -0.181682 -0.182663 -0.035481
7.066667 -1.459096 -2.126410 3.034544 -0.177333 -0.179078 0.023450
7.100000 -1.464942 -2.132322 3.028821 -0.172924 -0.175466 0.133602
7.133333 -1.470647 -2.138118 3.014815 -0.168448 -0.171822 0.294978
7.166667 -1.476211 -2.143797 3.025700 -0.163900 -0.168146 0.499671
7.200000 -1.481603 -2.149341 3.034169 -0.159280 -0.164438 0.737809
7.233333 -1.486851 -2.154766 3.041943 -0.154591 -0.160702 0.994411
7.266667 -1.491953 -2.160074 3.061336 -0.149832 -0.156937 1.253901
7.300000 -1.496906 -2.165262 3.113801 -0.145004 -0.153143 1.498065
7.333333 -1.501677 -2.170306 -3.104522 -0.140114 -0.149326 1.704511
7.366667 -1.506260 -2.175215 -3.019763 -0.135173 -0.145489 1.858575
7.400000 -1.510690 -2.180003 -2.926664 -0.130188 -0.141635 1.946884
7.433333 -1.514968 -2.184669 -2.839316 -0.125167 -0.137769 1.965311
7.466667 -1.519050 -2.189194 -2.715631 -0.120122 -0.133894 1.912162
7.500000 -1.522977 -2.193596 -2.626619 -0.115062 -0.130016 1.794810
7.533333 -1.526706 -2.197854 -2.553118 -0.109987 -0.126132 1.629217
7.566667 -1.530278 -2.201989 -2.507477 -0.104898 -0.122242 1.436707
7.600000 -1.533691 -2.206000 -2.485362 -0.099792 -0.118345 1.243332
7.633333 -1.536946 -2.209887 -2.462884 -0.094663 -0.114437 1.070169
7.666667 -1.540041 -2.213649 -2.437538 -0.089499 -0.110512 0.941179
7.700000 -1.542935 -2.217265 -2.439699 -0.084296 -0.106568 0.874408
7.733333 -1.545667 -2.220756 -2.449421 -0.079050 -0.102603 0.880469
7.766667 -1.548238 -2.224121 -2.435167 -0.073752 -0.098615 0.961129
7.800000 -1.550645 -2.227360 -2.423558 -0.068401 -0.094602 1.108614
7.833333 -1.552850 -2.230453 -2.399102 -0.062995 -0.090565 1.311815
7.866667 -1.554853 -2.233400 -2.350777 -0.057543 -0.086510 1.553667
7.900000 -1.556692 -2.236221 -2.301223 -0.052047 -0.082436 1.809411
7.933333 -1.558328 -2.238896 -2.237145 -0.046514 -0.078350 2.055330
7.966667 -1.559799 -2.241444 -2.145809 -0.040958 -0.074257 2.268052
8.000000 -1.561070 -2.243848 -2.059819 -0.035399 -0.070169 2.429577
8.033333 -1.562174 -2.246126 -1.944526 -0.029849 -0.066090 2.524451
8.066667 -1.563078 -2.248260 -1.837737 -0.024313 -0.062024 2.542702
8.100000 -1.563783 -2.250252 -1.707541 -0.018805 -0.057979 2.487564
8.133333 -1.564290 -2.252102 -1.602462 -0.013329 -0.053956 2.369249
8.166667 -1.564630 -2.253826 -1.500517 -0.007887 -0.049959 2.202140
8.200000 -1.564774 -2.255411 -1.423598 -0.002473 -0.045985 2.006067
8.233333 -1.564751 -2.256869 -1.371683 0.002912 -0.042035 1.807130
8.266667 -1.564562 -2.258200 -1.334022 0.008267 -0.038109 1.633319
8.300000 -1.564207 -2.259405 -1.295179 0.013599 -0.034205 1.503742
8.333333 -1.563687 -2.260484 -1.280200 0.018913 -0.030320 1.429532
8.366667 -1.562973 -2.261429 -1.264246 0.024213 -0.026452 1.424188
8.400000 -1.562067 -2.262242 -1.280562 0.029499 -0.022598 1.495617
8.433333 -1.560997 -2.262929 -1.224317 0.034775 -0.018758 1.633486
8.466667 -1.559735 -2.263485 -1.166025 0.040043 -0.014929 1.818619
8.500000 -1.558310 -2.263916 -1.112401 0.045298 -0.011113 2.032283
8.533333 -1.556696 -2.264218 -1.033022 0.050538 -0.007310 2.255729
8.566667 -1.554918 -2.264394 -0.944081 0.055758 -0.003524 2.456590
8.600000 -1.552978 -2.264446 -0.845344 0.060959 0.000247 2.594689
8.633333 -1.550852 -2.264371 -0.727471 0.066139 0.004001 2.647476
8.666667 -1.548565 -2.264172 -0.646027 0.071298 0.007737 2.603106
8.700000 -1.546093 -2.263848 -0.512265 0.076437 0.011456 2.448218
8.733333 -1.543462 -2.263400 -0.357755 0.081556 0.015157 2.170012
8.766667 -1.540649 -2.262829 -0.252106 0.086653 0.018841 1.774641
8.800000 -1.537678 -2.262135 -0.178674 0.091723 0.022506 1.280220
8.833333 -1.534528 -2.261320 -0.117841 0.096764 0.026153 0.706117
8.866667 -1.531201 -2.260383 -0.083728 0.101766 0.029782 0.068717
8.900000 -1.527718 -2.259325 -0.099249 0.106726 0.033393 -0.604423
8.933333 -1.524062 -2.258148 -0.143456 0.111635 0.036987 -1.271892
8.966667 -1.520254 -2.256850 -0.234392 0.116489 0.040563 -1.899300
9.000000 -1.516276 -2.255435 -0.325888 0.121283 0.044123 -2.455413
9.033333 -1.512131 -2.253903 -0.417078 0.126013 0.047668 -2.913468
9.066667 -1.507837 -2.252251 -0.573141 0.130677 0.051199 -3.246933
9.100000 -1.503382 -2.250484 -0.720418 0.135274 0.054715 -3.440846
9.133333 -1.498780 -2.248599 -0.886288 0.139804 0.058218 -3.493174
9.166667 -1.494034 -2.246596 -1.060086 0.144267 0.061709 -3.410962
9.200000 -1.489134 -2.244480 -1.190373 0.148664 0.065187 -3.209227
9.233333 -1.484092 -2.242246 -1.332304 0.152995 0.068653 -2.904353
9.266667 -1.478910 -2.239896 -1.455471 0.157263 0.072107 -2.521911
9.300000 -1.473583 -2.237433 -1.535126 0.161470 0.075548 -2.086912
9.333333 -1.468118 -2.234854 -1.587455 0.165615 0.078975 -1.624730
9.366667 -1.462514 -2.232162 -1.617954 0.169701 0.082390 -1.159318
9.400000 -1.456775 -2.229355 -1.611481 0.173729 0.085790 -0.707550
9.433333 -1.450904 -2.226436 -1.607095 0.177700 0.089174 -0.288273
9.466667 -1.444901 -2.223404 -1.595925 0.181615 0.092541 0.082711
9.500000 -1.438770 -2.220259 -1.578754 0.185473 0.095890 0.395475
9.533333 -1.432511 -2.217003 -1.571606 0.189278 0.099218 0.643012
9.566667 -1.426127 -2.213635 -1.554159 0.193029 0.102524 0.826195
9.600000 -1.419620 -2.210156 -1.494687 0.196729 0.105808 0.947748
9.633333 -1.412990 -2.206568 -1.444741 0.200377 0.109067 1.014249
9.666667 -1.406240 -2.202871 -1.368510 0.203974 0.112302 1.037500
9.700000 -1.399371 -2.199067 -1.315807 0.207520 0.115513 1.030997
9.733333 -1.392383 -2.195157 -1.276094 0.211016 0.118699 1.009704
9.766667 -1.385279 -2.191143 -1.239836 0.214460 0.121860 0.987506
9.800000 -1.378060 -2.187025 -1.215513 0.217852 0.124997 0.981056
9.833333 -1.370729 -2.182802 -1.209967 0.221193 0.128108 1.006428
9.866667 -1.363288 -2.178474 -1.206797 0.224481 0.131194 1.077729
9.900000 -1.355740 -2.174042 -1.203438 0.227719 0.134254 1.199570
9.933333 -1.348082 -2.169512 -1.182247 0.230905 0.137287 1.370461
9.966667 -1.340321 -2.164879 -1.148995 0.234038 0.140294 1.583101
10.000000 -1.332457 -2.160145 -1.087463 0.237119 0.143275 1.815429
10.033333 -1.324494 -2.155310 -1.025680 0.240148 0.146228 2.039556
10.066667 -1.316428 -2.150379 -0.942885 0.243123 0.149155 2.221931
10.100000 -1.308260 -2.145355 -0.851410 0.246043 0.152056 2.335596
10.133333 -1.299999 -2.140231 -0.737048 0.248908 0.154932 2.354844
10.166667 -1.291640 -2.135015 -0.603858 0.251717 0.157783 2.259117
10.200000 -1.283184 -2.129707 -0.473972 0.254470 0.160609 2.045392
10.233333 -1.274641 -2.124303 -0.385484 0.257164 0.163413 1.720460
10.266667 -1.266013 -2.118803 -0.292053 0.259798 0.166192 1.304829
10.300000 -1.257301 -2.113208 -0.221862 0.262374 0.168948 0.822913
10.333333 -1.248500 -2.107524 -0.206715 0.264887 0.171681 0.313011
10.366667 -1.239613 -2.101752 -0.207632 0.267337 0.174391 -0.182962
10.400000 -1.230649 -2.095887 -0.259301 0.269722 0.177079 -0.623804
10.433333 -1.221603 -2.089935 -0.330145 0.272039 0.179745 -0.974216
10.466667 -1.212477 -2.083896 -0.422884 0.274286 0.182390 -1.203886
10.500000 -1.203282 -2.077767 -0.517710 0.276459 0.185016 -1.293112
10.533333 -1.194013 -2.071552 -0.606909 0.278555 0.187623 -1.237286
10.566667 -1.184674 -2.065252 -0.689997 0.280575 0.190212 -1.040613
10.600000 -1.175266 -2.058866 -0.746090 0.282515 0.192785 -0.724498
10.633333 -1.165797 -2.052394 -0.792709 0.284375 0.195342 -0.316684
10.666667 -1.156269 -2.045837 -0.804398 0.286156 0.197881 0.141198
10.700000 -1.146684 -2.039194 -0.795341 0.287859 0.200404 0.611993
10.733333 -1.137045 -2.032467 -0.744336 0.289486 0.202910 1.052814
10.766667 -1.127353 -2.025657 -0.672074 0.291036 0.205397 1.420436
10.800000 -1.117610 -2.018765 -0.565621 0.292513 0.207864 1.681664
10.833333 -1.107820 -2.011791 -0.495359 0.293917 0.210310 1.813166
10.866667 -1.097984 -2.004735 -0.375806 0.295249 0.212734 1.805070
10.900000 -1.088104 -1.997598 -0.261400 0.296510 0.215135 1.651474
10.933333 -1.078183 -1.990382 -0.149917 0.297699 0.217510 1.362864
10.966667 -1.068224 -1.983086 -0.071671 0.298815 0.219861 0.965330
11.000000 -1.058229 -1.975711 -0.035022 0.299857 0.222185 0.493638
11.033333 -1.048199 -1.968260 -0.024828 0.300822 0.224484 -0.015118
11.066667 -1.038140 -1.960731 -0.044131 0.301710 0.226756 -0.517659
11.100000 -1.028051 -1.953128 -0.105566 0.302518 0.229002 -0.967926
11.133333 -1.017935 -1.945452 -0.164976 0.303248 0.231221 -1.327872
11.166667 -1.007794 -1.937703 -0.268051 0.303898 0.233414 -1.571333
11.200000 -0.997632 -1.929882 -0.369507 0.304469 0.235580 -1.687893
11.233333 -0.987453 -1.921988 -0.488708 0.304959 0.237720 -1.674003
11.266667 -0.977263 -1.914022 -0.600791 0.305370 0.239834 -1.539479
11.300000 -0.967064 -1.905985 -0.674343 0.305700 0.241924 -1.305370
11.333333 -0.956852 -1.897880 -0.719786 0.305949 0.243990 -0.992366
11.366667 -0.946637 -1.889706 -0.736025 0.306117 0.246031 -0.628134
11.400000 -0.936414 -1.881465 -0.726328 0.306207 0.248048 -0.234797
11.433333 -0.926184 -1.873159 -0.703412 0.306224 0.250039 0.163658
11.466667 -0.915949 -1.864790 -0.683073 0.306169 0.252002 0.547972
11.500000 -0.905724 -1.856353 -0.642081 0.306049 0.253936 0.901588
11.533333 -0.895512 -1.847849 -0.616868 0.305867 0.255839 1.208557
11.566667 -0.885314 -1.839279 -0.573014 0.305627 0.257709 1.458613
11.600000 -0.875121 -1.830650 -0.523870 0.305331 0.259547 1.643513
11.633333 -0.864946 -1.821955 -0.447708 0.304983 0.261351 1.756137
11.666667 -0.854780 -1.813203 -0.358376 0.304583 0.263120 1.786338
11.700000 -0.844625 -1.804395 -0.266670 0.304131 0.264856 1.729627
11.733333 -0.834482 -1.795530 -0.187026 0.303623 0.266559 1.585450
11.766667 -0.824354 -1.786611 -0.099417 0.303056 0.268232 1.360071
11.800000 -0.814242 -1.777638 -0.016726 0.302424 0.269876 1.063335
11.833333 -0.804150 -1.768612 0.040659 0.301721 0.271494 0.714953
11.866667 -0.794091 -1.759528 0.064292 0.300946 0.273087 0.344617
11.900000 -0.784055 -1.750393 0.056763 0.300097 0.274655 -0.015515
11.933333 -0.774044 -1.741209 0.020223 0.299180 0.276195 -0.334123
11.966667 -0.764060 -1.731976 -0.022711 0.298197 0.277706 -0.585598
12.000000 -0.754119 -1.722689 -0.091696 0.297151 0.279187 -0.745890
12.033333 -0.744225 -1.713347 -0.170758 0.296050 0.280633 -0.800825
12.066667 -0.734379 -1.703953 -0.235710 0.294895 0.282044 -0.747429
12.100000 -0.724568 -1.694516 -0.283636 0.293688 0.283420 -0.591922
12.133333 -0.714792 -1.685035 -0.324132 0.292428 0.284759 -0.350171
12.166667 -0.705055 -1.675512 -0.333097 0.291116 0.286063 -0.038992
12.200000 -0.695357 -1.665949 -0.332130 0.289749 0.287331 0.318315
12.233333 -0.685700 -1.656346 -0.311719 0.288321 0.288566 0.695552
12.266667 -0.676086 -1.646705 -0.260005 0.286830 0.289771 1.066482
12.300000 -0.666541 -1.637018 -0.215344 0.285273 0.290946 1.405083
12.333333 -0.657041 -1.627294 -0.156397 0.283648 0.292091 1.690007
12.366667 -0.647590 -1.617535 -0.078976 0.281958 0.293209 1.899834
12.400000 -0.638213 -1.607734 0.004727 0.280209 0.294295 2.015489
12.433333 -0.628888 -1.597899 0.108826 0.278407 0.295348 2.025930
12.466667 -0.619615 -1.588033 0.199015 0.276560 0.296366 1.929517
12.500000 -0.610422 -1.578128 0.298999 0.274672 0.297346 1.730960
12.533333 -0.601309 -1.568184 0.399405 0.272747 0.298286 1.443398
12.566667 -0.592254 -1.558213 0.484758 0.270787 0.299186 1.084462
12.600000 -0.583258 -1.548215 0.541619 0.268788 0.300045 0.676231
12.633333 -0.574322 -1.538190 0.550102 0.266747 0.300863 0.245318
12.666667 -0.565447 -1.528141 0.526004 0.264658 0.301641 -0.183237
12.700000 -0.556636 -1.518068 0.476692 0.262516 0.302377 -0.583392
12.733333 -0.547913 -1.507967 0.402432 0.260312 0.303073 -0.934638
12.766667 -0.539255 -1.497845 0.347424 0.258039 0.303730 -1.217323
12.800000 -0.530664 -1.487702 0.279581 0.255694 0.304345 -1.414163
12.833333 -0.522166 -1.477537 0.211707 0.253271 0.304918 -1.521180
12.866667 -0.513737 -1.467354 0.172992 0.250766 0.305447 -1.543686
12.900000 -0.505404 -1.457153 0.107512 0.248182 0.305930 -1.495009
12.933333 -0.497169 -1.446935 0.013957 0.245519 0.306364 -1.388215
12.966667 -0.489006 -1.436703 -0.041372 0.242780 0.306747 -1.243656
13.000000 -0.480944 -1.426460 -0.086179 0.239972 0.307079 -1.083696
13.033333 -0.472986 -1.416206 -0.122539 0.237106 0.307360 -0.925767
13.066667 -0.465103 -1.405942 -0.145900 0.234197 0.307592 -0.781093
13.100000 -0.457327 -1.395672 -0.139989 0.231257 0.307778 -0.657362
13.133333 -0.449660 -1.385399 -0.143319 0.228301 0.307920 -0.564408
13.166667 -0.442102 -1.375124 -0.131952 0.225344 0.308022 -0.502227
13.200000 -0.434655 -1.364850 -0.117818 0.222398 0.308086 -0.468807
13.233333 -0.427320 -1.354577 -0.149456 0.219469 0.308114 -0.456405
13.266667 -0.420063 -1.344299 -0.158891 0.216562 0.308108 -0.456198
13.300000 -0.412918 -1.334027 -0.185780 0.213684 0.308070 -0.454304
13.333333 -0.405854 -1.323753 -0.219504 0.210836 0.307999 -0.438825
13.366667 -0.398869 -1.313478 -0.242753 0.208013 0.307896 -0.401865
13.400000 -0.391966 -1.303203 -0.274387 0.205212 0.307760 -0.334841
13.433333 -0.385172 -1.292938 -0.306025 0.202428 0.307590 -0.241170
13.466667 -0.378460 -1.282676 -0.309997 0.199654 0.307385 -0.127246
13.500000 -0.371855 -1.272427 -0.302641 0.196880 0.307140 -0.007448
13.533333 -0.365356 -1.262192 -0.306684 0.194104 0.306855 0.107540
13.566667 -0.358939 -1.251962 -0.298457 0.191326 0.306531 0.202372
13.600000 -0.352604 -1.241739 -0.271382 0.188550 0.306170 0.259865
13.633333 -0.346353 -1.231522 -0.240645 0.185777 0.305771 0.273606
13.666667 -0.340201 -1.221325 -0.216989 0.183012 0.305339 0.243420
13.700000 -0.334150 -1.211147 -0.181950 0.180262 0.304879 0.174250
13.733333 -0.328198 -1.200991 -0.158033 0.177530 0.304394 0.072436
13.766667 -0.322327 -1.190845 -0.164042 0.174817 0.303885 -0.043748
13.800000 -0.316554 -1.180723 -0.163462 0.172127 0.303359 -0.159162
13.833333 -0.310876 -1.170624 -0.175842 0.169465 0.302819 -0.261449
13.866667 -0.305280 -1.160538 -0.192697 0.166832 0.302268 -0.343707
13.900000 -0.299766 -1.150467 -0.248038 0.164228 0.301707 -0.397225
13.933333 -0.294347 -1.140422 -0.297876 0.161651 0.301136 -0.417651
13.966667 -0.289010 -1.130394 -0.332692 0.159100 0.300554 -0.414101
14.000000 -0.283753 -1.120382 -0.338559 0.156570 0.299957 -0.387267
14.033333 -0.278578 -1.110389 -0.341304 0.154055 0.299342 -0.341928
14.066667 -0.273484 -1.100414 -0.324288 0.151550 0.298705 -0.286563
14.100000 -0.268470 -1.090458 -0.296460 0.149052 0.298042 -0.236343
14.133333 -0.263537 -1.080523 -0.323559 0.146557 0.297350 -0.200509
14.166667 -0.258697 -1.070618 -0.344397 0.144063 0.296626 -0.181644
14.200000 -0.253937 -1.060736 -0.342010 0.141571 0.295870 -0.187894
14.233333 -0.249256 -1.050876 -0.348685 0.139081 0.295079 -0.222164
14.266667 -0.244666 -1.041048 -0.347253 0.136596 0.294256 -0.280233
14.300000 -0.240154 -1.031244 -0.360246 0.134120 0.293400 -0.351966
14.333333 -0.235731 -1.021473 -0.352845 0.131659 0.292517 -0.437346
14.366667 -0.231384 -1.011728 -0.364301 0.129217 0.291609 -0.534230
14.400000 -0.227123 -1.002017 -0.381032 0.126798 0.290678 -0.636265
14.433333 -0.222946 -0.992341 -0.400151 0.124407 0.289729 -0.737230
14.466667 -0.218851 -0.982699 -0.428687 0.122047 0.288766 -0.832964
14.500000 -0.214830 -0.973087 -0.470706 0.119721 0.287791 -0.922427
14.533333 -0.210888 -0.963511 -0.511883 0.117429 0.286805 -1.000167
14.566667 -0.207020 -0.953965 -0.562343 0.115174 0.285809 -1.062869
14.600000 -0.203227 -0.944457 -0.597033 0.112957 0.284804 -1.114462
14.633333 -0.199507 -0.934980 -0.630946 0.110776 0.283787 -1.158341
14.666667 -0.195857 -0.925535 -0.677492 0.108631 0.282757 -1.198475
14.700000 -0.192279 -0.916122 -0.727408 0.106520 0.281713 -1.236837
14.733333 -0.188771 -0.906741 -0.768301 0.104441 0.280653 -1.270953
14.766667 -0.185332 -0.897395 -0.791627 0.102392 0.279577 -1.301571
14.800000 -0.181959 -0.888089 -0.808740 0.100372 0.278485 -1.323509
14.833333 -0.178654 -0.878818 -0.833160 0.098379 0.277378 -1.333829
14.866667 -0.175413 -0.869588 -0.915372 0.096413 0.276257 -1.321926
14.900000 -0.172236 -0.860398 -0.981787 0.094471 0.275126 -1.280635
14.933333 -0.169123 -0.851249 -1.068390 0.092553 0.273985 -1.198779
14.966667 -0.166074 -0.842136 -1.107683 0.090659 0.272836 -1.066274
15.000000 -0.163089 -0.833061 -1.142866 0.088788 0.271682 -0.874747
15.033333 -0.160166 -0.824023 -1.160356 0.086940 0.270522 -0.625585
15.066667 -0.157305 -0.815024 -1.199676 0.085116 0.269356 -0.336409
15.100000 -0.154503 -0.806062 -1.225445 0.083315 0.268183 -0.025405
15.133333 -0.151762 -0.797139 -1.260013 0.081538 0.267002 0.280119
15.166667 -0.149078 -0.788255 -1.255747 0.079787 0.265811 0.558249
15.200000 -0.146453 -0.779411 -1.199394 0.078061 0.264607 0.782492
15.233333 -0.143886 -0.770607 -1.132572 0.076360 0.263390 0.942539
15.266667 -0.141376 -0.761845 -1.040862 0.074684 0.262159 1.028571
15.300000 -0.138922 -0.753125 -0.948091 0.073035 0.260913 1.035057
15.333333 -0.136519 -0.744444 -0.865804 0.071412 0.259653 0.958016
15.366667 -0.134170 -0.735807 -0.837160 0.069817 0.258380 0.798501
15.400000 -0.131875 -0.727212 -0.822171 0.068251 0.257096 0.574695
15.433333 -0.129632 -0.718660 -0.832141 0.066716 0.255800 0.301348
15.466667 -0.127441 -0.710153 -0.839339 0.065213 0.254495 0.007879
15.500000 -0.125300 -0.701690 -0.831477 0.063744 0.253183 -0.273265
15.533333 -0.123209 -0.693272 -0.840634 0.062308 0.251864 -0.505096
15.566667 -0.121167 -0.684899 -0.833955 0.060907 0.250540 -0.661782
15.600000 -0.119173 -0.676572 -0.890002 0.059541 0.249214 -0.728775
15.633333 -0.117219 -0.668287 -0.965251 0.058210 0.247887 -0.697849
15.666667 -0.115302 -0.660042 -1.054312 0.056914 0.246560 -0.566931
15.700000 -0.113431 -0.651844 -1.137897 0.055650 0.245231 -0.341360
15.733333 -0.111605 -0.643694 -1.153211 0.054418 0.243901 -0.041106
15.766667 -0.109821 -0.635591 -1.152584 0.053217 0.242567 0.314422
15.800000 -0.108073 -0.627526 -1.156598 0.052045 0.241228 0.696351
15.833333 -0.106367 -0.619510 -1.111189 0.050900 0.239881 1.074540
15.866667 -0.104695 -0.611533 -1.046587 0.049784 0.238528 1.418097
15.900000 -0.103055 -0.603593 -0.957947 0.048699 0.237166 1.694977
15.933333 -0.101453 -0.595703 -0.834525 0.047647 0.235796 1.891799
15.966667 -0.099890 -0.587863 -0.729723 0.046629 0.234418 2.002943
16.000000 -0.098363 -0.580074 -0.639804 0.045649 0.233031 2.033820
16.033333 -0.096873 -0.572335 -0.544303 0.044708 0.231638 1.997110
16.066667 -0.095408 -0.564637 -0.480424 0.043808 0.230237 1.909847
16.100000 -0.093969 -0.556980 -0.436542 0.042947 0.228828 1.798096
16.133333 -0.092562 -0.549374 -0.397800 0.042126 0.227410 1.682599
16.166667 -0.091188 -0.541822 -0.364560 0.041344 0.225982 1.579732
16.200000 -0.089834 -0.534312 -0.315884 0.040601 0.224544 1.500502
16.233333 -0.088500 -0.526847 -0.291181 0.039894 0.223092 1.457401
16.266667 -0.087183 -0.519426 -0.243702 0.039226 0.221625 1.453510
16.300000 -0.085882 -0.512052 -0.201771 0.038595 0.220142 1.484536
16.333333 -0.084610 -0.504732 -0.140899 0.038004 0.218642 1.544022
16.366667 -0.083366 -0.497466 -0.097611 0.037450 0.217124 1.628074
16.400000 -0.082148 -0.490256 -0.040166 0.036932 0.215588 1.736106
16.433333 -0.080941 -0.483095 0.009530 0.036450 0.214034 1.860186
16.466667 -0.079744 -0.475983 0.066116 0.036003 0.212461 1.994599
16.500000 -0.078557 -0.468923 0.126863 0.035591 0.210871 2.136462
16.533333 -0.077377 -0.461914 0.206778 0.035209 0.209262 2.277500
16.566667 -0.076220 -0.454961 0.289114 0.034855 0.207635 2.405956
16.600000 -0.075068 -0.448063 0.376636 0.034529 0.205989 2.504748
16.633333 -0.073922 -0.441218 0.442604 0.034226 0.204323 2.564719
16.666667 -0.072779 -0.434429 0.537644 0.033941 0.202635 2.579740
16.700000 -0.071657 -0.427697 0.652060 0.033670 0.200925 2.539386
16.733333 -0.070555 -0.421025 0.794020 0.033415 0.199192 2.440775
16.766667 -0.069454 -0.414409 0.916006 0.033174 0.197437 2.281984
16.800000 -0.068354 -0.407852 0.990526 0.032945 0.195660 2.073869
16.833333 -0.067253 -0.401355 1.058947 0.032729 0.193861 1.822123
16.866667 -0.066170 -0.394918 1.090037 0.032529 0.192039 1.538853
16.900000 -0.065086 -0.388542 1.146052 0.032343 0.190197 1.245141
16.933333 -0.064019 -0.382228 1.166383 0.032164 0.188335 0.964496
16.966667 -0.062949 -0.375977 1.209410 0.031992 0.186454 0.717013
17.000000 -0.061896 -0.369788 1.226719 0.031824 0.184556 0.514004
17.033333 -0.060840 -0.363663 1.207364 0.031656 0.182643 0.366465
17.066667 -0.059781 -0.357605 1.182900 0.031481 0.180718 0.275582
17.100000 -0.058737 -0.351610 1.158053 0.031299 0.178781 0.233570
17.133333 -0.057691 -0.345682 1.143950 0.031110 0.176834 0.228291
17.166667 -0.056643 -0.339823 1.162507 0.030911 0.174877 0.250230
17.200000 -0.055608 -0.334027 1.165496 0.030702 0.172912 0.287138
17.233333 -0.054587 -0.328294 1.199264 0.030482 0.170937 0.322190
17.266667 -0.053579 -0.322624 1.217695 0.030255 0.168951 0.345953
17.300000 -0.052571 -0.317024 1.234498 0.030022 0.166954 0.356137
17.333333 -0.051576 -0.311489 1.277514 0.029782 0.164947 0.348681
17.366667 -0.050593 -0.306017 1.313329 0.029541 0.162930 0.325487
17.400000 -0.049612 -0.300617 1.324608 0.029299 0.160903 0.291037
17.433333 -0.048643 -0.295281 1.295623 0.029056 0.158870 0.262758
17.466667 -0.047678 -0.290018 1.298489 0.028810 0.156833 0.247309
17.500000 -0.046717 -0.284829 1.297254 0.028562 0.154791 0.249780
17.533333 -0.045767 -0.279704 1.293291 0.028310 0.152746 0.278055
17.566667 -0.044822 -0.274653 1.285353 0.028053 0.150699 0.335593
17.600000 -0.043889 -0.269667 1.290190 0.027788 0.148650 0.424564
17.633333 -0.042966 -0.264744 1.293489 0.027517 0.146599 0.534880
