t x y theta dxdt dydt dthetadt
0.000000 0.000000 0.000000 0.673854 -0.009511 -0.006020 0.003921
0.033333 0.000027 -0.000115 0.676506 -0.013437 -0.007839 0.002995
0.066667 -0.000183 -0.000267 0.673415 -0.018454 -0.010030 -0.002066
0.100000 -0.000632 -0.000453 0.675864 -0.024797 -0.012652 -0.011407
0.133333 -0.001326 -0.000674 0.678976 -0.033000 -0.015859 -0.028967
0.166667 -0.002069 -0.001349 0.670697 -0.043975 -0.019815 -0.064433
0.200000 -0.003481 -0.002161 0.667995 -0.058979 -0.024751 -0.120422
0.233333 -0.005148 -0.003003 0.676463 -0.079173 -0.030935 -0.200951
0.266667 -0.007075 -0.003874 0.675275 -0.105603 -0.038408 -0.303590
0.300000 -0.009265 -0.004773 0.678947 -0.139645 -0.047196 -0.429827
0.333333 -0.011720 -0.005698 0.675361 -0.182292 -0.057159 -0.574594
0.366667 -0.014445 -0.006647 0.661254 -0.233776 -0.068083 -0.726550
0.400000 -0.020539 -0.009066 0.630010 -0.293381 -0.079542 -0.875092
0.433333 -0.026902 -0.011505 0.613076 -0.360687 -0.091090 -1.011415
0.466667 -0.037829 -0.014955 0.564965 -0.434468 -0.102311 -1.129806
0.500000 -0.053399 -0.019354 0.493492 -0.512499 -0.112746 -1.220264
0.533333 -0.073695 -0.024396 0.418791 -0.591954 -0.121885 -1.277226
0.566667 -0.094226 -0.029445 0.356933 -0.670342 -0.129193 -1.298234
0.600000 -0.119149 -0.034573 0.317258 -0.745608 -0.134347 -1.285765
0.633333 -0.148027 -0.039457 0.273238 -0.814856 -0.137079 -1.239359
0.666667 -0.180790 -0.044403 0.233498 -0.875761 -0.137229 -1.161752
0.700000 -0.213695 -0.049336 0.200943 -0.926755 -0.134687 -1.061390
0.733333 -0.246712 -0.054249 0.171074 -0.966994 -0.129487 -0.946862
0.766667 -0.282992 -0.058945 0.135889 -0.995056 -0.121656 -0.826841
0.800000 -0.319320 -0.063612 0.107526 -1.009561 -0.111084 -0.707341
0.833333 -0.355663 -0.068244 0.080058 -1.010038 -0.097604 -0.596792
0.866667 -0.392414 -0.071979 0.051022 -0.996636 -0.081181 -0.500800
0.900000 -0.428593 -0.074833 0.044976 -0.969787 -0.061941 -0.423337
0.933333 -0.463817 -0.076861 0.050302 -0.930215 -0.040186 -0.367001
0.966667 -0.498923 -0.078840 0.045645 -0.879178 -0.016377 -0.331708
1.000000 -0.531573 -0.080026 0.051050 -0.818825 0.008705 -0.318790
1.033333 -0.560530 -0.080136 0.052830 -0.751295 0.034171 -0.326331
1.066667 -0.586020 -0.078811 0.047403 -0.678575 0.059228 -0.350925
1.100000 -0.606352 -0.075463 0.038207 -0.602690 0.083144 -0.383853
1.133333 -0.619806 -0.070102 0.026284 -0.525580 0.105218 -0.414322
1.166667 -0.633009 -0.064691 -0.005349 -0.449978 0.124698 -0.435172
1.200000 -0.645954 -0.059237 -0.031115 -0.377659 0.141071 -0.435244
1.233333 -0.658632 -0.053744 -0.060162 -0.309869 0.153930 -0.406472
1.266667 -0.671035 -0.048220 -0.082805 -0.247268 0.163028 -0.344229
1.300000 -0.673701 -0.041844 -0.090266 -0.190639 0.168224 -0.253504
1.333333 -0.676088 -0.035446 -0.112992 -0.140278 0.169692 -0.142242
1.366667 -0.678199 -0.029032 -0.135878 -0.095980 0.167754 -0.017681
1.400000 -0.680038 -0.022609 -0.139072 -0.057762 0.162775 0.107899
1.433333 -0.681608 -0.016184 -0.123970 -0.025845 0.155155 0.222829
1.466667 -0.680238 -0.010355 -0.086736 -0.000968 0.145211 0.314825
1.500000 -0.677298 -0.005308 -0.064067 0.017435 0.133485 0.381840
1.533333 -0.673902 -0.000873 -0.028624 0.029771 0.120441 0.420781
1.566667 -0.670968 0.002736 -0.006046 0.036746 0.106636 0.430956
1.600000 -0.667802 0.006321 0.028036 0.039090 0.092577 0.414186
1.633333 -0.665835 0.008797 0.032301 0.037671 0.078830 0.376539
1.666667 -0.664944 0.010667 0.040523 0.033971 0.065946 0.327779
1.700000 -0.664762 0.011874 0.042183 0.028825 0.054232 0.271813
1.733333 -0.664374 0.013046 0.042182 0.023061 0.043864 0.216204
1.766667 -0.664235 0.013971 0.045167 0.017397 0.034913 0.165484
1.800000 -0.664217 0.014651 0.046220 0.012578 0.027463 0.126203
1.833333 -0.664007 0.015295 0.043466 0.009050 0.021387 0.097076
1.866667 -0.663987 0.015796 0.054535 0.006793 0.016516 0.076052
1.900000 -0.664135 0.016027 0.063613 0.005603 0.012680 0.062231
