t x y theta dxdt dydt dthetadt
0.000000 0.000000 0.000000 1.918460 -0.096480 -0.115845 0.004629
0.033333 -0.003254 -0.003902 1.912544 -0.098680 -0.118409 0.003282
0.066667 -0.006584 -0.007889 1.916589 -0.100866 -0.120981 0.005060
0.100000 -0.009984 -0.011962 1.909804 -0.103033 -0.123562 0.006942
0.133333 -0.013460 -0.016122 1.922148 -0.105180 -0.126149 0.009832
0.166667 -0.017011 -0.020370 1.918274 -0.107307 -0.128744 0.011855
0.200000 -0.020629 -0.024703 1.915446 -0.109410 -0.131346 0.013276
0.233333 -0.024323 -0.029126 1.927043 -0.111491 -0.133954 0.010023
0.266667 -0.028082 -0.033635 1.915525 -0.113550 -0.136571 0.003540
0.300000 -0.031906 -0.038229 1.923257 -0.115589 -0.139197 -0.001759
0.333333 -0.035793 -0.042909 1.924796 -0.117609 -0.141835 -0.004734
0.366667 -0.039744 -0.047675 1.920792 -0.119614 -0.144488 -0.001002
0.400000 -0.043769 -0.052533 1.926552 -0.121608 -0.147159 0.010881
0.433333 -0.047855 -0.057477 1.912610 -0.123594 -0.149852 0.038579
0.466667 -0.052014 -0.062515 1.921142 -0.125572 -0.152568 0.080841
0.500000 -0.056234 -0.067638 1.914148 -0.127540 -0.155307 0.137784
0.533333 -0.060512 -0.072848 1.911564 -0.129498 -0.158070 0.211306
0.566667 -0.064861 -0.078154 1.899126 -0.131438 -0.160852 0.300740
0.600000 -0.069278 -0.083556 1.909084 -0.133358 -0.163653 0.405587
0.633333 -0.073763 -0.089055 1.939748 -0.135250 -0.166468 0.519788
0.666667 -0.078314 -0.094653 1.951255 -0.137110 -0.169295 0.644056
0.700000 -0.082932 -0.100350 1.983089 -0.138933 -0.172127 0.773385
0.733333 -0.087605 -0.106134 2.010269 -0.140716 -0.174962 0.904600
0.766667 -0.092339 -0.112018 2.038296 -0.142458 -0.177795 1.028581
0.800000 -0.097125 -0.117988 2.073068 -0.144156 -0.180622 1.139481
0.833333 -0.101969 -0.124059 2.120492 -0.145812 -0.183440 1.234142
0.866667 -0.106863 -0.130217 2.164448 -0.147428 -0.186250 1.309071
0.900000 -0.111812 -0.136476 2.218771 -0.149009 -0.189053 1.363118
0.933333 -0.116813 -0.142836 2.265374 -0.150557 -0.191847 1.391800
0.966667 -0.121862 -0.149282 2.331281 -0.152074 -0.194631 1.402489
1.000000 -0.126959 -0.155812 2.382342 -0.153563 -0.197405 1.400792
1.033333 -0.132108 -0.162441 2.440037 -0.155023 -0.200167 1.389189
1.066667 -0.137303 -0.169154 2.512191 -0.156453 -0.202911 1.365834
1.100000 -0.142548 -0.175964 2.528493 -0.157852 -0.205634 1.337549
1.133333 -0.147842 -0.182870 2.544953 -0.159217 -0.208337 1.310554
1.166667 -0.153182 -0.189871 2.583014 -0.160547 -0.211016 1.281400
1.200000 -0.158568 -0.196965 2.637905 -0.161838 -0.213671 1.246989
1.233333 -0.163995 -0.204142 2.675736 -0.163089 -0.216302 1.211884
1.266667 -0.169462 -0.211402 2.711958 -0.164299 -0.218910 1.185004
1.300000 -0.174968 -0.218743 2.776106 -0.165467 -0.221495 1.158372
1.333333 -0.180511 -0.226173 2.821199 -0.166591 -0.224060 1.127763
1.366667 -0.186093 -0.233685 2.854673 -0.167673 -0.226606 1.098478
1.400000 -0.191708 -0.241283 2.887000 -0.168712 -0.229137 1.076160
1.433333 -0.197359 -0.248962 2.926306 -0.169710 -0.231652 1.055633
1.466667 -0.203042 -0.256726 2.951690 -0.170666 -0.234150 1.029183
1.500000 -0.208756 -0.264576 2.956550 -0.171577 -0.236627 1.003956
1.533333 -0.214498 -0.272510 2.980659 -0.172445 -0.239078 0.980235
1.566667 -0.220269 -0.280530 3.034152 -0.173270 -0.241496 0.948402
1.600000 -0.226072 -0.288628 3.086810 -0.174052 -0.243878 0.895346
1.633333 -0.231898 -0.296809 3.117751 -0.174794 -0.246220 0.817823
1.666667 -0.237744 -0.305073 3.140369 -0.175503 -0.248524 0.715250
1.700000 -0.243621 -0.313414 -3.110383 -0.176186 -0.250790 0.580044
1.733333 -0.249514 -0.321824 -3.065928 -0.176851 -0.253023 0.412780
1.766667 -0.255423 -0.330301 -3.033190 -0.177501 -0.255228 0.222032
1.800000 -0.261345 -0.338845 -3.027681 -0.178143 -0.257410 0.024507
1.833333 -0.267280 -0.347454 -3.026483 -0.178778 -0.259574 -0.172254
1.866667 -0.273241 -0.356138 -3.052842 -0.179407 -0.261725 -0.360181
1.900000 -0.279228 -0.364895 -3.083665 -0.180030 -0.263866 -0.528950
1.933333 -0.285241 -0.373727 -3.133281 -0.180644 -0.266001 -0.670519
1.966667 -0.291279 -0.382632 3.113100 -0.181246 -0.268129 -0.781186
2.000000 -0.297342 -0.391610 3.072555 -0.181831 -0.270247 -0.866341
2.033333 -0.303428 -0.400660 3.039865 -0.182388 -0.272352 -0.922279
2.066667 -0.309538 -0.409782 3.012753 -0.182904 -0.274437 -0.948213
2.100000 -0.315651 -0.418970 2.980803 -0.183366 -0.276492 -0.942765
2.133333 -0.321766 -0.428222 2.970094 -0.183758 -0.278510 -0.906954
2.166667 -0.327903 -0.437545 2.932896 -0.184072 -0.280485 -0.837213
2.200000 -0.334062 -0.446938 2.896905 -0.184300 -0.282413 -0.720977
2.233333 -0.340242 -0.456400 2.863388 -0.184441 -0.284293 -0.544498
2.266667 -0.346443 -0.465932 2.817607 -0.184502 -0.286128 -0.287994
2.300000 -0.352631 -0.475519 2.780171 -0.184497 -0.287922 0.065562
2.333333 -0.358804 -0.485160 2.744790 -0.184439 -0.289684 0.527914
2.366667 -0.364960 -0.494852 2.747502 -0.184343 -0.291417 1.105278
2.400000 -0.371098 -0.504594 2.773742 -0.184226 -0.293130 1.787228
2.433333 -0.377216 -0.514386 2.818054 -0.184107 -0.294829 2.548207
2.466667 -0.383315 -0.524228 2.874371 -0.183997 -0.296519 3.347294
2.500000 -0.389433 -0.534136 2.943392 -0.183902 -0.298203 4.141438
2.533333 -0.395530 -0.544095 3.084719 -0.183828 -0.299880 4.894950
2.566667 -0.401647 -0.554120 -2.957803 -0.183776 -0.301551 5.562850
2.600000 -0.407784 -0.564211 -2.649863 -0.183738 -0.303212 6.108735
2.633333 -0.413942 -0.574365 -2.327740 -0.183708 -0.304859 6.498661
2.666667 -0.420079 -0.584565 -2.092008 -0.183681 -0.306489 6.710684
2.700000 -0.426197 -0.594809 -1.801618 -0.183659 -0.308103 6.714662
2.733333 -0.432335 -0.605116 -1.551012 -0.183642 -0.309701 6.483326
2.766667 -0.438454 -0.615469 -1.300429 -0.183635 -0.311283 6.006049
2.800000 -0.444553 -0.625867 -1.081079 -0.183651 -0.312855 5.284789
2.833333 -0.450674 -0.636327 -0.885820 -0.183701 -0.314419 4.339667
2.866667 -0.456776 -0.646829 -0.697550 -0.183793 -0.315978 3.192041
2.900000 -0.462860 -0.657370 -0.527514 -0.183925 -0.317525 1.893423
2.933333 -0.468967 -0.667974 -0.384989 -0.184104 -0.319062 0.502821
2.966667 -0.475098 -0.678640 -0.331848 -0.184330 -0.320585 -0.917484
3.000000 -0.481253 -0.689367 -0.387080 -0.184591 -0.322087 -2.307054
3.033333 -0.487435 -0.700155 -0.565484 -0.184878 -0.323560 -3.603794
3.066667 -0.493604 -0.710976 -0.819345 -0.185186 -0.325000 -4.741709
3.100000 -0.499765 -0.721828 -1.125197 -0.185514 -0.326412 -5.666879
3.133333 -0.505952 -0.732741 -1.437570 -0.185860 -0.327796 -6.343164
3.166667 -0.512168 -0.743714 -1.745070 -0.186220 -0.329155 -6.746995
3.200000 -0.518378 -0.754715 -2.045482 -0.186605 -0.330499 -6.871063
3.233333 -0.524584 -0.765743 -2.321124 -0.187025 -0.331842 -6.735841
3.266667 -0.530821 -0.776832 -2.526369 -0.187484 -0.333190 -6.382474
3.300000 -0.537058 -0.787948 -2.768122 -0.187983 -0.334546 -5.863965
3.333333 -0.543300 -0.799094 -2.996103 -0.188527 -0.335918 -5.229858
3.366667 -0.549575 -0.810300 3.117254 -0.189122 -0.337312 -4.531583
3.400000 -0.555884 -0.821565 2.968953 -0.189769 -0.338731 -3.814457
3.433333 -0.562228 -0.832889 2.887578 -0.190463 -0.340172 -3.113742
3.466667 -0.568587 -0.844256 2.817808 -0.191206 -0.341637 -2.447138
3.500000 -0.574965 -0.855668 2.759782 -0.191999 -0.343127 -1.832953
3.533333 -0.581364 -0.867123 2.733303 -0.192841 -0.344639 -1.287179
3.566667 -0.587786 -0.878625 2.731898 -0.193730 -0.346172 -0.817002
3.600000 -0.594249 -0.890186 2.732713 -0.194667 -0.347725 -0.427385
3.633333 -0.600739 -0.901796 2.749544 -0.195655 -0.349301 -0.113683
3.666667 -0.607260 -0.913455 2.760047 -0.196696 -0.350901 0.125951
3.700000 -0.613824 -0.925174 2.766862 -0.197792 -0.352528 0.302506
3.733333 -0.620422 -0.936945 2.795388 -0.198946 -0.354181 0.429374
3.766667 -0.627066 -0.948775 2.830771 -0.200156 -0.355863 0.516416
3.800000 -0.633748 -0.960660 2.855167 -0.201422 -0.357572 0.574333
3.833333 -0.640470 -0.972602 2.870108 -0.202741 -0.359309 0.610020
3.866667 -0.647233 -0.984603 2.886119 -0.204114 -0.361070 0.631046
3.900000 -0.654048 -0.996662 2.902277 -0.205539 -0.362856 0.639524
3.933333 -0.660914 -1.008780 2.923262 -0.207015 -0.364667 0.636610
3.966667 -0.667828 -1.020960 2.955125 -0.208545 -0.366504 0.624435
4.000000 -0.674793 -1.033203 2.970046 -0.210127 -0.368364 0.605055
4.033333 -0.681813 -1.045505 2.996084 -0.211761 -0.370250 0.579124
4.066667 -0.688887 -1.057873 3.031815 -0.213448 -0.372160 0.542751
4.100000 -0.696018 -1.070308 3.044003 -0.215188 -0.374095 0.495950
4.133333 -0.703208 -1.082801 3.060341 -0.216983 -0.376058 0.441685
4.166667 -0.710459 -1.095364 3.071300 -0.218831 -0.378048 0.382356
4.200000 -0.717772 -1.107999 3.092835 -0.220733 -0.380062 0.318310
4.233333 -0.725148 -1.120689 3.099818 -0.222689 -0.382100 0.249625
4.266667 -0.732591 -1.133454 3.106593 -0.224698 -0.384159 0.183797
4.300000 -0.740104 -1.146293 3.100088 -0.226756 -0.386230 0.128196
4.333333 -0.747682 -1.159188 3.103372 -0.228860 -0.388305 0.092023
4.366667 -0.755333 -1.172160 3.114283 -0.231008 -0.390377 0.089960
4.400000 -0.763061 -1.185210 3.109942 -0.233197 -0.392443 0.144928
4.433333 -0.770866 -1.198340 3.084721 -0.235423 -0.394493 0.285798
4.466667 -0.778752 -1.211550 3.101014 -0.237685 -0.396518 0.532561
4.500000 -0.786707 -1.224813 3.087221 -0.239981 -0.398519 0.906880
4.533333 -0.794734 -1.238128 3.097723 -0.242311 -0.400495 1.414571
4.566667 -0.802847 -1.251526 3.079345 -0.244679 -0.402447 2.054450
4.600000 -0.811033 -1.264975 3.090418 -0.247084 -0.404378 2.805421
4.633333 -0.819292 -1.278475 3.106704 -0.249533 -0.406302 3.636160
4.666667 -0.827644 -1.292060 -3.048671 -0.252031 -0.408231 4.506078
4.700000 -0.836071 -1.305694 -2.872687 -0.254582 -0.410174 5.366288
4.733333 -0.844595 -1.319405 -2.612423 -0.257187 -0.412139 6.172102
4.766667 -0.853196 -1.333163 -2.326788 -0.259846 -0.414129 6.871238
4.800000 -0.861875 -1.346967 -2.021942 -0.262558 -0.416145 7.426196
4.833333 -0.870654 -1.360851 -1.692761 -0.265316 -0.418177 7.802749
4.866667 -0.879533 -1.374816 -1.363400 -0.268114 -0.420215 7.993155
4.900000 -0.888513 -1.388861 -1.041063 -0.270942 -0.422247 7.990701
4.933333 -0.897594 -1.402987 -0.742915 -0.273797 -0.424260 7.801687
4.966667 -0.906777 -1.417194 -0.455447 -0.276672 -0.426240 7.447767
5.000000 -0.916042 -1.431439 -0.241892 -0.279561 -0.428173 6.953770
5.033333 -0.925409 -1.445763 0.010624 -0.282464 -0.430055 6.344025
5.066667 -0.934882 -1.460164 0.247793 -0.285384 -0.431879 5.632290
5.100000 -0.944437 -1.474600 0.422411 -0.288322 -0.433644 4.846932
5.133333 -0.954100 -1.489112 0.586815 -0.291278 -0.435347 4.012292
5.166667 -0.963846 -1.503656 0.736782 -0.294260 -0.436995 3.148147
5.200000 -0.973675 -1.518231 0.856154 -0.297276 -0.438596 2.271341
5.233333 -0.983619 -1.532879 0.908031 -0.300323 -0.440149 1.414304
5.266667 -0.993682 -1.547597 0.916736 -0.303404 -0.441660 0.612305
5.300000 -1.003828 -1.562342 0.901306 -0.306521 -0.443131 -0.111865
5.333333 -1.014096 -1.577154 0.844851 -0.309671 -0.444564 -0.735010
5.366667 -1.024490 -1.592031 0.759695 -0.312841 -0.445949 -1.231628
5.400000 -1.034966 -1.606930 0.656244 -0.316020 -0.447276 -1.581517
5.433333 -1.045525 -1.621849 0.553815 -0.319202 -0.448545 -1.784486
5.466667 -1.056210 -1.636827 0.454513 -0.322380 -0.449754 -1.851584
5.500000 -1.067021 -1.651860 0.347022 -0.325543 -0.450896 -1.792280
5.533333 -1.077956 -1.666948 0.268961 -0.328685 -0.451970 -1.626268
5.566667 -1.088972 -1.682047 0.213843 -0.331802 -0.452976 -1.382500
5.600000 -1.100110 -1.697195 0.174559 -0.334889 -0.453914 -1.091858
5.633333 -1.111328 -1.712350 0.148957 -0.337933 -0.454772 -0.779920
5.666667 -1.122626 -1.727512 0.132896 -0.340923 -0.455540 -0.464466
5.700000 -1.134039 -1.742715 0.141751 -0.343853 -0.456213 -0.166331
5.733333 -1.145563 -1.757954 0.155862 -0.346717 -0.456785 0.101976
5.766667 -1.157196 -1.773227 0.179408 -0.349509 -0.457246 0.335598
5.800000 -1.168936 -1.788531 0.192149 -0.352224 -0.457592 0.539799
5.833333 -1.180752 -1.803830 0.227753 -0.354861 -0.457820 0.719888
5.866667 -1.192642 -1.819122 0.257850 -0.357420 -0.457926 0.880522
5.900000 -1.204606 -1.834404 0.300788 -0.359903 -0.457910 1.029118
5.933333 -1.216667 -1.849702 0.323478 -0.362314 -0.457775 1.176060
5.966667 -1.228800 -1.864984 0.349872 -0.364659 -0.457522 1.325739
6.000000 -1.241003 -1.880251 0.392548 -0.366949 -0.457162 1.472528
6.033333 -1.253276 -1.895498 0.447721 -0.369196 -0.456703 1.611582
6.066667 -1.265617 -1.910724 0.487674 -0.371406 -0.456151 1.736613
6.100000 -1.278043 -1.925942 0.555019 -0.373581 -0.455511 1.839867
6.133333 -1.290535 -1.941134 0.637309 -0.375723 -0.454786 1.904325
6.166667 -1.303091 -1.956298 0.714650 -0.377828 -0.453978 1.919629
6.200000 -1.315727 -1.971437 0.806060 -0.379893 -0.453087 1.880377
6.233333 -1.328443 -1.986547 0.887538 -0.381919 -0.452107 1.786723
6.266667 -1.341219 -2.001622 0.978363 -0.383909 -0.451036 1.639873
6.300000 -1.354074 -2.016658 1.047003 -0.385871 -0.449870 1.447783
6.333333 -1.366987 -2.031654 1.099264 -0.387811 -0.448606 1.226729
6.366667 -1.379955 -2.046607 1.127782 -0.389736 -0.447241 0.991803
6.400000 -1.392978 -2.061515 1.156159 -0.391648 -0.445774 0.760804
6.433333 -1.406054 -2.076375 1.161231 -0.393553 -0.444205 0.546526
6.466667 -1.419181 -2.091185 1.149714 -0.395450 -0.442537 0.360744
6.500000 -1.432357 -2.105942 1.143453 -0.397345 -0.440769 0.209648
6.533333 -1.445623 -2.120631 1.119657 -0.399244 -0.438901 0.096283
6.566667 -1.458980 -2.135245 1.107931 -0.401149 -0.436931 0.017534
6.600000 -1.472432 -2.149779 1.128783 -0.403062 -0.434860 -0.036594
6.633333 -1.485925 -2.164252 1.129797 -0.404982 -0.432688 -0.074304
6.666667 -1.499459 -2.178660 1.121621 -0.406898 -0.430419 -0.102513
6.700000 -1.513030 -2.193003 1.121784 -0.408801 -0.428057 -0.126634
6.733333 -1.526638 -2.207276 1.123770 -0.410678 -0.425605 -0.153028
6.766667 -1.540350 -2.221448 1.122613 -0.412523 -0.423068 -0.182706
6.800000 -1.554167 -2.235514 1.124014 -0.414329 -0.420450 -0.209193
6.833333 -1.568014 -2.249505 1.119056 -0.416088 -0.417754 -0.230237
6.866667 -1.581968 -2.263381 1.104746 -0.417799 -0.414983 -0.246152
6.900000 -1.595947 -2.277179 1.082523 -0.419470 -0.412132 -0.256300
6.933333 -1.609948 -2.290895 1.045859 -0.421093 -0.409207 -0.257381
6.966667 -1.624056 -2.304487 1.029184 -0.422672 -0.406204 -0.248780
7.000000 -1.638181 -2.317994 1.033816 -0.424217 -0.403121 -0.233990
7.033333 -1.652321 -2.331413 1.039246 -0.425729 -0.399955 -0.215087
7.066667 -1.666562 -2.344702 1.044311 -0.427203 -0.396710 -0.194560
7.100000 -1.680813 -2.357899 1.038402 -0.428619 -0.393396 -0.174279
7.133333 -1.695071 -2.371004 1.028830 -0.429964 -0.390019 -0.159151
7.166667 -1.709420 -2.383973 1.021769 -0.431212 -0.386592 -0.150122
7.200000 -1.723856 -2.396804 1.016387 -0.432325 -0.383135 -0.146670
7.233333 -1.738377 -2.409496 1.011046 -0.433270 -0.379661 -0.145819
7.266667 -1.752891 -2.422088 1.010657 -0.434033 -0.376177 -0.143448
7.300000 -1.767480 -2.434538 1.002355 -0.434608 -0.372684 -0.138084
7.333333 -1.782056 -2.446884 1.000646 -0.434992 -0.369179 -0.128456
7.366667 -1.796618 -2.459127 0.994632 -0.435194 -0.365654 -0.115695
7.400000 -1.811161 -2.471263 0.974883 -0.435242 -0.362093 -0.100994
7.433333 -1.825682 -2.483293 0.975041 -0.435169 -0.358477 -0.088541
7.466667 -1.840178 -2.495214 0.976051 -0.434994 -0.354794 -0.081473
7.500000 -1.854646 -2.507025 0.979141 -0.434741 -0.351033 -0.084190
7.533333 -1.869082 -2.518724 0.978291 -0.434427 -0.347185 -0.096910
7.566667 -1.883545 -2.530269 0.987905 -0.434060 -0.343246 -0.120599
7.600000 -1.898027 -2.541660 0.978391 -0.433634 -0.339220 -0.155759
7.633333 -1.912523 -2.552895 0.983037 -0.433130 -0.335119 -0.200087
7.666667 -1.927026 -2.563974 0.981448 -0.432527 -0.330959 -0.250046
7.700000 -1.941480 -2.574936 0.973810 -0.431798 -0.326753 -0.299124
7.733333 -1.955881 -2.585779 0.955132 -0.430918 -0.322519 -0.344442
7.766667 -1.970266 -2.596466 0.946397 -0.429866 -0.318272 -0.383387
7.800000 -1.984629 -2.606995 0.916324 -0.428625 -0.314024 -0.412548
7.833333 -1.998928 -2.617403 0.886451 -0.427190 -0.309776 -0.429757
7.866667 -2.013187 -2.627654 0.872642 -0.425567 -0.305526 -0.434547
7.900000 -2.027400 -2.637749 0.857249 -0.423754 -0.301279 -0.429244
7.933333 -2.041538 -2.647719 0.839345 -0.421749 -0.297034 -0.414908
7.966667 -2.055597 -2.657567 0.838866 -0.419552 -0.292789 -0.390987
8.000000 -2.069586 -2.667258 0.826685 -0.417162 -0.288539 -0.361708
8.033333 -2.083495 -2.676794 0.818326 -0.414570 -0.284286 -0.331493
8.066667 -2.097315 -2.686204 0.808161 -0.411768 -0.280031 -0.303314
8.100000 -2.111039 -2.695461 0.782375 -0.408754 -0.275766 -0.276793
8.133333 -2.124665 -2.704591 0.775389 -0.405528 -0.271492 -0.254394
8.166667 -2.138178 -2.713569 0.770176 -0.402091 -0.267213 -0.239738
8.200000 -2.151587 -2.722420 0.771876 -0.398441 -0.262931 -0.235388
8.233333 -2.164864 -2.731120 0.760085 -0.394587 -0.258650 -0.241216
8.266667 -2.178002 -2.739670 0.759441 -0.390537 -0.254377 -0.258211
8.300000 -2.190993 -2.748071 0.756515 -0.386309 -0.250119 -0.289847
8.333333 -2.203826 -2.756324 0.748140 -0.381919 -0.245883 -0.335003
8.366667 -2.216494 -2.764431 0.741193 -0.377387 -0.241675 -0.389919
8.400000 -2.229038 -2.772409 0.736951 -0.372731 -0.237502 -0.447298
8.433333 -2.241398 -2.780243 0.723641 -0.367955 -0.233369 -0.502733
8.466667 -2.253627 -2.787950 0.713088 -0.363053 -0.229277 -0.551603
8.500000 -2.265658 -2.795514 0.676572 -0.358001 -0.225227 -0.585256
8.533333 -2.277480 -2.802938 0.632055 -0.352768 -0.221213 -0.594378
8.566667 -2.289163 -2.810235 0.599953 -0.347317 -0.217231 -0.569655
8.600000 -2.300704 -2.817404 0.583786 -0.341623 -0.213275 -0.504166
8.633333 -2.312100 -2.824447 0.560519 -0.335671 -0.209340 -0.392101
8.666667 -2.323349 -2.831363 0.541203 -0.329459 -0.205423 -0.228194
8.700000 -2.334348 -2.838147 0.519207 -0.322993 -0.201520 -0.013729
8.733333 -2.345090 -2.844799 0.506312 -0.316299 -0.197630 0.240425
8.766667 -2.355570 -2.851319 0.503824 -0.309417 -0.193750 0.517329
8.800000 -2.365783 -2.857710 0.511778 -0.302390 -0.189880 0.797069
8.833333 -2.375723 -2.863970 0.525916 -0.295255 -0.186019 1.059172
8.866667 -2.385388 -2.870101 0.574863 -0.288060 -0.182167 1.278843
8.900000 -2.394775 -2.876103 0.655720 -0.280863 -0.178325 1.434101
8.933333 -2.403998 -2.881981 0.751517 -0.273691 -0.174491 1.513451
8.966667 -2.413056 -2.887737 0.839928 -0.266555 -0.170666 1.513124
9.000000 -2.421831 -2.893362 0.936345 -0.259449 -0.166844 1.434961
9.033333 -2.430324 -2.898856 1.020582 -0.252376 -0.163026 1.285457
9.066667 -2.438649 -2.904229 1.075138 -0.245326 -0.159210 1.082337
9.100000 -2.446693 -2.909471 1.110335 -0.238278 -0.155395 0.847812
9.133333 -2.454567 -2.914593 1.111914 -0.231238 -0.151585 0.599945
9.166667 -2.462164 -2.919583 1.092916 -0.224228 -0.147784 0.355973
9.200000 -2.469485 -2.924441 1.057262 -0.217286 -0.144000 0.134976
9.233333 -2.476634 -2.929182 1.036178 -0.210425 -0.140238 -0.047232
9.266667 -2.483512 -2.933789 1.035463 -0.203661 -0.136504 -0.185297
9.300000 -2.490122 -2.938261 1.041062 -0.197007 -0.132800 -0.279906
9.333333 -2.496465 -2.942601 1.034852 -0.190472 -0.129131 -0.331248
9.366667 -2.502637 -2.946827 1.019073 -0.184051 -0.125500 -0.346953
9.400000 -2.508637 -2.950939 1.001415 -0.177721 -0.121906 -0.340358
9.433333 -2.514467 -2.954939 0.993011 -0.171480 -0.118349 -0.324959
9.466667 -2.520126 -2.958828 0.950870 -0.165320 -0.114832 -0.304940
9.500000 -2.525539 -2.962591 0.935418 -0.159236 -0.111356 -0.286470
9.533333 -2.530782 -2.966245 0.929843 -0.153207 -0.107917 -0.276655
9.566667 -2.535789 -2.969778 0.931630 -0.147231 -0.104516 -0.277264
9.600000 -2.540565 -2.973193 0.935329 -0.141314 -0.101156 -0.289203
9.633333 -2.545119 -2.976492 0.947426 -0.135465 -0.097839 -0.310970
9.666667 -2.549506 -2.979685 0.948024 -0.129698 -0.094567 -0.350966
9.700000 -2.553681 -2.982767 0.930581 -0.124028 -0.091343 -0.407193
9.733333 -2.557693 -2.985746 0.915680 -0.118479 -0.088172 -0.475089
9.766667 -2.561541 -2.988623 0.891065 -0.113060 -0.085056 -0.549334
9.800000 -2.565200 -2.991395 0.879768 -0.107773 -0.081994 -0.623048
9.833333 -2.568676 -2.994066 0.846884 -0.102614 -0.078985 -0.688394
9.866667 -2.571976 -2.996636 0.813362 -0.097578 -0.076028 -0.731840
9.900000 -2.575119 -2.999109 0.787064 -0.092659 -0.073122 -0.748004
9.933333 -2.578098 -3.001487 0.755326 -0.087851 -0.070266 -0.734101
9.966667 -2.580922 -3.003772 0.730137 -0.083156 -0.067460 -0.691106
10.000000 -2.583592 -3.005963 0.687199 -0.078575 -0.064705 -0.618964
10.033333 -2.586118 -3.008066 0.652384 -0.074111 -0.062003 -0.521267
10.066667 -2.588494 -3.010077 0.629519 -0.069757 -0.059352 -0.404432
10.100000 -2.590721 -3.011999 0.614236 -0.065506 -0.056751 -0.275686
