t x y theta dxdt dydt dthetadt
0.000000 0.000000 0.000000 0.320696 -0.054782 0.143449 0.072260
0.033333 -0.001785 0.004848 0.328882 -0.053139 0.148009 0.071862
0.066667 -0.003520 0.009852 0.331795 -0.051543 0.152593 0.052847
0.100000 -0.005194 0.015001 0.336935 -0.049990 0.157195 0.016069
0.133333 -0.006821 0.020310 0.383897 -0.048475 0.161806 -0.028869
0.166667 -0.008404 0.025781 0.345234 -0.046995 0.166420 -0.078508
0.200000 -0.009945 0.031414 0.355132 -0.045547 0.171033 -0.122749
0.233333 -0.011445 0.037209 0.353523 -0.044130 0.175638 -0.160947
0.266667 -0.012891 0.043149 0.321794 -0.042740 0.180232 -0.189111
0.300000 -0.014282 0.049234 0.321794 -0.041378 0.184811 -0.206503
0.333333 -0.015622 0.055464 0.288187 -0.040046 0.189376 -0.204290
0.366667 -0.016927 0.061855 0.277915 -0.038748 0.193929 -0.189364
0.400000 -0.018199 0.068407 0.277915 -0.037491 0.198476 -0.162578
0.433333 -0.019424 0.075103 0.269461 -0.036282 0.203023 -0.126126
0.466667 -0.020602 0.081945 0.269461 -0.035127 0.207578 -0.084521
0.500000 -0.021734 0.088932 0.267785 -0.034031 0.212144 -0.028395
0.533333 -0.022821 0.096064 0.278288 -0.032998 0.216725 0.033476
0.566667 -0.023884 0.103357 0.284864 -0.032027 0.221321 0.124000
0.600000 -0.024925 0.110809 0.284864 -0.031115 0.225929 0.248289
0.633333 -0.025924 0.118405 0.274366 -0.030255 0.230544 0.411997
0.666667 -0.026904 0.126163 0.304056 -0.029445 0.235165 0.611156
0.700000 -0.027866 0.134082 0.274306 -0.028679 0.239788 0.827495
0.733333 -0.028811 0.142163 0.299055 -0.027952 0.244408 1.050392
0.766667 -0.029742 0.150405 0.299100 -0.027260 0.249027 1.245064
0.800000 -0.030639 0.158790 0.311314 -0.026602 0.253646 1.399945
0.833333 -0.031502 0.167316 0.414660 -0.025977 0.258266 1.503903
0.866667 -0.032355 0.176007 0.493405 -0.025379 0.262881 1.577524
0.900000 -0.033177 0.184838 0.698920 -0.024809 0.267492 1.613269
0.933333 -0.033969 0.193809 0.809179 -0.024269 0.272105 1.616766
0.966667 -0.034757 0.202948 0.875333 -0.023762 0.276722 1.597579
1.000000 -0.035541 0.212258 0.850092 -0.023286 0.281340 1.553931
1.033333 -0.036299 0.221705 0.821658 -0.022840 0.285960 1.487645
1.066667 -0.037053 0.231324 0.792113 -0.022428 0.290584 1.376988
1.100000 -0.037805 0.241117 0.792113 -0.022045 0.295202 1.266881
1.133333 -0.038533 0.251043 0.861316 -0.021683 0.299801 1.177442
1.166667 -0.039237 0.261103 0.975882 -0.021339 0.304373 1.135995
1.200000 -0.039919 0.271294 1.179574 -0.021013 0.308913 1.149871
1.233333 -0.040603 0.281663 1.192243 -0.020705 0.313418 1.248241
1.266667 -0.041291 0.292209 1.193190 -0.020418 0.317890 1.462288
1.300000 -0.041982 0.302932 1.175109 -0.020158 0.322336 1.767938
1.333333 -0.042655 0.313781 1.132243 -0.019934 0.326765 2.166160
1.366667 -0.043309 0.324755 1.071479 -0.019748 0.331183 2.638291
1.400000 -0.043946 0.335853 1.085959 -0.019603 0.335595 3.199835
1.433333 -0.044566 0.347072 1.238007 -0.019501 0.340005 3.802817
1.466667 -0.045196 0.358463 1.384299 -0.019440 0.344412 4.398623
1.500000 -0.045838 0.370025 1.658322 -0.019417 0.348815 4.948597
1.533333 -0.046465 0.381704 1.857755 -0.019427 0.353211 5.406305
1.566667 -0.047107 0.393555 2.144592 -0.019459 0.357587 5.734349
1.600000 -0.047764 0.405577 2.482836 -0.019502 0.361929 5.877423
1.633333 -0.048409 0.417711 2.672804 -0.019540 0.366219 5.842902
1.666667 -0.049071 0.430015 2.905080 -0.019560 0.370440 5.631944
1.700000 -0.049749 0.442490 3.023475 -0.019550 0.374574 5.284882
1.733333 -0.050417 0.455070 -3.050058 -0.019499 0.378599 4.815796
1.766667 -0.051081 0.467786 -2.893038 -0.019403 0.382506 4.264155
1.800000 -0.051740 0.480637 -2.699563 -0.019262 0.386285 3.672532
1.833333 -0.052390 0.493584 -2.625353 -0.019077 0.389924 3.054760
1.866667 -0.053030 0.506661 -2.509923 -0.018852 0.393420 2.436133
1.900000 -0.053660 0.519863 -2.473012 -0.018594 0.396773 1.810060
1.933333 -0.054277 0.533190 -2.403836 -0.018309 0.399982 1.201638
1.966667 -0.054880 0.546634 -2.389596 -0.018005 0.403046 0.614402
2.000000 -0.055474 0.560163 -2.386341 -0.017687 0.405966 0.056037
2.033333 -0.056061 0.573772 -2.391631 -0.017362 0.408742 -0.461007
2.066667 -0.056641 0.587459 -2.456157 -0.017036 0.411376 -0.921166
2.100000 -0.057202 0.601245 -2.504546 -0.016713 0.413866 -1.311342
2.133333 -0.057756 0.615102 -2.533485 -0.016399 0.416217 -1.626787
2.166667 -0.058290 0.629048 -2.649709 -0.016101 0.418438 -1.857209
2.200000 -0.058819 0.643061 -2.735974 -0.015822 0.420536 -2.000415
2.233333 -0.059330 0.657147 -2.825713 -0.015574 0.422521 -2.056178
2.266667 -0.059835 0.671293 -2.919740 -0.015364 0.424399 -2.036180
2.300000 -0.060335 0.685496 -3.023950 -0.015198 0.426180 -1.945374
2.333333 -0.060832 0.699754 -3.104251 -0.015080 0.427866 -1.793602
2.366667 -0.061315 0.714056 3.117899 -0.015010 0.429461 -1.599109
2.400000 -0.061795 0.728405 3.065786 -0.014986 0.430965 -1.376758
2.433333 -0.062271 0.742800 3.044950 -0.014999 0.432379 -1.140464
2.466667 -0.062758 0.757251 3.020774 -0.015042 0.433703 -0.901848
2.500000 -0.063257 0.771754 2.996543 -0.015104 0.434933 -0.675376
2.533333 -0.063768 0.786301 2.991906 -0.015178 0.436067 -0.464658
2.566667 -0.064292 0.800890 2.983843 -0.015256 0.437099 -0.274316
2.600000 -0.064814 0.815508 2.976139 -0.015333 0.438025 -0.105807
2.633333 -0.065334 0.830152 2.994252 -0.015403 0.438839 0.038847
2.666667 -0.065852 0.844819 2.968575 -0.015463 0.439534 0.168195
2.700000 -0.066368 0.859505 2.991040 -0.015512 0.440107 0.280675
2.733333 -0.066883 0.874208 3.007391 -0.015549 0.440555 0.371800
2.766667 -0.067397 0.888925 3.038648 -0.015575 0.440876 0.441337
2.800000 -0.067910 0.903651 3.035277 -0.015590 0.441071 0.488146
2.833333 -0.068422 0.918384 3.054538 -0.015595 0.441143 0.518354
2.866667 -0.068947 0.933123 3.111058 -0.015592 0.441097 0.522877
2.900000 -0.069484 0.947864 3.122545 -0.015576 0.440936 0.518256
2.933333 -0.070020 0.962602 -3.130515 -0.015543 0.440662 0.505224
2.966667 -0.070546 0.977309 -3.114180 -0.015485 0.440277 0.498973
3.000000 -0.071057 0.991981 -3.081963 -0.015397 0.439785 0.501679
3.033333 -0.071568 1.006641 -3.113584 -0.015272 0.439188 0.513657
3.066667 -0.072079 1.021285 -3.083392 -0.015110 0.438489 0.534079
3.100000 -0.072590 1.035912 -3.099332 -0.014912 0.437691 0.551958
3.133333 -0.073101 1.050516 -3.109193 -0.014685 0.436802 0.572368
3.166667 -0.073612 1.065096 -3.072035 -0.014441 0.435827 0.571654
3.200000 -0.074092 1.079628 -3.029566 -0.014186 0.434766 0.548127
3.233333 -0.074573 1.094130 -2.971242 -0.013932 0.433619 0.490129
3.266667 -0.075024 1.108580 -2.965801 -0.013684 0.432386 0.406752
3.300000 -0.075446 1.122976 -2.881083 -0.013453 0.431065 0.289989
3.333333 -0.075868 1.137332 -2.873598 -0.013242 0.429649 0.136480
3.366667 -0.076292 1.151645 -2.863831 -0.013057 0.428131 -0.034247
3.400000 -0.076717 1.165912 -2.929603 -0.012902 0.426505 -0.210709
3.433333 -0.077143 1.180130 -2.929603 -0.012783 0.424766 -0.374320
3.466667 -0.077570 1.194297 -2.941808 -0.012700 0.422905 -0.521702
3.500000 -0.077999 1.208409 -3.004521 -0.012656 0.420913 -0.624064
3.533333 -0.078411 1.222432 -3.025318 -0.012652 0.418789 -0.674454
3.566667 -0.078826 1.236395 -3.041986 -0.012691 0.416539 -0.673942
3.600000 -0.079242 1.250296 -3.105342 -0.012772 0.414167 -0.623184
3.633333 -0.079651 1.264089 -3.131658 -0.012896 0.411675 -0.524513
3.666667 -0.080053 1.277775 3.138690 -0.013064 0.409076 -0.378991
3.700000 -0.080471 1.291373 3.114679 -0.013275 0.406379 -0.207136
3.733333 -0.080909 1.304879 3.084882 -0.013521 0.403588 -0.016205
3.766667 -0.081349 1.318308 3.116566 -0.013799 0.400705 0.188507
3.800000 -0.081814 1.331632 3.103246 -0.014102 0.397725 0.385922
3.833333 -0.082308 1.344842 -3.135154 -0.014419 0.394651 0.558592
3.866667 -0.082805 1.357969 -3.110845 -0.014740 0.391473 0.696184
3.900000 -0.083305 1.371010 -3.108019 -0.015055 0.388187 0.792026
3.933333 -0.083808 1.383962 -3.044036 -0.015359 0.384782 0.841308
3.966667 -0.084329 1.396748 -2.959990 -0.015648 0.381253 0.832780
4.000000 -0.084854 1.409441 -2.919008 -0.015915 0.377607 0.769155
4.033333 -0.085398 1.421957 -2.863207 -0.016163 0.373846 0.658366
4.066667 -0.085946 1.434377 -2.869537 -0.016392 0.369991 0.477120
4.100000 -0.086496 1.446697 -2.828642 -0.016603 0.366059 0.233313
4.133333 -0.087060 1.458833 -2.876193 -0.016793 0.362088 -0.095154
4.166667 -0.087627 1.470866 -2.851736 -0.016965 0.358103 -0.515735
4.200000 -0.088204 1.482710 -2.842688 -0.017118 0.354127 -1.004823
4.233333 -0.088782 1.494449 -2.867774 -0.017252 0.350175 -1.608006
4.266667 -0.089364 1.505995 -2.859706 -0.017370 0.346258 -2.308465
4.300000 -0.089948 1.517432 -2.911713 -0.017471 0.342385 -3.133716
4.333333 -0.090534 1.528758 -3.033998 -0.017559 0.338538 -3.526386
4.366667 -0.091122 1.539972 -3.033998 -0.017633 0.334704 -3.481748
4.400000 -0.091712 1.551073 2.878998 -0.017693 0.330857 -3.018986
4.433333 -0.092303 1.562059 2.878998 -0.017735 0.326975 -2.073005
4.466667 -0.092896 1.572929 2.430957 -0.017755 0.323022 -0.581132
4.500000 -0.093490 1.583681 2.084673 -0.017752 0.318968 1.493139
4.533333 -0.094090 1.594264 2.084673 -0.017723 0.314806 3.088636
4.566667 -0.094691 1.604727 1.421279 -0.017666 0.310534 4.321204
4.600000 -0.095294 1.615069 0.918702 -0.017584 0.306165 5.246139
4.633333 -0.095892 1.625241 0.482629 -0.017481 0.301723 5.852040
4.666667 -0.096484 1.635240 0.020585 -0.017363 0.297240 6.108782
4.700000 -0.097066 1.645065 -0.528146 -0.017235 0.292748 6.064189
4.733333 -0.097633 1.654712 -0.983353 -0.017105 0.288270 5.792457
4.766667 -0.098184 1.664180 -1.423029 -0.016980 0.283825 5.152702
4.800000 -0.098735 1.673522 -1.776423 -0.016867 0.279428 4.083527
4.833333 -0.099287 1.682738 -2.411892 -0.016771 0.275080 2.644996
4.866667 -0.099839 1.691826 -2.858582 -0.016694 0.270778 0.813664
4.900000 -0.100391 1.700787 -2.858582 -0.016637 0.266518 -1.503786
4.933333 -0.100943 1.709620 -2.858582 -0.016598 0.262288 -3.362598
4.966667 -0.101495 1.718325 2.610670 -0.016573 0.258074 -4.674632
5.000000 -0.102047 1.726871 2.487062 -0.016557 0.253868 -5.452243
5.033333 -0.102600 1.735258 2.317924 -0.016546 0.249668 -5.786983
5.066667 -0.103152 1.743515 2.199427 -0.016535 0.245470 -5.693257
5.100000 -0.103704 1.751615 1.944687 -0.016521 0.241275 -5.111004
5.133333 -0.104256 1.759558 1.944687 -0.016501 0.237085 -4.519194
5.166667 -0.104807 1.767371 1.713955 -0.016476 0.232908 -4.011294
5.200000 -0.105357 1.775054 1.568120 -0.016443 0.228741 -3.554841
5.233333 -0.105906 1.782608 1.496715 -0.016403 0.224580 -3.125248
5.266667 -0.106454 1.790032 1.387531 -0.016354 0.220422 -2.704709
5.300000 -0.107001 1.797326 1.337734 -0.016297 0.216262 -2.326324
5.333333 -0.107547 1.804492 1.270081 -0.016231 0.212095 -1.988832
5.366667 -0.108090 1.811506 1.189663 -0.016157 0.207918 -1.660039
5.400000 -0.108629 1.818369 1.161579 -0.016075 0.203733 -1.358826
5.433333 -0.109164 1.825084 1.105165 -0.015987 0.199546 -1.083186
5.466667 -0.109696 1.831651 1.085628 -0.015894 0.195367 -0.840302
5.500000 -0.110226 1.838090 1.076637 -0.015796 0.191203 -0.624929
5.533333 -0.110751 1.844384 1.078871 -0.015693 0.187064 -0.454677
5.566667 -0.111272 1.850535 1.075201 -0.015588 0.182960 -0.319810
5.600000 -0.111788 1.856545 1.059670 -0.015480 0.178895 -0.210734
5.633333 -0.112302 1.862428 1.080745 -0.015370 0.174872 -0.132954
5.666667 -0.112814 1.868185 1.098303 -0.015258 0.170891 -0.083089
5.700000 -0.113324 1.873818 1.083580 -0.015144 0.166953 -0.054529
5.733333 -0.113828 1.879314 1.069099 -0.015029 0.163057 -0.034935
5.766667 -0.114328 1.884677 1.083525 -0.014913 0.159200 -0.026861
5.800000 -0.114822 1.889908 1.074689 -0.014794 0.155380 -0.027481
5.833333 -0.115311 1.895007 1.072031 -0.014673 0.151596 -0.031031
5.866667 -0.115798 1.899986 1.052936 -0.014550 0.147850 -0.029746
