t x y theta dxdt dydt dthetadt
0.000000 0.000000 0.000000 -1.232633 -0.021974 -0.024717 -0.005589
0.033333 -0.000646 -0.000758 -1.222675 -0.025363 -0.028234 -0.007195
0.066667 -0.001335 -0.001574 -1.225235 -0.029176 -0.032162 -0.008475
0.100000 -0.002204 -0.002563 -1.217114 -0.033455 -0.036547 -0.013127
0.133333 -0.003259 -0.003729 -1.230137 -0.038294 -0.041495 -0.017745
0.166667 -0.004503 -0.005077 -1.233880 -0.043863 -0.047184 -0.022395
0.200000 -0.005911 -0.006581 -1.239085 -0.050267 -0.053728 -0.029857
0.233333 -0.007511 -0.008297 -1.229541 -0.057602 -0.061230 -0.040344
0.266667 -0.009317 -0.010209 -1.231771 -0.065877 -0.069706 -0.053586
0.300000 -0.011332 -0.012320 -1.234599 -0.075156 -0.079240 -0.066478
0.333333 -0.013734 -0.014856 -1.235800 -0.085458 -0.089865 -0.080778
0.366667 -0.016357 -0.017600 -1.229937 -0.096751 -0.101567 -0.095950
0.400000 -0.019559 -0.020957 -1.239043 -0.109000 -0.114325 -0.107952
0.433333 -0.022989 -0.024529 -1.238798 -0.122226 -0.128188 -0.114001
0.466667 -0.027182 -0.028939 -1.242964 -0.136448 -0.143193 -0.114721
0.500000 -0.032232 -0.034240 -1.254895 -0.151551 -0.159211 -0.111034
0.533333 -0.037521 -0.039763 -1.270587 -0.167377 -0.176054 -0.105226
0.566667 -0.043050 -0.045512 -1.276810 -0.183738 -0.193473 -0.097734
0.600000 -0.048822 -0.051487 -1.283694 -0.200507 -0.211284 -0.093502
0.633333 -0.055525 -0.058522 -1.281723 -0.217423 -0.229133 -0.096753
0.666667 -0.063164 -0.066643 -1.272442 -0.234256 -0.246696 -0.107952
0.700000 -0.071709 -0.075779 -1.277302 -0.250816 -0.263707 -0.128668
0.733333 -0.080501 -0.085142 -1.260850 -0.266960 -0.279956 -0.157806
0.766667 -0.090089 -0.095371 -1.254624 -0.282494 -0.295221 -0.193501
0.800000 -0.099922 -0.105821 -1.269062 -0.297189 -0.309239 -0.231563
0.833333 -0.110405 -0.116823 -1.274571 -0.310919 -0.321903 -0.269007
0.866667 -0.121130 -0.128041 -1.305600 -0.323613 -0.333183 -0.300389
0.900000 -0.132444 -0.139610 -1.330317 -0.335253 -0.343136 -0.321288
0.933333 -0.143996 -0.151389 -1.334926 -0.345806 -0.351803 -0.328147
0.966667 -0.155951 -0.163441 -1.355896 -0.355352 -0.359343 -0.320345
1.000000 -0.168139 -0.175695 -1.368099 -0.363981 -0.365932 -0.300246
1.033333 -0.180599 -0.188129 -1.383722 -0.371803 -0.371741 -0.264751
1.066667 -0.193287 -0.200758 -1.395305 -0.378896 -0.376894 -0.219052
1.100000 -0.206199 -0.213578 -1.392955 -0.385366 -0.381502 -0.167365
1.133333 -0.219270 -0.226478 -1.378120 -0.391330 -0.385689 -0.113061
1.166667 -0.232560 -0.239561 -1.399676 -0.396882 -0.389540 -0.057124
1.200000 -0.245930 -0.252669 -1.398065 -0.402112 -0.393126 -0.001437
1.233333 -0.259382 -0.265793 -1.397692 -0.407069 -0.396500 0.047620
1.266667 -0.272932 -0.278925 -1.400350 -0.411783 -0.399712 0.088993
1.300000 -0.286689 -0.292226 -1.403108 -0.416241 -0.402791 0.121963
1.333333 -0.300648 -0.305692 -1.387415 -0.420447 -0.405772 0.146058
1.366667 -0.314808 -0.319319 -1.375022 -0.424388 -0.408688 0.156492
1.400000 -0.329164 -0.333104 -1.362122 -0.428042 -0.411555 0.153667
1.433333 -0.343715 -0.347043 -1.349434 -0.431388 -0.414366 0.138146
1.466667 -0.358266 -0.360890 -1.343103 -0.434441 -0.417106 0.111893
1.500000 -0.373004 -0.374883 -1.336171 -0.437219 -0.419757 0.076359
1.533333 -0.387719 -0.388841 -1.330651 -0.439745 -0.422308 0.034754
1.566667 -0.402374 -0.402876 -1.334738 -0.442062 -0.424752 -0.007252
1.600000 -0.416962 -0.417057 -1.333727 -0.444239 -0.427102 -0.047237
1.633333 -0.431727 -0.431371 -1.349530 -0.446333 -0.429389 -0.079304
1.666667 -0.446666 -0.445814 -1.358464 -0.448359 -0.431621 -0.103464
1.700000 -0.461777 -0.460384 -1.364720 -0.450331 -0.433803 -0.119019
1.733333 -0.476799 -0.474871 -1.367094 -0.452249 -0.435930 -0.125654
1.766667 -0.491788 -0.489349 -1.384570 -0.454066 -0.437990 -0.124568
1.800000 -0.506941 -0.503944 -1.371835 -0.455710 -0.439971 -0.116023
1.833333 -0.522257 -0.518652 -1.383899 -0.457165 -0.441870 -0.105264
1.866667 -0.537733 -0.533471 -1.380631 -0.458428 -0.443703 -0.093859
1.900000 -0.553368 -0.548398 -1.382433 -0.459499 -0.445489 -0.079582
1.933333 -0.568763 -0.563282 -1.386846 -0.460383 -0.447235 -0.067790
1.966667 -0.583887 -0.578153 -1.387735 -0.461142 -0.448951 -0.058306
2.000000 -0.599164 -0.593123 -1.387667 -0.461861 -0.450645 -0.051869
2.033333 -0.614591 -0.608188 -1.410491 -0.462576 -0.452315 -0.044264
2.066667 -0.630169 -0.623346 -1.388961 -0.463321 -0.453960 -0.034341
2.100000 -0.645594 -0.638521 -1.397615 -0.464155 -0.455585 -0.025178
2.133333 -0.660836 -0.653681 -1.383597 -0.465121 -0.457195 -0.014233
2.166667 -0.676224 -0.668925 -1.398604 -0.466206 -0.458790 -0.001416
2.200000 -0.691758 -0.684251 -1.402547 -0.467387 -0.460365 0.015103
2.233333 -0.707435 -0.699655 -1.391784 -0.468671 -0.461919 0.029373
2.266667 -0.723256 -0.715136 -1.410416 -0.470068 -0.463455 0.044607
2.300000 -0.738990 -0.730611 -1.393828 -0.471553 -0.464980 0.058473
2.333333 -0.754683 -0.746108 -1.394646 -0.473095 -0.466502 0.073147
2.366667 -0.770311 -0.761669 -1.387681 -0.474725 -0.468040 0.086078
2.400000 -0.786080 -0.777295 -1.375768 -0.476489 -0.469610 0.091323
2.433333 -0.801987 -0.792985 -1.379665 -0.478419 -0.471227 0.093279
2.466667 -0.818034 -0.808735 -1.387488 -0.480542 -0.472887 0.087739
2.500000 -0.834059 -0.824481 -1.375281 -0.482901 -0.474560 0.078736
2.533333 -0.850041 -0.840256 -1.360314 -0.485551 -0.476215 0.064460
2.566667 -0.866160 -0.856083 -1.358454 -0.488498 -0.477819 0.045671
2.600000 -0.882393 -0.872044 -1.350538 -0.491727 -0.479337 0.029480
2.633333 -0.898768 -0.888157 -1.365001 -0.495265 -0.480734 0.012915
2.666667 -0.915278 -0.904315 -1.369163 -0.499150 -0.481991 -0.002489
2.700000 -0.931923 -0.920517 -1.355851 -0.503436 -0.483126 -0.015947
2.733333 -0.948745 -0.936705 -1.376561 -0.508244 -0.484183 -0.027512
2.766667 -0.965700 -0.952930 -1.375278 -0.513787 -0.485218 -0.035450
2.800000 -0.982721 -0.969120 -1.370874 -0.520371 -0.486312 -0.044234
2.833333 -1.000056 -0.985252 -1.377142 -0.528200 -0.487552 -0.049077
2.866667 -1.017519 -1.001415 -1.368722 -0.537470 -0.489022 -0.049658
2.900000 -1.035110 -1.017606 -1.372278 -0.548424 -0.490805 -0.043974
2.933333 -1.052828 -1.033824 -1.363184 -0.561164 -0.492929 -0.030530
2.966667 -1.071185 -1.050157 -1.394046 -0.575740 -0.495426 -0.003034
3.000000 -1.089665 -1.066512 -1.381873 -0.592019 -0.498295 0.046666
3.033333 -1.108967 -1.083041 -1.365060 -0.609880 -0.501506 0.116355
3.066667 -1.129355 -1.099883 -1.396135 -0.629121 -0.505001 0.209559
3.100000 -1.150817 -1.116873 -1.391231 -0.649242 -0.508667 0.320400
3.133333 -1.173414 -1.133967 -1.405527 -0.669735 -0.512411 0.449223
3.166667 -1.196110 -1.151068 -1.392336 -0.690158 -0.516094 0.587353
3.200000 -1.218901 -1.168175 -1.359606 -0.710160 -0.519590 0.722737
3.233333 -1.243413 -1.185642 -1.313652 -0.729357 -0.522779 0.849407
3.266667 -1.268003 -1.203107 -1.300818 -0.747527 -0.525589 0.956823
3.300000 -1.294499 -1.221003 -1.243489 -0.764590 -0.527964 1.037443
3.333333 -1.321052 -1.238891 -1.172089 -0.780642 -0.529865 1.083715
3.366667 -1.347651 -1.256767 -1.126539 -0.795659 -0.531167 1.087939
3.400000 -1.374285 -1.274627 -1.083003 -0.809620 -0.531747 1.052284
3.433333 -1.400942 -1.292468 -1.053125 -0.822719 -0.531528 0.983196
3.466667 -1.427612 -1.310286 -1.045442 -0.835067 -0.530411 0.885006
3.500000 -1.456780 -1.328084 -0.963593 -0.846932 -0.528189 0.765232
3.533333 -1.485935 -1.345852 -0.938326 -0.858493 -0.524651 0.632462
3.566667 -1.515062 -1.363587 -0.925987 -0.869763 -0.519811 0.498034
3.600000 -1.544148 -1.381285 -0.914713 -0.880754 -0.513688 0.366566
3.633333 -1.573177 -1.398942 -0.947463 -0.891358 -0.506046 0.240278
3.666667 -1.602135 -1.416556 -0.926461 -0.901469 -0.496654 0.121998
3.700000 -1.633265 -1.432769 -0.924193 -0.910727 -0.485455 0.022745
3.733333 -1.664293 -1.448934 -0.928769 -0.918673 -0.472141 -0.059058
3.766667 -1.695202 -1.465049 -0.917508 -0.925035 -0.456297 -0.125330
3.800000 -1.725977 -1.481112 -0.935595 -0.929357 -0.437248 -0.173603
3.833333 -1.758202 -1.495115 -0.968652 -0.931021 -0.414931 -0.207543
3.866667 -1.790257 -1.509066 -0.963099 -0.929410 -0.389291 -0.227261
3.900000 -1.822124 -1.522964 -0.969944 -0.924332 -0.360360 -0.239532
3.933333 -1.853786 -1.536812 -0.991989 -0.915804 -0.328672 -0.240985
3.966667 -1.885410 -1.547941 -1.001746 -0.903831 -0.294992 -0.229390
4.000000 -1.916792 -1.559025 -0.996780 -0.888484 -0.260418 -0.209312
4.033333 -1.947207 -1.567201 -1.001996 -0.870174 -0.225732 -0.181872
4.066667 -1.976102 -1.572331 -1.014560 -0.849424 -0.191968 -0.145035
4.100000 -2.004706 -1.577436 -1.021389 -0.826250 -0.159958 -0.100218
4.133333 -2.030766 -1.579385 -1.028381 -0.800519 -0.130523 -0.055182
4.166667 -2.056506 -1.581334 -1.040859 -0.771924 -0.104070 -0.013482
4.200000 -2.081914 -1.583298 -1.042911 -0.740413 -0.081187 0.024995
4.233333 -2.106977 -1.585291 -1.031129 -0.705538 -0.062254 0.061581
4.266667 -2.131684 -1.587326 -1.008981 -0.666643 -0.047147 0.090723
4.300000 -2.156024 -1.589419 -1.008981 -0.623519 -0.036055 0.113924
4.333333 -2.176227 -1.589318 -1.003284 -0.576306 -0.029059 0.137440
4.366667 -2.196043 -1.589303 -1.003782 -0.525555 -0.026395 0.171683
4.400000 -2.215467 -1.589393 -0.991088 -0.471827 -0.028189 0.227334
4.433333 -2.231379 -1.588696 -0.970209 -0.416266 -0.034913 0.314657
4.466667 -2.244083 -1.587925 -0.973931 -0.360357 -0.047302 0.451027
4.500000 -2.253849 -1.587676 -0.991497 -0.305695 -0.065636 0.643319
4.533333 -2.261014 -1.588457 -1.001789 -0.253511 -0.089600 0.898902
4.566667 -2.265963 -1.590687 -0.985200 -0.204967 -0.119100 1.206799
4.600000 -2.270529 -1.593117 -0.971546 -0.161142 -0.153965 1.550936
4.633333 -2.273771 -1.597798 -0.916736 -0.122600 -0.193309 1.909639
4.666667 -2.275890 -1.605032 -0.873608 -0.089497 -0.236013 2.250757
4.700000 -2.277656 -1.612499 -0.769097 -0.061528 -0.281503 2.540604
4.733333 -2.278508 -1.622918 -0.645440 -0.038313 -0.329502 2.741634
4.766667 -2.278526 -1.636542 -0.496514 -0.019214 -0.379084 2.831287
4.800000 -2.278231 -1.650413 -0.333961 -0.003529 -0.428930 2.790388
4.833333 -2.277633 -1.664530 -0.187130 0.009389 -0.478381 2.612990
4.866667 -2.276748 -1.678894 -0.037381 0.020011 -0.527444 2.302135
4.900000 -2.275539 -1.697169 0.062561 0.028695 -0.575150 1.877263
4.933333 -2.274134 -1.719391 0.113519 0.035659 -0.620849 1.369201
4.966667 -2.272483 -1.741848 0.159513 0.041058 -0.664588 0.811905
5.000000 -2.270600 -1.764530 0.157874 0.045045 -0.706724 0.248048
5.033333 -2.269085 -1.791258 0.132149 0.047744 -0.747126 -0.288114
5.066667 -2.267365 -1.818189 0.087898 0.049357 -0.784955 -0.763244
5.100000 -2.265455 -1.845308 0.027792 0.050050 -0.820306 -1.156122
5.133333 -2.263367 -1.872600 -0.076103 0.049990 -0.853309 -1.454310
5.166667 -2.261116 -1.900051 -0.146314 0.049308 -0.883850 -1.657021
5.200000 -2.259565 -1.930737 -0.215879 0.048143 -0.911635 -1.771729
5.233333 -2.257877 -1.961549 -0.307519 0.046479 -0.937079 -1.808679
5.266667 -2.256762 -1.995420 -0.382477 0.044209 -0.960650 -1.780968
5.300000 -2.255536 -2.029374 -0.430456 0.041226 -0.982511 -1.700441
5.333333 -2.254210 -2.063389 -0.490208 0.037387 -1.002474 -1.583421
5.366667 -2.252798 -2.097442 -0.530125 0.032452 -1.020298 -1.440014
5.400000 -2.251310 -2.131509 -0.568198 0.026162 -1.036109 -1.282533
5.433333 -2.249760 -2.165568 -0.626600 0.018429 -1.049580 -1.119871
5.466667 -2.248784 -2.201211 -0.665132 0.009132 -1.060528 -0.960602
5.500000 -2.247768 -2.236797 -0.704842 -0.001851 -1.068775 -0.810115
5.533333 -2.247430 -2.273193 -0.713863 -0.014591 -1.074096 -0.672297
5.566667 -2.247828 -2.310304 -0.739789 -0.029039 -1.076145 -0.549398
5.600000 -2.249096 -2.347738 -0.740243 -0.045063 -1.074354 -0.440778
5.633333 -2.250364 -2.385007 -0.735363 -0.062588 -1.068230 -0.346670
5.666667 -2.252690 -2.421801 -0.734346 -0.081482 -1.057469 -0.266373
5.700000 -2.256189 -2.457730 -0.740585 -0.101514 -1.041825 -0.200190
5.733333 -2.259709 -2.493411 -0.747188 -0.122539 -1.021331 -0.144824
5.766667 -2.263254 -2.528817 -0.766692 -0.144350 -0.996443 -0.095691
5.800000 -2.268284 -2.562260 -0.765283 -0.166908 -0.967710 -0.050886
5.833333 -2.273348 -2.595375 -0.765650 -0.190302 -0.935579 -0.007059
5.866667 -2.280050 -2.626304 -0.765134 -0.214425 -0.900686 0.038258
5.900000 -2.288469 -2.654857 -0.781214 -0.239222 -0.863731 0.085002
5.933333 -2.296926 -2.683014 -0.771588 -0.264420 -0.825503 0.133539
5.966667 -2.305421 -2.710755 -0.757420 -0.289891 -0.786512 0.179228
6.000000 -2.315785 -2.735936 -0.742622 -0.315240 -0.747378 0.219295
6.033333 -2.326184 -2.760663 -0.726644 -0.339867 -0.708931 0.250167
6.066667 -2.338371 -2.783023 -0.735414 -0.363362 -0.671700 0.271243
6.100000 -2.350583 -2.804897 -0.713871 -0.385501 -0.635933 0.282398
6.133333 -2.364510 -2.824770 -0.700917 -0.406017 -0.601866 0.284583
6.166667 -2.379996 -2.842842 -0.681409 -0.424304 -0.569959 0.278362
6.200000 -2.395486 -2.860388 -0.663660 -0.439973 -0.540360 0.267224
6.233333 -2.410970 -2.877396 -0.675397 -0.452538 -0.513147 0.256476
6.266667 -2.426440 -2.893855 -0.675246 -0.461660 -0.488228 0.247938
6.300000 -2.442715 -2.909197 -0.644545 -0.466627 -0.465757 0.243737
6.333333 -2.458955 -2.923969 -0.649992 -0.466929 -0.445614 0.247202
6.366667 -2.475747 -2.938096 -0.646450 -0.462495 -0.427364 0.262545
6.400000 -2.492563 -2.951651 -0.641744 -0.453313 -0.410692 0.290923
6.433333 -2.509311 -2.964607 -0.635220 -0.439529 -0.395213 0.328920
6.466667 -2.525416 -2.977235 -0.627664 -0.421205 -0.380679 0.372140
6.500000 -2.540495 -2.989584 -0.609337 -0.398850 -0.366621 0.418391
6.533333 -2.554192 -3.001631 -0.601776 -0.373170 -0.352589 0.459510
6.566667 -2.566192 -3.013422 -0.594567 -0.344841 -0.338155 0.488056
6.600000 -2.578078 -3.024567 -0.562860 -0.314448 -0.322919 0.496173
6.633333 -2.587809 -3.035447 -0.541026 -0.282919 -0.306386 0.480664
6.666667 -2.595275 -3.045988 -0.507829 -0.251267 -0.287983 0.439590
6.700000 -2.602615 -3.055855 -0.472640 -0.220328 -0.267341 0.371798
6.733333 -2.609826 -3.065038 -0.454204 -0.190730 -0.244176 0.279128
6.766667 -2.614982 -3.073552 -0.438313 -0.163090 -0.218322 0.164004
6.800000 -2.620008 -3.081364 -0.433892 -0.138039 -0.189528 0.031403
6.833333 -2.623584 -3.088086 -0.444574 -0.115851 -0.157831 -0.113951
6.866667 -2.626034 -3.093518 -0.452284 -0.096597 -0.123451 -0.263448
6.900000 -2.627639 -3.097366 -0.469897 -0.080396 -0.086543 -0.410246
6.933333 -2.629124 -3.100484 -0.494817 -0.067368 -0.047295 -0.546480
6.966667 -2.630303 -3.101741 -0.511540 -0.057352 -0.006080 -0.665977
7.000000 -2.631338 -3.101107 -0.539458 -0.050152 0.036527 -0.760342
7.033333 -2.632264 -3.099731 -0.567252 -0.045532 0.080197 -0.827449
7.066667 -2.633280 -3.096508 -0.595916 -0.043220 0.124602 -0.867261
7.100000 -2.634488 -3.091428 -0.632239 -0.042761 0.169296 -0.878598
7.133333 -2.635917 -3.084526 -0.695060 -0.043649 0.213685 -0.861529
7.166667 -2.637253 -3.076886 -0.735547 -0.045532 0.257454 -0.815127
7.200000 -2.638783 -3.067437 -0.759039 -0.048010 0.300338 -0.745260
7.233333 -2.640467 -3.056274 -0.791482 -0.050750 0.341793 -0.652552
7.266667 -2.642280 -3.043464 -0.800983 -0.053488 0.381322 -0.543554
7.300000 -2.644010 -3.029937 -0.823201 -0.056088 0.418624 -0.429489
7.333333 -2.645913 -3.014818 -0.828262 -0.058507 0.453529 -0.324902
7.366667 -2.648053 -2.998278 -0.851580 -0.060692 0.485712 -0.238965
7.400000 -2.650425 -2.980421 -0.850261 -0.062634 0.514956 -0.175858
7.433333 -2.652722 -2.961886 -0.839107 -0.064335 0.541359 -0.142283
7.466667 -2.654944 -2.942684 -0.824797 -0.065859 0.565070 -0.136559
7.500000 -2.657093 -2.922827 -0.812940 -0.067244 0.586150 -0.152791
7.533333 -2.659171 -2.902328 -0.793914 -0.068461 0.604834 -0.185607
7.566667 -2.661517 -2.881717 -0.795063 -0.069506 0.621527 -0.238165
7.600000 -2.663794 -2.860488 -0.807445 -0.070400 0.636649 -0.320456
7.633333 -2.666000 -2.838653 -0.854540 -0.071174 0.650449 -0.438855
7.666667 -2.668641 -2.816930 -0.895312 -0.071765 0.663289 -0.605379
7.700000 -2.671212 -2.794626 -0.918504 -0.072102 0.675501 -0.834071
7.733333 -2.673713 -2.771752 -0.905166 -0.072131 0.687286 -1.132752
7.766667 -2.676143 -2.748321 -0.916327 -0.071840 0.698694 -1.495334
7.800000 -2.678696 -2.725120 -0.917584 -0.071175 0.709790 -1.898360
7.833333 -2.681176 -2.701386 -0.932222 -0.070121 0.720778 -2.308724
7.866667 -2.683585 -2.677133 -0.997293 -0.068761 0.731684 -2.680953
7.900000 -2.685920 -2.652371 -1.088416 -0.067203 0.742590 -2.959704
7.933333 -2.688181 -2.627113 -1.239182 -0.065554 0.753580 -3.085687
7.966667 -2.690348 -2.601942 -1.438692 -0.063999 0.764935 -3.016274
8.000000 -2.692439 -2.576300 -1.651926 -0.062899 0.776914 -2.727787
8.033333 -2.694324 -2.550562 -1.871734 -0.062550 0.789663 -2.221134
8.066667 -2.696131 -2.524377 -2.084746 -0.063361 0.803497 -1.516253
8.100000 -2.697953 -2.497795 -2.202930 -0.065884 0.818810 -0.661050
8.133333 -2.699694 -2.470791 -2.211472 -0.070666 0.835992 0.278524
8.166667 -2.701773 -2.442812 -2.111357 -0.077977 0.855087 1.228282
8.200000 -2.703769 -2.414436 -1.960123 -0.087792 0.875983 2.115406
8.233333 -2.705679 -2.385677 -1.753859 -0.100091 0.898555 2.879883
8.266667 -2.707502 -2.356548 -1.561749 -0.114693 0.922523 3.470648
8.300000 -2.710710 -2.325857 -1.373781 -0.130978 0.947287 3.869284
8.333333 -2.715496 -2.293533 -1.179090 -0.148296 0.972172 4.074416
8.366667 -2.720183 -2.260885 -1.027854 -0.166185 0.996744 4.114454
8.400000 -2.726625 -2.226588 -0.875063 -0.184220 1.020552 4.023408
8.433333 -2.734892 -2.190729 -0.776708 -0.201825 1.043071 3.843849
8.466667 -2.743035 -2.154600 -0.664591 -0.218289 1.063743 3.616180
8.500000 -2.751046 -2.118221 -0.572714 -0.233299 1.082322 3.367983
8.533333 -2.758914 -2.081612 -0.472170 -0.246532 1.098633 3.119646
8.566667 -2.766628 -2.044793 -0.358726 -0.257631 1.112457 2.870954
8.600000 -2.775923 -2.006912 -0.264109 -0.266305 1.123753 2.624376
8.633333 -2.785042 -1.968862 -0.161433 -0.272429 1.132576 2.366441
8.666667 -2.795236 -1.930268 -0.084805 -0.275749 1.138897 2.091277
8.700000 -2.805227 -1.891547 0.003383 -0.275719 1.142463 1.788383
8.733333 -2.815614 -1.852870 0.054999 -0.271873 1.143122 1.457682
8.766667 -2.825770 -1.814108 0.107528 -0.263751 1.140725 1.105128
8.800000 -2.835680 -1.775282 0.143687 -0.250944 1.135063 0.735766
8.833333 -2.845331 -1.736413 0.179418 -0.233206 1.126063 0.365204
8.866667 -2.853730 -1.698484 0.167848 -0.210928 1.114054 0.004514
8.900000 -2.861841 -1.660552 0.160843 -0.184805 1.099573 -0.327161
8.933333 -2.869653 -1.622637 0.133429 -0.155560 1.083026 -0.621709
8.966667 -2.875241 -1.586186 0.075622 -0.124079 1.064937 -0.868567
9.000000 -2.878465 -1.551291 0.027364 -0.091627 1.046033 -1.061962
9.033333 -2.879261 -1.517986 -0.037469 -0.059487 1.027044 -1.200035
9.066667 -2.879720 -1.484766 -0.092933 -0.028583 1.008380 -1.286694
9.100000 -2.879834 -1.451643 -0.146795 0.000171 0.990407 -1.335857
9.133333 -2.877931 -1.419623 -0.193003 0.025785 0.973648 -1.358373
9.166667 -2.875675 -1.387727 -0.245109 0.047590 0.958369 -1.370967
9.200000 -2.873061 -1.355968 -0.297628 0.065599 0.944514 -1.385834
9.233333 -2.869492 -1.324894 -0.324818 0.080221 0.931761 -1.411741
9.266667 -2.865586 -1.294356 -0.356929 0.092087 0.919839 -1.449814
9.300000 -2.861315 -1.263988 -0.380305 0.102007 0.908446 -1.487955
9.333333 -2.857590 -1.234046 -0.401992 0.111361 0.896944 -1.514654
9.366667 -2.853493 -1.204294 -0.459726 0.121366 0.884842 -1.513778
9.400000 -2.849997 -1.174809 -0.519082 0.132981 0.871824 -1.469923
9.433333 -2.846883 -1.145600 -0.627309 0.147190 0.857467 -1.368450
9.466667 -2.843383 -1.116611 -0.706025 0.164618 0.841412 -1.204491
9.500000 -2.839467 -1.088019 -0.783582 0.185817 0.823313 -0.984161
9.533333 -2.834603 -1.060052 -0.846914 0.210570 0.803213 -0.720405
9.566667 -2.828258 -1.032984 -0.877298 0.238566 0.781197 -0.431855
9.600000 -2.819887 -1.006972 -0.889739 0.269447 0.757200 -0.140287
9.633333 -2.811115 -0.981219 -0.856483 0.302328 0.731662 0.126977
9.666667 -2.799352 -0.957613 -0.800373 0.336245 0.705144 0.355850
9.700000 -2.787190 -0.934274 -0.749855 0.370235 0.678182 0.539377
9.733333 -2.774632 -0.911205 -0.672546 0.403829 0.651076 0.682821
9.766667 -2.759056 -0.891551 -0.618596 0.436580 0.624277 0.803009
9.800000 -2.743093 -0.872169 -0.595663 0.467987 0.598477 0.921302
9.833333 -2.726750 -0.853056 -0.578978 0.497838 0.574110 1.065814
9.866667 -2.710032 -0.834213 -0.609532 0.526349 0.551296 1.268806
9.900000 -2.692947 -0.815636 -0.621561 0.553604 0.530185 1.556651
9.933333 -2.672995 -0.799454 -0.611160 0.579220 0.511201 1.948455
9.966667 -2.652691 -0.783532 -0.578224 0.602803 0.494269 2.445478
10.000000 -2.632044 -0.767866 -0.507536 0.624012 0.479171 3.033223
10.033333 -2.611066 -0.752452 -0.408625 0.642219 0.465627 3.683724
10.066667 -2.588491 -0.737683 -0.280385 0.656186 0.453495 4.337959
10.100000 -2.564860 -0.723192 -0.096077 0.664594 0.442568 4.930245
10.133333 -2.540782 -0.708746 0.092226 0.666642 0.432230 5.395667
10.166667 -2.516418 -0.694528 0.283453 0.661613 0.422208 5.679889
10.200000 -2.491779 -0.680534 0.567543 0.648612 0.412271 5.743748
10.233333 -2.468492 -0.666522 0.874521 0.627459 0.402288 5.566378
10.266667 -2.444954 -0.652721 1.183295 0.598671 0.392208 5.152339
10.300000 -2.423998 -0.639531 1.473708 0.563504 0.382158 4.522150
10.333333 -2.402811 -0.626540 1.678313 0.523040 0.372469 3.706130
10.366667 -2.384842 -0.614438 1.791071 0.478896 0.363543 2.743029
10.400000 -2.370178 -0.603115 1.825720 0.433421 0.355846 1.685888
10.433333 -2.358781 -0.592338 1.811476 0.388700 0.349856 0.588203
10.466667 -2.347160 -0.581727 1.766613 0.346648 0.345929 -0.494234
10.500000 -2.338147 -0.571102 1.690388 0.308840 0.344252 -1.509656
10.533333 -2.331294 -0.560273 1.607009 0.277149 0.345030 -2.418377
10.566667 -2.324194 -0.549584 1.516716 0.252620 0.348217 -3.193233
10.600000 -2.318211 -0.538413 1.378410 0.235545 0.353493 -3.827737
10.633333 -2.312833 -0.526593 1.198937 0.225964 0.360422 -4.323972
10.666667 -2.307176 -0.514889 1.002656 0.223923 0.368622 -4.688096
10.700000 -2.301159 -0.502437 0.788030 0.229056 0.377610 -4.928151
10.733333 -2.294412 -0.489170 0.590330 0.240446 0.386706 -5.049835
10.766667 -2.287351 -0.475999 0.409636 0.257465 0.395359 -5.061944
10.800000 -2.279963 -0.462920 0.233716 0.279574 0.403246 -4.969897
10.833333 -2.270972 -0.449072 0.037477 0.306123 0.409980 -4.780821
10.866667 -2.260242 -0.434543 -0.138281 0.336167 0.414993 -4.513401
10.900000 -2.249156 -0.420092 -0.289928 0.368958 0.417849 -4.194655
10.933333 -2.237708 -0.405715 -0.447607 0.403878 0.418400 -3.852383
10.966667 -2.224345 -0.391032 -0.587708 0.440179 0.416471 -3.501719
11.000000 -2.209048 -0.376314 -0.672910 0.477098 0.411828 -3.160185
11.033333 -2.191888 -0.361864 -0.754209 0.513945 0.404553 -2.844503
11.066667 -2.172848 -0.348070 -0.804131 0.550084 0.395116 -2.561052
11.100000 -2.153427 -0.334334 -0.885714 0.584819 0.384110 -2.300014
11.133333 -2.133624 -0.320650 -0.933059 0.617685 0.372129 -2.045816
11.166667 -2.112167 -0.308130 -0.969616 0.648367 0.359925 -1.787584
11.200000 -2.089227 -0.296852 -1.016396 0.676724 0.348367 -1.507996
11.233333 -2.064838 -0.286861 -1.105590 0.702904 0.338376 -1.183700
11.266667 -2.040079 -0.276900 -1.208920 0.727406 0.330760 -0.789810
11.300000 -2.014953 -0.266962 -1.271053 0.750937 0.326374 -0.318249
11.333333 -1.989468 -0.257037 -1.290017 0.773926 0.325814 0.224640
11.366667 -1.963628 -0.247121 -1.291965 0.796887 0.329455 0.829697
11.400000 -1.937440 -0.237203 -1.271567 0.820508 0.337622 1.478957
11.433333 -1.910909 -0.227278 -1.243758 0.845271 0.350146 2.147292
11.466667 -1.882368 -0.215815 -1.143302 0.871260 0.366613 2.793736
11.500000 -1.853499 -0.204332 -0.992563 0.898324 0.386298 3.385933
11.533333 -1.824311 -0.192822 -0.827545 0.926448 0.408601 3.909269
11.566667 -1.793251 -0.179515 -0.637514 0.955464 0.432975 4.342209
11.600000 -1.760417 -0.164351 -0.430555 0.984816 0.458596 4.673991
11.633333 -1.725887 -0.147327 -0.239428 1.013933 0.484832 4.891689
11.666667 -1.691084 -0.130269 -0.093250 1.042490 0.511265 5.008310
11.700000 -1.656025 -0.113176 0.091504 1.070283 0.537627 5.035774
11.733333 -1.619268 -0.094120 0.253676 1.096987 0.563491 4.981510
11.766667 -1.582286 -0.075036 0.459051 1.122369 0.588506 4.856012
11.800000 -1.543734 -0.054276 0.618175 1.146309 0.612441 4.679090
11.833333 -1.504992 -0.033496 0.777765 1.168826 0.635157 4.470383
11.866667 -1.466080 -0.012703 0.949896 1.189764 0.656354 4.229809
11.900000 -1.426012 0.009415 1.067630 1.208931 0.675550 3.965286
11.933333 -1.384949 0.032768 1.217170 1.226307 0.692480 3.675733
11.966667 -1.343060 0.057187 1.329111 1.241767 0.706759 3.380245
12.000000 -1.300186 0.082617 1.438423 1.255291 0.718140 3.067692
12.033333 -1.257247 0.108017 1.530634 1.266756 0.726394 2.740631
12.066667 -1.214266 0.133376 1.631063 1.276118 0.731377 2.407154
12.100000 -1.171267 0.158682 1.631063 1.283409 0.733324 2.073026
12.133333 -1.128273 0.183924 1.771299 1.288734 0.732352 1.740018
12.166667 -1.085042 0.208660 1.830612 1.292295 0.728798 1.400078
12.200000 -1.041865 0.233309 1.869346 1.294359 0.722883 1.063391
12.233333 -0.998216 0.256939 1.888188 1.295170 0.714872 0.732796
12.266667 -0.954668 0.280461 1.894147 1.295003 0.704902 0.414979
12.300000 -0.911246 0.303865 1.896760 1.294112 0.692808 0.105670
12.333333 -0.867973 0.327141 1.892164 1.292595 0.678553 -0.175904
12.366667 -0.824875 0.350278 1.893704 1.290519 0.661852 -0.422716
12.400000 -0.781974 0.373267 1.861302 1.287826 0.642637 -0.629091
12.433333 -0.739296 0.396098 1.825222 1.284547 0.620692 -0.793277
12.466667 -0.696313 0.416795 1.761321 1.280616 0.596229 -0.912347
12.500000 -0.653600 0.437316 1.710701 1.275854 0.569648 -0.981556
12.533333 -0.610865 0.455828 1.662750 1.270099 0.541543 -1.007444
12.566667 -0.568451 0.474151 1.634571 1.263192 0.512725 -0.991053
12.600000 -0.526048 0.490712 1.588526 1.254973 0.483986 -0.934193
12.633333 -0.483775 0.505694 1.566601 1.245218 0.456310 -0.838262
12.666667 -0.441858 0.519263 1.528064 1.233820 0.430321 -0.710143
12.700000 -0.400507 0.531542 1.503371 1.220583 0.406692 -0.551573
12.733333 -0.359599 0.543622 1.479608 1.205051 0.385665 -0.368440
12.766667 -0.319157 0.555503 1.461205 1.186396 0.367372 -0.165002
12.800000 -0.279205 0.567186 1.461219 1.163848 0.351680 0.047219
12.833333 -0.240589 0.578144 1.454560 1.136343 0.338248 0.259835
12.866667 -0.202509 0.588907 1.464375 1.102784 0.326693 0.458732
12.900000 -0.164986 0.599476 1.481168 1.062098 0.316423 0.627444
12.933333 -0.128041 0.609854 1.517355 1.013825 0.307037 0.749702
12.966667 -0.091697 0.620042 1.561047 0.957883 0.298184 0.809293
13.000000 -0.055973 0.630043 1.619730 0.894171 0.289642 0.798650
13.033333 -0.024036 0.639681 1.686664 0.823515 0.281270 0.707725
13.066667 0.003469 0.648890 1.741709 0.747058 0.273046 0.538357
13.100000 0.025931 0.657696 1.788394 0.666889 0.265069 0.292068
13.133333 0.047717 0.666324 1.805968 0.584783 0.257416 -0.021179
13.166667 0.063948 0.674551 1.812208 0.503152 0.250213 -0.391039
13.200000 0.079496 0.682607 1.783177 0.424406 0.243583 -0.802460
13.233333 0.089430 0.690345 1.741684 0.350443 0.237739 -1.234033
13.266667 0.098688 0.697917 1.682472 0.282501 0.232936 -1.668205
13.300000 0.102986 0.705496 1.616833 0.221025 0.229458 -2.082757
13.333333 0.106628 0.712915 1.537591 0.166454 0.227588 -2.461753
13.366667 0.109625 0.720180 1.444125 0.118338 0.227535 -2.782826
13.400000 0.111990 0.727292 1.346333 0.076224 0.229506 -3.034633
13.433333 0.113735 0.734255 1.203087 0.039202 0.233538 -3.211213
13.466667 0.114875 0.741073 1.070593 0.006729 0.239512 -3.310703
13.500000 0.113922 0.748656 0.917247 -0.021966 0.247094 -3.333095
13.533333 0.112392 0.756099 0.775409 -0.047537 0.256037 -3.281256
13.566667 0.109622 0.764362 0.657138 -0.070388 0.265899 -3.173978
13.600000 0.105972 0.773517 0.541729 -0.090896 0.276154 -3.023778
13.633333 0.101772 0.783649 0.421133 -0.109086 0.286271 -2.845501
13.666667 0.097064 0.793644 0.328415 -0.125012 0.295809 -2.651520
13.700000 0.092365 0.804740 0.293485 -0.138545 0.304479 -2.463903
13.733333 0.087193 0.815697 0.244126 -0.149682 0.311832 -2.299845
13.766667 0.081568 0.826511 0.179263 -0.158390 0.317682 -2.163196
13.800000 0.075507 0.837180 0.109558 -0.164603 0.321993 -2.057987
13.833333 0.069028 0.847703 0.036341 -0.168263 0.324915 -1.984340
13.866667 0.063592 0.859135 -0.016807 -0.169365 0.326460 -1.941892
13.900000 0.057775 0.870414 -0.083909 -0.167883 0.326659 -1.911849
13.933333 0.051593 0.881537 -0.139842 -0.163849 0.325530 -1.882571
13.966667 0.045065 0.892500 -0.205066 -0.157455 0.323021 -1.844773
14.000000 0.038207 0.903299 -0.264453 -0.149043 0.319036 -1.793898
14.033333 0.032507 0.914266 -0.348998 -0.139032 0.313291 -1.724168
14.066667 0.027909 0.925246 -0.413843 -0.127854 0.305769 -1.628651
14.100000 0.024288 0.936013 -0.481086 -0.116048 0.296436 -1.513183
14.133333 0.021483 0.946340 -0.528673 -0.104194 0.285386 -1.377459
14.166667 0.018423 0.956486 -0.570974 -0.092730 0.272659 -1.227635
14.200000 0.015931 0.965819 -0.615898 -0.082036 0.258289 -1.065744
14.233333 0.013969 0.974262 -0.636818 -0.072406 0.242573 -0.899300
14.266667 0.012436 0.981666 -0.672753 -0.064009 0.225769 -0.737046
14.300000 0.010690 0.988879 -0.682474 -0.056800 0.208179 -0.585800
14.333333 0.008741 0.995901 -0.702420 -0.050580 0.190100 -0.452251
14.366667 0.007188 1.001862 -0.711162 -0.045255 0.172001 -0.336933
14.400000 0.005451 1.007632 -0.709709 -0.040640 0.154314 -0.243364
14.433333 0.004077 1.012458 -0.705026 -0.036521 0.137318 -0.169771
14.466667 0.003027 1.016435 -0.693441 -0.032731 0.121188 -0.115685
14.500000 0.002272 1.019618 -0.696237 -0.029238 0.106135 -0.077422
14.533333 0.001789 1.022158 -0.708809 -0.026079 0.092374 -0.051611
14.566667 0.001160 1.024516 -0.699191 -0.023196 0.079936 -0.038464
14.600000 0.000393 1.026697 -0.715673 -0.020594 0.068881 -0.031759
14.633333 -0.000186 1.028483 -0.709542 -0.018319 0.059219 -0.030206
14.666667 -0.000890 1.030099 -0.711409 -0.016372 0.050934 -0.028574
14.700000 -0.001467 1.031499 -0.703059 -0.014689 0.043890 -0.026291
14.733333 -0.001894 1.032657 -0.718548 -0.013190 0.037870 -0.023634
14.766667 -0.002169 1.033661 -0.707322 -0.011843 0.032726 -0.017853
14.800000 -0.002548 1.034512 -0.717500 -0.010623 0.028289 -0.011988
14.833333 -0.002832 1.035287 -0.716302 -0.009490 0.024408 -0.006100
