t x y theta dxdt dydt dthetadt
0.000000 0.000000 0.000000 -1.004882 -0.004591 0.012215 0.419070
0.033333 0.000106 0.000409 -1.006663 -0.008004 0.011922 0.603945
0.066667 -0.000068 0.001122 -0.995285 -0.012112 0.008682 0.813565
0.100000 -0.000404 0.001436 -0.990647 -0.016977 0.001562 1.034223
0.133333 -0.000925 0.002450 -0.981636 -0.022876 -0.010126 1.249463
0.166667 -0.001602 0.003059 -0.953236 -0.030411 -0.027152 1.438822
0.200000 -0.002674 0.004809 -0.854776 -0.040149 -0.049701 1.576842
0.233333 -0.004138 0.005603 -0.748180 -0.052898 -0.077402 1.642991
0.266667 -0.005537 0.004422 -0.651045 -0.069600 -0.109093 1.633044
0.300000 -0.007072 0.002823 -0.556393 -0.091228 -0.143709 1.542333
0.333333 -0.008472 -0.002213 -0.467866 -0.118551 -0.179695 1.375743
0.366667 -0.010506 -0.010308 -0.409479 -0.151759 -0.215326 1.145319
0.400000 -0.014278 -0.020600 -0.380076 -0.190956 -0.248814 0.881728
0.433333 -0.018146 -0.031301 -0.347812 -0.235651 -0.278891 0.617014
0.466667 -0.024621 -0.043797 -0.361636 -0.284529 -0.305129 0.378430
0.500000 -0.035315 -0.056615 -0.376560 -0.335680 -0.327374 0.191252
0.533333 -0.046069 -0.069832 -0.421343 -0.386969 -0.346227 0.075797
0.566667 -0.060915 -0.082193 -0.477671 -0.436036 -0.362742 0.045283
0.600000 -0.079501 -0.093330 -0.496805 -0.480254 -0.378904 0.096064
0.633333 -0.098098 -0.104858 -0.498873 -0.517312 -0.396546 0.220052
0.666667 -0.118997 -0.116502 -0.494314 -0.545443 -0.417326 0.399115
0.700000 -0.141762 -0.129036 -0.474906 -0.563805 -0.442557 0.611509
0.733333 -0.164461 -0.141950 -0.448222 -0.571658 -0.473343 0.831630
0.766667 -0.187068 -0.155237 -0.417454 -0.568945 -0.510393 1.030862
0.800000 -0.208536 -0.171516 -0.354809 -0.556606 -0.553021 1.185560
0.833333 -0.226898 -0.191322 -0.287483 -0.535620 -0.600014 1.275738
0.866667 -0.245078 -0.211460 -0.233560 -0.507243 -0.649415 1.290539
0.900000 -0.263054 -0.231915 -0.165912 -0.472436 -0.698862 1.227517
0.933333 -0.278280 -0.257163 -0.090996 -0.432617 -0.745472 1.091364
0.966667 -0.293250 -0.282688 -0.030175 -0.389114 -0.786483 0.895270
1.000000 -0.305734 -0.311848 0.026004 -0.342427 -0.819573 0.657106
1.033333 -0.316665 -0.344172 0.045699 -0.293114 -0.843235 0.398885
1.066667 -0.325855 -0.377590 0.046511 -0.241866 -0.856673 0.143289
1.100000 -0.333300 -0.411112 0.020820 -0.189370 -0.859943 -0.086707
1.133333 -0.340396 -0.444772 -0.009444 -0.135442 -0.854152 -0.272943
1.166667 -0.344509 -0.475428 -0.054685 -0.079998 -0.840671 -0.400784
1.200000 -0.345953 -0.503324 -0.104286 -0.023525 -0.821922 -0.460803
1.233333 -0.344114 -0.528035 -0.147641 0.033432 -0.800569 -0.452645
1.266667 -0.341918 -0.552774 -0.166897 0.091057 -0.779490 -0.383920
1.300000 -0.339364 -0.577524 -0.184675 0.149323 -0.761096 -0.269901
1.333333 -0.332473 -0.599481 -0.193914 0.207097 -0.747437 -0.126161
1.366667 -0.325230 -0.621408 -0.198078 0.263650 -0.740128 0.029366
1.400000 -0.317641 -0.643290 -0.183770 0.318830 -0.740090 0.176647
1.433333 -0.305538 -0.666197 -0.156041 0.372488 -0.747571 0.298382
1.466667 -0.289094 -0.691623 -0.130865 0.423201 -0.762066 0.384882
1.500000 -0.272317 -0.716937 -0.101207 0.469521 -0.783216 0.428541
1.533333 -0.255222 -0.742122 -0.075637 0.510517 -0.809984 0.426067
1.566667 -0.237820 -0.767159 -0.049854 0.544765 -0.841382 0.375786
1.600000 -0.216597 -0.795581 -0.029935 0.569847 -0.875581 0.282518
1.633333 -0.195090 -0.823807 -0.013135 0.583443 -0.910523 0.155131
1.666667 -0.172145 -0.854399 -0.004206 0.584139 -0.943967 0.001282
1.700000 -0.149368 -0.885777 0.004817 0.571077 -0.973480 -0.168594
1.733333 -0.125923 -0.920515 -0.005498 0.543448 -0.996069 -0.346681
1.766667 -0.102648 -0.957437 -0.023248 0.501104 -1.007646 -0.522969
1.800000 -0.082012 -0.995701 -0.049476 0.445651 -1.005237 -0.682878
1.833333 -0.064241 -1.034276 -0.095367 0.379425 -0.986474 -0.813303
1.866667 -0.049756 -1.072527 -0.128382 0.305771 -0.949666 -0.903128
1.900000 -0.039266 -1.109949 -0.171232 0.228059 -0.893401 -0.940760
1.933333 -0.033886 -1.144840 -0.217887 0.150428 -0.818459 -0.917327
1.966667 -0.033437 -1.176083 -0.254761 0.077448 -0.728564 -0.830812
2.000000 -0.038095 -1.201779 -0.295941 0.013328 -0.627861 -0.697543
2.033333 -0.042581 -1.226988 -0.347363 -0.038172 -0.520482 -0.537679
2.066667 -0.050139 -1.243327 -0.399234 -0.073998 -0.411805 -0.367971
2.100000 -0.057966 -1.246501 -0.447309 -0.091724 -0.308100 -0.208004
2.133333 -0.065625 -1.249167 -0.407090 -0.090117 -0.214279 -0.080160
2.166667 -0.073102 -1.251328 -0.357624 -0.069504 -0.133085 0.004246
2.200000 -0.077876 -1.246683 -0.306028 -0.031887 -0.066435 0.045970
2.233333 -0.082455 -1.241543 -0.255115 0.020454 -0.015827 0.048928
2.266667 -0.086826 -1.235920 -0.219843 0.084054 0.019420 0.015059
2.300000 -0.086809 -1.232005 -0.224514 0.155778 0.042282 -0.049773
2.333333 -0.081705 -1.229738 -0.262166 0.232716 0.055768 -0.124692
2.366667 -0.070526 -1.228718 -0.311116 0.312228 0.062587 -0.195911
2.400000 -0.052340 -1.228675 -0.344659 0.392302 0.065882 -0.252678
2.433333 -0.033925 -1.228143 -0.379795 0.470366 0.068418 -0.282813
2.466667 -0.015294 -1.227126 -0.402732 0.544527 0.071951 -0.278675
2.500000 0.003542 -1.225630 -0.394327 0.612643 0.076536 -0.239147
2.533333 0.022570 -1.223660 -0.393056 0.672987 0.081821 -0.177277
2.566667 0.047201 -1.220461 -0.385550 0.724194 0.086991 -0.105260
2.600000 0.071991 -1.216789 -0.374973 0.765956 0.090740 -0.032577
2.633333 0.101965 -1.212317 -0.377149 0.798264 0.092106 0.029051
2.666667 0.134452 -1.207092 -0.372549 0.821201 0.090612 0.073381
2.700000 0.167026 -1.201404 -0.370359 0.835224 0.086438 0.099957
2.733333 0.198910 -1.196957 -0.379071 0.840589 0.080369 0.115624
2.766667 0.229202 -1.193347 -0.357334 0.838448 0.073797 0.125528
2.800000 0.257716 -1.191561 -0.356286 0.829384 0.068474 0.134235
2.833333 0.284508 -1.191992 -0.342440 0.814724 0.066289 0.145266
2.866667 0.311282 -1.191997 -0.350069 0.795851 0.068807 0.162719
2.900000 0.336022 -1.192921 -0.345573 0.774054 0.077626 0.186860
2.933333 0.360707 -1.193424 -0.348774 0.750405 0.093584 0.213955
2.966667 0.385110 -1.192403 -0.334460 0.724874 0.117042 0.242541
3.000000 0.409214 -1.189404 -0.332096 0.697046 0.147470 0.271468
3.033333 0.433201 -1.185990 -0.327001 0.665756 0.183576 0.297155
3.066667 0.456291 -1.179007 -0.313616 0.630143 0.223749 0.313981
3.100000 0.479219 -1.171621 -0.287293 0.589053 0.265841 0.318427
3.133333 0.500831 -1.161563 -0.283835 0.541867 0.307803 0.309631
3.166667 0.520501 -1.149304 -0.251642 0.488732 0.347604 0.284339
3.200000 0.537251 -1.135756 -0.238535 0.430638 0.383765 0.238869
3.233333 0.552315 -1.120117 -0.230500 0.369571 0.415186 0.175912
3.266667 0.564533 -1.103514 -0.225396 0.307639 0.441244 0.097780
3.300000 0.573738 -1.086487 -0.216468 0.247656 0.461616 0.008597
3.333333 0.579157 -1.069142 -0.209296 0.192684 0.476294 -0.091000
3.366667 0.580503 -1.052387 -0.226983 0.145503 0.485787 -0.191206
3.400000 0.581596 -1.035400 -0.237328 0.108477 0.490417 -0.288015
3.433333 0.579897 -1.018416 -0.249067 0.083407 0.490593 -0.380932
3.466667 0.577958 -1.001236 -0.261438 0.071366 0.486602 -0.466692
3.500000 0.576350 -0.985147 -0.283641 0.072696 0.478844 -0.543759
3.533333 0.574518 -0.968892 -0.307536 0.086598 0.467781 -0.607542
3.566667 0.575241 -0.952500 -0.331103 0.111579 0.453480 -0.661027
3.600000 0.578811 -0.936880 -0.366447 0.145322 0.436451 -0.696204
3.633333 0.582172 -0.921127 -0.387709 0.184697 0.417285 -0.704318
3.666667 0.589722 -0.906721 -0.412845 0.226104 0.396787 -0.680156
3.700000 0.597063 -0.892201 -0.416281 0.265924 0.375429 -0.623103
3.733333 0.608060 -0.880298 -0.457353 0.300682 0.353781 -0.532433
3.766667 0.621900 -0.870226 -0.503607 0.327429 0.332638 -0.410835
3.800000 0.637565 -0.861580 -0.533931 0.344173 0.312553 -0.273295
3.833333 0.652999 -0.852838 -0.560039 0.349828 0.294041 -0.136472
3.866667 0.669368 -0.844034 -0.577624 0.344050 0.277777 -0.012328
3.900000 0.685477 -0.835144 -0.554119 0.327131 0.264750 0.091991
3.933333 0.699596 -0.826278 -0.517809 0.300261 0.255498 0.164320
3.966667 0.710854 -0.818006 -0.471415 0.265130 0.250293 0.198283
4.000000 0.719037 -0.810030 -0.429478 0.223346 0.249551 0.197083
4.033333 0.722888 -0.803267 -0.403146 0.176477 0.253927 0.169660
4.066667 0.726439 -0.796470 -0.390568 0.126666 0.263301 0.120803
4.100000 0.729690 -0.789643 -0.389213 0.075649 0.277643 0.056659
4.133333 0.732638 -0.782789 -0.425331 0.024553 0.297131 -0.007958
4.166667 0.735281 -0.775912 -0.481501 -0.025982 0.322100 -0.060869
4.200000 0.731195 -0.763325 -0.490550 -0.074652 0.351955 -0.096644
4.233333 0.726794 -0.750742 -0.489358 -0.120490 0.385510 -0.116057
4.266667 0.722085 -0.738176 -0.498030 -0.162569 0.421876 -0.122411
4.300000 0.717072 -0.725637 -0.479996 -0.199390 0.459728 -0.120546
4.333333 0.708557 -0.709497 -0.482869 -0.229050 0.497448 -0.121838
4.366667 0.697751 -0.691123 -0.477051 -0.249660 0.533062 -0.136918
4.400000 0.685481 -0.671760 -0.456988 -0.260263 0.565489 -0.170528
4.433333 0.672022 -0.650152 -0.456266 -0.259667 0.593751 -0.223737
4.466667 0.658290 -0.628667 -0.458237 -0.247214 0.616778 -0.293049
4.500000 0.646654 -0.605995 -0.472588 -0.223075 0.633501 -0.374412
4.533333 0.637557 -0.582403 -0.500291 -0.187910 0.643146 -0.462155
4.566667 0.628213 -0.558991 -0.519373 -0.142521 0.645440 -0.548753
4.600000 0.623453 -0.535726 -0.561233 -0.088558 0.639984 -0.624693
4.633333 0.623502 -0.513221 -0.580232 -0.028232 0.626796 -0.685914
4.666667 0.623314 -0.490945 -0.606352 0.035725 0.606312 -0.726850
4.700000 0.622885 -0.468922 -0.616099 0.100807 0.579506 -0.739600
4.733333 0.628757 -0.448704 -0.645432 0.164109 0.547813 -0.713845
4.766667 0.634380 -0.428770 -0.677588 0.222247 0.512421 -0.644363
4.800000 0.644284 -0.411295 -0.711449 0.272737 0.474845 -0.531973
4.833333 0.657395 -0.396313 -0.750627 0.313345 0.436311 -0.377449
4.866667 0.673743 -0.384349 -0.790907 0.342213 0.397741 -0.194676
4.900000 0.689793 -0.372713 -0.792647 0.357594 0.359783 -0.007427
4.933333 0.706540 -0.363544 -0.800478 0.358857 0.322871 0.158238
4.966667 0.723151 -0.354982 -0.816228 0.346650 0.287561 0.289502
5.000000 0.737495 -0.346216 -0.806160 0.322235 0.253820 0.381172
5.033333 0.751454 -0.337821 -0.733702 0.287790 0.221816 0.432903
5.066667 0.765008 -0.329808 -0.641129 0.246133 0.191713 0.461784
5.100000 0.770431 -0.322793 -0.560358 0.200717 0.163693 0.491947
5.133333 0.775417 -0.316195 -0.486604 0.154556 0.137341 0.544872
5.166667 0.775739 -0.312720 -0.495694 0.110405 0.112378 0.628067
5.200000 0.775233 -0.312686 -0.598316 0.070479 0.088791 0.743624
5.233333 0.774352 -0.312857 -0.696104 0.036289 0.066323 0.894707
5.266667 0.773431 -0.311248 -0.760262 0.008713 0.044547 1.071838
5.300000 0.772039 -0.310086 -0.721305 -0.012788 0.022957 1.258978
5.333333 0.770170 -0.309377 -0.592349 -0.028808 0.001406 1.433442
5.366667 0.768139 -0.308030 -0.467117 -0.040693 -0.020772 1.570676
5.400000 0.767260 -0.308385 -0.330333 -0.050299 -0.043969 1.640468
5.433333 0.765882 -0.309201 -0.234293 -0.059668 -0.068250 1.620208
5.466667 0.763995 -0.310480 -0.137325 -0.070659 -0.093081 1.499475
5.500000 0.761592 -0.312225 -0.059839 -0.084217 -0.117883 1.285323
5.533333 0.760157 -0.317601 -0.007196 -0.101408 -0.141814 1.007607
5.566667 0.758195 -0.323443 0.008456 -0.123027 -0.163651 0.706242
5.600000 0.755823 -0.331758 -0.018693 -0.149068 -0.182760 0.427709
5.633333 0.751287 -0.340533 -0.045617 -0.179073 -0.199034 0.202473
5.666667 0.746203 -0.349769 -0.086119 -0.212605 -0.212720 0.054833
5.700000 0.740565 -0.359462 -0.137083 -0.249357 -0.224067 -0.005686
5.733333 0.731796 -0.367277 -0.171204 -0.288829 -0.234132 0.010722
5.766667 0.719718 -0.373173 -0.172391 -0.330354 -0.244184 0.079593
5.800000 0.707065 -0.379533 -0.170667 -0.373914 -0.255047 0.174603
5.833333 0.693838 -0.386357 -0.155538 -0.419711 -0.267133 0.272406
5.866667 0.680036 -0.393646 -0.106801 -0.467946 -0.280850 0.346610
5.900000 0.664066 -0.401670 -0.051106 -0.518679 -0.296587 0.375543
5.933333 0.646910 -0.411898 -0.017575 -0.571931 -0.313764 0.346984
5.966667 0.627546 -0.423870 0.013191 -0.627972 -0.331086 0.267626
6.000000 0.607628 -0.436309 0.036781 -0.686497 -0.347386 0.143937
6.033333 0.587160 -0.449212 0.041282 -0.747203 -0.361605 -0.007091
6.066667 0.562893 -0.463580 0.046485 -0.809557 -0.372531 -0.163497
6.100000 0.534394 -0.478052 0.008000 -0.872923 -0.379038 -0.302216
6.133333 0.500283 -0.490653 -0.013883 -0.936397 -0.380765 -0.406008
6.166667 0.465669 -0.503724 -0.066310 -0.998594 -0.378322 -0.465981
6.200000 0.430573 -0.517263 -0.110846 -1.057953 -0.372744 -0.473615
6.233333 0.395016 -0.531267 -0.141937 -1.112544 -0.365177 -0.431157
6.266667 0.359017 -0.545732 -0.172488 -1.160894 -0.357075 -0.343033
6.300000 0.317551 -0.557143 -0.176054 -1.201193 -0.350323 -0.222593
6.333333 0.273162 -0.566153 -0.182746 -1.232227 -0.346504 -0.079836
6.366667 0.228396 -0.575640 -0.167141 -1.253070 -0.346795 0.071018
6.400000 0.182762 -0.584749 -0.149028 -1.263320 -0.351926 0.216335
6.433333 0.137570 -0.594463 -0.139793 -1.263064 -0.362745 0.345605
6.466667 0.092086 -0.604665 -0.122270 -1.252171 -0.379941 0.447559
6.500000 0.046342 -0.615357 -0.099374 -1.232043 -0.403170 0.519202
6.533333 0.002464 -0.628202 -0.078601 -1.204264 -0.431662 0.558982
6.566667 -0.037120 -0.642885 -0.046911 -1.170578 -0.464679 0.566850
6.600000 -0.076878 -0.658047 -0.011480 -1.132413 -0.501470 0.545942
6.633333 -0.110452 -0.676559 0.006990 -1.091892 -0.540455 0.503766
6.666667 -0.144153 -0.695534 0.023191 -1.050852 -0.579995 0.447783
6.700000 -0.177966 -0.714967 0.053132 -1.010183 -0.618990 0.383748
6.733333 -0.211875 -0.734854 0.068556 -0.970219 -0.656854 0.314799
6.766667 -0.241872 -0.759533 0.066110 -0.931287 -0.692534 0.249470
6.800000 -0.271926 -0.784643 0.067472 -0.894144 -0.725058 0.191755
6.833333 -0.302025 -0.810176 0.050772 -0.858323 -0.754172 0.139753
6.866667 -0.332156 -0.836120 0.059310 -0.823944 -0.779744 0.091297
6.900000 -0.359636 -0.864193 0.043746 -0.791546 -0.801357 0.048323
6.933333 -0.384286 -0.892613 0.046146 -0.762274 -0.818262 0.010559
6.966667 -0.408938 -0.921398 0.068539 -0.736824 -0.830562 -0.026560
7.000000 -0.430048 -0.949849 0.075991 -0.716525 -0.838406 -0.065113
7.033333 -0.451153 -0.978635 0.073761 -0.703032 -0.841941 -0.106314
7.066667 -0.472249 -1.007744 0.079458 -0.697699 -0.841263 -0.149494
7.100000 -0.492922 -1.036616 0.070609 -0.701377 -0.837060 -0.198638
7.133333 -0.513584 -1.065787 0.056496 -0.714231 -0.830370 -0.253303
7.166667 -0.535415 -1.093879 0.036523 -0.736614 -0.821937 -0.309166
7.200000 -0.557233 -1.122250 0.017730 -0.767116 -0.812422 -0.362654
7.233333 -0.581430 -1.149223 0.000629 -0.804298 -0.802445 -0.408331
7.266667 -0.607917 -1.173973 -0.007437 -0.846698 -0.792941 -0.439357
7.300000 -0.634382 -1.198989 -0.005380 -0.892730 -0.784667 -0.451353
7.333333 -0.667777 -1.224105 -0.020794 -0.940287 -0.778314 -0.441233
7.366667 -0.701127 -1.249490 -0.048058 -0.987533 -0.774541 -0.410002
7.400000 -0.734415 -1.275135 -0.080251 -1.033505 -0.774045 -0.356852
7.433333 -0.771461 -1.300708 -0.107828 -1.077158 -0.777395 -0.282887
7.466667 -0.810586 -1.325762 -0.127818 -1.117292 -0.784579 -0.196659
7.500000 -0.849595 -1.351073 -0.130193 -1.152820 -0.795418 -0.100606
7.533333 -0.888464 -1.376636 -0.136370 -1.183999 -0.809737 0.000172
7.566667 -0.928140 -1.401679 -0.135026 -1.210757 -0.827128 0.099361
7.600000 -0.969790 -1.428308 -0.109463 -1.232848 -0.847068 0.186733
7.633333 -1.013245 -1.456905 -0.090775 -1.250384 -0.868907 0.255702
7.666667 -1.056456 -1.485741 -0.070443 -1.263832 -0.892183 0.308396
7.700000 -1.100312 -1.517249 -0.054245 -1.273506 -0.916270 0.339796
7.733333 -1.143862 -1.548977 -0.028635 -1.279159 -0.940354 0.349680
7.766667 -1.187077 -1.580913 -0.007542 -1.280489 -0.963648 0.340793
7.800000 -1.229929 -1.613046 -0.024995 -1.277144 -0.985347 0.323682
7.833333 -1.273524 -1.646672 -0.004647 -1.268058 -1.004603 0.300375
7.866667 -1.316630 -1.681693 0.005342 -1.251994 -1.020528 0.271116
7.900000 -1.359282 -1.716872 0.000246 -1.228093 -1.032523 0.243164
7.933333 -1.401448 -1.752195 0.006077 -1.195498 -1.040089 0.219733
7.966667 -1.443101 -1.787646 0.024607 -1.153874 -1.042889 0.203389
8.000000 -1.484212 -1.823211 0.041928 -1.103546 -1.040964 0.188190
8.033333 -1.524030 -1.860273 0.026705 -1.045672 -1.034699 0.180955
8.066667 -1.563248 -1.897416 0.046258 -0.981028 -1.024688 0.180713
8.100000 -1.598302 -1.934070 0.043929 -0.910312 -1.011447 0.185877
8.133333 -1.627711 -1.967833 0.055787 -0.834433 -0.995765 0.192845
8.166667 -1.648717 -1.998619 0.051473 -0.754547 -0.978844 0.201356
8.200000 -1.669062 -2.029394 0.055846 -0.671243 -0.961757 0.211970
8.233333 -1.688738 -2.060151 0.052269 -0.585353 -0.945696 0.218514
8.266667 -1.707738 -2.090877 0.068413 -0.498327 -0.931885 0.222134
8.300000 -1.726053 -2.121565 0.077314 -0.411503 -0.921550 0.219435
8.333333 -1.743677 -2.152203 0.101698 -0.325797 -0.915566 0.211857
8.366667 -1.754012 -2.181335 0.119137 -0.241593 -0.914021 0.197671
8.400000 -1.759106 -2.210409 0.118813 -0.159953 -0.916770 0.178713
8.433333 -1.760646 -2.238830 0.131890 -0.081685 -0.923472 0.153301
8.466667 -1.758944 -2.267481 0.127212 -0.007714 -0.933479 0.123921
8.500000 -1.755305 -2.298424 0.123934 0.060875 -0.945936 0.093835
8.533333 -1.749207 -2.330606 0.119847 0.122625 -0.959755 0.066159
8.566667 -1.742466 -2.362633 0.132163 0.176285 -0.974411 0.040644
8.600000 -1.733391 -2.396167 0.127931 0.221378 -0.989360 0.015603
8.633333 -1.723706 -2.429515 0.125392 0.257914 -1.003966 -0.003847
8.666667 -1.713273 -2.465020 0.123660 0.286467 -1.017592 -0.021862
8.700000 -1.702262 -2.500309 0.132050 0.307512 -1.030251 -0.041253
8.733333 -1.690693 -2.535366 0.129794 0.321849 -1.042382 -0.064289
8.766667 -1.678586 -2.570173 0.121784 0.330216 -1.054020 -0.088131
8.800000 -1.665962 -2.604715 0.126081 0.333105 -1.065626 -0.110498
8.833333 -1.652840 -2.638974 0.123666 0.330623 -1.077776 -0.133690
8.866667 -1.639241 -2.672933 0.121257 0.322557 -1.091518 -0.156265
8.900000 -1.629455 -2.710823 0.111468 0.309583 -1.106843 -0.173527
8.933333 -1.619219 -2.748385 0.091572 0.292231 -1.123629 -0.182906
8.966667 -1.608549 -2.785597 0.092380 0.270984 -1.141691 -0.186592
9.000000 -1.597462 -2.822438 0.079112 0.246500 -1.160405 -0.184152
9.033333 -1.589761 -2.861857 0.066914 0.219980 -1.178857 -0.172411
9.066667 -1.581664 -2.900867 0.066908 0.192797 -1.195694 -0.150062
9.100000 -1.575958 -2.941659 0.057809 0.165522 -1.210214 -0.121921
9.133333 -1.571758 -2.983811 0.060085 0.138838 -1.221218 -0.094157
9.166667 -1.569041 -3.026333 0.057855 0.113665 -1.227701 -0.067367
9.200000 -1.567614 -3.069622 0.040680 0.090902 -1.228707 -0.044382
9.233333 -1.565817 -3.112380 0.045227 0.070896 -1.223021 -0.034964
9.266667 -1.563654 -3.154578 0.058991 0.054029 -1.209596 -0.043298
9.300000 -1.563043 -3.195710 0.053433 0.040782 -1.187059 -0.066184
9.333333 -1.562071 -3.236225 0.056999 0.031426 -1.154472 -0.100054
9.366667 -1.561754 -3.277346 0.079910 0.025843 -1.110456 -0.142864
9.400000 -1.562179 -3.317450 0.077599 0.023829 -1.053566 -0.192871
9.433333 -1.562286 -3.355425 0.059968 0.025368 -0.983317 -0.236979
9.466667 -1.562575 -3.388502 0.053288 0.030394 -0.899557 -0.267555
9.500000 -1.562517 -3.420826 0.032240 0.038666 -0.803021 -0.284243
9.533333 -1.562111 -3.452376 0.016800 0.050002 -0.695096 -0.285731
9.566667 -1.560534 -3.475687 -0.025774 0.064133 -0.578846 -0.270611
9.600000 -1.558626 -3.498186 -0.052086 0.080653 -0.457659 -0.237580
9.633333 -1.555907 -3.512335 -0.050623 0.098979 -0.335241 -0.196223
9.666667 -1.552574 -3.518825 -0.055813 0.118416 -0.215084 -0.150223
9.700000 -1.548932 -3.519062 -0.039660 0.138591 -0.100553 -0.106457
9.733333 -1.543748 -3.514692 -0.034413 0.159002 0.005158 -0.068203
9.766667 -1.537080 -3.506242 -0.024253 0.179099 0.100196 -0.041919
9.800000 -1.530153 -3.497002 -0.017156 0.198307 0.182694 -0.030941
9.833333 -1.522972 -3.486990 -0.011391 0.216239 0.252209 -0.030715
9.866667 -1.515541 -3.476226 -0.019614 0.232271 0.308437 -0.040606
9.900000 -1.507864 -3.464728 -0.040011 0.245376 0.351497 -0.050409
9.933333 -1.498603 -3.450661 -0.037289 0.254478 0.381476 -0.054539
9.966667 -1.489111 -3.435900 -0.048162 0.258994 0.398784 -0.044425
10.000000 -1.479419 -3.419351 -0.029900 0.258460 0.403904 -0.021233
10.033333 -1.468122 -3.402271 -0.049681 0.252260 0.396713 0.015686
10.066667 -1.457263 -3.385633 -0.060569 0.240430 0.377076 0.062461
10.100000 -1.448341 -3.370694 -0.076800 0.223657 0.345623 0.113970
10.133333 -1.439214 -3.355176 -0.059213 0.203199 0.303894 0.163457
10.166667 -1.429887 -3.339099 -0.051279 0.180032 0.252982 0.201971
10.200000 -1.424454 -3.328231 -0.018754 0.155475 0.194651 0.231013
10.233333 -1.420909 -3.322995 -0.015349 0.131245 0.131174 0.245230
10.266667 -1.420246 -3.325658 0.014875 0.108896 0.065949 0.244143
10.300000 -1.419335 -3.327822 0.031909 0.089437 0.001483 0.225050
10.333333 -1.418168 -3.329484 0.028127 0.073446 -0.059612 0.190790
10.366667 -1.416740 -3.330642 0.032797 0.061491 -0.114730 0.147963
10.400000 -1.415795 -3.338482 0.033526 0.053513 -0.161720 0.100271
10.433333 -1.414560 -3.345808 0.039342 0.049085 -0.199057 0.050961
10.466667 -1.413218 -3.357527 0.047003 0.047650 -0.226059 0.003810
10.500000 -1.411563 -3.368707 0.029743 0.048823 -0.241869 -0.036456
10.533333 -1.409587 -3.379334 0.025690 0.052370 -0.246323 -0.069663
10.566667 -1.407285 -3.389393 0.011604 0.058052 -0.239271 -0.097009
10.600000 -1.405837 -3.400327 0.018554 0.066204 -0.220893 -0.122998
10.633333 -1.404046 -3.410663 0.023451 0.077118 -0.191669 -0.145713
10.666667 -1.402918 -3.418748 0.006394 0.090920 -0.153312 -0.163188
10.700000 -1.401435 -3.426208 0.011981 0.107735 -0.107547 -0.179100
10.733333 -1.399587 -3.433028 0.005993 0.127831 -0.055916 -0.192111
10.766667 -1.396096 -3.434385 -0.008642 0.151569 -0.000368 -0.204452
10.800000 -1.389959 -3.430009 -0.013827 0.178469 0.056513 -0.211580
10.833333 -1.383461 -3.424962 -0.020697 0.208514 0.112555 -0.214615
10.866667 -1.376600 -3.419242 -0.039284 0.241723 0.166689 -0.218983
10.900000 -1.369370 -3.412846 -0.040728 0.278116 0.217851 -0.222695
10.933333 -1.358662 -3.402396 -0.064661 0.317277 0.264532 -0.226446
10.966667 -1.347591 -3.391265 -0.060180 0.358823 0.306059 -0.230179
11.000000 -1.336157 -3.379456 -0.056075 0.403416 0.343108 -0.238482
11.033333 -1.324361 -3.366971 -0.061677 0.451148 0.376392 -0.252814
11.066667 -1.309492 -3.353188 -0.067407 0.501969 0.406440 -0.270249
11.100000 -1.291859 -3.338731 -0.084452 0.555621 0.433786 -0.288810
11.133333 -1.273876 -3.323598 -0.090173 0.612030 0.459703 -0.309960
11.166667 -1.251284 -3.307667 -0.090848 0.670548 0.485172 -0.329724
11.200000 -1.228361 -3.291061 -0.119399 0.729713 0.510671 -0.340387
11.233333 -1.205119 -3.273785 -0.129725 0.788121 0.536573 -0.339672
11.266667 -1.178237 -3.256588 -0.146957 0.844537 0.563416 -0.324080
11.300000 -1.148415 -3.238337 -0.159255 0.897911 0.591701 -0.295188
11.333333 -1.114616 -3.218314 -0.180392 0.946665 0.621466 -0.248977
11.366667 -1.078776 -3.196960 -0.190693 0.989742 0.652381 -0.187113
11.400000 -1.042716 -3.174945 -0.202411 1.026332 0.684099 -0.115032
11.433333 -1.006459 -3.152275 -0.202287 1.055781 0.716322 -0.035556
11.466667 -0.970032 -3.128960 -0.212443 1.077774 0.748577 0.044957
11.500000 -0.931865 -3.102840 -0.196558 1.092112 0.780274 0.121582
11.533333 -0.893588 -3.074835 -0.182474 1.099700 0.810949 0.185422
11.566667 -0.855229 -3.046216 -0.181061 1.101426 0.840467 0.231530
11.600000 -0.816813 -3.016994 -0.158337 1.098319 0.868598 0.254244
11.633333 -0.778369 -2.987185 -0.146324 1.091416 0.895113 0.255286
11.666667 -0.742794 -2.957084 -0.134804 1.081718 0.919877 0.236176
11.700000 -0.707242 -2.926429 -0.115206 1.070236 0.943241 0.202834
11.733333 -0.672558 -2.894014 -0.081650 1.057503 0.965556 0.162280
11.766667 -0.637948 -2.861075 -0.087187 1.044020 0.987097 0.121041
11.800000 -0.603434 -2.827629 -0.087765 1.030222 1.008242 0.087196
11.833333 -0.569039 -2.793692 -0.099505 1.016358 1.029328 0.060453
11.866667 -0.534787 -2.759279 -0.122457 1.001999 1.050623 0.044575
11.900000 -0.501927 -2.723863 -0.137155 0.986759 1.071850 0.039815
11.933333 -0.469256 -2.688008 -0.134468 0.970116 1.092829 0.047260
11.966667 -0.436795 -2.651730 -0.124856 0.951618 1.113284 0.062236
12.000000 -0.404565 -2.615046 -0.115892 0.930708 1.132987 0.080392
12.033333 -0.373040 -2.576070 -0.104818 0.907037 1.151699 0.102693
12.066667 -0.341793 -2.536726 -0.093747 0.880903 1.169254 0.123003
12.100000 -0.311871 -2.496195 -0.083076 0.852290 1.185659 0.137627
12.133333 -0.282269 -2.455341 -0.072075 0.821253 1.200822 0.143093
12.166667 -0.255180 -2.414683 -0.086428 0.787945 1.214761 0.143855
12.200000 -0.230870 -2.374023 -0.078943 0.752943 1.227425 0.142319
12.233333 -0.206927 -2.333111 -0.080007 0.716953 1.238905 0.137362
12.266667 -0.183364 -2.291967 -0.072223 0.680364 1.249346 0.132850
12.300000 -0.160194 -2.250612 -0.070160 0.643771 1.259037 0.129372
12.333333 -0.138741 -2.208486 -0.070233 0.607811 1.268276 0.129605
12.366667 -0.120028 -2.165385 -0.050387 0.572953 1.277207 0.126228
12.400000 -0.101745 -2.122145 -0.049525 0.538988 1.286011 0.117545
12.433333 -0.085820 -2.078847 -0.047390 0.505711 1.294779 0.103673
12.466667 -0.070338 -2.035458 -0.045394 0.473149 1.303449 0.084534
12.500000 -0.055305 -1.992000 -0.037598 0.441348 1.311810 0.062870
12.533333 -0.040727 -1.948497 -0.030883 0.409931 1.319834 0.036117
12.566667 -0.026609 -1.904969 -0.025281 0.378315 1.327669 0.012517
12.600000 -0.014371 -1.860520 -0.021943 0.346562 1.335349 -0.004914
12.633333 -0.003151 -1.815658 -0.043535 0.314455 1.342861 -0.013191
12.666667 0.006835 -1.770201 -0.034573 0.281728 1.350214 -0.014071
12.700000 0.016344 -1.724820 -0.050752 0.248067 1.357453 -0.006379
12.733333 0.023436 -1.679185 -0.062735 0.214025 1.364210 0.012415
12.766667 0.030051 -1.633678 -0.054646 0.180046 1.370017 0.038373
12.800000 0.036191 -1.588324 -0.052246 0.146177 1.374589 0.067623
12.833333 0.041858 -1.543148 -0.050339 0.112535 1.377718 0.094494
12.866667 0.043102 -1.495850 -0.047324 0.079262 1.379175 0.121448
12.900000 0.043877 -1.448789 -0.036990 0.046312 1.378720 0.142989
12.933333 0.044188 -1.401991 -0.022402 0.012986 1.376371 0.155420
12.966667 0.044044 -1.355481 -0.002936 -0.020909 1.372111 0.157836
13.000000 0.043450 -1.309288 -0.009774 -0.055446 1.365850 0.152842
13.033333 0.042416 -1.263436 -0.000006 -0.090574 1.357294 0.141872
13.066667 0.040947 -1.217951 0.001956 -0.126481 1.346369 0.123005
13.100000 0.035406 -1.173289 0.008269 -0.162521 1.332797 0.098377
13.133333 0.029453 -1.129052 -0.000454 -0.197765 1.316206 0.071348
13.166667 0.023099 -1.085266 0.009561 -0.231384 1.296400 0.043935
13.200000 0.014232 -1.041235 0.010132 -0.262373 1.273129 0.015654
13.233333 0.002730 -0.997804 0.012280 -0.289477 1.246276 -0.014241
13.266667 -0.009129 -0.954906 0.014101 -0.311087 1.215468 -0.044483
13.300000 -0.022552 -0.913810 0.014424 -0.326349 1.180674 -0.072697
13.333333 -0.036291 -0.873297 0.005351 -0.334486 1.141792 -0.099630
13.366667 -0.049391 -0.835375 0.007483 -0.334759 1.098501 -0.124695
13.400000 -0.062765 -0.798075 -0.002697 -0.326698 1.050249 -0.146422
13.433333 -0.074546 -0.764459 -0.013057 -0.310732 0.996653 -0.157552
13.466667 -0.085139 -0.732343 -0.020967 -0.287847 0.937280 -0.154802
13.500000 -0.095947 -0.700890 -0.023232 -0.259407 0.871287 -0.138490
13.533333 -0.106955 -0.670115 -0.021832 -0.226996 0.798195 -0.107954
13.566667 -0.115514 -0.642546 -0.052008 -0.192560 0.717981 -0.062880
13.600000 -0.121750 -0.617217 -0.056830 -0.158268 0.631412 -0.006932
13.633333 -0.125128 -0.594980 -0.053160 -0.125820 0.539402 0.049818
13.666667 -0.126660 -0.576019 -0.056798 -0.096755 0.443466 0.099333
13.700000 -0.126527 -0.561194 -0.053054 -0.072152 0.346088 0.137099
13.733333 -0.125380 -0.551362 -0.041689 -0.053109 0.249998 0.159514
13.766667 -0.124375 -0.546132 -0.021960 -0.040235 0.157941 0.161091
13.800000 -0.123628 -0.546164 0.008381 -0.033615 0.072778 0.141163
13.833333 -0.124498 -0.551499 0.025680 -0.032824 -0.002371 0.106033
13.866667 -0.125439 -0.557461 0.045063 -0.036948 -0.064546 0.058980
13.900000 -0.126449 -0.564026 0.034162 -0.044901 -0.111762 0.006173
13.933333 -0.127524 -0.571172 0.027642 -0.055236 -0.142974 -0.047150
13.966667 -0.128660 -0.578872 0.002956 -0.066852 -0.157721 -0.091604
14.000000 -0.131610 -0.588458 -0.013999 -0.078735 -0.156791 -0.119449
14.033333 -0.134609 -0.598551 -0.028637 -0.090452 -0.142267 -0.130019
14.066667 -0.138691 -0.607876 -0.029965 -0.101835 -0.116834 -0.118249
14.100000 -0.143143 -0.614878 -0.039129 -0.112765 -0.083166 -0.087860
14.133333 -0.147612 -0.618056 -0.041748 -0.123156 -0.043961 -0.042702
14.166667 -0.151678 -0.617434 -0.035611 -0.132426 -0.002576 0.007577
14.200000 -0.155823 -0.612834 -0.041763 -0.140088 0.037619 0.054994
14.233333 -0.160017 -0.608629 -0.034960 -0.145483 0.073996 0.095584
14.266667 -0.164254 -0.604810 -0.022005 -0.147973 0.104208 0.122819
14.300000 -0.170616 -0.597297 -0.011118 -0.146946 0.126111 0.134939
14.333333 -0.177017 -0.590161 0.000584 -0.142075 0.138528 0.130818
14.366667 -0.183447 -0.583396 -0.000048 -0.133599 0.141782 0.115988
14.400000 -0.190490 -0.575283 0.021673 -0.121912 0.137225 0.092433
14.433333 -0.196768 -0.567916 0.021643 -0.107484 0.126249 0.062149
14.466667 -0.201301 -0.562367 0.024452 -0.091006 0.110436 0.028525
14.500000 -0.203364 -0.559377 0.014864 -0.073600 0.092002 -0.004109
14.533333 -0.203348 -0.558625 0.003192 -0.056433 0.072878 -0.030353
14.566667 -0.203317 -0.558197 0.001587 -0.040392 0.054344 -0.051134
14.600000 -0.202610 -0.558240 0.007834 -0.026347 0.037454 -0.065232
14.633333 -0.202087 -0.558468 -0.001833 -0.015017 0.023184 -0.070885
14.666667 -0.201548 -0.558988 -0.012257 -0.006788 0.012310 -0.068651
14.700000 -0.201589 -0.558804 -0.013538 -0.001442 0.004751 -0.060558
14.733333 -0.201615 -0.558893 -0.007693 0.001609 0.000043 -0.051025
14.766667 -0.201626 -0.559248 -0.014610 0.002878 -0.002297 -0.040621
14.800000 -0.201622 -0.559858 -0.007585 0.003039 -0.002928 -0.029189
