t x y theta dxdt dydt dthetadt
0.000000 0.000000 0.000000 0.138031 0.078030 -0.072598 1.183098
0.033333 0.015883 -0.014748 0.185670 0.129809 -0.120797 2.028926
0.066667 0.031681 -0.029430 0.341592 0.194353 -0.180898 3.102279
0.100000 0.047387 -0.044032 0.712729 0.271589 -0.252842 4.374257
0.133333 0.063007 -0.058567 1.014389 0.335339 -0.312292 5.458237
0.166667 0.078537 -0.073026 1.392686 0.385678 -0.359311 6.280535
0.200000 0.093980 -0.087410 1.741678 0.422680 -0.393962 6.773350
0.233333 0.109337 -0.101722 2.146046 0.446419 -0.416308 6.886737
0.266667 0.124609 -0.115963 2.323864 0.456970 -0.426413 6.616738
0.300000 0.139798 -0.130134 2.605166 0.454405 -0.424338 5.998864
0.333333 0.154901 -0.144238 2.837387 0.451853 -0.422286 5.238180
0.366667 0.169920 -0.158276 2.982875 0.449313 -0.420257 4.403217
0.400000 0.184852 -0.172247 3.071898 0.446786 -0.418250 3.562563
0.433333 0.199700 -0.186151 3.096227 0.444269 -0.416265 2.788767
0.466667 0.214463 -0.199989 3.140565 0.441762 -0.414298 2.102368
0.500000 0.229140 -0.213760 -3.106099 0.439263 -0.412346 1.515487
0.533333 0.243737 -0.227469 -3.096581 0.436769 -0.410404 1.047860
0.566667 0.258253 -0.241115 -3.095859 0.434280 -0.408471 0.691952
0.600000 0.272690 -0.254699 -3.099359 0.431792 -0.406542 0.435721
0.633333 0.287046 -0.268222 -3.085509 0.429304 -0.404615 0.249540
0.666667 0.301317 -0.281679 -3.098249 0.426813 -0.402689 0.127373
0.700000 0.315504 -0.295069 -3.085153 0.424318 -0.400761 0.052766
0.733333 0.329610 -0.308399 -3.089081 0.421819 -0.398831 0.004226
0.766667 0.343631 -0.321663 -3.099311 0.419315 -0.396898 -0.026122
0.800000 0.357566 -0.334861 -3.104245 0.416807 -0.394964 -0.046967
0.833333 0.371417 -0.347993 -3.110353 0.414298 -0.393032 -0.057218
0.866667 0.385183 -0.361058 -3.096605 0.411790 -0.391104 -0.064100
0.900000 0.398868 -0.374064 -3.109329 0.409285 -0.389181 -0.068089
0.933333 0.412469 -0.387003 -3.103736 0.406785 -0.387266 -0.069078
0.966667 0.425984 -0.399877 -3.110899 0.404290 -0.385358 -0.067818
1.000000 0.439414 -0.412684 -3.113291 0.401799 -0.383458 -0.065088
1.033333 0.452764 -0.425433 -3.115456 0.399312 -0.381562 -0.064216
1.066667 0.466029 -0.438115 -3.123861 0.396827 -0.379670 -0.062777
1.100000 0.479215 -0.450738 -3.123119 0.394343 -0.377780 -0.061735
1.133333 0.492321 -0.463303 -3.121158 0.391859 -0.375893 -0.058629
1.166667 0.505348 -0.475808 -3.121655 0.389376 -0.374008 -0.057217
1.200000 0.518290 -0.488248 -3.124643 0.386893 -0.372124 -0.055428
1.233333 0.531146 -0.500622 -3.130956 0.384410 -0.370243 -0.049524
1.266667 0.543916 -0.512929 -3.137285 0.381928 -0.368365 -0.037749
1.300000 0.556601 -0.525170 -3.118056 0.379447 -0.366489 -0.023754
1.333333 0.569206 -0.537352 -3.125089 0.376967 -0.364616 -0.009406
1.366667 0.581726 -0.549468 -3.134973 0.374487 -0.362746 0.007466
1.400000 0.594166 -0.561525 3.125093 0.372008 -0.360878 0.026665
1.433333 0.606526 -0.573525 -3.140836 0.369531 -0.359013 0.042271
1.466667 0.618805 -0.585466 -3.128704 0.367053 -0.357148 0.050364
1.500000 0.631004 -0.597346 -3.132482 0.364574 -0.355283 0.054516
1.533333 0.643117 -0.609160 -3.126805 0.362093 -0.353415 0.053392
1.566667 0.655144 -0.620907 -3.109314 0.359607 -0.351542 0.046175
1.600000 0.667090 -0.632595 -3.107247 0.357116 -0.349663 0.029442
1.633333 0.678954 -0.644221 -3.105234 0.354619 -0.347778 0.008753
1.666667 0.690733 -0.655781 -3.102387 0.352116 -0.345886 -0.013860
1.700000 0.702429 -0.667280 -3.119185 0.349607 -0.343988 -0.038100
1.733333 0.714044 -0.678718 -3.122701 0.347092 -0.342085 -0.062177
1.766667 0.725572 -0.690089 -3.121143 0.344572 -0.340177 -0.084546
1.800000 0.737017 -0.701398 -3.124562 0.342047 -0.338265 -0.102691
1.833333 0.748380 -0.712646 -3.136404 0.339516 -0.336349 -0.119556
1.866667 0.759657 -0.723827 -3.137179 0.336979 -0.334426 -0.133351
1.900000 0.770846 -0.734939 -3.140024 0.334435 -0.332498 -0.145503
1.933333 0.781952 -0.745989 3.134700 0.331886 -0.330565 -0.153815
1.966667 0.792974 -0.756979 -3.134970 0.329330 -0.328627 -0.157241
2.000000 0.803913 -0.767906 3.135969 0.326769 -0.326682 -0.154676
2.033333 0.814764 -0.778764 3.123804 0.324203 -0.324731 -0.144112
2.066667 0.825527 -0.789554 3.118984 0.321631 -0.322774 -0.126951
2.100000 0.836206 -0.800282 3.105335 0.319054 -0.320810 -0.101874
2.133333 0.846800 -0.810947 3.091445 0.316470 -0.318835 -0.072274
2.166667 0.857307 -0.821542 3.082983 0.313880 -0.316850 -0.039036
2.200000 0.867728 -0.832074 3.089043 0.311283 -0.314854 -0.004554
2.233333 0.878063 -0.842540 3.086396 0.308679 -0.312846 0.028747
2.266667 0.888310 -0.852937 3.108158 0.306067 -0.310825 0.057745
2.300000 0.898471 -0.863268 3.124149 0.303447 -0.308790 0.079285
2.333333 0.908545 -0.873533 3.114732 0.300819 -0.306744 0.092290
2.366667 0.918531 -0.883727 3.121937 0.298182 -0.304684 0.095679
2.400000 0.928428 -0.893851 3.129042 0.295537 -0.302611 0.090369
2.433333 0.938237 -0.903904 3.127005 0.292883 -0.300526 0.076864
2.466667 0.947957 -0.913888 3.134129 0.290222 -0.298430 0.058277
2.500000 0.957588 -0.923804 3.135221 0.287553 -0.296323 0.037232
2.533333 0.967131 -0.933648 3.128663 0.284877 -0.294205 0.017032
2.566667 0.976584 -0.943421 3.132303 0.282195 -0.292077 -0.002737
2.600000 0.985947 -0.953124 3.133600 0.279507 -0.289937 -0.020402
2.633333 0.995219 -0.962756 3.134757 0.276812 -0.287786 -0.035855
2.666667 1.004402 -0.972316 3.124214 0.274111 -0.285622 -0.048254
2.700000 1.013495 -0.981804 3.135098 0.271403 -0.283446 -0.057819
2.733333 1.022499 -0.991219 3.125121 0.268688 -0.281256 -0.066280
2.766667 1.031411 -1.000561 3.122358 0.265966 -0.279053 -0.073129
2.800000 1.040234 -1.009829 3.113954 0.263237 -0.276836 -0.078737
2.833333 1.048967 -1.019024 3.105284 0.260502 -0.274607 -0.081633
2.866667 1.057607 -1.028144 3.115076 0.257761 -0.272365 -0.084130
2.900000 1.066154 -1.037188 3.111556 0.255013 -0.270110 -0.084624
2.933333 1.074607 -1.046155 3.111392 0.252259 -0.267843 -0.084259
2.966667 1.082971 -1.055047 3.106099 0.249499 -0.265565 -0.080765
3.000000 1.091240 -1.063862 3.095072 0.246734 -0.263275 -0.076237
3.033333 1.099420 -1.072603 3.098620 0.243966 -0.260976 -0.073665
3.066667 1.107511 -1.081269 3.101712 0.241197 -0.258670 -0.069814
3.100000 1.115506 -1.089856 3.087048 0.238428 -0.256357 -0.066364
3.133333 1.123405 -1.098362 3.088354 0.235661 -0.254040 -0.062321
3.166667 1.131215 -1.106793 3.085161 0.232898 -0.251721 -0.060023
3.200000 1.138929 -1.115143 3.081756 0.230138 -0.249399 -0.058083
3.233333 1.146553 -1.123418 3.092573 0.227382 -0.247074 -0.052729
3.266667 1.154081 -1.131610 3.088460 0.224629 -0.244746 -0.046554
3.300000 1.161519 -1.139727 3.093783 0.221878 -0.242414 -0.039886
3.333333 1.168868 -1.147770 3.078487 0.219127 -0.240074 -0.029392
3.366667 1.176128 -1.155736 3.063563 0.216374 -0.237724 -0.013263
3.400000 1.183299 -1.163628 3.079559 0.213618 -0.235365 0.006595
3.433333 1.190382 -1.171444 3.080750 0.210859 -0.232994 0.029441
3.466667 1.197365 -1.179174 3.073003 0.208096 -0.230613 0.054460
3.500000 1.204260 -1.186828 3.074907 0.205330 -0.228219 0.080770
3.533333 1.211056 -1.194395 3.069887 0.202560 -0.225816 0.102941
3.566667 1.217763 -1.201886 3.083556 0.199789 -0.223402 0.116171
3.600000 1.224372 -1.209288 3.087330 0.197015 -0.220978 0.123794
3.633333 1.230892 -1.216614 3.106076 0.194239 -0.218545 0.121286
3.666667 1.237314 -1.223852 3.116629 0.191462 -0.216102 0.110033
3.700000 1.243648 -1.231014 3.123000 0.188686 -0.213653 0.090076
3.733333 1.249895 -1.238101 3.117153 0.185911 -0.211197 0.065345
3.766667 1.256054 -1.245113 3.133621 0.183139 -0.208737 0.040521
3.800000 1.262117 -1.252037 3.118979 0.180372 -0.206275 0.014331
3.833333 1.268083 -1.258873 3.121271 0.177613 -0.203816 -0.005927
3.866667 1.273954 -1.265623 3.111860 0.174863 -0.201360 -0.020274
3.900000 1.279729 -1.272286 3.105399 0.172124 -0.198911 -0.026571
3.933333 1.285409 -1.278863 3.107090 0.169401 -0.196475 -0.028134
3.966667 1.291004 -1.285365 3.099269 0.166697 -0.194054 -0.024246
4.000000 1.296515 -1.291793 3.104777 0.164013 -0.191653 -0.017317
4.033333 1.301932 -1.298137 3.098972 0.161349 -0.189270 -0.012070
4.066667 1.307257 -1.304396 3.105685 0.158708 -0.186908 -0.008979
4.100000 1.312498 -1.310582 3.116743 0.156089 -0.184568 -0.009567
4.133333 1.317656 -1.316694 3.104522 0.153491 -0.182248 -0.009354
4.166667 1.322730 -1.322734 3.125968 0.150912 -0.179946 -0.013300
4.200000 1.327714 -1.328691 3.113110 0.148354 -0.177662 -0.017446
4.233333 1.332609 -1.334567 3.107588 0.145814 -0.175396 -0.021280
4.266667 1.337422 -1.340371 3.098979 0.143293 -0.173147 -0.024630
4.300000 1.342153 -1.346102 3.109088 0.140788 -0.170911 -0.028339
4.333333 1.346797 -1.351754 3.092596 0.138298 -0.168690 -0.033298
4.366667 1.351361 -1.357335 3.094988 0.135825 -0.166481 -0.036691
4.400000 1.355843 -1.362845 3.094162 0.133365 -0.164284 -0.039258
4.433333 1.360246 -1.368284 3.101003 0.130917 -0.162095 -0.042029
4.466667 1.364570 -1.373653 3.109372 0.128481 -0.159914 -0.044351
4.500000 1.368815 -1.378952 3.112571 0.126058 -0.157743 -0.043164
4.533333 1.372976 -1.384175 3.100816 0.123648 -0.155581 -0.043093
4.566667 1.377054 -1.389323 3.098660 0.121250 -0.153427 -0.040546
4.600000 1.381051 -1.394396 3.080493 0.118865 -0.151283 -0.037037
4.633333 1.384965 -1.399395 3.071109 0.116497 -0.149152 -0.028495
4.666667 1.388804 -1.404326 3.095415 0.114145 -0.147036 -0.017312
4.700000 1.392567 -1.409189 3.077167 0.111810 -0.144934 -0.003539
4.733333 1.396250 -1.413981 3.091660 0.109495 -0.142849 0.012643
4.766667 1.399855 -1.418702 3.084696 0.107198 -0.140782 0.026285
4.800000 1.403386 -1.423356 3.089294 0.104919 -0.138731 0.035074
4.833333 1.406843 -1.427945 3.094482 0.102658 -0.136695 0.035498
4.866667 1.410224 -1.432465 3.088202 0.100414 -0.134675 0.031826
4.900000 1.413532 -1.436920 3.106122 0.098188 -0.132670 0.019041
4.933333 1.416765 -1.441306 3.099336 0.095978 -0.130681 0.004989
4.966667 1.419924 -1.445626 3.107817 0.093787 -0.128708 -0.010362
5.000000 1.423010 -1.449879 3.105440 0.091616 -0.126752 -0.020923
5.033333 1.426022 -1.454067 3.110039 0.089466 -0.124815 -0.027004
5.066667 1.428962 -1.458189 3.092531 0.087338 -0.122898 -0.029279
5.100000 1.431830 -1.462247 3.086950 0.085234 -0.121002 -0.023133
