t x y theta dxdt dydt dthetadt
0.000000 0.000000 0.000000 0.904011 0.073391 0.037407 0.002337
0.033333 0.003444 0.001559 0.915208 0.075395 0.038141 0.002210
0.066667 0.005613 0.002777 0.906466 0.078042 0.039217 0.002245
0.100000 0.007885 0.004037 0.911611 0.081533 0.040693 0.002324
0.133333 0.010318 0.005421 0.911020 0.086586 0.042875 0.000989
0.166667 0.012910 0.006894 0.913990 0.095646 0.046809 -0.000943
0.200000 0.014477 0.007672 0.905072 0.114385 0.054885 -0.001904
0.233333 0.017764 0.009244 0.911877 0.147835 0.069153 -0.000451
0.266667 0.020825 0.010605 0.909487 0.200801 0.091559 0.001028
0.300000 0.023993 0.012008 0.912711 0.293710 0.130418 -0.019435
0.333333 0.027268 0.013453 0.903544 0.416498 0.181599 -0.051326
0.366667 0.033726 0.016584 0.900635 0.555752 0.239521 -0.096463
0.400000 0.040287 0.019755 0.905384 0.691585 0.295927 -0.143403
0.433333 0.046951 0.022965 0.917287 0.804635 0.342829 -0.192024
0.466667 0.060748 0.029167 0.910439 0.881771 0.374742 -0.241824
0.500000 0.092328 0.042934 0.914337 0.877390 0.373030 -0.248447
0.533333 0.161613 0.072020 0.915746 0.806255 0.343679 -0.231265
0.566667 0.230908 0.101089 0.909168 0.691539 0.296162 -0.198600
0.600000 0.300156 0.130121 0.913031 0.543084 0.234585 -0.165762
0.633333 0.555471 0.234330 0.656017 0.363016 0.159945 -0.110237
0.666667 0.459268 0.195213 0.758833 0.170482 0.080196 -0.040459
0.700000 0.362825 0.156028 0.738203 0.003101 0.010819 0.011387
0.733333 0.266230 0.116807 0.905555 -0.133159 -0.045630 0.037319
0.766667 0.169564 0.077581 0.906291 -0.245353 -0.091891 0.073066
0.800000 0.153774 0.071356 0.904446 -0.304530 -0.116105 0.110092
0.833333 0.138017 0.065144 0.913408 -0.266566 -0.100343 0.091579
0.866667 0.174131 0.080121 0.912560 -0.144120 -0.049832 0.030813
0.900000 0.286716 0.125962 0.769759 0.034312 0.023756 -0.037680
0.933333 0.200030 0.091138 0.904766 0.261959 0.117552 -0.092651
0.966667 0.208211 0.094963 0.908979 0.528470 0.227241 -0.175272
1.000000 0.216389 0.098779 0.914349 0.802475 0.339944 -0.278533
1.033333 0.224561 0.102585 0.777840 1.042559 0.438710 -0.325217
1.066667 0.232722 0.106377 0.732933 1.245236 0.522062 -0.338152
1.100000 0.240867 0.110155 0.907685 1.425875 0.596171 -0.365765
1.133333 0.363781 0.160885 0.903100 1.549115 0.646647 -0.390333
1.166667 0.486573 0.211526 0.763845 1.608771 0.670905 -0.388340
1.200000 0.609141 0.262040 0.722558 1.599002 0.666556 -0.351632
1.233333 0.636332 0.273785 0.757241 1.526807 0.636508 -0.352330
1.266667 0.711074 0.304683 0.724960 1.395203 0.582035 -0.357256
1.300000 0.761371 0.325952 0.719381 1.204126 0.503131 -0.331642
1.333333 0.826466 0.352993 0.672246 0.992015 0.415466 -0.291909
1.366667 0.861876 0.367456 0.904684 0.774161 0.325364 -0.274134
1.400000 0.896744 0.381688 0.602397 0.567131 0.239647 -0.263434
1.433333 0.813909 0.348335 0.666866 0.378973 0.161609 -0.226021
1.466667 0.730572 0.314798 0.752659 0.227663 0.098570 -0.190956
1.500000 0.758601 0.326320 0.701983 0.116959 0.052121 -0.160835
1.533333 0.786180 0.337647 0.656278 0.041528 0.020093 -0.146736
1.566667 0.813285 0.348770 0.711617 -0.002706 0.000791 -0.104585
1.600000 0.891207 0.380279 0.603156 -0.022822 -0.008714 -0.066140
1.633333 0.844163 0.361315 0.616744 -0.034152 -0.014687 -0.041260
1.666667 0.796594 0.342147 0.720598 -0.077204 -0.033572 -0.007128
1.700000 0.783853 0.336819 0.707060 -0.161455 -0.069237 0.038937
1.733333 0.770639 0.331298 0.627038 -0.276380 -0.117426 0.090880
1.766667 0.756966 0.325588 0.769337 -0.411482 -0.173904 0.137648
1.800000 0.868990 0.370663 0.611400 -0.560811 -0.236231 0.178258
1.833333 0.838406 0.357949 0.678212 -0.721905 -0.303349 0.231983
1.866667 0.782934 0.335096 0.711147 -0.870893 -0.365535 0.298291
1.900000 0.759574 0.325408 0.714871 -0.992930 -0.416777 0.345689
1.933333 0.751373 0.321457 0.674231 -1.110878 -0.466292 0.394704
1.966667 0.658750 0.283222 0.704531 -1.235231 -0.518240 0.437471
2.000000 0.512639 0.223327 0.670911 -1.352746 -0.567196 0.498529
2.033333 0.366279 0.163362 0.905356 -1.433771 -0.601111 0.528563
2.066667 0.425941 0.186748 0.758961 -1.474350 -0.618355 0.534733
2.100000 0.485432 0.210040 0.911364 -1.486021 -0.623524 0.525075
2.133333 0.544700 0.233218 0.655013 -1.460316 -0.613176 0.509076
2.166667 0.383354 0.167011 0.908687 -1.389753 -0.584328 0.471048
2.200000 0.221862 0.100780 0.904035 -1.288783 -0.542874 0.398194
2.233333 0.168051 0.078194 0.908316 -1.187377 -0.500987 0.344056
2.266667 0.114279 0.055628 0.902620 -1.079120 -0.456113 0.281541
2.300000 0.092533 0.046301 0.910342 -0.953874 -0.404209 0.234777
2.333333 0.085950 0.043164 0.906550 -0.804264 -0.342346 0.165506
2.366667 0.079472 0.040062 0.906241 -0.649458 -0.278308 0.112730
2.400000 0.073105 0.036997 0.908057 -0.502917 -0.217582 0.078285
2.433333 0.066850 0.033970 0.910009 -0.360148 -0.158376 0.044871
2.466667 0.063734 0.032316 0.903790 -0.231588 -0.104956 0.023657
2.500000 0.060735 0.030702 0.913927 -0.117504 -0.057431 0.002994
2.533333 0.057667 0.029188 0.913792 -0.015999 -0.015020 -0.012281
2.566667 0.054718 0.027717 0.904203 0.070150 0.021103 -0.027253
2.600000 0.051888 0.026288 0.907400 0.146210 0.053024 -0.041830
2.633333 0.050761 0.025735 0.903195 0.212324 0.080745 -0.057219
2.666667 0.053486 0.026700 0.905639 0.263841 0.102364 -0.073638
2.700000 0.062800 0.030455 0.908841 0.282860 0.110549 -0.089657
2.733333 0.072219 0.034244 0.911905 0.251508 0.097987 -0.075232
2.766667 0.081733 0.038063 0.913284 0.196436 0.075490 -0.061665
2.800000 0.121283 0.053962 0.910645 0.125998 0.046509 -0.047805
2.833333 0.222047 0.094902 0.907600 0.035722 0.009294 -0.033923
2.866667 0.322774 0.135798 0.727847 -0.075846 -0.036723 -0.003883
2.900000 0.159711 0.069344 0.907801 -0.181955 -0.080593 0.025707
2.933333 0.093255 0.041951 0.910072 -0.265773 -0.115366 0.040623
2.966667 0.074496 0.034009 0.904119 -0.336429 -0.144659 0.057622
3.000000 0.055814 0.026098 0.902205 -0.390574 -0.167116 0.074949
3.033333 0.037222 0.018224 0.908138 -0.410673 -0.175604 0.092381
3.066667 0.030439 0.014950 0.906263 -0.380427 -0.163415 0.079810
3.100000 0.023763 0.011717 0.907574 -0.327484 -0.141765 0.067326
3.133333 0.020503 0.010229 0.915661 -0.261322 -0.114553 0.053832
3.166667 0.016574 0.008547 0.906426 -0.183424 -0.082423 0.038178
3.200000 0.014378 0.007325 0.908026 -0.097640 -0.046921 0.021002
3.233333 0.012762 0.006447 0.907322 -0.013100 -0.011769 0.003466
3.266667 0.012075 0.005923 0.908644 0.072185 0.023723 -0.014690
3.300000 0.011497 0.005442 0.914108 0.159705 0.060086 -0.034014
3.333333 0.011028 0.005002 0.913486 0.240458 0.093650 -0.052596
3.366667 0.011092 0.004862 0.906134 0.307293 0.121496 -0.070445
3.400000 0.015463 0.006739 0.910018 0.352989 0.140616 -0.087389
3.433333 0.027800 0.011679 0.908360 0.371612 0.148560 -0.102772
3.466667 0.058557 0.024219 0.906330 0.336512 0.134522 -0.087813
3.500000 0.089371 0.036773 0.906194 0.264141 0.105199 -0.071190
3.533333 0.120213 0.049330 0.907314 0.172234 0.067788 -0.054168
3.566667 0.151054 0.061878 0.900155 0.066724 0.024697 -0.036084
3.600000 0.299464 0.122046 0.728545 -0.055679 -0.025342 -0.002384
3.633333 0.193330 0.078729 0.902141 -0.178607 -0.075609 0.030039
3.666667 0.087121 0.035412 0.905153 -0.273111 -0.114258 0.047662
3.700000 0.052665 0.021263 0.904486 -0.337440 -0.140502 0.064712
3.733333 0.018252 0.007139 0.908167 -0.364613 -0.151397 0.081644
3.766667 0.005632 0.001798 0.914759 -0.332921 -0.138016 0.085620
3.800000 0.003647 0.000872 0.906480 -0.208324 -0.086537 0.037520
3.833333 0.001742 -0.000023 0.901446 -0.026796 -0.011712 -0.026402
3.866667 -0.000085 -0.000888 0.904775 0.171886 0.070122 -0.090326
3.900000 -0.001834 -0.001721 0.909826 0.370877 0.151955 -0.153724
3.933333 -0.003506 -0.002525 0.912946 0.542814 0.222442 -0.218595
3.966667 0.004394 0.000791 0.906778 0.641937 0.262739 -0.260232
4.000000 0.031009 0.012012 0.907961 0.627149 0.256043 -0.244324
4.033333 0.057666 0.023243 0.900074 0.534635 0.217168 -0.196448
4.066667 0.147442 0.060490 0.910004 0.397407 0.159623 -0.149642
4.100000 0.364659 0.149509 0.780290 0.210164 0.081332 -0.092379
4.133333 0.509772 0.208496 0.652203 -0.021107 -0.015106 -0.011364
4.166667 0.329222 0.134149 0.714467 -0.252917 -0.111712 0.074847
4.200000 0.148444 0.059762 0.910221 -0.450038 -0.193935 0.139800
4.233333 0.099502 0.039011 0.912055 -0.617325 -0.263647 0.187977
4.266667 0.050527 0.018260 0.901486 -0.750072 -0.318772 0.237852
4.300000 0.001557 -0.002476 0.906984 -0.811831 -0.344324 0.264399
4.333333 -0.020694 -0.012079 0.905534 -0.780221 -0.331169 0.247554
4.366667 -0.031152 -0.016627 0.905105 -0.688844 -0.293157 0.197689
4.400000 -0.035947 -0.018850 0.905238 -0.571028 -0.244015 0.148785
4.433333 -0.037855 -0.019961 0.914649 -0.437496 -0.188276 0.100099
4.466667 -0.039691 -0.021042 0.912468 -0.303774 -0.132448 0.049723
4.500000 -0.041952 -0.022117 0.911698 -0.195739 -0.087264 0.012109
4.533333 -0.044810 -0.023453 0.904552 -0.129090 -0.059202 -0.005662
4.566667 -0.047597 -0.024758 0.907782 -0.090468 -0.042790 -0.006500
4.600000 -0.050311 -0.026032 0.906891 -0.065633 -0.032228 -0.008628
4.633333 -0.052952 -0.027276 0.893538 -0.050667 -0.025872 -0.007486
4.666667 -0.053232 -0.027456 0.916805 -0.041965 -0.022198 -0.005886
4.700000 -0.053441 -0.027606 0.903135 -0.035999 -0.019689 -0.003822
4.733333 -0.053502 -0.027639 0.907860 -0.031420 -0.017777 -0.000883
4.766667 -0.054634 -0.028447 0.903682 -0.027785 -0.016243 0.001761
4.800000 -0.055700 -0.029227 0.907768 -0.025034 -0.014999 0.005669
4.833333 -0.056699 -0.029979 0.903586 -0.023433 -0.014115 0.006177
