t x y theta dxdt dydt dthetadt
0.000000 0.000000 0.000000 -0.245121 0.080249 -0.018155 -0.062655
0.033333 0.002619 -0.000374 -0.237139 0.082025 -0.012252 -0.024013
0.066667 0.005368 -0.000477 -0.232722 0.084319 -0.006139 0.002349
0.100000 0.008320 -0.000308 -0.240305 0.087017 -0.000048 0.018144
0.133333 0.011074 -0.000206 -0.265756 0.089922 0.005870 0.031275
0.166667 0.013623 -0.000172 -0.275339 0.092703 0.011636 0.043738
0.200000 0.016559 0.000327 -0.276919 0.094916 0.017397 0.054439
0.233333 0.019955 0.001161 -0.279557 0.096127 0.023336 0.061263
0.266667 0.023685 0.002245 -0.277414 0.095941 0.029667 0.065692
0.300000 0.027805 0.003420 -0.255801 0.094094 0.036793 0.063446
0.333333 0.031691 0.004523 -0.230136 0.090425 0.045014 0.049793
0.366667 0.035337 0.005550 -0.218297 0.084953 0.054629 0.026467
0.400000 0.038859 0.006755 -0.218141 0.077938 0.065876 -0.001356
0.433333 0.041956 0.008325 -0.210450 0.069737 0.078987 -0.027808
0.466667 0.044429 0.010440 -0.219751 0.060793 0.094230 -0.052377
0.500000 0.046163 0.013385 -0.244769 0.051587 0.111450 -0.065710
0.533333 0.046957 0.017700 -0.251953 0.042625 0.130424 -0.064425
0.566667 0.047474 0.021920 -0.284024 0.034068 0.150425 -0.045386
0.600000 0.047708 0.026038 -0.283276 0.025665 0.170285 -0.011404
0.633333 0.048026 0.032309 -0.293307 0.017049 0.188690 0.040466
0.666667 0.048054 0.038463 -0.276264 0.007528 0.203996 0.111535
0.700000 0.048579 0.046688 -0.274372 -0.003756 0.214709 0.195809
0.733333 0.049455 0.056565 -0.237150 -0.017825 0.219435 0.288195
0.766667 0.050025 0.066292 -0.221789 -0.035533 0.217142 0.378182
0.800000 0.050084 0.076367 -0.223454 -0.057444 0.207222 0.455670
0.833333 0.049825 0.086266 -0.214802 -0.084225 0.189280 0.502956
0.866667 0.049243 0.095975 -0.214798 -0.116017 0.163559 0.513015
0.900000 0.046286 0.102967 -0.213705 -0.152617 0.130811 0.482158
0.933333 0.040355 0.106597 -0.166932 -0.193428 0.092236 0.412814
0.966667 0.034092 0.110008 -0.096881 -0.237609 0.049255 0.310438
1.000000 0.024473 0.109343 -0.047407 -0.283898 0.003754 0.186994
1.033333 0.014525 0.108450 -0.018469 -0.330689 -0.042357 0.056367
1.066667 0.004251 0.107327 -0.019372 -0.376592 -0.087572 -0.072845
1.100000 -0.009252 0.103018 -0.053857 -0.420322 -0.130817 -0.187858
1.133333 -0.025668 0.096159 -0.121752 -0.460748 -0.171553 -0.274074
1.166667 -0.044546 0.087420 -0.173038 -0.496514 -0.209270 -0.317701
1.200000 -0.063716 0.078463 -0.200101 -0.526933 -0.244194 -0.313034
1.233333 -0.083167 0.069294 -0.222856 -0.551535 -0.276568 -0.254948
1.266667 -0.102885 0.059919 -0.230383 -0.569758 -0.306437 -0.144525
1.300000 -0.123707 0.049544 -0.227711 -0.581413 -0.333926 0.002724
1.333333 -0.144982 0.038120 -0.213171 -0.586759 -0.359102 0.163586
1.366667 -0.166298 0.025746 -0.217559 -0.586670 -0.382029 0.319201
1.400000 -0.187436 0.012168 -0.201861 -0.581827 -0.402435 0.452340
1.433333 -0.208019 -0.002443 -0.157662 -0.572959 -0.420045 0.545740
1.466667 -0.227312 -0.017854 -0.120880 -0.561225 -0.434665 0.588635
1.500000 -0.244931 -0.033998 -0.091559 -0.547649 -0.445673 0.585761
1.533333 -0.262713 -0.050269 -0.053797 -0.532955 -0.452454 0.548170
1.566667 -0.280649 -0.066653 -0.021771 -0.517794 -0.454817 0.486768
1.600000 -0.296741 -0.082847 0.017985 -0.502915 -0.452767 0.418213
1.633333 -0.312969 -0.099128 0.015743 -0.488886 -0.446290 0.365596
1.666667 -0.329325 -0.115483 0.015376 -0.475831 -0.435351 0.346918
1.700000 -0.344061 -0.129633 0.013265 -0.463897 -0.420773 0.363559
1.733333 -0.358912 -0.143833 -0.013199 -0.453251 -0.403275 0.405145
1.766667 -0.373871 -0.158074 -0.033269 -0.443927 -0.383328 0.449323
1.800000 -0.388934 -0.172344 -0.047709 -0.435657 -0.361267 0.474146
1.833333 -0.402590 -0.182538 -0.050086 -0.428481 -0.338052 0.452856
1.866667 -0.416338 -0.192746 -0.014173 -0.422619 -0.314795 0.368251
1.900000 -0.430174 -0.202961 0.072663 -0.417862 -0.291926 0.223321
1.933333 -0.444094 -0.213177 0.163170 -0.413929 -0.269947 0.032817
1.966667 -0.457390 -0.221302 0.254709 -0.410436 -0.249613 -0.173933
2.000000 -0.470391 -0.228161 0.320604 -0.407193 -0.231808 -0.377984
2.033333 -0.483586 -0.234375 0.276593 -0.403691 -0.216608 -0.555471
2.066667 -0.497267 -0.240147 0.136842 -0.399356 -0.204017 -0.685764
2.100000 -0.511015 -0.245907 -0.044128 -0.394069 -0.194217 -0.754778
2.133333 -0.524826 -0.251655 -0.178253 -0.387632 -0.187437 -0.753143
2.166667 -0.538697 -0.257391 -0.249910 -0.379994 -0.183455 -0.681354
2.200000 -0.552625 -0.263113 -0.236668 -0.371025 -0.181884 -0.537376
2.233333 -0.564823 -0.268566 -0.166054 -0.360890 -0.182587 -0.342414
2.266667 -0.577073 -0.274006 -0.123257 -0.349871 -0.185331 -0.123964
2.300000 -0.587421 -0.280407 -0.056394 -0.338318 -0.189743 0.082669
2.333333 -0.597821 -0.286794 -0.053271 -0.326865 -0.195233 0.252470
2.366667 -0.608275 -0.293166 -0.043272 -0.316249 -0.201270 0.362298
2.400000 -0.618784 -0.299521 -0.047034 -0.307343 -0.207273 0.401485
2.433333 -0.629348 -0.305860 -0.049542 -0.300713 -0.212669 0.385292
2.466667 -0.638639 -0.313227 -0.053377 -0.297002 -0.216810 0.329560
2.500000 -0.647203 -0.321360 -0.019391 -0.296547 -0.219141 0.254227
2.533333 -0.655620 -0.329989 0.012381 -0.299460 -0.219234 0.167499
2.566667 -0.664103 -0.338592 0.005856 -0.305633 -0.216861 0.088514
2.600000 -0.673217 -0.346873 0.013336 -0.314742 -0.212005 0.024094
2.633333 -0.683023 -0.354723 0.029694 -0.326541 -0.204753 -0.029627
2.666667 -0.693675 -0.362048 0.040926 -0.340341 -0.195535 -0.069790
2.700000 -0.705297 -0.368566 0.009192 -0.355305 -0.185091 -0.087165
2.733333 -0.717871 -0.374226 -0.022760 -0.370549 -0.174386 -0.076524
2.766667 -0.730521 -0.379847 -0.050411 -0.385263 -0.164325 -0.050073
2.800000 -0.744444 -0.384516 -0.070780 -0.398712 -0.155751 -0.016330
2.833333 -0.759148 -0.388318 -0.077007 -0.410285 -0.149480 0.020500
2.866667 -0.773922 -0.392084 -0.060849 -0.419743 -0.146090 0.047369
2.900000 -0.788765 -0.395813 -0.026821 -0.427201 -0.145718 0.045265
2.933333 -0.803625 -0.399624 -0.012387 -0.432977 -0.148050 0.012890
2.966667 -0.818365 -0.403912 -0.015564 -0.437445 -0.152691 -0.039209
3.000000 -0.833164 -0.408169 0.032227 -0.441157 -0.159085 -0.105343
3.033333 -0.847544 -0.413444 0.081318 -0.444682 -0.166372 -0.181452
3.066667 -0.861978 -0.420044 0.072790 -0.448460 -0.173541 -0.254527
3.100000 -0.876466 -0.426614 0.021481 -0.452792 -0.179658 -0.307375
3.133333 -0.891004 -0.433154 -0.058996 -0.457834 -0.184059 -0.335392
3.166667 -0.906141 -0.440346 -0.129606 -0.463554 -0.186125 -0.339323
3.200000 -0.921708 -0.447607 -0.180376 -0.469738 -0.185384 -0.312498
3.233333 -0.937318 -0.454832 -0.172625 -0.475986 -0.181696 -0.255185
3.266667 -0.953353 -0.461619 -0.111311 -0.481827 -0.175253 -0.179090
3.300000 -0.969907 -0.467921 -0.075799 -0.486799 -0.166436 -0.103635
3.333333 -0.986792 -0.473737 -0.086887 -0.490448 -0.155620 -0.047398
3.366667 -1.003951 -0.479027 -0.098331 -0.492434 -0.143347 -0.020503
3.400000 -1.021093 -0.483548 -0.121162 -0.492509 -0.130200 -0.023527
3.433333 -1.037976 -0.487155 -0.099516 -0.490614 -0.116813 -0.043253
3.466667 -1.054868 -0.490726 -0.054438 -0.486880 -0.103815 -0.062527
3.500000 -1.071418 -0.493587 -0.032930 -0.481530 -0.091744 -0.067881
3.533333 -1.087968 -0.496417 -0.061313 -0.474837 -0.081062 -0.048789
3.566667 -1.103908 -0.498601 -0.113478 -0.467252 -0.072288 -0.004160
3.600000 -1.118926 -0.500053 -0.154291 -0.459266 -0.065865 0.050788
3.633333 -1.133933 -0.501486 -0.179674 -0.451242 -0.062146 0.097705
3.666667 -1.148926 -0.502904 -0.209462 -0.443480 -0.061217 0.133893
3.700000 -1.163002 -0.504014 -0.196855 -0.436248 -0.063247 0.161810
3.733333 -1.177059 -0.505119 -0.122935 -0.429790 -0.068579 0.179755
3.766667 -1.191096 -0.506223 -0.002007 -0.424130 -0.077164 0.182423
3.800000 -1.204841 -0.508757 0.058972 -0.419166 -0.088774 0.173185
3.833333 -1.218562 -0.511299 0.047369 -0.414882 -0.103035 0.153419
3.866667 -1.232257 -0.513852 -0.017673 -0.411222 -0.119724 0.111393
3.900000 -1.246035 -0.518223 -0.100759 -0.407988 -0.138198 0.046866
3.933333 -1.259783 -0.522609 -0.153074 -0.404971 -0.157517 -0.025318
3.966667 -1.273126 -0.528298 -0.140178 -0.402049 -0.176834 -0.081704
4.000000 -1.286437 -0.534003 -0.068410 -0.399134 -0.195598 -0.115401
4.033333 -1.299633 -0.541386 -0.031626 -0.396112 -0.213205 -0.124436
4.066667 -1.312777 -0.550447 -0.032754 -0.392906 -0.228797 -0.108062
4.100000 -1.325883 -0.559517 -0.061364 -0.389577 -0.241921 -0.075374
4.133333 -1.338952 -0.568592 -0.079682 -0.386220 -0.252301 -0.042475
4.166667 -1.351980 -0.577669 -0.097502 -0.382867 -0.259792 -0.023075
4.200000 -1.364785 -0.587155 -0.116092 -0.379606 -0.264015 -0.012212
4.233333 -1.377279 -0.596677 -0.120605 -0.376549 -0.264816 -0.004131
4.266667 -1.389524 -0.605967 -0.108234 -0.373818 -0.262375 0.007079
4.300000 -1.401722 -0.615239 -0.082043 -0.371489 -0.256839 0.027712
4.333333 -1.413874 -0.624490 -0.074670 -0.369618 -0.248340 0.068838
4.366667 -1.426003 -0.633419 -0.064908 -0.368288 -0.237104 0.135099
4.400000 -1.438105 -0.641779 -0.065752 -0.367616 -0.223658 0.220228
4.433333 -1.450269 -0.649434 -0.070500 -0.367756 -0.208652 0.311615
4.466667 -1.462380 -0.657052 -0.077660 -0.368794 -0.192700 0.398743
4.500000 -1.474428 -0.663597 -0.083861 -0.370920 -0.176447 0.468063
4.533333 -1.486663 -0.669070 -0.092408 -0.374304 -0.160622 0.501081
4.566667 -1.499037 -0.673321 -0.075674 -0.379099 -0.145917 0.487265
4.600000 -1.511583 -0.676418 -0.038264 -0.385305 -0.132879 0.426183
4.633333 -1.524063 -0.679477 0.032609 -0.392757 -0.121833 0.328894
4.666667 -1.536475 -0.682500 0.130438 -0.401314 -0.113089 0.202144
4.700000 -1.548815 -0.685488 0.205874 -0.410615 -0.106858 0.061511
4.733333 -1.562304 -0.688609 0.214279 -0.420180 -0.103242 -0.075029
4.766667 -1.577166 -0.691958 0.127747 -0.429370 -0.102212 -0.189683
4.800000 -1.591943 -0.695278 0.044174 -0.437595 -0.103697 -0.272407
4.833333 -1.607782 -0.698535 -0.059124 -0.444218 -0.107694 -0.312723
4.866667 -1.623522 -0.701768 -0.119842 -0.448620 -0.114080 -0.296422
4.900000 -1.639155 -0.704977 -0.109749 -0.450354 -0.122699 -0.225157
4.933333 -1.655037 -0.708153 -0.069082 -0.449274 -0.133349 -0.111773
4.966667 -1.671041 -0.711800 -0.050320 -0.445631 -0.145750 0.018592
5.000000 -1.686806 -0.716112 -0.049389 -0.439825 -0.159413 0.146110
5.033333 -1.702120 -0.721296 -0.025904 -0.432543 -0.173667 0.245703
5.066667 -1.716574 -0.727367 0.003420 -0.424586 -0.187731 0.296326
5.100000 -1.730102 -0.734229 0.051443 -0.416801 -0.200657 0.293398
5.133333 -1.743069 -0.742106 0.085671 -0.409916 -0.211488 0.245410
5.166667 -1.755609 -0.750790 0.085677 -0.404417 -0.219402 0.167907
5.200000 -1.767975 -0.759444 0.078065 -0.400607 -0.223927 0.073858
5.233333 -1.780391 -0.768451 0.061519 -0.398600 -0.224782 -0.019013
5.266667 -1.792962 -0.777330 0.042068 -0.398236 -0.222037 -0.096039
5.300000 -1.806023 -0.785712 0.034929 -0.399115 -0.216181 -0.148881
5.333333 -1.819661 -0.793173 0.030246 -0.400705 -0.207946 -0.173780
5.366667 -1.833087 -0.800584 0.011544 -0.402463 -0.198125 -0.170127
5.400000 -1.847032 -0.806819 -0.008589 -0.403860 -0.187480 -0.138473
5.433333 -1.861354 -0.811716 -0.016856 -0.404563 -0.176912 -0.084636
5.466667 -1.875436 -0.816557 -0.021886 -0.404416 -0.167143 -0.018085
5.500000 -1.889266 -0.821342 -0.021699 -0.403436 -0.158647 0.049708
5.533333 -1.902834 -0.826069 -0.002727 -0.401802 -0.151663 0.104216
5.566667 -1.916131 -0.830740 0.005761 -0.399717 -0.146362 0.135651
5.600000 -1.929144 -0.835352 0.010281 -0.397504 -0.142724 0.134747
5.633333 -1.942218 -0.839877 0.017272 -0.395180 -0.140393 0.098408
5.666667 -1.954986 -0.844345 0.039290 -0.392729 -0.139019 0.032584
5.700000 -1.967439 -0.848753 0.054168 -0.390110 -0.138286 -0.052422
5.733333 -1.979565 -0.853104 0.086205 -0.387529 -0.137969 -0.143320
5.766667 -1.993533 -0.857947 0.100382 -0.385010 -0.137798 -0.230370
5.800000 -2.007149 -0.862731 0.079109 -0.382515 -0.137594 -0.302671
5.833333 -2.020401 -0.867454 0.026200 -0.380326 -0.137356 -0.347669
5.866667 -2.033274 -0.872117 -0.036512 -0.378722 -0.137078 -0.359331
5.900000 -2.045756 -0.876718 -0.078490 -0.378033 -0.136773 -0.339657
5.933333 -2.057832 -0.881258 -0.107399 -0.378002 -0.136409 -0.287821
5.966667 -2.069489 -0.885736 -0.117716 -0.378727 -0.136003 -0.207761
6.000000 -2.080715 -0.890151 -0.080752 -0.380241 -0.135488 -0.110561
6.033333 -2.091494 -0.894503 -0.062570 -0.382162 -0.134606 -0.018567
6.066667 -2.105573 -0.899024 -0.061099 -0.383794 -0.133078 0.046026
6.100000 -2.119176 -0.903480 -0.064573 -0.384347 -0.130599 0.072515
6.133333 -2.132285 -0.907871 -0.074065 -0.383006 -0.126716 0.046061
6.166667 -2.146432 -0.912516 -0.033374 -0.378670 -0.120990 -0.038190
6.200000 -2.160049 -0.917095 0.022445 -0.370190 -0.112987 -0.175536
6.233333 -2.173690 -0.921773 0.016170 -0.356752 -0.102576 -0.349815
6.266667 -2.187316 -0.926333 0.017718 -0.338011 -0.089576 -0.544855
6.300000 -2.200225 -0.930327 -0.024693 -0.313613 -0.073850 -0.743944
6.333333 -2.211763 -0.933225 -0.063735 -0.283822 -0.055760 -0.924121
6.366667 -2.221169 -0.934356 -0.109202 -0.249380 -0.035990 -1.062379
6.400000 -2.229931 -0.935422 -0.151968 -0.211462 -0.015720 -1.134031
6.433333 -2.238034 -0.936428 -0.215744 -0.171392 0.003668 -1.128629
6.466667 -2.242523 -0.935258 -0.311850 -0.130757 0.020463 -1.033565
6.500000 -2.246323 -0.934036 -0.375938 -0.091266 0.033003 -0.851237
6.533333 -2.247278 -0.930792 -0.427491 -0.054637 0.039597 -0.595697
6.566667 -2.247520 -0.927511 -0.460709 -0.022009 0.039206 -0.288847
6.600000 -2.245613 -0.923097 -0.472114 0.005816 0.031368 0.031778
6.633333 -2.242126 -0.918449 -0.470281 0.028172 0.016153 0.336035
6.666667 -2.238040 -0.914552 -0.437476 0.044937 -0.005850 0.583686
6.700000 -2.234392 -0.912648 -0.384321 0.056144 -0.033782 0.747281
6.733333 -2.231638 -0.913745 -0.269594 0.062709 -0.065663 0.807471
6.766667 -2.230195 -0.918625 -0.198219 0.065504 -0.099499 0.755464
6.800000 -2.227981 -0.923510 -0.124696 0.065503 -0.133362 0.600240
6.833333 -2.224984 -0.928398 -0.068784 0.064044 -0.165393 0.360346
6.866667 -2.223941 -0.937404 -0.058631 0.062678 -0.193713 0.067058
6.900000 -2.222093 -0.946406 -0.052673 0.063065 -0.216620 -0.245403
6.933333 -2.219425 -0.955398 -0.092128 0.066462 -0.233057 -0.536045
6.966667 -2.218256 -0.965632 -0.154764 0.073973 -0.242495 -0.772638
7.000000 -2.217746 -0.975750 -0.252608 0.086701 -0.244515 -0.929151
7.033333 -2.216507 -0.984401 -0.333100 0.105730 -0.238717 -0.995632
7.066667 -2.214387 -0.993016 -0.398991 0.131772 -0.225149 -0.965037
7.100000 -2.211370 -1.001589 -0.453397 0.165266 -0.204231 -0.846304
7.133333 -2.207441 -1.010115 -0.485699 0.206498 -0.176758 -0.661332
7.166667 -2.202584 -1.018589 -0.471321 0.255532 -0.143425 -0.434210
7.200000 -2.196785 -1.027006 -0.516780 0.312460 -0.104846 -0.190572
7.233333 -2.186620 -1.030609 -0.487455 0.376886 -0.062208 0.047687
7.266667 -2.172137 -1.029673 -0.457951 0.447941 -0.017084 0.255485
7.300000 -2.156678 -1.028682 -0.424571 0.524601 0.029058 0.419281
7.333333 -2.140237 -1.027643 -0.393640 0.605558 0.074863 0.531911
7.366667 -2.119968 -1.023783 -0.373305 0.689459 0.118849 0.594796
7.400000 -2.096215 -1.017785 -0.335246 0.774284 0.159202 0.607896
7.433333 -2.068889 -1.010041 -0.316523 0.858274 0.194753 0.582381
7.466667 -2.037251 -1.000725 -0.293090 0.940161 0.225129 0.531636
7.500000 -2.004637 -0.991416 -0.249946 1.018894 0.250105 0.467227
7.533333 -1.967579 -0.981226 -0.239654 1.093410 0.269519 0.402446
7.566667 -1.925959 -0.970475 -0.229870 1.162828 0.283630 0.344764
7.600000 -1.883404 -0.959782 -0.237837 1.226974 0.293125 0.307156
7.633333 -1.839935 -0.949164 -0.244081 1.285599 0.298685 0.290344
7.666667 -1.795569 -0.938637 -0.256578 1.338738 0.300878 0.297619
7.700000 -1.750326 -0.928216 -0.257701 1.386468 0.299994 0.329139
7.733333 -1.704227 -0.917920 -0.237367 1.429460 0.296170 0.377310
7.766667 -1.654118 -0.908023 -0.224544 1.468489 0.289440 0.435598
7.800000 -1.603197 -0.898283 -0.219362 1.504128 0.279662 0.490475
7.833333 -1.551489 -0.888716 -0.189805 1.536966 0.266234 0.535088
7.866667 -1.499020 -0.879339 -0.162604 1.567320 0.248426 0.557881
7.900000 -1.445814 -0.870166 -0.134850 1.595367 0.225857 0.553244
7.933333 -1.391897 -0.861213 -0.078319 1.620912 0.198482 0.519492
7.966667 -1.337297 -0.852496 -0.068164 1.644008 0.165977 0.461001
8.000000 -1.282038 -0.844030 -0.040186 1.664708 0.128024 0.383724
8.033333 -1.225675 -0.839273 -0.026962 1.683095 0.085197 0.295422
8.066667 -1.168635 -0.838422 -0.020521 1.699202 0.038291 0.206605
8.100000 -1.111021 -0.837854 -0.028705 1.713228 -0.011725 0.124096
8.133333 -1.052862 -0.837577 -0.039135 1.725458 -0.063828 0.060020
8.166667 -0.994585 -0.841201 -0.053116 1.735842 -0.116328 0.015014
8.200000 -0.935819 -0.845123 -0.065392 1.744331 -0.167533 -0.007161
8.233333 -0.877354 -0.852109 -0.062668 1.750906 -0.216416 -0.008006
8.266667 -0.819290 -0.861781 -0.071056 1.755724 -0.262175 0.008765
8.300000 -0.760642 -0.874031 -0.068387 1.758875 -0.304084 0.037718
8.333333 -0.701621 -0.886567 -0.064664 1.760522 -0.341561 0.068867
8.366667 -0.642253 -0.899383 -0.061806 1.760927 -0.374740 0.099852
8.400000 -0.583133 -0.913560 -0.048677 1.760400 -0.403672 0.124279
8.433333 -0.523722 -0.928001 -0.039378 1.759235 -0.428564 0.139298
8.466667 -0.464796 -0.943251 -0.020262 1.757589 -0.449762 0.142984
8.500000 -0.406527 -0.959196 -0.020562 1.755700 -0.467897 0.136505
8.533333 -0.348047 -0.975373 -0.020599 1.753686 -0.483581 0.122526
8.566667 -0.290390 -0.991974 -0.013083 1.751706 -0.497149 0.100073
8.600000 -0.232572 -1.008784 -0.013183 1.749826 -0.509119 0.074985
8.633333 -0.174499 -1.026193 -0.015746 1.748109 -0.519745 0.050422
8.666667 -0.116143 -1.044147 -0.007820 1.746574 -0.529147 0.029310
8.700000 -0.057703 -1.062274 0.001550 1.745110 -0.537351 0.011974
8.733333 0.000798 -1.080562 -0.013301 1.743675 -0.544428 -0.001553
8.766667 0.059148 -1.099125 -0.018272 1.742076 -0.550475 -0.007013
8.800000 0.117354 -1.117809 -0.012340 1.740179 -0.555482 -0.006822
8.833333 0.175544 -1.136614 -0.026602 1.737825 -0.559496 -0.001148
8.866667 0.233338 -1.155443 -0.015785 1.734967 -0.562583 0.006892
8.900000 0.291068 -1.174366 -0.020607 1.731587 -0.564802 0.018641
8.933333 0.348710 -1.193371 -0.018845 1.727670 -0.566223 0.032864
8.966667 0.406240 -1.212443 -0.016808 1.723282 -0.566933 0.042103
9.000000 0.463633 -1.231570 -0.008448 1.718486 -0.567067 0.042107
9.033333 0.521132 -1.250573 -0.017855 1.713390 -0.566798 0.024956
9.066667 0.578447 -1.269603 -0.014814 1.708026 -0.566253 -0.009782
9.100000 0.635553 -1.288648 0.000140 1.702449 -0.565547 -0.068787
9.133333 0.692395 -1.307505 0.008766 1.696647 -0.564771 -0.157326
9.166667 0.748681 -1.326073 0.015962 1.690680 -0.563963 -0.272513
9.200000 0.804689 -1.344616 0.003422 1.684642 -0.563028 -0.408681
9.233333 0.860395 -1.363122 -0.008859 1.678595 -0.561801 -0.557106
9.266667 0.916187 -1.381804 0.003011 1.672651 -0.559928 -0.713679
9.300000 0.971928 -1.400565 -0.032288 1.666933 -0.556827 -0.864295
9.333333 1.027548 -1.419476 -0.071380 1.661593 -0.551614 -0.994323
9.366667 1.083063 -1.438397 -0.137528 1.656572 -0.543453 -1.091971
9.400000 1.138160 -1.457216 -0.186820 1.651668 -0.531393 -1.150820
9.433333 1.192815 -1.475920 -0.248170 1.646678 -0.514508 -1.164677
9.466667 1.247006 -1.494496 -0.300407 1.641332 -0.492004 -1.126160
9.500000 1.301674 -1.512418 -0.353181 1.635257 -0.463593 -1.040355
9.533333 1.356613 -1.529197 -0.395334 1.628015 -0.429667 -0.917591
9.566667 1.411017 -1.545813 -0.437846 1.619018 -0.390453 -0.770193
9.600000 1.465504 -1.560101 -0.457983 1.607373 -0.346757 -0.612426
9.633333 1.519832 -1.571608 -0.469171 1.591690 -0.299520 -0.460901
9.666667 1.573827 -1.579692 -0.464529 1.570639 -0.250304 -0.337127
9.700000 1.627192 -1.587587 -0.471769 1.543071 -0.200357 -0.251563
9.733333 1.679487 -1.591679 -0.455815 1.507507 -0.150843 -0.207865
9.766667 1.731107 -1.595584 -0.446555 1.463064 -0.103253 -0.207981
9.800000 1.781650 -1.596052 -0.421918 1.409746 -0.058943 -0.248210
9.833333 1.831473 -1.596343 -0.411176 1.348566 -0.018993 -0.316929
9.866667 1.880555 -1.596463 -0.428948 1.280455 0.015980 -0.395141
9.900000 1.925226 -1.594396 -0.441582 1.206576 0.045153 -0.478107
9.933333 1.964460 -1.590646 -0.472784 1.129346 0.068238 -0.562139
9.966667 1.997325 -1.585768 -0.511862 1.051350 0.085038 -0.645709
10.000000 2.029396 -1.580756 -0.579564 0.974883 0.095516 -0.727197
10.033333 2.060669 -1.575622 -0.609402 0.901971 0.099214 -0.817399
10.066667 2.085154 -1.571186 -0.632294 0.835319 0.096177 -0.928997
10.100000 2.108840 -1.566651 -0.645540 0.777185 0.086591 -1.057966
10.133333 2.131731 -1.562029 -0.663887 0.728574 0.070535 -1.195321
10.166667 2.153831 -1.557332 -0.640060 0.689552 0.048259 -1.334291
10.200000 2.173883 -1.556760 -0.651406 0.659749 0.020533 -1.467525
10.233333 2.193154 -1.556132 -0.715912 0.638324 -0.011283 -1.574305
10.266667 2.211649 -1.555455 -0.804916 0.622989 -0.046548 -1.630525
10.300000 2.229376 -1.554737 -0.900558 0.611425 -0.084382 -1.619800
10.333333 2.248961 -1.558030 -1.023705 0.601476 -0.123689 -1.537238
10.366667 2.270545 -1.564799 -1.129056 0.591224 -0.163163 -1.370810
10.400000 2.291373 -1.571537 -1.218920 0.578718 -0.202186 -1.116591
10.433333 2.313425 -1.580676 -1.265024 0.562075 -0.240229 -0.786454
10.466667 2.334722 -1.589779 -1.252301 0.540491 -0.276125 -0.407230
10.500000 2.355267 -1.598842 -1.237852 0.513327 -0.308719 -0.004419
10.533333 2.373553 -1.610732 -1.228889 0.480545 -0.337057 0.407269
10.566667 2.391089 -1.622569 -1.208884 0.442639 -0.360543 0.803461
10.600000 2.403845 -1.637258 -1.148987 0.401069 -0.377748 1.166818
10.633333 2.415861 -1.651874 -1.061860 0.357667 -0.387448 1.487125
10.666667 2.427148 -1.666408 -1.006356 0.314150 -0.388673 1.766985
10.700000 2.437714 -1.680849 -0.929560 0.272239 -0.380845 1.995135
10.733333 2.444101 -1.696793 -0.876240 0.233411 -0.363887 2.147060
10.766667 2.449790 -1.712619 -0.820303 0.198780 -0.337893 2.215083
10.800000 2.453583 -1.727258 -0.764770 0.168255 -0.303999 2.197287
10.833333 2.456704 -1.739484 -0.657928 0.141504 -0.263748 2.092457
10.866667 2.459519 -1.748647 -0.499253 0.117704 -0.219143 1.893177
10.900000 2.462495 -1.754947 -0.398051 0.095648 -0.172211 1.617004
10.933333 2.465670 -1.758418 -0.280169 0.073636 -0.124992 1.295522
10.966667 2.468671 -1.759259 -0.196047 0.049996 -0.079504 0.948738
11.000000 2.471304 -1.757878 -0.172580 0.023648 -0.037538 0.591222
11.033333 2.473360 -1.756353 -0.228939 -0.006459 -0.000562 0.253433
11.066667 2.474853 -1.754688 -0.349013 -0.040492 0.030167 -0.022881
11.100000 2.475797 -1.752892 -0.404952 -0.077850 0.053820 -0.219916
11.133333 2.473774 -1.749521 -0.399658 -0.117302 0.070035 -0.339472
11.166667 2.471234 -1.746031 -0.415420 -0.157540 0.078872 -0.386200
11.200000 2.464392 -1.741852 -0.452634 -0.197004 0.080726 -0.372840
11.233333 2.453286 -1.737396 -0.499439 -0.233278 0.075996 -0.333895
11.266667 2.441728 -1.732844 -0.499077 -0.264168 0.065326 -0.313485
11.300000 2.429745 -1.728207 -0.479792 -0.287470 0.048946 -0.334480
11.333333 2.417362 -1.723493 -0.439960 -0.301463 0.027108 -0.392141
11.366667 2.404507 -1.721944 -0.373006 -0.304461 0.000136 -0.478445
11.400000 2.393329 -1.724600 -0.351857 -0.295614 -0.031363 -0.580020
11.433333 2.381826 -1.727194 -0.357005 -0.275770 -0.066340 -0.679660
11.466667 2.370021 -1.729728 -0.434945 -0.246550 -0.103541 -0.755267
11.500000 2.357940 -1.732202 -0.524333 -0.210385 -0.141355 -0.795822
11.533333 2.345605 -1.734616 -0.631446 -0.169479 -0.178343 -0.807729
11.566667 2.339329 -1.741041 -0.723050 -0.126430 -0.213302 -0.813246
11.600000 2.338413 -1.750735 -0.773817 -0.083582 -0.245476 -0.841683
11.633333 2.342064 -1.762888 -0.779369 -0.042907 -0.274144 -0.918714
11.666667 2.345516 -1.774965 -0.731619 -0.006107 -0.298698 -1.074316
11.700000 2.348774 -1.786953 -0.650800 0.025291 -0.318439 -1.331746
11.733333 2.351842 -1.798842 -0.625351 0.049475 -0.332451 -1.701021
11.766667 2.354726 -1.810622 -0.636931 0.065399 -0.340163 -2.151927
11.800000 2.357429 -1.822281 -0.693196 0.072427 -0.341231 -2.634655
11.833333 2.359891 -1.834625 -0.750813 0.070878 -0.335897 -3.097338
11.866667 2.362563 -1.847435 -0.835692 0.061245 -0.324674 -3.488742
11.900000 2.366863 -1.860542 -1.093045 0.044352 -0.308456 -3.756195
11.933333 2.371820 -1.873043 -1.417034 0.021278 -0.288464 -3.857847
11.966667 2.375752 -1.884027 -1.698749 -0.007313 -0.265742 -3.786670
12.000000 2.377140 -1.892807 -1.916219 -0.040539 -0.241286 -3.552979
12.033333 2.375528 -1.899352 -2.026122 -0.077729 -0.216078 -3.188218
12.066667 2.371038 -1.904283 -2.084322 -0.117716 -0.191188 -2.724823
12.100000 2.366410 -1.909004 -2.078706 -0.159061 -0.167544 -2.219176
12.133333 2.358980 -1.912931 -2.087994 -0.199609 -0.145849 -1.733500
12.166667 2.351435 -1.916641 -2.069113 -0.236874 -0.126437 -1.321217
12.200000 2.341406 -1.919913 -2.091292 -0.268721 -0.109283 -1.020878
12.233333 2.331291 -1.922962 -2.129799 -0.293299 -0.093783 -0.830797
12.266667 2.319077 -1.925822 -2.141122 -0.309286 -0.079030 -0.740656
12.300000 2.305394 -1.928531 -2.138357 -0.315811 -0.064165 -0.716017
12.333333 2.291200 -1.930989 -2.112421 -0.312644 -0.048293 -0.719842
12.366667 2.277370 -1.933220 -2.170505 -0.300111 -0.030892 -0.701442
12.400000 2.263540 -1.935216 -2.227317 -0.278791 -0.011572 -0.623363
12.433333 2.252209 -1.936402 -2.269865 -0.249189 0.009721 -0.471955
12.466667 2.243876 -1.936423 -2.316850 -0.211705 0.033078 -0.239069
12.500000 2.238416 -1.934680 -2.387278 -0.166586 0.058797 0.079033
12.533333 2.233011 -1.932704 -2.432214 -0.114710 0.086931 0.491744
12.566667 2.230640 -1.928548 -2.423362 -0.056913 0.117494 0.988674
12.600000 2.228337 -1.924166 -2.370797 0.006338 0.150827 1.554600
12.633333 2.226105 -1.919563 -2.269941 0.074333 0.187460 2.176053
12.666667 2.230049 -1.913108 -2.187611 0.145586 0.227770 2.842050
12.700000 2.234064 -1.906447 -2.100536 0.218339 0.271797 3.533705
12.733333 2.238148 -1.899585 -1.996796 0.291224 0.319857 4.232747
12.766667 2.248446 -1.890039 -1.832670 0.362627 0.372404 4.925768
12.800000 2.264465 -1.877400 -1.655475 0.429902 0.428826 5.608579
12.833333 2.285671 -1.861009 -1.436686 0.489822 0.487431 6.261087
12.866667 2.306892 -1.844471 -1.218439 0.540372 0.546330 6.853697
12.900000 2.328105 -1.827805 -0.954618 0.579463 0.603341 7.352665
12.933333 2.351394 -1.806884 -0.740885 0.605152 0.655644 7.730447
12.966667 2.376155 -1.781656 -0.435668 0.616559 0.700281 7.958479
13.000000 2.401064 -1.752581 -0.100660 0.614003 0.734462 8.016042
13.033333 2.425862 -1.723478 0.240135 0.598933 0.756150 7.914413
13.066667 2.448650 -1.692592 0.594583 0.572235 0.762545 7.675141
13.100000 2.468891 -1.661494 0.962599 0.535367 0.750791 7.341349
13.133333 2.486435 -1.631954 1.251302 0.490199 0.719015 6.943073
13.166667 2.501280 -1.605369 1.431040 0.438365 0.666120 6.536192
13.200000 2.515892 -1.578914 1.575294 0.381523 0.592509 6.165734
13.233333 2.526931 -1.558187 1.652441 0.321809 0.500229 5.862862
13.266667 2.537702 -1.537639 1.773866 0.261843 0.393537 5.646565
13.300000 2.548189 -1.517294 1.889120 0.204299 0.278503 5.518833
13.333333 2.554393 -1.504448 2.037359 0.151955 0.161477 5.480719
13.366667 2.556871 -1.500015 2.231010 0.107328 0.048663 5.488679
13.400000 2.556093 -1.505523 2.443384 0.073161 -0.053646 5.498253
13.433333 2.552696 -1.523016 2.701810 0.051022 -0.140464 5.455832
13.466667 2.548964 -1.540721 2.915606 0.041769 -0.208330 5.329707
13.500000 2.544897 -1.558618 -3.101083 0.045565 -0.255328 5.088954
13.533333 2.540493 -1.576688 -2.901561 0.061379 -0.280991 4.723137
13.566667 2.538877 -1.590928 -2.705694 0.087390 -0.286150 4.259498
13.600000 2.540563 -1.602002 -2.566548 0.120004 -0.273793 3.738192
13.633333 2.546037 -1.610057 -2.459923 0.155433 -0.248352 3.213528
13.666667 2.555543 -1.615135 -2.356560 0.189821 -0.214256 2.723340
13.700000 2.564669 -1.620325 -2.321946 0.219656 -0.175679 2.321953
13.733333 2.577498 -1.623143 -2.345784 0.241443 -0.136492 2.045858
13.766667 2.589907 -1.626066 -2.346093 0.252564 -0.099630 1.912046
13.800000 2.601873 -1.629091 -2.335299 0.251983 -0.066869 1.922862
13.833333 2.613374 -1.632214 -2.347529 0.239560 -0.038479 2.072542
13.866667 2.624493 -1.633281 -2.288109 0.215888 -0.014390 2.349246
13.900000 2.633205 -1.632241 -2.170151 0.181725 0.005284 2.715649
13.933333 2.638019 -1.629277 -2.076859 0.139449 0.020838 3.131598
13.966667 2.642290 -1.626412 -1.954693 0.091465 0.032453 3.551373
14.000000 2.646002 -1.623648 -1.821064 0.039843 0.040289 3.928994
14.033333 2.649140 -1.620990 -1.683371 -0.013688 0.044248 4.212015
14.066667 2.647779 -1.618328 -1.504646 -0.067612 0.044291 4.355461
14.100000 2.642765 -1.616265 -1.297828 -0.120659 0.040843 4.329272
14.133333 2.634964 -1.615240 -1.114411 -0.172801 0.034658 4.111678
14.166667 2.626552 -1.614330 -0.905987 -0.224118 0.026551 3.695022
14.200000 2.617523 -1.613539 -0.725108 -0.274877 0.017576 3.089569
14.233333 2.607776 -1.612958 -0.570163 -0.325514 0.008946 2.325404
14.266667 2.597230 -1.612502 -0.413491 -0.376897 0.001903 1.449321
14.300000 2.585180 -1.612761 -0.347782 -0.429944 -0.002557 0.525268
14.333333 2.571070 -1.614014 -0.374828 -0.485267 -0.003915 -0.378266
14.366667 2.556333 -1.615391 -0.440726 -0.543668 -0.001757 -1.184590
14.400000 2.538673 -1.617329 -0.589028 -0.605445 0.003861 -1.824450
14.433333 2.517950 -1.618924 -0.772054 -0.670430 0.012401 -2.242429
14.466667 2.493968 -1.619346 -0.925669 -0.737802 0.022806 -2.402391
14.500000 2.469377 -1.619892 -1.129169 -0.806398 0.033736 -2.294252
14.533333 2.441263 -1.618548 -1.319101 -0.874770 0.043737 -1.925077
14.566667 2.410448 -1.615491 -1.430952 -0.941059 0.051311 -1.332607
14.600000 2.377037 -1.611212 -1.488279 -1.003422 0.055107 -0.574300
14.633333 2.341009 -1.606365 -1.471853 -1.059892 0.054215 0.279218
14.666667 2.302553 -1.601777 -1.414481 -1.108923 0.048336 1.155283
14.700000 2.262163 -1.597971 -1.327493 -1.148645 0.037641 1.974178
14.733333 2.220569 -1.595460 -1.225681 -1.177176 0.022794 2.660407
14.766667 2.177594 -1.594529 -1.073694 -1.192515 0.004819 3.162262
14.800000 2.134057 -1.595377 -0.894675 -1.193514 -0.014904 3.448842
14.833333 2.091170 -1.598152 -0.685856 -1.180103 -0.034928 3.509169
14.866667 2.047902 -1.601100 -0.454731 -1.151946 -0.054039 3.343148
14.900000 2.004280 -1.604222 -0.301754 -1.109621 -0.071229 2.977262
14.933333 1.964199 -1.607799 -0.177547 -1.054845 -0.085659 2.450334
14.966667 1.928341 -1.611301 -0.071815 -0.990837 -0.096682 1.804945
15.000000 1.892192 -1.614978 -0.007141 -0.920356 -0.104056 1.086805
15.033333 1.861636 -1.618664 -0.002841 -0.845932 -0.107889 0.341678
15.066667 1.836649 -1.622645 -0.049271 -0.771396 -0.108169 -0.376341
15.100000 1.817735 -1.626932 -0.141021 -0.701184 -0.104851 -1.022152
15.133333 1.798558 -1.631396 -0.219864 -0.638628 -0.098146 -1.554409
15.166667 1.779116 -1.636037 -0.299175 -0.585709 -0.088626 -1.935053
15.200000 1.764037 -1.640521 -0.387222 -0.544776 -0.076761 -2.137690
15.233333 1.751462 -1.644290 -0.494135 -0.517573 -0.063200 -2.139591
15.266667 1.739127 -1.646500 -0.621604 -0.504123 -0.049050 -1.935306
15.300000 1.725570 -1.646484 -0.757197 -0.502621 -0.035780 -1.535507
15.333333 1.711704 -1.646650 -0.841273 -0.511554 -0.025047 -0.954814
15.366667 1.697517 -1.647003 -0.953351 -0.529557 -0.018463 -0.218368
15.400000 1.680633 -1.645644 -0.996306 -0.554382 -0.018085 0.634489
15.433333 1.660724 -1.643204 -0.983936 -0.583436 -0.025374 1.550527
15.466667 1.640472 -1.640968 -0.921738 -0.614719 -0.041328 2.467717
15.500000 1.617780 -1.640223 -0.783249 -0.647193 -0.066517 3.334653
15.533333 1.594738 -1.639694 -0.594222 -0.679767 -0.100783 4.096493
15.566667 1.570510 -1.642741 -0.373003 -0.711638 -0.143221 4.698869
15.600000 1.545928 -1.646012 -0.108954 -0.742845 -0.192044 5.113852
15.633333 1.520990 -1.649508 0.095518 -0.774393 -0.245684 5.337434
15.666667 1.495374 -1.657547 0.369772 -0.807303 -0.302349 5.380445
15.700000 1.468785 -1.669980 0.632928 -0.842342 -0.359898 5.260210
15.733333 1.440663 -1.686780 0.820747 -0.880205 -0.416201 5.003651
15.766667 1.412183 -1.703781 0.967012 -0.921200 -0.469769 4.644896
15.800000 1.383348 -1.720971 1.064412 -0.965014 -0.519407 4.208966
15.833333 1.351334 -1.740823 1.162064 -1.010058 -0.563527 3.708517
15.866667 1.318971 -1.760833 1.268586 -1.054796 -0.601266 3.156444
15.900000 1.282822 -1.782578 1.370057 -1.097093 -0.632259 2.563147
15.933333 1.243244 -1.805734 1.483440 -1.134758 -0.656734 1.936450
15.966667 1.200770 -1.830003 1.579473 -1.165015 -0.674466 1.280523
16.000000 1.157989 -1.854352 1.662564 -1.185356 -0.685344 0.605315
16.033333 1.114916 -1.878760 1.711879 -1.194735 -0.690021 -0.073570
16.066667 1.071569 -1.903205 1.699437 -1.192096 -0.688798 -0.725746
16.100000 1.027963 -1.927666 1.640510 -1.177413 -0.681898 -1.318557
16.133333 0.984116 -1.952122 1.506039 -1.150780 -0.669096 -1.821806
16.166667 0.944670 -1.975015 1.404791 -1.114301 -0.650933 -2.208561
16.200000 0.905011 -1.997864 1.248538 -1.070119 -0.627652 -2.456461
16.233333 0.870809 -2.018588 1.087958 -1.020439 -0.599053 -2.553012
16.266667 0.836410 -2.039235 0.977215 -0.967790 -0.564683 -2.517622
16.300000 0.808910 -2.057013 0.832644 -0.915431 -0.524707 -2.372693
16.333333 0.781218 -2.074685 0.722061 -0.866980 -0.479840 -2.142158
16.366667 0.753334 -2.092237 0.669250 -0.824475 -0.430226 -1.842976
16.400000 0.725256 -2.109655 0.687055 -0.790393 -0.376548 -1.504038
16.433333 0.702340 -2.122789 0.709743 -0.766796 -0.320081 -1.154455
16.466667 0.682941 -2.131878 0.689635 -0.755405 -0.262942 -0.799522
16.500000 0.663329 -2.140811 0.635573 -0.756831 -0.206526 -0.449621
16.533333 0.643129 -2.145963 0.592166 -0.771327 -0.152204 -0.113141
16.566667 0.620283 -2.147543 0.576158 -0.799772 -0.101866 0.195822
16.600000 0.593365 -2.145840 0.555783 -0.841728 -0.057501 0.480891
16.633333 0.566206 -2.143987 0.567684 -0.895889 -0.020375 0.749972
16.666667 0.538805 -2.141992 0.622740 -0.960952 0.009022 0.997023
16.700000 0.511157 -2.139862 0.701417 -1.035386 0.029993 1.214397
16.733333 0.477187 -2.136764 0.791883 -1.117207 0.042381 1.393676
16.766667 0.437051 -2.133733 0.856521 -1.203713 0.046674 1.537124
16.800000 0.396684 -2.130591 0.923339 -1.293587 0.043767 1.637789
16.833333 0.349756 -2.128311 0.976047 -1.385426 0.034313 1.695731
16.866667 0.302627 -2.125936 1.048866 -1.477501 0.018923 1.713871
16.900000 0.249884 -2.124822 1.079511 -1.567657 -0.001458 1.710716
16.933333 0.196985 -2.123627 1.135085 -1.654770 -0.026319 1.699927
16.966667 0.139687 -2.123793 1.181187 -1.738026 -0.055101 1.682664
17.000000 0.078521 -2.125553 1.247219 -1.815491 -0.086980 1.655380
17.033333 0.014254 -2.129005 1.291198 -1.885964 -0.120843 1.604889
17.066667 -0.050042 -2.132390 1.347457 -1.948569 -0.155713 1.519499
17.100000 -0.117791 -2.137815 1.401103 -2.003305 -0.190809 1.364488
17.133333 -0.188438 -2.145449 1.463700 -2.049325 -0.224677 1.110984
17.166667 -0.261557 -2.155549 1.543615 -2.086084 -0.256055 0.733529
17.200000 -0.334530 -2.165572 1.586499 -2.113919 -0.284151 0.222407
17.233333 -0.407308 -2.175511 1.663043 -2.132833 -0.308453 -0.427086
17.266667 -0.480459 -2.188662 1.697940 -2.142252 -0.328000 -1.206987
17.300000 -0.553318 -2.201714 1.689299 -2.141164 -0.341862 -2.081802
17.333333 -0.625836 -2.214658 1.628392 -2.128510 -0.349505 -3.001546
17.366667 -0.697963 -2.227485 1.534345 -2.103313 -0.350708 -3.908702
17.400000 -0.769650 -2.240185 1.379468 -2.063716 -0.344778 -4.747801
17.433333 -0.840848 -2.252749 1.142921 -2.008172 -0.330824 -5.453121
17.466667 -0.911510 -2.265168 0.851920 -1.936327 -0.308871 -5.967960
17.500000 -0.981585 -2.277432 0.527848 -1.848417 -0.278963 -6.254888
17.533333 -1.051027 -2.289533 0.204476 -1.745660 -0.241489 -6.298381
17.566667 -1.113389 -2.299705 -0.078679 -1.629603 -0.196776 -6.093311
17.600000 -1.168576 -2.307568 -0.340570 -1.503567 -0.146073 -5.652384
17.633333 -1.216162 -2.312661 -0.549566 -1.371961 -0.091409 -5.017324
17.666667 -1.255731 -2.314440 -0.697169 -1.239211 -0.034624 -4.243860
17.700000 -1.294500 -2.316044 -0.854245 -1.109870 0.021880 -3.384479
17.733333 -1.325498 -2.313411 -0.949070 -0.988568 0.075293 -2.489983
17.766667 -1.349421 -2.306376 -0.978318 -0.879453 0.122390 -1.606861
17.800000 -1.372517 -2.299190 -0.971341 -0.784893 0.160760 -0.774196
17.833333 -1.391453 -2.288940 -0.956763 -0.705903 0.188149 -0.009995
17.866667 -1.409564 -2.278568 -0.913647 -0.642276 0.202842 0.677238
17.900000 -1.426853 -2.268086 -0.857336 -0.593242 0.203955 1.273425
17.933333 -1.444020 -2.258175 -0.785338 -0.556679 0.191810 1.767688
17.966667 -1.460375 -2.248184 -0.720732 -0.529796 0.168019 2.149548
18.000000 -1.475922 -2.238128 -0.644329 -0.510388 0.133976 2.411085
18.033333 -1.492288 -2.231482 -0.553598 -0.496022 0.092422 2.538452
18.066667 -1.509138 -2.228789 -0.438371 -0.484913 0.046311 2.526697
18.100000 -1.526069 -2.230369 -0.283530 -0.475335 -0.001333 2.381005
18.133333 -1.542208 -2.231915 -0.137831 -0.466266 -0.047638 2.115827
18.166667 -1.558147 -2.238118 0.000585 -0.457225 -0.090052 1.748841
18.200000 -1.573301 -2.244284 0.091669 -0.447820 -0.125836 1.308812
18.233333 -1.587670 -2.250409 0.136015 -0.438256 -0.153464 0.831853
18.266667 -1.602410 -2.258998 0.131104 -0.428536 -0.172134 0.348529
18.300000 -1.616372 -2.267535 0.098664 -0.418783 -0.181685 -0.107287
18.333333 -1.629557 -2.276013 0.023578 -0.408903 -0.182512 -0.506623
18.366667 -1.641969 -2.284424 -0.077777 -0.398904 -0.175799 -0.823612
18.400000 -1.655513 -2.291235 -0.150050 -0.388458 -0.163260 -1.050524
18.433333 -1.668286 -2.297968 -0.204710 -0.377101 -0.146327 -1.186214
18.466667 -1.681447 -2.302103 -0.249471 -0.364378 -0.126716 -1.233214
18.500000 -1.693838 -2.306152 -0.277115 -0.349818 -0.105956 -1.204276
18.533333 -1.706514 -2.307748 -0.282548 -0.332941 -0.085738 -1.121963
18.566667 -1.718421 -2.309256 -0.312842 -0.313220 -0.067360 -1.008320
18.600000 -1.729559 -2.310674 -0.373949 -0.290414 -0.051753 -0.874307
18.633333 -1.739584 -2.310991 -0.406953 -0.264310 -0.039928 -0.733758
18.666667 -1.748133 -2.310868 -0.438392 -0.235018 -0.032073 -0.596598
18.700000 -1.755915 -2.310659 -0.464395 -0.202508 -0.028245 -0.470194
18.733333 -1.762934 -2.310368 -0.485475 -0.167062 -0.027767 -0.350327
18.766667 -1.769190 -2.309996 -0.483578 -0.128962 -0.029957 -0.238390
18.800000 -1.772971 -2.310876 -0.483624 -0.088729 -0.033977 -0.140795
18.833333 -1.775999 -2.311679 -0.455903 -0.046811 -0.038687 -0.058843
18.866667 -1.776622 -2.313765 -0.454355 -0.003711 -0.042986 0.008311
18.900000 -1.776506 -2.315773 -0.432412 0.039782 -0.045776 0.059386
18.933333 -1.774152 -2.318725 -0.426144 0.082806 -0.046345 0.092402
18.966667 -1.771077 -2.321597 -0.437405 0.124497 -0.043986 0.110781
19.000000 -1.765769 -2.324366 -0.442305 0.164278 -0.038302 0.120596
19.033333 -1.758422 -2.326582 -0.445436 0.201342 -0.029380 0.128103
19.066667 -1.749329 -2.327741 -0.445561 0.235182 -0.017868 0.132608
19.100000 -1.739566 -2.328816 -0.431265 0.265507 -0.004671 0.136179
19.133333 -1.729148 -2.329806 -0.424690 0.292351 0.009077 0.135601
19.166667 -1.717852 -2.329141 -0.425649 0.315731 0.022109 0.128034
19.200000 -1.706196 -2.327066 -0.405612 0.335774 0.033033 0.107622
19.233333 -1.694631 -2.323977 -0.408649 0.353019 0.040782 0.072481
19.266667 -1.682472 -2.320813 -0.391220 0.367985 0.044593 0.021232
19.300000 -1.669737 -2.317576 -0.388853 0.381172 0.044061 -0.040715
19.333333 -1.656440 -2.314272 -0.374999 0.392987 0.039149 -0.106101
19.366667 -1.643248 -2.312051 -0.382178 0.403929 0.030177 -0.167953
19.400000 -1.629526 -2.309769 -0.380188 0.414402 0.017958 -0.217888
19.433333 -1.615492 -2.309076 -0.413910 0.424548 0.003471 -0.251822
19.466667 -1.601166 -2.309999 -0.444531 0.434509 -0.012081 -0.260424
19.500000 -1.586358 -2.310864 -0.464733 0.444433 -0.027562 -0.243493
19.533333 -1.571410 -2.313243 -0.484069 0.454475 -0.041790 -0.202609
19.566667 -1.556012 -2.315562 -0.489134 0.464671 -0.053836 -0.144655
19.600000 -1.540628 -2.318816 -0.502523 0.475030 -0.062900 -0.072589
19.633333 -1.524824 -2.322004 -0.506278 0.485565 -0.068484 0.007147
19.666667 -1.508614 -2.325123 -0.490871 0.496212 -0.070459 0.082511
19.700000 -1.492079 -2.328254 -0.466500 0.506898 -0.068801 0.144763
19.733333 -1.474902 -2.331168 -0.461395 0.517468 -0.063876 0.190560
19.766667 -1.457366 -2.334002 -0.446129 0.527822 -0.056077 0.221397
19.800000 -1.439485 -2.336755 -0.428527 0.537838 -0.046066 0.233130
19.833333 -1.421064 -2.338611 -0.410538 0.547436 -0.034540 0.224190
19.866667 -1.402319 -2.339717 -0.408538 0.556494 -0.022130 0.200281
19.900000 -1.383317 -2.340059 -0.413849 0.564871 -0.009517 0.167742
19.933333 -1.364204 -2.339647 -0.417142 0.572471 0.002765 0.128669
19.966667 -1.345095 -2.338525 -0.398188 0.579219 0.014184 0.084963
20.000000 -1.325735 -2.337315 -0.400025 0.585062 0.024352 0.043346
20.033333 -1.305948 -2.335729 -0.398029 0.589945 0.033040 0.010626
20.066667 -1.285940 -2.334058 -0.391926 0.593921 0.040159 -0.012983
20.100000 -1.265728 -2.332304 -0.390748 0.597031 0.045765 -0.028297
20.133333 -1.245326 -2.330469 -0.405815 0.599324 0.050030 -0.035626
20.166667 -1.224750 -2.328554 -0.410214 0.600777 0.053238 -0.034116
20.200000 -1.204710 -2.326730 -0.422474 0.601425 0.055683 -0.026558
20.233333 -1.184526 -2.324831 -0.434663 0.601320 0.057648 -0.015549
20.266667 -1.164692 -2.322937 -0.432141 0.600518 0.059356 -0.000893
20.300000 -1.144743 -2.320970 -0.418309 0.599113 0.060995 0.015701
20.333333 -1.124691 -2.318933 -0.414913 0.597191 0.062713 0.032317
20.366667 -1.104575 -2.316852 -0.398717 0.594918 0.064606 0.045029
20.400000 -1.084487 -2.314724 -0.401302 0.592356 0.066738 0.052463
20.433333 -1.064673 -2.312530 -0.401305 0.589574 0.069150 0.052590
20.466667 -1.045063 -2.310233 -0.409469 0.586576 0.071862 0.046473
20.500000 -1.025767 -2.307844 -0.399773 0.583311 0.074939 0.036713
20.533333 -1.006447 -2.305398 -0.402374 0.579768 0.078387 0.027870
20.566667 -0.987113 -2.302896 -0.394954 0.575785 0.082330 0.023974
20.600000 -0.967778 -2.300342 -0.393201 0.571240 0.086903 0.027712
20.633333 -0.948644 -2.297477 -0.395339 0.565861 0.092346 0.042394
20.666667 -0.929889 -2.294214 -0.406962 0.559290 0.099003 0.066292
20.700000 -0.911166 -2.290908 -0.404572 0.551268 0.107066 0.098237
20.733333 -0.892484 -2.287562 -0.409544 0.541510 0.116755 0.135223
20.766667 -0.873854 -2.284181 -0.408880 0.529968 0.128054 0.175086
20.800000 -0.855285 -2.280768 -0.397138 0.516605 0.140946 0.214290
20.833333 -0.837823 -2.276264 -0.386997 0.501559 0.155288 0.248523
20.866667 -0.820441 -2.271737 -0.371810 0.485155 0.170751 0.274788
20.900000 -0.804559 -2.265774 -0.357750 0.467654 0.187157 0.293844
20.933333 -0.788771 -2.259801 -0.338167 0.449318 0.204327 0.304188
20.966667 -0.774436 -2.252268 -0.318876 0.430405 0.222069 0.304518
21.000000 -0.761554 -2.243310 -0.310641 0.411173 0.240149 0.297841
21.033333 -0.748779 -2.234366 -0.305430 0.391879 0.258256 0.286372
21.066667 -0.736114 -2.225447 -0.295881 0.372664 0.276156 0.273552
21.100000 -0.723562 -2.216564 -0.294085 0.353687 0.293481 0.257029
21.133333 -0.711125 -2.207727 -0.286751 0.335103 0.309862 0.236849
21.166667 -0.700426 -2.196802 -0.286136 0.316995 0.324929 0.215516
21.200000 -0.689843 -2.185946 -0.287119 0.299488 0.338322 0.189764
21.233333 -0.680892 -2.172955 -0.258751 0.282846 0.349512 0.157974
21.266667 -0.672055 -2.160062 -0.245943 0.267470 0.357921 0.119992
21.300000 -0.663330 -2.147283 -0.246663 0.253749 0.363040 0.078605
21.333333 -0.656076 -2.133726 -0.228985 0.242229 0.364189 0.035608
21.366667 -0.648928 -2.120315 -0.237673 0.233264 0.361087 -0.007163
21.400000 -0.642301 -2.107254 -0.239022 0.227155 0.353585 -0.046673
21.433333 -0.635771 -2.094373 -0.239680 0.223821 0.342061 -0.077930
21.466667 -0.629334 -2.081688 -0.259841 0.222993 0.326931 -0.099922
21.500000 -0.622799 -2.070223 -0.270337 0.224384 0.308703 -0.114757
21.533333 -0.615842 -2.059899 -0.287226 0.227348 0.288309 -0.117932
21.566667 -0.608198 -2.050750 -0.296554 0.231280 0.266398 -0.114052
21.600000 -0.599841 -2.042843 -0.291228 0.235483 0.243591 -0.103181
21.633333 -0.591556 -2.035203 -0.277706 0.239383 0.220191 -0.089425
21.666667 -0.582803 -2.029029 -0.286711 0.242363 0.196715 -0.072925
21.700000 -0.574118 -2.023144 -0.275575 0.243842 0.173517 -0.054611
21.733333 -0.565497 -2.017557 -0.281760 0.243480 0.150620 -0.040559
21.766667 -0.556937 -2.012279 -0.284009 0.241017 0.128146 -0.029206
21.800000 -0.548645 -2.008699 -0.296086 0.236243 0.106249 -0.020790
21.833333 -0.540408 -2.005445 -0.300948 0.229080 0.085204 -0.012950
21.866667 -0.532223 -2.002525 -0.289664 0.219722 0.065031 -0.009329
21.900000 -0.524581 -2.001204 -0.303505 0.208389 0.045935 -0.004139
21.933333 -0.516984 -2.000230 -0.292697 0.195196 0.028285 0.002911
21.966667 -0.510226 -2.000350 -0.293945 0.180450 0.012457 0.015200
22.000000 -0.504665 -2.001167 -0.280979 0.164709 -0.001399 0.030205
22.033333 -0.499133 -2.002345 -0.283997 0.148465 -0.013197 0.048165
22.066667 -0.493624 -2.003890 -0.280043 0.132070 -0.022785 0.072789
22.100000 -0.489715 -2.005279 -0.292404 0.115965 -0.030295 0.097708
22.133333 -0.487479 -2.006251 -0.291526 0.100859 -0.036109 0.122987
22.166667 -0.485238 -2.007602 -0.296024 0.087271 -0.040811 0.144210
22.200000 -0.482983 -2.009336 -0.292570 0.075534 -0.045015 0.163916
22.233333 -0.480703 -2.011459 -0.270907 0.066079 -0.049473 0.176128
22.266667 -0.479178 -2.012916 -0.264512 0.059534 -0.055221 0.176027
22.300000 -0.478037 -2.014031 -0.240912 0.056260 -0.063101 0.159529
22.333333 -0.477132 -2.015220 -0.237810 0.056500 -0.074059 0.125485
22.366667 -0.476155 -2.016821 -0.222439 0.060525 -0.088920 0.069786
22.400000 -0.475094 -2.018838 -0.211617 0.068499 -0.108251 -0.009697
22.433333 -0.473469 -2.021669 -0.215245 0.080351 -0.132309 -0.107683
22.466667 -0.471736 -2.024929 -0.232554 0.095599 -0.160775 -0.216868
22.500000 -0.469883 -2.028621 -0.230245 0.114047 -0.193547 -0.324221
22.533333 -0.466857 -2.033922 -0.228983 0.135084 -0.229827 -0.422817
22.566667 -0.462543 -2.041295 -0.242652 0.158150 -0.268840 -0.499477
22.600000 -0.456433 -2.051488 -0.272501 0.182731 -0.309826 -0.548202
22.633333 -0.450168 -2.062123 -0.315961 0.208487 -0.352223 -0.563967
22.666667 -0.441278 -2.076847 -0.358616 0.235074 -0.395450 -0.548884
22.700000 -0.432221 -2.092005 -0.403754 0.261806 -0.438440 -0.508345
22.733333 -0.422993 -2.107590 -0.413040 0.288455 -0.480678 -0.448111
22.766667 -0.413592 -2.123595 -0.442316 0.314712 -0.521581 -0.376178
22.800000 -0.404013 -2.140013 -0.451346 0.340342 -0.560730 -0.299764
22.833333 -0.392005 -2.160101 -0.435514 0.364890 -0.597350 -0.230248
22.866667 -0.379814 -2.180583 -0.424493 0.388314 -0.631278 -0.172872
22.900000 -0.365685 -2.203446 -0.407831 0.410612 -0.662459 -0.133238
22.933333 -0.350172 -2.228081 -0.403702 0.431500 -0.690582 -0.109929
22.966667 -0.334480 -2.253069 -0.402839 0.450721 -0.715320 -0.105135
23.000000 -0.318613 -2.278396 -0.418036 0.467984 -0.736264 -0.114715
23.033333 -0.302573 -2.304045 -0.433782 0.483353 -0.753560 -0.128380
23.066667 -0.285770 -2.330253 -0.446903 0.496648 -0.766971 -0.140777
23.100000 -0.268522 -2.356692 -0.450971 0.507961 -0.776599 -0.146966
23.133333 -0.251112 -2.383403 -0.458556 0.517617 -0.782742 -0.144916
23.166667 -0.233483 -2.409726 -0.464974 0.525934 -0.785853 -0.132089
23.200000 -0.215701 -2.436289 -0.470220 0.533234 -0.786368 -0.111108
23.233333 -0.197770 -2.463073 -0.475521 0.539680 -0.784606 -0.090015
23.266667 -0.179693 -2.490063 -0.471822 0.545509 -0.781028 -0.071529
23.300000 -0.161202 -2.516478 -0.477147 0.550836 -0.775986 -0.054245
23.333333 -0.142574 -2.543065 -0.473743 0.555714 -0.769852 -0.045223
23.366667 -0.123941 -2.568570 -0.454849 0.560203 -0.762971 -0.044667
23.400000 -0.105093 -2.593484 -0.463710 0.564326 -0.755756 -0.051462
23.433333 -0.086123 -2.618527 -0.481834 0.568098 -0.748519 -0.059290
23.466667 -0.067266 -2.642867 -0.462066 0.571551 -0.741583 -0.067595
23.500000 -0.048069 -2.667073 -0.475623 0.574715 -0.735170 -0.079531
23.533333 -0.028723 -2.691084 -0.476563 0.577604 -0.729457 -0.087020
23.566667 -0.009277 -2.715171 -0.486858 0.580221 -0.724444 -0.088277
23.600000 0.010146 -2.739035 -0.490993 0.582637 -0.720092 -0.083773
23.633333 0.029658 -2.762950 -0.485598 0.584917 -0.716323 -0.078955
23.666667 0.049253 -2.786905 -0.511793 0.587043 -0.712935 -0.070719
23.700000 0.068926 -2.810889 -0.503428 0.589003 -0.709717 -0.057339
23.733333 0.088443 -2.834405 -0.508909 0.590802 -0.706412 -0.043404
23.766667 0.108027 -2.857926 -0.495825 0.592464 -0.702867 -0.032351
23.800000 0.127889 -2.881201 -0.489328 0.593953 -0.698919 -0.023081
23.833333 0.147805 -2.904458 -0.505229 0.595241 -0.694484 -0.013285
23.866667 0.167772 -2.927686 -0.495795 0.596342 -0.689523 -0.008631
23.900000 0.187782 -2.950874 -0.498579 0.597248 -0.684066 -0.010062
23.933333 0.207829 -2.974011 -0.505911 0.597904 -0.678118 -0.015703
23.966667 0.227836 -2.996638 -0.498482 0.598237 -0.671729 -0.021187
24.000000 0.247868 -3.019192 -0.506136 0.598220 -0.664931 -0.026714
24.033333 0.267833 -3.041210 -0.492449 0.597828 -0.657758 -0.034077
24.066667 0.287660 -3.062730 -0.502677 0.597003 -0.650220 -0.037673
24.100000 0.307644 -3.084125 -0.505269 0.595622 -0.642291 -0.037274
24.133333 0.327631 -3.105411 -0.495350 0.593634 -0.634016 -0.034897
24.166667 0.347615 -3.126579 -0.510713 0.590844 -0.625245 -0.031950
24.200000 0.367591 -3.147619 -0.518915 0.587042 -0.615847 -0.030050
24.233333 0.387381 -3.168174 -0.520033 0.581792 -0.605498 -0.032085
24.266667 0.406772 -3.188180 -0.524730 0.574761 -0.593947 -0.051930
24.300000 0.426137 -3.208033 -0.503773 0.565769 -0.581041 -0.097979
24.333333 0.445472 -3.227728 -0.503778 0.554532 -0.566557 -0.175101
24.366667 0.464771 -3.247257 -0.512561 0.541057 -0.550553 -0.294557
24.400000 0.483481 -3.265946 -0.509366 0.525399 -0.533140 -0.463043
24.433333 0.501271 -3.283701 -0.511222 0.508164 -0.514778 -0.676729
24.466667 0.519011 -3.301270 -0.515470 0.489935 -0.495802 -0.918519
24.500000 0.534984 -3.317217 -0.505031 0.471473 -0.476548 -1.172146
24.533333 0.550903 -3.332970 -0.520729 0.453852 -0.457322 -1.419311
24.566667 0.564082 -3.346718 -0.601993 0.438222 -0.438462 -1.629332
24.600000 0.577207 -3.360267 -0.728714 0.425815 -0.420053 -1.764487
24.633333 0.590280 -3.373616 -0.808678 0.417562 -0.401765 -1.798937
24.666667 0.602339 -3.386352 -0.898065 0.414355 -0.383407 -1.714293
24.700000 0.614349 -3.398886 -1.003918 0.416710 -0.364561 -1.500993
24.733333 0.626314 -3.411219 -1.103712 0.424899 -0.344924 -1.157937
24.766667 0.638809 -3.423345 -1.197422 0.438814 -0.323909 -0.704559
24.800000 0.652127 -3.434854 -1.254009 0.458050 -0.301378 -0.183205
24.833333 0.666849 -3.445478 -1.250923 0.481885 -0.277650 0.363968
24.866667 0.683336 -3.454698 -1.211645 0.509346 -0.253245 0.889848
24.900000 0.699779 -3.463724 -1.144668 0.539382 -0.229173 1.352641
24.933333 0.718230 -3.470874 -1.017188 0.570631 -0.206597 1.706956
24.966667 0.738494 -3.475816 -0.890663 0.601516 -0.187227 1.924083
25.000000 0.758700 -3.480580 -0.742019 0.630452 -0.172674 1.994227
25.033333 0.780678 -3.483986 -0.646943 0.656101 -0.164357 1.924245
25.066667 0.804317 -3.486553 -0.534167 0.677378 -0.163173 1.727266
25.100000 0.829341 -3.489194 -0.467570 0.693128 -0.169644 1.425572
25.133333 0.855193 -3.492597 -0.420889 0.702612 -0.183870 1.061674
25.166667 0.880932 -3.495869 -0.418863 0.705632 -0.205165 0.678670
25.200000 0.906448 -3.501453 -0.416531 0.702297 -0.232268 0.314593
25.233333 0.931478 -3.509661 -0.441875 0.692882 -0.263539 -0.004190
25.266667 0.956354 -3.517756 -0.488914 0.677801 -0.297520 -0.248161
25.300000 0.979489 -3.528994 -0.534543 0.658151 -0.332329 -0.402995
25.333333 1.000427 -3.543255 -0.551100 0.635165 -0.365977 -0.472289
25.366667 1.021175 -3.557401 -0.582343 0.610019 -0.396751 -0.466837
25.400000 1.041725 -3.571428 -0.623965 0.583788 -0.423364 -0.396850
25.433333 1.060091 -3.587828 -0.675522 0.557570 -0.444764 -0.278262
25.466667 1.078242 -3.604096 -0.680348 0.532317 -0.459958 -0.134857
25.500000 1.094822 -3.621192 -0.665733 0.508472 -0.468522 0.019563
25.533333 1.110570 -3.638772 -0.640698 0.486155 -0.470708 0.171029
25.566667 1.125434 -3.656103 -0.601208 0.465339 -0.466806 0.297325
25.600000 1.140065 -3.673271 -0.565882 0.445996 -0.457249 0.374508
25.633333 1.154457 -3.690266 -0.583585 0.427743 -0.442873 0.391889
25.666667 1.168371 -3.705425 -0.571815 0.410217 -0.424655 0.344711
25.700000 1.182041 -3.720397 -0.535262 0.393069 -0.403616 0.229773
25.733333 1.195229 -3.733459 -0.488782 0.376013 -0.380592 0.059720
25.766667 1.207656 -3.744725 -0.475585 0.358864 -0.356657 -0.125654
25.800000 1.219834 -3.755792 -0.446689 0.341456 -0.332741 -0.287751
25.833333 1.230910 -3.765538 -0.423673 0.323971 -0.309630 -0.405460
25.866667 1.241735 -3.775081 -0.458120 0.306547 -0.287824 -0.460390
25.900000 1.251300 -3.783719 -0.562216 0.289520 -0.267772 -0.435049
25.933333 1.260615 -3.792152 -0.660698 0.273240 -0.249649 -0.327221
25.966667 1.268719 -3.799783 -0.742013 0.258020 -0.233362 -0.163121
26.000000 1.276577 -3.807210 -0.802225 0.244101 -0.218815 0.032043
26.033333 1.283775 -3.813957 -0.815234 0.231478 -0.205648 0.243006
26.066667 1.290715 -3.820089 -0.764277 0.220170 -0.193685 0.450963
26.100000 1.297418 -3.826021 -0.628542 0.209930 -0.182584 0.621632
26.133333 1.304314 -3.831754 -0.492187 0.200489 -0.172109 0.727108
26.166667 1.310938 -3.837332 -0.407810 0.191433 -0.162034 0.758954
26.200000 1.317292 -3.842627 -0.399239 0.182362 -0.152147 0.716911
26.233333 1.323447 -3.847533 -0.400976 0.173005 -0.142412 0.605838
26.266667 1.329382 -3.852253 -0.404432 0.163080 -0.132716 0.439424
26.300000 1.335100 -3.856787 -0.411646 0.152553 -0.123109 0.252123
26.333333 1.340604 -3.861140 -0.425627 0.141507 -0.113687 0.075853
26.366667 1.345112 -3.864582 -0.435500 0.130229 -0.104701 -0.069705
26.400000 1.349416 -3.867849 -0.452178 0.119042 -0.096376 -0.177439
26.433333 1.352782 -3.870429 -0.473551 0.108310 -0.088883 -0.245374
26.466667 1.355954 -3.872841 -0.486461 0.098397 -0.082422 -0.276557
26.500000 1.358551 -3.874852 -0.477686 0.089577 -0.077111 -0.286486
26.533333 1.360697 -3.876772 -0.487222 0.082024 -0.072969 -0.288354
26.566667 1.362647 -3.878808 -0.485717 0.075766 -0.069835 -0.291075
26.600000 1.364427 -3.880696 -0.503208 0.070831 -0.067548 -0.293804
26.633333 1.366450 -3.882861 -0.513553 0.067088 -0.065864 -0.298283
