t x y theta dxdt dydt dthetadt
0.000000 0.000000 0.000000 -0.336914 0.014328 -0.011692 0.208863
0.033333 0.000230 -0.000114 -0.340607 0.019548 -0.013034 0.303951
0.066667 0.000392 -0.000195 -0.341132 0.027066 -0.015504 0.408330
0.100000 0.000671 -0.000483 -0.328506 0.036938 -0.019140 0.513465
0.133333 0.001088 -0.000984 -0.321627 0.049206 -0.023960 0.613291
0.166667 0.001667 -0.001702 -0.300388 0.063496 -0.029787 0.700696
0.200000 0.003282 -0.002706 -0.251410 0.080099 -0.036672 0.768822
0.233333 0.005954 -0.003706 -0.193792 0.099825 -0.044983 0.811760
0.266667 0.008852 -0.004936 -0.157117 0.123513 -0.055093 0.830740
0.300000 0.014208 -0.006951 -0.107647 0.152413 -0.067618 0.827631
0.333333 0.019827 -0.009204 -0.078454 0.187771 -0.083171 0.805568
0.366667 0.025727 -0.011697 -0.054988 0.231343 -0.102666 0.768311
0.400000 0.031924 -0.014434 -0.049825 0.283788 -0.126695 0.724538
0.433333 0.038435 -0.017420 -0.028197 0.344910 -0.155487 0.680749
0.466667 0.045275 -0.020656 -0.026518 0.414515 -0.189284 0.641731
0.500000 0.052462 -0.024146 -0.002004 0.491812 -0.227975 0.610061
0.533333 0.068586 -0.031203 0.018347 0.575290 -0.271168 0.586954
0.566667 0.091916 -0.041366 0.041036 0.662536 -0.317962 0.571795
0.600000 0.115617 -0.051772 0.055753 0.751588 -0.367440 0.559236
0.633333 0.145975 -0.065800 0.085240 0.840154 -0.418348 0.548722
0.666667 0.176695 -0.080056 0.105176 0.926141 -0.469494 0.536320
0.700000 0.211527 -0.097026 0.133142 1.007509 -0.519564 0.522482
0.733333 0.249185 -0.116630 0.153042 1.083448 -0.567596 0.506061
0.766667 0.288975 -0.138304 0.155641 1.153844 -0.612866 0.487878
0.800000 0.329076 -0.160156 0.165179 1.218295 -0.654594 0.468135
0.833333 0.370546 -0.183638 0.171629 1.277516 -0.692602 0.446424
0.866667 0.412288 -0.207264 0.193252 1.331833 -0.726609 0.423265
0.900000 0.457948 -0.232777 0.214286 1.381471 -0.756526 0.395525
0.933333 0.506508 -0.259884 0.222932 1.426139 -0.782271 0.360263
0.966667 0.555269 -0.287075 0.242626 1.465584 -0.803991 0.314043
1.000000 0.606565 -0.315063 0.253045 1.499416 -0.821747 0.258550
1.033333 0.660512 -0.344249 0.270297 1.526601 -0.835409 0.190821
1.066667 0.714573 -0.373452 0.288216 1.546187 -0.844728 0.112229
1.100000 0.768712 -0.402648 0.292882 1.557392 -0.849254 0.027831
1.133333 0.822266 -0.431684 0.277933 1.559733 -0.848599 -0.054405
1.166667 0.875833 -0.460668 0.278963 1.552582 -0.842223 -0.128203
1.200000 0.929376 -0.489760 0.279909 1.536217 -0.830030 -0.190983
1.233333 0.981695 -0.518646 0.259991 1.511542 -0.812141 -0.235928
1.266667 1.033928 -0.547413 0.228107 1.479706 -0.788998 -0.259165
1.300000 1.086045 -0.576040 0.212375 1.442151 -0.761216 -0.261615
1.333333 1.134694 -0.602447 0.200082 1.400269 -0.729439 -0.247984
1.366667 1.182024 -0.627897 0.180757 1.355260 -0.694021 -0.220980
1.400000 1.227702 -0.651331 0.183293 1.307973 -0.655270 -0.184943
1.433333 1.266647 -0.669649 0.177481 1.259302 -0.613723 -0.145386
1.466667 1.305338 -0.687742 0.179034 1.209961 -0.569541 -0.110746
1.500000 1.343755 -0.705598 0.182492 1.160892 -0.523338 -0.084518
1.533333 1.381881 -0.723205 0.193435 1.112509 -0.475277 -0.069461
1.566667 1.419696 -0.740552 0.187595 1.065568 -0.426007 -0.067960
1.600000 1.457183 -0.757628 0.192115 1.020582 -0.375856 -0.077339
1.633333 1.489525 -0.768505 0.185303 0.977457 -0.324780 -0.096228
1.666667 1.521503 -0.779097 0.190076 0.936168 -0.273156 -0.119553
1.700000 1.549568 -0.785107 0.178553 0.896644 -0.221483 -0.143924
1.733333 1.577244 -0.790829 0.171703 0.859041 -0.170714 -0.164678
1.766667 1.604524 -0.796264 0.164466 0.823424 -0.121764 -0.178315
1.800000 1.630677 -0.798676 0.152961 0.790036 -0.075929 -0.185368
1.833333 1.656048 -0.799270 0.142823 0.758934 -0.034171 -0.185866
1.866667 1.680660 -0.798159 0.138262 0.730174 0.002523 -0.180998
1.900000 1.704163 -0.795521 0.116984 0.703194 0.033820 -0.170015
1.933333 1.727228 -0.792621 0.124838 0.677616 0.059603 -0.155921
1.966667 1.749603 -0.788722 0.117559 0.652981 0.079813 -0.140359
2.000000 1.770961 -0.784177 0.120690 0.628659 0.094747 -0.124586
2.033333 1.791864 -0.779397 0.113741 0.604249 0.104445 -0.108768
2.066667 1.811039 -0.774933 0.114762 0.579477 0.109402 -0.092199
2.100000 1.829742 -0.770832 0.110852 0.554287 0.110148 -0.079328
2.133333 1.847982 -0.766527 0.108997 0.528418 0.107123 -0.068773
2.166667 1.865757 -0.762028 0.099011 0.501658 0.101005 -0.060080
2.200000 1.882332 -0.758144 0.089964 0.474016 0.092533 -0.050941
2.233333 1.897832 -0.755187 0.100409 0.445758 0.082586 -0.043011
2.266667 1.912866 -0.752062 0.103452 0.416903 0.071770 -0.037502
2.300000 1.926883 -0.749753 0.098561 0.387649 0.060580 -0.032974
2.333333 1.939276 -0.748193 0.102583 0.358493 0.049696 -0.029379
2.366667 1.950153 -0.747531 0.094384 0.329993 0.039741 -0.025511
2.400000 1.960571 -0.746729 0.096574 0.302535 0.031099 -0.024574
2.433333 1.969776 -0.746384 0.098140 0.276379 0.023928 -0.023134
2.466667 1.977315 -0.746572 0.095374 0.251847 0.018432 -0.019428
2.500000 1.984411 -0.746634 0.092273 0.229109 0.014649 -0.013327
2.533333 1.991070 -0.746573 0.103077 0.208037 0.012411 -0.006162
2.566667 1.997299 -0.746392 0.090997 0.188331 0.011345 -0.000507
2.600000 2.003105 -0.746095 0.086328 0.169796 0.011112 0.005500
2.633333 2.008495 -0.745687 0.077932 0.152160 0.011364 0.011683
2.666667 2.013476 -0.745170 0.085534 0.135229 0.011751 0.016011
2.700000 2.018055 -0.744549 0.103179 0.118855 0.012000 0.018268
2.733333 2.022239 -0.743828 0.105731 0.103039 0.011887 0.019604
2.766667 2.026037 -0.743011 0.104705 0.087856 0.011327 0.020147
2.800000 2.027764 -0.742743 0.106509 0.073437 0.010354 0.019242
2.833333 2.029121 -0.742386 0.092474 0.060080 0.009041 0.014504
2.866667 2.030120 -0.741945 0.095363 0.048044 0.007464 0.008427
2.900000 2.030849 -0.741761 0.097209 0.037579 0.005726 0.002491
2.933333 2.031756 -0.741873 0.095740 0.028783 0.004027 -0.003021
2.966667 2.032335 -0.741908 0.102596 0.021759 0.002535 -0.008091
3.000000 2.032593 -0.741869 0.102675 0.016370 0.001282 -0.012030
3.033333 2.032542 -0.741760 0.099343 0.012262 0.000320 -0.013801
3.066667 2.032835 -0.741956 0.096307 0.009027 -0.000269 -0.015782
