t x y theta dxdt dydt dthetadt
0.000000 0.000000 0.000000 -0.369855 0.007509 0.012030 0.019744
0.033333 0.000412 -0.000048 -0.358516 0.007820 0.017791 -0.003170
0.066667 0.000866 -0.000075 -0.360263 0.008518 0.025463 -0.035345
0.100000 0.001276 0.000589 -0.377125 0.009933 0.035276 -0.077271
0.133333 0.001167 0.002038 -0.362904 0.012534 0.047136 -0.128787
0.166667 0.001104 0.003508 -0.373368 0.016794 0.061023 -0.187228
0.200000 0.001088 0.004999 -0.363868 0.023200 0.076516 -0.254676
0.233333 0.001121 0.006512 -0.363376 0.032227 0.092812 -0.328385
0.266667 0.001813 0.009412 -0.398322 0.044430 0.108902 -0.400524
0.300000 0.002556 0.012331 -0.427805 0.060042 0.123843 -0.466178
0.333333 0.003737 0.017406 -0.424200 0.078773 0.136674 -0.516970
0.366667 0.005718 0.024429 -0.437563 0.100094 0.146014 -0.552185
0.400000 0.007750 0.031457 -0.460240 0.122874 0.150594 -0.559450
0.433333 0.011651 0.038739 -0.489660 0.145665 0.149426 -0.536931
0.466667 0.017791 0.045447 -0.542763 0.166696 0.142016 -0.484821
0.500000 0.023973 0.052143 -0.561066 0.184359 0.127842 -0.409242
0.533333 0.031727 0.057543 -0.600824 0.197350 0.107098 -0.313805
0.566667 0.040872 0.062101 -0.597657 0.204729 0.080899 -0.203866
0.600000 0.051480 0.065360 -0.600301 0.205790 0.050837 -0.090493
0.633333 0.062099 0.068590 -0.591623 0.200246 0.018488 0.019393
0.666667 0.071899 0.069641 -0.584367 0.188324 -0.014710 0.120377
0.700000 0.079604 0.067546 -0.576409 0.170352 -0.047075 0.220454
0.733333 0.082799 0.062016 -0.544408 0.147195 -0.077216 0.320581
0.766667 0.085975 0.056466 -0.521760 0.119899 -0.104340 0.430338
0.800000 0.089129 0.050905 -0.491654 0.090661 -0.128009 0.553222
0.833333 0.092259 0.045339 -0.494529 0.061808 -0.147814 0.694080
0.866667 0.095364 0.039776 -0.503019 0.035605 -0.163617 0.850294
0.900000 0.098440 0.034223 -0.513612 0.014384 -0.175673 1.008666
0.933333 0.095106 0.027596 -0.490475 0.000131 -0.184613 1.156792
0.966667 0.091747 0.020997 -0.463389 -0.005384 -0.190736 1.278956
1.000000 0.088367 0.014434 -0.386998 -0.001484 -0.194254 1.363390
1.033333 0.084035 0.007660 -0.290400 0.012011 -0.195354 1.395858
1.066667 0.079692 0.000939 -0.188030 0.034834 -0.194133 1.371590
1.100000 0.077563 -0.006195 -0.099256 0.066081 -0.190590 1.290938
1.133333 0.078020 -0.013728 -0.030318 0.103938 -0.184583 1.161125
1.166667 0.081865 -0.021205 0.009728 0.145928 -0.176382 0.991282
1.200000 0.088743 -0.028070 0.024882 0.189634 -0.166295 0.799032
1.233333 0.098815 -0.033784 0.017760 0.232575 -0.154736 0.604266
1.266667 0.108864 -0.039391 0.001529 0.272511 -0.142031 0.423028
1.300000 0.122209 -0.042656 -0.013976 0.307490 -0.128640 0.270138
1.333333 0.135507 -0.045800 -0.026907 0.336394 -0.114968 0.155802
1.366667 0.148745 -0.048817 -0.033714 0.358874 -0.101236 0.085982
1.400000 0.161907 -0.051703 -0.010424 0.374767 -0.087683 0.052851
1.433333 0.174981 -0.054453 0.000864 0.384365 -0.074410 0.047094
1.466667 0.187952 -0.057060 0.007381 0.387996 -0.061612 0.058318
1.500000 0.200807 -0.059520 0.005701 0.386267 -0.049148 0.073744
1.533333 0.214713 -0.061276 0.014835 0.379743 -0.036970 0.077302
1.566667 0.229452 -0.062531 -0.003311 0.368337 -0.024922 0.055862
1.600000 0.243850 -0.063071 -0.008826 0.352088 -0.012862 0.007456
1.633333 0.257192 -0.062934 -0.004938 0.330384 -0.000366 -0.071170
1.666667 0.268718 -0.062111 0.019137 0.302739 0.012995 -0.178483
1.700000 0.279080 -0.061061 0.043009 0.268901 0.027478 -0.308144
1.733333 0.287655 -0.060035 0.049665 0.228387 0.043944 -0.443674
1.766667 0.296004 -0.058839 0.030518 0.181424 0.063386 -0.568045
1.800000 0.304117 -0.057472 0.012844 0.127769 0.087121 -0.670507
1.833333 0.309022 -0.055822 -0.025928 0.068369 0.115771 -0.730309
1.866667 0.313676 -0.053998 -0.073195 0.003912 0.150041 -0.732540
1.900000 0.312591 -0.050274 -0.145806 -0.064864 0.190503 -0.665597
1.933333 0.311251 -0.046377 -0.202192 -0.136722 0.236749 -0.526476
1.966667 0.303141 -0.037719 -0.287203 -0.209825 0.287369 -0.316437
2.000000 0.294785 -0.028895 -0.303822 -0.281866 0.340375 -0.031015
2.033333 0.286191 -0.019910 -0.297467 -0.351504 0.394130 0.315152
2.066667 0.272271 -0.005375 -0.242857 -0.416840 0.446507 0.704580
2.100000 0.254561 0.013637 -0.197297 -0.476516 0.495297 1.119517
2.133333 0.232855 0.035756 -0.171066 -0.528850 0.538217 1.542561
2.166667 0.210975 0.057978 -0.108183 -0.573145 0.573788 1.955841
2.200000 0.188945 0.080282 -0.033733 -0.608664 0.600861 2.334635
2.233333 0.166787 0.102648 0.034962 -0.633745 0.617905 2.667386
2.266667 0.144524 0.125054 0.166926 -0.647115 0.623980 2.943353
2.300000 0.122179 0.147479 0.250674 -0.647414 0.618527 3.155343
2.333333 0.097599 0.169488 0.426325 -0.634362 0.602132 3.285350
2.366667 0.072987 0.191475 0.549228 -0.607942 0.575571 3.329271
2.400000 0.048367 0.213419 0.678158 -0.568351 0.539556 3.286839
2.433333 0.023765 0.235300 0.810829 -0.517186 0.495521 3.157022
2.466667 0.002873 0.253501 0.956969 -0.456940 0.445407 2.950554
2.500000 -0.013026 0.267724 1.078218 -0.390756 0.391547 2.673442
2.533333 -0.028846 0.281834 1.196634 -0.321524 0.335664 2.352663
2.566667 -0.036335 0.291270 1.258098 -0.252508 0.279718 2.004613
2.600000 -0.038006 0.296729 1.288086 -0.187409 0.226068 1.648629
2.633333 -0.036765 0.299554 1.318433 -0.129446 0.176997 1.305570
2.666667 -0.035425 0.302243 1.329483 -0.080643 0.133845 0.990618
2.700000 -0.033635 0.303779 1.351124 -0.041893 0.097177 0.718195
2.733333 -0.031976 0.304697 1.372500 -0.013891 0.067620 0.493689
2.766667 -0.030389 0.304917 1.361790 0.004158 0.044999 0.319061
2.800000 -0.029306 0.305102 1.358462 0.014044 0.028441 0.190847
2.833333 -0.028863 0.305273 1.357883 0.018070 0.016620 0.102020
2.866667 -0.028339 0.305319 1.350913 0.018190 0.008514 0.042697
2.900000 -0.028164 0.305367 1.348236 0.016032 0.003214 0.005601
2.933333 -0.027911 0.305296 1.351193 0.013224 -0.000268 -0.015260
2.966667 -0.027582 0.305107 1.352320 0.010644 -0.002644 -0.025074
3.000000 -0.027180 0.304805 1.348582 0.008593 -0.004286 -0.027921
