t x y theta dxdt dydt dthetadt
0.000000 0.000000 0.000000 -0.248225 0.013723 0.013194 -0.324592
0.033333 0.000402 0.000304 -0.262010 0.015758 0.017865 -0.361613
0.066667 0.000863 0.000600 -0.273109 0.018104 0.023644 -0.401645
0.100000 0.001384 0.000885 -0.294843 0.020771 0.030509 -0.443480
0.133333 0.002024 0.001449 -0.325617 0.023748 0.038291 -0.479372
0.166667 0.002779 0.002424 -0.336692 0.027047 0.046955 -0.508864
0.200000 0.003697 0.003929 -0.356973 0.030716 0.056641 -0.525253
0.233333 0.004737 0.006075 -0.373116 0.034791 0.067437 -0.521102
0.266667 0.005961 0.008962 -0.388177 0.039304 0.079414 -0.486466
0.300000 0.007253 0.011817 -0.397943 0.044346 0.092816 -0.418772
0.333333 0.008613 0.014637 -0.419526 0.050066 0.108113 -0.323959
0.366667 0.010372 0.018560 -0.452696 0.056547 0.125494 -0.203115
0.400000 0.012200 0.022434 -0.493162 0.063821 0.144964 -0.061166
0.433333 0.014099 0.026254 -0.519382 0.071880 0.166449 0.098147
0.466667 0.016069 0.030011 -0.502026 0.080748 0.189993 0.262931
0.500000 0.018562 0.035723 -0.467678 0.090314 0.215209 0.424990
0.533333 0.021610 0.043339 -0.440743 0.100380 0.241196 0.578645
0.566667 0.025257 0.052823 -0.400799 0.110742 0.267033 0.713502
0.600000 0.028973 0.062204 -0.345690 0.121282 0.291613 0.817768
0.633333 0.033333 0.073028 -0.315758 0.131944 0.313497 0.877149
0.666667 0.038225 0.085070 -0.290339 0.142712 0.330827 0.887363
0.700000 0.043473 0.098041 -0.258944 0.153781 0.341830 0.845108
0.733333 0.048923 0.111692 -0.236140 0.165379 0.345306 0.751452
0.766667 0.054590 0.125673 -0.175706 0.177807 0.340341 0.611393
0.800000 0.060462 0.139367 -0.131341 0.191291 0.326095 0.432254
0.833333 0.066385 0.152838 -0.111458 0.205968 0.302480 0.227465
0.866667 0.072787 0.164897 -0.106819 0.221854 0.269915 0.005934
0.900000 0.079233 0.176695 -0.107884 0.238750 0.229430 -0.223472
0.933333 0.086641 0.186209 -0.114971 0.256410 0.181808 -0.460447
0.966667 0.095259 0.192780 -0.139337 0.274451 0.127721 -0.705210
1.000000 0.105273 0.195890 -0.181465 0.292318 0.068629 -0.955270
1.033333 0.116642 0.195130 -0.258311 0.309397 0.005941 -1.216857
1.066667 0.128021 0.194050 -0.314304 0.325024 -0.058906 -1.495681
1.100000 0.139403 0.192647 -0.340455 0.338516 -0.124907 -1.795710
1.133333 0.151743 0.186741 -0.395885 0.349099 -0.190506 -2.112291
1.166667 0.164065 0.180508 -0.410096 0.356221 -0.254107 -2.438633
1.200000 0.176991 0.169772 -0.460649 0.359416 -0.314566 -2.772060
1.233333 0.189878 0.158716 -0.557356 0.358276 -0.371229 -3.103667
1.266667 0.202818 0.143721 -0.696035 0.352588 -0.423190 -3.418476
1.300000 0.215487 0.125288 -0.855209 0.342229 -0.469022 -3.699388
1.333333 0.228086 0.106565 -1.004840 0.327446 -0.508140 -3.932750
1.366667 0.240607 0.087567 -1.170335 0.308267 -0.539814 -4.106602
1.400000 0.251963 0.067074 -1.337669 0.285036 -0.563602 -4.207911
1.433333 0.261905 0.045750 -1.494500 0.258360 -0.578741 -4.230951
1.466667 0.270095 0.024241 -1.678475 0.228864 -0.585010 -4.177324
1.500000 0.278175 0.002519 -1.794219 0.197334 -0.583104 -4.060879
1.533333 0.284203 -0.018548 -1.927871 0.164471 -0.573271 -3.893680
1.566667 0.288117 -0.038533 -2.060929 0.131345 -0.556087 -3.689805
1.600000 0.291915 -0.058684 -2.187370 0.098810 -0.532311 -3.466098
1.633333 0.293786 -0.076966 -2.307057 0.067636 -0.503252 -3.230191
1.666667 0.295543 -0.095389 -2.418348 0.038407 -0.470280 -2.986015
1.700000 0.295836 -0.111600 -2.508596 0.011682 -0.434536 -2.723183
1.733333 0.294950 -0.125594 -2.578226 -0.012211 -0.397474 -2.434581
1.766667 0.293079 -0.137409 -2.650388 -0.033273 -0.360689 -2.120132
1.800000 0.290512 -0.147146 -2.717771 -0.051456 -0.325661 -1.781628
1.833333 0.287861 -0.156990 -2.790058 -0.067127 -0.293237 -1.427004
1.866667 0.284765 -0.164835 -2.863253 -0.080535 -0.264256 -1.075872
1.900000 0.281304 -0.170661 -2.913210 -0.092276 -0.239266 -0.753688
1.933333 0.277786 -0.176596 -2.963280 -0.102871 -0.218498 -0.484306
1.966667 0.274218 -0.182643 -2.968864 -0.112953 -0.201633 -0.278919
2.000000 0.270611 -0.188807 -2.906377 -0.123256 -0.187979 -0.140468
2.033333 0.266974 -0.195091 -2.824554 -0.134073 -0.177124 -0.069410
2.066667 0.262591 -0.200394 -2.726240 -0.145715 -0.168326 -0.049475
2.100000 0.258199 -0.205825 -2.706522 -0.158141 -0.160792 -0.056388
2.133333 0.253808 -0.211390 -2.740382 -0.171259 -0.153822 -0.063715
2.166667 0.247706 -0.216428 -2.764345 -0.184504 -0.147166 -0.054261
2.200000 0.241630 -0.221610 -2.841912 -0.197257 -0.140756 -0.012850
2.233333 0.233912 -0.226017 -2.896674 -0.208801 -0.134554 0.069727
2.266667 0.226249 -0.230581 -2.957533 -0.218478 -0.128650 0.190778
2.300000 0.217425 -0.234171 -2.996804 -0.225651 -0.123411 0.331002
2.333333 0.208687 -0.237932 -2.978917 -0.229736 -0.119221 0.461797
2.366667 0.200053 -0.241872 -2.920028 -0.230444 -0.116188 0.561550
2.400000 0.191365 -0.245204 -2.809014 -0.227472 -0.114483 0.603131
2.433333 0.182856 -0.248217 -2.679662 -0.220812 -0.114069 0.568762
2.466667 0.174794 -0.251333 -2.585847 -0.210234 -0.114857 0.449443
2.500000 0.167488 -0.254833 -2.562715 -0.195576 -0.116400 0.253209
2.533333 0.160369 -0.258558 -2.580899 -0.176654 -0.118245 0.003396
2.566667 0.154746 -0.262651 -2.619339 -0.153599 -0.120081 -0.273175
2.600000 0.149342 -0.266989 -2.682751 -0.126572 -0.121467 -0.542166
2.633333 0.144171 -0.271580 -2.729529 -0.095910 -0.122109 -0.776501
2.666667 0.139248 -0.276433 -2.788743 -0.062285 -0.121595 -0.956820
2.700000 0.136943 -0.281030 -2.861332 -0.026483 -0.121553 -1.079591
2.733333 0.134914 -0.285908 -2.912514 0.010708 -0.123608 -1.149573
2.766667 0.135714 -0.290208 -2.940917 0.048698 -0.129433 -1.174405
2.800000 0.139214 -0.293752 -2.972910 0.086712 -0.140854 -1.164127
2.833333 0.145286 -0.296328 -2.978003 0.123994 -0.159764 -1.119546
2.866667 0.151665 -0.299228 -2.998032 0.159774 -0.188314 -1.033438
2.900000 0.158354 -0.302464 -3.024686 0.193127 -0.224968 -0.892581
2.933333 0.165357 -0.306049 -3.059794 0.222953 -0.268071 -0.679822
2.966667 0.172679 -0.309995 -3.113498 0.248280 -0.315753 -0.385659
3.000000 0.180545 -0.311004 3.093722 0.268520 -0.366241 -0.004050
3.033333 0.191918 -0.332265 3.014579 0.282999 -0.415939 0.457960
3.066667 0.203615 -0.353908 2.979701 0.291368 -0.461400 0.980664
3.100000 0.215635 -0.375924 3.014668 0.293683 -0.501189 1.536834
3.133333 0.227979 -0.398307 3.081018 0.290355 -0.534098 2.085482
3.166667 0.240646 -0.421048 -3.073059 0.281789 -0.559273 2.586401
3.200000 0.251831 -0.441629 -2.914075 0.268383 -0.575615 2.995456
3.233333 0.261371 -0.460686 -2.766960 0.251293 -0.585688 3.281812
3.266667 0.269147 -0.478765 -2.561778 0.231703 -0.591967 3.420342
3.300000 0.274913 -0.496568 -2.386511 0.210690 -0.596991 3.406694
3.333333 0.281023 -0.514709 -2.221574 0.189163 -0.603191 3.251259
3.366667 0.284997 -0.533830 -2.109934 0.168318 -0.612671 2.980477
3.400000 0.289334 -0.553284 -2.006529 0.149032 -0.627389 2.630477
3.433333 0.294046 -0.573068 -1.944206 0.131663 -0.647088 2.233815
3.466667 0.299145 -0.593181 -1.905416 0.116220 -0.671287 1.835053
3.500000 0.302338 -0.615671 -1.864238 0.102812 -0.698925 1.462058
3.533333 0.305942 -0.638480 -1.851403 0.091594 -0.728975 1.142140
3.566667 0.307956 -0.663879 -1.826959 0.082495 -0.760249 0.884639
3.600000 0.310412 -0.689582 -1.825725 0.075696 -0.791754 0.698685
3.633333 0.311661 -0.717577 -1.821757 0.071736 -0.822478 0.588661
3.666667 0.313385 -0.745854 -1.827523 0.071464 -0.851488 0.546487
3.700000 0.314328 -0.775863 -1.803448 0.075455 -0.878227 0.569449
3.733333 0.315783 -0.806130 -1.799690 0.084180 -0.902069 0.647865
3.766667 0.317149 -0.837668 -1.782821 0.098108 -0.922753 0.776599
3.800000 0.319064 -0.869437 -1.755467 0.117675 -0.940061 0.941689
3.833333 0.321839 -0.901820 -1.749831 0.142718 -0.954217 1.129196
3.866667 0.325790 -0.934827 -1.723131 0.172742 -0.965473 1.327185
3.900000 0.330345 -0.968019 -1.673805 0.207460 -0.974183 1.521197
3.933333 0.336805 -1.001200 -1.616163 0.246522 -0.980753 1.697189
3.966667 0.345353 -1.034201 -1.527812 0.289149 -0.985599 1.838780
4.000000 0.356211 -1.066988 -1.449489 0.334150 -0.989138 1.937608
4.033333 0.367733 -1.099898 -1.357759 0.380642 -0.991660 1.985032
4.066667 0.379932 -1.132913 -1.271744 0.427974 -0.993496 1.974704
4.100000 0.395027 -1.166024 -1.179188 0.475149 -0.994819 1.904399
4.133333 0.413077 -1.199308 -1.106906 0.521198 -0.995763 1.777108
4.166667 0.431830 -1.232651 -1.054317 0.565628 -0.996321 1.604662
4.200000 0.451292 -1.266038 -0.991239 0.608516 -0.996352 1.396563
4.233333 0.473978 -1.299382 -0.944549 0.649709 -0.995689 1.167182
4.266667 0.497380 -1.332738 -0.904780 0.689096 -0.994035 0.929828
4.300000 0.521501 -1.366091 -0.886520 0.726943 -0.991105 0.699925
4.333333 0.546343 -1.399426 -0.875080 0.763790 -0.986651 0.487349
4.366667 0.571905 -1.432727 -0.877517 0.800055 -0.980451 0.299714
4.400000 0.598190 -1.465978 -0.879025 0.835875 -0.972402 0.139741
4.433333 0.627013 -1.498554 -0.886094 0.871652 -0.962441 0.010997
4.466667 0.656557 -1.531050 -0.895913 0.907647 -0.950607 -0.083931
4.500000 0.686821 -1.563451 -0.917228 0.943902 -0.936965 -0.150900
4.533333 0.719047 -1.594724 -0.918820 0.980165 -0.921664 -0.191714
4.566667 0.751987 -1.625874 -0.934962 1.016179 -0.904773 -0.214033
4.600000 0.786717 -1.655753 -0.946918 1.051547 -0.886469 -0.216660
4.633333 0.823370 -1.684493 -0.940173 1.085829 -0.866858 -0.207968
4.666667 0.860719 -1.713075 -0.956552 1.118584 -0.846098 -0.193990
4.700000 0.898758 -1.741489 -0.945331 1.149426 -0.824408 -0.178498
4.733333 0.938222 -1.768722 -0.976653 1.178103 -0.801909 -0.161742
4.766667 0.978358 -1.795768 -0.972416 1.204376 -0.778876 -0.145658
4.800000 1.019581 -1.821525 -0.967123 1.228265 -0.755547 -0.136988
4.833333 1.061685 -1.846048 -0.982104 1.249905 -0.732259 -0.132247
4.866667 1.104432 -1.870360 -0.978903 1.269498 -0.709352 -0.133626
4.900000 1.147702 -1.893520 -0.985737 1.287300 -0.687224 -0.137360
4.933333 1.191280 -1.915592 -0.978295 1.303634 -0.666294 -0.149998
4.966667 1.235013 -1.936756 -0.986579 1.318873 -0.646955 -0.167805
5.000000 1.279109 -1.957221 -0.993393 1.333368 -0.629482 -0.188355
5.033333 1.323657 -1.977128 -1.003261 1.347377 -0.613999 -0.213612
5.066667 1.368642 -1.996628 -1.000187 1.361162 -0.600575 -0.239682
5.100000 1.414081 -2.015888 -1.014209 1.374972 -0.589065 -0.269117
5.133333 1.460077 -2.034910 -1.021233 1.388933 -0.579246 -0.297298
5.166667 1.506621 -2.053855 -1.035728 1.403084 -0.570766 -0.324093
5.200000 1.553643 -2.072743 -1.054814 1.417394 -0.563268 -0.348930
5.233333 1.601127 -2.091558 -1.064987 1.431794 -0.556428 -0.369138
5.266667 1.649123 -2.110129 -1.072128 1.446188 -0.549905 -0.385037
5.300000 1.697617 -2.128456 -1.081417 1.460463 -0.543448 -0.395137
5.333333 1.746599 -2.146536 -1.103150 1.474509 -0.536852 -0.396877
5.366667 1.796056 -2.164368 -1.120589 1.488249 -0.529998 -0.393280
5.400000 1.845976 -2.181952 -1.124929 1.501587 -0.522798 -0.384122
5.433333 1.896346 -2.199287 -1.155154 1.514427 -0.515221 -0.371411
5.466667 1.947154 -2.216371 -1.170309 1.526646 -0.507213 -0.355926
5.500000 1.998386 -2.233204 -1.166993 1.538120 -0.498687 -0.336429
5.533333 2.050031 -2.249785 -1.196719 1.548743 -0.489578 -0.315249
5.566667 2.102074 -2.266114 -1.190458 1.558399 -0.479779 -0.288827
5.600000 2.154503 -2.282191 -1.194003 1.567036 -0.469226 -0.256250
5.633333 2.207303 -2.298015 -1.214473 1.574609 -0.457845 -0.218351
5.666667 2.260143 -2.313262 -1.207133 1.581172 -0.445672 -0.175267
5.700000 2.313328 -2.328255 -1.224254 1.586798 -0.432804 -0.130299
5.733333 2.366435 -2.342575 -1.232242 1.591648 -0.419420 -0.086602
5.766667 2.419860 -2.356642 -1.246131 1.595896 -0.405755 -0.047395
5.800000 2.473117 -2.369989 -1.256032 1.599776 -0.392111 -0.014057
5.833333 2.526573 -2.382718 -1.244024 1.603556 -0.378884 0.014885
5.866667 2.579814 -2.394774 -1.235404 1.607461 -0.366398 0.037949
5.900000 2.633255 -2.406254 -1.203621 1.611716 -0.354973 0.053176
5.933333 2.686811 -2.417359 -1.192856 1.616474 -0.344913 0.061321
5.966667 2.740608 -2.428227 -1.207102 1.621907 -0.336573 0.062035
6.000000 2.794577 -2.438926 -1.194489 1.628067 -0.330200 0.049577
6.033333 2.848762 -2.449393 -1.222637 1.634959 -0.325918 0.022765
6.066667 2.903151 -2.459634 -1.220884 1.642555 -0.323861 -0.017015
6.100000 2.957732 -2.469652 -1.222673 1.650819 -0.324103 -0.064756
6.133333 3.012849 -2.479969 -1.216863 1.659637 -0.326531 -0.120061
6.166667 3.068465 -2.490780 -1.191050 1.668880 -0.330825 -0.184312
6.200000 3.124231 -2.501376 -1.194920 1.678424 -0.336607 -0.247463
6.233333 3.180135 -2.511760 -1.217411 1.688197 -0.343468 -0.307382
6.266667 3.236489 -2.522860 -1.216442 1.698072 -0.350861 -0.362388
6.300000 3.293274 -2.534746 -1.236186 1.707903 -0.358183 -0.406946
6.333333 3.350460 -2.547319 -1.275364 1.717667 -0.364925 -0.433963
6.366667 3.408011 -2.560407 -1.296319 1.727270 -0.370682 -0.434646
6.400000 3.466015 -2.573866 -1.308172 1.736667 -0.375055 -0.411075
6.433333 3.524066 -2.587114 -1.347392 1.745709 -0.377698 -0.363075
6.466667 3.582146 -2.600148 -1.366167 1.754414 -0.378461 -0.289505
6.500000 3.641018 -2.613200 -1.380030 1.762858 -0.377330 -0.198074
6.533333 3.699886 -2.626034 -1.382638 1.771036 -0.374408 -0.097914
6.566667 3.759479 -2.638679 -1.378955 1.778966 -0.369878 0.003885
6.600000 3.819031 -2.651103 -1.372561 1.786630 -0.364058 0.100583
6.633333 3.878527 -2.663304 -1.346444 1.794136 -0.357262 0.185683
6.666667 3.938574 -2.675223 -1.339896 1.801359 -0.349753 0.253216
6.700000 3.998527 -2.686916 -1.329193 1.808217 -0.341777 0.301850
6.733333 4.058957 -2.698167 -1.311680 1.814611 -0.333515 0.335762
6.766667 4.119252 -2.709189 -1.303652 1.820539 -0.325096 0.353678
6.800000 4.180310 -2.719840 -1.284283 1.826012 -0.316595 0.362321
6.833333 4.242067 -2.730123 -1.261495 1.830847 -0.308119 0.366515
6.866667 4.303629 -2.740172 -1.257647 1.835099 -0.299753 0.370080
6.900000 4.364973 -2.749986 -1.236063 1.838702 -0.291552 0.372847
6.933333 4.426079 -2.759565 -1.253062 1.841719 -0.283528 0.373738
6.966667 4.487656 -2.768812 -1.236598 1.844115 -0.275672 0.374025
7.000000 4.548951 -2.777823 -1.230814 1.845914 -0.267914 0.371613
7.033333 4.611013 -2.786588 -1.208653 1.847285 -0.260111 0.364346
7.066667 4.672747 -2.795115 -1.173825 1.848230 -0.252116 0.349520
7.100000 4.734130 -2.803403 -1.176938 1.848745 -0.243786 0.331337
7.133333 4.796008 -2.811493 -1.153067 1.848604 -0.234935 0.305157
7.166667 4.857487 -2.819343 -1.138929 1.847650 -0.225404 0.272826
7.200000 4.919230 -2.827009 -1.128909 1.845570 -0.215112 0.232131
7.233333 4.981093 -2.834399 -1.123094 1.842054 -0.204079 0.188458
7.266667 5.042888 -2.841429 -1.124860 1.836815 -0.192338 0.149245
7.300000 5.104474 -2.847953 -1.133308 1.829431 -0.179828 0.116644
7.333333 5.166131 -2.853847 -1.120264 1.819502 -0.166585 0.102926
7.366667 5.227582 -2.858982 -1.131633 1.806350 -0.152592 0.118453
7.400000 5.288460 -2.863880 -1.116133 1.789242 -0.137764 0.174591
7.433333 5.348740 -2.868543 -1.111836 1.767482 -0.121968 0.275618
7.466667 5.407944 -2.872016 -1.130471 1.740253 -0.105142 0.422659
7.500000 5.466500 -2.875258 -1.132890 1.706900 -0.087446 0.613841
7.533333 5.524383 -2.878273 -1.139383 1.667134 -0.069082 0.844539
7.566667 5.581570 -2.881063 -1.127348 1.620947 -0.050385 1.096439
7.600000 5.638037 -2.883632 -1.084706 1.568731 -0.031783 1.353662
7.633333 5.691845 -2.884599 -1.036729 1.510996 -0.013820 1.600568
7.666667 5.742642 -2.884219 -0.976676 1.448623 0.002970 1.820218
7.700000 5.790123 -2.882680 -0.871906 1.382953 0.018136 1.999751
7.733333 5.834110 -2.880363 -0.760301 1.315323 0.031243 2.124638
7.766667 5.877290 -2.877854 -0.658689 1.247120 0.041949 2.195881
7.800000 5.916917 -2.875300 -0.555692 1.179738 0.049976 2.214623
7.833333 5.953130 -2.872974 -0.475128 1.114465 0.055312 2.184952
7.866667 5.988514 -2.870478 -0.400619 1.052352 0.058114 2.113494
7.900000 6.020592 -2.868549 -0.359514 0.994019 0.058726 2.013738
7.933333 6.051837 -2.866465 -0.298692 0.939628 0.057591 1.897869
7.966667 6.082248 -2.864232 -0.249980 0.889434 0.055164 1.772974
8.000000 6.109771 -2.862660 -0.194338 0.843403 0.051941 1.642313
8.033333 6.136463 -2.860951 -0.134377 0.801278 0.048201 1.509032
8.066667 6.162329 -2.859113 -0.082115 0.762876 0.044171 1.375460
8.100000 6.185929 -2.857934 -0.026471 0.727954 0.039937 1.234988
8.133333 6.208712 -2.856636 0.030489 0.696489 0.035541 1.086496
8.166667 6.230684 -2.855223 0.064272 0.668212 0.031082 0.929761
8.200000 6.251735 -2.854490 0.087829 0.642718 0.026625 0.771420
8.233333 6.271989 -2.853652 0.118210 0.619654 0.022375 0.614734
8.266667 6.291451 -2.852714 0.125557 0.598505 0.018551 0.467168
8.300000 6.310867 -2.852423 0.138308 0.578603 0.015370 0.337925
8.333333 6.329508 -2.852039 0.122824 0.559283 0.013050 0.236677
8.366667 6.348053 -2.852024 0.126235 0.539882 0.011781 0.166114
8.400000 6.366317 -2.852184 0.108946 0.519800 0.011697 0.126020
8.433333 6.384138 -2.852301 0.108649 0.498465 0.012863 0.115583
8.466667 6.401211 -2.852335 0.104563 0.475491 0.015247 0.130218
8.500000 6.417543 -2.852289 0.109711 0.450761 0.018754 0.163133
8.533333 6.432806 -2.851883 0.116700 0.424133 0.023273 0.199966
8.566667 6.446778 -2.851062 0.119898 0.395627 0.028586 0.236142
8.600000 6.459176 -2.849732 0.128671 0.365584 0.034412 0.262863
8.633333 6.470868 -2.848332 0.150701 0.334537 0.040420 0.277643
8.666667 6.481864 -2.846868 0.182656 0.302948 0.046314 0.275334
8.700000 6.492175 -2.845342 0.197059 0.271219 0.051862 0.255772
8.733333 6.500551 -2.843376 0.215136 0.239948 0.056795 0.224338
8.766667 6.507098 -2.841053 0.207311 0.209679 0.060914 0.182587
8.800000 6.512998 -2.838680 0.220589 0.180717 0.064165 0.135335
8.833333 6.518265 -2.836260 0.218735 0.153309 0.066530 0.086294
8.866667 6.522246 -2.833700 0.209303 0.127813 0.067956 0.042169
8.900000 6.525623 -2.831102 0.208230 0.104634 0.068364 0.006873
8.933333 6.528131 -2.828574 0.198718 0.083892 0.067804 -0.017761
8.966667 6.529949 -2.826249 0.203041 0.065618 0.066348 -0.033020
9.000000 6.531212 -2.823898 0.206525 0.049890 0.064026 -0.038379
9.033333 6.531938 -2.821526 0.195686 0.036715 0.060898 -0.037127
9.066667 6.532571 -2.819562 0.198043 0.025893 0.057126 -0.032834
9.100000 6.532700 -2.817582 0.189336 0.017162 0.052921 -0.027385
9.133333 6.532341 -2.815591 0.188489 0.010347 0.048409 -0.023494
9.166667 6.532136 -2.813970 0.203295 0.005241 0.043724 -0.019858
9.200000 6.532080 -2.812684 0.199996 0.001584 0.039027 -0.017369
9.233333 6.532239 -2.811716 0.202407 -0.000982 0.034501 -0.018781
9.266667 6.531973 -2.810744 0.199876 -0.002729 0.030235 -0.021082
