t x y theta dxdt dydt dthetadt
0.000000 0.000000 0.000000 0.304714 0.045722 -0.052448 0.003811
0.033333 0.001573 -0.001872 0.312791 0.048958 -0.055969 0.006237
0.066667 0.003253 -0.003838 0.316489 0.052328 -0.059636 0.006533
0.100000 0.005039 -0.005900 0.315710 0.055882 -0.063541 0.005182
0.133333 0.006934 -0.008059 0.312809 0.059692 -0.067810 0.004596
0.166667 0.008938 -0.010314 0.318794 0.063828 -0.072564 0.005201
0.200000 0.011050 -0.012668 0.313169 0.068393 -0.077979 0.003113
0.233333 0.013272 -0.015119 0.323258 0.073490 -0.084240 -0.000106
0.266667 0.015603 -0.017670 0.311621 0.079191 -0.091478 -0.002515
0.300000 0.018178 -0.020581 0.309643 0.085554 -0.099791 -0.004092
0.333333 0.020862 -0.023591 0.319809 0.092628 -0.109268 -0.010960
0.366667 0.023835 -0.027012 0.311427 0.100412 -0.119918 -0.027105
0.400000 0.027108 -0.030870 0.313122 0.108837 -0.131623 -0.063402
0.433333 0.030713 -0.035207 0.313504 0.117813 -0.144205 -0.127228
0.466667 0.034683 -0.040050 0.318779 0.127247 -0.157476 -0.230673
0.500000 0.039043 -0.045442 0.311536 0.137047 -0.171205 -0.382325
0.533333 0.043811 -0.051452 0.318692 0.147046 -0.185032 -0.582351
0.566667 0.049018 -0.058123 0.303186 0.157176 -0.198651 -0.831036
0.600000 0.054323 -0.064879 0.309174 0.167424 -0.211861 -1.116552
0.633333 0.060144 -0.072395 0.309313 0.177803 -0.224413 -1.427401
0.666667 0.066494 -0.080700 0.269212 0.188412 -0.236060 -1.743404
0.700000 0.072930 -0.089075 0.192482 0.199382 -0.246589 -2.044249
0.733333 0.079448 -0.097516 0.067251 0.211002 -0.255912 -2.306535
0.766667 0.086566 -0.106589 -0.055625 0.223412 -0.263937 -2.505032
0.800000 0.093756 -0.115715 -0.158183 0.236794 -0.270515 -2.621435
0.833333 0.101704 -0.125259 -0.265395 0.251254 -0.275574 -2.643261
0.866667 0.109711 -0.134844 -0.368964 0.266844 -0.279125 -2.572093
0.900000 0.118665 -0.144640 -0.511357 0.283462 -0.281157 -2.411307
0.933333 0.127664 -0.154463 -0.630062 0.300835 -0.281666 -2.178883
0.966667 0.137680 -0.164267 -0.712859 0.318743 -0.280712 -1.897165
1.000000 0.148675 -0.173963 -0.744128 0.336792 -0.278399 -1.589967
1.033333 0.160616 -0.183478 -0.779140 0.354591 -0.274889 -1.279254
1.066667 0.173428 -0.192729 -0.794762 0.371620 -0.270351 -0.980253
1.100000 0.186236 -0.201971 -0.800296 0.387513 -0.265012 -0.713273
1.133333 0.199753 -0.210870 -0.805661 0.401924 -0.259093 -0.489017
1.166667 0.213875 -0.219407 -0.805681 0.414588 -0.252782 -0.313141
1.200000 0.228552 -0.227592 -0.802753 0.425356 -0.246289 -0.184074
1.233333 0.243708 -0.235419 -0.802261 0.434139 -0.239795 -0.098452
1.266667 0.258791 -0.243208 -0.806764 0.441035 -0.233411 -0.051024
1.300000 0.273786 -0.250954 -0.796142 0.446089 -0.227235 -0.031468
1.333333 0.289022 -0.258385 -0.794085 0.449398 -0.221358 -0.030846
1.366667 0.304426 -0.265538 -0.795353 0.451015 -0.215861 -0.042886
1.400000 0.319694 -0.272633 -0.789546 0.450995 -0.210780 -0.064979
1.433333 0.334992 -0.279507 -0.794747 0.449365 -0.206119 -0.094055
1.466667 0.350253 -0.286188 -0.809729 0.446079 -0.201912 -0.126793
1.500000 0.365449 -0.292700 -0.808132 0.441099 -0.198189 -0.159951
1.533333 0.380500 -0.299088 -0.816906 0.434424 -0.194939 -0.186940
1.566667 0.395326 -0.305380 -0.815743 0.426024 -0.192130 -0.202199
1.600000 0.409856 -0.311599 -0.820867 0.415908 -0.189724 -0.199208
1.633333 0.424137 -0.317735 -0.828601 0.404075 -0.187663 -0.175531
1.666667 0.437952 -0.323865 -0.852727 0.390452 -0.185858 -0.129962
1.700000 0.451165 -0.330007 -0.868927 0.374898 -0.184186 -0.059114
1.733333 0.463610 -0.336189 -0.888520 0.357162 -0.182517 0.031841
1.766667 0.475091 -0.342405 -0.889293 0.337060 -0.180704 0.136205
1.800000 0.486246 -0.348518 -0.887094 0.314243 -0.178588 0.242090
1.833333 0.497064 -0.354525 -0.883642 0.288503 -0.176035 0.341425
1.866667 0.507531 -0.360421 -0.856105 0.259692 -0.172910 0.421701
1.900000 0.516525 -0.366300 -0.819673 0.227925 -0.169114 0.464981
1.933333 0.525143 -0.372061 -0.785652 0.193469 -0.164603 0.462806
1.966667 0.532119 -0.377714 -0.755994 0.156637 -0.159357 0.415028
2.000000 0.537391 -0.383204 -0.730639 0.118001 -0.153362 0.328681
2.033333 0.540877 -0.388462 -0.684151 0.078146 -0.146612 0.207838
2.066667 0.542548 -0.393418 -0.666978 0.037918 -0.139169 0.066224
2.100000 0.542365 -0.398041 -0.662674 -0.001992 -0.131110 -0.075251
2.133333 0.540320 -0.402260 -0.699446 -0.040924 -0.122446 -0.198008
2.166667 0.537855 -0.406339 -0.722473 -0.078287 -0.113242 -0.296239
2.200000 0.533566 -0.409905 -0.763269 -0.113585 -0.103585 -0.366345
2.233333 0.528856 -0.413327 -0.818566 -0.146555 -0.093544 -0.400112
2.266667 0.523727 -0.416605 -0.848836 -0.177326 -0.083069 -0.399335
2.300000 0.516948 -0.419258 -0.846063 -0.206108 -0.072051 -0.372897
2.333333 0.508606 -0.421228 -0.853373 -0.233134 -0.060467 -0.336706
2.366667 0.499854 -0.423051 -0.848385 -0.258633 -0.048251 -0.295037
2.400000 0.490696 -0.424726 -0.852649 -0.282938 -0.035380 -0.252572
2.433333 0.481136 -0.426255 -0.843553 -0.306262 -0.021811 -0.219308
2.466667 0.470291 -0.426859 -0.822756 -0.328547 -0.007708 -0.199030
2.500000 0.459055 -0.427317 -0.834905 -0.349756 0.006719 -0.188029
2.533333 0.446701 -0.426772 -0.858895 -0.369861 0.021231 -0.175600
2.566667 0.433971 -0.426086 -0.872128 -0.388839 0.035587 -0.160341
2.600000 0.420366 -0.424519 -0.898484 -0.406566 0.049525 -0.138738
2.633333 0.406019 -0.422154 -0.901007 -0.422847 0.062667 -0.107524
2.666667 0.391049 -0.419084 -0.919762 -0.437602 0.074762 -0.060843
2.700000 0.375737 -0.415886 -0.917442 -0.450679 0.085575 -0.003305
2.733333 0.360093 -0.412565 -0.911625 -0.462042 0.095010 0.056393
2.766667 0.344152 -0.408820 -0.896853 -0.471581 0.102917 0.116980
2.800000 0.327897 -0.404963 -0.892208 -0.479277 0.109275 0.171189
2.833333 0.311340 -0.400998 -0.875237 -0.485266 0.114219 0.218550
2.866667 0.294849 -0.396873 -0.851236 -0.489710 0.117916 0.251655
2.900000 0.278075 -0.392651 -0.863840 -0.492682 0.120501 0.273709
2.933333 0.261027 -0.388339 -0.844697 -0.494073 0.122015 0.287128
2.966667 0.244289 -0.384082 -0.838698 -0.493877 0.122588 0.292966
3.000000 0.227945 -0.379944 -0.823427 -0.492021 0.122283 0.295110
3.033333 0.211356 -0.375733 -0.812866 -0.488278 0.121069 0.291915
3.066667 0.194529 -0.371453 -0.803997 -0.482465 0.118928 0.285865
3.100000 0.178351 -0.367440 -0.800555 -0.474652 0.115933 0.273353
3.133333 0.161952 -0.363368 -0.802206 -0.465098 0.112214 0.256444
3.166667 0.145340 -0.359245 -0.779482 -0.454071 0.107887 0.234688
3.200000 0.129575 -0.355464 -0.760186 -0.441988 0.103115 0.207659
3.233333 0.114694 -0.352005 -0.746962 -0.429500 0.098145 0.178026
3.266667 0.100719 -0.348868 -0.740726 -0.417280 0.093197 0.146983
3.300000 0.087626 -0.346037 -0.745374 -0.405846 0.088419 0.117337
3.333333 0.075325 -0.343485 -0.741531 -0.395708 0.083955 0.087937
3.366667 0.063720 -0.341200 -0.747731 -0.387404 0.079955 0.060832
3.400000 0.051931 -0.338891 -0.752498 -0.381268 0.076496 0.038325
3.433333 0.039960 -0.336560 -0.748911 -0.377407 0.073555 0.016437
3.466667 0.027808 -0.334211 -0.754662 -0.375807 0.071067 -0.006072
3.500000 0.015476 -0.331846 -0.747292 -0.376398 0.068956 -0.033098
3.533333 0.002965 -0.329468 -0.749670 -0.378944 0.067091 -0.064529
3.566667 -0.009724 -0.327080 -0.743706 -0.383103 0.065277 -0.103038
3.600000 -0.022415 -0.324886 -0.745679 -0.388630 0.063366 -0.149077
3.633333 -0.035219 -0.322882 -0.742214 -0.395354 0.061265 -0.194226
3.666667 -0.048199 -0.320876 -0.747452 -0.403140 0.058899 -0.234438
3.700000 -0.061353 -0.318871 -0.749140 -0.411886 0.056216 -0.262759
3.733333 -0.074680 -0.316869 -0.758193 -0.421569 0.053194 -0.275847
3.766667 -0.088545 -0.315037 -0.800095 -0.432146 0.049865 -0.269043
3.800000 -0.103000 -0.313364 -0.823520 -0.443512 0.046239 -0.242437
3.833333 -0.118116 -0.311899 -0.846824 -0.455479 0.042328 -0.199160
3.866667 -0.133398 -0.310445 -0.861911 -0.467831 0.038169 -0.142077
3.900000 -0.149347 -0.309214 -0.863660 -0.480299 0.033833 -0.075850
3.933333 -0.165457 -0.307997 -0.857942 -0.492610 0.029390 -0.004749
3.966667 -0.182172 -0.307044 -0.837150 -0.504516 0.024922 0.064206
4.000000 -0.199431 -0.306356 -0.820974 -0.515814 0.020518 0.127717
4.033333 -0.217204 -0.305921 -0.808678 -0.526361 0.016275 0.179519
4.066667 -0.235124 -0.305505 -0.793958 -0.536033 0.012268 0.217959
4.100000 -0.253456 -0.305323 -0.799890 -0.544768 0.008555 0.245020
4.133333 -0.271925 -0.305160 -0.804725 -0.552485 0.005193 0.262332
4.166667 -0.290738 -0.305180 -0.785456 -0.559130 0.002210 0.271603
4.200000 -0.309679 -0.305220 -0.774436 -0.564687 -0.000385 0.275612
4.233333 -0.328838 -0.305387 -0.773471 -0.569172 -0.002608 0.280123
4.266667 -0.348114 -0.305574 -0.758739 -0.572590 -0.004471 0.284693
4.300000 -0.367502 -0.305781 -0.742534 -0.574990 -0.006012 0.286476
4.333333 -0.386942 -0.306074 -0.736450 -0.576460 -0.007267 0.283962
4.366667 -0.406483 -0.306388 -0.731525 -0.577141 -0.008284 0.280259
4.400000 -0.425953 -0.306733 -0.705818 -0.577097 -0.009090 0.273189
4.433333 -0.445340 -0.307097 -0.696528 -0.576394 -0.009709 0.260779
4.466667 -0.464584 -0.307470 -0.687535 -0.575180 -0.010180 0.244382
4.500000 -0.483616 -0.307822 -0.692924 -0.573593 -0.010525 0.226845
4.533333 -0.502725 -0.308194 -0.687338 -0.571741 -0.010780 0.208970
4.566667 -0.521909 -0.308586 -0.674500 -0.569655 -0.010952 0.190404
4.600000 -0.540694 -0.308931 -0.669234 -0.567479 -0.011071 0.173082
4.633333 -0.559547 -0.309295 -0.659437 -0.565315 -0.011147 0.148818
4.666667 -0.578461 -0.309679 -0.652837 -0.563186 -0.011166 0.110840
4.700000 -0.597435 -0.310082 -0.655343 -0.561078 -0.011087 0.050158
4.733333 -0.615835 -0.310426 -0.656553 -0.559055 -0.010835 -0.039785
4.766667 -0.634288 -0.310790 -0.639812 -0.557253 -0.010354 -0.167792
4.800000 -0.652790 -0.311173 -0.644507 -0.555691 -0.009568 -0.333195
4.833333 -0.671339 -0.311577 -0.643787 -0.554423 -0.008425 -0.519870
4.866667 -0.689933 -0.312000 -0.641340 -0.553515 -0.006906 -0.710216
4.900000 -0.708119 -0.312344 -0.622973 -0.553072 -0.005046 -0.886773
4.933333 -0.726345 -0.312708 -0.642875 -0.553093 -0.002915 -1.029983
4.966667 -0.744501 -0.312966 -0.728267 -0.553587 -0.000570 -1.114333
5.000000 -0.762712 -0.313046 -0.820875 -0.554637 0.001919 -1.127101
5.033333 -0.781101 -0.312893 -0.912595 -0.556305 0.004469 -1.064342
5.066667 -0.799741 -0.312365 -0.999311 -0.558637 0.006982 -0.926245
5.100000 -0.818409 -0.311861 -1.069704 -0.561645 0.009397 -0.714047
5.133333 -0.837102 -0.311384 -1.089816 -0.565367 0.011633 -0.440987
5.166667 -0.855817 -0.310934 -1.093413 -0.569746 0.013605 -0.131323
5.200000 -0.874552 -0.310514 -1.064502 -0.574650 0.015242 0.187932
5.233333 -0.893304 -0.310125 -1.021138 -0.579994 0.016510 0.492386
5.266667 -0.912523 -0.309519 -0.974237 -0.585692 0.017425 0.755640
5.300000 -0.932202 -0.308784 -0.933246 -0.591594 0.017979 0.956745
5.333333 -0.952362 -0.307971 -0.878872 -0.597504 0.018187 1.088110
5.366667 -0.972525 -0.307198 -0.836701 -0.603280 0.018063 1.147846
5.400000 -0.992689 -0.306466 -0.773542 -0.608821 0.017616 1.144979
5.433333 -1.013231 -0.305796 -0.719559 -0.613933 0.016848 1.089740
5.466667 -1.034114 -0.305209 -0.679447 -0.618452 0.015773 0.998009
5.500000 -1.054984 -0.304670 -0.634239 -0.622321 0.014431 0.881415
5.533333 -1.075837 -0.304181 -0.620081 -0.625563 0.012879 0.749609
5.566667 -1.096957 -0.303794 -0.597351 -0.628150 0.011187 0.614647
5.600000 -1.118049 -0.303461 -0.593929 -0.630047 0.009438 0.485775
5.633333 -1.139109 -0.303185 -0.580573 -0.631299 0.007698 0.369780
5.666667 -1.160298 -0.302978 -0.563659 -0.631944 0.006022 0.268593
5.700000 -1.181561 -0.302830 -0.572907 -0.631955 0.004469 0.187442
5.733333 -1.202776 -0.302747 -0.577958 -0.631258 0.003104 0.126961
5.766667 -1.223968 -0.302677 -0.576322 -0.629825 0.001979 0.084661
5.800000 -1.245102 -0.302676 -0.582514 -0.627650 0.001124 0.056312
5.833333 -1.266173 -0.302747 -0.577396 -0.624697 0.000576 0.037348
5.866667 -1.287177 -0.302891 -0.582560 -0.620965 0.000337 0.028817
5.900000 -1.308011 -0.302994 -0.566825 -0.616476 0.000390 0.023807
5.933333 -1.328644 -0.303044 -0.574082 -0.611270 0.000687 0.019951
5.966667 -1.349195 -0.303175 -0.563377 -0.605413 0.001167 0.014838
6.000000 -1.369466 -0.303198 -0.572407 -0.598975 0.001766 0.010088
6.033333 -1.389424 -0.303111 -0.571459 -0.591996 0.002422 0.007025
6.066667 -1.409019 -0.302901 -0.570093 -0.584457 0.003100 0.003390
6.100000 -1.428210 -0.302561 -0.560888 -0.576342 0.003767 0.003462
6.133333 -1.447299 -0.302318 -0.570987 -0.567671 0.004388 0.007104
6.166667 -1.466283 -0.302178 -0.573628 -0.558377 0.004969 0.014639
6.200000 -1.485161 -0.302143 -0.571790 -0.548298 0.005572 0.022153
6.233333 -1.503472 -0.301989 -0.578518 -0.537374 0.006228 0.027006
6.266667 -1.521194 -0.301704 -0.582021 -0.525643 0.006932 0.027073
6.300000 -1.538802 -0.301537 -0.578124 -0.513174 0.007681 0.020242
6.333333 -1.556294 -0.301490 -0.564836 -0.500009 0.008477 0.004719
6.366667 -1.573067 -0.301284 -0.560889 -0.486360 0.009252 -0.017103
6.400000 -1.589102 -0.300925 -0.546655 -0.472605 0.009873 -0.045061
6.433333 -1.604355 -0.300408 -0.541247 -0.459049 0.010253 -0.076437
6.466667 -1.619490 -0.300030 -0.551888 -0.445887 0.010352 -0.107231
6.500000 -1.633780 -0.299502 -0.571846 -0.433345 0.010112 -0.135542
6.533333 -1.647196 -0.298813 -0.568421 -0.421713 0.009448 -0.159681
6.566667 -1.660500 -0.298281 -0.593077 -0.411120 0.008364 -0.180024
6.600000 -1.673695 -0.297911 -0.603350 -0.401587 0.006891 -0.193032
6.633333 -1.686783 -0.297708 -0.609934 -0.393103 0.005037 -0.198961
6.666667 -1.699767 -0.297678 -0.622981 -0.385696 0.002794 -0.199944
6.700000 -1.712651 -0.297827 -0.618187 -0.379250 0.000195 -0.196680
6.733333 -1.725071 -0.297825 -0.621110 -0.373553 -0.002701 -0.183605
6.766667 -1.737151 -0.297709 -0.621951 -0.368430 -0.005923 -0.160800
6.800000 -1.749140 -0.297789 -0.611000 -0.363701 -0.009528 -0.129633
6.833333 -1.761043 -0.298071 -0.625310 -0.359217 -0.013567 -0.090587
6.866667 -1.772864 -0.298560 -0.653749 -0.354812 -0.018110 -0.043593
6.900000 -1.784636 -0.299083 -0.663901 -0.350417 -0.023252 0.010555
6.933333 -1.796322 -0.299717 -0.667604 -0.345966 -0.029071 0.063911
6.966667 -1.807937 -0.300577 -0.671847 -0.341409 -0.035578 0.111236
7.000000 -1.819486 -0.301669 -0.660516 -0.336750 -0.042756 0.149854
7.033333 -1.830732 -0.303058 -0.642341 -0.332017 -0.050582 0.178458
7.066667 -1.841920 -0.304689 -0.615885 -0.327275 -0.059000 0.193941
7.100000 -1.852729 -0.306697 -0.589552 -0.322603 -0.067921 0.196386
7.133333 -1.863141 -0.309083 -0.564695 -0.318137 -0.077252 0.188795
7.166667 -1.873509 -0.311728 -0.573902 -0.314006 -0.086887 0.180684
7.200000 -1.883598 -0.314819 -0.574315 -0.310310 -0.096761 0.176895
7.233333 -1.893654 -0.318178 -0.572909 -0.307103 -0.106817 0.179935
7.266667 -1.903680 -0.321809 -0.581327 -0.304423 -0.117015 0.193600
7.300000 -1.913674 -0.326016 -0.608594 -0.302250 -0.127326 0.218008
7.333333 -1.923650 -0.330503 -0.608144 -0.300504 -0.137749 0.253031
7.366667 -1.933613 -0.335274 -0.597771 -0.299109 -0.148310 0.289892
7.400000 -1.943569 -0.340332 -0.576935 -0.297992 -0.158973 0.321834
7.433333 -1.953522 -0.345681 -0.539879 -0.297118 -0.169778 0.343689
7.466667 -1.963477 -0.351325 -0.517790 -0.296453 -0.180768 0.352116
7.500000 -1.973441 -0.357265 -0.486033 -0.296019 -0.192124 0.342671
7.533333 -1.983128 -0.364054 -0.464015 -0.295930 -0.204081 0.314906
7.566667 -1.992832 -0.371145 -0.453233 -0.296352 -0.216997 0.268081
7.600000 -2.002560 -0.378540 -0.455356 -0.297445 -0.231257 0.203580
7.633333 -2.012317 -0.386240 -0.471322 -0.299397 -0.247216 0.119274
7.666667 -2.022106 -0.394247 -0.473232 -0.302466 -0.265362 0.009100
7.700000 -2.031934 -0.402561 -0.463231 -0.306846 -0.285955 -0.130672
7.733333 -2.041805 -0.411185 -0.467732 -0.312598 -0.309121 -0.310936
7.766667 -2.051921 -0.421116 -0.466144 -0.319752 -0.334799 -0.533758
7.800000 -2.062089 -0.431356 -0.465931 -0.328421 -0.363066 -0.802203
7.833333 -2.072698 -0.443118 -0.475632 -0.338577 -0.393708 -1.107721
7.866667 -2.083857 -0.456518 -0.460928 -0.350007 -0.426124 -1.438863
7.900000 -2.095671 -0.471685 -0.500756 -0.362576 -0.459830 -1.778307
7.933333 -2.107552 -0.487150 -0.559343 -0.376209 -0.494406 -2.102949
7.966667 -2.120247 -0.504520 -0.681198 -0.390684 -0.529301 -2.388605
8.000000 -2.133855 -0.523826 -0.805904 -0.405628 -0.563668 -2.611656
8.033333 -2.147532 -0.543406 -0.934874 -0.420794 -0.596998 -2.758522
8.066667 -2.161278 -0.563248 -1.082378 -0.436086 -0.629144 -2.814837
8.100000 -2.176101 -0.585049 -1.206414 -0.451237 -0.659775 -2.777032
8.133333 -2.192017 -0.608788 -1.330593 -0.465892 -0.688424 -2.646743
8.166667 -2.207999 -0.632753 -1.413990 -0.479977 -0.715026 -2.444612
8.200000 -2.224042 -0.656929 -1.485634 -0.493461 -0.739687 -2.190979
8.233333 -2.241265 -0.683002 -1.554049 -0.506185 -0.762267 -1.908358
8.266667 -2.258543 -0.709255 -1.614110 -0.517953 -0.782519 -1.621778
8.300000 -2.275870 -0.735669 -1.646381 -0.528859 -0.800515 -1.353830
8.333333 -2.294348 -0.763749 -1.679972 -0.539076 -0.816482 -1.123125
8.366667 -2.312864 -0.791955 -1.687503 -0.548619 -0.830347 -0.934226
8.400000 -2.331414 -0.820268 -1.712500 -0.557524 -0.842029 -0.789695
8.433333 -2.349990 -0.848670 -1.711922 -0.566016 -0.851733 -0.691247
8.466667 -2.368586 -0.877140 -1.715666 -0.574386 -0.859607 -0.637160
8.500000 -2.388228 -0.906571 -1.741987 -0.582663 -0.865483 -0.622923
8.533333 -2.407875 -0.936031 -1.751080 -0.590972 -0.869305 -0.648127
8.566667 -2.427520 -0.965501 -1.773101 -0.599432 -0.871024 -0.711705
8.600000 -2.447155 -0.994959 -1.802131 -0.608217 -0.870476 -0.814492
8.633333 -2.467707 -1.024507 -1.827692 -0.617326 -0.867350 -0.949718
8.666667 -2.488230 -1.054003 -1.842278 -0.626669 -0.861321 -1.117779
8.700000 -2.509606 -1.083225 -1.879979 -0.636208 -0.852410 -1.318000
8.733333 -2.530934 -1.112354 -1.901735 -0.645845 -0.840380 -1.546221
8.766667 -2.552202 -1.141373 -1.950400 -0.655473 -0.825062 -1.799058
8.800000 -2.574223 -1.169576 -1.993920 -0.664811 -0.806577 -2.076912
8.833333 -2.596889 -1.196644 -2.077291 -0.673601 -0.785071 -2.375888
8.866667 -2.619460 -1.223543 -2.163920 -0.681566 -0.760893 -2.674719
8.900000 -2.642590 -1.248984 -2.290537 -0.688421 -0.734243 -2.950995
8.933333 -2.666251 -1.272834 -2.385656 -0.693683 -0.705654 -3.181246
8.966667 -2.689777 -1.296469 -2.474869 -0.696866 -0.675819 -3.341024
9.000000 -2.713693 -1.318332 -2.604786 -0.697635 -0.645327 -3.400234
9.033333 -2.737445 -1.339952 -2.755191 -0.695759 -0.614717 -3.349738
9.066667 -2.761391 -1.359697 -2.901113 -0.691022 -0.584537 -3.201943
9.100000 -2.785504 -1.377609 -3.088199 -0.683302 -0.555372 -2.973757
9.133333 -2.809407 -1.395247 3.011262 -0.672779 -0.527555 -2.690518
9.166667 -2.832248 -1.411611 2.896542 -0.659735 -0.501367 -2.393709
9.200000 -2.854849 -1.427687 2.874248 -0.644428 -0.476918 -2.143337
9.233333 -2.876277 -1.442710 2.848185 -0.627218 -0.454460 -1.988409
9.266667 -2.896467 -1.456751 2.863911 -0.608614 -0.434034 -1.969619
9.300000 -2.916375 -1.470489 2.895847 -0.589197 -0.415501 -2.125033
9.333333 -2.935989 -1.483919 2.912718 -0.569414 -0.398778 -2.471949
9.366667 -2.954347 -1.496520 2.872946 -0.549667 -0.383710 -2.997299
9.400000 -2.972387 -1.508806 2.822125 -0.530417 -0.370218 -3.654723
9.433333 -2.989234 -1.520516 2.745980 -0.511964 -0.358068 -4.388609
9.466667 -3.005742 -1.531907 2.604027 -0.494414 -0.347050 -5.131350
9.500000 -3.021901 -1.542977 2.372237 -0.477770 -0.337060 -5.808692
9.533333 -3.037085 -1.554043 2.063656 -0.462115 -0.327954 -6.359649
9.566667 -3.051900 -1.564785 1.702107 -0.447411 -0.319478 -6.732362
9.600000 -3.066338 -1.575200 1.355378 -0.433568 -0.311406 -6.894602
9.633333 -3.080390 -1.585288 1.051847 -0.420427 -0.303528 -6.827126
9.666667 -3.094048 -1.595046 0.833847 -0.407908 -0.295695 -6.535805
9.700000 -3.107493 -1.605102 0.595596 -0.395916 -0.287702 -6.039750
9.733333 -3.120525 -1.614827 0.381734 -0.384229 -0.279317 -5.367241
9.766667 -3.133139 -1.624219 0.191333 -0.372754 -0.270291 -4.564117
9.800000 -3.145324 -1.633277 0.040636 -0.361398 -0.260376 -3.674641
9.833333 -3.157073 -1.642000 -0.081951 -0.350156 -0.249233 -2.738812
9.866667 -3.168740 -1.650243 -0.170243 -0.338999 -0.236424 -1.780926
9.900000 -3.179954 -1.658151 -0.189359 -0.327921 -0.221509 -0.830292
9.933333 -3.190709 -1.665723 -0.189131 -0.316895 -0.204114 0.082889
9.966667 -3.200996 -1.672961 -0.154778 -0.305787 -0.183983 0.935747
10.000000 -3.210808 -1.679864 -0.098269 -0.294411 -0.160757 1.700844
10.033333 -3.220137 -1.686434 -0.011967 -0.282471 -0.134211 2.352367
10.066667 -3.229442 -1.691393 0.110266 -0.269594 -0.104334 2.860998
10.100000 -3.238649 -1.694676 0.253112 -0.255376 -0.071401 3.212854
10.133333 -3.247351 -1.697635 0.428248 -0.239390 -0.035743 3.408140
10.166667 -3.255752 -1.698905 0.615676 -0.221302 0.002084 3.453128
10.200000 -3.263699 -1.698521 0.793595 -0.200886 0.041199 3.369168
10.233333 -3.271019 -1.696511 0.962679 -0.178088 0.080523 3.173573
10.266667 -3.277502 -1.692896 1.052405 -0.152972 0.118969 2.893525
10.300000 -3.282991 -1.687680 1.136366 -0.125697 0.155674 2.546981
10.333333 -3.287264 -1.680930 1.168329 -0.096684 0.189667 2.151531
10.366667 -3.290124 -1.672712 1.227037 -0.066288 0.220134 1.715239
10.400000 -3.291361 -1.663165 1.255346 -0.034905 0.246506 1.230560
10.433333 -3.292044 -1.653396 1.283443 -0.002846 0.268536 0.695904
10.466667 -3.290802 -1.642719 1.303948 0.029353 0.286186 0.105213
10.500000 -3.289003 -1.631858 1.332613 0.061268 0.299526 -0.533011
10.533333 -3.286649 -1.620832 1.391804 0.092819 0.308824 -1.213775
10.566667 -3.283739 -1.609662 1.403441 0.123925 0.314529 -1.915223
10.600000 -3.278552 -1.598702 1.365283 0.154546 0.317191 -2.599811
10.633333 -3.272814 -1.587636 1.247053 0.184737 0.317205 -3.223976
10.666667 -3.266529 -1.576483 1.091311 0.214996 0.314917 -3.747361
10.700000 -3.258017 -1.566201 0.879668 0.245643 0.310644 -4.136506
10.733333 -3.248969 -1.555870 0.604511 0.276775 0.304735 -4.353520
10.766667 -3.239390 -1.545508 0.326248 0.308389 0.297496 -4.375640
10.800000 -3.229288 -1.535134 0.112213 0.340679 0.289082 -4.198374
10.833333 -3.218669 -1.524766 -0.046756 0.373629 0.279749 -3.839675
10.866667 -3.206097 -1.515355 -0.148404 0.406798 0.269837 -3.330397
10.900000 -3.191613 -1.506808 -0.256436 0.439907 0.259600 -2.710058
10.933333 -3.176640 -1.498319 -0.332286 0.472677 0.249258 -2.035070
10.966667 -3.159942 -1.490476 -0.383031 0.504707 0.239021 -1.357055
11.000000 -3.141633 -1.483133 -0.395664 0.535378 0.229171 -0.721378
11.033333 -3.122874 -1.475895 -0.378886 0.564184 0.219943 -0.158204
11.066667 -3.102775 -1.468976 -0.333319 0.590889 0.211401 0.319086
11.100000 -3.081465 -1.462287 -0.307395 0.615286 0.203556 0.700830
11.133333 -3.059752 -1.455748 -0.239463 0.637192 0.196386 0.990666
11.166667 -3.037655 -1.449374 -0.172531 0.656697 0.189752 1.191082
11.200000 -3.015190 -1.443179 -0.123676 0.674050 0.183438 1.313895
11.233333 -2.992374 -1.437177 -0.061427 0.689484 0.177217 1.370714
11.266667 -2.968886 -1.431286 -0.011961 0.703212 0.170866 1.371380
11.300000 -2.945084 -1.425615 0.045877 0.715448 0.164178 1.325902
11.333333 -2.920788 -1.420109 0.090502 0.726401 0.156904 1.244877
11.366667 -2.896099 -1.414801 0.129614 0.736152 0.148807 1.143320
11.400000 -2.871075 -1.409747 0.172508 0.744696 0.139690 1.025927
11.433333 -2.845813 -1.404970 0.194620 0.752043 0.129362 0.899080
11.466667 -2.820334 -1.400483 0.236124 0.758208 0.117723 0.763917
11.500000 -2.794683 -1.396426 0.245882 0.763144 0.104689 0.627771
11.533333 -2.768853 -1.392685 0.269095 0.766872 0.090278 0.492393
11.566667 -2.742864 -1.389274 0.289421 0.769472 0.074611 0.358429
11.600000 -2.716869 -1.386557 0.301127 0.771051 0.057842 0.228733
11.633333 -2.690925 -1.384650 0.301178 0.771729 0.040164 0.103011
11.666667 -2.665099 -1.383644 0.294781 0.771550 0.021661 -0.013585
11.700000 -2.639438 -1.383642 0.291159 0.770566 0.002451 -0.121279
11.733333 -2.613717 -1.384024 0.281843 0.768794 -0.017400 -0.218401
11.766667 -2.587954 -1.384798 0.274371 0.766151 -0.038022 -0.308832
11.800000 -2.562168 -1.385973 0.256685 0.762527 -0.059604 -0.397658
11.833333 -2.536772 -1.388555 0.242661 0.757741 -0.082471 -0.496860
11.866667 -2.511391 -1.391553 0.211291 0.751683 -0.106799 -0.624769
11.900000 -2.486044 -1.394974 0.211068 0.744223 -0.132829 -0.806614
11.933333 -2.460750 -1.398825 0.178232 0.735155 -0.160935 -1.058720
11.966667 -2.435527 -1.403110 0.157529 0.724416 -0.191206 -1.389587
12.000000 -2.411059 -1.409256 0.132327 0.711945 -0.223715 -1.797488
12.033333 -2.387439 -1.417361 0.136235 0.697801 -0.258370 -2.264781
12.066667 -2.363943 -1.425911 0.088824 0.681966 -0.295278 -2.759047
12.100000 -2.341421 -1.436607 0.036402 0.664580 -0.334307 -3.227707
12.133333 -2.319056 -1.447750 -0.079169 0.645935 -0.375050 -3.622119
12.166667 -2.297798 -1.461068 -0.248911 0.626331 -0.417199 -3.894817
12.200000 -2.276727 -1.474828 -0.478658 0.606083 -0.460414 -4.001782
12.233333 -2.256785 -1.490699 -0.742782 0.585537 -0.504357 -3.910114
12.266667 -2.237953 -1.508644 -0.993140 0.565192 -0.548309 -3.608095
12.300000 -2.219346 -1.527013 -1.185194 0.545385 -0.591743 -3.106053
12.333333 -2.201728 -1.547385 -1.340891 0.526474 -0.634206 -2.429174
12.366667 -2.184969 -1.569695 -1.415961 0.508712 -0.675203 -1.621687
12.400000 -2.168944 -1.593866 -1.452296 0.492416 -0.714189 -0.741814
12.433333 -2.153508 -1.619795 -1.409104 0.477777 -0.750659 0.144227
12.466667 -2.138347 -1.646085 -1.337915 0.464820 -0.784548 0.980189
12.500000 -2.123479 -1.673926 -1.235813 0.453629 -0.815696 1.717166
12.533333 -2.108903 -1.702093 -1.100457 0.444095 -0.844075 2.316544
12.566667 -2.094399 -1.731599 -0.971995 0.436062 -0.869795 2.761010
12.600000 -2.080204 -1.761391 -0.861228 0.429221 -0.893119 3.047060
12.633333 -2.066326 -1.791449 -0.722067 0.423230 -0.914390 3.184854
12.666667 -2.052359 -1.822577 -0.588988 0.417734 -0.933669 3.186117
12.700000 -2.038725 -1.853929 -0.479726 0.412338 -0.951157 3.064953
12.733333 -2.025034 -1.886126 -0.354059 0.406677 -0.966906 2.844498
12.766667 -2.011323 -1.919070 -0.241310 0.400407 -0.980888 2.546429
12.800000 -1.997667 -1.952648 -0.133926 0.393208 -0.992887 2.178748
12.833333 -1.984145 -1.986721 -0.051870 0.384828 -1.002598 1.751228
12.866667 -1.970999 -2.020902 0.010909 0.375078 -1.009802 1.277624
12.900000 -1.958218 -2.055314 0.028427 0.363760 -1.014101 0.780370
12.933333 -1.945898 -2.089889 0.056061 0.350818 -1.015276 0.272426
12.966667 -1.934147 -2.124463 0.063667 0.336309 -1.013114 -0.230751
13.000000 -1.922804 -2.159043 0.048699 0.320405 -1.007623 -0.687755
13.033333 -1.911877 -2.193606 -0.044095 0.303309 -0.998720 -1.058980
13.066667 -1.901781 -2.227674 -0.074715 0.285292 -0.986310 -1.317814
13.100000 -1.892510 -2.261069 -0.108072 0.266717 -0.970569 -1.459171
13.133333 -1.884109 -2.293597 -0.232925 0.247906 -0.951672 -1.450265
13.166667 -1.876149 -2.326010 -0.366269 0.229120 -0.929931 -1.281989
13.200000 -1.869015 -2.357179 -0.470702 0.210589 -0.905653 -0.971906
13.233333 -1.862668 -2.387024 -0.568064 0.192549 -0.879515 -0.546112
13.266667 -1.856775 -2.416688 -0.624905 0.175124 -0.852369 -0.023257
13.300000 -1.851517 -2.444698 -0.613070 0.158357 -0.824978 0.589030
13.333333 -1.846721 -2.472490 -0.512502 0.142219 -0.797756 1.216328
13.366667 -1.842376 -2.498228 -0.429289 0.126671 -0.770955 1.808273
13.400000 -1.838427 -2.521675 -0.326942 0.111607 -0.744810 2.314563
13.433333 -1.834948 -2.544855 -0.326942 0.096861 -0.719052 2.691629
13.466667 -1.831940 -2.567757 -0.071063 0.082306 -0.693279 2.874530
13.500000 -1.829407 -2.590367 0.059469 0.067820 -0.666897 2.824560
13.533333 -1.827349 -2.612672 0.207580 0.053292 -0.639689 2.556450
13.566667 -1.825769 -2.634659 0.364478 0.038570 -0.611438 2.096555
13.600000 -1.824667 -2.656315 0.516976 0.023482 -0.581599 1.503920
13.633333 -1.824045 -2.677629 0.618879 0.007815 -0.549986 0.845347
13.666667 -1.823972 -2.696037 0.672322 -0.008717 -0.516586 0.246735
13.700000 -1.824432 -2.711749 0.674682 -0.026381 -0.481700 -0.215352
13.733333 -1.825373 -2.727091 0.562963 -0.045379 -0.445642 -0.441869
13.766667 -1.826836 -2.740150 0.372652 -0.065893 -0.409006 -0.381305
13.800000 -1.828780 -2.752830 0.134944 -0.088061 -0.372697 -0.013595
13.833333 -1.831204 -2.765126 -0.052211 -0.111876 -0.337580 0.652872
13.866667 -1.834529 -2.775713 -0.202331 -0.137142 -0.304289 1.553118
13.900000 -1.838946 -2.784809 -0.154719 -0.163699 -0.273151 2.637053
13.933333 -1.844617 -2.792606 0.025608 -0.191358 -0.244455 3.764309
13.966667 -1.851664 -2.799306 0.294277 -0.219743 -0.218173 4.830394
14.000000 -1.860146 -2.805100 0.661985 -0.248295 -0.194270 5.732594
14.033333 -1.869088 -2.810513 0.857669 -0.276581 -0.172638 6.402991
14.066667 -1.878483 -2.815550 1.385162 -0.304354 -0.153111 6.769489
14.100000 -1.889314 -2.820003 1.675260 -0.331251 -0.135559 6.807777
14.133333 -1.901598 -2.823924 1.948057 -0.356966 -0.119711 6.567516
14.166667 -1.914311 -2.827480 2.184069 -0.381414 -0.105313 6.099165
14.200000 -1.927444 -2.830677 2.376334 -0.404761 -0.092011 5.464523
14.233333 -1.941957 -2.833410 2.527211 -0.426951 -0.079477 4.701225
14.266667 -1.956869 -2.835793 2.599763 -0.447758 -0.067518 3.902585
14.300000 -1.972167 -2.837832 2.684638 -0.467044 -0.056006 3.104164
14.333333 -1.987841 -2.839531 2.812969 -0.484702 -0.044879 2.311090
14.366667 -2.004483 -2.840807 2.873180 -0.500513 -0.034145 1.520323
14.400000 -2.021991 -2.841671 2.906057 -0.514138 -0.023860 0.725840
14.433333 -2.040170 -2.842148 2.917598 -0.525463 -0.014056 -0.067894
14.466667 -2.058795 -2.842277 2.931589 -0.534509 -0.004743 -0.882403
14.500000 -2.077650 -2.842087 2.925101 -0.541356 0.004077 -1.709855
14.533333 -2.096799 -2.841595 2.869704 -0.546123 0.012414 -2.505130
14.566667 -2.115748 -2.840868 2.778070 -0.549068 0.020270 -3.213974
14.600000 -2.134378 -2.839959 2.638792 -0.550598 0.027632 -3.781002
14.633333 -2.152619 -2.838889 2.490011 -0.551186 0.034507 -4.151688
14.666667 -2.170445 -2.837679 2.270043 -0.551355 0.040854 -4.280914
14.700000 -2.188497 -2.836202 1.992557 -0.551585 0.046566 -4.138796
14.733333 -2.206763 -2.834463 1.697237 -0.552302 0.051521 -3.738272
14.766667 -2.224763 -2.832545 1.412777 -0.553832 0.055648 -3.112779
14.800000 -2.242953 -2.830379 1.239460 -0.556362 0.058847 -2.310709
14.833333 -2.261318 -2.827973 1.138186 -0.559904 0.060988 -1.392675
14.866667 -2.279848 -2.825333 1.186451 -0.564306 0.062023 -0.434795
14.900000 -2.298577 -2.822820 1.312961 -0.569369 0.062061 0.482722
14.933333 -2.317582 -2.820554 1.429577 -0.574898 0.061141 1.296853
14.966667 -2.336713 -2.818075 1.585613 -0.580662 0.059266 1.956235
15.000000 -2.356219 -2.816043 1.744264 -0.586416 0.056633 2.433329
15.033333 -2.376118 -2.814553 1.869491 -0.591946 0.053508 2.723307
15.066667 -2.396103 -2.812865 1.974533 -0.597110 0.049996 2.856803
15.100000 -2.416159 -2.810986 2.062808 -0.601801 0.046081 2.884908
15.133333 -2.436588 -2.809913 2.148778 -0.605882 0.041855 2.853619
15.166667 -2.457060 -2.808656 2.225773 -0.609358 0.037338 2.809584
15.200000 -2.477562 -2.807219 2.305183 -0.612305 0.032360 2.780645
15.233333 -2.498080 -2.805607 2.369376 -0.614969 0.026563 2.773572
15.266667 -2.518797 -2.805115 2.426801 -0.617704 0.019890 2.771234
15.300000 -2.539500 -2.804454 2.493789 -0.620859 0.012312 2.740528
15.333333 -2.560175 -2.803626 2.584659 -0.624872 0.003740 2.653699
15.366667 -2.580808 -2.802632 2.703676 -0.629973 -0.005764 2.482470
15.400000 -2.601371 -2.802916 2.859978 -0.636365 -0.015959 2.208568
15.433333 -2.621862 -2.803039 3.034027 -0.644033 -0.026432 1.826934
15.466667 -2.642350 -2.804372 -3.129995 -0.652732 -0.036889 1.343845
15.500000 -2.663985 -2.806464 -3.044032 -0.662111 -0.046957 0.776384
15.533333 -2.685504 -2.808392 -3.025378 -0.671711 -0.056183 0.150613
15.566667 -2.708309 -2.810898 -3.070643 -0.681059 -0.064125 -0.499324
15.600000 -2.732466 -2.813847 3.135787 -0.689540 -0.070483 -1.135584
15.633333 -2.756454 -2.816624 3.039387 -0.696579 -0.074995 -1.723008
15.666667 -2.780786 -2.819924 2.922798 -0.701633 -0.077446 -2.231534
15.700000 -2.804912 -2.823044 2.809448 -0.704372 -0.077779 -2.640710
15.733333 -2.828811 -2.825980 2.692759 -0.704422 -0.075923 -2.945983
15.766667 -2.852930 -2.828879 2.593380 -0.701511 -0.071851 -3.158955
15.800000 -2.876785 -2.831586 2.468265 -0.695526 -0.065551 -3.296352
15.833333 -2.900355 -2.834097 2.346668 -0.686397 -0.057031 -3.379959
15.866667 -2.923621 -2.836408 2.229955 -0.674092 -0.046377 -3.431781
15.900000 -2.946565 -2.838514 2.120712 -0.658327 -0.033551 -3.469996
15.933333 -2.968993 -2.839792 2.012853 -0.638849 -0.018666 -3.504019
15.966667 -2.991061 -2.840858 1.900954 -0.615575 -0.001946 -3.531168
16.000000 -3.012178 -2.840896 1.790743 -0.588576 0.016282 -3.551079
16.033333 -3.032899 -2.840718 1.671070 -0.557774 0.035723 -3.555715
16.066667 -3.052182 -2.839450 1.545758 -0.523229 0.056049 -3.537372
16.100000 -3.069794 -2.837091 1.411554 -0.485409 0.076757 -3.485403
16.133333 -3.085515 -2.833692 1.296522 -0.444981 0.097376 -3.393967
16.166667 -3.100779 -2.830075 1.155927 -0.402472 0.117524 -3.260563
16.200000 -3.113860 -2.825536 1.032191 -0.358340 0.136962 -3.083834
16.233333 -3.124643 -2.820165 0.899722 -0.313414 0.155343 -2.867482
16.266667 -3.133059 -2.814008 0.797010 -0.268599 0.172419 -2.616153
16.300000 -3.140984 -2.807643 0.711623 -0.224402 0.188138 -2.338653
16.333333 -3.148412 -2.801074 0.657048 -0.181169 0.202530 -2.045497
16.366667 -3.153512 -2.793883 0.611308 -0.139384 0.215586 -1.750334
16.400000 -3.156340 -2.786109 0.558041 -0.099440 0.227314 -1.466705
16.433333 -3.158665 -2.778145 0.511464 -0.061460 0.237826 -1.209192
16.466667 -3.158980 -2.769709 0.485443 -0.025439 0.247256 -0.993748
16.500000 -3.158794 -2.761093 0.462709 0.008441 0.255666 -0.840194
16.533333 -3.158110 -2.752303 0.456446 0.039957 0.263087 -0.760961
16.566667 -3.155921 -2.743200 0.446410 0.069081 0.269622 -0.762418
16.600000 -3.152479 -2.733861 0.439064 0.095829 0.275381 -0.842148
16.633333 -3.148050 -2.724381 0.446486 0.120147 0.280462 -0.993015
16.666667 -3.142843 -2.714808 0.438607 0.142115 0.284975 -1.199228
16.700000 -3.137005 -2.705173 0.438283 0.161809 0.289061 -1.435434
16.733333 -3.130700 -2.695399 0.401841 0.179331 0.292855 -1.680267
16.766667 -3.124166 -2.685638 0.351210 0.194835 0.296489 -1.918411
16.800000 -3.117179 -2.675752 0.252436 0.208526 0.300082 -2.143233
16.833333 -3.109747 -2.665746 0.089846 0.220645 0.303763 -2.346200
16.866667 -3.101879 -2.655627 -0.061218 0.231359 0.307626 -2.517360
16.900000 -3.093581 -2.645401 -0.174686 0.240937 0.311701 -2.648356
16.933333 -3.085469 -2.634980 -0.236884 0.249652 0.316019 -2.728356
16.966667 -3.076943 -2.624465 -0.274338 0.257656 0.320579 -2.738888
17.000000 -3.068011 -2.613863 -0.333625 0.265047 0.325328 -2.654077
17.033333 -3.059134 -2.602871 -0.402204 0.271983 0.330144 -2.456570
17.066667 -3.049866 -2.591805 -0.518589 0.278558 0.334907 -2.134229
17.100000 -3.040216 -2.580673 -0.637684 0.284780 0.339523 -1.680871
17.133333 -3.030548 -2.569187 -0.783383 0.290660 0.343861 -1.093872
17.166667 -3.020895 -2.557370 -0.929298 0.296262 0.347776 -0.385977
17.200000 -3.010883 -2.545508 -0.990989 0.301617 0.351152 0.404291
17.233333 -3.000518 -2.533611 -1.000836 0.306653 0.353939 1.223925
17.266667 -2.990387 -2.521536 -0.948123 0.311429 0.356082 1.992941
17.300000 -2.979917 -2.509442 -0.797409 0.316076 0.357539 2.623652
17.333333 -2.969116 -2.497336 -0.585203 0.320719 0.358331 3.025658
17.366667 -2.957991 -2.485228 -0.367320 0.325414 0.358525 3.123340
17.400000 -2.947048 -2.473156 -0.107891 0.330258 0.358206 2.873428
17.433333 -2.936190 -2.461154 0.122716 0.335400 0.357464 2.272333
17.466667 -2.925315 -2.449238 0.318252 0.340874 0.356416 1.367974
17.500000 -2.914143 -2.437351 0.464217 0.346665 0.355174 0.248735
17.533333 -2.902681 -2.425504 0.530135 0.352767 0.353819 -0.971085
17.566667 -2.890913 -2.413762 0.440484 0.359162 0.352469 -2.159389
17.600000 -2.878867 -2.402075 0.195620 0.365716 0.351268 -3.179167
17.633333 -2.866465 -2.390435 -0.110119 0.372252 0.350314 -3.913012
17.666667 -2.853799 -2.378867 -0.415162 0.378594 0.349676 -4.276725
17.700000 -2.840876 -2.367379 -0.709102 0.384542 0.349478 -4.230675
17.733333 -2.827753 -2.355838 -0.985183 0.389886 0.349869 -3.776613
17.766667 -2.814552 -2.344180 -1.243741 0.394510 0.350900 -2.966400
17.800000 -2.801114 -2.332627 -1.444117 0.398420 0.352517 -1.890370
17.833333 -2.787446 -2.321187 -1.500166 0.401653 0.354692 -0.661652
17.866667 -2.773555 -2.309869 -1.438384 0.404302 0.357407 0.603170
17.900000 -2.759923 -2.298034 -1.258407 0.406559 0.360493 1.789845
17.933333 -2.746568 -2.285637 -1.057784 0.408714 0.363653 2.802127
17.966667 -2.733009 -2.273390 -0.853152 0.410988 0.366616 3.575549
18.000000 -2.719252 -2.261302 -0.642056 0.413586 0.369141 4.072983
18.033333 -2.705653 -2.248789 -0.408000 0.416730 0.370936 4.291794
18.066667 -2.692070 -2.235959 -0.196125 0.420606 0.371612 4.251202
18.100000 -2.678318 -2.222895 -0.025924 0.425289 0.370904 3.998632
18.133333 -2.664390 -2.210034 0.116166 0.430698 0.368711 3.590421
18.166667 -2.650293 -2.197385 0.212484 0.436761 0.364949 3.082388
18.200000 -2.635665 -2.184861 0.303445 0.443337 0.359582 2.528026
18.233333 -2.620880 -2.172572 0.370426 0.450223 0.352677 1.975030
18.266667 -2.605557 -2.160615 0.396129 0.457172 0.344475 1.460510
18.300000 -2.590087 -2.148915 0.415042 0.463971 0.335239 1.006839
18.333333 -2.574232 -2.137816 0.420076 0.470463 0.325192 0.628876
18.366667 -2.558243 -2.126995 0.416844 0.476377 0.314491 0.341223
18.400000 -2.542062 -2.116928 0.401590 0.481519 0.303323 0.156416
18.433333 -2.525761 -2.107159 0.386916 0.485723 0.291824 0.076672
18.466667 -2.509347 -2.097698 0.367224 0.488912 0.280038 0.097544
18.500000 -2.492825 -2.088553 0.333204 0.491012 0.267972 0.206894
18.533333 -2.476203 -2.079735 0.311469 0.491897 0.255522 0.387936
18.566667 -2.459488 -2.071252 0.323866 0.491666 0.242718 0.613037
18.600000 -2.442685 -2.063112 0.311433 0.490331 0.229456 0.851506
18.633333 -2.425802 -2.055325 0.342084 0.487845 0.215587 1.070693
18.666667 -2.408846 -2.047899 0.376772 0.484076 0.200927 1.247566
18.700000 -2.393169 -2.041646 0.473808 0.478967 0.185316 1.364628
18.733333 -2.377429 -2.035770 0.589669 0.472626 0.168735 1.411339
18.766667 -2.361633 -2.030277 0.729697 0.465023 0.151060 1.384518
18.800000 -2.345784 -2.025174 0.807519 0.456253 0.132259 1.287417
18.833333 -2.329889 -2.020468 0.836174 0.446521 0.112350 1.135599
18.866667 -2.315058 -2.016847 0.834111 0.436230 0.091450 0.945221
18.900000 -2.300190 -2.013634 0.845784 0.425643 0.069628 0.736130
18.933333 -2.286131 -2.011411 0.839978 0.415016 0.046892 0.529808
18.966667 -2.272761 -2.010161 0.842817 0.404736 0.023323 0.350259
19.000000 -2.259974 -2.009854 0.834296 0.395238 -0.000979 0.209366
19.033333 -2.247663 -2.010485 0.834984 0.386950 -0.025828 0.103983
19.066667 -2.235322 -2.011541 0.834036 0.380064 -0.051101 0.021765
19.100000 -2.223242 -2.013524 0.834177 0.374912 -0.076681 -0.050188
19.133333 -2.211322 -2.016441 0.833184 0.371669 -0.102393 -0.132119
19.166667 -2.199469 -2.020316 0.838243 0.370376 -0.128107 -0.244686
19.200000 -2.187586 -2.025176 0.846155 0.370942 -0.153712 -0.397598
19.233333 -2.175674 -2.030462 0.840598 0.373184 -0.179224 -0.587770
19.266667 -2.163545 -2.036814 0.839316 0.377049 -0.204652 -0.803792
19.300000 -2.151097 -2.044265 0.851122 0.382314 -0.229888 -1.036869
19.333333 -2.138233 -2.052880 0.820950 0.388833 -0.254903 -1.267542
19.366667 -2.125342 -2.061907 0.764521 0.396474 -0.279674 -1.477319
19.400000 -2.112424 -2.071343 0.678571 0.405079 -0.304167 -1.649727
19.433333 -2.098900 -2.082009 0.585813 0.414528 -0.328271 -1.773289
19.466667 -2.085352 -2.093070 0.467746 0.424620 -0.351874 -1.839234
19.500000 -2.071140 -2.105302 0.382749 0.435257 -0.374962 -1.839213
19.533333 -2.056251 -2.118642 0.309666 0.446255 -0.397452 -1.778687
19.566667 -2.041343 -2.132355 0.250479 0.457405 -0.419212 -1.667790
19.600000 -2.025744 -2.147063 0.206134 0.468522 -0.440079 -1.521586
19.633333 -2.010133 -2.162125 0.154924 0.479442 -0.459969 -1.357002
19.666667 -1.993833 -2.178073 0.119595 0.489986 -0.478754 -1.190331
19.700000 -1.976881 -2.194839 0.095970 0.499940 -0.496289 -1.034220
19.733333 -1.959931 -2.211927 0.067368 0.509223 -0.512531 -0.892408
19.766667 -1.942426 -2.229696 0.062185 0.517711 -0.527432 -0.764396
19.800000 -1.924933 -2.247761 0.048250 0.525347 -0.541034 -0.644100
19.833333 -1.907003 -2.266355 0.030313 0.531988 -0.553291 -0.522395
19.866667 -1.889099 -2.285221 -0.001546 0.537608 -0.564251 -0.396333
19.900000 -1.870925 -2.304470 -0.026685 0.542228 -0.574010 -0.263017
19.933333 -1.852497 -2.324053 -0.056087 0.545782 -0.582568 -0.120504
19.966667 -1.833873 -2.343888 -0.081659 0.548296 -0.589973 0.029990
20.000000 -1.815301 -2.363942 -0.061161 0.549767 -0.596224 0.183513
20.033333 -1.796659 -2.384073 -0.039430 0.550283 -0.601432 0.328933
20.066667 -1.778084 -2.404395 -0.025289 0.549880 -0.605659 0.463356
20.100000 -1.759583 -2.424896 0.010806 0.548584 -0.608916 0.577151
20.133333 -1.741165 -2.445561 0.042418 0.546485 -0.611285 0.660648
20.166667 -1.722887 -2.466063 0.097688 0.543669 -0.612878 0.705462
20.200000 -1.704705 -2.486703 0.108713 0.540202 -0.613786 0.713525
20.233333 -1.686627 -2.507466 0.142013 0.536111 -0.614012 0.688600
20.266667 -1.668744 -2.528007 0.180163 0.531416 -0.613571 0.632165
20.300000 -1.651079 -2.548323 0.188533 0.526149 -0.612539 0.554426
20.333333 -1.633539 -2.568722 0.225723 0.520293 -0.610936 0.462124
20.366667 -1.616132 -2.589192 0.234685 0.513833 -0.608748 0.368647
20.400000 -1.598864 -2.609721 0.244009 0.506776 -0.605981 0.273272
20.433333 -1.581925 -2.630018 0.236071 0.499150 -0.602690 0.184409
20.466667 -1.565139 -2.650347 0.244006 0.491006 -0.598913 0.106591
20.500000 -1.548746 -2.670419 0.225245 0.482366 -0.594614 0.041763
20.533333 -1.532768 -2.690243 0.247302 0.473299 -0.589804 -0.005608
20.566667 -1.517167 -2.709822 0.227012 0.463878 -0.584518 -0.034928
20.600000 -1.501954 -2.729165 0.230388 0.454197 -0.578812 -0.045321
20.633333 -1.486922 -2.748481 0.214706 0.444326 -0.572705 -0.042395
20.666667 -1.472312 -2.767490 0.217894 0.434333 -0.566231 -0.025580
20.700000 -1.457894 -2.786450 0.205513 0.424271 -0.559426 0.002078
20.733333 -1.443913 -2.805063 0.211531 0.414165 -0.552301 0.036314
20.766667 -1.430355 -2.823326 0.210087 0.404005 -0.544832 0.068611
20.800000 -1.417001 -2.841509 0.207707 0.393760 -0.536976 0.101142
20.833333 -1.404040 -2.859349 0.208206 0.383434 -0.528752 0.136359
20.866667 -1.391456 -2.876862 0.239536 0.373019 -0.520165 0.166952
20.900000 -1.379086 -2.894266 0.257731 0.362538 -0.511265 0.188277
20.933333 -1.367112 -2.911272 0.253950 0.352015 -0.502099 0.201430
20.966667 -1.355517 -2.927929 0.237579 0.341485 -0.492726 0.212367
21.000000 -1.344292 -2.944246 0.261735 0.330982 -0.483195 0.216378
21.033333 -1.333465 -2.960181 0.275386 0.320513 -0.473514 0.210036
21.066667 -1.323056 -2.975704 0.282751 0.310107 -0.463721 0.201446
21.100000 -1.313062 -2.990809 0.277434 0.299779 -0.453831 0.196085
21.133333 -1.303299 -3.005749 0.290118 0.289535 -0.443841 0.193173
21.166667 -1.293766 -3.020518 0.312156 0.279371 -0.433729 0.185709
21.200000 -1.284628 -3.034867 0.308044 0.269286 -0.423483 0.179942
21.233333 -1.275723 -3.049031 0.303290 0.259266 -0.413073 0.176620
21.266667 -1.267215 -3.062738 0.306102 0.249266 -0.402414 0.171332
21.300000 -1.259104 -3.075975 0.314957 0.239236 -0.391414 0.160893
21.333333 -1.251392 -3.088724 0.319892 0.229168 -0.380049 0.144883
21.366667 -1.243916 -3.101269 0.336169 0.219066 -0.368306 0.128696
21.400000 -1.236674 -3.113604 0.348947 0.208931 -0.356175 0.106715
21.433333 -1.229819 -3.125462 0.337435 0.198791 -0.343690 0.082394
21.466667 -1.223355 -3.136825 0.352590 0.188701 -0.330943 0.055578
21.500000 -1.217278 -3.147672 0.344935 0.178732 -0.318075 0.031091
21.533333 -1.211583 -3.157980 0.362318 0.168927 -0.305180 0.007823
21.566667 -1.206118 -3.168062 0.350237 0.159327 -0.292357 -0.012069
21.600000 -1.201037 -3.177551 0.346402 0.149991 -0.279729 -0.026002
21.633333 -1.196337 -3.186413 0.327584 0.140955 -0.267372 -0.036811
21.666667 -1.191861 -3.195044 0.325832 0.132229 -0.255305 -0.041390
21.700000 -1.187761 -3.202987 0.322224 0.123806 -0.243497 -0.043137
21.733333 -1.183881 -3.210697 0.329805 0.115667 -0.231887 -0.039045
21.766667 -1.180219 -3.218176 0.342469 0.107796 -0.220449 -0.033967
21.800000 -1.176771 -3.225422 0.337065 0.100152 -0.209092 -0.027134
21.833333 -1.173536 -3.232437 0.338123 0.092694 -0.197741 -0.021189
21.866667 -1.170510 -3.239219 0.326362 0.085390 -0.186325 -0.017203
21.900000 -1.167821 -3.245210 0.330069 0.078217 -0.174832 -0.015211
21.933333 -1.165334 -3.250970 0.325372 0.071164 -0.163262 -0.014198
21.966667 -1.163143 -3.256053 0.328172 0.064223 -0.151642 -0.012283
22.000000 -1.161148 -3.260909 0.329261 0.057398 -0.140032 -0.012312
22.033333 -1.159412 -3.265187 0.329947 0.050712 -0.128551 -0.009286
22.066667 -1.157865 -3.269244 0.322014 0.044189 -0.117344 -0.005427
22.100000 -1.156556 -3.272803 0.327920 0.037843 -0.106487 -0.000324
22.133333 -1.155428 -3.276147 0.335204 0.031691 -0.096080 0.001937
22.166667 -1.154525 -3.279062 0.323619 0.025736 -0.086160 0.003772
22.200000 -1.153821 -3.281588 0.325221 0.019984 -0.076779 0.006947
22.233333 -1.153288 -3.283911 0.328397 0.014423 -0.067907 0.007863
22.266667 -1.152935 -3.285892 0.334010 0.009042 -0.059523 0.007647
22.300000 -1.152774 -3.287569 0.330061 0.003838 -0.051625 0.006773
22.333333 -1.152770 -3.289055 0.323239 -0.001194 -0.044197 0.008506
22.366667 -1.152921 -3.290354 0.337012 -0.006071 -0.037214 0.007864
22.400000 -1.153236 -3.291397 0.326304 -0.010809 -0.030626 0.006302
22.433333 -1.153713 -3.292206 0.331779 -0.015423 -0.024419 0.005445
22.466667 -1.154330 -3.292843 0.326166 -0.019943 -0.018547 0.006171
22.500000 -1.155083 -3.293314 0.336829 -0.024399 -0.012963 0.006560
22.533333 -1.155969 -3.293624 0.331116 -0.028838 -0.007614 0.005538
22.566667 -1.157026 -3.293730 0.329936 -0.033283 -0.002478 0.006470
22.600000 -1.158205 -3.293687 0.330140 -0.037756 0.002470 0.006344
22.633333 -1.159503 -3.293500 0.331552 -0.042268 0.007254 0.005149
22.666667 -1.160913 -3.293174 0.327809 -0.046825 0.011894 0.002656
22.700000 -1.162530 -3.292677 0.333060 -0.051421 0.016394 0.000867
22.733333 -1.164251 -3.292054 0.333061 -0.056022 0.020749 0.002597
22.766667 -1.166190 -3.291259 0.336258 -0.060626 0.024974 0.023466
22.800000 -1.168362 -3.290298 0.333121 -0.065244 0.029087 0.085080
22.833333 -1.170622 -3.289227 0.331927 -0.069920 0.033117 0.211698
22.866667 -1.173150 -3.287993 0.332349 -0.074654 0.037070 0.426497
22.900000 -1.175756 -3.286663 0.332276 -0.079477 0.040972 0.748895
22.933333 -1.178434 -3.285242 0.325052 -0.084435 0.044852 1.189034
22.966667 -1.181179 -3.283736 0.326150 -0.089536 0.048721 1.724605
23.000000 -1.184241 -3.282030 0.330019 -0.094736 0.052559 2.324606
23.033333 -1.187359 -3.280253 0.330206 -0.099929 0.056326 2.947740
23.066667 -1.190527 -3.278410 0.373181 -0.105041 0.059988 3.549569
