t x y theta dxdt dydt dthetadt
0.000000 0.000000 0.000000 0.697320 -0.004329 -0.014632 0.001406
0.033333 0.000040 -0.000188 0.704929 -0.005642 -0.020437 0.003858
0.066667 0.000194 -0.000347 0.692710 -0.007450 -0.027683 0.003150
0.100000 0.000122 -0.000571 0.702690 -0.009769 -0.036346 -0.004134
0.133333 -0.000133 -0.001505 0.703465 -0.012360 -0.045965 -0.021675
0.166667 -0.000267 -0.002393 0.694099 -0.015040 -0.056118 -0.049115
0.200000 -0.000827 -0.004414 0.692268 -0.017715 -0.066919 -0.088421
0.233333 -0.001260 -0.006374 0.708521 -0.020396 -0.078944 -0.145502
0.266667 -0.002704 -0.010607 0.707386 -0.023035 -0.092670 -0.219742
0.300000 -0.004013 -0.014760 0.699730 -0.025658 -0.108793 -0.306761
0.333333 -0.005184 -0.018824 0.691330 -0.028363 -0.128372 -0.402123
0.366667 -0.006212 -0.022788 0.698110 -0.031223 -0.152449 -0.498042
0.400000 -0.007093 -0.026643 0.674616 -0.033896 -0.180634 -0.578507
0.433333 -0.007824 -0.030379 0.641324 -0.035829 -0.211594 -0.621583
0.466667 -0.008399 -0.033985 0.610177 -0.036658 -0.244387 -0.612500
0.500000 -0.008816 -0.037454 0.569342 -0.035939 -0.277652 -0.535201
0.533333 -0.010380 -0.047607 0.533177 -0.033090 -0.308576 -0.376980
0.566667 -0.013053 -0.063194 0.486911 -0.027315 -0.333268 -0.134259
0.600000 -0.015551 -0.078594 0.459091 -0.018456 -0.349295 0.180382
0.633333 -0.018201 -0.096238 0.415291 -0.006446 -0.353897 0.550668
0.666667 -0.019737 -0.114212 0.395862 0.008797 -0.344083 0.959795
0.700000 -0.021078 -0.131928 0.445669 0.027326 -0.317084 1.376244
0.733333 -0.018776 -0.143479 0.547882 0.048249 -0.272670 1.766552
0.766667 -0.016273 -0.154730 0.653585 0.070235 -0.212794 2.100403
0.800000 -0.013567 -0.165663 0.757584 0.092235 -0.138931 2.357168
0.833333 -0.010655 -0.176259 0.880431 0.113204 -0.053722 2.510695
0.866667 -0.005675 -0.177812 1.006586 0.132097 0.039365 2.539578
0.900000 0.000881 -0.171631 1.120794 0.147755 0.136239 2.442090
0.933333 0.007640 -0.165089 1.227744 0.160550 0.233965 2.222342
0.966667 0.014511 -0.151019 1.329169 0.171081 0.330088 1.887878
1.000000 0.021580 -0.136597 1.405062 0.180242 0.422024 1.447641
1.033333 0.028845 -0.121831 1.440138 0.188862 0.507081 0.924433
1.066667 0.033929 -0.099529 1.476490 0.198378 0.583274 0.347181
1.100000 0.039205 -0.076909 1.496295 0.210691 0.649775 -0.261295
1.133333 0.044674 -0.053989 1.496595 0.226772 0.705694 -0.875322
1.166667 0.050846 -0.025306 1.457078 0.247527 0.750887 -1.466568
1.200000 0.057208 0.003636 1.381847 0.273279 0.785489 -2.005677
1.233333 0.063760 0.032813 1.282183 0.304525 0.810156 -2.470405
1.266667 0.073974 0.063230 1.144444 0.340563 0.826332 -2.848152
1.300000 0.084372 0.093833 1.004118 0.380098 0.835017 -3.128184
1.333333 0.098426 0.122999 0.845144 0.421598 0.837427 -3.301632
1.366667 0.112648 0.152302 0.683912 0.463607 0.835027 -3.372142
1.400000 0.129126 0.179382 0.569283 0.504819 0.829307 -3.353416
1.433333 0.148611 0.205587 0.449904 0.543397 0.821641 -3.263314
1.466667 0.169841 0.231704 0.334790 0.578284 0.812695 -3.120418
1.500000 0.191186 0.257870 0.237630 0.608670 0.803054 -2.944151
1.533333 0.212631 0.284065 0.148647 0.634380 0.793104 -2.760785
1.566667 0.235782 0.310896 0.085654 0.654973 0.782659 -2.587330
1.600000 0.258997 0.337715 -0.001461 0.670099 0.771011 -2.430099
1.633333 0.282257 0.364498 -0.077476 0.680079 0.757537 -2.295293
1.666667 0.306018 0.390760 -0.116156 0.685251 0.741743 -2.182071
1.700000 0.329564 0.416074 -0.194678 0.685668 0.722941 -2.089711
1.733333 0.353574 0.440813 -0.266362 0.681096 0.700582 -2.011411
1.766667 0.377234 0.464273 -0.330424 0.671854 0.674658 -1.943426
1.800000 0.400412 0.486398 -0.416276 0.658529 0.645851 -1.884369
1.833333 0.423522 0.508371 -0.478720 0.641143 0.614544 -1.826403
1.866667 0.446546 0.530176 -0.526951 0.619393 0.580729 -1.770030
1.900000 0.467863 0.549330 -0.571014 0.593701 0.544996 -1.713800
1.933333 0.486865 0.565708 -0.634236 0.564525 0.507907 -1.660600
1.966667 0.505731 0.581876 -0.710712 0.532005 0.469576 -1.602878
2.000000 0.524448 0.597822 -0.731388 0.495927 0.429605 -1.540165
2.033333 0.539285 0.610322 -0.796122 0.456980 0.388386 -1.475434
2.066667 0.553948 0.622582 -0.824982 0.416412 0.346753 -1.404055
2.100000 0.568430 0.634595 -0.888962 0.374911 0.304931 -1.322056
2.133333 0.582719 0.646353 -0.953304 0.333217 0.263087 -1.222541
2.166667 0.593101 0.654447 -0.977962 0.292405 0.221767 -1.115652
2.200000 0.600481 0.659509 -1.025456 0.254001 0.182099 -1.000971
2.233333 0.607652 0.664306 -1.059271 0.218653 0.144486 -0.878038
2.266667 0.611893 0.666869 -1.112242 0.186771 0.109424 -0.750108
2.300000 0.615924 0.669169 -1.116856 0.158894 0.077613 -0.623849
2.333333 0.618489 0.670063 -1.112780 0.135621 0.049896 -0.509929
2.366667 0.620546 0.670128 -1.137151 0.116928 0.026669 -0.405439
2.400000 0.623925 0.669207 -1.126983 0.102098 0.007748 -0.315388
2.433333 0.627102 0.668042 -1.136600 0.090672 -0.006815 -0.241011
2.466667 0.630081 0.666637 -1.140495 0.081805 -0.017446 -0.185849
2.500000 0.632864 0.664998 -1.143223 0.074688 -0.024538 -0.148442
2.533333 0.635162 0.663858 -1.157715 0.068343 -0.028673 -0.120484
2.566667 0.637267 0.662495 -1.143057 0.062103 -0.030374 -0.102708
2.600000 0.639503 0.661406 -1.157780 0.055825 -0.030124 -0.088721
2.633333 0.641551 0.660104 -1.143923 0.049408 -0.028447 -0.080077
2.666667 0.643415 0.658596 -1.157214 0.043007 -0.025664 -0.072314
2.700000 0.644850 0.657811 -1.174699 0.036722 -0.022242 -0.062645
2.733333 0.645607 0.657339 -1.183377 0.030752 -0.018547 -0.052845
2.766667 0.645906 0.656904 -1.151234 0.025290 -0.014894 -0.041453
2.800000 0.646035 0.656280 -1.160143 0.020415 -0.011414 -0.031024
