t x y theta dxdt dydt dthetadt
0.000000 0.000000 0.000000 -1.659781 -0.118605 0.092805 -0.144074
0.033333 -0.003980 0.003122 -1.667724 -0.120477 0.094821 -0.138518
0.066667 -0.008028 0.006315 -1.682763 -0.122358 0.096851 -0.104991
0.100000 -0.012145 0.009580 -1.685029 -0.124247 0.098896 -0.035842
0.133333 -0.016321 0.012910 -1.685866 -0.126147 0.100957 0.082713
0.166667 -0.020555 0.016306 -1.663049 -0.128057 0.103033 0.266438
0.200000 -0.024847 0.019768 -1.679295 -0.129977 0.105125 0.526313
0.233333 -0.029197 0.023295 -1.680020 -0.131907 0.107232 0.862908
0.266667 -0.033620 0.026898 -1.699045 -0.133845 0.109353 1.276028
0.300000 -0.038114 0.030577 -1.715984 -0.135791 0.111488 1.761940
0.333333 -0.042682 0.034334 -1.684398 -0.137741 0.113634 2.308066
0.366667 -0.047307 0.038156 -1.585142 -0.139692 0.115792 2.898128
0.400000 -0.051989 0.042045 -1.477064 -0.141642 0.117959 3.509820
0.433333 -0.056745 0.046012 -1.318724 -0.143586 0.120135 4.125459
0.466667 -0.061574 0.050058 -1.144706 -0.145522 0.122321 4.710311
0.500000 -0.066459 0.054169 -0.947509 -0.147446 0.124517 5.228334
0.533333 -0.071416 0.058359 -0.744051 -0.149360 0.126727 5.645779
0.566667 -0.076429 0.062615 -0.552714 -0.151260 0.128951 5.934478
0.600000 -0.081496 0.066938 -0.317764 -0.153146 0.131193 6.068483
0.633333 -0.086632 0.071340 -0.073151 -0.155017 0.133455 6.026833
0.666667 -0.091835 0.075822 0.175536 -0.156874 0.135736 5.804972
0.700000 -0.097104 0.080385 0.435680 -0.158713 0.138035 5.403602
0.733333 -0.102426 0.085014 0.677597 -0.160533 0.140348 4.826109
0.766667 -0.107811 0.089724 0.900660 -0.162329 0.142670 4.077142
0.800000 -0.113258 0.094517 1.042722 -0.164100 0.144992 3.174986
0.833333 -0.118766 0.099392 1.169910 -0.165842 0.147307 2.142597
0.866667 -0.124333 0.104350 1.227707 -0.167554 0.149606 1.009947
0.900000 -0.129959 0.109390 1.228443 -0.169234 0.151881 -0.188296
0.933333 -0.135633 0.114493 1.199988 -0.170884 0.154123 -1.404661
0.966667 -0.141364 0.119677 1.130450 -0.172507 0.156327 -2.592206
1.000000 -0.147149 0.124939 1.006571 -0.174105 0.158489 -3.711099
1.033333 -0.152988 0.130277 0.873581 -0.175682 0.160604 -4.724212
1.066667 -0.158873 0.135678 0.647717 -0.177237 0.162671 -5.593094
1.100000 -0.164802 0.141139 0.384449 -0.178773 0.164689 -6.279548
1.133333 -0.170785 0.146671 0.085307 -0.180288 0.166657 -6.759581
1.166667 -0.176820 0.152270 -0.205078 -0.181780 0.168578 -7.009619
1.200000 -0.182907 0.157933 -0.500783 -0.183245 0.170451 -7.014720
1.233333 -0.189048 0.163657 -0.800277 -0.184679 0.172280 -6.775217
1.266667 -0.195242 0.169441 -1.049002 -0.186078 0.174068 -6.328706
1.300000 -0.201488 0.175282 -1.337297 -0.187434 0.175815 -5.731719
1.333333 -0.207773 0.181180 -1.602180 -0.188742 0.177525 -5.043581
1.366667 -0.214096 0.187133 -1.810634 -0.189997 0.179201 -4.331731
1.400000 -0.220454 0.193142 -1.909530 -0.191200 0.180844 -3.671144
1.433333 -0.226867 0.199201 -1.921750 -0.192351 0.182456 -3.126780
1.466667 -0.233313 0.205314 -1.905742 -0.193458 0.184039 -2.733504
1.500000 -0.239792 0.211480 -1.864426 -0.194533 0.185591 -2.512700
1.533333 -0.246303 0.217697 -1.821611 -0.195586 0.187112 -2.483397
1.566667 -0.252844 0.223966 -1.858483 -0.196630 0.188602 -2.645544
1.600000 -0.259414 0.230286 -1.950911 -0.197672 0.190061 -2.965641
1.633333 -0.266012 0.236654 -2.115268 -0.198720 0.191492 -3.392231
1.666667 -0.272637 0.243072 -2.241469 -0.199773 0.192896 -3.873860
1.700000 -0.279287 0.249537 -2.377040 -0.200829 0.194277 -4.353572
1.733333 -0.285988 0.256043 -2.557591 -0.201883 0.195640 -4.766541
1.766667 -0.292739 0.262589 -2.748623 -0.202923 0.196989 -5.066472
1.800000 -0.299538 0.269175 -2.965369 -0.203941 0.198327 -5.232923
1.833333 -0.306383 0.275801 3.099348 -0.204922 0.199659 -5.273039
1.866667 -0.313247 0.282469 2.876046 -0.205857 0.200988 -5.200525
1.900000 -0.320149 0.289192 2.653829 -0.206734 0.202314 -5.042046
1.933333 -0.327067 0.295955 2.461574 -0.207544 0.203637 -4.839265
1.966667 -0.334020 0.302772 2.294475 -0.208285 0.204956 -4.625784
2.000000 -0.340985 0.309628 2.163901 -0.208956 0.206266 -4.438487
2.033333 -0.347980 0.316536 2.068291 -0.209560 0.207562 -4.301739
2.066667 -0.354985 0.323481 1.994743 -0.210102 0.208837 -4.234312
2.100000 -0.361998 0.330461 1.915677 -0.210590 0.210087 -4.243350
2.133333 -0.369035 0.337491 1.826236 -0.211028 0.211308 -4.320009
2.166667 -0.376096 0.344570 1.695364 -0.211422 0.212495 -4.452246
2.200000 -0.383159 0.351681 1.531599 -0.211777 0.213647 -4.602336
2.233333 -0.390240 0.358838 1.329106 -0.212095 0.214763 -4.720288
2.266667 -0.397321 0.366024 1.117034 -0.212380 0.215840 -4.758399
2.300000 -0.404399 0.373238 0.955963 -0.212633 0.216875 -4.671886
2.333333 -0.411491 0.380491 0.737244 -0.212856 0.217868 -4.417999
2.366667 -0.418596 0.387780 0.527178 -0.213053 0.218819 -3.962944
2.400000 -0.425711 0.395102 0.351811 -0.213221 0.219726 -3.297502
2.433333 -0.432837 0.402457 0.186511 -0.213356 0.220588 -2.436066
2.466667 -0.439950 0.409832 0.056554 -0.213457 0.221406 -1.400286
2.500000 -0.447071 0.417235 -0.029714 -0.213515 0.222179 -0.221356
2.533333 -0.454197 0.424664 -0.044374 -0.213520 0.222907 1.050415
2.566667 -0.461328 0.432116 0.036525 -0.213460 0.223589 2.346545
2.600000 -0.468461 0.439590 0.133697 -0.213329 0.224225 3.604381
2.633333 -0.475592 0.447085 0.317852 -0.213117 0.224817 4.759534
2.666667 -0.482721 0.454600 0.550908 -0.212815 0.225365 5.749106
2.700000 -0.489842 0.462133 0.829549 -0.212416 0.225871 6.515341
2.733333 -0.496936 0.469676 1.151166 -0.211916 0.226340 7.013820
2.766667 -0.504015 0.477236 1.494386 -0.211314 0.226777 7.239781
2.800000 -0.511078 0.484814 1.824937 -0.210607 0.227181 7.190345
2.833333 -0.518105 0.492397 2.141025 -0.209798 0.227557 6.887225
2.866667 -0.525109 0.499997 2.466741 -0.208889 0.227906 6.364939
2.900000 -0.532074 0.507598 2.658643 -0.207886 0.228230 5.676872
2.933333 -0.539007 0.515216 2.848860 -0.206790 0.228523 4.883431
2.966667 -0.545898 0.522833 2.993993 -0.205603 0.228782 4.032866
3.000000 -0.552749 0.530466 3.084031 -0.204327 0.229007 3.180778
3.033333 -0.559557 0.538117 3.129097 -0.202963 0.229193 2.373957
3.066667 -0.566319 0.545785 -3.136534 -0.201510 0.229333 1.653598
3.100000 -0.573034 0.553453 -3.117135 -0.199969 0.229422 1.032828
3.133333 -0.579695 0.561110 -3.132053 -0.198337 0.229461 0.520133
3.166667 -0.586302 0.568767 3.141242 -0.196614 0.229451 0.115206
3.200000 -0.592847 0.576438 3.134591 -0.194798 0.229385 -0.193408
3.233333 -0.599330 0.584092 3.097649 -0.192891 0.229265 -0.423021
3.266667 -0.605751 0.591728 3.064208 -0.190889 0.229098 -0.595560
3.300000 -0.612100 0.599372 3.029723 -0.188796 0.228887 -0.717502
3.333333 -0.618374 0.607023 3.002992 -0.186612 0.228627 -0.799534
3.366667 -0.624578 0.614648 2.996578 -0.184340 0.228316 -0.849600
3.400000 -0.630711 0.622247 2.986785 -0.181983 0.227954 -0.872079
3.433333 -0.636759 0.629845 2.939574 -0.179543 0.227539 -0.870401
3.466667 -0.642721 0.637437 2.883240 -0.177025 0.227059 -0.846949
3.500000 -0.648592 0.645022 2.834259 -0.174430 0.226509 -0.813616
3.533333 -0.654372 0.652596 2.802069 -0.171760 0.225888 -0.784068
3.566667 -0.660069 0.660132 2.780398 -0.169017 0.225193 -0.771783
3.600000 -0.665670 0.667651 2.761522 -0.166205 0.224414 -0.790687
3.633333 -0.671184 0.675128 2.744935 -0.163327 0.223548 -0.856631
3.666667 -0.676597 0.682581 2.730773 -0.160382 0.222595 -0.985578
3.700000 -0.681907 0.690006 2.730480 -0.157374 0.221552 -1.180058
3.733333 -0.687111 0.697400 2.733819 -0.154308 0.220416 -1.438550
3.766667 -0.692222 0.704743 2.727473 -0.151185 0.219184 -1.756710
3.800000 -0.697224 0.712047 2.699028 -0.148008 0.217857 -2.126954
3.833333 -0.702115 0.719310 2.609716 -0.144781 0.216431 -2.532609
3.866667 -0.706895 0.726527 2.480127 -0.141509 0.214903 -2.950613
3.900000 -0.711560 0.733694 2.348009 -0.138197 0.213271 -3.367812
3.933333 -0.716123 0.740799 2.213865 -0.134845 0.211534 -3.763091
3.966667 -0.720568 0.747846 2.073483 -0.131454 0.209690 -4.115095
4.000000 -0.724893 0.754830 1.909010 -0.128028 0.207737 -4.399115
4.033333 -0.729112 0.761745 1.779784 -0.124568 0.205678 -4.600417
4.066667 -0.733222 0.768589 1.594018 -0.121072 0.203513 -4.702712
4.100000 -0.737208 0.775359 1.412773 -0.117537 0.201244 -4.679683
4.133333 -0.741070 0.782049 1.231669 -0.113966 0.198872 -4.510827
4.166667 -0.744819 0.788662 1.053981 -0.110357 0.196400 -4.177060
4.200000 -0.748453 0.795195 0.872621 -0.106708 0.193827 -3.670722
4.233333 -0.751960 0.801636 0.680819 -0.103013 0.191151 -2.980660
4.266667 -0.755338 0.807982 0.519244 -0.099273 0.188375 -2.115699
4.300000 -0.758587 0.814228 0.395776 -0.095487 0.185498 -1.108460
4.333333 -0.761716 0.820385 0.337765 -0.091653 0.182526 -0.000308
4.366667 -0.764725 0.826452 0.332363 -0.087770 0.179462 1.154154
4.400000 -0.767602 0.832409 0.388872 -0.083840 0.176315 2.297713
4.433333 -0.770345 0.838255 0.532969 -0.079865 0.173092 3.369093
4.466667 -0.772954 0.843986 0.732145 -0.075848 0.169806 4.319465
4.500000 -0.775425 0.849600 0.992206 -0.071788 0.166461 5.120378
4.533333 -0.777757 0.855097 1.268347 -0.067683 0.163064 5.749628
4.566667 -0.779947 0.860476 1.546396 -0.063536 0.159621 6.201889
4.600000 -0.781991 0.865733 1.815251 -0.059344 0.156135 6.486292
4.633333 -0.783907 0.870885 2.010685 -0.055108 0.152605 6.631691
4.666667 -0.785694 0.875928 2.244299 -0.050827 0.149031 6.671089
4.700000 -0.787326 0.880846 2.442237 -0.046507 0.145412 6.642093
4.733333 -0.788827 0.885653 2.620728 -0.042155 0.141750 6.588492
4.766667 -0.790167 0.890331 2.845408 -0.037774 0.138041 6.549170
4.800000 -0.791374 0.894895 3.077203 -0.033368 0.134284 6.558012
4.833333 -0.792415 0.899328 -2.974858 -0.028939 0.130477 6.619897
4.866667 -0.793290 0.903612 -2.762203 -0.024492 0.126621 6.737273
4.900000 -0.794031 0.907778 -2.579142 -0.020021 0.122711 6.894252
4.933333 -0.794602 0.911794 -2.414234 -0.015520 0.118745 7.068884
4.966667 -0.795039 0.915687 -2.181261 -0.010983 0.114720 7.231081
5.000000 -0.795341 0.919457 -1.916782 -0.006407 0.110635 7.339221
5.033333 -0.795507 0.923102 -1.644343 -0.001778 0.106483 7.360283
5.066667 -0.795539 0.926622 -1.358988 0.002914 0.102258 7.251702
5.100000 -0.795391 0.929984 -1.060996 0.007668 0.097963 6.979171
5.133333 -0.795060 0.933187 -0.752482 0.012485 0.093596 6.501194
5.166667 -0.794594 0.936261 -0.468305 0.017361 0.089157 5.793640
5.200000 -0.793944 0.939173 -0.197145 0.022287 0.084650 4.857604
5.233333 -0.793107 0.941921 -0.026830 0.027238 0.080089 3.707549
5.266667 -0.792136 0.944535 0.151910 0.032192 0.075483 2.372059
5.300000 -0.790977 0.946983 0.265435 0.037141 0.070834 0.892826
5.333333 -0.789632 0.949261 0.287839 0.042067 0.066148 -0.665306
5.366667 -0.788099 0.951368 0.232587 0.046956 0.061429 -2.236821
5.400000 -0.786432 0.953339 0.093303 0.051800 0.056678 -3.240398
5.433333 -0.784633 0.955173 -0.120380 0.056606 0.051883 -3.615253
5.466667 -0.782650 0.956827 -0.389012 0.061369 0.047048 -3.815661
5.500000 -0.780536 0.958344 -0.706609 0.066080 0.042180 -3.776027
5.533333 -0.778242 0.959676 -0.983195 0.070737 0.037283 -3.457920
5.566667 -0.775819 0.960869 -1.347755 0.075343 0.032362 -2.831195
5.600000 -0.773221 0.961874 -1.733779 0.079893 0.027430 -2.921591
5.633333 -0.770452 0.962689 -2.130566 0.084374 0.022507 -3.726491
5.666667 -0.767556 0.963365 -2.498161 0.088785 0.017600 -4.218605
5.700000 -0.764494 0.963848 -2.851295 0.093124 0.012722 -4.434865
5.733333 -0.761269 0.964139 3.131831 0.097386 0.007879 -4.404767
5.766667 -0.757921 0.964289 2.905498 0.101565 0.003085 -4.169824
5.800000 -0.754450 0.964300 2.763873 0.105657 -0.001661 -3.261767
5.833333 -0.750859 0.964171 2.724453 0.109669 -0.006364 -1.745475
5.866667 -0.747148 0.963902 2.706212 0.113601 -0.011027 -0.210060
5.900000 -0.743284 0.963456 2.709370 0.117458 -0.015660 1.280101
5.933333 -0.739271 0.962835 2.807078 0.121241 -0.020265 2.660306
5.966667 -0.735142 0.962074 2.951235 0.124956 -0.024851 3.869350
6.000000 -0.730901 0.961175 -3.119624 0.128603 -0.029422 4.858046
6.033333 -0.726547 0.960138 -2.849306 0.132180 -0.033982 5.595556
6.066667 -0.722061 0.958916 -2.596605 0.135686 -0.038531 6.065350
6.100000 -0.717466 0.957556 -2.287795 0.139119 -0.043074 6.255025
6.133333 -0.712747 0.956015 -1.965117 0.142482 -0.047616 6.165223
6.166667 -0.707922 0.954337 -1.688568 0.145774 -0.052157 5.809799
6.200000 -0.702994 0.952525 -1.460119 0.148997 -0.056692 5.217856
6.233333 -0.697964 0.950578 -1.260768 0.152151 -0.061215 4.428534
6.266667 -0.692833 0.948497 -1.092295 0.155237 -0.065724 3.476583
6.300000 -0.687596 0.946244 -0.980041 0.158252 -0.070210 2.411046
6.333333 -0.682254 0.943821 -0.913082 0.161194 -0.074669 1.282100
6.366667 -0.676812 0.941230 -0.921824 0.164060 -0.079098 0.135749
6.400000 -0.671274 0.938472 -0.954025 0.166846 -0.083492 -0.995475
6.433333 -0.665645 0.935585 -1.025114 0.169551 -0.087849 -2.088440
6.466667 -0.659927 0.932570 -1.105973 0.172170 -0.092160 -3.116363
6.500000 -0.654123 0.929429 -1.262102 0.174705 -0.096419 -4.058546
6.533333 -0.648234 0.926162 -1.439452 0.177153 -0.100621 -4.904308
6.566667 -0.642268 0.922741 -1.644525 0.179517 -0.104763 -5.638069
6.600000 -0.636228 0.919166 -1.875542 0.181800 -0.108845 -6.243834
6.633333 -0.630118 0.915443 -2.130743 0.184006 -0.112863 -6.693763
6.666667 -0.623931 0.911599 -2.339529 0.186142 -0.116814 -6.971115
6.700000 -0.617679 0.907612 -2.629656 0.188212 -0.120695 -7.056749
6.733333 -0.611355 0.903508 -2.937708 0.190221 -0.124494 -6.930409
6.766667 -0.604969 0.899267 3.022183 0.192174 -0.128203 -6.578047
6.800000 -0.598521 0.894906 2.748640 0.194076 -0.131817 -5.981337
6.833333 -0.592011 0.890429 2.485881 0.195926 -0.135334 -5.149464
6.866667 -0.585441 0.885838 2.288740 0.197727 -0.138755 -4.082938
6.900000 -0.578812 0.881136 2.140547 0.199480 -0.142081 -2.804207
6.933333 -0.572123 0.876326 1.955571 0.201183 -0.145317 -1.346149
6.966667 -0.565377 0.871411 1.934453 0.202835 -0.148469 0.248814
7.000000 -0.558575 0.866391 1.940672 0.204433 -0.151538 1.406833
7.033333 -0.551721 0.861273 2.034453 0.205973 -0.154527 2.079163
7.066667 -0.544816 0.856060 2.205627 0.207453 -0.157438 2.204147
7.100000 -0.537861 0.850748 2.446043 0.208865 -0.160271 1.724191
7.133333 -0.530860 0.845339 2.760364 0.210208 -0.163027 0.581660
7.166667 -0.523813 0.839835 3.107738 0.211476 -0.165706 -1.281399
7.200000 -0.516724 0.834256 -2.756005 0.212670 -0.168310 -2.881846
7.233333 -0.509595 0.828585 -2.299117 0.213787 -0.170841 -4.271422
7.266667 -0.502432 0.822833 -1.900416 0.214831 -0.173305 -4.956269
7.300000 -0.495233 0.816993 -1.360029 0.215805 -0.175706 -4.954835
7.333333 -0.488005 0.811078 -0.827140 0.216710 -0.178051 -4.261641
7.366667 -0.480753 0.805091 -0.332109 0.217548 -0.180346 -2.846514
7.400000 -0.473478 0.799036 0.117340 0.218322 -0.182594 -1.170094
7.433333 -0.466182 0.792918 0.492890 0.219034 -0.184801 0.847066
7.466667 -0.458861 0.786721 0.803709 0.219683 -0.186968 2.231374
7.500000 -0.451516 0.780447 1.014936 0.220267 -0.189095 3.075229
7.533333 -0.444149 0.774100 1.131184 0.220784 -0.191184 3.461790
7.566667 -0.436763 0.767680 1.159537 0.221232 -0.193232 3.461112
7.600000 -0.429359 0.761189 1.141325 0.221609 -0.195239 3.117806
7.633333 -0.421939 0.754630 1.125505 0.221910 -0.197198 2.456038
7.666667 -0.414519 0.748011 1.133474 0.222135 -0.199108 2.007970
7.700000 -0.407099 0.741333 1.156782 0.222285 -0.200967 1.756805
7.733333 -0.399670 0.734593 1.228680 0.222363 -0.202771 1.668564
7.766667 -0.392234 0.727792 1.299265 0.222371 -0.204521 1.702893
7.800000 -0.384806 0.720934 1.381248 0.222309 -0.206216 1.820840
7.833333 -0.377388 0.714021 1.453733 0.222182 -0.207860 1.989775
7.866667 -0.369982 0.707054 1.521533 0.221992 -0.209451 2.199181
7.900000 -0.362577 0.700034 1.583262 0.221738 -0.210991 2.448962
7.933333 -0.355175 0.692963 1.648454 0.221421 -0.212478 2.759495
7.966667 -0.347778 0.685844 1.741247 0.221042 -0.213910 3.149921
8.000000 -0.340401 0.678678 1.811217 0.220605 -0.215287 3.639747
8.033333 -0.333032 0.671466 1.911666 0.220110 -0.216606 4.237827
8.066667 -0.325687 0.664211 2.003864 0.219556 -0.217868 4.928973
8.100000 -0.318366 0.656914 2.128653 0.218941 -0.219074 5.678795
8.133333 -0.311072 0.649577 2.287587 0.218266 -0.220225 6.431916
8.166667 -0.303806 0.642202 2.490690 0.217527 -0.221323 7.137684
8.200000 -0.296559 0.634793 2.785137 0.216724 -0.222372 7.731224
8.233333 -0.289330 0.627352 3.138738 0.215855 -0.223370 8.152802
8.266667 -0.282137 0.619882 -2.745694 0.214922 -0.224319 8.350388
8.300000 -0.274966 0.612384 -2.348182 0.213928 -0.225217 8.296334
8.333333 -0.267820 0.604860 -1.973599 0.212874 -0.226063 7.984523
8.366667 -0.260720 0.597301 -1.614314 0.211757 -0.226853 7.414044
8.400000 -0.253667 0.589711 -1.313058 0.210579 -0.227584 6.618856
8.433333 -0.246665 0.582093 -1.094351 0.209336 -0.228254 5.650941
8.466667 -0.239716 0.574450 -0.953115 0.208031 -0.228856 4.580118
8.500000 -0.232799 0.566791 -0.802619 0.206664 -0.229389 3.463558
8.533333 -0.225917 0.559119 -0.754381 0.205238 -0.229848 2.359435
8.566667 -0.219070 0.551434 -0.730532 0.203758 -0.230232 1.318800
8.600000 -0.212288 0.543737 -0.764673 0.202225 -0.230537 0.371519
8.633333 -0.205544 0.536032 -0.802985 0.200641 -0.230766 -0.474049
8.666667 -0.198869 0.528320 -0.870750 0.199003 -0.230917 -1.222612
8.700000 -0.192267 0.520603 -0.932329 0.197314 -0.230993 -1.877181
8.733333 -0.185708 0.512886 -1.020613 0.195574 -0.230994 -2.458862
8.766667 -0.179224 0.505170 -1.096440 0.193785 -0.230920 -2.987157
8.800000 -0.172786 0.497457 -1.192227 0.191951 -0.230771 -3.478702
8.833333 -0.166395 0.489748 -1.321264 0.190078 -0.230548 -3.941730
8.866667 -0.160084 0.482051 -1.441911 0.188171 -0.230251 -4.389169
8.900000 -0.153822 0.474362 -1.594582 0.186231 -0.229881 -4.823277
8.933333 -0.147641 0.466689 -1.803212 0.184263 -0.229435 -5.230243
8.966667 -0.141543 0.459037 -2.000524 0.182271 -0.228918 -5.589039
9.000000 -0.135498 0.451400 -2.165929 0.180260 -0.228328 -5.877394
9.033333 -0.129505 0.443778 -2.386883 0.178235 -0.227662 -6.067622
9.066667 -0.123595 0.436185 -2.623868 0.176200 -0.226918 -6.118136
9.100000 -0.117767 0.428622 -2.865900 0.174165 -0.226092 -5.994098
9.133333 -0.111996 0.421081 -3.120737 0.172130 -0.225180 -5.669730
9.166667 -0.106306 0.413575 2.911130 0.170097 -0.224177 -5.126715
9.200000 -0.100673 0.406094 2.677100 0.168066 -0.223079 -4.347249
9.233333 -0.095098 0.398641 2.458101 0.166037 -0.221887 -3.329430
9.266667 -0.089598 0.391245 2.286709 0.164012 -0.220602 -2.101962
9.300000 -0.084157 0.383879 2.185830 0.161986 -0.219226 -0.702323
9.333333 -0.078789 0.376574 2.144059 0.159959 -0.217768 0.817284
9.366667 -0.073494 0.369332 2.169785 0.157928 -0.216236 2.388823
9.400000 -0.068260 0.362126 2.302713 0.155893 -0.214640 3.400610
9.433333 -0.063097 0.354989 2.505465 0.153850 -0.212989 4.283247
9.466667 -0.058005 0.347924 2.783132 0.151796 -0.211291 4.962455
9.500000 -0.052977 0.340900 3.110692 0.149731 -0.209554 5.361254
9.533333 -0.048021 0.333956 -2.786558 0.147654 -0.207781 5.421227
9.566667 -0.043128 0.327056 -2.367090 0.145563 -0.205974 5.111748
9.600000 -0.038300 0.320200 -2.029721 0.143455 -0.204133 5.489700
9.633333 -0.033551 0.313421 -1.624449 0.141332 -0.202257 5.536018
9.666667 -0.028867 0.306688 -1.264869 0.139191 -0.200344 5.299121
9.700000 -0.024262 0.300039 -0.994269 0.137034 -0.198395 4.852170
9.733333 -0.019724 0.293439 -0.802062 0.134864 -0.196411 4.279502
9.766667 -0.015265 0.286923 -0.685008 0.132683 -0.194394 3.663696
9.800000 -0.010872 0.280459 -0.651090 0.130494 -0.192350 2.543706
9.833333 -0.006559 0.274079 -0.679772 0.128300 -0.190276 1.512654
9.866667 -0.002326 0.267783 -0.724632 0.126102 -0.188180 0.620272
9.900000 0.001841 0.261542 -0.761812 0.123902 -0.186063 -0.107216
9.933333 0.005928 0.255386 -0.809627 0.121703 -0.183926 -0.665071
9.966667 0.009948 0.249287 -0.876621 0.119503 -0.181772 -1.061742
10.000000 0.013900 0.243246 -0.932285 0.117306 -0.179604 -1.315494
10.033333 0.017774 0.237290 -1.002375 0.115114 -0.177428 -1.460318
10.066667 0.021581 0.231393 -1.061082 0.112929 -0.175247 -1.531081
10.100000 0.025309 0.225582 -1.111232 0.110752 -0.173062 -1.554058
10.133333 0.028960 0.219856 -1.156328 0.108584 -0.170877 -1.548686
10.166667 0.032532 0.214216 -1.209583 0.106429 -0.168697 -1.533166
10.200000 0.036038 0.208638 -1.244392 0.104287 -0.166523 -1.515924
10.233333 0.039476 0.203123 -1.292004 0.102158 -0.164352 -1.501086
10.266667 0.042838 0.197693 -1.354010 0.100040 -0.162181 -1.490212
10.300000 0.046133 0.192327 -1.400132 0.097934 -0.160008 -1.484424
10.333333 0.049361 0.187026 -1.447831 0.095838 -0.157828 -1.482511
10.366667 0.052523 0.181790 -1.502684 0.093749 -0.155633 -1.481499
10.400000 0.055618 0.176619 -1.544455 0.091665 -0.153418 -1.478654
10.433333 0.058639 0.171533 -1.590085 0.089586 -0.151182 -1.473382
10.466667 0.061595 0.166513 -1.645885 0.087514 -0.148926 -1.463268
10.500000 0.064477 0.161579 -1.708599 0.085448 -0.146648 -1.447046
10.533333 0.067287 0.156728 -1.749582 0.083390 -0.144353 -1.426835
10.566667 0.070026 0.151962 -1.791665 0.081345 -0.142049 -1.401851
10.600000 0.072694 0.147280 -1.848558 0.079315 -0.139741 -1.371242
10.633333 0.075298 0.142666 -1.888675 0.077302 -0.137433 -1.334559
10.666667 0.077838 0.138120 -1.929065 0.075309 -0.135131 -1.293942
10.700000 0.080310 0.133657 -1.988027 0.073338 -0.132838 -1.249238
10.733333 0.082719 0.129263 -2.017281 0.071389 -0.130556 -1.199282
