t x y theta dxdt dydt dthetadt
0.000000 0.000000 0.000000 -0.323362 -0.004898 -0.007299 -0.005575
0.033333 -0.000170 -0.000200 -0.333311 -0.007429 -0.009682 -0.001604
0.066667 -0.000375 -0.000127 -0.333613 -0.010809 -0.013098 0.003291
0.100000 -0.000507 -0.000205 -0.325349 -0.015245 -0.017779 0.006370
0.133333 -0.001068 -0.000547 -0.325292 -0.021453 -0.024405 0.006674
0.166667 -0.001599 -0.001063 -0.329014 -0.029944 -0.033544 0.007390
0.200000 -0.002102 -0.001755 -0.319919 -0.040945 -0.045552 0.004044
0.233333 -0.002577 -0.002625 -0.320974 -0.054722 -0.060734 -0.005509
0.266667 -0.003027 -0.003675 -0.322144 -0.071528 -0.079366 -0.024422
0.300000 -0.004657 -0.005577 -0.328726 -0.091508 -0.101662 -0.051046
0.333333 -0.008186 -0.008957 -0.324146 -0.113648 -0.126669 -0.086434
0.366667 -0.011689 -0.012519 -0.329126 -0.137036 -0.153490 -0.134093
0.400000 -0.015162 -0.016259 -0.322597 -0.160916 -0.181331 -0.187406
0.433333 -0.018605 -0.020177 -0.328033 -0.184512 -0.209422 -0.242522
0.466667 -0.028372 -0.030825 -0.328029 -0.206512 -0.236483 -0.293145
0.500000 -0.038096 -0.041640 -0.329978 -0.226028 -0.261867 -0.337697
0.533333 -0.047769 -0.052613 -0.362275 -0.243063 -0.285966 -0.369397
0.566667 -0.057382 -0.063737 -0.377978 -0.257633 -0.309361 -0.382093
0.600000 -0.066925 -0.075000 -0.412888 -0.269636 -0.332738 -0.373555
0.633333 -0.076390 -0.086394 -0.434312 -0.278872 -0.356939 -0.343363
0.666667 -0.085767 -0.097910 -0.448586 -0.286201 -0.383894 -0.291809
0.700000 -0.095048 -0.109536 -0.472866 -0.291948 -0.414439 -0.215324
0.733333 -0.104223 -0.121264 -0.474382 -0.296128 -0.448730 -0.121625
0.766667 -0.113284 -0.133083 -0.467868 -0.298549 -0.486397 -0.015315
0.800000 -0.122221 -0.144983 -0.466607 -0.299261 -0.526851 0.095198
0.833333 -0.133666 -0.163173 -0.465618 -0.298204 -0.568444 0.205983
0.866667 -0.145854 -0.184825 -0.454191 -0.294714 -0.608694 0.311860
0.900000 -0.158026 -0.208740 -0.436447 -0.288275 -0.645175 0.402725
0.933333 -0.168574 -0.233943 -0.419287 -0.278570 -0.675643 0.481657
0.966667 -0.177729 -0.260971 -0.397130 -0.265746 -0.697969 0.545276
1.000000 -0.186694 -0.287956 -0.378666 -0.249832 -0.710136 0.597289
1.033333 -0.195460 -0.314871 -0.339381 -0.231393 -0.711797 0.635455
1.066667 -0.204018 -0.341689 -0.327200 -0.211079 -0.702979 0.663191
1.100000 -0.210099 -0.366576 -0.289743 -0.189884 -0.684802 0.683337
1.133333 -0.215956 -0.391314 -0.277175 -0.168346 -0.658439 0.694885
1.166667 -0.220430 -0.413080 -0.248169 -0.146764 -0.625912 0.703111
1.200000 -0.224668 -0.434649 -0.234655 -0.125438 -0.589247 0.708718
1.233333 -0.227896 -0.452655 -0.213992 -0.104291 -0.549928 0.719621
1.266667 -0.230879 -0.470423 -0.176193 -0.083302 -0.509562 0.734473
1.300000 -0.233286 -0.485236 -0.166176 -0.061855 -0.469192 0.759469
1.333333 -0.235442 -0.499778 -0.132675 -0.039651 -0.430108 0.795691
1.366667 -0.237344 -0.514032 -0.107823 -0.015949 -0.392832 0.843713
1.400000 -0.238226 -0.525552 -0.083219 0.009927 -0.358083 0.903857
1.433333 -0.238849 -0.536755 -0.069381 0.038811 -0.326272 0.972018
1.466667 -0.236656 -0.545618 -0.041354 0.071649 -0.297922 1.046946
1.500000 -0.234204 -0.554142 -0.004259 0.108919 -0.273299 1.121659
1.533333 -0.231494 -0.562316 0.036471 0.151089 -0.252626 1.190606
1.566667 -0.227057 -0.569221 0.095241 0.197938 -0.236394 1.244940
1.600000 -0.222366 -0.575756 0.139608 0.249368 -0.224687 1.273945
1.633333 -0.215429 -0.581634 0.173829 0.304525 -0.217674 1.266409
1.666667 -0.205450 -0.587347 0.230581 0.361938 -0.214837 1.216157
1.700000 -0.191358 -0.593573 0.290633 0.419951 -0.215782 1.119009
1.733333 -0.177046 -0.599394 0.358524 0.476640 -0.219800 0.975105
1.766667 -0.159193 -0.605979 0.413726 0.529339 -0.225323 0.789295
1.800000 -0.137962 -0.613954 0.427462 0.575057 -0.230830 0.572938
1.833333 -0.116562 -0.621491 0.452812 0.611598 -0.234730 0.339617
1.866667 -0.092017 -0.630536 0.457976 0.637588 -0.235676 0.104345
1.900000 -0.065158 -0.640544 0.472891 0.651813 -0.231914 -0.117421
1.933333 -0.038203 -0.650072 0.448014 0.653012 -0.221513 -0.310350
1.966667 -0.012237 -0.659836 0.392313 0.641979 -0.203773 -0.462066
2.000000 0.010503 -0.668806 0.339831 0.619864 -0.178281 -0.565863
2.033333 0.033265 -0.677249 0.302006 0.587573 -0.144717 -0.613306
2.066667 0.056026 -0.685152 0.277216 0.546017 -0.103054 -0.602665
2.100000 0.070738 -0.687134 0.267691 0.496892 -0.055009 -0.537936
2.133333 0.085413 -0.688552 0.235968 0.442518 -0.003000 -0.423525
2.166667 0.100037 -0.689396 0.203096 0.384096 0.050975 -0.268186
2.200000 0.114597 -0.689659 0.184260 0.322947 0.105021 -0.081246
2.233333 0.125259 -0.684058 0.200631 0.260754 0.156899 0.118966
2.266667 0.132151 -0.673700 0.209938 0.199466 0.204340 0.314477
2.300000 0.138949 -0.662752 0.217163 0.140580 0.247194 0.491597
2.333333 0.140102 -0.650666 0.223445 0.086051 0.285752 0.629549
2.366667 0.141157 -0.637996 0.260355 0.038283 0.320485 0.711613
2.400000 0.142114 -0.624745 0.317540 -0.000514 0.351891 0.727359
2.433333 0.136131 -0.613902 0.360847 -0.028299 0.381418 0.678307
2.466667 0.130059 -0.602482 0.437310 -0.043648 0.411012 0.569546
2.500000 0.123905 -0.590487 0.489967 -0.045172 0.441589 0.409260
2.533333 0.117679 -0.577917 0.522198 -0.033021 0.473890 0.213965
2.566667 0.111937 -0.563678 0.526310 -0.008145 0.508327 0.007466
2.600000 0.108551 -0.546994 0.507881 0.028291 0.545154 -0.189242
2.633333 0.108159 -0.527817 0.455050 0.074443 0.583333 -0.356529
2.666667 0.111311 -0.506459 0.394187 0.127986 0.620777 -0.477140
2.700000 0.118849 -0.483158 0.338589 0.185750 0.654904 -0.538061
2.733333 0.126327 -0.459318 0.313985 0.245324 0.683224 -0.533332
2.766667 0.133736 -0.434951 0.276280 0.304756 0.703553 -0.466074
2.800000 0.146009 -0.408683 0.276362 0.362084 0.713911 -0.343080
2.833333 0.162834 -0.382036 0.254294 0.415312 0.713476 -0.176686
2.866667 0.179555 -0.354897 0.242230 0.462903 0.702635 0.016492
2.900000 0.196152 -0.327280 0.261448 0.504002 0.683092 0.215156
2.933333 0.212609 -0.299198 0.280341 0.537762 0.656563 0.402405
2.966667 0.233286 -0.274068 0.313272 0.562932 0.624962 0.555491
3.000000 0.255496 -0.254387 0.334468 0.578287 0.590680 0.658941
3.033333 0.278155 -0.240997 0.345640 0.583442 0.556208 0.694534
3.066667 0.300587 -0.227166 0.371101 0.578164 0.523853 0.653012
3.100000 0.322768 -0.212890 0.418679 0.562411 0.495502 0.538242
3.133333 0.344672 -0.198167 0.493664 0.536153 0.473035 0.350754
3.166667 0.366278 -0.182992 0.576094 0.500004 0.457953 0.103930
3.200000 0.384328 -0.169437 0.605160 0.455660 0.451010 -0.191925
3.233333 0.397936 -0.155827 0.577053 0.404850 0.452011 -0.514606
3.266667 0.411185 -0.141753 0.537568 0.349418 0.460624 -0.844869
3.300000 0.424060 -0.127210 0.452971 0.291246 0.476100 -1.165686
3.333333 0.430984 -0.113319 0.400969 0.232597 0.498007 -1.454005
3.366667 0.437509 -0.098948 0.316745 0.175478 0.526007 -1.689417
3.400000 0.440752 -0.082901 0.231298 0.120995 0.559706 -1.855881
3.433333 0.441334 -0.064103 0.163864 0.069770 0.598739 -1.953858
3.466667 0.441500 -0.044815 0.078381 0.022390 0.642345 -1.981440
3.500000 0.440106 -0.022726 0.001060 -0.020655 0.689948 -1.947802
3.533333 0.438293 -0.000145 -0.067505 -0.059636 0.740314 -1.865630
3.566667 0.435610 0.024553 -0.124458 -0.094717 0.792206 -1.754214
3.600000 0.431281 0.052668 -0.195946 -0.126174 0.844513 -1.630555
3.633333 0.426532 0.081264 -0.258904 -0.154327 0.896914 -1.500674
3.666667 0.420324 0.113115 -0.296853 -0.179516 0.949102 -1.377355
3.700000 0.412772 0.147834 -0.338150 -0.202153 1.000813 -1.267514
3.733333 0.404809 0.183005 -0.353142 -0.222276 1.052112 -1.177478
3.766667 0.396438 0.218613 -0.388427 -0.240104 1.102847 -1.103852
3.800000 0.387666 0.254647 -0.404092 -0.255819 1.153256 -1.045204
3.833333 0.378490 0.293390 -0.433242 -0.269480 1.202707 -1.000756
3.866667 0.368922 0.332530 -0.465458 -0.281233 1.251332 -0.966797
3.900000 0.359111 0.376166 -0.508297 -0.291382 1.298833 -0.936364
3.933333 0.348918 0.420163 -0.545228 -0.300158 1.345033 -0.901593
3.966667 0.338709 0.467452 -0.587321 -0.307773 1.389718 -0.863963
4.000000 0.328129 0.515057 -0.607029 -0.314249 1.432404 -0.825028
4.033333 0.317689 0.565878 -0.656613 -0.319622 1.472999 -0.786341
4.066667 0.306889 0.616965 -0.688886 -0.324018 1.510575 -0.747516
4.100000 0.295735 0.668290 -0.698142 -0.327422 1.544938 -0.712708
4.133333 0.284231 0.719827 -0.697947 -0.329969 1.575657 -0.689944
4.166667 0.272384 0.771547 -0.708177 -0.331890 1.602246 -0.678607
4.200000 0.261266 0.827038 -0.729211 -0.333691 1.623970 -0.672297
4.233333 0.249815 0.882655 -0.753231 -0.335791 1.640392 -0.667575
4.266667 0.238930 0.939798 -0.766708 -0.338818 1.650513 -0.662128
4.300000 0.227722 0.997002 -0.788599 -0.343410 1.652998 -0.647960
4.333333 0.217290 1.053952 -0.829791 -0.350356 1.645940 -0.611747
4.366667 0.206545 1.110899 -0.881058 -0.360249 1.627522 -0.547828
4.400000 0.195489 1.167814 -0.904546 -0.373476 1.595631 -0.454060
4.433333 0.184127 1.224663 -0.917756 -0.390460 1.547924 -0.330397
4.466667 0.172464 1.281416 -0.949690 -0.411025 1.483813 -0.174599
4.500000 0.158613 1.331412 -0.938148 -0.434832 1.403284 0.003771
4.533333 0.144472 1.381256 -0.941201 -0.461091 1.307728 0.193166
4.566667 0.130047 1.430925 -0.946239 -0.489065 1.198978 0.384603
4.600000 0.112664 1.471378 -0.925579 -0.517884 1.080753 0.565680
4.633333 0.095015 1.511618 -0.878239 -0.546680 0.956784 0.727328
4.666667 0.075500 1.542983 -0.847251 -0.574917 0.830727 0.855004
4.700000 0.054615 1.564765 -0.807262 -0.602287 0.705914 0.944216
4.733333 0.032741 1.575676 -0.747561 -0.628682 0.586258 0.987269
4.766667 0.010652 1.586380 -0.720600 -0.653915 0.476056 0.976770
4.800000 -0.011636 1.596894 -0.666136 -0.678137 0.378318 0.913097
4.833333 -0.034110 1.607236 -0.626963 -0.701564 0.296434 0.799500
4.866667 -0.056754 1.617425 -0.592084 -0.724323 0.232549 0.641332
4.900000 -0.080620 1.620446 -0.544162 -0.746496 0.188710 0.445944
4.933333 -0.106187 1.619191 -0.523947 -0.768022 0.165116 0.228391
4.966667 -0.131874 1.617857 -0.524060 -0.788928 0.161359 0.004364
5.000000 -0.159747 1.617302 -0.528937 -0.808801 0.176513 -0.212900
5.033333 -0.187700 1.616729 -0.556822 -0.827097 0.208847 -0.407963
5.066667 -0.216233 1.620854 -0.585777 -0.843293 0.256303 -0.568999
5.100000 -0.244804 1.625017 -0.632869 -0.856928 0.315737 -0.688973
5.133333 -0.274461 1.634228 -0.657934 -0.867798 0.383395 -0.774121
5.166667 -0.304871 1.648238 -0.714853 -0.875640 0.455123 -0.832530
5.200000 -0.335138 1.666576 -0.773873 -0.880107 0.527004 -0.874203
5.233333 -0.365490 1.689106 -0.801085 -0.880438 0.595116 -0.918095
5.266667 -0.395142 1.716321 -0.815493 -0.875631 0.656245 -0.975504
5.300000 -0.424696 1.743648 -0.828347 -0.864610 0.708112 -1.058456
5.333333 -0.454131 1.771089 -0.833029 -0.846122 0.750160 -1.162834
5.366667 -0.483423 1.798645 -0.820352 -0.818935 0.782986 -1.283636
5.400000 -0.512550 1.826315 -0.859358 -0.782694 0.807750 -1.409836
5.433333 -0.541490 1.854101 -0.904400 -0.738021 0.826415 -1.523394
5.466667 -0.570220 1.882002 -0.984914 -0.686076 0.841724 -1.607411
5.500000 -0.598718 1.910019 -1.090274 -0.627939 0.856916 -1.641450
5.533333 -0.620594 1.938645 -1.189434 -0.565500 0.874467 -1.616332
5.566667 -0.636537 1.966717 -1.266884 -0.501287 0.895796 -1.525400
5.600000 -0.647727 1.994301 -1.343079 -0.437655 0.922386 -1.373841
5.633333 -0.658635 2.022002 -1.420981 -0.376499 0.955527 -1.171557
5.666667 -0.667095 2.051681 -1.452576 -0.319704 0.995307 -0.936458
5.700000 -0.673907 2.085751 -1.463979 -0.269441 1.040466 -0.693261
5.733333 -0.680431 2.119930 -1.451165 -0.226603 1.090012 -0.466461
5.766667 -0.686668 2.154211 -1.420763 -0.190968 1.143094 -0.278133
5.800000 -0.691812 2.192225 -1.412025 -0.161580 1.197631 -0.142322
5.833333 -0.695614 2.236253 -1.404267 -0.137499 1.250443 -0.070032
5.866667 -0.699132 2.280349 -1.391666 -0.117458 1.298690 -0.059849
5.900000 -0.702369 2.324497 -1.388941 -0.100113 1.340659 -0.100686
5.933333 -0.705004 2.372586 -1.383614 -0.084727 1.374199 -0.174133
5.966667 -0.707654 2.423214 -1.379204 -0.071696 1.397061 -0.260429
6.000000 -0.710033 2.473830 -1.385447 -0.061826 1.408324 -0.341392
6.033333 -0.712142 2.524411 -1.402142 -0.055809 1.408649 -0.401875
6.066667 -0.713637 2.575393 -1.432851 -0.054316 1.399064 -0.433327
6.100000 -0.714286 2.625083 -1.482912 -0.058241 1.380334 -0.432037
6.133333 -0.713463 2.672653 -1.531492 -0.068924 1.353993 -0.401396
6.166667 -0.712140 2.717871 -1.566599 -0.086549 1.322400 -0.344922
6.200000 -0.711915 2.759637 -1.575589 -0.111491 1.287741 -0.268928
6.233333 -0.714278 2.800241 -1.563509 -0.144221 1.251610 -0.179600
6.266667 -0.716398 2.840667 -1.536065 -0.185442 1.215443 -0.086561
6.300000 -0.725316 2.879043 -1.535654 -0.234384 1.180985 0.000033
6.333333 -0.733986 2.917216 -1.519830 -0.289139 1.149700 0.073080
6.366667 -0.742404 2.955172 -1.522833 -0.348315 1.122313 0.126864
6.400000 -0.750563 2.992901 -1.519460 -0.410041 1.098959 0.157106
6.433333 -0.764879 3.028166 -1.500973 -0.471517 1.079852 0.161858
6.466667 -0.784153 3.062027 -1.502498 -0.528822 1.065107 0.144350
6.500000 -0.803130 3.095630 -1.507339 -0.579394 1.054305 0.106317
6.533333 -0.825985 3.129185 -1.490661 -0.620754 1.046675 0.048404
6.566667 -0.851733 3.162482 -1.482555 -0.649904 1.041555 -0.036681
6.600000 -0.879365 3.195972 -1.480824 -0.663661 1.038514 -0.151952
6.633333 -0.907232 3.229965 -1.474543 -0.660550 1.036629 -0.298965
6.666667 -0.933732 3.265960 -1.471960 -0.640754 1.034706 -0.479428
6.700000 -0.959779 3.301643 -1.479017 -0.604527 1.031775 -0.693299
6.733333 -0.985346 3.337002 -1.497730 -0.553303 1.027134 -0.932329
6.766667 -1.006530 3.372854 -1.524249 -0.490107 1.019856 -1.173286
6.800000 -1.023103 3.407471 -1.572532 -0.419190 1.009214 -1.394666
6.833333 -1.035578 3.441712 -1.613347 -0.344850 0.994590 -1.575450
6.866667 -1.044238 3.475358 -1.662485 -0.271088 0.975943 -1.695172
6.900000 -1.048984 3.507785 -1.780240 -0.202504 0.953056 -1.727980
6.933333 -1.050127 3.539575 -1.884537 -0.143322 0.925698 -1.660406
6.966667 -1.050681 3.570970 -1.982943 -0.096250 0.894310 -1.494568
7.000000 -1.048434 3.601087 -2.068673 -0.063570 0.858946 -1.240059
7.033333 -1.045591 3.630792 -2.153031 -0.045922 0.820156 -0.912322
7.066667 -1.042151 3.660078 -2.191166 -0.043282 0.778189 -0.536032
7.100000 -1.039979 3.685351 -2.186553 -0.053674 0.733955 -0.151631
7.133333 -1.037207 3.710195 -2.166763 -0.074604 0.688322 0.204082
7.166667 -1.039731 3.731260 -2.119724 -0.103505 0.641570 0.498710
7.200000 -1.041644 3.751894 -2.053127 -0.136601 0.593982 0.708680
7.233333 -1.050289 3.769117 -1.979296 -0.170087 0.545506 0.818554
7.266667 -1.058299 3.785913 -1.894999 -0.200432 0.496109 0.826617
7.300000 -1.065658 3.802287 -1.830695 -0.225059 0.445054 0.746009
7.333333 -1.078587 3.815233 -1.789377 -0.240836 0.392071 0.593933
7.366667 -1.090827 3.827769 -1.778638 -0.245718 0.337339 0.398629
7.400000 -1.102357 3.839905 -1.793114 -0.238645 0.281723 0.190835
7.433333 -1.113158 3.851648 -1.813310 -0.220187 0.226200 -0.001314
7.466667 -1.123207 3.863007 -1.838509 -0.190603 0.172436 -0.151214
7.500000 -1.131883 3.867983 -1.885952 -0.150552 0.122755 -0.236591
7.533333 -1.138181 3.867417 -1.916197 -0.102470 0.079016 -0.243772
7.566667 -1.141302 3.862860 -1.925279 -0.048175 0.043599 -0.173913
7.600000 -1.143601 3.857990 -1.929992 0.010640 0.018445 -0.042503
7.633333 -1.142109 3.853640 -1.949199 0.073070 0.005546 0.128685
7.666667 -1.136197 3.851394 -1.980019 0.137499 0.005493 0.312594
7.700000 -1.129432 3.848905 -1.982085 0.202652 0.017930 0.477410
7.733333 -1.121810 3.846195 -1.948428 0.268453 0.042116 0.601775
7.766667 -1.113324 3.843285 -1.891935 0.334651 0.075794 0.667740
7.800000 -1.100095 3.848426 -1.799557 0.400673 0.116012 0.667238
7.833333 -1.085999 3.853403 -1.721924 0.466076 0.159606 0.603566
7.866667 -1.071038 3.858227 -1.687380 0.530905 0.204149 0.480199
7.900000 -1.051807 3.868281 -1.641470 0.594868 0.247266 0.310572
7.933333 -1.031717 3.878203 -1.638938 0.657453 0.286978 0.106024
7.966667 -1.008050 3.890226 -1.683121 0.718164 0.321905 -0.112566
8.000000 -0.980697 3.904306 -1.714487 0.777055 0.351894 -0.321163
8.033333 -0.952514 3.918269 -1.764629 0.833975 0.376852 -0.507514
8.066667 -0.922138 3.932640 -1.785567 0.888519 0.396586 -0.658722
8.100000 -0.890961 3.946898 -1.821677 0.940855 0.411804 -0.768627
8.133333 -0.858998 3.961044 -1.859734 0.991079 0.423193 -0.833910
8.166667 -0.825131 3.975447 -1.869177 1.039419 0.431702 -0.867379
8.200000 -0.790050 3.990018 -1.911611 1.085941 0.437880 -0.880155
8.233333 -0.754238 4.004480 -1.925703 1.130803 0.442308 -0.878641
8.266667 -0.716054 4.019417 -1.961085 1.174297 0.445630 -0.867374
8.300000 -0.675308 4.034620 -1.994922 1.216276 0.448015 -0.848899
8.333333 -0.632222 4.050067 -2.005975 1.256481 0.449673 -0.830318
8.366667 -0.588497 4.065403 -2.058258 1.294880 0.450913 -0.798581
8.400000 -0.544162 4.080627 -2.077847 1.331417 0.451937 -0.756142
8.433333 -0.499245 4.095736 -2.111968 1.366259 0.453124 -0.701387
8.466667 -0.452695 4.111072 -2.131418 1.399470 0.455007 -0.634436
8.500000 -0.404607 4.126070 -2.181273 1.431342 0.458200 -0.556819
8.533333 -0.356025 4.140947 -2.186104 1.462399 0.463239 -0.462451
8.566667 -0.306981 4.155703 -2.194219 1.492611 0.470309 -0.363179
8.600000 -0.257507 4.170335 -2.204378 1.521907 0.479567 -0.261115
8.633333 -0.207635 4.184840 -2.204779 1.549789 0.490816 -0.160765
8.666667 -0.156552 4.200197 -2.225925 1.576075 0.503527 -0.067818
8.700000 -0.101879 4.217232 -2.212766 1.600324 0.516948 0.010531
8.733333 -0.046913 4.234131 -2.206934 1.622032 0.530380 0.065752
8.766667 0.010902 4.253004 -2.207578 1.640791 0.543111 0.097162
8.800000 0.066847 4.273277 -2.179368 1.656372 0.554302 0.105497
8.833333 0.122969 4.293390 -2.182702 1.669004 0.563342 0.090931
8.866667 0.179226 4.313334 -2.153306 1.679015 0.569904 0.053214
8.900000 0.235581 4.333099 -2.132284 1.687377 0.574025 -0.002020
8.933333 0.291993 4.352676 -2.154564 1.695247 0.575777 -0.066514
8.966667 0.348422 4.372054 -2.148062 1.704317 0.575569 -0.135381
9.000000 0.404828 4.391224 -2.167353 1.715928 0.574077 -0.201966
9.033333 0.461171 4.410176 -2.180949 1.731213 0.571920 -0.262442
9.066667 0.517411 4.428901 -2.198923 1.750793 0.569599 -0.307819
9.100000 0.574027 4.447564 -2.214934 1.774601 0.567367 -0.333954
9.133333 0.630459 4.465979 -2.227547 1.802195 0.565418 -0.345986
9.166667 0.689552 4.484724 -2.248476 1.832339 0.563701 -0.344796
9.200000 0.750987 4.503459 -2.266017 1.863751 0.562014 -0.332332
9.233333 0.814314 4.522380 -2.277433 1.895066 0.560174 -0.309818
9.266667 0.879490 4.541381 -2.282469 1.924954 0.557986 -0.283826
9.300000 0.946507 4.560278 -2.277165 1.952446 0.555341 -0.259286
9.333333 1.013051 4.578860 -2.286156 1.976761 0.552155 -0.235913
9.366667 1.082364 4.597668 -2.295895 1.997513 0.548418 -0.215901
9.400000 1.151092 4.616138 -2.301737 2.014755 0.544160 -0.205415
9.433333 1.219179 4.634258 -2.306135 2.028486 0.539336 -0.206186
9.466667 1.286568 4.652014 -2.322141 2.039073 0.533962 -0.216894
9.500000 1.353201 4.669396 -2.340650 2.046665 0.528014 -0.240366
9.533333 1.419023 4.686391 -2.320169 2.051106 0.521348 -0.283848
9.566667 1.488961 4.704186 -2.320950 2.051372 0.513507 -0.343726
9.600000 1.557969 4.721570 -2.333642 2.046222 0.504010 -0.417673
9.633333 1.629330 4.738879 -2.331845 2.033476 0.492152 -0.502253
9.666667 1.699636 4.755750 -2.361452 2.010044 0.476889 -0.592155
9.700000 1.768824 4.772169 -2.391467 1.972938 0.457197 -0.675369
9.733333 1.836831 4.788125 -2.405540 1.918949 0.431913 -0.726363
9.766667 1.905133 4.803582 -2.413326 1.846846 0.400553 -0.745421
9.800000 1.972127 4.818550 -2.440905 1.755415 0.362640 -0.718474
9.833333 2.037752 4.833016 -2.511981 1.645435 0.318291 -0.641330
9.866667 2.098273 4.845524 -2.616278 1.519471 0.268363 -0.509666
9.900000 2.148121 4.854404 -2.616682 1.379999 0.213742 -0.328654
9.933333 2.196432 4.862752 -2.655923 1.230893 0.155959 -0.118335
9.966667 2.235428 4.867379 -2.630297 1.075757 0.096455 0.116559
10.000000 2.264045 4.867785 -2.611680 0.918932 0.036979 0.353218
10.033333 2.291016 4.867651 -2.599183 0.763326 -0.021117 0.571835
10.066667 2.306160 4.862396 -2.535827 0.611033 -0.076644 0.738076
10.100000 2.319616 4.856609 -2.525997 0.464291 -0.128329 0.835903
10.133333 2.331372 4.850294 -2.429586 0.324266 -0.175262 0.846052
10.166667 2.341415 4.843460 -2.399343 0.190603 -0.217047 0.765276
10.200000 2.349735 4.836113 -2.343719 0.061478 -0.253912 0.587998
10.233333 2.345849 4.825420 -2.268612 -0.062993 -0.285772 0.316665
10.266667 2.340229 4.814232 -2.268709 -0.183277 -0.313381 -0.015663
10.300000 2.332879 4.802561 -2.265005 -0.299658 -0.338144 -0.397058
10.333333 2.323801 4.790416 -2.245573 -0.411570 -0.362228 -0.795221
10.366667 2.306875 4.776610 -2.291972 -0.517094 -0.387460 -1.197239
10.400000 2.284429 4.762364 -2.368982 -0.613273 -0.415364 -1.569121
10.433333 2.259480 4.749250 -2.443115 -0.699446 -0.447915 -1.883335
10.466667 2.230256 4.736025 -2.577007 -0.775175 -0.485823 -2.139442
10.500000 2.198174 4.722557 -2.647196 -0.840622 -0.528445 -2.326879
10.533333 2.164462 4.708687 -2.780841 -0.897023 -0.573701 -2.438598
10.566667 2.129741 4.692938 -2.895477 -0.947069 -0.619377 -2.475848
10.600000 2.095552 4.674601 -2.939532 -0.994413 -0.662914 -2.459706
10.633333 2.061711 4.650974 -3.036113 -1.042190 -0.700835 -2.407668
10.666667 2.031410 4.618558 -3.128848 -1.093097 -0.729990 -2.330164
10.700000 1.999592 4.585831 3.083962 -1.149195 -0.748183 -2.237315
10.733333 1.966275 4.552822 3.035483 -1.212073 -0.753640 -2.154722
10.766667 1.931479 4.519562 2.971153 -1.282153 -0.745133 -2.090636
10.800000 1.887958 4.492517 2.894964 -1.358282 -0.722666 -2.044371
10.833333 1.839352 4.470166 2.834928 -1.438395 -0.687899 -2.013146
10.866667 1.789346 4.447635 2.791833 -1.519781 -0.643748 -2.002472
10.900000 1.734682 4.427253 2.714688 -1.599785 -0.593456 -2.011628
10.933333 1.676944 4.408592 2.664045 -1.675589 -0.540766 -2.033771
10.966667 1.616612 4.391491 2.566841 -1.744600 -0.489252 -2.063955
11.000000 1.553937 4.376348 2.508344 -1.805669 -0.441244 -2.099123
11.033333 1.490814 4.364187 2.437068 -1.858594 -0.397962 -2.143564
11.066667 1.427078 4.355413 2.374672 -1.903481 -0.360113 -2.183486
11.100000 1.362226 4.346536 2.310279 -1.940929 -0.327756 -2.217099
11.133333 1.296302 4.337560 2.200616 -1.971707 -0.300912 -2.232871
11.166667 1.229351 4.328488 2.162905 -1.996809 -0.279313 -2.234292
11.200000 1.161418 4.319323 2.064451 -2.016812 -0.262877 -2.217152
11.233333 1.092547 4.310066 1.983995 -2.031820 -0.251642 -2.173456
11.266667 1.024044 4.303587 1.897090 -2.042478 -0.245135 -2.105635
11.300000 0.954694 4.297019 1.821626 -2.049096 -0.243269 -2.014181
11.333333 0.884541 4.290361 1.739445 -2.052317 -0.245684 -1.910046
11.366667 0.813631 4.283612 1.661975 -2.052682 -0.252155 -1.789004
11.400000 0.745153 4.275803 1.620132 -2.050780 -0.262583 -1.659475
11.433333 0.676006 4.267902 1.571486 -2.047205 -0.276629 -1.528707
11.466667 0.609736 4.258807 1.541619 -2.042563 -0.293838 -1.406108
11.500000 0.542878 4.249623 1.505556 -2.037596 -0.313360 -1.295068
11.533333 0.475469 4.240352 1.443732 -2.032756 -0.334433 -1.196133
11.566667 0.408127 4.228184 1.424499 -2.028542 -0.356036 -1.116619
11.600000 0.340313 4.215934 1.404913 -2.025193 -0.377228 -1.052265
11.633333 0.272885 4.201250 1.358317 -2.023270 -0.397196 -1.003007
11.666667 0.205062 4.186495 1.340570 -2.022561 -0.415373 -0.962381
11.700000 0.136882 4.171677 1.295394 -2.022782 -0.431391 -0.924843
11.733333 0.069847 4.156359 1.249426 -2.023749 -0.444956 -0.889737
11.766667 0.004429 4.141304 1.242457 -2.025335 -0.456324 -0.848676
11.800000 -0.062995 4.125152 1.213776 -2.027366 -0.465626 -0.802079
11.833333 -0.130631 4.108966 1.179022 -2.029393 -0.473294 -0.747324
11.866667 -0.198441 4.092754 1.159721 -2.031409 -0.479758 -0.685150
11.900000 -0.266416 4.076832 1.115629 -2.033462 -0.485544 -0.618761
11.933333 -0.334724 4.060935 1.102306 -2.035322 -0.491026 -0.550166
11.966667 -0.402963 4.044629 1.078595 -2.036499 -0.496235 -0.484044
12.000000 -0.471231 4.028330 1.073490 -2.036819 -0.501372 -0.422178
12.033333 -0.539491 4.012045 1.068568 -2.036163 -0.506478 -0.367570
12.066667 -0.607451 3.994458 1.051093 -2.034222 -0.511366 -0.321527
12.100000 -0.675331 3.976903 1.062757 -2.030568 -0.515663 -0.288893
12.133333 -0.743097 3.959390 1.045715 -2.025035 -0.519075 -0.264821
12.166667 -0.810714 3.941928 1.046497 -2.017596 -0.521403 -0.250789
12.200000 -0.878145 3.924526 1.042425 -2.008079 -0.522364 -0.247333
12.233333 -0.946114 3.906367 1.039094 -1.996250 -0.521603 -0.254471
12.266667 -1.013080 3.888372 1.016137 -1.982319 -0.519230 -0.270870
12.300000 -1.079755 3.870466 0.998372 -1.966335 -0.515313 -0.293091
12.333333 -1.146106 3.852660 0.988911 -1.948266 -0.509919 -0.324218
12.366667 -1.212099 3.834963 0.996147 -1.928093 -0.503082 -0.363241
12.400000 -1.275155 3.818773 0.980797 -1.905727 -0.494824 -0.406638
12.433333 -1.337789 3.802711 0.975606 -1.881208 -0.485305 -0.455791
12.466667 -1.399970 3.786783 0.968961 -1.854293 -0.474468 -0.515985
12.500000 -1.461668 3.770999 0.945277 -1.825118 -0.462476 -0.586790
12.533333 -1.522853 3.755367 0.914401 -1.793696 -0.449437 -0.669496
12.566667 -1.583496 3.739893 0.899667 -1.759605 -0.435355 -0.759900
12.600000 -1.643569 3.724586 0.881694 -1.722566 -0.420264 -0.862377
12.633333 -1.700335 3.711070 0.830752 -1.682468 -0.404264 -0.965035
12.666667 -1.756476 3.697735 0.814699 -1.639198 -0.387419 -1.065831
12.700000 -1.811968 3.684585 0.779168 -1.592573 -0.369765 -1.161427
12.733333 -1.863382 3.673180 0.756857 -1.542944 -0.351576 -1.249283
12.766667 -1.914102 3.661971 0.700082 -1.491543 -0.333338 -1.331943
12.800000 -1.964497 3.650707 0.637893 -1.439315 -0.315513 -1.402705
12.833333 -2.013251 3.640264 0.569851 -1.386831 -0.298344 -1.473697
12.866667 -2.059758 3.630687 0.499925 -1.334660 -0.282141 -1.532968
12.900000 -2.100243 3.622576 0.474551 -1.283732 -0.267264 -1.585533
12.933333 -2.139948 3.614674 0.416957 -1.234237 -0.253793 -1.628514
12.966667 -2.178863 3.606980 0.416957 -1.185869 -0.241702 -1.666762
13.000000 -2.216980 3.599497 0.309347 -1.138752 -0.230981 -1.702939
13.033333 -2.254289 3.592224 0.258342 -1.092991 -0.221645 -1.735127
13.066667 -2.290782 3.585161 0.194997 -1.048673 -0.213589 -1.773477
13.100000 -2.326451 3.578308 0.129191 -1.005011 -0.206494 -1.813112
13.133333 -2.359108 3.571523 0.075120 -0.961666 -0.200032 -1.856809
13.166667 -2.390928 3.564948 0.015038 -0.918284 -0.193839 -1.892881
13.200000 -2.419994 3.558704 -0.039065 -0.874399 -0.187480 -1.926313
13.233333 -2.448218 3.552670 -0.111207 -0.829810 -0.180580 -1.951415
13.266667 -2.475034 3.546435 -0.177281 -0.784283 -0.172764 -1.965832
13.300000 -2.500354 3.540416 -0.242903 -0.738082 -0.163764 -1.967288
13.333333 -2.524832 3.534605 -0.326619 -0.691271 -0.153483 -1.951798
13.366667 -2.547376 3.529047 -0.389604 -0.644208 -0.141907 -1.924744
13.400000 -2.568074 3.524083 -0.451594 -0.597120 -0.129172 -1.877604
13.433333 -2.587938 3.519327 -0.536909 -0.550140 -0.115412 -1.811542
13.466667 -2.605702 3.515464 -0.600246 -0.503744 -0.101008 -1.724600
13.500000 -2.621095 3.512266 -0.642282 -0.458427 -0.086378 -1.620066
13.533333 -2.635072 3.510092 -0.716560 -0.414810 -0.071943 -1.499654
13.566667 -2.648246 3.508117 -0.752314 -0.373069 -0.058133 -1.363532
13.600000 -2.658143 3.507253 -0.803255 -0.333529 -0.045335 -1.215218
13.633333 -2.667260 3.506580 -0.833813 -0.296510 -0.033932 -1.059915
13.666667 -2.675610 3.506093 -0.879762 -0.262017 -0.024095 -0.900990
13.700000 -2.683208 3.505787 -0.905616 -0.229857 -0.015936 -0.742299
13.733333 -2.690069 3.505657 -0.929586 -0.199782 -0.009445 -0.589022
13.766667 -2.696206 3.505699 -0.944116 -0.171977 -0.004519 -0.446458
13.800000 -2.701635 3.505907 -0.955050 -0.146290 -0.000927 -0.320080
13.833333 -2.706371 3.506276 -0.946879 -0.122662 0.001529 -0.210702
13.866667 -2.710430 3.506802 -0.956954 -0.101022 0.003019 -0.120889
13.900000 -2.712265 3.506767 -0.938505 -0.081540 0.003770 -0.051648
13.933333 -2.713456 3.506879 -0.935429 -0.064419 0.003964 -0.002771
13.966667 -2.714021 3.507133 -0.923255 -0.049577 0.003763 0.028582
14.000000 -2.714678 3.507359 -0.919931 -0.037075 0.003263 0.045081
14.033333 -2.714843 3.507521 -0.926703 -0.026840 0.002629 0.050343
14.066667 -2.715043 3.507557 -0.922209 -0.018894 0.002014 0.045150
14.100000 -2.715634 3.507500 -0.929033 -0.012923 0.001456 0.036548
14.133333 -2.715688 3.507563 -0.935644 -0.008485 0.001007 0.027565
14.166667 -2.716340 3.507380 -0.922561 -0.005177 0.000710 0.019092
