t x y theta dxdt dydt dthetadt
0.000000 0.000000 0.000000 0.270940 -0.056914 -0.043931 0.826943
0.033333 -0.003159 -0.002152 0.265272 -0.058694 -0.041123 0.944711
0.066667 -0.006389 -0.004665 0.272869 -0.058015 -0.035192 1.017761
0.100000 -0.009585 -0.007040 0.321882 -0.054918 -0.025729 1.034177
0.133333 -0.011976 -0.009259 0.403797 -0.049666 -0.012771 0.989190
0.166667 -0.014325 -0.011326 0.526411 -0.042439 0.003649 0.882754
0.200000 -0.015458 -0.011765 0.595143 -0.033612 0.022861 0.719052
0.233333 -0.016544 -0.012039 0.644092 -0.023530 0.044085 0.505346
0.266667 -0.016688 -0.009721 0.642995 -0.012332 0.066337 0.249988
0.300000 -0.016784 -0.007232 0.616430 -0.000067 0.088694 -0.030300
0.333333 -0.016045 -0.001914 0.575657 0.013353 0.110215 -0.316021
0.366667 -0.015257 0.003577 0.532636 0.028016 0.129961 -0.578733
0.400000 -0.014421 0.009241 0.515748 0.044066 0.147434 -0.796646
0.433333 -0.013539 0.015077 0.487255 0.061394 0.162209 -0.950790
0.466667 -0.012611 0.021085 0.452440 0.079650 0.174383 -1.032735
0.500000 -0.011638 0.027262 0.391109 0.098484 0.184055 -1.044933
0.533333 -0.008899 0.034095 0.318639 0.117470 0.191730 -0.995989
0.566667 -0.004215 0.040978 0.257787 0.136022 0.197921 -0.902447
0.600000 0.002867 0.047579 0.212221 0.153404 0.203101 -0.779011
0.633333 0.009978 0.054343 0.197296 0.169039 0.207734 -0.641580
0.666667 0.017109 0.061270 0.180761 0.182475 0.212044 -0.499825
0.700000 0.024252 0.068357 0.181376 0.193262 0.216257 -0.364213
0.733333 0.031399 0.075604 0.195612 0.201243 0.220318 -0.242515
0.766667 0.038542 0.083007 0.212513 0.206579 0.224156 -0.144111
0.800000 0.045673 0.090566 0.214392 0.209807 0.227522 -0.070144
0.833333 0.052783 0.098278 0.224446 0.211407 0.230080 -0.019553
0.866667 0.059864 0.106142 0.213900 0.211771 0.231428 0.013441
0.900000 0.066908 0.114154 0.225739 0.211291 0.231161 0.031769
0.933333 0.073906 0.122313 0.207190 0.210083 0.229117 0.042201
0.966667 0.080851 0.130616 0.202053 0.208004 0.225082 0.049941
1.000000 0.087734 0.139061 0.187338 0.204764 0.219082 0.056455
1.033333 0.094546 0.147645 0.193453 0.200101 0.211290 0.064280
1.066667 0.102093 0.154701 0.214077 0.193870 0.202155 0.066807
1.100000 0.109552 0.161892 0.220145 0.185924 0.192129 0.070053
1.133333 0.116624 0.168006 0.231212 0.176113 0.181671 0.068076
1.166667 0.122911 0.173206 0.228203 0.164542 0.171451 0.066040
1.200000 0.127994 0.177707 0.253926 0.151384 0.162109 0.061077
1.233333 0.132955 0.182347 0.240573 0.136785 0.154391 0.053834
1.266667 0.137788 0.187128 0.254092 0.120793 0.148849 0.045979
1.300000 0.141297 0.191313 0.217074 0.103430 0.146287 0.037341
1.333333 0.144665 0.195643 0.211298 0.084876 0.147215 0.031063
1.366667 0.146858 0.199710 0.211937 0.065183 0.151938 0.020518
1.400000 0.148900 0.203927 0.223963 0.044254 0.160867 0.012234
1.433333 0.150789 0.208299 0.246382 0.022196 0.174117 -0.001358
1.466667 0.151309 0.213359 0.243870 -0.000563 0.191587 -0.019248
1.500000 0.151669 0.218578 0.249904 -0.023395 0.212910 -0.054152
1.533333 0.151865 0.223957 0.249906 -0.045607 0.238079 -0.108674
1.566667 0.150158 0.231048 0.246417 -0.066475 0.266972 -0.180729
1.600000 0.146551 0.240121 0.226498 -0.084948 0.299107 -0.277822
1.633333 0.141283 0.251693 0.245328 -0.099872 0.334137 -0.394073
1.666667 0.135854 0.263419 0.218024 -0.110442 0.371947 -0.527541
1.700000 0.130267 0.275293 0.189105 -0.116082 0.412338 -0.665009
1.733333 0.124873 0.290319 0.219115 -0.116545 0.454418 -0.802950
1.766667 0.119327 0.305480 0.175873 -0.111794 0.497584 -0.934711
1.800000 0.113633 0.320765 0.127230 -0.102356 0.541330 -1.049762
1.833333 0.109511 0.339168 0.075995 -0.089427 0.584985 -1.136646
1.866667 0.107003 0.360302 0.015298 -0.074263 0.627692 -1.187270
1.900000 0.104351 0.381524 -0.031350 -0.058166 0.668564 -1.200623
1.933333 0.103353 0.405575 -0.079643 -0.042385 0.707206 -1.166056
1.966667 0.103750 0.432077 -0.131419 -0.028134 0.742836 -1.085495
2.000000 0.103995 0.458611 -0.194266 -0.016331 0.774754 -0.964167
2.033333 0.105120 0.487061 -0.234975 -0.007351 0.802251 -0.814492
2.066667 0.106082 0.515497 -0.262502 -0.001245 0.824913 -0.648868
2.100000 0.106878 0.543894 -0.282661 0.002168 0.842134 -0.473579
2.133333 0.107500 0.572228 -0.279694 0.003352 0.853536 -0.307579
2.166667 0.107809 0.601670 -0.268985 0.003000 0.859159 -0.161361
2.200000 0.107771 0.631896 -0.257513 0.001823 0.858976 -0.042545
2.233333 0.107423 0.662466 -0.258354 0.000468 0.852996 0.048752
2.266667 0.106838 0.692811 -0.233232 -0.000573 0.841094 0.116300
2.300000 0.106295 0.722287 -0.218790 -0.001136 0.823390 0.161417
2.333333 0.105551 0.751546 -0.212767 -0.001213 0.799772 0.203396
2.366667 0.105374 0.778633 -0.208011 -0.000991 0.770242 0.258535
2.400000 0.104984 0.805454 -0.204464 -0.000761 0.734732 0.337803
2.433333 0.105857 0.828729 -0.196606 -0.001134 0.693852 0.450831
2.466667 0.106507 0.851696 -0.216715 -0.002779 0.648071 0.608567
2.500000 0.106926 0.874334 -0.222578 -0.006137 0.598202 0.817950
2.533333 0.107108 0.896625 -0.216419 -0.011652 0.545062 1.063242
2.566667 0.107501 0.913539 -0.189675 -0.019659 0.489468 1.329535
2.600000 0.107643 0.930074 -0.129339 -0.030343 0.432660 1.607265
2.633333 0.106913 0.941381 -0.088836 -0.043386 0.375674 1.875648
2.666667 0.105919 0.952291 0.029118 -0.058391 0.319871 2.102503
2.700000 0.104657 0.962797 0.130095 -0.074972 0.266459 2.264925
2.733333 0.102187 0.970222 0.185769 -0.092688 0.216832 2.362645
2.766667 0.098521 0.974861 0.318911 -0.111062 0.171840 2.395330
2.800000 0.093965 0.977450 0.469533 -0.129698 0.132047 2.365202
2.833333 0.088609 0.978628 0.571031 -0.148571 0.097238 2.286864
2.866667 0.082967 0.979398 0.635286 -0.167780 0.066832 2.188454
2.900000 0.077037 0.979763 0.692139 -0.187544 0.039978 2.098107
2.933333 0.070589 0.980302 0.747273 -0.208166 0.015389 2.023447
2.966667 0.063851 0.980445 0.761366 -0.230192 -0.008198 1.981673
3.000000 0.056490 0.980735 0.799381 -0.254216 -0.032239 1.984822
3.033333 0.048497 0.980972 0.814153 -0.280615 -0.057738 2.036117
3.066667 0.039905 0.980447 0.870886 -0.309673 -0.085435 2.131076
3.100000 0.030421 0.978773 0.964005 -0.341552 -0.115761 2.252905
3.133333 0.019512 0.975520 1.078766 -0.376488 -0.148756 2.392853
3.166667 0.006983 0.970427 1.177399 -0.414274 -0.183959 2.529679
3.200000 -0.007385 0.963377 1.248697 -0.454577 -0.220314 2.646668
3.233333 -0.023629 0.954435 1.363409 -0.497054 -0.256622 2.727953
3.266667 -0.040137 0.945157 1.454039 -0.541208 -0.291714 2.764078
3.300000 -0.058720 0.934079 1.564377 -0.586279 -0.324476 2.752984
3.333333 -0.079344 0.921191 1.680312 -0.631153 -0.353915 2.695121
3.366667 -0.100198 0.908010 1.754432 -0.675091 -0.379408 2.598615
3.400000 -0.123273 0.893583 1.851415 -0.717338 -0.400654 2.462362
3.433333 -0.148600 0.878407 1.944929 -0.757205 -0.417601 2.295140
3.466667 -0.176345 0.862962 2.024619 -0.794060 -0.430054 2.102144
3.500000 -0.204250 0.847298 2.100846 -0.827747 -0.437842 1.888730
3.533333 -0.234811 0.832384 2.163293 -0.858295 -0.441029 1.663949
3.566667 -0.265488 0.817290 2.209149 -0.885598 -0.439370 1.424574
3.600000 -0.296257 0.802033 2.259772 -0.909600 -0.432965 1.179165
3.633333 -0.327093 0.786632 2.288314 -0.930306 -0.421711 0.929769
3.666667 -0.357973 0.771104 2.304042 -0.947714 -0.405767 0.676974
3.700000 -0.388872 0.755470 2.334591 -0.961374 -0.385463 0.424860
3.733333 -0.421986 0.742104 2.322697 -0.970720 -0.360957 0.173185
3.766667 -0.455069 0.728665 2.324519 -0.975040 -0.332747 -0.067102
3.800000 -0.489264 0.717508 2.346262 -0.973380 -0.301246 -0.289807
3.833333 -0.523959 0.708754 2.322778 -0.964718 -0.267401 -0.484535
3.866667 -0.558541 0.699967 2.328493 -0.948333 -0.232240 -0.641777
3.900000 -0.592673 0.693500 2.270897 -0.923988 -0.197023 -0.749611
3.933333 -0.626635 0.687019 2.215330 -0.892026 -0.162875 -0.801800
3.966667 -0.658620 0.682478 2.153912 -0.853296 -0.131089 -0.793460
4.000000 -0.688114 0.679600 2.100800 -0.809368 -0.102806 -0.721007
4.033333 -0.714946 0.678148 2.062697 -0.762263 -0.078622 -0.591955
4.066667 -0.739046 0.677788 2.034633 -0.713951 -0.059164 -0.412505
4.100000 -0.760462 0.678063 2.004515 -0.666356 -0.044597 -0.201552
4.133333 -0.779531 0.678457 1.997086 -0.621010 -0.035267 0.024274
4.166667 -0.796534 0.678323 2.010103 -0.578926 -0.030974 0.244486
4.200000 -0.813223 0.678196 2.050193 -0.540214 -0.031321 0.436857
4.233333 -0.829588 0.678077 2.098080 -0.504049 -0.035985 0.586416
4.266667 -0.845623 0.677966 2.141739 -0.468972 -0.044382 0.681551
4.300000 -0.861011 0.676730 2.178498 -0.433170 -0.055917 0.716995
4.333333 -0.875896 0.674480 2.216258 -0.394455 -0.069847 0.689990
4.366667 -0.890428 0.672243 2.250928 -0.350519 -0.085735 0.602725
4.400000 -0.903803 0.669039 2.286048 -0.299860 -0.103144 0.463751
4.433333 -0.916813 0.665855 2.308819 -0.241851 -0.121611 0.285316
4.466667 -0.927436 0.661810 2.316436 -0.176889 -0.140600 0.077593
4.500000 -0.935070 0.656986 2.311911 -0.105373 -0.159814 -0.144036
4.533333 -0.938979 0.651334 2.296197 -0.028390 -0.178984 -0.359814
4.566667 -0.938549 0.644887 2.273479 0.052311 -0.197654 -0.551423
4.600000 -0.933501 0.637451 2.269772 0.135032 -0.215517 -0.706287
4.633333 -0.928112 0.630074 2.243644 0.218406 -0.232340 -0.815642
4.666667 -0.917748 0.621509 2.179150 0.301368 -0.248015 -0.871982
4.700000 -0.902450 0.611808 2.106833 0.382133 -0.262244 -0.876011
4.733333 -0.886874 0.602194 2.042101 0.459150 -0.274784 -0.832664
4.766667 -0.871046 0.592679 1.997848 0.531171 -0.285508 -0.750766
4.800000 -0.854993 0.583273 1.969641 0.597678 -0.294363 -0.635058
4.833333 -0.834278 0.573171 1.971014 0.657786 -0.301227 -0.494003
4.866667 -0.809169 0.562574 1.972848 0.710812 -0.306004 -0.337796
4.900000 -0.779448 0.551356 1.973505 0.756522 -0.308668 -0.171861
4.933333 -0.749641 0.540296 1.976821 0.794629 -0.309102 -0.006041
4.966667 -0.719788 0.529408 1.992404 0.824744 -0.307097 0.152211
5.000000 -0.689933 0.518706 1.993712 0.845806 -0.302313 0.293606
5.033333 -0.660118 0.508201 1.987631 0.857511 -0.294549 0.413736
5.066667 -0.630385 0.497907 2.001022 0.860002 -0.283731 0.509019
5.100000 -0.600776 0.487837 2.004601 0.854011 -0.269952 0.576594
5.133333 -0.570373 0.478246 2.033414 0.840153 -0.253397 0.620888
5.166667 -0.540180 0.468902 2.083651 0.818978 -0.234363 0.650116
5.200000 -0.510968 0.460555 2.130611 0.791512 -0.213367 0.671489
5.233333 -0.483360 0.453307 2.192728 0.758050 -0.190897 0.688555
5.266667 -0.457714 0.447242 2.216623 0.718617 -0.167403 0.711961
5.300000 -0.434258 0.442526 2.215069 0.672426 -0.143261 0.748089
5.333333 -0.413179 0.439156 2.211930 0.619526 -0.118987 0.804113
5.366667 -0.392538 0.436087 2.208962 0.560110 -0.095080 0.882351
5.400000 -0.372369 0.433325 2.203815 0.493644 -0.071732 0.983792
5.433333 -0.352702 0.430873 2.229769 0.420334 -0.049059 1.110578
5.466667 -0.337414 0.429743 2.274713 0.340034 -0.026943 1.252692
5.500000 -0.327200 0.429723 2.341439 0.253264 -0.005000 1.398866
5.533333 -0.317569 0.430026 2.409016 0.159822 0.017395 1.530356
5.566667 -0.314247 0.431041 2.471066 0.060547 0.040775 1.632452
5.600000 -0.311541 0.432382 2.540529 -0.042763 0.065419 1.695339
5.633333 -0.315296 0.434420 2.598845 -0.148185 0.091537 1.714194
5.666667 -0.319685 0.436784 2.693481 -0.253479 0.119094 1.690470
5.700000 -0.330305 0.440206 2.768446 -0.356547 0.148005 1.630472
5.733333 -0.346929 0.445118 2.820832 -0.454684 0.177999 1.546630
5.766667 -0.364182 0.450354 2.869264 -0.547037 0.208514 1.447122
5.800000 -0.386965 0.457915 2.903660 -0.632803 0.238917 1.335839
5.833333 -0.414990 0.468404 2.932539 -0.711952 0.268751 1.213165
5.866667 -0.443598 0.479198 2.954623 -0.784556 0.297640 1.082876
5.900000 -0.472768 0.490290 2.979517 -0.851045 0.324738 0.946082
5.933333 -0.502479 0.501670 3.025644 -0.912916 0.349634 0.797841
5.966667 -0.532706 0.513329 3.071113 -0.970461 0.372914 0.637231
6.000000 -0.563427 0.525257 3.116513 -1.024915 0.395659 0.464868
6.033333 -0.598142 0.541921 3.131599 -1.077234 0.418453 0.281732
6.066667 -0.633297 0.558829 -3.138835 -1.128452 0.441987 0.087108
6.100000 -0.674068 0.570986 3.138703 -1.179001 0.467677 -0.114906
6.133333 -0.715215 0.583362 3.115567 -1.228535 0.496363 -0.312128
6.166667 -0.758945 0.599902 3.100896 -1.276685 0.527739 -0.497034
6.200000 -0.802978 0.616635 3.080352 -1.322471 0.561077 -0.661628
6.233333 -0.847274 0.633548 3.036663 -1.365093 0.596279 -0.799839
6.266667 -0.893762 0.653496 2.989708 -1.403439 0.632789 -0.907132
6.300000 -0.942061 0.675952 2.953108 -1.437070 0.669014 -0.983293
6.333333 -0.991881 0.700444 2.914187 -1.465603 0.703442 -1.035211
6.366667 -1.043024 0.726594 2.866768 -1.488957 0.735216 -1.064030
6.400000 -1.095117 0.754106 2.834916 -1.507039 0.763410 -1.074460
6.433333 -1.147204 0.781665 2.801160 -1.519583 0.786787 -1.069797
6.466667 -1.199235 0.809242 2.777686 -1.526543 0.804567 -1.055369
6.500000 -1.251161 0.836812 2.743242 -1.527689 0.816673 -1.035353
6.533333 -1.303271 0.865101 2.707537 -1.522998 0.823289 -1.010112
6.566667 -1.355114 0.893755 2.655232 -1.512511 0.824493 -0.985294
6.600000 -1.406702 0.922317 2.616123 -1.496268 0.820485 -0.962082
6.633333 -1.457258 0.950637 2.594471 -1.474182 0.811350 -0.944545
6.666667 -1.507459 0.978806 2.565271 -1.446377 0.797205 -0.930161
6.700000 -1.555951 1.005951 2.546658 -1.413203 0.778303 -0.920572
6.733333 -1.603991 1.032890 2.512274 -1.374722 0.754685 -0.917132
6.766667 -1.651532 1.059595 2.484254 -1.331150 0.726569 -0.917567
6.800000 -1.696297 1.084448 2.457118 -1.282942 0.694355 -0.923360
6.833333 -1.738648 1.107414 2.430574 -1.230968 0.658891 -0.929819
6.866667 -1.780365 1.130071 2.410280 -1.175915 0.620897 -0.941155
6.900000 -1.819199 1.150610 2.367598 -1.118289 0.580971 -0.952935
6.933333 -1.855088 1.168873 2.324375 -1.059215 0.540171 -0.964175
6.966667 -1.887952 1.184769 2.274003 -0.999831 0.499535 -0.975272
7.000000 -1.920030 1.200276 2.259875 -0.941208 0.460012 -0.984147
7.033333 -1.951287 1.215377 2.222427 -0.883642 0.421943 -0.992852
7.066667 -1.978924 1.227890 2.192882 -0.827342 0.385679 -0.995173
7.100000 -2.005676 1.239968 2.182593 -0.771972 0.351201 -0.994817
7.133333 -2.028566 1.249591 2.131961 -0.716583 0.318025 -0.990066
7.166667 -2.050516 1.258755 2.098560 -0.659623 0.285213 -0.983478
7.200000 -2.071503 1.267452 2.061538 -0.599282 0.251682 -0.974047
7.233333 -2.091500 1.275671 2.026463 -0.534586 0.216849 -0.959856
7.266667 -2.110484 1.283403 1.989341 -0.464605 0.180010 -0.944740
7.300000 -2.128431 1.290639 1.960022 -0.389055 0.140788 -0.923919
7.333333 -2.145317 1.297369 1.927972 -0.307862 0.098895 -0.898672
7.366667 -2.157023 1.301366 1.880913 -0.221891 0.054548 -0.862556
7.400000 -2.163807 1.302847 1.877391 -0.132692 0.008262 -0.816110
7.433333 -2.166100 1.302094 1.856690 -0.041759 -0.039490 -0.759980
7.466667 -2.164208 1.299273 1.834018 0.048972 -0.087891 -0.694474
7.500000 -2.158480 1.294492 1.794312 0.137334 -0.135996 -0.620462
7.533333 -2.149228 1.287855 1.757001 0.220869 -0.182758 -0.532790
7.566667 -2.138850 1.280703 1.732565 0.297783 -0.227461 -0.433403
7.600000 -2.125688 1.271850 1.718204 0.366911 -0.269541 -0.320271
7.633333 -2.110148 1.261244 1.717811 0.427352 -0.308612 -0.195099
7.666667 -2.093495 1.250142 1.720236 0.478863 -0.344649 -0.057348
7.700000 -2.075138 1.237528 1.716819 0.521637 -0.377734 0.086589
7.733333 -2.055233 1.223287 1.724179 0.556236 -0.407932 0.222234
7.766667 -2.034242 1.208581 1.726623 0.583059 -0.435112 0.341954
7.800000 -2.012174 1.193420 1.719738 0.602377 -0.459177 0.439922
7.833333 -1.989904 1.177129 1.737877 0.614876 -0.480055 0.516054
7.866667 -1.967870 1.159825 1.803390 0.621106 -0.497501 0.565337
7.900000 -1.946576 1.142012 1.849196 0.622026 -0.511299 0.593733
7.933333 -1.924242 1.123798 1.881272 0.618840 -0.521335 0.613489
7.966667 -1.903325 1.105290 1.896045 0.613238 -0.527537 0.632394
8.000000 -1.881380 1.086410 1.913764 0.607039 -0.529938 0.652991
8.033333 -1.861118 1.067609 1.920384 0.601944 -0.528535 0.676697
8.066667 -1.842432 1.049110 1.925198 0.599767 -0.523419 0.711683
8.100000 -1.824896 1.031239 1.932883 0.601919 -0.514951 0.751546
8.133333 -1.807924 1.014262 1.938052 0.609708 -0.503709 0.787743
8.166667 -1.789931 0.996981 1.962382 0.623819 -0.490448 0.809274
8.200000 -1.770915 0.979405 1.982542 0.644796 -0.475824 0.811126
8.233333 -1.750825 0.963298 2.062102 0.672573 -0.460675 0.780844
8.266667 -1.729270 0.948622 2.133254 0.706596 -0.445976 0.705733
8.300000 -1.705895 0.935312 2.181726 0.746120 -0.432559 0.583596
8.333333 -1.681494 0.921745 2.207613 0.789969 -0.420953 0.417128
8.366667 -1.654749 0.908918 2.228478 0.836921 -0.411646 0.216083
8.400000 -1.625619 0.896559 2.225329 0.885698 -0.405199 -0.010344
8.433333 -1.595472 0.883959 2.213659 0.935363 -0.401832 -0.240054
8.466667 -1.563124 0.871375 2.197007 0.985107 -0.401432 -0.451650
8.500000 -1.528560 0.858595 2.151479 1.034172 -0.403610 -0.627504
8.533333 -1.493001 0.845589 2.115795 1.082097 -0.408049 -0.757765
8.566667 -1.456455 0.832360 2.068162 1.128742 -0.414262 -0.834347
8.600000 -1.417658 0.818544 2.016427 1.173969 -0.421575 -0.853064
8.633333 -1.376786 0.804080 1.966054 1.217581 -0.429400 -0.819075
8.666667 -1.334962 0.789409 1.941575 1.259613 -0.437251 -0.742158
8.700000 -1.292200 0.774538 1.906067 1.300275 -0.444831 -0.630923
8.733333 -1.247775 0.759273 1.893401 1.339591 -0.451836 -0.494722
8.766667 -1.202441 0.743818 1.878288 1.377470 -0.458047 -0.343959
8.800000 -1.155768 0.728167 1.880583 1.413949 -0.463379 -0.192471
8.833333 -1.107918 0.712473 1.868270 1.449204 -0.467874 -0.048248
8.866667 -1.058417 0.696672 1.871883 1.483267 -0.471644 0.084344
8.900000 -1.008075 0.680706 1.878387 1.516137 -0.474789 0.200413
8.933333 -0.956912 0.664582 1.913696 1.548005 -0.477437 0.298188
8.966667 -0.904468 0.648591 1.921720 1.579023 -0.479740 0.375561
9.000000 -0.850836 0.632756 1.940699 1.609315 -0.481861 0.435899
9.033333 -0.796445 0.616781 1.967128 1.638887 -0.483894 0.477645
9.066667 -0.741313 0.600670 1.971209 1.667829 -0.485951 0.499337
9.100000 -0.685463 0.584429 1.995905 1.696143 -0.488148 0.498934
9.133333 -0.628918 0.568064 2.015743 1.723769 -0.490586 0.480949
9.166667 -0.571003 0.551681 2.027794 1.750668 -0.493327 0.445831
9.200000 -0.511836 0.535277 2.046973 1.776708 -0.496364 0.394554
9.233333 -0.451515 0.518818 2.085457 1.801780 -0.499763 0.329334
9.266667 -0.390593 0.502257 2.093691 1.825689 -0.503568 0.257611
9.300000 -0.329095 0.485600 2.101899 1.848290 -0.507865 0.183590
9.333333 -0.266592 0.468706 2.109335 1.869405 -0.512725 0.107447
9.366667 -0.203566 0.451728 2.107401 1.888931 -0.518228 0.034289
9.400000 -0.139838 0.434262 2.081625 1.906853 -0.524440 -0.029937
9.433333 -0.075642 0.416724 2.083832 1.923231 -0.531322 -0.078687
9.466667 -0.011002 0.399119 2.086944 1.938256 -0.538810 -0.116319
9.500000 0.054052 0.381455 2.064946 1.952134 -0.546772 -0.140116
9.533333 0.119494 0.363738 2.055176 1.965163 -0.555126 -0.149813
9.566667 0.185714 0.345144 2.039163 1.977554 -0.563751 -0.146438
9.600000 0.251805 0.325969 2.061400 1.989541 -0.572561 -0.138381
9.633333 0.318306 0.306183 2.043099 2.001233 -0.581412 -0.129141
9.666667 0.385081 0.286375 2.046276 2.012689 -0.590155 -0.118738
9.700000 0.452102 0.266552 2.037352 2.023923 -0.598632 -0.110203
9.733333 0.519341 0.246724 2.036585 2.034877 -0.606622 -0.106412
9.766667 0.587390 0.226395 2.036668 2.045538 -0.613934 -0.109286
9.800000 0.656099 0.205679 2.045364 2.055766 -0.620389 -0.113417
9.833333 0.725269 0.184635 2.025442 2.065460 -0.625918 -0.119545
9.866667 0.794728 0.163315 2.027066 2.074441 -0.630378 -0.127617
9.900000 0.864349 0.141774 2.018769 2.082550 -0.633630 -0.133580
9.933333 0.933974 0.120210 2.019306 2.089647 -0.635558 -0.135307
9.966667 1.003606 0.098709 2.009256 2.095582 -0.636126 -0.129247
10.000000 1.074062 0.077072 2.009365 2.100254 -0.635308 -0.115854
10.033333 1.144461 0.055520 1.994736 2.103671 -0.633045 -0.093310
10.066667 1.214772 0.034064 1.986495 2.105932 -0.629396 -0.056862
10.100000 1.285488 0.012962 1.985944 2.107106 -0.624486 -0.011557
10.133333 1.356051 -0.008023 1.991124 2.107306 -0.618410 0.043951
10.166667 1.426428 -0.028881 1.980973 2.106677 -0.611159 0.107830
10.200000 1.497034 -0.049004 1.971477 2.105428 -0.602776 0.180557
10.233333 1.567389 -0.068982 1.998362 2.103637 -0.593343 0.257671
10.266667 1.637462 -0.088803 1.998055 2.101297 -0.582949 0.334260
10.300000 1.707220 -0.108460 2.021653 2.098479 -0.571612 0.408636
10.333333 1.776631 -0.127943 2.030975 2.095204 -0.559432 0.476805
10.366667 1.846434 -0.146698 2.049457 2.091372 -0.546652 0.533677
10.400000 1.916521 -0.164640 2.079060 2.086819 -0.533450 0.572436
10.433333 1.986163 -0.182383 2.094043 2.081365 -0.520013 0.593988
10.466667 2.055910 -0.199395 2.121157 2.074745 -0.506559 0.593822
10.500000 2.125617 -0.215688 2.156929 2.066626 -0.493391 0.574152
10.533333 2.194779 -0.231761 2.175125 2.056503 -0.480750 0.535739
10.566667 2.263661 -0.247284 2.204910 2.043887 -0.468746 0.481070
10.600000 2.332083 -0.262367 2.232473 2.028258 -0.457445 0.415671
10.633333 2.399782 -0.277076 2.231705 2.009191 -0.446891 0.341445
10.666667 2.467379 -0.291565 2.237805 1.986465 -0.437016 0.266490
10.700000 2.534518 -0.305946 2.253412 1.959699 -0.427606 0.194113
10.733333 2.600793 -0.320057 2.247375 1.928824 -0.418479 0.127928
10.766667 2.665918 -0.333959 2.245957 1.893744 -0.409392 0.070757
10.800000 2.729416 -0.347615 2.236798 1.854361 -0.400075 0.022396
10.833333 2.792073 -0.361007 2.234888 1.810540 -0.390241 -0.018071
10.866667 2.852369 -0.373953 2.233830 1.762252 -0.379664 -0.055597
10.900000 2.910721 -0.386618 2.241800 1.709703 -0.368206 -0.094980
10.933333 2.966722 -0.398889 2.236691 1.653079 -0.355720 -0.142800
10.966667 3.021774 -0.410882 2.223068 1.592595 -0.342149 -0.202713
11.000000 3.075855 -0.422592 2.225911 1.528464 -0.327498 -0.278411
11.033333 3.126391 -0.433547 2.230229 1.460838 -0.311756 -0.371899
11.066667 3.175913 -0.444215 2.232247 1.389576 -0.294883 -0.480239
11.100000 3.221491 -0.453856 2.223958 1.314673 -0.276897 -0.597223
11.133333 3.262796 -0.462489 2.182624 1.235910 -0.257778 -0.712175
11.166667 3.303040 -0.470832 2.160441 1.153215 -0.237512 -0.817586
11.200000 3.342212 -0.478882 2.129690 1.066714 -0.216111 -0.900803
11.233333 3.376883 -0.485921 2.095195 0.976963 -0.193705 -0.952650
11.266667 3.410467 -0.492670 2.046480 0.884643 -0.170437 -0.966593
11.300000 3.439549 -0.498331 1.997069 0.790587 -0.146481 -0.941093
11.333333 3.464208 -0.502858 1.923921 0.696043 -0.122142 -0.877120
11.366667 3.484391 -0.506304 1.876491 0.602686 -0.097853 -0.777018
11.400000 3.503492 -0.509470 1.857642 0.512297 -0.074083 -0.651106
11.433333 3.518246 -0.511492 1.850209 0.426288 -0.051223 -0.507769
11.466667 3.528849 -0.512309 1.841703 0.346374 -0.029710 -0.359536
11.500000 3.535831 -0.512067 1.844936 0.273879 -0.009901 -0.219567
11.533333 3.539869 -0.510925 1.846207 0.209657 0.007975 -0.102077
11.566667 3.542905 -0.509537 1.838609 0.153773 0.023888 -0.017214
11.600000 3.544964 -0.507911 1.856258 0.106077 0.037880 0.034439
11.633333 3.546068 -0.506056 1.869490 0.066256 0.050087 0.054392
11.666667 3.546705 -0.504104 1.893972 0.033341 0.060753 0.044791
11.700000 3.546436 -0.501941 1.905022 0.006302 0.070213 0.014754
11.733333 3.546076 -0.499510 1.902395 -0.015964 0.078820 -0.027084
11.766667 3.544856 -0.496886 1.899868 -0.034282 0.086865 -0.072592
11.800000 3.543403 -0.493697 1.894615 -0.049635 0.094567 -0.120996
11.833333 3.541138 -0.490332 1.864359 -0.062822 0.102070 -0.170857
11.866667 3.538085 -0.486803 1.857492 -0.074081 0.109437 -0.217144
11.900000 3.534270 -0.483117 1.819647 -0.083632 0.116618 -0.255143
11.933333 3.530714 -0.479019 1.830734 -0.091490 0.123501 -0.283049
11.966667 3.527787 -0.474635 1.844981 -0.097427 0.129855 -0.298454
12.000000 3.524168 -0.470125 1.835378 -0.101032 0.135533 -0.296925
12.033333 3.521055 -0.465237 1.826214 -0.101765 0.140248 -0.277347
12.066667 3.517293 -0.460243 1.813293 -0.099095 0.143673 -0.234695
12.100000 3.512903 -0.455155 1.789377 -0.092391 0.145503 -0.172750
12.133333 3.507905 -0.449983 1.764066 -0.080931 0.145474 -0.088191
12.166667 3.503958 -0.444485 1.748196 -0.064269 0.143473 0.015891
12.200000 3.501598 -0.439101 1.730277 -0.041868 0.139324 0.136037
12.233333 3.498689 -0.433664 1.742067 -0.013645 0.133099 0.266178
12.266667 3.495249 -0.428185 1.762358 0.020119 0.125002 0.392467
12.300000 3.495575 -0.423952 1.792978 0.058780 0.115346 0.506020
12.333333 3.495400 -0.419696 1.803011 0.101605 0.104424 0.597727
12.366667 3.499431 -0.416512 1.834978 0.147282 0.092677 0.665864
12.400000 3.507711 -0.414303 1.894357 0.193867 0.080721 0.707593
12.433333 3.515512 -0.412094 1.944523 0.239692 0.069073 0.725475
12.466667 3.522837 -0.409889 1.987800 0.282889 0.058215 0.724901
12.500000 3.533906 -0.408509 1.988956 0.321802 0.048458 0.715844
12.533333 3.548436 -0.407733 1.988858 0.354243 0.040114 0.701118
12.566667 3.562482 -0.406976 1.995699 0.378773 0.033162 0.682484
12.600000 3.579061 -0.406469 2.005467 0.394517 0.027357 0.662994
12.633333 3.595140 -0.405990 2.028029 0.400356 0.022324 0.642530
12.666667 3.610707 -0.405542 2.056701 0.395351 0.017555 0.620619
12.700000 3.625753 -0.405129 2.085667 0.378977 0.012445 0.585873
12.733333 3.641050 -0.404521 2.126990 0.351496 0.006227 0.533295
12.766667 3.655603 -0.403740 2.156858 0.313319 -0.001666 0.457349
12.800000 3.668510 -0.402917 2.171474 0.265134 -0.011742 0.357960
12.833333 3.679022 -0.402434 2.202114 0.208180 -0.024452 0.236727
12.866667 3.686452 -0.402558 2.204483 0.144357 -0.039994 0.099263
12.900000 3.690245 -0.403499 2.209421 0.075659 -0.058418 -0.040855
12.933333 3.693464 -0.404495 2.201866 0.004004 -0.079623 -0.171100
12.966667 3.692681 -0.406706 2.187388 -0.068690 -0.103436 -0.279746
13.000000 3.688101 -0.410154 2.163579 -0.140669 -0.129549 -0.363398
13.033333 3.679994 -0.415028 2.122912 -0.210182 -0.157319 -0.416700
13.066667 3.668493 -0.421624 2.090555 -0.275931 -0.186156 -0.440408
13.100000 3.656455 -0.428265 2.053208 -0.337130 -0.215399 -0.439097
13.133333 3.643892 -0.434943 2.050332 -0.393069 -0.244250 -0.421939
13.166667 3.628768 -0.443829 2.046360 -0.443457 -0.271975 -0.397174
13.200000 3.613151 -0.452738 2.039796 -0.488465 -0.298061 -0.372596
13.233333 3.595106 -0.463959 2.038894 -0.528622 -0.322190 -0.358528
13.266667 3.574846 -0.477248 2.031861 -0.564570 -0.344119 -0.361093
13.300000 3.554151 -0.490526 2.025543 -0.596689 -0.363572 -0.382451
13.333333 3.533042 -0.503780 2.024826 -0.625328 -0.380331 -0.417136
13.366667 3.511540 -0.516996 2.016248 -0.650758 -0.394353 -0.462504
13.400000 3.489667 -0.530160 2.009426 -0.672858 -0.405417 -0.511027
13.433333 3.466540 -0.544166 1.975132 -0.691380 -0.413443 -0.553608
13.466667 3.442332 -0.558646 1.936929 -0.705929 -0.418408 -0.583887
13.500000 3.417469 -0.573427 1.917605 -0.716218 -0.420355 -0.598113
13.533333 3.392203 -0.588292 1.881185 -0.722120 -0.419411 -0.596206
13.566667 3.366680 -0.603027 1.855200 -0.723354 -0.415525 -0.577123
13.600000 3.340985 -0.617734 1.834697 -0.719681 -0.408659 -0.542607
13.633333 3.315421 -0.632162 1.814404 -0.711150 -0.398867 -0.498103
13.666667 3.290297 -0.646103 1.808104 -0.697949 -0.386239 -0.448138
13.700000 3.265978 -0.659515 1.792390 -0.680174 -0.370879 -0.392988
13.733333 3.242790 -0.672167 1.793084 -0.657778 -0.352874 -0.335813
13.766667 3.221082 -0.683870 1.785722 -0.631136 -0.332516 -0.276875
13.800000 3.201107 -0.694352 1.771344 -0.601038 -0.310341 -0.217248
13.833333 3.181043 -0.704578 1.766043 -0.568015 -0.286729 -0.153720
13.866667 3.160904 -0.714535 1.754745 -0.532495 -0.262036 -0.082606
13.900000 3.142883 -0.723176 1.742348 -0.495151 -0.236763 -0.008107
13.933333 3.127069 -0.730431 1.745823 -0.457071 -0.211541 0.068190
13.966667 3.111219 -0.737381 1.739127 -0.418777 -0.186815 0.141822
14.000000 3.097749 -0.743003 1.739634 -0.380504 -0.162849 0.210790
14.033333 3.086750 -0.747399 1.762630 -0.342653 -0.140008 0.267997
14.066667 3.078387 -0.750580 1.781221 -0.305999 -0.118723 0.307137
14.100000 3.070008 -0.753424 1.805033 -0.271096 -0.099232 0.327595
14.133333 3.061613 -0.755924 1.818202 -0.238008 -0.081556 0.331403
14.166667 3.053203 -0.758074 1.851719 -0.207151 -0.065741 0.318548
14.200000 3.047006 -0.759661 1.874410 -0.178882 -0.051756 0.288367
14.233333 3.042721 -0.760830 1.875019 -0.153441 -0.039392 0.247652
14.266667 3.038412 -0.761632 1.870111 -0.130539 -0.028231 0.202425
14.300000 3.035430 -0.762290 1.858617 -0.110124 -0.017881 0.157757
14.333333 3.032413 -0.762570 1.866256 -0.092311 -0.008012 0.115044
14.366667 3.030222 -0.762664 1.868119 -0.077174 0.001706 0.080524
14.400000 3.028768 -0.762612 1.872236 -0.064675 0.011573 0.057869
14.433333 3.027890 -0.762361 1.875932 -0.054643 0.021824 0.045466
14.466667 3.026941 -0.761711 1.878854 -0.047140 0.032702 0.040230
14.500000 3.025910 -0.760656 1.871431 -0.041978 0.044543 0.039791
14.533333 3.024788 -0.759193 1.872887 -0.038997 0.057615 0.042508
14.566667 3.023564 -0.757316 1.873913 -0.037893 0.072152 0.044382
14.600000 3.022601 -0.754998 1.878326 -0.038442 0.088327 0.038360
14.633333 3.021516 -0.752258 1.874452 -0.040476 0.106275 0.018461
14.666667 3.020494 -0.748708 1.886735 -0.043768 0.125876 -0.020578
14.700000 3.019326 -0.744729 1.886366 -0.048260 0.147087 -0.082834
14.733333 3.018000 -0.740319 1.884952 -0.053988 0.170249 -0.172361
14.766667 3.016506 -0.735475 1.891245 -0.061180 0.196094 -0.289349
14.800000 3.014590 -0.728869 1.890284 -0.070042 0.225260 -0.422859
14.833333 3.012115 -0.720107 1.889764 -0.080802 0.258257 -0.561953
14.866667 3.009438 -0.710910 1.891054 -0.093674 0.295765 -0.694627
14.900000 3.006549 -0.701280 1.880598 -0.108663 0.337914 -0.813707
14.933333 3.003437 -0.691219 1.810521 -0.125545 0.384115 -0.904932
14.966667 3.000092 -0.680729 1.739659 -0.143859 0.433030 -0.959866
15.000000 2.996504 -0.669814 1.671694 -0.163415 0.483876 -0.976232
15.033333 2.991257 -0.654348 1.628609 -0.183964 0.535811 -0.952836
15.066667 2.984373 -0.634193 1.573547 -0.205159 0.587601 -0.888221
15.100000 2.975816 -0.609160 1.556842 -0.226820 0.638230 -0.781028
15.133333 2.966984 -0.583744 1.543678 -0.248883 0.687038 -0.643772
15.166667 2.957873 -0.557963 1.537870 -0.271533 0.733908 -0.486980
15.200000 2.948478 -0.531835 1.526587 -0.294531 0.777934 -0.322302
15.233333 2.938794 -0.505381 1.509867 -0.317965 0.818891 -0.159341
15.266667 2.928816 -0.478619 1.503801 -0.342254 0.857363 -0.009775
15.300000 2.918540 -0.451569 1.499663 -0.367716 0.894193 0.118995
15.333333 2.905561 -0.420171 1.509109 -0.394538 0.929890 0.227014
15.366667 2.892279 -0.388528 1.536744 -0.422698 0.964590 0.313037
15.400000 2.878692 -0.356666 1.554297 -0.452438 0.998714 0.381496
15.433333 2.862772 -0.321679 1.584067 -0.483515 1.031725 0.433091
15.466667 2.846548 -0.286524 1.602390 -0.515354 1.062341 0.473420
15.500000 2.828428 -0.249214 1.626721 -0.547300 1.088986 0.507264
15.533333 2.810008 -0.211796 1.642655 -0.578929 1.110528 0.540419
15.566667 2.789856 -0.172710 1.657429 -0.609704 1.125726 0.580497
15.600000 2.768143 -0.132468 1.669028 -0.638853 1.133177 0.627083
15.633333 2.746147 -0.092214 1.675287 -0.665995 1.132131 0.685237
15.666667 2.722977 -0.051918 1.684246 -0.690795 1.122165 0.752765
15.700000 2.698890 -0.012152 1.690490 -0.713153 1.103070 0.827095
15.733333 2.673731 0.026848 1.738252 -0.732831 1.074664 0.900502
15.766667 2.647841 0.064484 1.768688 -0.749921 1.037398 0.967966
15.800000 2.621732 0.099518 1.816900 -0.764791 0.992447 1.026244
15.833333 2.595402 0.134373 1.872932 -0.777733 0.940882 1.067885
15.866667 2.569083 0.166236 1.925940 -0.789189 0.884179 1.090097
15.900000 2.542760 0.195173 1.959156 -0.799549 0.824136 1.092063
15.933333 2.516214 0.221559 1.998961 -0.809291 0.762736 1.079219
15.966667 2.489307 0.245480 2.035779 -0.818814 0.701829 1.052646
16.000000 2.462122 0.266971 2.060527 -0.828473 0.642698 1.017652
16.033333 2.434533 0.286111 2.088914 -0.838456 0.586872 0.980238
16.066667 2.406622 0.302936 2.118603 -0.848833 0.535396 0.945616
16.100000 2.378100 0.317550 2.147082 -0.859568 0.488889 0.912269
16.133333 2.349472 0.331841 2.182582 -0.870679 0.447476 0.877017
16.166667 2.319788 0.344239 2.209644 -0.881981 0.411133 0.839184
16.200000 2.290028 0.356304 2.230855 -0.893174 0.379772 0.795418
16.233333 2.260208 0.368034 2.266835 -0.904150 0.352857 0.742894
16.266667 2.230343 0.379426 2.298657 -0.914915 0.329773 0.678947
16.300000 2.199552 0.389638 2.326092 -0.925495 0.309879 0.607807
16.333333 2.167900 0.398898 2.360916 -0.935677 0.292778 0.532230
16.366667 2.136255 0.407815 2.372785 -0.945470 0.277921 0.456021
16.400000 2.104635 0.416389 2.385673 -0.954948 0.264904 0.379138
16.433333 2.073058 0.424620 2.379304 -0.964047 0.253459 0.307322
16.466667 2.040341 0.432634 2.378775 -0.972470 0.243415 0.245546
16.500000 2.007706 0.440306 2.380896 -0.980025 0.234616 0.194355
16.533333 1.975172 0.447636 2.394753 -0.986690 0.226770 0.156434
16.566667 1.941858 0.454925 2.392782 -0.992263 0.219698 0.128176
16.600000 1.907964 0.462233 2.390801 -0.996426 0.213148 0.114601
16.633333 1.874234 0.469202 2.396531 -0.998812 0.206848 0.110124
16.666667 1.840278 0.476128 2.400374 -0.999229 0.200544 0.110498
16.700000 1.806529 0.482717 2.417387 -0.997328 0.194033 0.113040
16.733333 1.772921 0.489203 2.404992 -0.992728 0.187160 0.113299
16.766667 1.739172 0.495570 2.408141 -0.985058 0.179721 0.112799
16.800000 1.705697 0.501602 2.416464 -0.973945 0.171522 0.104163
16.833333 1.672520 0.507301 2.416577 -0.958950 0.162322 0.086103
16.866667 1.639733 0.512746 2.436704 -0.939710 0.151922 0.053515
16.900000 1.607604 0.517945 2.426701 -0.915840 0.140061 0.006883
16.933333 1.576302 0.522807 2.441740 -0.886812 0.126439 -0.053855
16.966667 1.546149 0.527203 2.437430 -0.852328 0.110849 -0.127866
17.000000 1.516988 0.531202 2.441816 -0.812458 0.093213 -0.209526
17.033333 1.489295 0.534676 2.444326 -0.767764 0.073636 -0.291728
17.066667 1.462044 0.537830 2.422045 -0.718775 0.052269 -0.359350
17.100000 1.437243 0.539933 2.422253 -0.666608 0.029600 -0.408091
17.133333 1.415397 0.540814 2.401401 -0.613040 0.006452 -0.429584
17.166667 1.396820 0.540327 2.356451 -0.560197 -0.016125 -0.421090
17.200000 1.378739 0.539540 2.307565 -0.510080 -0.037056 -0.379753
17.233333 1.363885 0.537330 2.276373 -0.464671 -0.055187 -0.309639
17.266667 1.351873 0.533822 2.264612 -0.426169 -0.069318 -0.225123
17.300000 1.342022 0.529290 2.272465 -0.396260 -0.078531 -0.133652
17.333333 1.332686 0.524493 2.268961 -0.375861 -0.082313 -0.047083
17.366667 1.323866 0.519444 2.276681 -0.365047 -0.080610 0.023565
17.400000 1.314892 0.514856 2.297276 -0.363518 -0.073650 0.066458
17.433333 1.305156 0.511126 2.321236 -0.370076 -0.062223 0.078917
17.466667 1.294241 0.508464 2.357064 -0.382614 -0.047635 0.064338
17.500000 1.281790 0.506993 2.372255 -0.398438 -0.031595 0.022037
17.533333 1.267732 0.506666 2.371038 -0.414829 -0.015833 -0.048971
17.566667 1.252227 0.507442 2.346521 -0.428937 -0.002277 -0.144470
17.600000 1.235671 0.509068 2.317046 -0.438071 0.007296 -0.255629
17.633333 1.218461 0.511318 2.304214 -0.440219 0.011574 -0.377677
17.666667 1.200676 0.513943 2.298588 -0.434203 0.009835 -0.505106
17.700000 1.182916 0.516515 2.282204 -0.419803 0.002057 -0.627693
17.733333 1.165760 0.518896 2.264015 -0.397258 -0.011503 -0.734184
17.766667 1.150233 0.520187 2.263979 -0.367752 -0.029912 -0.821064
17.800000 1.137222 0.519855 2.262239 -0.332844 -0.051994 -0.894639
17.833333 1.127318 0.517296 2.204110 -0.294330 -0.076472 -0.961059
17.866667 1.118066 0.514563 2.130136 -0.253959 -0.102163 -1.027506
17.900000 1.112752 0.508463 2.047880 -0.213547 -0.127770 -1.098490
17.933333 1.108100 0.502207 1.999133 -0.174729 -0.152108 -1.183118
17.966667 1.104114 0.495807 1.988874 -0.138791 -0.173983 -1.285941
18.000000 1.100796 0.489274 1.991937 -0.106567 -0.192532 -1.404996
18.033333 1.098149 0.482619 1.972274 -0.078346 -0.207218 -1.540527
18.066667 1.096176 0.475854 1.945734 -0.054205 -0.217626 -1.692625
18.100000 1.095768 0.466974 1.896498 -0.033638 -0.223824 -1.867691
18.133333 1.096038 0.458010 1.819342 -0.016201 -0.225842 -2.055351
18.166667 1.096815 0.448466 1.716548 -0.001225 -0.224162 -2.235086
18.200000 1.097610 0.439276 1.611332 0.011823 -0.219282 -2.379752
18.233333 1.098192 0.431379 1.541717 0.023327 -0.211832 -2.463715
18.266667 1.099457 0.423452 1.439753 0.033644 -0.202595 -2.461280
18.300000 1.100101 0.417910 1.334201 0.043273 -0.192960 -2.348510
18.333333 1.101433 0.412362 1.229280 0.052945 -0.184611 -2.118933
18.366667 1.103456 0.406819 1.114773 0.063359 -0.179322 -1.784669
18.400000 1.106173 0.401290 1.015983 0.075179 -0.178610 -1.374198
18.433333 1.108539 0.397221 0.918477 0.089013 -0.183587 -0.910868
18.466667 1.110776 0.393714 0.867730 0.105626 -0.195204 -0.424738
18.500000 1.113716 0.390248 0.869786 0.125419 -0.213458 0.054121
18.533333 1.116930 0.385701 0.949748 0.148577 -0.237782 0.495581
18.566667 1.120786 0.379460 1.042714 0.175237 -0.267113 0.880506
18.600000 1.125658 0.371043 1.135827 0.205675 -0.300407 1.196975
18.633333 1.131957 0.360270 1.208345 0.240144 -0.336501 1.433714
18.666667 1.140058 0.347096 1.287132 0.278411 -0.373769 1.585663
18.700000 1.150186 0.331547 1.332145 0.320024 -0.410484 1.660003
18.733333 1.161033 0.316143 1.369969 0.364646 -0.445269 1.675569
18.766667 1.172596 0.300907 1.412285 0.411726 -0.477019 1.649391
18.800000 1.186528 0.283776 1.463220 0.460396 -0.504515 1.599923
18.833333 1.202821 0.265080 1.508851 0.509571 -0.526783 1.539573
18.866667 1.219819 0.246626 1.568262 0.558549 -0.543492 1.478421
18.900000 1.239361 0.227052 1.645813 0.606833 -0.554764 1.414820
18.933333 1.261403 0.206757 1.683904 0.653609 -0.560640 1.343262
18.966667 1.285841 0.185971 1.738194 0.697976 -0.560677 1.255034
19.000000 1.310944 0.165539 1.764569 0.739154 -0.554577 1.147633
19.033333 1.336698 0.145491 1.804824 0.776570 -0.541795 1.022162
19.066667 1.364291 0.126414 1.843853 0.809466 -0.521633 0.886786
19.100000 1.392505 0.107779 1.900185 0.837287 -0.493420 0.751146
19.133333 1.422250 0.091404 1.925904 0.859652 -0.456355 0.622844
19.166667 1.452583 0.075525 1.944162 0.876687 -0.410569 0.514512
19.200000 1.483486 0.060167 1.918027 0.888577 -0.356308 0.433980
19.233333 1.514941 0.045354 1.922705 0.895560 -0.294147 0.387266
19.266667 1.546931 0.031113 1.917686 0.898077 -0.224580 0.372604
19.300000 1.578179 0.022206 1.910851 0.896526 -0.148385 0.386506
19.333333 1.608375 0.018721 1.911779 0.891749 -0.067197 0.423145
19.366667 1.637199 0.020857 1.928765 0.884499 0.017389 0.469587
19.400000 1.666494 0.023626 1.947081 0.875644 0.103674 0.505660
19.433333 1.696246 0.027037 1.978111 0.866152 0.189862 0.512632
19.466667 1.724594 0.036080 2.007658 0.857070 0.273872 0.475783
19.500000 1.753374 0.045771 2.041205 0.849237 0.354416 0.387012
19.533333 1.780898 0.060608 2.083375 0.843137 0.430903 0.239039
19.566667 1.807289 0.080429 2.141073 0.839074 0.503217 0.032368
19.600000 1.834081 0.100880 2.159024 0.837433 0.571200 -0.223281
19.633333 1.861263 0.121950 2.132571 0.838474 0.634636 -0.512287
19.666667 1.888828 0.143627 2.114339 0.842096 0.693790 -0.820461
19.700000 1.916765 0.165899 2.067845 0.848558 0.748523 -1.135493
19.733333 1.944623 0.191715 2.006127 0.858285 0.798763 -1.439981
19.766667 1.972796 0.220650 1.941708 0.871600 0.844536 -1.719776
19.800000 2.001620 0.252269 1.861239 0.888455 0.885799 -1.963835
19.833333 2.030780 0.284412 1.783659 0.909106 0.922571 -2.172295
19.866667 2.060265 0.317058 1.696318 0.933987 0.954641 -2.341397
19.900000 2.090065 0.350183 1.617820 0.963006 0.981831 -2.471969
19.933333 2.121988 0.384648 1.524021 0.995682 1.003885 -2.566621
19.966667 2.154204 0.419545 1.441113 1.031651 1.020618 -2.626915
20.000000 2.186700 0.454850 1.350159 1.071028 1.032106 -2.658642
20.033333 2.222573 0.490380 1.248723 1.113037 1.038743 -2.659995
20.066667 2.262087 0.525788 1.155990 1.156617 1.040969 -2.634873
20.100000 2.301832 0.561529 1.052441 1.200966 1.039216 -2.582006
20.133333 2.341787 0.597580 0.961014 1.245512 1.034048 -2.506080
20.166667 2.385677 0.632108 0.864328 1.289376 1.025969 -2.411532
20.200000 2.429732 0.666898 0.786684 1.331130 1.015556 -2.298903
20.233333 2.473928 0.701928 0.699470 1.370139 1.003125 -2.170301
20.266667 2.521435 0.734718 0.641856 1.406049 0.989075 -2.029624
20.300000 2.569030 0.767705 0.598119 1.438432 0.973773 -1.884066
20.333333 2.620008 0.798757 0.527513 1.466411 0.957769 -1.731950
20.366667 2.671013 0.829966 0.466020 1.489550 0.941290 -1.577928
20.400000 2.722010 0.861316 0.418590 1.507380 0.924570 -1.421764
20.433333 2.772968 0.892787 0.367810 1.519261 0.908030 -1.267544
20.466667 2.825589 0.922662 0.323531 1.524701 0.891948 -1.111938
20.500000 2.878104 0.952626 0.291069 1.523373 0.876668 -0.953246
20.533333 2.930868 0.981392 0.258587 1.515622 0.862144 -0.797718
20.566667 2.982958 1.009184 0.245069 1.501545 0.848602 -0.643041
20.600000 3.034631 1.036503 0.221597 1.481793 0.836257 -0.494850
20.633333 3.085114 1.063455 0.205772 1.457059 0.825271 -0.354434
20.666667 3.135322 1.090426 0.213418 1.428048 0.815685 -0.228110
20.700000 3.182953 1.117140 0.185361 1.395273 0.807478 -0.113336
20.733333 3.227263 1.143512 0.210741 1.359290 0.800625 -0.008846
20.766667 3.271210 1.169868 0.218391 1.320894 0.794869 0.084063
20.800000 3.314769 1.196197 0.237047 1.280597 0.789842 0.164583
20.833333 3.357913 1.222489 0.228035 1.238640 0.785031 0.234287
20.866667 3.400618 1.248732 0.229907 1.195074 0.780014 0.294627
20.900000 3.438499 1.274787 0.246810 1.150557 0.774355 0.335109
20.933333 3.475896 1.300772 0.256148 1.105273 0.767587 0.354704
20.966667 3.512789 1.326678 0.268048 1.059518 0.759424 0.349894
21.000000 3.549160 1.352494 0.291602 1.013606 0.749625 0.319306
21.033333 3.581330 1.377679 0.313030 0.968474 0.738178 0.257800
21.066667 3.612943 1.402756 0.344081 0.925226 0.725040 0.164589
21.100000 3.641388 1.427078 0.363540 0.884377 0.710163 0.050211
21.133333 3.669252 1.451275 0.365345 0.846600 0.693527 -0.079674
21.166667 3.695084 1.474452 0.372211 0.812477 0.674977 -0.216647
21.200000 3.719812 1.496861 0.360394 0.782587 0.654249 -0.349246
21.233333 3.744035 1.518297 0.326878 0.756770 0.630989 -0.465646
21.266667 3.768306 1.538607 0.300877 0.734489 0.604963 -0.558664
21.300000 3.791954 1.558762 0.263736 0.714902 0.575905 -0.627824
21.333333 3.814972 1.578759 0.204312 0.697170 0.543807 -0.672609
21.366667 3.837351 1.598594 0.168101 0.680199 0.508826 -0.695077
21.400000 3.860108 1.616647 0.146394 0.662795 0.471480 -0.701073
21.433333 3.882867 1.632705 0.142016 0.643912 0.432203 -0.699709
21.466667 3.905265 1.646585 0.135377 0.622767 0.391527 -0.695828
21.500000 3.927068 1.658439 0.133385 0.599111 0.350396 -0.693872
21.533333 3.947763 1.668182 0.109995 0.572758 0.309751 -0.695162
21.566667 3.967777 1.677779 0.087232 0.543618 0.270401 -0.695441
21.600000 3.985876 1.685071 0.055601 0.511881 0.232954 -0.687687
21.633333 4.001706 1.690119 0.026916 0.478219 0.198301 -0.660892
21.666667 4.016842 1.695056 -0.007851 0.443429 0.167243 -0.608473
21.700000 4.031281 1.699894 -0.037431 0.408189 0.140090 -0.523963
21.733333 4.045022 1.704650 -0.069462 0.373168 0.116966 -0.406809
21.766667 4.056558 1.707570 -0.104017 0.339296 0.098393 -0.264853
21.800000 4.066108 1.708840 -0.127285 0.307319 0.084794 -0.108727
21.833333 4.074963 1.710074 -0.141832 0.277550 0.076143 0.049625
21.866667 4.083126 1.711290 -0.123314 0.250133 0.072272 0.198031
21.900000 4.090203 1.711934 -0.072873 0.225237 0.073214 0.323296
21.933333 4.096597 1.712597 -0.029319 0.202895 0.078973 0.413757
21.966667 4.102243 1.713886 0.002991 0.182614 0.088918 0.465359
22.000000 4.107418 1.716245 0.019595 0.163611 0.102317 0.477477
22.033333 4.111923 1.718677 0.034033 0.145228 0.118660 0.454572
22.066667 4.116500 1.722909 0.067816 0.126508 0.137439 0.404105
22.100000 4.121267 1.729188 0.078938 0.106091 0.157955 0.341781
22.133333 4.125379 1.735585 0.088761 0.082484 0.179511 0.284474
22.166667 4.128842 1.742112 0.083062 0.054591 0.201652 0.244363
22.200000 4.131661 1.748782 0.074886 0.021777 0.224075 0.231326
22.233333 4.133842 1.755607 0.067584 -0.016587 0.246474 0.248401
22.266667 4.134840 1.763824 0.060894 -0.060678 0.268703 0.299425
22.300000 4.133966 1.773187 0.062702 -0.109859 0.290765 0.378630
22.333333 4.130578 1.783657 0.062810 -0.162960 0.312675 0.478739
22.366667 4.126584 1.794322 0.087455 -0.219018 0.334600 0.591180
22.400000 4.118952 1.805933 0.106028 -0.277045 0.356767 0.704950
22.433333 4.107539 1.818595 0.146107 -0.335785 0.379468 0.809438
22.466667 4.092108 1.832253 0.192115 -0.393631 0.402856 0.891192
22.500000 4.076141 1.846131 0.225886 -0.449483 0.427302 0.942019
22.533333 4.059661 1.860237 0.270150 -0.502515 0.453169 0.954937
22.566667 4.042691 1.874572 0.310874 -0.551531 0.480679 0.927354
22.600000 4.022466 1.890334 0.346510 -0.595366 0.509951 0.861272
22.633333 4.001802 1.906333 0.394763 -0.633238 0.541097 0.761688
22.666667 3.978754 1.923936 0.430137 -0.664789 0.574357 0.638102
22.700000 3.953972 1.943239 0.461383 -0.689355 0.609585 0.494026
22.733333 3.928157 1.964336 0.469300 -0.706036 0.646647 0.338417
22.766667 3.902032 1.987295 0.467877 -0.714349 0.685176 0.180987
22.800000 3.875623 2.010485 0.452314 -0.714184 0.724903 0.028639
22.833333 3.849482 2.035720 0.451729 -0.705537 0.765214 -0.112318
22.866667 3.823123 2.061172 0.446541 -0.688686 0.805527 -0.239280
22.900000 3.798360 2.088115 0.429893 -0.664526 0.845406 -0.341710
22.933333 3.775040 2.116822 0.415799 -0.634598 0.884329 -0.419842
22.966667 3.753505 2.147245 0.392981 -0.600411 0.922093 -0.476129
23.000000 3.734012 2.179268 0.376907 -0.563619 0.958272 -0.512273
23.033333 3.716628 2.212892 0.335119 -0.525816 0.992750 -0.524501
23.066667 3.701532 2.247923 0.316359 -0.488728 1.025097 -0.512327
23.100000 3.686401 2.283077 0.310140 -0.453666 1.054908 -0.482555
23.133333 3.673293 2.319425 0.288593 -0.421658 1.081876 -0.430480
23.166667 3.660185 2.355855 0.263102 -0.393500 1.105692 -0.354873
23.200000 3.648564 2.393636 0.247810 -0.369695 1.126128 -0.254473
23.233333 3.638038 2.432609 0.245919 -0.350507 1.142953 -0.137658
23.266667 3.627555 2.471599 0.225086 -0.335696 1.156178 -0.005722
23.300000 3.617676 2.511358 0.220641 -0.325189 1.165645 0.144140
23.333333 3.608033 2.551630 0.221888 -0.318651 1.171180 0.303347
23.366667 3.598472 2.591845 0.246639 -0.315855 1.172554 0.465868
23.400000 3.588575 2.631957 0.264961 -0.316330 1.169626 0.624117
23.433333 3.578787 2.671961 0.279625 -0.319606 1.162333 0.773972
23.466667 3.568304 2.711293 0.327734 -0.325247 1.150579 0.904261
23.500000 3.557954 2.750466 0.358558 -0.332617 1.134459 1.005797
23.533333 3.546705 2.788862 0.398996 -0.341059 1.114298 1.075499
23.566667 3.535615 2.827051 0.454581 -0.349913 1.090284 1.109892
23.600000 3.523677 2.864011 0.502457 -0.358593 1.062695 1.110114
23.633333 3.511116 2.899522 0.558705 -0.366478 1.031692 1.078015
23.666667 3.497917 2.933416 0.603023 -0.372928 0.997541 1.021058
23.700000 3.484936 2.967016 0.649655 -0.377226 0.960524 0.941985
23.733333 3.471581 2.998428 0.671097 -0.378865 0.920826 0.845581
23.766667 3.458477 3.029510 0.684690 -0.377349 0.878925 0.741782
23.800000 3.445126 3.058551 0.699086 -0.372156 0.835298 0.635837
23.833333 3.431709 3.085507 0.720169 -0.362990 0.790622 0.532752
23.866667 3.418593 3.112087 0.740118 -0.349845 0.745490 0.435981
23.900000 3.405837 3.136534 0.741448 -0.333013 0.700718 0.354347
23.933333 3.393631 3.158839 0.753482 -0.312616 0.656922 0.290608
23.966667 3.382458 3.179204 0.772324 -0.288637 0.614642 0.241151
24.000000 3.372666 3.197738 0.770064 -0.261541 0.574424 0.206776
24.033333 3.364829 3.214542 0.769424 -0.231690 0.536628 0.186971
24.066667 3.357379 3.230923 0.764228 -0.199295 0.501606 0.181829
24.100000 3.350328 3.246878 0.766674 -0.164292 0.469411 0.184723
24.133333 3.346142 3.261018 0.769246 -0.127041 0.440391 0.193130
24.166667 3.342372 3.274728 0.776658 -0.088184 0.414750 0.205459
24.200000 3.339025 3.288009 0.778614 -0.047944 0.392474 0.216136
24.233333 3.336106 3.300859 0.801032 -0.006595 0.373426 0.220909
24.266667 3.336125 3.312315 0.813342 0.035519 0.357832 0.215002
24.300000 3.338918 3.322661 0.820819 0.077583 0.345913 0.197758
24.333333 3.342149 3.332580 0.840348 0.119154 0.337404 0.168901
24.366667 3.347870 3.342369 0.843610 0.159760 0.332081 0.133653
24.400000 3.354027 3.351734 0.850152 0.199114 0.330040 0.096994
24.433333 3.362275 3.361924 0.862497 0.236828 0.331406 0.063540
24.466667 3.372291 3.373578 0.861980 0.272539 0.335395 0.036168
24.500000 3.382725 3.384811 0.838742 0.306720 0.341292 0.017024
24.533333 3.393571 3.395621 0.829200 0.340050 0.348693 0.004479
24.566667 3.404821 3.406008 0.822068 0.373550 0.357244 -0.008199
24.600000 3.418183 3.419480 0.818525 0.407562 0.365885 -0.027186
24.633333 3.431930 3.432524 0.816848 0.442916 0.373684 -0.058410
24.666667 3.446050 3.445136 0.826587 0.480758 0.380293 -0.105438
24.700000 3.460533 3.457312 0.842604 0.521424 0.385264 -0.173211
24.733333 3.478599 3.471513 0.864100 0.564425 0.387705 -0.259872
24.766667 3.497001 3.485268 0.868845 0.609072 0.386530 -0.363723
24.800000 3.515723 3.498572 0.859400 0.655112 0.381240 -0.480474
24.833333 3.538434 3.512386 0.833712 0.701230 0.371076 -0.601248
24.866667 3.565010 3.526233 0.788136 0.745384 0.355292 -0.720173
24.900000 3.591846 3.539608 0.756373 0.785841 0.333230 -0.828237
24.933333 3.618917 3.552504 0.720130 0.821613 0.304996 -0.923925
24.966667 3.648770 3.563956 0.661671 0.851562 0.271134 -1.001714
25.000000 3.680717 3.573690 0.626583 0.874488 0.232418 -1.059802
25.033333 3.712817 3.582930 0.587578 0.890092 0.189989 -1.102685
25.066667 3.745604 3.589826 0.569088 0.898517 0.144951 -1.135659
25.100000 3.778138 3.594143 0.532172 0.899698 0.098448 -1.164173
25.133333 3.809327 3.595445 0.493860 0.893249 0.051353 -1.186719
25.166667 3.838333 3.593420 0.468744 0.879186 0.004333 -1.205373
25.200000 3.867345 3.590910 0.412894 0.857736 -0.042366 -1.215775
25.233333 3.896334 3.587923 0.381676 0.829247 -0.088412 -1.214913
25.266667 3.925276 3.584467 0.319696 0.794229 -0.133514 -1.191420
25.300000 3.954142 3.580552 0.268795 0.753629 -0.177446 -1.140421
25.333333 3.982908 3.576186 0.230318 0.708616 -0.220165 -1.063946
25.366667 4.007917 3.568992 0.195272 0.660458 -0.261593 -0.967648
25.400000 4.029460 3.559333 0.137509 0.610339 -0.301331 -0.860150
25.433333 4.047904 3.547560 0.091333 0.559385 -0.339040 -0.743158
25.466667 4.063470 3.533975 0.059611 0.508834 -0.374169 -0.626871
25.500000 4.076577 3.518617 0.066368 0.459894 -0.406020 -0.518170
25.533333 4.089481 3.502898 0.084945 0.413665 -0.433810 -0.419024
25.566667 4.102172 3.486839 0.097190 0.370634 -0.457035 -0.324437
25.600000 4.112300 3.470130 0.103349 0.331203 -0.475464 -0.235581
25.633333 4.122202 3.453120 0.091889 0.295281 -0.489156 -0.156849
25.666667 4.131870 3.435832 0.067975 0.262493 -0.498549 -0.086707
25.700000 4.141300 3.418286 0.021261 0.232084 -0.504321 -0.016332
25.733333 4.148007 3.401091 0.012288 0.203502 -0.507200 0.057990
25.766667 4.154469 3.383679 0.028585 0.176498 -0.507722 0.134975
25.800000 4.158490 3.366757 0.050038 0.150939 -0.506382 0.216707
25.833333 4.162265 3.349658 0.062366 0.126942 -0.503333 0.304172
25.866667 4.165792 3.332403 0.079852 0.104693 -0.498340 0.390762
25.900000 4.169074 3.315012 0.096831 0.084609 -0.490859 0.463006
25.933333 4.170456 3.299204 0.112084 0.066887 -0.480190 0.514084
25.966667 4.171596 3.283297 0.129382 0.051719 -0.465635 0.541668
26.000000 4.172498 3.267309 0.162106 0.039022 -0.446649 0.544802
26.033333 4.173166 3.251258 0.192947 0.028763 -0.422955 0.521287
26.066667 4.173602 3.235160 0.211823 0.020922 -0.394553 0.476695
26.100000 4.173812 3.219035 0.233818 0.015387 -0.361849 0.416722
26.133333 4.173591 3.205473 0.249703 0.011924 -0.325549 0.343737
26.166667 4.173240 3.194415 0.268900 0.010288 -0.286570 0.260309
26.200000 4.173006 3.185888 0.267185 0.010330 -0.245897 0.170468
26.233333 4.173103 3.179780 0.272051 0.011646 -0.204882 0.082356
26.266667 4.173669 3.176100 0.262254 0.013534 -0.165271 0.000836
26.300000 4.174032 3.172454 0.258284 0.015196 -0.128770 -0.067304
26.333333 4.174195 3.168844 0.259302 0.015724 -0.096956 -0.114929
26.366667 4.174978 3.167102 0.248732 0.014159 -0.071134 -0.138879
26.400000 4.176421 3.167139 0.239430 0.009613 -0.052302 -0.141089
26.433333 4.177672 3.167214 0.228002 0.001517 -0.040763 -0.126681
26.466667 4.179282 3.168356 0.194362 -0.010310 -0.036123 -0.101904
26.500000 4.180703 3.169531 0.196154 -0.025922 -0.037823 -0.074612
26.533333 4.181432 3.170559 0.184962 -0.044910 -0.045029 -0.050157
26.566667 4.181032 3.170815 0.197833 -0.066736 -0.056858 -0.034798
26.600000 4.178960 3.169727 0.209239 -0.090660 -0.072241 -0.027449
26.633333 4.175007 3.166725 0.231989 -0.115924 -0.090210 -0.028213
26.666667 4.168762 3.161475 0.244639 -0.141632 -0.109781 -0.034919
26.700000 4.162357 3.156257 0.258427 -0.166704 -0.129801 -0.044186
26.733333 4.155803 3.151075 0.238675 -0.190321 -0.149339 -0.053982
26.766667 4.149108 3.145932 0.223191 -0.211577 -0.167433 -0.059084
26.800000 4.142284 3.140832 0.185162 -0.229715 -0.183386 -0.057247
26.833333 4.133373 3.133821 0.179558 -0.243900 -0.196528 -0.050155
26.866667 4.124354 3.126862 0.176929 -0.253794 -0.206595 -0.045265
26.900000 4.114275 3.118537 0.180808 -0.258959 -0.213240 -0.048624
26.933333 4.104114 3.110277 0.193850 -0.258764 -0.215987 -0.069057
26.966667 4.093883 3.102091 0.199212 -0.252771 -0.214476 -0.112858
27.000000 4.084141 3.093585 0.207964 -0.240729 -0.208370 -0.187471
27.033333 4.074356 3.085167 0.220785 -0.222946 -0.197731 -0.284989
27.066667 4.064541 3.076843 0.230930 -0.199512 -0.182472 -0.387235
27.100000 4.056538 3.069541 0.235771 -0.171210 -0.163080 -0.481906
27.133333 4.050633 3.063699 0.238415 -0.139418 -0.140485 -0.557194
27.166667 4.047118 3.059551 0.181874 -0.105806 -0.115865 -0.602660
27.200000 4.043609 3.055516 0.086351 -0.072058 -0.090565 -0.604262
27.233333 4.042352 3.053135 0.023130 -0.039749 -0.065825 -0.562379
27.266667 4.042981 3.052278 -0.018489 -0.010612 -0.043004 -0.485725
27.300000 4.045089 3.052681 -0.039029 0.014078 -0.023152 -0.379137
27.333333 4.048262 3.053917 -0.039879 0.033670 -0.006854 -0.247059
27.366667 4.051867 3.055647 -0.016668 0.048004 0.005640 -0.102407
27.400000 4.055483 3.057484 0.029727 0.057170 0.014350 0.032473
27.433333 4.059107 3.059424 0.048938 0.061672 0.019594 0.146149
27.466667 4.061518 3.060373 0.054092 0.062434 0.021988 0.231203
27.500000 4.063932 3.061416 0.050662 0.060475 0.022271 0.283410
