t x y theta dxdt dydt dthetadt
0.000000 0.000000 0.000000 0.380979 -0.150222 0.025165 -0.003388
0.033333 -0.005041 0.000832 0.374310 -0.153124 0.025503 -0.001937
0.066667 -0.010193 0.001637 0.375308 -0.156042 0.025867 -0.001620
0.100000 -0.015454 0.002487 0.381194 -0.158958 0.026260 -0.004130
0.133333 -0.020829 0.003307 0.370239 -0.161852 0.026684 -0.006842
0.166667 -0.026442 0.004037 0.383210 -0.164713 0.027127 -0.011235
0.200000 -0.031955 0.005026 0.385162 -0.167553 0.027550 -0.017099
0.233333 -0.037587 0.005980 0.384282 -0.170418 0.027888 -0.024804
0.266667 -0.043337 0.006897 0.378958 -0.173338 0.028098 -0.032293
0.300000 -0.049059 0.008005 0.370892 -0.176354 0.028130 -0.036598
0.333333 -0.054903 0.009073 0.370471 -0.179505 0.027934 -0.041219
0.366667 -0.060871 0.010097 0.371346 -0.182836 0.027482 -0.043471
0.400000 -0.066965 0.011075 0.365400 -0.186351 0.026793 -0.042335
0.433333 -0.073185 0.012005 0.363907 -0.190037 0.025889 -0.037117
0.466667 -0.079533 0.012885 0.373121 -0.193882 0.024797 -0.030473
0.500000 -0.086012 0.013711 0.366042 -0.197846 0.023571 -0.024964
0.533333 -0.092622 0.014483 0.362752 -0.201893 0.022269 -0.018741
0.566667 -0.099478 0.015172 0.354913 -0.205973 0.020938 -0.012278
0.600000 -0.106469 0.015800 0.359384 -0.210056 0.019598 -0.008169
0.633333 -0.113595 0.016367 0.369564 -0.214120 0.018278 -0.005914
0.666667 -0.120858 0.016870 0.370648 -0.218153 0.017008 -0.003826
0.700000 -0.128164 0.017503 0.361870 -0.222160 0.015781 -0.001944
0.733333 -0.135610 0.018068 0.371749 -0.226149 0.014590 -0.001590
0.766667 -0.143196 0.018562 0.357118 -0.230152 0.013415 -0.001077
0.800000 -0.150923 0.018981 0.360983 -0.234197 0.012251 -0.000367
0.833333 -0.158793 0.019323 0.367071 -0.238308 0.011084 0.001980
0.866667 -0.166808 0.019587 0.368779 -0.242494 0.009900 0.005729
0.900000 -0.174897 0.019950 0.356010 -0.246722 0.008746 0.011859
0.933333 -0.183132 0.020229 0.366250 -0.250957 0.007666 0.020913
0.966667 -0.191506 0.020533 0.363098 -0.255113 0.006745 0.028162
1.000000 -0.200121 0.020753 0.363954 -0.259101 0.006047 0.035254
1.033333 -0.208886 0.020880 0.362774 -0.262820 0.005656 0.041289
1.066667 -0.217802 0.020913 0.365293 -0.266120 0.005715 0.045997
1.100000 -0.226917 0.020901 0.370685 -0.268915 0.006294 0.046793
1.133333 -0.236100 0.020972 0.370742 -0.271125 0.007444 0.044714
1.166667 -0.245397 0.021068 0.380571 -0.272738 0.009152 0.040927
1.200000 -0.254849 0.021058 0.384347 -0.273762 0.011397 0.034158
1.233333 -0.264058 0.021440 0.385367 -0.274284 0.014062 0.023301
1.266667 -0.273424 0.021711 0.382395 -0.274492 0.016910 0.008101
1.300000 -0.282564 0.022344 0.367475 -0.274588 0.019702 -0.007790
1.333333 -0.291817 0.022982 0.374732 -0.274763 0.022215 -0.024850
1.366667 -0.300937 0.023885 0.383544 -0.275155 0.024291 -0.041198
1.400000 -0.309611 0.025376 0.387212 -0.275937 0.025725 -0.056375
1.433333 -0.318451 0.026735 0.381550 -0.277167 0.026444 -0.070291
1.466667 -0.327460 0.027956 0.374974 -0.278856 0.026439 -0.082485
1.500000 -0.336641 0.029036 0.355271 -0.280942 0.025773 -0.093430
1.533333 -0.345995 0.029968 0.360355 -0.283365 0.024517 -0.103747
1.566667 -0.355526 0.030748 0.364354 -0.286097 0.022714 -0.112307
1.600000 -0.365234 0.031372 0.358557 -0.289019 0.020517 -0.119089
1.633333 -0.375123 0.031834 0.351539 -0.292088 0.017987 -0.123974
1.666667 -0.385195 0.032131 0.353039 -0.295285 0.015142 -0.127056
1.700000 -0.394980 0.032757 0.337100 -0.298662 0.011916 -0.129883
1.733333 -0.404876 0.033262 0.342510 -0.302280 0.008233 -0.131520
1.766667 -0.414724 0.033780 0.333881 -0.306220 0.003970 -0.132655
1.800000 -0.424765 0.034113 0.326048 -0.310604 -0.001049 -0.133320
1.833333 -0.435001 0.034257 0.327513 -0.315532 -0.006945 -0.131620
1.866667 -0.445435 0.034206 0.320274 -0.321045 -0.013775 -0.128153
1.900000 -0.456068 0.033957 0.317863 -0.327126 -0.021563 -0.125512
1.933333 -0.466904 0.033504 0.314465 -0.333744 -0.030324 -0.123500
1.966667 -0.477964 0.032620 0.299977 -0.340801 -0.039946 -0.122151
2.000000 -0.489527 0.030994 0.300667 -0.348245 -0.050388 -0.121860
2.033333 -0.501299 0.029153 0.300579 -0.356097 -0.061746 -0.125216
2.066667 -0.513281 0.027095 0.298324 -0.364509 -0.074255 -0.130799
2.100000 -0.525619 0.024369 0.293375 -0.373725 -0.088210 -0.134378
2.133333 -0.538170 0.021421 0.288189 -0.384166 -0.104146 -0.135681
2.166667 -0.550936 0.018248 0.300454 -0.396494 -0.122967 -0.138486
2.200000 -0.563819 0.014581 0.285651 -0.411287 -0.145417 -0.140918
2.233333 -0.577158 0.010032 0.262681 -0.429326 -0.172403 -0.139085
2.266667 -0.590713 0.005255 0.258617 -0.451668 -0.205148 -0.134041
2.300000 -0.604486 0.000248 0.257497 -0.479815 -0.245421 -0.131596
2.333333 -0.619309 -0.006353 0.256343 -0.514581 -0.294085 -0.139866
2.366667 -0.635235 -0.014642 0.254259 -0.556279 -0.351287 -0.153950
2.400000 -0.652423 -0.024822 0.254733 -0.605154 -0.417138 -0.177038
2.433333 -0.671138 -0.037237 0.243566 -0.660708 -0.490865 -0.213008
2.466667 -0.692079 -0.052676 0.248010 -0.721429 -0.570444 -0.262091
2.500000 -0.715726 -0.071722 0.237965 -0.784022 -0.651648 -0.313597
2.533333 -0.739565 -0.090953 0.239327 -0.845798 -0.730994 -0.358524
2.566667 -0.768047 -0.115989 0.248296 -0.903188 -0.803990 -0.395477
2.600000 -0.802237 -0.148061 0.244583 -0.952257 -0.865679 -0.422382
2.633333 -0.844108 -0.189379 0.181879 -0.988968 -0.910989 -0.434064
2.666667 -0.882741 -0.226994 0.103257 -1.010371 -0.936223 -0.423137
2.700000 -0.921469 -0.264658 0.101983 -1.015400 -0.940073 -0.396461
2.733333 -0.960270 -0.302338 0.098360 -1.003163 -0.921463 -0.350932
2.766667 -0.999118 -0.339998 0.106541 -0.975181 -0.882251 -0.296279
2.800000 -1.037990 -0.377603 0.106167 -0.934010 -0.825636 -0.231156
2.833333 -1.071930 -0.408885 0.107467 -0.883942 -0.756960 -0.164869
2.866667 -1.102701 -0.435826 0.052291 -0.828814 -0.681067 -0.105981
2.900000 -1.123091 -0.449859 0.101906 -0.772707 -0.603069 -0.057973
2.933333 -1.142350 -0.461873 0.098741 -0.719573 -0.528010 -0.028704
2.966667 -1.160870 -0.472329 0.104893 -0.671858 -0.459181 -0.005364
3.000000 -1.179344 -0.482621 0.104914 -0.631451 -0.399137 0.008316
3.033333 -1.197768 -0.492745 0.105586 -0.598625 -0.348467 0.016827
3.066667 -1.215915 -0.501933 0.103609 -0.573416 -0.307424 0.017065
3.100000 -1.234035 -0.510491 0.075534 -0.554167 -0.274190 0.016358
3.133333 -1.252098 -0.518868 0.096497 -0.539015 -0.246558 0.021269
3.166667 -1.270713 -0.527302 0.104485 -0.526611 -0.222888 0.021794
3.200000 -1.289265 -0.535548 0.108662 -0.515603 -0.201529 0.019262
3.233333 -1.307751 -0.543603 0.109050 -0.505100 -0.181372 0.014845
3.266667 -1.326168 -0.551465 0.071401 -0.494459 -0.161542 0.016055
3.300000 -1.340694 -0.554208 0.118125 -0.484162 -0.142525 0.016532
3.333333 -1.355149 -0.556756 0.115490 -0.474814 -0.124983 0.013459
3.366667 -1.369534 -0.559114 0.114594 -0.466764 -0.109254 0.010888
3.400000 -1.383852 -0.561283 0.115405 -0.460355 -0.095657 0.010543
3.433333 -1.398581 -0.563584 0.074884 -0.455889 -0.084485 0.015189
3.466667 -1.413245 -0.565703 0.103972 -0.453640 -0.076065 0.015897
3.500000 -1.428417 -0.568090 0.109334 -0.453193 -0.069898 0.020146
3.533333 -1.443524 -0.570301 0.102800 -0.454067 -0.065428 0.026087
3.566667 -1.458567 -0.572339 0.107432 -0.455773 -0.062113 0.032763
3.600000 -1.473815 -0.574371 0.106142 -0.457812 -0.059421 0.038997
3.633333 -1.489255 -0.576397 0.100886 -0.459746 -0.056857 0.038809
3.666667 -1.505007 -0.578554 0.115186 -0.461121 -0.053910 0.040191
3.700000 -1.520694 -0.580549 0.117082 -0.461906 -0.050561 0.038625
3.733333 -1.536261 -0.582247 0.119818 -0.462112 -0.046843 0.034768
3.766667 -1.551764 -0.583789 0.122526 -0.461753 -0.042790 0.028874
3.800000 -1.567203 -0.585178 0.114404 -0.460886 -0.038460 0.022098
3.833333 -1.582622 -0.586417 0.117994 -0.459555 -0.033907 0.013091
3.866667 -1.597931 -0.587423 0.115032 -0.457885 -0.029256 0.003982
3.900000 -1.613176 -0.588285 0.116365 -0.455970 -0.024604 -0.004637
3.933333 -1.628375 -0.589008 0.115533 -0.453892 -0.020026 -0.012636
3.966667 -1.643546 -0.589617 0.120719 -0.451748 -0.015615 -0.019443
4.000000 -1.658567 -0.590003 0.120150 -0.449617 -0.011449 -0.026398
4.033333 -1.673456 -0.590194 0.116269 -0.447586 -0.007610 -0.026614
4.066667 -1.688281 -0.590261 0.117091 -0.445696 -0.004133 -0.026394
4.100000 -1.703037 -0.590221 0.113465 -0.443981 -0.001045 -0.025717
4.133333 -1.717812 -0.590177 0.118183 -0.442469 0.001636 -0.024150
4.166667 -1.732454 -0.589973 0.083250 -0.441174 0.003918 -0.019211
4.200000 -1.747034 -0.589662 0.113305 -0.440081 0.005840 -0.013611
4.233333 -1.761552 -0.589246 0.111956 -0.439161 0.007443 -0.011648
4.266667 -1.776049 -0.588808 0.105277 -0.438388 0.008767 -0.008361
4.300000 -1.790686 -0.588521 0.107989 -0.437714 0.009871 -0.004846
4.333333 -1.805388 -0.588311 0.116524 -0.437110 0.010785 -0.001261
4.366667 -1.820029 -0.588013 0.107821 -0.436543 0.011534 -0.001237
4.400000 -1.834609 -0.587631 0.113913 -0.435998 0.012125 -0.000339
4.433333 -1.849128 -0.587170 0.110932 -0.435445 0.012586 0.004777
4.466667 -1.863586 -0.586632 0.111078 -0.434868 0.012922 0.009018
4.500000 -1.878063 -0.586149 0.107324 -0.434276 0.013115 0.014531
4.533333 -1.892478 -0.585597 0.110209 -0.433651 0.013173 0.020897
4.566667 -1.906953 -0.585155 0.086151 -0.432969 0.013119 0.029335
4.600000 -1.921366 -0.584651 0.116539 -0.432211 0.012965 0.036855
4.633333 -1.935682 -0.584099 0.110075 -0.431368 0.012711 0.042546
4.666667 -1.950097 -0.583712 0.113401 -0.430405 0.012402 0.048652
4.700000 -1.964550 -0.583430 0.125967 -0.429267 0.012106 0.051287
4.733333 -1.978940 -0.583101 0.121841 -0.427928 0.011861 0.052043
4.766667 -1.993269 -0.582727 0.118377 -0.426381 0.011685 0.048955
4.800000 -2.007605 -0.582443 0.126285 -0.424602 0.011628 0.045383
4.833333 -2.021776 -0.582071 0.129303 -0.422568 0.011730 0.039281
4.866667 -2.035733 -0.581562 0.121290 -0.420298 0.011976 0.030427
4.900000 -2.049704 -0.581165 0.123232 -0.417847 0.012313 0.023304
4.933333 -2.063660 -0.580851 0.124483 -0.415261 0.012713 0.016778
4.966667 -2.077552 -0.580509 0.128818 -0.412578 0.013147 0.010952
5.000000 -2.091378 -0.580142 0.137532 -0.409870 0.013534 0.004329
5.033333 -2.104873 -0.579541 0.126195 -0.407225 0.013779 -0.000760
5.066667 -2.118341 -0.579027 0.124579 -0.404698 0.013834 -0.003870
5.100000 -2.131744 -0.578495 0.128249 -0.402327 0.013655 -0.007024
5.133333 -2.145080 -0.577950 0.128447 -0.400145 0.013204 -0.010452
5.166667 -2.158315 -0.577418 0.128982 -0.398184 0.012441 -0.011730
5.200000 -2.171434 -0.576892 0.121328 -0.396449 0.011382 -0.010793
5.233333 -2.184485 -0.576359 0.122473 -0.394894 0.010096 -0.010244
5.266667 -2.197574 -0.575995 0.126045 -0.393480 0.008636 -0.010241
5.300000 -2.210595 -0.575629 0.119872 -0.392192 0.007026 -0.009805
5.333333 -2.223723 -0.575515 0.124355 -0.391007 0.005308 -0.008962
5.366667 -2.236838 -0.575528 0.125224 -0.389891 0.003529 -0.008897
5.400000 -2.249884 -0.575544 0.124265 -0.388858 0.001660 -0.010023
5.433333 -2.262859 -0.575565 0.125972 -0.388003 -0.000422 -0.011461
5.466667 -2.275762 -0.575593 0.125552 -0.387435 -0.002860 -0.012840
5.500000 -2.288594 -0.575627 0.127008 -0.387200 -0.005714 -0.016052
5.533333 -2.301352 -0.575671 0.119408 -0.387368 -0.009085 -0.019648
5.566667 -2.314035 -0.575724 0.116184 -0.388026 -0.013092 -0.022790
5.600000 -2.326644 -0.575789 0.118831 -0.389177 -0.017748 -0.025487
5.633333 -2.339567 -0.576366 0.121271 -0.390831 -0.023059 -0.028971
5.666667 -2.352412 -0.576956 0.121893 -0.392989 -0.029017 -0.035502
5.700000 -2.365178 -0.577559 0.120887 -0.395161 -0.035033 -0.039243
5.733333 -2.378368 -0.578807 0.119306 -0.396975 -0.040646 -0.041593
5.766667 -2.392132 -0.580867 0.110624 -0.398005 -0.045320 -0.043295
5.800000 -2.405811 -0.582939 0.112139 -0.397864 -0.048572 -0.043988
5.833333 -2.419401 -0.585021 0.110089 -0.395989 -0.049729 -0.039712
5.866667 -2.432900 -0.587112 0.112777 -0.391979 -0.048304 -0.029754
5.900000 -2.446305 -0.589211 0.114921 -0.386219 -0.044747 -0.021242
5.933333 -2.459612 -0.591315 0.116177 -0.378991 -0.039396 -0.014899
5.966667 -2.474603 -0.595471 0.087419 -0.370706 -0.032750 -0.007447
6.000000 -2.489489 -0.599627 0.065719 -0.361778 -0.025309 0.002053
6.033333 -2.497977 -0.596295 0.119130 -0.353262 -0.018327 0.003354
6.066667 -2.508497 -0.595417 0.125205 -0.345716 -0.012487 0.002026
6.100000 -2.518908 -0.594541 0.120200 -0.339474 -0.008199 0.002281
6.133333 -2.529210 -0.593665 0.123904 -0.334850 -0.005857 -0.001033
6.166667 -2.539400 -0.592793 0.117361 -0.332061 -0.005731 -0.009245
6.200000 -2.551379 -0.594120 0.082025 -0.331160 -0.007905 -0.021634
6.233333 -2.560107 -0.591705 0.110981 -0.331654 -0.011801 -0.027166
6.266667 -2.570692 -0.591566 0.108565 -0.333240 -0.017048 -0.032826
6.300000 -2.583209 -0.593789 0.121155 -0.335210 -0.022793 -0.041846
6.333333 -2.595607 -0.596014 0.116471 -0.336960 -0.028291 -0.040991
6.366667 -2.607880 -0.598239 0.069145 -0.338202 -0.033159 -0.033735
6.400000 -2.620026 -0.600459 0.088322 -0.339305 -0.037762 -0.031354
6.433333 -2.629349 -0.599436 0.133068 -0.340385 -0.042189 -0.034847
6.466667 -2.640666 -0.600895 0.059957 -0.341587 -0.046554 -0.031272
6.500000 -2.651846 -0.602344 0.116484 -0.344016 -0.052116 -0.027788
6.533333 -2.662886 -0.603781 0.121631 -0.348363 -0.059668 -0.030979
6.566667 -2.676639 -0.608482 0.086027 -0.354491 -0.069062 -0.040559
6.600000 -2.688383 -0.610846 0.064029 -0.361580 -0.079392 -0.041159
6.633333 -2.694895 -0.607057 0.110496 -0.368800 -0.089706 -0.030730
6.666667 -2.704798 -0.607268 0.114692 -0.375384 -0.099154 -0.023795
6.700000 -2.718071 -0.611461 0.110470 -0.379678 -0.105831 0.002747
6.733333 -2.735246 -0.620219 0.058279 -0.380232 -0.108085 0.054506
6.766667 -2.752245 -0.628936 0.062657 -0.376532 -0.105352 0.133263
6.800000 -2.765972 -0.633668 0.092581 -0.368446 -0.097539 0.233679
6.833333 -2.779504 -0.638341 0.081208 -0.356226 -0.085079 0.353915
6.866667 -2.792832 -0.642948 0.101921 -0.340664 -0.069087 0.494049
6.900000 -2.805949 -0.647481 0.092878 -0.323135 -0.051410 0.632140
6.933333 -2.818845 -0.651934 0.072101 -0.305199 -0.034063 0.758818
6.966667 -2.825725 -0.649081 0.126989 -0.288340 -0.018981 0.867228
7.000000 -2.830095 -0.643151 0.182532 -0.273631 -0.007595 0.950877
7.033333 -2.834215 -0.636935 0.285864 -0.262023 -0.001115 0.996012
7.066667 -2.841070 -0.634213 0.323249 -0.253723 0.000221 0.993808
7.100000 -2.849613 -0.633878 0.359002 -0.248289 -0.002971 0.956527
7.133333 -2.859066 -0.635120 0.398682 -0.245118 -0.009924 0.879368
7.166667 -2.868644 -0.637125 0.422453 -0.242808 -0.018887 0.769992
7.200000 -2.878026 -0.639563 0.443737 -0.240025 -0.028051 0.638554
7.233333 -2.886973 -0.642199 0.454437 -0.235479 -0.035616 0.504686
7.266667 -2.895659 -0.644726 0.484788 -0.228402 -0.040499 0.392462
7.300000 -2.904075 -0.647137 0.493617 -0.218795 -0.042601 0.288446
7.333333 -2.911618 -0.649316 0.489526 -0.206898 -0.042066 0.205056
7.366667 -2.918880 -0.651365 0.489696 -0.193418 -0.039608 0.143933
7.400000 -2.925856 -0.653276 0.370971 -0.179213 -0.036268 0.096241
7.433333 -2.929915 -0.652178 0.485809 -0.165330 -0.033397 0.059863
7.466667 -2.934018 -0.651843 0.480537 -0.152580 -0.031966 0.027464
7.500000 -2.938313 -0.652423 0.472775 -0.141317 -0.032280 0.000871
7.533333 -2.942306 -0.652841 0.486868 -0.131450 -0.034176 -0.015890
7.566667 -2.945993 -0.653091 0.491696 -0.122974 -0.037639 -0.025509
7.600000 -2.949684 -0.654057 0.498154 -0.115909 -0.042654 -0.019451
7.633333 -2.953277 -0.655641 0.484159 -0.109928 -0.048795 -0.006397
7.666667 -2.957237 -0.658331 0.488063 -0.104624 -0.055590 0.008337
7.700000 -2.960874 -0.660820 0.490920 -0.099684 -0.062815 0.040038
7.733333 -2.964184 -0.663096 0.311407 -0.095351 -0.070895 0.075334
7.766667 -2.967160 -0.665149 0.492262 -0.091672 -0.079951 0.109818
7.800000 -2.970880 -0.668733 0.507300 -0.088530 -0.089860 0.138837
7.833333 -2.974256 -0.672071 0.396721 -0.085879 -0.100562 0.171153
7.866667 -2.975355 -0.673122 0.520068 -0.084157 -0.112564 0.197034
7.900000 -2.976987 -0.675506 0.529539 -0.084081 -0.126642 0.206218
7.933333 -2.979001 -0.679059 0.524007 -0.085894 -0.142888 0.182873
7.966667 -2.981763 -0.684182 0.543758 -0.090161 -0.161705 0.103477
8.000000 -2.985041 -0.690641 0.548385 -0.097085 -0.182989 -0.030510
8.033333 -2.987939 -0.696773 0.551880 -0.106526 -0.206108 -0.233788
8.066667 -2.991945 -0.704906 0.422396 -0.117320 -0.229155 -0.473147
8.100000 -2.994994 -0.712225 0.556997 -0.127360 -0.248995 -0.756872
8.133333 -2.997640 -0.719162 0.552979 -0.134448 -0.262399 -1.046654
8.166667 -2.999873 -0.725697 0.549027 -0.136027 -0.265898 -1.283573
8.200000 -3.005246 -0.736448 0.536734 -0.130313 -0.257193 -1.444007
8.233333 -3.014920 -0.752672 0.527154 -0.115962 -0.234721 -1.540920
8.266667 -3.024145 -0.768421 0.322421 -0.092344 -0.197885 -1.589126
8.300000 -3.035890 -0.786773 -0.037210 -0.058948 -0.146409 -1.506104
8.333333 -3.041121 -0.796091 -0.041215 -0.016584 -0.081862 -1.310214
8.366667 -3.040895 -0.797518 -0.034589 0.033243 -0.006625 -1.041422
8.400000 -3.040164 -0.798365 -0.037564 0.089007 0.076987 -0.739142
8.433333 -3.034753 -0.792131 -0.041136 0.148451 0.165730 -0.341648
8.466667 -3.024729 -0.778844 -0.033857 0.209097 0.256013 0.126062
8.500000 -3.014189 -0.764952 -0.043285 0.266977 0.342442 0.481119
8.533333 -3.003136 -0.750454 0.229670 0.319847 0.421915 0.701928
8.566667 -2.991568 -0.735348 -0.035843 0.366524 0.492719 0.828573
8.600000 -2.979489 -0.719635 -0.029684 0.406129 0.553533 0.866618
8.633333 -2.960134 -0.693737 0.343656 0.438312 0.603826 0.726002
8.666667 -2.942549 -0.669257 0.341110 0.463607 0.644322 0.425299
8.700000 -2.925833 -0.645138 0.236582 0.483814 0.677271 0.132685
8.733333 -2.908626 -0.620438 0.339753 0.500046 0.704058 -0.115733
8.766667 -2.890933 -0.595165 0.561924 0.512894 0.725384 -0.391756
8.800000 -2.872761 -0.569327 0.564476 0.522954 0.741956 -0.685726
8.833333 -2.856125 -0.545225 -0.035262 0.531769 0.755733 -0.866629
8.866667 -2.839017 -0.520572 -0.029809 0.540168 0.767805 -0.935738
8.900000 -2.821440 -0.495375 -0.031168 0.548581 0.778913 -0.959554
8.933333 -2.803399 -0.469641 -0.031168 0.557441 0.789801 -0.943172
8.966667 -2.784896 -0.443375 -0.031168 0.567179 0.801213 -0.827552
9.000000 -2.765935 -0.416585 -0.031168 0.578226 0.813891 -0.612781
9.033333 -2.746520 -0.389277 -0.031168 0.590111 0.827397 -0.429928
9.066667 -2.726654 -0.361457 -0.031168 0.602554 0.841459 -0.277872
9.100000 -2.706342 -0.333134 -0.031168 0.615387 0.855886 -0.049305
9.133333 -2.685587 -0.304313 -0.031168 0.628257 0.870202 0.248886
9.166667 -2.664392 -0.275003 -0.031168 0.640725 0.883767 0.597566
9.200000 -2.642763 -0.245210 -0.031168 0.652291 0.895808 0.996520
9.233333 -2.620702 -0.214941 -0.031168 0.662623 0.905745 1.498385
9.266667 -2.598214 -0.184204 -0.031168 0.667936 0.908585 2.093382
9.300000 -2.575303 -0.153006 -0.031168 0.666160 0.901614 2.583977
9.333333 -2.551973 -0.121356 -0.031168 0.655563 0.882650 2.966748
9.366667 -2.528227 -0.089259 -0.031168 0.634558 0.849821 3.242941
9.400000 -2.504070 -0.056725 -0.031168 0.601654 0.801489 3.412554
9.433333 -2.479506 -0.023759 1.154711 0.557193 0.738484 3.470273
9.466667 -2.456743 0.006262 1.175246 0.508424 0.670472 3.434747
9.500000 -2.434618 0.034684 1.167777 0.459173 0.602565 3.404800
9.533333 -2.412838 0.061948 1.167777 0.413143 0.539659 3.382141
9.566667 -2.390657 0.089628 1.199667 0.374008 0.486544 3.366150
