t x y theta dxdt dydt dthetadt
0.000000 0.000000 0.000000 0.849491 -0.011641 -0.021925 -0.776870
0.033333 -0.000525 -0.000673 0.849778 -0.012488 -0.026764 -1.054084
0.066667 -0.001035 -0.001439 0.852946 -0.011946 -0.032610 -1.337370
0.100000 -0.001954 -0.002397 0.835684 -0.009066 -0.039822 -1.605674
0.133333 -0.002854 -0.003450 0.764157 -0.002889 -0.048772 -1.827094
0.166667 -0.003643 -0.005091 0.670429 0.007433 -0.059735 -1.973395
0.200000 -0.004408 -0.006830 0.509860 0.022862 -0.073091 -2.034271
0.233333 -0.005149 -0.008665 0.398073 0.043993 -0.089126 -2.007449
0.266667 -0.005862 -0.010598 0.251847 0.070989 -0.107954 -1.897141
0.300000 -0.004758 -0.013791 0.122725 0.103201 -0.129332 -1.710202
0.333333 -0.003625 -0.017080 0.102330 0.139968 -0.153053 -1.474755
0.366667 0.000138 -0.021853 0.084870 0.180108 -0.178717 -1.221669
0.400000 0.006830 -0.028166 0.092720 0.221887 -0.205583 -0.982179
0.433333 0.016520 -0.036039 0.109808 0.263168 -0.232646 -0.777214
0.466667 0.026219 -0.043997 0.120354 0.301940 -0.258886 -0.626362
0.500000 0.038701 -0.053571 0.133732 0.336724 -0.283516 -0.544334
0.533333 0.053101 -0.064491 0.131510 0.365891 -0.305570 -0.521237
0.566667 0.068762 -0.076427 0.114704 0.387900 -0.323937 -0.541983
0.600000 0.085073 -0.089231 0.079378 0.401809 -0.337787 -0.582674
0.633333 0.100266 -0.101745 0.045469 0.407391 -0.346518 -0.626044
0.666667 0.115322 -0.114756 0.002772 0.404496 -0.349562 -0.656476
0.700000 0.130285 -0.127790 -0.045771 0.393207 -0.346490 -0.658544
0.733333 0.145140 -0.140835 -0.079962 0.373845 -0.337031 -0.629397
0.766667 0.157702 -0.152746 -0.106325 0.347805 -0.321796 -0.569997
0.800000 0.170128 -0.164648 -0.113711 0.316359 -0.301414 -0.489746
0.833333 0.182405 -0.176531 -0.120800 0.280830 -0.276870 -0.396075
0.866667 0.194520 -0.188385 -0.130978 0.242497 -0.249229 -0.297736
0.900000 0.200832 -0.195568 -0.135990 0.202867 -0.219816 -0.204639
0.933333 0.206964 -0.202707 -0.126974 0.163450 -0.190050 -0.123958
0.966667 0.208812 -0.205972 -0.135580 0.125262 -0.161109 -0.059847
1.000000 0.210472 -0.209186 -0.137628 0.089259 -0.134103 -0.010376
1.033333 0.211942 -0.212351 -0.137211 0.056214 -0.109883 0.026527
1.066667 0.212160 -0.214316 -0.130799 0.027055 -0.089397 0.055511
1.100000 0.211547 -0.215770 -0.114052 0.001851 -0.072855 0.080489
1.133333 0.210742 -0.217175 -0.103504 -0.019462 -0.060370 0.104607
1.166667 0.209301 -0.218331 -0.105734 -0.037464 -0.051448 0.129498
1.200000 0.207272 -0.219425 -0.121697 -0.052793 -0.045610 0.159023
1.233333 0.204877 -0.220468 -0.127243 -0.066279 -0.042342 0.195948
1.266667 0.202146 -0.221537 -0.115152 -0.079183 -0.040799 0.238939
1.300000 0.199175 -0.222781 -0.099182 -0.092416 -0.040427 0.288565
1.333333 0.196021 -0.223988 -0.086535 -0.106768 -0.040651 0.342337
1.366667 0.192688 -0.225158 -0.076842 -0.122766 -0.041200 0.395708
1.400000 0.189152 -0.226768 -0.066866 -0.140815 -0.041722 0.434246
1.433333 0.185443 -0.228345 -0.053200 -0.161427 -0.041813 0.445749
1.466667 0.180766 -0.230027 -0.039340 -0.184504 -0.041295 0.424359
1.500000 0.175922 -0.231677 -0.015922 -0.210179 -0.040007 0.363292
1.533333 0.169829 -0.233521 0.025882 -0.238557 -0.037779 0.256819
1.566667 0.161598 -0.235112 0.067228 -0.269539 -0.034477 0.104594
1.600000 0.150354 -0.236109 0.076213 -0.302791 -0.030177 -0.079137
1.633333 0.138971 -0.237078 0.093416 -0.337319 -0.025117 -0.280666
1.666667 0.127459 -0.238021 0.079713 -0.372257 -0.019645 -0.482660
1.700000 0.115828 -0.238940 0.061570 -0.405903 -0.014370 -0.666449
1.733333 0.104091 -0.239837 -0.000798 -0.436735 -0.009934 -0.803220
1.766667 0.087390 -0.239642 -0.049047 -0.462803 -0.007183 -0.873122
1.800000 0.070610 -0.239428 -0.115259 -0.482743 -0.006703 -0.868627
1.833333 0.050447 -0.238447 -0.167689 -0.495039 -0.009120 -0.789192
1.866667 0.030240 -0.237452 -0.250674 -0.498564 -0.014763 -0.643655
1.900000 0.010012 -0.236447 -0.294783 -0.492766 -0.023616 -0.447656
1.933333 -0.009577 -0.236174 -0.317289 -0.477066 -0.035579 -0.232616
1.966667 -0.029150 -0.235897 -0.306341 -0.452254 -0.050093 -0.022997
2.000000 -0.045996 -0.237323 -0.269060 -0.419062 -0.066560 0.157196
2.033333 -0.059409 -0.240533 -0.216103 -0.379313 -0.084060 0.295405
2.066667 -0.072757 -0.243744 -0.155945 -0.334612 -0.101810 0.378284
2.100000 -0.081751 -0.248744 -0.109054 -0.286958 -0.119100 0.403472
2.133333 -0.090659 -0.253742 -0.075558 -0.238033 -0.135448 0.381029
2.166667 -0.096011 -0.259557 -0.072082 -0.188905 -0.150609 0.322025
2.200000 -0.101265 -0.265364 -0.079081 -0.139978 -0.164751 0.246641
2.233333 -0.103113 -0.271380 -0.092803 -0.091462 -0.178278 0.166108
2.266667 -0.104858 -0.277383 -0.122548 -0.043569 -0.191597 0.099366
2.300000 -0.106502 -0.283369 -0.129397 0.004003 -0.205213 0.055849
2.333333 -0.108043 -0.289333 -0.149260 0.051114 -0.219384 0.039229
2.366667 -0.105517 -0.296318 -0.128955 0.097565 -0.234266 0.045682
2.400000 -0.102892 -0.303275 -0.127937 0.142375 -0.249533 0.065808
2.433333 -0.097318 -0.311491 -0.119706 0.184659 -0.264549 0.093624
2.466667 -0.089133 -0.320952 -0.102511 0.223324 -0.278569 0.116243
2.500000 -0.079132 -0.331155 -0.096910 0.257017 -0.290742 0.127636
2.533333 -0.066497 -0.342842 -0.075746 0.284322 -0.300145 0.121373
2.566667 -0.053814 -0.354468 -0.075901 0.304386 -0.306068 0.101063
2.600000 -0.041097 -0.366024 -0.072637 0.316257 -0.307680 0.068670
2.633333 -0.028361 -0.377499 -0.073970 0.319290 -0.304382 0.026440
2.666667 -0.015236 -0.389209 -0.075150 0.313237 -0.295766 -0.016552
2.700000 -0.002340 -0.400575 -0.078692 0.297850 -0.281355 -0.056243
2.733333 0.009008 -0.410846 -0.076971 0.273480 -0.261041 -0.086901
2.766667 0.017075 -0.418860 -0.080787 0.240136 -0.234614 -0.108587
2.800000 0.025093 -0.426750 -0.093052 0.198850 -0.202626 -0.121154
2.833333 0.033052 -0.434511 -0.110115 0.150741 -0.165795 -0.124524
2.866667 0.040942 -0.442138 -0.112448 0.096786 -0.124792 -0.124516
2.900000 0.048755 -0.449625 -0.119107 0.038424 -0.080641 -0.123745
2.933333 0.049631 -0.451953 -0.119034 -0.022801 -0.034497 -0.126642
2.966667 0.045068 -0.450226 -0.131091 -0.085215 0.012382 -0.135955
3.000000 0.040422 -0.448356 -0.115271 -0.147717 0.059154 -0.153633
3.033333 0.031885 -0.443608 -0.120926 -0.208716 0.104667 -0.179668
3.066667 0.023278 -0.438726 -0.116095 -0.266655 0.147798 -0.212465
3.100000 0.011343 -0.431571 -0.109794 -0.320010 0.187453 -0.251310
3.133333 -0.000644 -0.424300 -0.127383 -0.368366 0.223354 -0.291520
3.166667 -0.016367 -0.414479 -0.152909 -0.411222 0.255179 -0.328239
3.200000 -0.032114 -0.404564 -0.161627 -0.448045 0.282561 -0.355323
3.233333 -0.047868 -0.394567 -0.181199 -0.478990 0.305586 -0.369254
3.266667 -0.063614 -0.384500 -0.204597 -0.504219 0.324350 -0.362547
3.300000 -0.083244 -0.371677 -0.222890 -0.524118 0.339083 -0.327310
3.333333 -0.102829 -0.358812 -0.237910 -0.538326 0.349490 -0.260642
3.366667 -0.122349 -0.345920 -0.249683 -0.546698 0.355411 -0.162286
3.400000 -0.141783 -0.333019 -0.255476 -0.548928 0.356605 -0.034498
3.433333 -0.161112 -0.320122 -0.264320 -0.544788 0.352893 0.116865
3.466667 -0.181409 -0.306576 -0.275774 -0.533928 0.343971 0.275909
3.500000 -0.201271 -0.293566 -0.265595 -0.516416 0.329818 0.424034
3.533333 -0.220475 -0.281259 -0.256962 -0.492528 0.310520 0.544117
3.566667 -0.236384 -0.271490 -0.238079 -0.463140 0.286653 0.619840
3.600000 -0.252089 -0.261803 -0.186520 -0.429586 0.259115 0.640443
3.633333 -0.267574 -0.252209 -0.127497 -0.393117 0.228811 0.602174
3.666667 -0.282821 -0.242722 -0.071962 -0.355150 0.196865 0.515000
3.700000 -0.293813 -0.236483 -0.002991 -0.317047 0.164430 0.392550
3.733333 -0.301549 -0.232671 0.029678 -0.280116 0.132729 0.253444
3.766667 -0.307464 -0.230535 0.033565 -0.244889 0.102431 0.115945
3.800000 -0.312656 -0.229400 -0.008062 -0.211691 0.074111 -0.002403
3.833333 -0.317657 -0.228865 -0.051311 -0.180826 0.048323 -0.087090
3.866667 -0.323182 -0.228534 -0.113175 -0.152518 0.025551 -0.133507
3.900000 -0.328408 -0.228352 -0.164330 -0.126355 0.005757 -0.139305
3.933333 -0.333267 -0.228472 -0.182323 -0.101576 -0.011454 -0.112130
3.966667 -0.336787 -0.229299 -0.181302 -0.077448 -0.026560 -0.057669
4.000000 -0.338860 -0.230777 -0.141481 -0.053039 -0.040283 0.009194
4.033333 -0.340612 -0.232414 -0.093124 -0.027459 -0.053431 0.072679
4.066667 -0.341051 -0.234508 -0.048569 -0.000076 -0.066780 0.118710
4.100000 -0.340489 -0.236850 -0.046338 0.029349 -0.080841 0.139491
4.133333 -0.339599 -0.239352 -0.055016 0.060759 -0.095859 0.137058
4.166667 -0.337718 -0.242245 -0.052873 0.093803 -0.111843 0.110845
4.200000 -0.334706 -0.245634 -0.060688 0.127902 -0.128557 0.073083
4.233333 -0.331366 -0.249183 -0.071453 0.162539 -0.145745 0.036066
4.266667 -0.326158 -0.253860 -0.086917 0.197368 -0.163143 0.013427
4.300000 -0.318629 -0.259814 -0.087435 0.232076 -0.180440 0.007478
4.333333 -0.308201 -0.267421 -0.090761 0.266027 -0.197189 0.015760
4.366667 -0.297464 -0.275177 -0.082974 0.298967 -0.213133 0.037659
4.400000 -0.286425 -0.283078 -0.083538 0.330763 -0.228193 0.063994
4.433333 -0.275094 -0.291119 -0.073439 0.361465 -0.242418 0.086560
4.466667 -0.262068 -0.299772 -0.064529 0.391343 -0.256064 0.097865
4.500000 -0.248769 -0.308555 -0.070603 0.420768 -0.269504 0.097172
4.533333 -0.233785 -0.317729 -0.050866 0.450614 -0.283455 0.082210
4.566667 -0.218551 -0.327020 -0.040668 0.481311 -0.298400 0.056401
4.600000 -0.203081 -0.336421 -0.036799 0.513136 -0.314658 0.024163
4.633333 -0.186319 -0.346306 -0.034231 0.545976 -0.332291 -0.009306
4.666667 -0.169348 -0.356288 -0.034419 0.579493 -0.351139 -0.039696
4.700000 -0.149856 -0.367631 -0.048908 0.612939 -0.370780 -0.062352
4.733333 -0.128958 -0.380014 -0.061372 0.645094 -0.390322 -0.068372
4.766667 -0.105753 -0.394004 -0.067256 0.674756 -0.408849 -0.059302
4.800000 -0.080424 -0.409379 -0.064448 0.700659 -0.425417 -0.036303
4.833333 -0.054980 -0.424805 -0.081066 0.721785 -0.439209 0.000581
4.866667 -0.028558 -0.441167 -0.099892 0.736716 -0.449176 0.050852
4.900000 -0.002068 -0.457553 -0.084982 0.744307 -0.454444 0.108363
4.933333 0.024467 -0.473950 -0.079434 0.744071 -0.454673 0.164991
4.966667 0.051728 -0.490744 -0.067420 0.735529 -0.449590 0.218294
5.000000 0.078984 -0.507520 -0.047427 0.718544 -0.439145 0.266012
5.033333 0.104558 -0.523152 -0.030235 0.692867 -0.423275 0.300740
5.066667 0.127154 -0.536827 -0.016135 0.659405 -0.402680 0.317422
5.100000 0.149680 -0.550446 -0.008865 0.619531 -0.378330 0.320355
5.133333 0.172114 -0.563997 -0.004738 0.574120 -0.350868 0.313702
5.166667 0.194438 -0.577472 0.012991 0.524487 -0.321145 0.300685
5.200000 0.212116 -0.588131 0.034658 0.472161 -0.290129 0.284805
5.233333 0.224901 -0.595953 0.049704 0.419247 -0.259069 0.274482
5.266667 0.237533 -0.603673 0.049469 0.366912 -0.228593 0.274370
5.300000 0.246446 -0.609342 0.053782 0.316222 -0.199262 0.281206
5.333333 0.255193 -0.614899 0.047603 0.268558 -0.171808 0.292629
5.366667 0.261054 -0.618930 0.035187 0.225366 -0.147006 0.308184
5.400000 0.266742 -0.622846 0.049425 0.187311 -0.125160 0.325883
5.433333 0.272254 -0.626645 0.076851 0.154163 -0.106076 0.339986
5.466667 0.275697 -0.629301 0.092793 0.126084 -0.089802 0.346556
5.500000 0.277777 -0.631088 0.120634 0.102743 -0.076118 0.344593
5.533333 0.279682 -0.632758 0.130653 0.083669 -0.064716 0.335285
5.566667 0.281415 -0.634312 0.153179 0.067829 -0.054992 0.312503
5.600000 0.282978 -0.635753 0.168566 0.054610 -0.046602 0.277706
5.633333 0.284374 -0.637081 0.173902 0.043828 -0.039462 0.235325
5.666667 0.285604 -0.638299 0.168813 0.034989 -0.033308 0.189282
5.700000 0.286672 -0.639406 0.178860 0.027708 -0.027934 0.144231
5.733333 0.287318 -0.640182 0.172096 0.021592 -0.023157 0.100013
5.766667 0.287656 -0.640728 0.175247 0.016509 -0.018938 0.065104
5.800000 0.287840 -0.641169 0.175016 0.012302 -0.015221 0.040178
5.833333 0.287913 -0.641434 0.172766 0.008775 -0.011921 0.022914
5.866667 0.288114 -0.641655 0.187395 0.005883 -0.009066 0.011446
