t x y theta dxdt dydt dthetadt
0.000000 0.000000 0.000000 2.511446 0.149389 -0.032840 3.906314
0.033333 0.005042 -0.001123 2.651530 0.152974 -0.033889 3.810963
0.066667 0.010192 -0.002275 2.778347 0.156537 -0.034891 3.741716
0.100000 0.015474 -0.003463 2.869542 0.160075 -0.035847 3.703254
0.133333 0.020886 -0.004687 2.989601 0.163580 -0.036759 3.680727
0.166667 0.026405 -0.005938 3.108554 0.167045 -0.037629 3.653969
0.200000 0.032028 -0.007215 -3.052855 0.170472 -0.038459 3.608037
0.233333 0.037780 -0.008518 -2.933441 0.173857 -0.039252 3.534741
0.266667 0.043658 -0.009848 -2.804554 0.177195 -0.040012 3.434203
0.300000 0.049638 -0.011201 -2.661117 0.180481 -0.040739 3.295127
0.333333 0.055719 -0.012577 -2.511005 0.183717 -0.041436 3.121078
0.366667 0.061899 -0.013974 -2.375774 0.186901 -0.042104 2.919205
0.400000 0.068196 -0.015395 -2.305681 0.190031 -0.042745 2.704453
0.433333 0.074590 -0.016835 -2.218462 0.193106 -0.043360 2.485502
0.466667 0.081094 -0.018296 -2.164724 0.196129 -0.043950 2.275424
0.500000 0.087694 -0.019776 -2.110746 0.199101 -0.044515 2.090015
0.533333 0.094388 -0.021274 -2.064896 0.202022 -0.045055 1.945879
0.566667 0.101184 -0.022791 -2.008806 0.204888 -0.045571 1.854164
0.600000 0.108072 -0.024324 -1.969531 0.207703 -0.046063 1.811231
0.633333 0.115057 -0.025875 -1.912646 0.210466 -0.046529 1.819516
0.666667 0.122132 -0.027440 -1.876724 0.213175 -0.046970 1.869803
0.700000 0.129294 -0.029018 -1.824912 0.215831 -0.047385 1.954282
0.733333 0.136544 -0.030607 -1.745061 0.218433 -0.047774 2.054582
0.766667 0.143880 -0.032212 -1.675448 0.220983 -0.048137 2.155258
0.800000 0.151300 -0.033830 -1.587364 0.223480 -0.048472 2.241761
0.833333 0.158802 -0.035457 -1.512965 0.225924 -0.048781 2.293873
0.866667 0.166383 -0.037097 -1.429903 0.228316 -0.049062 2.294535
0.900000 0.174045 -0.038744 -1.341923 0.230657 -0.049315 2.228219
0.933333 0.181786 -0.040397 -1.250869 0.232950 -0.049538 2.088606
0.966667 0.189605 -0.042055 -1.136638 0.235194 -0.049730 1.867621
1.000000 0.197493 -0.043722 -1.052992 0.237389 -0.049890 1.565915
1.033333 0.205448 -0.045398 -0.967532 0.239538 -0.050015 1.189058
1.066667 0.213477 -0.047076 -0.919494 0.241642 -0.050105 0.747754
1.100000 0.221579 -0.048755 -0.888030 0.243697 -0.050158 0.253168
1.133333 0.229741 -0.050439 -0.880745 0.245706 -0.050173 -0.278120
1.166667 0.237973 -0.052122 -0.916651 0.247668 -0.050146 -0.815701
1.200000 0.246275 -0.053802 -0.977190 0.249583 -0.050074 -1.330199
1.233333 0.254644 -0.055479 -1.028699 0.251447 -0.049956 -1.792820
1.266667 0.263065 -0.057153 -1.114270 0.253257 -0.049786 -2.174193
1.300000 0.271552 -0.058821 -1.205156 0.255014 -0.049562 -2.446345
1.333333 0.280088 -0.060481 -1.327071 0.256713 -0.049281 -2.589717
1.366667 0.288686 -0.062133 -1.452723 0.258357 -0.048942 -2.604881
1.400000 0.297345 -0.063777 -1.611166 0.259945 -0.048545 -2.495372
1.433333 0.306048 -0.065403 -1.758349 0.261482 -0.048089 -2.268159
1.466667 0.314809 -0.067019 -1.873538 0.262969 -0.047576 -1.939874
1.500000 0.323611 -0.068612 -1.916617 0.264413 -0.047010 -1.538430
1.533333 0.332454 -0.070178 -1.954978 0.265817 -0.046395 -1.096539
1.566667 0.341336 -0.071715 -1.972859 0.267185 -0.045735 -0.642950
1.600000 0.350271 -0.073238 -1.975360 0.268524 -0.045039 -0.209773
1.633333 0.359243 -0.074727 -1.948368 0.269838 -0.044314 0.171269
1.666667 0.368265 -0.076199 -1.903887 0.271133 -0.043569 0.475249
1.700000 0.377338 -0.077655 -1.845644 0.272410 -0.042808 0.694628
1.733333 0.386443 -0.079070 -1.796587 0.273672 -0.042036 0.829137
1.766667 0.395580 -0.080444 -1.749032 0.274918 -0.041255 0.886233
1.800000 0.404763 -0.081799 -1.691182 0.276148 -0.040468 0.876826
1.833333 0.413992 -0.083134 -1.654806 0.277361 -0.039675 0.818856
1.866667 0.423264 -0.084447 -1.630465 0.278553 -0.038876 0.730717
1.900000 0.432578 -0.085739 -1.618352 0.279725 -0.038071 0.626120
1.933333 0.441935 -0.087009 -1.613352 0.280875 -0.037257 0.517471
1.966667 0.451317 -0.088231 -1.611208 0.281999 -0.036432 0.413344
2.000000 0.460739 -0.089429 -1.602831 0.283097 -0.035591 0.323892
2.033333 0.470199 -0.090603 -1.594014 0.284165 -0.034733 0.250906
2.066667 0.479696 -0.091751 -1.589182 0.285204 -0.033857 0.194845
2.100000 0.489228 -0.092873 -1.576058 0.286213 -0.032964 0.152550
2.133333 0.498796 -0.093968 -1.579776 0.287192 -0.032057 0.121418
2.166667 0.508397 -0.095036 -1.572559 0.288142 -0.031134 0.098078
2.200000 0.518020 -0.096051 -1.572742 0.289061 -0.030193 0.078938
2.233333 0.527674 -0.097038 -1.574394 0.289950 -0.029235 0.064500
2.266667 0.537359 -0.097996 -1.571684 0.290805 -0.028253 0.054618
2.300000 0.547073 -0.098923 -1.565507 0.291626 -0.027243 0.051467
2.333333 0.556815 -0.099820 -1.565916 0.292410 -0.026199 0.056304
2.366667 0.566584 -0.100686 -1.569086 0.293157 -0.025122 0.071048
2.400000 0.576379 -0.101519 -1.571699 0.293866 -0.024009 0.096579
2.433333 0.586199 -0.102320 -1.574585 0.294536 -0.022860 0.131616
2.466667 0.596043 -0.103089 -1.569885 0.295169 -0.021674 0.175911
2.500000 0.605902 -0.103802 -1.560630 0.295763 -0.020454 0.228059
2.533333 0.615775 -0.104459 -1.559919 0.296319 -0.019201 0.285366
2.566667 0.625669 -0.105082 -1.550351 0.296839 -0.017921 0.345265
2.600000 0.635574 -0.105649 -1.539772 0.297323 -0.016617 0.404814
2.633333 0.645499 -0.106180 -1.525753 0.297774 -0.015294 0.462981
2.666667 0.655442 -0.106676 -1.491949 0.298190 -0.013955 0.516701
2.700000 0.665393 -0.107116 -1.472031 0.298574 -0.012604 0.564090
2.733333 0.675360 -0.107519 -1.453537 0.298923 -0.011239 0.604305
2.766667 0.685343 -0.107885 -1.437345 0.299237 -0.009861 0.638472
2.800000 0.695331 -0.108195 -1.412452 0.299516 -0.008467 0.667671
2.833333 0.705323 -0.108448 -1.388359 0.299759 -0.007060 0.692477
2.866667 0.715328 -0.108664 -1.359969 0.299968 -0.005643 0.714443
2.900000 0.725345 -0.108842 -1.337054 0.300144 -0.004217 0.735177
2.933333 0.735362 -0.108964 -1.320482 0.300287 -0.002785 0.757608
2.966667 0.745380 -0.109031 -1.291898 0.300397 -0.001351 0.780286
3.000000 0.755397 -0.109044 -1.262365 0.300475 0.000083 0.802799
3.033333 0.765411 -0.109002 -1.243211 0.300522 0.001515 0.826231
3.066667 0.775433 -0.108921 -1.213689 0.300537 0.002945 0.853617
3.100000 0.785461 -0.108801 -1.180394 0.300522 0.004368 0.884281
3.133333 0.795495 -0.108643 -1.151635 0.300477 0.005784 0.916746
3.166667 0.805522 -0.108432 -1.110610 0.300404 0.007192 0.950921
3.200000 0.815543 -0.108170 -1.092317 0.300302 0.008590 0.989567
3.233333 0.825556 -0.107856 -1.066468 0.300170 0.009979 1.029747
3.266667 0.835560 -0.107492 -1.020380 0.300007 0.011360 1.066597
3.300000 0.845554 -0.107079 -0.988317 0.299815 0.012730 1.101280
3.333333 0.855550 -0.106627 -0.962010 0.299597 0.014088 1.131750
3.366667 0.865546 -0.106137 -0.910536 0.299354 0.015430 1.158025
3.400000 0.875530 -0.105599 -0.860513 0.299091 0.016756 1.174647
3.433333 0.885503 -0.105016 -0.828706 0.298812 0.018061 1.182755
3.466667 0.895462 -0.104388 -0.769679 0.298520 0.019345 1.180978
3.500000 0.905408 -0.103716 -0.739869 0.298218 0.020607 1.168232
3.533333 0.915341 -0.103001 -0.698773 0.297908 0.021848 1.143335
3.566667 0.925260 -0.102245 -0.660464 0.297593 0.023066 1.108983
3.600000 0.935176 -0.101451 -0.621636 0.297278 0.024261 1.067789
3.633333 0.945079 -0.100616 -0.581536 0.296964 0.025431 1.018143
3.666667 0.954969 -0.099743 -0.548746 0.296655 0.026576 0.965578
3.700000 0.964854 -0.098833 -0.522988 0.296352 0.027696 0.909911
3.733333 0.974727 -0.097886 -0.489605 0.296054 0.028791 0.855067
3.766667 0.984587 -0.096902 -0.451557 0.295763 0.029863 0.796240
3.800000 0.994442 -0.095883 -0.443978 0.295477 0.030915 0.733143
3.833333 1.004286 -0.094830 -0.409625 0.295197 0.031949 0.664041
3.866667 1.014119 -0.093744 -0.400002 0.294921 0.032968 0.584875
3.900000 1.023942 -0.092627 -0.369581 0.294650 0.033972 0.489401
3.933333 1.033758 -0.091475 -0.355457 0.294383 0.034964 0.372711
3.966667 1.043565 -0.090294 -0.334682 0.294121 0.035944 0.236365
4.000000 1.053364 -0.089079 -0.331095 0.293863 0.036914 0.078015
4.033333 1.063155 -0.087831 -0.306523 0.293609 0.037872 -0.100406
4.066667 1.072938 -0.086550 -0.295441 0.293358 0.038821 -0.300132
4.100000 1.082713 -0.085237 -0.305135 0.293108 0.039758 -0.513167
4.133333 1.092478 -0.083892 -0.333771 0.292858 0.040685 -0.734579
4.166667 1.102235 -0.082515 -0.365117 0.292606 0.041600 -0.961425
4.200000 1.111985 -0.081111 -0.411174 0.292351 0.042504 -1.182954
4.233333 1.121726 -0.079676 -0.462594 0.292090 0.043396 -1.388390
4.266667 1.131460 -0.078213 -0.520491 0.291824 0.044277 -1.562885
4.300000 1.141187 -0.076721 -0.568594 0.291550 0.045147 -1.699180
4.333333 1.150905 -0.075200 -0.640911 0.291268 0.046007 -1.786822
4.366667 1.160611 -0.073651 -0.705214 0.290978 0.046858 -1.818782
4.400000 1.170308 -0.072073 -0.791092 0.290678 0.047700 -1.797998
4.433333 1.179993 -0.070468 -0.867333 0.290369 0.048535 -1.727852
4.466667 1.189669 -0.068833 -0.958534 0.290052 0.049364 -1.615818
4.500000 1.199334 -0.067171 -1.044568 0.289727 0.050186 -1.466693
4.533333 1.208987 -0.065483 -1.077205 0.289394 0.051004 -1.294807
4.566667 1.218629 -0.063769 -1.111367 0.289055 0.051818 -1.109125
4.600000 1.228259 -0.062031 -1.129339 0.288711 0.052630 -0.919150
4.633333 1.237879 -0.060259 -1.141568 0.288361 0.053439 -0.736104
4.666667 1.247486 -0.058465 -1.141568 0.288006 0.054245 -0.570686
4.700000 1.257081 -0.056647 -1.162020 0.287646 0.055046 -0.431902
4.733333 1.266665 -0.054796 -1.180417 0.287281 0.055839 -0.321199
4.766667 1.276236 -0.052925 -1.173842 0.286911 0.056621 -0.244673
4.800000 1.285795 -0.051022 -1.177925 0.286537 0.057388 -0.203165
4.833333 1.295341 -0.049089 -1.183217 0.286157 0.058137 -0.196620
4.866667 1.304874 -0.047127 -1.180625 0.285774 0.058866 -0.224074
4.900000 1.314394 -0.045146 -1.179975 0.285386 0.059571 -0.286543
4.933333 1.323901 -0.043137 -1.190442 0.284993 0.060253 -0.381572
4.966667 1.333395 -0.041111 -1.188962 0.284598 0.060910 -0.501186
5.000000 1.342876 -0.039068 -1.183044 0.284200 0.061543 -0.638757
5.033333 1.352343 -0.037000 -1.185938 0.283799 0.062154 -0.786300
5.066667 1.361797 -0.034917 -1.223581 0.283397 0.062743 -0.932674
5.100000 1.371237 -0.032812 -1.264372 0.282994 0.063311 -1.064012
5.133333 1.380664 -0.030692 -1.331034 0.282591 0.063858 -1.168909
5.166667 1.390076 -0.028552 -1.391039 0.282189 0.064384 -1.238629
5.200000 1.399475 -0.026391 -1.452180 0.281789 0.064886 -1.263160
5.233333 1.408860 -0.024210 -1.509348 0.281392 0.065363 -1.235145
5.266667 1.418232 -0.022019 -1.564070 0.280997 0.065811 -1.150951
5.300000 1.427591 -0.019810 -1.596425 0.280605 0.066230 -1.011942
5.333333 1.436937 -0.017583 -1.643646 0.280217 0.066619 -0.825049
5.366667 1.446271 -0.015348 -1.673862 0.279832 0.066978 -0.599363
5.400000 1.455592 -0.013098 -1.711171 0.279452 0.067310 -0.343565
5.433333 1.464900 -0.010842 -1.718776 0.279075 0.067615 -0.070109
5.466667 1.474195 -0.008581 -1.717835 0.278702 0.067893 0.207420
5.500000 1.483477 -0.006315 -1.693307 0.278333 0.068146 0.476662
5.533333 1.492748 -0.004039 -1.678009 0.277968 0.068374 0.730014
5.566667 1.502007 -0.001752 -1.646827 0.277607 0.068574 0.960802
5.600000 1.511254 0.000543 -1.593534 0.277252 0.068746 1.157318
5.633333 1.520489 0.002847 -1.518087 0.276901 0.068887 1.314078
5.666667 1.529712 0.005156 -1.469016 0.276557 0.068993 1.428985
5.700000 1.538923 0.007470 -1.405411 0.276219 0.069062 1.503630
5.733333 1.548123 0.009786 -1.340890 0.275887 0.069088 1.536282
5.766667 1.557311 0.012099 -1.293903 0.275562 0.069069 1.529420
5.800000 1.566489 0.014411 -1.240303 0.275242 0.069004 1.491785
5.833333 1.575656 0.016720 -1.181672 0.274928 0.068890 1.432525
5.866667 1.584814 0.019025 -1.132630 0.274620 0.068727 1.359550
5.900000 1.593963 0.021324 -1.078426 0.274316 0.068516 1.276057
5.933333 1.603103 0.023615 -1.038409 0.274017 0.068259 1.192178
5.966667 1.612230 0.025897 -1.007925 0.273721 0.067956 1.114000
6.000000 1.621350 0.028167 -0.986731 0.273427 0.067610 1.046475
6.033333 1.630457 0.030426 -0.943627 0.273134 0.067222 0.992089
6.066667 1.639556 0.032670 -0.928673 0.272842 0.066793 0.953934
6.100000 1.648646 0.034897 -0.899717 0.272550 0.066325 0.937087
6.133333 1.657728 0.037106 -0.869609 0.272258 0.065819 0.940256
6.166667 1.666798 0.039300 -0.845730 0.271966 0.065274 0.960345
6.200000 1.675860 0.041471 -0.810160 0.271674 0.064690 0.990463
6.233333 1.684912 0.043624 -0.792714 0.271382 0.064068 1.029566
6.266667 1.693953 0.045758 -0.763986 0.271091 0.063407 1.069808
6.300000 1.702983 0.047872 -0.719537 0.270801 0.062707 1.105826
6.333333 1.712003 0.049966 -0.672639 0.270513 0.061966 1.130064
6.366667 1.721015 0.052027 -0.624241 0.270229 0.061184 1.136158
6.400000 1.730017 0.054066 -0.571241 0.269947 0.060361 1.121864
6.433333 1.739010 0.056070 -0.534381 0.269671 0.059494 1.076206
6.466667 1.747993 0.058049 -0.492780 0.269400 0.058584 0.994362
6.500000 1.756967 0.059989 -0.460107 0.269134 0.057634 0.870477
6.533333 1.765933 0.061903 -0.432323 0.268873 0.056645 0.708184
6.566667 1.774889 0.063789 -0.382065 0.268618 0.055619 0.510050
6.600000 1.783837 0.065634 -0.357928 0.268368 0.054563 0.277980
6.633333 1.792777 0.067449 -0.325252 0.268122 0.053479 0.017401
6.666667 1.801709 0.069220 -0.334775 0.267880 0.052370 -0.260388
6.700000 1.810634 0.070946 -0.359108 0.267641 0.051239 -0.542832
6.733333 1.819552 0.072629 -0.374320 0.267403 0.050089 -0.823867
6.766667 1.828461 0.074278 -0.408830 0.267166 0.048922 -1.090163
6.800000 1.837363 0.075893 -0.472338 0.266929 0.047741 -1.325818
6.833333 1.846258 0.077474 -0.541348 0.266690 0.046547 -1.514119
6.866667 1.855144 0.079010 -0.594339 0.266447 0.045342 -1.648097
6.900000 1.864021 0.080500 -0.667508 0.266201 0.044127 -1.724179
6.933333 1.872892 0.081954 -0.749155 0.265950 0.042903 -1.736441
6.966667 1.881756 0.083369 -0.826902 0.265694 0.041668 -1.686659
7.000000 1.890610 0.084741 -0.906468 0.265432 0.040424 -1.584911
7.033333 1.899455 0.086068 -0.971743 0.265167 0.039173 -1.442868
7.066667 1.908289 0.087351 -1.019295 0.264899 0.037915 -1.271380
7.100000 1.917117 0.088594 -1.067988 0.264631 0.036649 -1.080877
7.133333 1.925935 0.089795 -1.084026 0.264364 0.035378 -0.885716
7.166667 1.934742 0.090953 -1.101947 0.264102 0.034102 -0.699882
7.200000 1.943537 0.092070 -1.106282 0.263846 0.032819 -0.533471
7.233333 1.952321 0.093145 -1.116796 0.263598 0.031527 -0.394810
7.266667 1.961101 0.094177 -1.111234 0.263359 0.030226 -0.287454
7.300000 1.969870 0.095167 -1.115264 0.263132 0.028914 -0.212968
7.333333 1.978635 0.096113 -1.115010 0.262918 0.027588 -0.170853
7.366667 1.987397 0.097012 -1.107765 0.262715 0.026246 -0.154614
7.400000 1.996149 0.097869 -1.118137 0.262524 0.024889 -0.154612
7.433333 2.004891 0.098682 -1.125757 0.262344 0.023513 -0.162747
7.466667 2.013630 0.099447 -1.107312 0.262177 0.022119 -0.173129
7.500000 2.022368 0.100164 -1.131437 0.262020 0.020705 -0.179087
7.533333 2.031097 0.100835 -1.144750 0.261874 0.019273 -0.173095
7.566667 2.039818 0.101460 -1.161252 0.261741 0.017820 -0.151504
7.600000 2.048537 0.102034 -1.172626 0.261622 0.016347 -0.116383
7.633333 2.057256 0.102558 -1.175956 0.261518 0.014853 -0.069270
7.666667 2.065969 0.103032 -1.187959 0.261428 0.013338 -0.008795
7.700000 2.074677 0.103456 -1.188891 0.261355 0.011803 0.058635
7.733333 2.083379 0.103830 -1.181381 0.261299 0.010246 0.126317
7.766667 2.092083 0.104151 -1.176282 0.261260 0.008669 0.188313
7.800000 2.100787 0.104418 -1.158224 0.261236 0.007071 0.241948
7.833333 2.109492 0.104632 -1.141958 0.261229 0.005452 0.285250
7.866667 2.118199 0.104791 -1.123969 0.261238 0.003813 0.312678
7.900000 2.126904 0.104895 -1.106819 0.261261 0.002154 0.325614
7.933333 2.135611 0.104943 -1.098289 0.261299 0.000475 0.329540
7.966667 2.144317 0.104935 -1.088642 0.261350 -0.001225 0.328349
8.000000 2.153027 0.104870 -1.068054 0.261414 -0.002944 0.327037
8.033333 2.161739 0.104749 -1.065778 0.261491 -0.004685 0.332260
8.066667 2.170454 0.104567 -1.063845 0.261579 -0.006449 0.352161
8.100000 2.179172 0.104328 -1.054516 0.261680 -0.008237 0.395357
8.133333 2.187893 0.104027 -1.046652 0.261794 -0.010051 0.463678
8.166667 2.196618 0.103668 -1.040796 0.261920 -0.011895 0.560906
8.200000 2.205349 0.103251 -1.023735 0.262060 -0.013771 0.689082
8.233333 2.214084 0.102767 -1.023970 0.262214 -0.015679 0.847148
8.266667 2.222825 0.102225 -0.992125 0.262382 -0.017623 1.028297
8.300000 2.231570 0.101615 -0.960942 0.262566 -0.019604 1.222276
8.333333 2.240322 0.100936 -0.920710 0.262767 -0.021621 1.419554
8.366667 2.249079 0.100186 -0.872332 0.262985 -0.023673 1.603096
8.400000 2.257844 0.099376 -0.807155 0.263223 -0.025757 1.754367
8.433333 2.266617 0.098493 -0.732391 0.263479 -0.027872 1.854086
8.466667 2.275399 0.097534 -0.650355 0.263756 -0.030012 1.889227
8.500000 2.284191 0.096500 -0.560283 0.264053 -0.032172 1.848999
8.533333 2.292993 0.095388 -0.469243 0.264370 -0.034346 1.724117
8.566667 2.301805 0.094215 -0.379550 0.264706 -0.036528 1.518790
8.600000 2.310630 0.092961 -0.301991 0.265059 -0.038713 1.243651
8.633333 2.319469 0.091625 -0.245587 0.265428 -0.040892 0.912879
8.666667 2.328318 0.090229 -0.194690 0.265810 -0.043062 0.539677
8.700000 2.337184 0.088748 -0.203829 0.266203 -0.045214 0.142755
8.733333 2.346061 0.087207 -0.232769 0.266605 -0.047347 -0.257212
8.766667 2.354955 0.085580 -0.255623 0.267014 -0.049458 -0.646185
8.800000 2.363861 0.083894 -0.301722 0.267428 -0.051553 -1.014017
8.833333 2.372784 0.082123 -0.356108 0.267847 -0.053635 -1.352871
8.866667 2.381720 0.080293 -0.429358 0.268269 -0.055707 -1.650764
8.900000 2.390668 0.078403 -0.488402 0.268694 -0.057778 -1.907823
8.933333 2.399629 0.076456 -0.545449 0.269121 -0.059852 -2.127166
8.966667 2.408607 0.074424 -0.604064 0.269552 -0.061933 -2.313786
9.000000 2.417599 0.072334 -0.696722 0.269986 -0.064019 -2.471527
9.033333 2.426604 0.070186 -0.795473 0.270424 -0.066111 -2.601527
9.066667 2.435624 0.067957 -0.915561 0.270867 -0.068208 -2.708756
9.100000 2.444659 0.065646 -1.009903 0.271315 -0.070303 -2.790499
9.133333 2.453710 0.063256 -1.109328 0.271770 -0.072390 -2.840913
9.166667 2.462775 0.060788 -1.202094 0.272233 -0.074461 -2.852058
9.200000 2.471855 0.058265 -1.290527 0.272704 -0.076510 -2.820928
9.233333 2.480951 0.055666 -1.385856 0.273184 -0.078530 -2.750715
9.266667 2.490063 0.053013 -1.498326 0.273674 -0.080514 -2.643720
9.300000 2.499190 0.050289 -1.611087 0.274175 -0.082459 -2.504387
9.333333 2.508335 0.047494 -1.721945 0.274686 -0.084362 -2.337805
9.366667 2.517496 0.044648 -1.796071 0.275207 -0.086226 -2.153492
9.400000 2.526675 0.041736 -1.862608 0.275738 -0.088049 -1.955606
9.433333 2.535873 0.038760 -1.907343 0.276278 -0.089833 -1.746441
9.466667 2.545091 0.035722 -1.956336 0.276825 -0.091577 -1.531600
9.500000 2.554326 0.032635 -1.990632 0.277380 -0.093282 -1.317395
9.533333 2.563581 0.029487 -2.026072 0.277940 -0.094952 -1.109978
9.566667 2.572855 0.026282 -2.072069 0.278505 -0.096584 -0.910472
9.600000 2.582147 0.023029 -2.089855 0.279073 -0.098178 -0.724101
9.633333 2.591459 0.019721 -2.120473 0.279644 -0.099735 -0.552453
9.666667 2.600789 0.016368 -2.136083 0.280217 -0.101258 -0.396106
9.700000 2.610138 0.012961 -2.153358 0.280792 -0.102745 -0.252793
9.733333 2.619508 0.009502 -2.145604 0.281367 -0.104195 -0.124862
9.766667 2.628895 0.006001 -2.143821 0.281943 -0.105610 -0.014461
9.800000 2.638303 0.002449 -2.124227 0.282518 -0.106989 0.078810
9.833333 2.647730 -0.001152 -2.119596 0.283094 -0.108332 0.156740
9.866667 2.657178 -0.004801 -2.088802 0.283668 -0.109637 0.216687
9.900000 2.666644 -0.008487 -2.093040 0.284241 -0.110903 0.257075
9.933333 2.676128 -0.012209 -2.077915 0.284812 -0.112130 0.282331
9.966667 2.685632 -0.015976 -2.083896 0.285381 -0.113315 0.297271
10.000000 2.695154 -0.019777 -2.063940 0.285946 -0.114457 0.306475
10.033333 2.704695 -0.023619 -2.058321 0.286508 -0.115558 0.311690
10.066667 2.714256 -0.027501 -2.041504 0.287066 -0.116619 0.325092
10.100000 2.723835 -0.031421 -2.038828 0.287619 -0.117641 0.356513
10.133333 2.733433 -0.035372 -2.022922 0.288166 -0.118624 0.410745
10.166667 2.743050 -0.039351 -1.994051 0.288708 -0.119571 0.488317
10.200000 2.752684 -0.043358 -1.992422 0.289243 -0.120480 0.589205
10.233333 2.762337 -0.047391 -2.008706 0.289772 -0.121352 0.713957
10.266667 2.772007 -0.051456 -1.988579 0.290294 -0.122189 0.853325
10.300000 2.781693 -0.055550 -1.976723 0.290809 -0.122990 0.997943
10.333333 2.791396 -0.059673 -1.942107 0.291316 -0.123757 1.141657
10.366667 2.801117 -0.063818 -1.891675 0.291816 -0.124491 1.277043
10.400000 2.810854 -0.067989 -1.822650 0.292308 -0.125193 1.394617
10.433333 2.820605 -0.072186 -1.748963 0.292792 -0.125863 1.479788
10.466667 2.830374 -0.076401 -1.674607 0.293266 -0.126499 1.523215
10.500000 2.840162 -0.080633 -1.604634 0.293731 -0.127103 1.514108
10.533333 2.849967 -0.084881 -1.570258 0.294184 -0.127674 1.444474
10.566667 2.859784 -0.089151 -1.514593 0.294626 -0.128213 1.313160
10.600000 2.869614 -0.093442 -1.471868 0.295053 -0.128719 1.122107
10.633333 2.879455 -0.097754 -1.418317 0.295467 -0.129190 0.880301
10.666667 2.889314 -0.102076 -1.345659 0.295868 -0.129625 0.595039
10.700000 2.899190 -0.106408 -1.319965 0.296256 -0.130022 0.279322
10.733333 2.909077 -0.110757 -1.313888 0.296634 -0.130376 -0.061305
10.766667 2.918974 -0.115119 -1.316225 0.297006 -0.130683 -0.421696
10.800000 2.928881 -0.119493 -1.360956 0.297373 -0.130939 -0.789450
10.833333 2.938800 -0.123877 -1.408106 0.297740 -0.131143 -1.147614
10.866667 2.948728 -0.128267 -1.451999 0.298109 -0.131294 -1.473584
10.900000 2.958667 -0.132660 -1.500743 0.298483 -0.131390 -1.753072
10.933333 2.968617 -0.137055 -1.593387 0.298865 -0.131434 -1.963539
10.966667 2.978582 -0.141450 -1.655976 0.299257 -0.131427 -2.095868
11.000000 2.988560 -0.145841 -1.756551 0.299658 -0.131371 -2.140929
11.033333 2.998554 -0.150230 -1.850765 0.300069 -0.131267 -2.105366
11.066667 3.008561 -0.154608 -1.972736 0.300492 -0.131113 -1.998835
11.100000 3.018584 -0.158982 -2.097417 0.300926 -0.130907 -1.826086
11.133333 3.028621 -0.163349 -2.201095 0.301372 -0.130642 -1.602376
11.166667 3.038674 -0.167710 -2.201095 0.301831 -0.130306 -1.327556
11.200000 3.048741 -0.172063 -2.201095 0.302305 -0.129891 -1.027429
11.233333 3.058822 -0.176407 -2.201095 0.302795 -0.129386 -0.716867
11.266667 3.068918 -0.180741 -2.201095 0.303303 -0.128783 -0.413877
11.300000 3.079027 -0.185063 -2.294550 0.303827 -0.128079 -0.128252
11.333333 3.089159 -0.189348 -2.268096 0.304366 -0.127275 0.130054
11.366667 3.099304 -0.193619 -2.231593 0.304916 -0.126383 0.351646
11.400000 3.109472 -0.197846 -2.208433 0.305470 -0.125412 0.552612
11.433333 3.119664 -0.202026 -2.172686 0.306024 -0.124379 0.742325
11.466667 3.129878 -0.206156 -2.146152 0.306572 -0.123295 0.932886
11.500000 3.140116 -0.210235 -2.083720 0.307109 -0.122177 1.112369
11.533333 3.150376 -0.214261 -2.080355 0.307630 -0.121033 1.290191
11.566667 3.160648 -0.218268 -2.044550 0.308136 -0.119868 1.466452
11.600000 3.170929 -0.222255 -2.014254 0.308624 -0.118682 1.631124
11.633333 3.181232 -0.226183 -1.953109 0.309095 -0.117475 1.776196
11.666667 3.191545 -0.230091 -1.878329 0.309550 -0.116244 1.889977
11.700000 3.201867 -0.233977 -1.798849 0.309992 -0.114986 1.981375
11.733333 3.212208 -0.237801 -1.702911 0.310421 -0.113696 2.036226
11.766667 3.222556 -0.241603 -1.613805 0.310838 -0.112380 2.052372
11.800000 3.232924 -0.245343 -1.526597 0.311241 -0.111040 2.029174
11.833333 3.243310 -0.249020 -1.458513 0.311632 -0.109678 1.976607
11.866667 3.253713 -0.252637 -1.375689 0.312007 -0.108307 1.908426
11.900000 3.264134 -0.256192 -1.315167 0.312361 -0.106940 1.834474
11.933333 3.274559 -0.259722 -1.263028 0.312690 -0.105591 1.775589
11.966667 3.284988 -0.263228 -1.227088 0.312990 -0.104267 1.742052
12.000000 3.295435 -0.266671 -1.201550 0.313259 -0.102978 1.746134
12.033333 3.305884 -0.270088 -1.158473 0.313494 -0.101729 1.785583
12.066667 3.316348 -0.273442 -1.121909 0.313695 -0.100517 1.859253
12.100000 3.326814 -0.276771 -1.052245 0.313866 -0.099332 1.959681
12.133333 3.337294 -0.280036 -1.001790 0.314012 -0.098163 2.076530
12.166667 3.347774 -0.283276 -0.917787 0.314135 -0.097002 2.200060
12.200000 3.358252 -0.286490 -0.829046 0.314242 -0.095837 2.317881
12.233333 3.368727 -0.289678 -0.728884 0.314335 -0.094661 2.423774
12.266667 3.379199 -0.292841 -0.624877 0.314424 -0.093462 2.507781
12.300000 3.389682 -0.295941 -0.529176 0.314510 -0.092237 2.567035
12.333333 3.400161 -0.299016 -0.451737 0.314596 -0.090983 2.599067
12.366667 3.410650 -0.302030 -0.378633 0.314682 -0.089701 2.604954
12.400000 3.421132 -0.305019 -0.294760 0.314767 -0.088396 2.588806
12.433333 3.431623 -0.307950 -0.198953 0.314847 -0.087077 2.554474
12.466667 3.442125 -0.310823 -0.109435 0.314914 -0.085759 2.505329
12.500000 3.452635 -0.313640 -0.003348 0.314963 -0.084457 2.438439
12.533333 3.463135 -0.316434 0.077254 0.314987 -0.083184 2.349138
12.566667 3.473642 -0.319174 0.146937 0.314986 -0.081946 2.231087
12.600000 3.484158 -0.321863 0.220151 0.314959 -0.080752 2.076019
12.633333 3.494682 -0.324503 0.294090 0.314908 -0.079604 1.879346
12.666667 3.505189 -0.327120 0.368149 0.314833 -0.078503 1.637712
12.700000 3.515679 -0.329715 0.438599 0.314734 -0.077448 1.354853
12.733333 3.526151 -0.332289 0.503604 0.314613 -0.076437 1.034435
12.766667 3.536628 -0.334822 0.554636 0.314466 -0.075469 0.681267
12.800000 3.547112 -0.337314 0.575728 0.314290 -0.074546 0.305660
12.833333 3.557601 -0.339768 0.576942 0.314081 -0.073665 -0.086149
12.866667 3.568066 -0.342203 0.555744 0.313836 -0.072827 -0.482912
12.900000 3.578535 -0.344604 0.521964 0.313550 -0.072034 -0.876132
12.933333 3.589006 -0.346975 0.466368 0.313220 -0.071290 -1.251790
12.966667 3.599478 -0.349316 0.426204 0.312837 -0.070596 -1.598539
13.000000 3.609920 -0.351642 0.353900 0.312398 -0.069956 -1.909197
13.033333 3.620331 -0.353953 0.281216 0.311898 -0.069369 -2.176177
13.066667 3.630709 -0.356251 0.189988 0.311332 -0.068834 -2.396289
13.100000 3.641081 -0.358529 0.094464 0.310695 -0.068352 -2.567355
13.133333 3.651442 -0.360790 0.000535 0.309986 -0.067917 -2.692303
13.166667 3.661792 -0.363035 -0.106859 0.309202 -0.067525 -2.768447
13.200000 3.672102 -0.365270 -0.217350 0.308344 -0.067173 -2.799185
13.233333 3.682395 -0.367494 -0.330587 0.307406 -0.066859 -2.787702
13.266667 3.692645 -0.369709 -0.428614 0.306386 -0.066581 -2.739097
13.300000 3.702871 -0.371916 -0.522245 0.305284 -0.066338 -2.661797
13.333333 3.713051 -0.374117 -0.609623 0.304100 -0.066127 -2.565484
13.366667 3.723184 -0.376311 -0.694361 0.302835 -0.065949 -2.465490
13.400000 3.733266 -0.378501 -0.779531 0.301494 -0.065801 -2.368822
13.433333 3.743297 -0.380687 -0.864710 0.300081 -0.065683 -2.281657
13.466667 3.753289 -0.382869 -0.922388 0.298604 -0.065594 -2.212546
13.500000 3.763237 -0.385046 -0.957952 0.297065 -0.065533 -2.166551
13.533333 3.773129 -0.387223 -1.024311 0.295468 -0.065500 -2.141939
13.566667 3.782963 -0.389400 -1.091298 0.293813 -0.065498 -2.140167
13.600000 3.792736 -0.391577 -1.149092 0.292099 -0.065525 -2.167304
13.633333 3.802456 -0.393755 -1.243698 0.290323 -0.065584 -2.226983
13.666667 3.812119 -0.395935 -1.332343 0.288485 -0.065675 -2.314368
13.700000 3.821723 -0.398117 -1.403914 0.286582 -0.065799 -2.420888
13.733333 3.831260 -0.400304 -1.469850 0.284614 -0.065956 -2.545071
13.766667 3.840731 -0.402497 -1.524577 0.282579 -0.066147 -2.676008
13.800000 3.850131 -0.404697 -1.610492 0.280476 -0.066372 -2.795425
13.833333 3.859460 -0.406906 -1.719063 0.278307 -0.066633 -2.888851
13.866667 3.868716 -0.409125 -1.803430 0.276069 -0.066932 -2.946405
13.900000 3.877896 -0.411354 -1.933399 0.273765 -0.067269 -2.957368
13.933333 3.886997 -0.413593 -2.069665 0.271394 -0.067646 -2.908294
13.966667 3.896018 -0.415845 -2.193231 0.268957 -0.068066 -2.789543
14.000000 3.904956 -0.418108 -2.320544 0.266455 -0.068529 -2.597943
14.033333 3.913810 -0.420392 -2.434305 0.263888 -0.069035 -2.329537
14.066667 3.922578 -0.422690 -2.517315 0.261257 -0.069584 -1.977414
14.100000 3.931259 -0.425003 -2.580280 0.258562 -0.070178 -1.541509
14.133333 3.939848 -0.427340 -2.623069 0.255803 -0.070816 -1.027161
14.166667 3.948343 -0.429704 -2.646377 0.252977 -0.071500 -0.437863
14.200000 3.956740 -0.432095 -2.661273 0.250081 -0.072231 0.223918
14.233333 3.965043 -0.434505 -2.673964 0.247115 -0.073011 0.955603
14.266667 3.973243 -0.436947 -2.665041 0.244076 -0.073841 1.748448
14.300000 3.981346 -0.439410 -2.626409 0.240962 -0.074724 2.583984
14.333333 3.989350 -0.441894 -2.550944 0.237769 -0.075662 3.444381
14.366667 3.997242 -0.444417 -2.417716 0.234496 -0.076661 4.296641
14.400000 4.005020 -0.446979 -2.240211 0.231141 -0.077721 5.099831
14.433333 4.012694 -0.449565 -2.025623 0.227702 -0.078848 5.805703
14.466667 4.020246 -0.452195 -1.825048 0.224177 -0.080045 6.374437
14.500000 4.027676 -0.454871 -1.557621 0.220571 -0.081308 6.774856
14.533333 4.034979 -0.457596 -1.239706 0.216889 -0.082631 6.977741
14.566667 4.042172 -0.460347 -0.874620 0.213140 -0.084005 6.971625
14.600000 4.049234 -0.463152 -0.519078 0.209332 -0.085421 6.758502
14.633333 4.056162 -0.466011 -0.264226 0.205480 -0.086859 6.360141
14.666667 4.062956 -0.468927 -0.061205 0.201594 -0.088306 5.797301
14.700000 4.069612 -0.471901 0.095346 0.197685 -0.089751 5.113746
14.733333 4.076129 -0.474935 0.244469 0.193759 -0.091184 4.365877
14.766667 4.082505 -0.478028 0.388660 0.189824 -0.092597 3.611059
14.800000 4.088762 -0.481152 0.544126 0.185880 -0.093988 2.899092
14.833333 4.094899 -0.484307 0.592302 0.181924 -0.095366 2.267853
14.866667 4.100891 -0.487524 0.571349 0.177954 -0.096730 1.749948
14.900000 4.106760 -0.490772 0.554721 0.173969 -0.098085 1.354497
14.933333 4.112506 -0.494052 0.544652 0.169961 -0.099441 1.079105
14.966667 4.118127 -0.497364 0.542127 0.165924 -0.100806 0.912486
15.000000 4.123602 -0.500739 0.557438 0.161855 -0.102185 0.847711
15.033333 4.128949 -0.504147 0.584419 0.157752 -0.103577 0.870403
15.066667 4.134148 -0.507617 0.605084 0.153611 -0.104990 0.966460
15.100000 4.139198 -0.511150 0.650888 0.149428 -0.106426 1.126005
15.133333 4.144098 -0.514745 0.701109 0.145206 -0.107881 1.342544
15.166667 4.148869 -0.518374 0.759470 0.140949 -0.109350 1.609563
15.200000 4.153508 -0.522035 0.799469 0.136656 -0.110829 1.910003
15.233333 4.158016 -0.525729 0.852387 0.132328 -0.112320 2.231414
15.266667 4.162370 -0.529486 0.895534 0.127965 -0.113818 2.566191
15.300000 4.166570 -0.533304 0.942524 0.123573 -0.115316 2.906205
15.333333 4.170615 -0.537183 1.029801 0.119154 -0.116814 3.239278
15.366667 4.174525 -0.541095 1.161998 0.114709 -0.118310 3.554550
15.400000 4.178278 -0.545068 1.323075 0.110243 -0.119796 3.851657
15.433333 4.181874 -0.549100 1.518990 0.105766 -0.121262 4.128758
15.466667 4.185334 -0.553164 1.726187 0.101282 -0.122701 4.370862
15.500000 4.188636 -0.557285 1.903803 0.096795 -0.124110 4.563863
15.533333 4.191778 -0.561463 1.988269 0.092303 -0.125485 4.706486
15.566667 4.194761 -0.565696 2.092012 0.087808 -0.126822 4.799875
15.600000 4.197608 -0.569959 2.263801 0.083309 -0.128121 4.843384
15.633333 4.200317 -0.574254 2.443901 0.078804 -0.129384 4.841019
15.666667 4.202890 -0.578578 2.645791 0.074289 -0.130612 4.806310
15.700000 4.205303 -0.582951 2.836651 0.069766 -0.131805 4.749584
