t x y theta dxdt dydt dthetadt
0.000000 0.000000 0.000000 0.006009 0.002140 -0.007879 0.029546
0.033333 -0.000072 -0.000303 -0.015421 0.005994 -0.006853 0.051383
0.066667 0.000265 -0.000377 -0.005632 0.011700 -0.004839 0.082555
0.100000 0.000436 -0.000541 -0.003428 0.019625 -0.001375 0.118850
0.133333 0.000459 -0.001008 0.002476 0.030095 0.003979 0.153967
0.166667 0.000550 -0.001411 -0.006510 0.043442 0.011635 0.181961
0.200000 0.001102 -0.001546 -0.001461 0.059729 0.021739 0.200919
0.233333 0.002700 -0.001609 -0.002600 0.078942 0.034440 0.203908
0.266667 0.004785 -0.001382 0.029773 0.100911 0.049658 0.190493
0.300000 0.007369 -0.000852 0.058975 0.125463 0.067245 0.161076
0.333333 0.011378 0.001059 0.071986 0.152293 0.086900 0.121388
0.366667 0.015906 0.003294 0.088905 0.181046 0.108310 0.074346
0.400000 0.023613 0.008489 0.086087 0.211283 0.131057 0.026351
0.433333 0.031853 0.014031 0.078612 0.242655 0.154687 -0.018541
0.466667 0.040633 0.019923 0.057088 0.274485 0.178573 -0.055200
0.500000 0.049959 0.026173 0.043056 0.306147 0.202114 -0.079984
0.533333 0.059840 0.032786 0.017685 0.337216 0.224931 -0.091271
0.566667 0.070281 0.039769 0.015420 0.367299 0.246664 -0.088897
0.600000 0.084589 0.049470 0.016821 0.396173 0.267193 -0.078430
0.633333 0.099463 0.059554 0.023248 0.423908 0.286654 -0.061168
0.666667 0.114904 0.070026 0.022740 0.450848 0.305379 -0.041982
0.700000 0.130917 0.080887 0.033390 0.477339 0.323702 -0.024685
0.733333 0.147501 0.092140 0.046976 0.503650 0.341870 -0.013846
0.766667 0.164660 0.103787 0.047564 0.530050 0.360128 -0.010170
0.800000 0.182395 0.115829 0.038270 0.557135 0.378896 -0.010486
0.833333 0.200708 0.128270 0.032046 0.584822 0.398121 -0.014784
0.866667 0.219598 0.141110 0.026551 0.613028 0.417749 -0.021347
0.900000 0.239068 0.154352 0.018760 0.641668 0.437728 -0.026667
0.933333 0.259118 0.167995 0.016569 0.670875 0.458151 -0.028925
0.966667 0.283820 0.184873 0.024668 0.700442 0.478877 -0.027242
1.000000 0.309093 0.202160 0.021145 0.730003 0.499635 -0.023312
1.033333 0.334932 0.219854 0.024426 0.759534 0.520388 -0.017597
1.066667 0.361331 0.237951 0.036459 0.789009 0.541100 -0.011736
1.100000 0.388286 0.256448 0.023807 0.818404 0.561733 -0.008234
1.133333 0.415793 0.275344 0.028965 0.847413 0.582049 -0.007734
1.166667 0.443844 0.294635 0.018149 0.876412 0.602284 -0.009096
1.200000 0.472435 0.314316 0.015000 0.905539 0.622540 -0.013459
1.233333 0.501559 0.334386 0.026755 0.935022 0.642959 -0.020082
1.266667 0.533823 0.356629 0.023419 0.964878 0.663517 -0.027306
1.300000 0.566601 0.379255 0.021106 0.995150 0.684214 -0.035586
1.333333 0.601295 0.403043 0.029760 1.025670 0.704939 -0.045635
1.366667 0.636482 0.427203 0.016623 1.055928 0.725345 -0.059672
1.400000 0.672149 0.451727 0.016695 1.085419 0.745049 -0.075183
1.433333 0.708284 0.476609 0.020466 1.113699 0.763680 -0.090912
1.466667 0.746748 0.503008 0.017164 1.140687 0.781172 -0.106531
1.500000 0.785652 0.529751 0.012429 1.166246 0.797412 -0.121471
1.533333 0.824981 0.556829 0.005526 1.190644 0.812567 -0.131736
1.566667 0.865791 0.584671 -0.002073 1.214101 0.826786 -0.137082
1.600000 0.907096 0.612646 -0.011782 1.236995 0.840413 -0.139828
1.633333 0.949104 0.641212 -0.006230 1.259278 0.853629 -0.141312
1.666667 0.991473 0.670075 -0.021932 1.280818 0.866503 -0.142391
1.700000 1.034185 0.699223 -0.039110 1.301511 0.879132 -0.142627
1.733333 1.075817 0.727435 -0.028546 1.321388 0.891625 -0.146423
1.766667 1.120682 0.756968 -0.032015 1.340405 0.904063 -0.152338
1.800000 1.166964 0.787596 -0.032141 1.358460 0.916378 -0.160021
1.833333 1.213516 0.818470 -0.030768 1.375751 0.928633 -0.169041
1.866667 1.260450 0.850218 -0.029943 1.392464 0.940841 -0.179782
1.900000 1.308097 0.882369 -0.048790 1.408744 0.952999 -0.192692
1.933333 1.355126 0.914438 -0.061594 1.424267 0.964810 -0.203118
1.966667 1.402341 0.946701 -0.067228 1.439005 0.976092 -0.212049
2.000000 1.449720 0.979145 -0.080472 1.453043 0.986798 -0.218112
2.033333 1.497242 1.011756 -0.088051 1.466438 0.996855 -0.219876
2.066667 1.546781 1.045545 -0.090510 1.478989 1.006155 -0.218380
2.100000 1.597264 1.079698 -0.095148 1.490506 1.014604 -0.213209
2.133333 1.647820 1.113981 -0.107746 1.500938 1.022247 -0.209636
2.166667 1.698424 1.148376 -0.116319 1.510228 1.029067 -0.208310
2.200000 1.749791 1.183205 -0.118379 1.518165 1.034955 -0.209704
2.233333 1.801156 1.218118 -0.129494 1.524539 1.039797 -0.217319
2.266667 1.852495 1.253099 -0.120253 1.529506 1.043629 -0.229091
2.300000 1.903783 1.288131 -0.128838 1.533326 1.046508 -0.248633
2.333333 1.954994 1.323198 -0.147441 1.536561 1.048562 -0.271310
2.366667 2.006104 1.358286 -0.146576 1.539522 1.049929 -0.295041
2.400000 2.057088 1.393377 -0.169722 1.542642 1.050806 -0.318705
2.433333 2.107921 1.428456 -0.163512 1.546355 1.051390 -0.340469
2.466667 2.158577 1.463506 -0.182274 1.550932 1.051794 -0.359510
2.500000 2.211025 1.498644 -0.203376 1.556409 1.052102 -0.367359
2.533333 2.263245 1.533725 -0.209352 1.562353 1.052307 -0.366765
2.566667 2.315211 1.568733 -0.235643 1.568334 1.052352 -0.357563
2.600000 2.366895 1.603651 -0.240121 1.573859 1.052146 -0.339622
2.633333 2.418272 1.638463 -0.278110 1.578275 1.051522 -0.306325
2.666667 2.472120 1.673681 -0.275454 1.580696 1.050267 -0.259232
2.700000 2.526574 1.709156 -0.271733 1.580490 1.048157 -0.205059
2.733333 2.580633 1.744482 -0.283888 1.576887 1.044964 -0.143674
2.766667 2.634269 1.779641 -0.294494 1.569201 1.040491 -0.077092
2.800000 2.687451 1.814616 -0.310115 1.556753 1.034544 -0.009614
2.833333 2.740150 1.849391 -0.299256 1.539188 1.027084 0.044718
2.866667 2.792338 1.883947 -0.289536 1.516369 1.018118 0.083722
2.900000 2.843985 1.918269 -0.295595 1.487932 1.007629 0.107315
2.933333 2.895064 1.952339 -0.272606 1.454267 0.995692 0.110162
2.966667 2.943607 1.985203 -0.249665 1.415605 0.982320 0.089122
3.000000 2.991528 2.017779 -0.245707 1.371756 0.967308 0.046713
3.033333 3.038804 2.050051 -0.229270 1.322372 0.950375 -0.008466
3.066667 3.080929 2.081445 -0.229698 1.267767 0.931326 -0.072551
3.100000 3.122364 2.112497 -0.226870 1.208629 0.910099 -0.143650
3.133333 3.163088 2.143193 -0.250181 1.144734 0.886413 -0.209198
3.166667 3.203083 2.173518 -0.269127 1.076179 0.860125 -0.260797
3.200000 3.239224 2.202967 -0.286134 1.003755 0.831556 -0.297244
3.233333 3.271906 2.231033 -0.299728 0.928479 0.801114 -0.319607
3.266667 3.303815 2.258678 -0.332988 0.849998 0.769102 -0.331279
3.300000 3.331074 2.284149 -0.341113 0.767733 0.735969 -0.339081
3.333333 3.352385 2.306566 -0.349771 0.682632 0.702729 -0.359448
3.366667 3.372909 2.328516 -0.350716 0.595480 0.670331 -0.403492
3.400000 3.392644 2.349992 -0.359499 0.506801 0.639601 -0.476345
3.433333 3.411590 2.370988 -0.361767 0.416667 0.611200 -0.576967
3.466667 3.423192 2.389410 -0.358520 0.326716 0.586044 -0.702236
3.500000 3.434013 2.407329 -0.352258 0.238590 0.564592 -0.837738
3.533333 3.438869 2.424600 -0.372377 0.152979 0.546610 -0.964586
3.566667 3.442964 2.441352 -0.403753 0.070729 0.531678 -1.068607
3.600000 3.441893 2.457907 -0.467687 -0.006758 0.519069 -1.135236
3.633333 3.436201 2.474917 -0.560343 -0.077335 0.507856 -1.158973
3.666667 3.429797 2.491381 -0.656840 -0.139874 0.496472 -1.133855
3.700000 3.422705 2.507297 -0.709650 -0.193043 0.483445 -1.065479
3.733333 3.412748 2.524483 -0.773643 -0.235589 0.467461 -0.962037
3.766667 3.402145 2.541108 -0.781594 -0.266291 0.447461 -0.836094
3.800000 3.389833 2.558257 -0.793881 -0.284764 0.422511 -0.702119
3.833333 3.376926 2.574833 -0.778612 -0.291329 0.392187 -0.574315
3.866667 3.363783 2.589650 -0.774330 -0.286421 0.356710 -0.465520
3.900000 3.351953 2.601690 -0.764565 -0.271059 0.316757 -0.380335
3.933333 3.339612 2.613150 -0.761037 -0.246653 0.273391 -0.323136
3.966667 3.329171 2.621588 -0.781248 -0.215211 0.228058 -0.285864
4.000000 3.321470 2.627789 -0.806626 -0.178830 0.182494 -0.264803
4.033333 3.315832 2.631820 -0.824014 -0.140035 0.138578 -0.250172
4.066667 3.312635 2.634277 -0.849697 -0.101285 0.098050 -0.233920
4.100000 3.312464 2.634825 -0.874271 -0.064809 0.062255 -0.212014
4.133333 3.311913 2.634843 -0.870053 -0.032418 0.032294 -0.181218
4.166667 3.315214 2.633568 -0.874637 -0.005646 0.008537 -0.146133
4.200000 3.318156 2.631787 -0.866657 0.014626 -0.008963 -0.107411
4.233333 3.320747 2.629509 -0.850266 0.028408 -0.020730 -0.069450
4.266667 3.322995 2.626743 -0.847017 0.036187 -0.027595 -0.037239
4.300000 3.325251 2.625079 -0.844916 0.038906 -0.030481 -0.015288
4.333333 3.327177 2.622944 -0.860155 0.037513 -0.030310 -0.001932
4.366667 3.328406 2.622398 -0.872310 0.033529 -0.027972 0.004488
