t x y theta dxdt dydt dthetadt
0.000000 0.000000 0.000000 -3.111812 0.148770 0.023255 -0.021847
0.033333 0.004987 0.000778 -3.116574 0.151253 0.023700 -0.026147
0.066667 0.010064 0.001574 -3.119315 0.153735 0.024141 -0.032990
0.100000 0.015233 0.002387 -3.118857 0.156212 0.024574 -0.047298
0.133333 0.020492 0.003218 -3.124133 0.158685 0.024995 -0.069867
0.166667 0.025826 0.004061 -3.139571 0.161152 0.025398 -0.099792
0.200000 0.031251 0.004921 -3.129093 0.163610 0.025778 -0.136340
0.233333 0.036750 0.005793 -3.118405 0.166058 0.026127 -0.182285
0.266667 0.042322 0.006677 -3.114821 0.168492 0.026442 -0.233536
0.300000 0.047982 0.007577 -3.128587 0.170909 0.026720 -0.284369
0.333333 0.053714 0.008489 3.139820 0.173303 0.026961 -0.332744
0.366667 0.059533 0.009404 3.132825 0.175673 0.027165 -0.377318
0.400000 0.065435 0.010323 3.108784 0.178012 0.027337 -0.412627
0.433333 0.071419 0.011244 3.077928 0.180317 0.027483 -0.430837
0.466667 0.077482 0.012166 3.066805 0.182582 0.027607 -0.430266
0.500000 0.083621 0.013088 3.038602 0.184801 0.027715 -0.408776
0.533333 0.089833 0.014010 3.023712 0.186970 0.027813 -0.365591
0.566667 0.096115 0.014929 3.004250 0.189084 0.027906 -0.299308
0.600000 0.102467 0.015862 3.002133 0.191142 0.027995 -0.215603
0.633333 0.108883 0.016790 2.984288 0.193144 0.028084 -0.119188
0.666667 0.115367 0.017731 2.981519 0.195092 0.028173 -0.013680
0.700000 0.121920 0.018684 2.979616 0.196988 0.028262 0.095686
0.733333 0.128528 0.019631 2.990736 0.198834 0.028350 0.203449
0.766667 0.135190 0.020571 2.995862 0.200635 0.028436 0.304207
0.800000 0.141918 0.021524 3.014790 0.202393 0.028520 0.397004
0.833333 0.148695 0.022467 3.035410 0.204115 0.028607 0.477507
0.866667 0.155537 0.023424 3.059691 0.205805 0.028701 0.542959
0.900000 0.162444 0.024395 3.080026 0.207470 0.028806 0.588947
0.933333 0.169394 0.025355 3.105485 0.209114 0.028928 0.617628
0.966667 0.176386 0.026303 3.133199 0.210742 0.029070 0.628852
1.000000 0.183442 0.027266 -3.130344 0.212357 0.029234 0.623052
1.033333 0.190537 0.028227 -3.093357 0.213961 0.029420 0.601283
1.066667 0.197694 0.029204 -3.081421 0.215554 0.029625 0.567999
1.100000 0.204914 0.030196 -3.066613 0.217135 0.029845 0.530170
1.133333 0.212172 0.031187 -3.039182 0.218704 0.030076 0.487791
1.166667 0.219492 0.032194 -3.015419 0.220260 0.030313 0.443970
1.200000 0.226874 0.033218 -3.009447 0.221801 0.030553 0.401280
1.233333 0.234296 0.034242 -3.013096 0.223329 0.030794 0.363945
1.266667 0.241779 0.035283 -2.999316 0.224846 0.031039 0.331400
1.300000 0.249306 0.036327 -2.993827 0.226357 0.031292 0.301589
1.333333 0.256877 0.037373 -2.979559 0.227865 0.031558 0.276602
1.366667 0.264493 0.038423 -2.969174 0.229379 0.031846 0.256098
1.400000 0.272156 0.039478 -2.962834 0.230905 0.032161 0.238502
1.433333 0.279867 0.040537 -2.951247 0.232447 0.032507 0.221688
1.466667 0.287626 0.041603 -2.948032 0.234011 0.032887 0.204881
1.500000 0.295444 0.042690 -2.941123 0.235600 0.033301 0.189386
1.533333 0.303318 0.043798 -2.923510 0.237212 0.033749 0.173081
1.566667 0.311249 0.044928 -2.932839 0.238846 0.034228 0.157794
1.600000 0.319237 0.046080 -2.918701 0.240497 0.034739 0.142072
1.633333 0.327281 0.047256 -2.920349 0.242160 0.035278 0.127260
1.666667 0.335380 0.048444 -2.917757 0.243828 0.035842 0.113109
1.700000 0.343536 0.049643 -2.922938 0.245499 0.036431 0.098581
1.733333 0.351749 0.050856 -2.906855 0.247168 0.037043 0.086136
1.766667 0.360021 0.052083 -2.905530 0.248836 0.037677 0.072166
1.800000 0.368347 0.053336 -2.905308 0.250504 0.038335 0.059402
1.833333 0.376726 0.054616 -2.893790 0.252172 0.039016 0.045705
1.866667 0.385159 0.055923 -2.900772 0.253844 0.039721 0.032769
1.900000 0.393644 0.057259 -2.902447 0.255523 0.040448 0.021306
1.933333 0.402181 0.058623 -2.897910 0.257211 0.041197 0.009602
1.966667 0.410780 0.060007 -2.898240 0.258910 0.041963 0.001030
2.000000 0.419431 0.061420 -2.905001 0.260623 0.042743 -0.004408
2.033333 0.428144 0.062855 -2.906266 0.262351 0.043537 -0.004952
2.066667 0.436921 0.064312 -2.898197 0.264091 0.044343 -0.004119
2.100000 0.445747 0.065800 -2.909269 0.265841 0.045165 -0.002389
2.133333 0.454639 0.067313 -2.905233 0.267594 0.046005 0.001683
2.166667 0.463579 0.068859 -2.906490 0.269344 0.046868 0.006329
2.200000 0.472584 0.070431 -2.908844 0.271084 0.047757 0.007529
2.233333 0.481656 0.072030 -2.898766 0.272804 0.048677 0.000959
2.266667 0.490795 0.073656 -2.906226 0.274497 0.049629 -0.010645
2.300000 0.499979 0.075319 -2.898526 0.276155 0.050614 -0.032024
2.333333 0.509231 0.077011 -2.888021 0.277771 0.051635 -0.066833
2.366667 0.518528 0.078741 -2.895068 0.279340 0.052691 -0.118163
2.400000 0.527869 0.080510 -2.910559 0.280866 0.053783 -0.182979
2.433333 0.537279 0.082311 -2.907827 0.282351 0.054909 -0.258466
2.466667 0.546731 0.084152 -2.902410 0.283805 0.056067 -0.349017
2.500000 0.556225 0.086033 -2.896441 0.285241 0.057254 -0.452372
2.533333 0.565760 0.087956 -2.916307 0.286679 0.058464 -0.566447
2.566667 0.575335 0.089920 -2.956905 0.288133 0.059695 -0.686089
2.600000 0.584950 0.091928 -2.983295 0.289608 0.060942 -0.810305
2.633333 0.594604 0.093978 -3.016625 0.291116 0.062201 -0.931143
2.666667 0.604295 0.096072 -3.035213 0.292662 0.063470 -1.037219
2.700000 0.614059 0.098209 -3.072934 0.294242 0.064749 -1.116615
2.733333 0.623897 0.100391 -3.104294 0.295842 0.066040 -1.161098
2.766667 0.633771 0.102618 3.119825 0.297450 0.067343 -1.164823
2.800000 0.643717 0.104882 3.058230 0.299054 0.068661 -1.121066
2.833333 0.653734 0.107185 2.995455 0.300630 0.069998 -1.030357
2.866667 0.663820 0.109528 2.941038 0.302153 0.071357 -0.893143
2.900000 0.673938 0.111920 2.893685 0.303605 0.072744 -0.716697
2.933333 0.684087 0.114361 2.865009 0.304980 0.074161 -0.508128
2.966667 0.694298 0.116848 2.854157 0.306268 0.075613 -0.279341
3.000000 0.704569 0.119384 2.857101 0.307464 0.077103 -0.042977
3.033333 0.714866 0.121972 2.865929 0.308573 0.078632 0.187496
3.066667 0.725190 0.124611 2.893363 0.309602 0.080203 0.397467
3.100000 0.735538 0.127301 2.921601 0.310558 0.081816 0.576707
3.133333 0.745910 0.130045 2.951977 0.311441 0.083477 0.718171
3.166667 0.756304 0.132841 2.989607 0.312255 0.085189 0.819637
3.200000 0.766736 0.135699 3.039897 0.313004 0.086956 0.877194
3.233333 0.777200 0.138618 3.067120 0.313690 0.088784 0.896265
3.266667 0.787683 0.141591 3.105258 0.314310 0.090674 0.879700
3.300000 0.798190 0.144630 3.132929 0.314865 0.092624 0.842594
3.333333 0.808715 0.147733 -3.112783 0.315355 0.094630 0.804486
3.366667 0.819256 0.150893 -3.087243 0.315780 0.096684 0.796116
3.400000 0.829808 0.154132 -3.047265 0.316137 0.098776 0.858180
3.433333 0.840367 0.157451 -3.039150 0.316429 0.100901 1.015239
3.466667 0.850931 0.160851 -3.018504 0.316655 0.103050 1.304239
3.500000 0.861498 0.164335 -3.017788 0.316816 0.105221 1.740539
3.533333 0.872064 0.167902 -3.037333 0.316915 0.107407 2.327732
3.566667 0.882639 0.171527 -3.012021 0.316955 0.109606 3.042910
3.600000 0.893220 0.175211 -3.019309 0.316936 0.111816 3.849397
3.633333 0.903807 0.178952 -2.925319 0.316862 0.114031 4.712741
3.666667 0.914381 0.182784 -2.739637 0.316736 0.116250 5.575041
3.700000 0.924958 0.186674 -2.457576 0.316559 0.118471 6.377534
3.733333 0.935519 0.190657 -2.103465 0.316335 0.120693 7.056095
3.766667 0.946060 0.194732 -1.821120 0.316069 0.122908 7.571642
3.800000 0.956602 0.198866 -1.460531 0.315769 0.125109 7.884978
3.833333 0.967121 0.203092 -1.122762 0.315442 0.127287 7.974542
3.866667 0.977638 0.207376 -0.793017 0.315091 0.129433 7.842150
3.900000 0.988129 0.211750 -0.492662 0.314725 0.131537 7.511421
3.933333 0.998615 0.216182 -0.241954 0.314344 0.133595 7.029051
3.966667 1.009097 0.220671 -0.011027 0.313941 0.135612 6.428949
4.000000 1.019547 0.225247 0.205168 0.313509 0.137593 5.760467
4.033333 1.029989 0.229880 0.389858 0.313041 0.139546 5.065631
4.066667 1.040424 0.234569 0.524841 0.312532 0.141477 4.383356
4.100000 1.050850 0.239314 0.631753 0.311974 0.143395 3.744364
4.133333 1.061266 0.244115 0.723854 0.311368 0.145305 3.170197
4.166667 1.071672 0.248971 0.802516 0.310722 0.147200 2.690181
4.200000 1.082031 0.253909 0.875153 0.310039 0.149083 2.326722
4.233333 1.092378 0.258901 0.927140 0.309322 0.150953 2.097181
4.266667 1.102674 0.263974 0.950646 0.308571 0.152812 2.010084
4.300000 1.112917 0.269128 0.962576 0.307786 0.154661 2.068265
4.333333 1.123146 0.274334 0.976032 0.306965 0.156500 2.265619
4.366667 1.133359 0.279593 1.009866 0.306101 0.158338 2.582350
4.400000 1.143555 0.284903 1.067103 0.305184 0.160177 2.985576
4.433333 1.153735 0.290264 1.143323 0.304209 0.162022 3.441090
4.466667 1.163896 0.295676 1.258657 0.303171 0.163873 3.908639
4.500000 1.174040 0.301136 1.426647 0.302064 0.165732 4.340238
4.533333 1.184127 0.306676 1.631194 0.300886 0.167599 4.692626
4.566667 1.194156 0.312293 1.848896 0.299644 0.169471 4.931475
4.600000 1.204126 0.317984 2.076325 0.298349 0.171338 5.039340
4.633333 1.214035 0.323748 2.309245 0.297019 0.173190 5.001741
4.666667 1.223923 0.329558 2.523109 0.295669 0.175021 4.821150
4.700000 1.233750 0.335436 2.717060 0.294315 0.176823 4.522467
4.733333 1.243516 0.341380 2.846259 0.292971 0.178591 4.139374
4.766667 1.253223 0.347390 2.994276 0.291648 0.180323 3.704026
4.800000 1.262907 0.353440 3.112169 0.290347 0.182019 3.243062
4.833333 1.272568 0.359531 -3.106162 0.289068 0.183683 2.784836
4.866667 1.282205 0.365661 -3.043170 0.287810 0.185314 2.346506
4.900000 1.291790 0.371857 -3.006507 0.286572 0.186911 1.930504
4.933333 1.301325 0.378117 -2.976392 0.285354 0.188471 1.530340
4.966667 1.310812 0.384438 -2.939371 0.284153 0.189988 1.141994
5.000000 1.320252 0.390818 -2.894621 0.282972 0.191454 0.763429
5.033333 1.329646 0.397254 -2.829151 0.281819 0.192856 0.386443
5.066667 1.339015 0.403721 -2.779274 0.280699 0.194181 0.007193
5.100000 1.348341 0.410239 -2.767604 0.279616 0.195420 -0.369742
5.133333 1.357625 0.416804 -2.796621 0.278576 0.196563 -0.738524
5.166667 1.366884 0.423396 -2.855130 0.277578 0.197604 -1.087334
5.200000 1.376106 0.430029 -2.927019 0.276620 0.198541 -1.405876
5.233333 1.385302 0.436686 -3.014999 0.275697 0.199376 -1.674564
5.266667 1.394472 0.443366 -3.079846 0.274802 0.200112 -1.876803
5.300000 1.403618 0.450068 3.100452 0.273930 0.200755 -2.004114
5.333333 1.412739 0.456790 3.024266 0.273074 0.201308 -2.052508
5.366667 1.421827 0.463527 2.940472 0.272230 0.201778 -2.026443
5.400000 1.430886 0.470275 2.843585 0.271396 0.202170 -1.932505
5.433333 1.439918 0.477039 2.789406 0.270571 0.202491 -1.788606
5.466667 1.448922 0.483810 2.719846 0.269751 0.202745 -1.609131
5.500000 1.457897 0.490584 2.659685 0.268939 0.202942 -1.410115
5.533333 1.466843 0.497360 2.616391 0.268136 0.203087 -1.198946
5.566667 1.475765 0.504145 2.588269 0.267343 0.203186 -0.985650
5.600000 1.484660 0.510928 2.563934 0.266561 0.203243 -0.778871
5.633333 1.493529 0.517707 2.555727 0.265792 0.203263 -0.580385
5.666667 1.502374 0.524490 2.541295 0.265038 0.203246 -0.392247
5.700000 1.511194 0.531265 2.540595 0.264301 0.203195 -0.216258
5.733333 1.519990 0.538042 2.542805 0.263583 0.203107 -0.058762
5.766667 1.528761 0.544818 2.542674 0.262885 0.202983 0.080940
5.800000 1.537507 0.551593 2.528263 0.262208 0.202821 0.203284
5.833333 1.546228 0.558364 2.530910 0.261552 0.202619 0.308512
5.866667 1.554924 0.565131 2.562999 0.260918 0.202375 0.391558
5.900000 1.563603 0.571885 2.582415 0.260304 0.202088 0.454391
5.933333 1.572265 0.578625 2.623944 0.259712 0.201757 0.497514
5.966667 1.580912 0.585351 2.642668 0.259138 0.201381 0.520156
6.000000 1.589535 0.592067 2.673360 0.258584 0.200960 0.518646
6.033333 1.598144 0.598766 2.681977 0.258052 0.200495 0.494184
6.066667 1.606743 0.605449 2.697074 0.257542 0.199984 0.454983
6.100000 1.615316 0.612117 2.717314 0.257056 0.199429 0.402359
6.133333 1.623864 0.618766 2.740764 0.256597 0.198826 0.340922
6.166667 1.632404 0.625395 2.746135 0.256165 0.198176 0.270430
6.200000 1.640919 0.632003 2.752524 0.255760 0.197476 0.195197
6.233333 1.649428 0.638586 2.751401 0.255379 0.196726 0.111652
6.266667 1.657933 0.645143 2.749353 0.255018 0.195925 0.014129
6.300000 1.666412 0.651675 2.752034 0.254668 0.195074 -0.094989
6.333333 1.674889 0.658176 2.748523 0.254322 0.194176 -0.214321
6.366667 1.683365 0.664644 2.750068 0.253972 0.193231 -0.338019
6.400000 1.691839 0.671077 2.767196 0.253608 0.192243 -0.462849
6.433333 1.700313 0.677473 2.752819 0.253220 0.191215 -0.577761
6.466667 1.708759 0.683837 2.731562 0.252798 0.190149 -0.672946
6.500000 1.717178 0.690166 2.681555 0.252339 0.189047 -0.741639
6.533333 1.725594 0.696455 2.633470 0.251836 0.187910 -0.777901
6.566667 1.733982 0.702707 2.572612 0.251285 0.186739 -0.778863
6.600000 1.742364 0.708919 2.532339 0.250691 0.185535 -0.738976
6.633333 1.750716 0.715091 2.514909 0.250060 0.184295 -0.665062
6.666667 1.759060 0.721222 2.482155 0.249399 0.183018 -0.564805
6.700000 1.767374 0.727311 2.459136 0.248713 0.181702 -0.453372
6.733333 1.775657 0.733355 2.440350 0.248015 0.180342 -0.343598
6.766667 1.783910 0.739353 2.446167 0.247310 0.178936 -0.246495
6.800000 1.792132 0.745304 2.464132 0.246606 0.177479 -0.176366
6.833333 1.800336 0.751209 2.489702 0.245905 0.175967 -0.138678
6.866667 1.808508 0.757063 2.499106 0.245215 0.174397 -0.136329
6.900000 1.816662 0.762866 2.478928 0.244539 0.172763 -0.161579
6.933333 1.824798 0.768614 2.487902 0.243874 0.171062 -0.209369
6.966667 1.832915 0.774305 2.488694 0.243223 0.169291 -0.273652
7.000000 1.841013 0.779936 2.480443 0.242578 0.167447 -0.344589
7.033333 1.849094 0.785503 2.446655 0.241933 0.165534 -0.411243
7.066667 1.857157 0.791003 2.418095 0.241278 0.163552 -0.465839
7.100000 1.865183 0.796445 2.397674 0.240604 0.161509 -0.508572
7.133333 1.873192 0.801812 2.378413 0.239903 0.159406 -0.536598
7.166667 1.881184 0.807103 2.354636 0.239170 0.157251 -0.544987
7.200000 1.889158 0.812314 2.339044 0.238401 0.155049 -0.534560
7.233333 1.897115 0.817443 2.314626 0.237593 0.152803 -0.508855
7.266667 1.905031 0.822506 2.307276 0.236744 0.150520 -0.471494
7.300000 1.912928 0.827483 2.287481 0.235852 0.148205 -0.420074
7.333333 1.920783 0.832392 2.273599 0.234912 0.145864 -0.355848
7.366667 1.928594 0.837232 2.254126 0.233920 0.143504 -0.286341
7.400000 1.936384 0.841981 2.244379 0.232871 0.141131 -0.214308
7.433333 1.944128 0.846659 2.223905 0.231762 0.138748 -0.142921
7.466667 1.951850 0.851243 2.215905 0.230592 0.136360 -0.072454
7.500000 1.959549 0.855734 2.236353 0.229358 0.133969 -0.012478
7.533333 1.967199 0.860150 2.236860 0.228061 0.131577 0.033240
7.566667 1.974799 0.864492 2.247974 0.226706 0.129181 0.063548
7.600000 1.982349 0.868757 2.259772 0.225298 0.126780 0.077972
7.633333 1.989846 0.872946 2.272953 0.223845 0.124370 0.074625
7.666667 1.997290 0.877056 2.282890 0.222358 0.121945 0.049321
7.700000 2.004680 0.881088 2.282136 0.220850 0.119497 0.011244
7.733333 2.012014 0.885041 2.277159 0.219331 0.117019 -0.038514
7.766667 2.019292 0.888913 2.275386 0.217809 0.114508 -0.096081
7.800000 2.026512 0.892703 2.283579 0.216285 0.111961 -0.161917
7.833333 2.033673 0.896412 2.255179 0.214760 0.109377 -0.229748
7.866667 2.040804 0.900024 2.246840 0.213227 0.106759 -0.289682
7.900000 2.047904 0.903538 2.237361 0.211676 0.104113 -0.336969
7.933333 2.054941 0.906969 2.236907 0.210096 0.101443 -0.354741
7.966667 2.061946 0.910301 2.229319 0.208475 0.098756 -0.327507
8.000000 2.068885 0.913548 2.202255 0.206805 0.096056 -0.229226
8.033333 2.075758 0.916708 2.181045 0.205082 0.093345 -0.043855
8.066667 2.082595 0.919770 2.147655 0.203302 0.090626 0.242530
8.100000 2.089363 0.922745 2.132433 0.201471 0.087897 0.637556
8.133333 2.096060 0.925632 2.105842 0.199588 0.085158 1.134485
8.166667 2.102686 0.928430 2.092492 0.197664 0.082406 1.714510
8.200000 2.109239 0.931138 2.112663 0.195704 0.079638 2.332976
8.233333 2.115718 0.933757 2.168118 0.193716 0.076854 2.940673
8.266667 2.122147 0.936277 2.322101 0.191705 0.074053 3.472705
8.300000 2.128498 0.938707 2.494090 0.189676 0.071234 3.863437
8.333333 2.134797 0.941037 2.722218 0.187640 0.068397 4.045035
8.366667 2.141041 0.943266 2.944386 0.185594 0.065544 3.968798
8.400000 2.147203 0.945402 -3.111087 0.183536 0.062676 3.615571
8.433333 2.153284 0.947445 -2.884448 0.181460 0.059794 2.986254
8.466667 2.159279 0.949396 -2.654619 0.179365 0.056898 2.116305
8.500000 2.165218 0.951250 -2.521049 0.177242 0.053989 1.058835
8.533333 2.171099 0.953005 -2.491562 0.175080 0.051066 -0.105694
8.566667 2.176921 0.954660 -2.554933 0.172873 0.048129 -1.294497
8.600000 2.182653 0.956221 -2.685997 0.170622 0.045175 -2.428106
8.633333 2.188323 0.957681 -2.882852 0.168319 0.042202 -3.428822
8.666667 2.193930 0.959039 -3.110304 0.165956 0.039213 -4.236439
8.700000 2.199441 0.960301 2.924872 0.163529 0.036209 -4.805228
8.733333 2.204856 0.961470 2.686171 0.161038 0.033190 -5.116665
8.766667 2.210201 0.962525 2.442589 0.158481 0.030161 -5.172480
8.800000 2.215445 0.963485 2.266715 0.155853 0.027128 -4.995769
8.833333 2.220613 0.964335 2.058065 0.153156 0.024094 -4.621063
8.866667 2.225679 0.965089 1.885519 0.150390 0.021064 -4.096306
8.900000 2.230660 0.965736 1.728293 0.147556 0.018043 -3.471165
