t x y theta dxdt dydt dthetadt
0.000000 0.000000 0.000000 -0.024191 0.003538 0.003352 -0.000165
0.033333 0.000442 0.000072 -0.025145 0.005477 0.004661 0.009052
0.066667 0.000802 0.000110 -0.012321 0.008635 0.006375 0.021859
0.100000 0.000966 0.000139 -0.016693 0.013843 0.008643 0.039961
0.133333 0.000815 0.000296 -0.031109 0.021853 0.011590 0.067034
0.166667 0.000935 0.000589 -0.023920 0.033686 0.015427 0.104334
0.200000 0.001180 0.000806 -0.023243 0.050753 0.020485 0.150043
0.233333 0.001686 0.001296 -0.015058 0.074546 0.027052 0.200778
0.266667 0.002717 0.001942 -0.012328 0.106656 0.035475 0.255940
0.300000 0.005137 0.003031 -0.011552 0.147773 0.045888 0.312394
0.333333 0.008076 0.004217 -0.005334 0.198494 0.058434 0.363066
0.366667 0.011545 0.005503 0.017644 0.258739 0.073127 0.404105
0.400000 0.015556 0.006888 0.033407 0.327493 0.089743 0.433721
0.433333 0.026338 0.009870 0.065697 0.403160 0.107983 0.451741
0.466667 0.037675 0.012955 0.093211 0.483763 0.127395 0.456684
0.500000 0.055827 0.017540 0.114371 0.566938 0.147468 0.445411
0.533333 0.079718 0.023457 0.130233 0.650141 0.167557 0.422072
0.566667 0.104151 0.029477 0.135965 0.730970 0.186947 0.388052
0.600000 0.131631 0.036636 0.137223 0.807630 0.204912 0.344457
0.633333 0.163109 0.044659 0.163116 0.879092 0.220898 0.292501
0.666667 0.195086 0.052775 0.159462 0.944544 0.234435 0.236076
0.700000 0.230644 0.061871 0.168981 1.004340 0.245178 0.179368
0.733333 0.266662 0.071049 0.184417 1.059322 0.253044 0.121376
0.766667 0.303118 0.080300 0.185802 1.110329 0.258027 0.063760
0.800000 0.339990 0.089618 0.189667 1.157924 0.260370 0.005874
0.833333 0.377256 0.098996 0.186715 1.202735 0.260325 -0.048342
0.866667 0.417218 0.108117 0.190724 1.245108 0.258154 -0.100370
0.900000 0.458974 0.116863 0.172171 1.284568 0.254330 -0.149029
0.933333 0.505262 0.125210 0.170873 1.320056 0.249238 -0.190328
0.966667 0.551839 0.133594 0.151961 1.350675 0.243368 -0.221521
1.000000 0.598672 0.142009 0.149193 1.375676 0.237087 -0.239982
1.033333 0.647674 0.149637 0.135608 1.393861 0.230766 -0.246502
1.066667 0.696868 0.157287 0.125197 1.404012 0.224745 -0.241168
1.100000 0.745975 0.164103 0.111395 1.405349 0.219198 -0.223599
1.133333 0.795204 0.170931 0.102709 1.397299 0.214179 -0.196787
1.166667 0.844522 0.177767 0.088342 1.379280 0.209667 -0.164556
1.200000 0.892813 0.184417 0.099990 1.350807 0.205658 -0.130041
1.233333 0.936661 0.191112 0.073494 1.311678 0.201920 -0.093867
1.266667 0.980502 0.197800 0.080279 1.262144 0.198166 -0.059663
1.300000 1.024307 0.204475 0.088205 1.202885 0.194033 -0.033087
1.333333 1.068047 0.211135 0.094409 1.135252 0.189293 -0.014189
1.366667 1.111695 0.217774 0.093314 1.060604 0.183718 -0.005192
1.400000 1.148050 0.224240 0.096252 0.980614 0.177036 -0.003989
1.433333 1.178557 0.230529 0.094229 0.897487 0.169264 -0.014872
1.466667 1.202840 0.236197 0.091655 0.814279 0.160627 -0.032133
1.500000 1.226960 0.241821 0.100263 0.733926 0.151458 -0.049837
1.533333 1.250909 0.247400 0.104790 0.658855 0.142044 -0.069103
1.566667 1.269561 0.251853 0.107187 0.591913 0.132761 -0.087687
1.600000 1.282412 0.255220 0.089473 0.535742 0.124209 -0.106357
1.633333 1.295087 0.258531 0.061024 0.491939 0.116872 -0.119611
1.666667 1.307591 0.261786 0.070758 0.460778 0.111108 -0.131259
1.700000 1.319928 0.264983 0.062108 0.441845 0.107184 -0.140488
1.733333 1.330754 0.267802 0.067095 0.434823 0.105389 -0.145681
1.766667 1.342703 0.270784 0.058887 0.438777 0.105931 -0.144638
1.800000 1.354500 0.273708 0.062450 0.451881 0.108646 -0.137583
1.833333 1.370197 0.277127 0.057748 0.472165 0.113276 -0.128475
1.866667 1.385745 0.280489 0.049796 0.497819 0.119488 -0.114261
1.900000 1.401144 0.283793 0.041049 0.527632 0.127063 -0.099766
1.933333 1.418972 0.288141 0.025318 0.559947 0.135637 -0.083946
1.966667 1.438894 0.292870 0.021646 0.593249 0.144789 -0.068783
2.000000 1.460704 0.298271 0.022415 0.626534 0.154212 -0.053757
2.033333 1.482349 0.303610 0.033284 0.659659 0.163730 -0.038643
2.066667 1.503821 0.308882 0.029197 0.692916 0.173229 -0.026047
2.100000 1.529356 0.315506 0.032658 0.725704 0.182336 -0.013006
2.133333 1.554698 0.322057 0.035425 0.758135 0.190837 -0.001323
2.166667 1.579835 0.328531 0.038983 0.790144 0.198509 0.008265
2.200000 1.604757 0.334924 0.043584 0.822074 0.205084 0.014878
2.233333 1.632649 0.342107 0.029281 0.853666 0.210174 0.021036
2.266667 1.660298 0.349200 0.020421 0.884139 0.213383 0.028330
2.300000 1.692457 0.357304 0.027446 0.913201 0.214226 0.033545
2.333333 1.724335 0.365307 0.030867 0.940020 0.212222 0.037294
2.366667 1.755912 0.373204 0.036197 0.963975 0.206951 0.039386
2.400000 1.790297 0.381058 0.034893 0.983881 0.198265 0.041036
2.433333 1.824337 0.388794 0.043295 0.999094 0.186163 0.038174
2.466667 1.859986 0.395826 0.047217 1.008968 0.170451 0.028220
2.500000 1.895241 0.402728 0.051680 1.013396 0.151366 0.014395
2.533333 1.930882 0.407475 0.051814 1.012279 0.129088 -0.003212
2.566667 1.966079 0.412082 0.048420 1.005520 0.103799 -0.022795
2.600000 2.000805 0.416546 0.051639 0.993521 0.075359 -0.046087
2.633333 2.033993 0.417163 0.035550 0.976510 0.043870 -0.066459
2.666667 2.066661 0.417634 0.041767 0.955248 0.009842 -0.080671
2.700000 2.098785 0.417957 0.035894 0.930180 -0.026103 -0.088231
2.733333 2.130342 0.418134 0.037597 0.902032 -0.063289 -0.089618
2.766667 2.161306 0.418165 0.024528 0.871426 -0.100923 -0.084221
2.800000 2.190457 0.415018 0.018843 0.839013 -0.137625 -0.069529
2.833333 2.217992 0.408690 0.010806 0.805357 -0.172379 -0.050105
2.866667 2.243694 0.400038 0.016437 0.770809 -0.204057 -0.027857
2.900000 2.268721 0.391260 0.011399 0.735638 -0.231786 -0.004043
2.933333 2.291891 0.380346 0.004310 0.700089 -0.254455 0.022107
2.966667 2.314352 0.369326 0.013912 0.664629 -0.271196 0.047435
3.000000 2.336085 0.358213 0.027729 0.629398 -0.281748 0.067857
3.033333 2.357074 0.347017 0.025864 0.594470 -0.286018 0.081958
3.066667 2.376698 0.336032 0.030011 0.559876 -0.284547 0.088867
3.100000 2.394201 0.326404 0.032199 0.525713 -0.277925 0.087178
3.133333 2.410913 0.316726 0.033026 0.491811 -0.267193 0.075315
3.166667 2.426820 0.307009 0.043084 0.457889 -0.253277 0.055696
3.200000 2.441365 0.298920 0.050617 0.423461 -0.236793 0.034705
3.233333 2.455079 0.290809 0.051010 0.388102 -0.218179 0.017771
3.266667 2.467252 0.284293 0.052546 0.350862 -0.197264 0.010185
3.300000 2.478571 0.277769 0.056411 0.310658 -0.173784 0.017185
3.333333 2.488651 0.272094 0.044549 0.266761 -0.147527 0.045630
3.366667 2.498014 0.266876 0.036212 0.218132 -0.117955 0.098360
3.400000 2.506619 0.262121 0.026099 0.164205 -0.084603 0.174107
3.433333 2.513805 0.258242 0.018281 0.104410 -0.046822 0.268164
3.466667 2.518412 0.256042 0.014993 0.039140 -0.004457 0.374172
3.500000 2.522110 0.253860 0.027336 -0.031140 0.042594 0.481767
3.533333 2.519986 0.255801 0.053615 -0.105883 0.094572 0.575918
3.566667 2.516945 0.257756 0.088100 -0.184070 0.151169 0.644198
3.600000 2.506858 0.265211 0.122731 -0.264074 0.211282 0.673316
3.633333 2.495861 0.272667 0.163990 -0.344221 0.273503 0.657065
3.666667 2.483962 0.280114 0.217588 -0.423265 0.336464 0.589345
3.700000 2.467588 0.291912 0.253638 -0.499666 0.398430 0.473080
3.733333 2.447725 0.307360 0.291478 -0.572147 0.457199 0.316086
3.766667 2.426183 0.325427 0.301835 -0.639503 0.510139 0.131207
3.800000 2.401994 0.346792 0.302690 -0.701634 0.555532 -0.065285
3.833333 2.376969 0.368064 0.275444 -0.758460 0.591409 -0.258225
3.866667 2.349551 0.391641 0.256405 -0.809725 0.615360 -0.427723
3.900000 2.319480 0.416404 0.228257 -0.855620 0.625143 -0.560507
3.933333 2.288639 0.440997 0.180536 -0.896588 0.619751 -0.645255
3.966667 2.257051 0.465393 0.149582 -0.933079 0.598999 -0.681891
4.000000 2.224741 0.489565 0.105178 -0.965596 0.562431 -0.670779
4.033333 2.191735 0.513488 0.059725 -0.994655 0.510420 -0.618849
4.066667 2.158586 0.532646 0.035276 -1.021505 0.444580 -0.539999
4.100000 2.123178 0.547756 0.030095 -1.047267 0.367630 -0.448592
4.133333 2.087157 0.562549 0.013573 -1.073106 0.281396 -0.358962
4.166667 2.050617 0.572144 0.005697 -1.100291 0.188334 -0.278079
4.200000 2.014273 0.576679 0.025186 -1.129489 0.091795 -0.218366
4.233333 1.977346 0.575334 0.032900 -1.161353 -0.004810 -0.182621
4.266667 1.939925 0.573635 0.041775 -1.195741 -0.098895 -0.171125
4.300000 1.902220 0.567079 0.043275 -1.232645 -0.188701 -0.176760
4.333333 1.860981 0.555508 0.042127 -1.271184 -0.271633 -0.194920
4.366667 1.819339 0.543596 0.024449 -1.310448 -0.346288 -0.220198
4.400000 1.773750 0.527321 0.008290 -1.349374 -0.412236 -0.238738
4.433333 1.727829 0.510726 -0.016025 -1.386904 -0.469975 -0.246767
4.466667 1.677943 0.491131 -0.029061 -1.421851 -0.519440 -0.236701
4.500000 1.627801 0.471247 -0.040159 -1.452748 -0.560978 -0.211443
4.533333 1.577444 0.451090 -0.065831 -1.478733 -0.595833 -0.169802
4.566667 1.526911 0.430679 -0.055517 -1.498958 -0.624853 -0.117950
4.600000 1.475237 0.408173 -0.071975 -1.513136 -0.648764 -0.063620
4.633333 1.423470 0.385449 -0.059171 -1.520981 -0.667839 -0.010439
4.666667 1.371652 0.362529 -0.054685 -1.522740 -0.682684 0.033454
4.700000 1.319822 0.339432 -0.046363 -1.518918 -0.693600 0.066209
4.733333 1.267925 0.314688 -0.029846 -1.509887 -0.700201 0.081932
4.766667 1.216100 0.289811 -0.031442 -1.496028 -0.702104 0.085457
4.800000 1.164388 0.264820 -0.012435 -1.477602 -0.699030 0.075112
4.833333 1.114267 0.240146 -0.016635 -1.454994 -0.690739 0.052957
4.866667 1.066931 0.216736 -0.020225 -1.428848 -0.677432 0.023071
4.900000 1.019823 0.193279 -0.028745 -1.399499 -0.658954 -0.009467
4.933333 0.972978 0.169796 -0.027492 -1.367693 -0.636093 -0.037115
4.966667 0.926432 0.146307 -0.015380 -1.334026 -0.609403 -0.059675
5.000000 0.882273 0.126138 -0.019148 -1.299179 -0.579562 -0.071861
5.033333 0.838478 0.106002 -0.030516 -1.263468 -0.547095 -0.071733
5.066667 0.798722 0.090742 -0.046209 -1.226394 -0.512368 -0.059432
5.100000 0.759388 0.075546 -0.053460 -1.186989 -0.476346 -0.038017
5.133333 0.720503 0.060423 -0.051779 -1.143973 -0.439471 -0.010597
5.166667 0.682095 0.045385 -0.055350 -1.096376 -0.402668 0.019890
5.200000 0.644188 0.030445 -0.058558 -1.041808 -0.366198 0.051542
5.233333 0.609103 0.019586 -0.052393 -0.978460 -0.330859 0.080006
5.266667 0.574569 0.008844 -0.047141 -0.904324 -0.296760 0.107646
5.300000 0.542441 0.001127 -0.025129 -0.818260 -0.263877 0.135952
5.333333 0.510904 -0.006463 -0.017839 -0.719143 -0.232188 0.168018
5.366667 0.481555 -0.012879 -0.003955 -0.605839 -0.201510 0.209749
5.400000 0.458958 -0.018309 -0.012345 -0.479511 -0.172080 0.260546
5.433333 0.447270 -0.022877 -0.007245 -0.341287 -0.143397 0.323961
5.466667 0.436218 -0.027299 -0.002641 -0.193782 -0.115561 0.394195
5.500000 0.425801 -0.031577 -0.016033 -0.039850 -0.088618 0.467200
5.533333 0.428985 -0.034355 -0.002613 0.116663 -0.063069 0.535025
5.566667 0.432785 -0.036984 0.001184 0.272170 -0.039245 0.588421
5.600000 0.447249 -0.037842 0.049031 0.423224 -0.017663 0.616701
5.633333 0.472050 -0.036630 0.098940 0.566313 0.000696 0.608968
5.666667 0.497381 -0.035270 0.145212 0.698576 0.014260 0.557960
5.700000 0.523202 -0.033767 0.200408 0.816865 0.021026 0.457737
5.733333 0.556219 -0.030279 0.207029 0.919459 0.019758 0.310929
5.766667 0.594296 -0.026100 0.224760 1.004132 0.009096 0.121917
5.800000 0.632722 -0.021795 0.237675 1.070409 -0.011959 -0.092370
5.833333 0.674264 -0.019369 0.219132 1.118760 -0.043921 -0.314682
5.866667 0.717190 -0.020984 0.212200 1.149975 -0.085492 -0.528553
5.900000 0.760301 -0.022490 0.197434 1.166071 -0.134155 -0.720428
5.933333 0.803539 -0.023890 0.130457 1.167920 -0.187471 -0.885852
5.966667 0.846847 -0.025186 0.077204 1.156184 -0.242715 -1.026076
6.000000 0.887787 -0.035105 0.010375 1.129984 -0.296224 -1.149134
6.033333 0.922837 -0.053179 -0.043914 1.088599 -0.344144 -1.268532
6.066667 0.957803 -0.071134 -0.085415 1.030551 -0.383544 -1.397316
6.100000 0.992637 -0.088956 -0.093545 0.953889 -0.412196 -1.546773
6.133333 1.027291 -0.106631 -0.122152 0.858237 -0.427702 -1.723548
6.166667 1.061715 -0.124142 -0.152643 0.744252 -0.427660 -1.925799
6.200000 1.095863 -0.141477 -0.196504 0.614043 -0.411821 -2.148132
6.233333 1.129686 -0.158619 -0.262413 0.467974 -0.380871 -2.377234
6.266667 1.147535 -0.174809 -0.351834 0.309161 -0.336224 -2.594030
6.300000 1.152988 -0.188529 -0.453253 0.141172 -0.279374 -2.776206
6.333333 1.147072 -0.197917 -0.584723 -0.031835 -0.213018 -2.905031
6.366667 1.140726 -0.207084 -0.721804 -0.205512 -0.140561 -2.967888
6.400000 1.124784 -0.210059 -0.880608 -0.375459 -0.064842 -2.954413
6.433333 1.108409 -0.212810 -1.017005 -0.536166 0.011281 -2.862420
6.466667 1.085805 -0.209874 -1.122100 -0.685013 0.085113 -2.694547
6.500000 1.055681 -0.201389 -1.200974 -0.819676 0.153664 -2.460153
6.533333 1.025156 -0.192700 -1.267847 -0.940122 0.214641 -2.168991
6.566667 0.987704 -0.180333 -1.327653 -1.046380 0.265914 -1.827950
6.600000 0.949897 -0.167790 -1.385835 -1.140020 0.306359 -1.452175
6.633333 0.905036 -0.153674 -1.424900 -1.221305 0.334767 -1.052719
6.666667 0.859884 -0.139415 -1.462108 -1.290178 0.350791 -0.644411
6.700000 0.814474 -0.125031 -1.496392 -1.347125 0.354483 -0.238166
6.733333 0.768844 -0.110536 -1.512208 -1.391792 0.346459 0.153772
6.766667 0.717431 -0.097500 -1.527386 -1.424460 0.328053 0.516645
6.800000 0.665875 -0.084387 -1.484338 -1.444307 0.299922 0.841583
6.833333 0.614221 -0.071212 -1.422560 -1.452573 0.263783 1.118875
6.866667 0.562860 -0.063334 -1.341462 -1.450058 0.221352 1.343938
6.900000 0.511487 -0.055417 -1.229940 -1.437057 0.174812 1.508306
6.933333 0.460145 -0.047471 -1.160895 -1.413523 0.125996 1.613554
6.966667 0.413321 -0.045781 -1.096235 -1.379759 0.076838 1.658687
7.000000 0.366611 -0.044072 -1.046368 -1.336495 0.029860 1.652387
7.033333 0.322616 -0.047502 -0.992670 -1.283820 -0.012215 1.607368
7.066667 0.278809 -0.050912 -0.953741 -1.221773 -0.047559 1.533956
7.100000 0.235226 -0.054298 -0.906157 -1.150440 -0.074622 1.446624
7.133333 0.196167 -0.059978 -0.858068 -1.070572 -0.091621 1.349694
7.166667 0.160733 -0.066830 -0.826605 -0.982620 -0.097684 1.257188
7.200000 0.125617 -0.073639 -0.774496 -0.887147 -0.092410 1.170622
7.233333 0.095064 -0.079846 -0.729245 -0.785321 -0.076802 1.088796
7.266667 0.068773 -0.084897 -0.679792 -0.678771 -0.051565 1.014070
7.300000 0.047882 -0.088402 -0.672869 -0.570335 -0.018114 0.952550
7.333333 0.030946 -0.089412 -0.635954 -0.462816 0.021156 0.909289
7.366667 0.020298 -0.087787 -0.594068 -0.359329 0.063752 0.880684
7.400000 0.010048 -0.086093 -0.576256 -0.263367 0.106647 0.868610
7.433333 0.005669 -0.081329 -0.575531 -0.177944 0.147209 0.876909
7.466667 0.005887 -0.073673 -0.569497 -0.105879 0.182310 0.904375
7.500000 0.009068 -0.064038 -0.548017 -0.048444 0.209412 0.939606
7.533333 0.014254 -0.052695 -0.508655 -0.006442 0.226680 0.979056
7.566667 0.020142 -0.040790 -0.471128 0.020231 0.232932 1.022149
7.600000 0.025182 -0.029394 -0.406582 0.032732 0.227875 1.062505
7.633333 0.027820 -0.019474 -0.353831 0.033120 0.211739 1.089739
7.666667 0.030766 -0.009557 -0.320819 0.024389 0.186217 1.097482
7.700000 0.034008 0.000346 -0.284383 0.009326 0.153083 1.086485
7.733333 0.032699 0.004723 -0.256614 -0.008863 0.114829 1.056942
7.766667 0.031669 0.009067 -0.213429 -0.027392 0.074035 1.005604
7.800000 0.027169 0.006981 -0.170553 -0.043753 0.033723 0.937335
7.833333 0.022940 0.004857 -0.147384 -0.056492 -0.003367 0.859540
7.866667 0.018980 0.002698 -0.116337 -0.064867 -0.035360 0.775402
7.900000 0.015285 0.000505 -0.086627 -0.068353 -0.060544 0.689014
7.933333 0.011774 -0.004430 -0.065990 -0.067433 -0.078392 0.598630
7.966667 0.009383 -0.010673 -0.045201 -0.062769 -0.088677 0.510668
8.000000 0.007489 -0.016394 -0.030025 -0.055580 -0.092472 0.426135
8.033333 0.005844 -0.022131 -0.027047 -0.046792 -0.090841 0.344432
8.066667 0.004818 -0.025789 -0.009660 -0.037358 -0.084963 0.269498
