t x y theta dxdt dydt dthetadt
0.000000 0.000000 0.000000 -0.009517 -0.000209 0.005762 -0.013303
0.033333 -0.000112 0.000138 -0.006852 -0.000687 0.009849 -0.025963
0.066667 -0.000045 0.000266 -0.019044 -0.001717 0.015707 -0.041829
0.100000 -0.000202 0.000611 -0.007690 -0.003509 0.024005 -0.064516
0.133333 -0.000169 0.000945 -0.002543 -0.006378 0.035850 -0.090079
0.166667 0.000057 0.001264 -0.009209 -0.010698 0.052487 -0.117657
0.200000 0.000119 0.002186 -0.006748 -0.016692 0.074667 -0.142063
0.233333 -0.000216 0.003385 -0.007147 -0.024634 0.103137 -0.160305
0.266667 -0.000343 0.004566 -0.028908 -0.034804 0.138701 -0.169682
0.300000 -0.001487 0.007686 -0.031472 -0.047152 0.181193 -0.164225
0.333333 -0.002962 0.013575 -0.051070 -0.061164 0.229246 -0.142852
0.366667 -0.004209 0.019433 -0.060818 -0.075644 0.280459 -0.106226
0.400000 -0.005222 0.025255 -0.071446 -0.089081 0.332350 -0.057146
0.433333 -0.008041 0.036192 -0.080552 -0.099205 0.381600 0.001421
0.466667 -0.012396 0.052481 -0.088821 -0.103599 0.424442 0.067677
0.500000 -0.019231 0.074000 -0.077642 -0.099969 0.457411 0.138752
0.533333 -0.025791 0.095425 -0.060745 -0.086512 0.478087 0.209896
0.566667 -0.032062 0.116731 -0.037567 -0.062311 0.485117 0.279338
0.600000 -0.038035 0.137896 -0.024322 -0.026672 0.477459 0.345039
0.633333 -0.043697 0.158896 -0.004752 0.019945 0.455396 0.404238
0.666667 -0.047595 0.178979 -0.000702 0.076649 0.420189 0.450827
0.700000 -0.047269 0.195177 0.005946 0.142259 0.373773 0.482007
0.733333 -0.041570 0.206287 0.011556 0.215602 0.317925 0.498369
0.766667 -0.027869 0.211901 0.026421 0.295361 0.254340 0.501142
0.800000 -0.013849 0.217259 0.065017 0.379597 0.185068 0.490371
0.833333 0.000478 0.222356 0.106495 0.466588 0.111975 0.467509
0.866667 0.015104 0.227184 0.127093 0.555127 0.036267 0.439976
0.900000 0.030019 0.231737 0.143961 0.644094 -0.041175 0.410823
0.933333 0.052440 0.230457 0.150803 0.732213 -0.119293 0.384326
0.966667 0.080226 0.224105 0.161578 0.818712 -0.197063 0.364131
1.000000 0.108243 0.217473 0.151080 0.903440 -0.273629 0.356678
1.033333 0.141225 0.206188 0.162585 0.985758 -0.347926 0.363709
1.066667 0.177647 0.191206 0.159048 1.064509 -0.418341 0.383171
1.100000 0.216343 0.173324 0.159645 1.138435 -0.483102 0.410930
1.133333 0.257185 0.153107 0.169730 1.206857 -0.540969 0.439791
1.166667 0.301201 0.131222 0.187107 1.269234 -0.591172 0.460861
1.200000 0.346820 0.108001 0.220754 1.324348 -0.632921 0.462416
1.233333 0.392419 0.084601 0.253660 1.371387 -0.666025 0.441799
1.266667 0.439824 0.060426 0.289825 1.409720 -0.690811 0.390644
1.300000 0.487118 0.036117 0.322123 1.439080 -0.708053 0.308828
1.333333 0.538577 0.011066 0.338287 1.458154 -0.718080 0.200254
1.366667 0.589830 -0.014074 0.331285 1.465733 -0.721069 0.075748
1.400000 0.642442 -0.039070 0.343769 1.460403 -0.717166 -0.052962
1.433333 0.694747 -0.064106 0.321953 1.441673 -0.706676 -0.176192
1.466667 0.746692 -0.089157 0.313508 1.409398 -0.689994 -0.277630
1.500000 0.798227 -0.114201 0.281492 1.363266 -0.667302 -0.345743
1.533333 0.849300 -0.139212 0.256262 1.304536 -0.639491 -0.376731
1.566667 0.892009 -0.161054 0.244388 1.235014 -0.607756 -0.375921
1.600000 0.933222 -0.181119 0.199153 1.158402 -0.574057 -0.343441
1.633333 0.973840 -0.201083 0.169118 1.078092 -0.540233 -0.286597
1.666667 1.006783 -0.216848 0.165710 0.997830 -0.508269 -0.212356
1.700000 1.039056 -0.232476 0.168323 0.921362 -0.480151 -0.130050
1.733333 1.062155 -0.244379 0.177138 0.852522 -0.457575 -0.045233
1.766667 1.084527 -0.256114 0.200469 0.793547 -0.441402 0.041449
1.800000 1.106147 -0.267673 0.208953 0.744747 -0.431415 0.119866
1.833333 1.126992 -0.279043 0.213069 0.705289 -0.426928 0.187065
1.866667 1.145022 -0.291350 0.212824 0.672883 -0.426251 0.238653
1.900000 1.163929 -0.305345 0.205661 0.644522 -0.427240 0.274613
1.933333 1.185094 -0.320966 0.210418 0.615354 -0.427090 0.296188
1.966667 1.209433 -0.337938 0.227787 0.580989 -0.423280 0.303233
2.000000 1.232873 -0.354656 0.256045 0.537541 -0.413595 0.302580
2.033333 1.255384 -0.371104 0.281263 0.482397 -0.396351 0.297303
2.066667 1.276938 -0.387264 0.292963 0.413560 -0.370573 0.293011
2.100000 1.297508 -0.403120 0.308364 0.330477 -0.336199 0.292070
2.133333 1.312292 -0.416286 0.298932 0.234229 -0.293980 0.299300
2.166667 1.320487 -0.426746 0.317268 0.127048 -0.245138 0.320771
2.200000 1.322385 -0.434185 0.310730 0.012236 -0.191642 0.359816
2.233333 1.316350 -0.437739 0.312418 -0.106787 -0.135563 0.415651
2.266667 1.309260 -0.440928 0.312887 -0.226049 -0.079162 0.486187
2.300000 1.301112 -0.443748 0.307945 -0.342430 -0.024213 0.572530
2.333333 1.284295 -0.441530 0.332357 -0.453239 0.027671 0.666342
2.366667 1.266431 -0.438939 0.375519 -0.557049 0.075407 0.757336
2.400000 1.241258 -0.432721 0.410241 -0.652935 0.118352 0.834689
2.433333 1.215063 -0.426133 0.449168 -0.740853 0.156438 0.894405
2.466667 1.187861 -0.419183 0.486088 -0.820832 0.189829 0.931390
2.500000 1.159668 -0.411875 0.540576 -0.892603 0.218648 0.934409
2.533333 1.127517 -0.403471 0.584273 -0.956525 0.243541 0.904531
2.566667 1.094413 -0.394722 0.598214 -1.012368 0.264973 0.848447
2.600000 1.057679 -0.385135 0.625936 -1.060539 0.283751 0.772444
2.633333 1.018355 -0.374801 0.672491 -1.101284 0.300399 0.681092
2.666667 0.978149 -0.364145 0.693831 -1.135096 0.315406 0.580511
2.700000 0.937088 -0.353175 0.708153 -1.162458 0.329200 0.483488
2.733333 0.895198 -0.341900 0.717312 -1.183546 0.341909 0.395258
2.766667 0.855755 -0.330579 0.714873 -1.199080 0.353657 0.316931
2.800000 0.815636 -0.318482 0.722130 -1.209742 0.364336 0.250030
2.833333 0.775105 -0.305832 0.721276 -1.216152 0.373863 0.196953
2.866667 0.733846 -0.292917 0.725299 -1.218927 0.382197 0.156432
2.900000 0.693500 -0.279603 0.725709 -1.219131 0.389385 0.125291
2.933333 0.652475 -0.266047 0.727496 -1.217935 0.395497 0.102325
2.966667 0.610793 -0.252258 0.733934 -1.215729 0.400521 0.084002
3.000000 0.568480 -0.238248 0.742099 -1.212625 0.404498 0.070733
3.033333 0.528117 -0.224577 0.747716 -1.208776 0.407457 0.059998
3.066667 0.489298 -0.211200 0.743409 -1.204588 0.409442 0.053759
3.100000 0.449913 -0.197636 0.756046 -1.200168 0.410513 0.051502
3.133333 0.409759 -0.183954 0.755304 -1.195427 0.410652 0.053035
3.166667 0.370307 -0.170123 0.744341 -1.190864 0.409967 0.061684
3.200000 0.330349 -0.156136 0.736470 -1.186965 0.408443 0.076025
3.233333 0.290981 -0.142198 0.736688 -1.184169 0.406115 0.097568
3.266667 0.251143 -0.128126 0.736762 -1.182450 0.402945 0.123486
3.300000 0.212138 -0.114541 0.744513 -1.181853 0.398910 0.153580
3.333333 0.172699 -0.100842 0.767529 -1.182664 0.394081 0.184985
3.366667 0.135039 -0.087929 0.762811 -1.185036 0.388547 0.212896
3.400000 0.096030 -0.075209 0.771434 -1.189122 0.382581 0.233421
3.433333 0.056635 -0.062402 0.786219 -1.194875 0.376375 0.243968
3.466667 0.016844 -0.049996 0.793228 -1.202308 0.370253 0.244582
3.500000 -0.023298 -0.037521 0.809727 -1.211317 0.364458 0.234374
3.533333 -0.063298 -0.025918 0.822448 -1.221407 0.359233 0.214064
3.566667 -0.103617 -0.014262 0.830235 -1.231722 0.354643 0.187061
3.600000 -0.144818 -0.003028 0.834151 -1.241479 0.350671 0.158734
3.633333 -0.185372 0.008144 0.843984 -1.250155 0.347358 0.130083
3.666667 -0.228685 0.019615 0.849850 -1.257268 0.344608 0.101661
3.700000 -0.272251 0.031113 0.841058 -1.262475 0.342359 0.075815
3.733333 -0.316048 0.042631 0.829342 -1.265601 0.340409 0.057331
3.766667 -0.359489 0.053933 0.838481 -1.266887 0.338693 0.045136
3.800000 -0.401968 0.065228 0.840789 -1.266691 0.337098 0.037126
3.833333 -0.443960 0.076547 0.848627 -1.265158 0.335450 0.033023
3.866667 -0.486113 0.087859 0.827940 -1.262659 0.333639 0.035770
3.900000 -0.527303 0.098859 0.841031 -1.259603 0.331584 0.042306
3.933333 -0.568621 0.109839 0.848091 -1.256433 0.329295 0.047983
3.966667 -0.610054 0.120791 0.851085 -1.253471 0.326725 0.052527
4.000000 -0.651586 0.131711 0.850317 -1.250841 0.323832 0.056914
4.033333 -0.693200 0.142591 0.850315 -1.248767 0.320628 0.061894
4.066667 -0.735320 0.153301 0.846340 -1.247419 0.317153 0.062465
4.100000 -0.777493 0.163960 0.857294 -1.246767 0.313379 0.059611
4.133333 -0.819701 0.174563 0.860989 -1.246683 0.309273 0.055666
4.166667 -0.861164 0.184870 0.857448 -1.246903 0.304810 0.051251
4.200000 -0.901515 0.194874 0.863508 -1.247463 0.300040 0.045128
4.233333 -0.941857 0.204805 0.866118 -1.248454 0.294977 0.036740
4.266667 -0.982970 0.214614 0.866280 -1.249878 0.289593 0.027417
4.300000 -1.024890 0.224341 0.864324 -1.251785 0.283927 0.020198
4.333333 -1.067211 0.233636 0.874897 -1.254252 0.278042 0.012028
4.366667 -1.109614 0.242858 0.867964 -1.257501 0.272027 0.003827
4.400000 -1.151932 0.251983 0.864109 -1.261226 0.265905 -0.003432
4.433333 -1.193998 0.260781 0.857098 -1.264970 0.259713 -0.008060
4.466667 -1.235948 0.269474 0.867294 -1.268299 0.253442 -0.009541
4.500000 -1.276472 0.277644 0.859460 -1.271226 0.247040 -0.011156
4.533333 -1.319122 0.285722 0.871982 -1.273647 0.240394 -0.010662
4.566667 -1.362647 0.293484 0.865412 -1.275354 0.233397 -0.008503
4.600000 -1.405992 0.301127 0.855029 -1.276421 0.225965 -0.006306
4.633333 -1.449141 0.308648 0.864092 -1.277092 0.217971 -0.006264
4.666667 -1.492076 0.316045 0.857912 -1.277682 0.209397 -0.005719
4.700000 -1.534779 0.323314 0.858376 -1.277826 0.200244 -0.003453
4.733333 -1.577235 0.330452 0.867774 -1.277485 0.190532 0.000228
4.766667 -1.619384 0.337039 0.869608 -1.276784 0.180280 0.003956
4.800000 -1.660416 0.342871 0.864797 -1.275916 0.169558 0.009941
4.833333 -1.703632 0.347856 0.857578 -1.274817 0.158589 0.019417
4.866667 -1.746534 0.352705 0.857013 -1.273352 0.147548 0.028406
4.900000 -1.789102 0.357416 0.864201 -1.271662 0.136638 0.034519
4.933333 -1.831319 0.361990 0.854343 -1.269676 0.126111 0.039199
4.966667 -1.874359 0.365744 0.863960 -1.266998 0.116276 0.041743
5.000000 -1.917013 0.369360 0.870198 -1.263097 0.107335 0.039325
5.033333 -1.959508 0.372495 0.875502 -1.257499 0.099402 0.030489
5.066667 -2.001375 0.375295 0.871808 -1.249751 0.092604 0.017367
5.100000 -2.042801 0.377961 0.877331 -1.239124 0.087066 0.002406
5.133333 -2.083766 0.380494 0.886842 -1.224695 0.082880 -0.016161
5.166667 -2.125910 0.382840 0.886699 -1.205492 0.079942 -0.035368
5.200000 -2.167557 0.385056 0.878231 -1.180192 0.078165 -0.052187
5.233333 -2.208688 0.387145 0.865832 -1.147764 0.077361 -0.064585
5.266667 -2.248634 0.389296 0.860187 -1.106824 0.077211 -0.075837
5.300000 -2.286448 0.391947 0.854977 -1.056723 0.077292 -0.088680
5.333333 -2.323693 0.394474 0.855439 -0.996973 0.077095 -0.106594
5.366667 -2.358488 0.397455 0.856857 -0.928059 0.076197 -0.133867
5.400000 -2.392685 0.400313 0.850526 -0.851322 0.074242 -0.173772
5.433333 -2.422696 0.403350 0.841392 -0.768230 0.070924 -0.228636
5.466667 -2.448640 0.406496 0.851232 -0.681307 0.066111 -0.294883
5.500000 -2.469367 0.409296 0.853327 -0.592900 0.059821 -0.367928
5.533333 -2.484412 0.411592 0.855321 -0.506414 0.052267 -0.442761
5.566667 -2.498838 0.413760 0.852462 -0.424422 0.043748 -0.515076
5.600000 -2.508082 0.414829 0.810167 -0.349598 0.034679 -0.580672
5.633333 -2.516724 0.415771 0.762382 -0.284131 0.025563 -0.633499
5.666667 -2.520329 0.415829 0.717522 -0.229488 0.016953 -0.669088
5.700000 -2.523358 0.415763 0.686784 -0.186520 0.009318 -0.685779
5.733333 -2.525830 0.415575 0.667878 -0.154555 0.002963 -0.682021
5.766667 -2.527760 0.415269 0.653796 -0.133026 -0.001833 -0.656723
5.800000 -2.530246 0.414605 0.635883 -0.120209 -0.005066 -0.611449
5.833333 -2.532224 0.413829 0.622495 -0.114448 -0.006872 -0.554360
5.866667 -2.535869 0.413136 0.593641 -0.113532 -0.007589 -0.491041
5.900000 -2.539037 0.412338 0.575894 -0.115570 -0.007547 -0.427171
5.933333 -2.543537 0.412207 0.548425 -0.119103 -0.007054 -0.365120
