t x y theta dxdt dydt dthetadt
0.000000 0.000000 0.000000 -0.000401 -0.005340 -0.013115 -0.008839
0.033333 -0.000382 -0.000356 0.005454 -0.002894 -0.016546 -0.008193
0.066667 -0.001494 -0.000708 -0.001939 0.001335 -0.020753 -0.008010
0.100000 -0.002136 -0.001186 -0.001232 0.007900 -0.025876 -0.008118
0.133333 -0.002291 -0.001790 -0.002374 0.017196 -0.032097 -0.009096
0.166667 -0.001945 -0.002525 -0.003011 0.029313 -0.039445 -0.014501
0.200000 -0.001659 -0.003874 0.000161 0.044474 -0.047931 -0.025211
0.233333 -0.000842 -0.005357 -0.001019 0.062874 -0.057545 -0.036613
0.266667 0.000521 -0.006979 0.004964 0.084504 -0.068313 -0.051063
0.300000 0.003412 -0.009527 0.016959 0.108964 -0.079967 -0.068055
0.333333 0.006877 -0.012216 0.009374 0.135891 -0.092130 -0.086799
0.366667 0.010930 -0.015047 -0.009532 0.165071 -0.104502 -0.101680
0.400000 0.015583 -0.018022 -0.012965 0.196298 -0.116850 -0.110028
0.433333 0.022685 -0.022514 -0.016209 0.229214 -0.128840 -0.113020
0.466667 0.031737 -0.027903 -0.020238 0.263494 -0.140089 -0.107135
0.500000 0.041421 -0.033434 -0.031409 0.299166 -0.150449 -0.090517
0.533333 0.051746 -0.039107 -0.037383 0.336016 -0.159809 -0.066458
0.566667 0.063533 -0.044850 -0.038944 0.373803 -0.168077 -0.040178
0.600000 0.075976 -0.050730 -0.049063 0.412151 -0.175190 -0.014285
0.633333 0.089080 -0.056746 -0.043209 0.451044 -0.181361 0.008443
0.666667 0.104984 -0.063072 -0.037491 0.490424 -0.186910 0.024324
0.700000 0.121560 -0.069530 -0.029056 0.530063 -0.192113 0.031368
0.733333 0.140076 -0.075985 -0.019422 0.569805 -0.197269 0.031251
0.766667 0.160398 -0.082510 -0.012809 0.609441 -0.202643 0.025365
0.800000 0.181930 -0.089197 -0.010739 0.648775 -0.208399 0.014318
0.833333 0.204654 -0.095887 -0.007965 0.687152 -0.214501 -0.000393
0.866667 0.228052 -0.102698 -0.023970 0.724203 -0.220884 -0.011728
0.900000 0.252687 -0.109813 -0.022926 0.759679 -0.227475 -0.020307
0.933333 0.278278 -0.117554 -0.029094 0.793641 -0.234151 -0.024112
0.966667 0.306686 -0.125945 -0.036459 0.826139 -0.240754 -0.021207
1.000000 0.335750 -0.134445 -0.046621 0.857446 -0.247215 -0.010819
1.033333 0.365463 -0.143052 -0.028048 0.888100 -0.253493 0.006892
1.066667 0.395818 -0.151760 -0.031666 0.918514 -0.259551 0.022227
1.100000 0.426807 -0.160564 -0.030480 0.949006 -0.265393 0.035805
1.133333 0.458421 -0.169462 -0.026268 0.979596 -0.271104 0.043935
1.166667 0.490653 -0.178448 -0.041844 1.010904 -0.276953 0.045401
1.200000 0.523493 -0.187517 -0.011208 1.043290 -0.283122 0.036165
1.233333 0.558355 -0.196909 -0.011284 1.076949 -0.289782 0.018507
1.266667 0.595283 -0.206524 -0.009699 1.111856 -0.297050 -0.002089
1.300000 0.632785 -0.216208 -0.007314 1.147953 -0.304948 -0.024809
1.333333 0.672134 -0.226462 -0.007842 1.185162 -0.313403 -0.045101
1.366667 0.712029 -0.236773 -0.014685 1.222554 -0.322121 -0.063285
1.400000 0.753048 -0.247384 -0.025533 1.259259 -0.330826 -0.072781
1.433333 0.795170 -0.258640 -0.029270 1.294593 -0.339235 -0.073825
1.466667 0.837871 -0.270059 -0.040624 1.328165 -0.347098 -0.067013
1.500000 0.885058 -0.282578 -0.045838 1.359331 -0.354088 -0.052209
1.533333 0.932701 -0.295122 -0.046561 1.387669 -0.359970 -0.032677
1.566667 0.980777 -0.307682 -0.051727 1.413309 -0.364619 -0.006185
1.600000 1.029262 -0.320251 -0.045459 1.436592 -0.367988 0.021802
1.633333 1.078134 -0.332818 -0.042017 1.457888 -0.370090 0.046577
1.666667 1.127368 -0.345377 -0.026819 1.477505 -0.370959 0.066664
1.700000 1.176941 -0.357917 -0.026524 1.496374 -0.370904 0.080247
1.733333 1.226829 -0.370431 -0.030764 1.515304 -0.370193 0.087167
1.766667 1.277007 -0.382910 -0.022095 1.534680 -0.369055 0.082376
1.800000 1.327450 -0.395345 -0.024008 1.554614 -0.367626 0.069756
1.833333 1.378514 -0.407234 -0.020551 1.575042 -0.366078 0.055613
1.866667 1.429795 -0.419063 -0.013410 1.595954 -0.364569 0.040975
1.900000 1.483819 -0.431036 0.012095 1.616910 -0.363078 0.025433
1.933333 1.539326 -0.443389 -0.002621 1.637529 -0.361552 0.012779
1.966667 1.595544 -0.455390 -0.025764 1.657675 -0.359974 0.006332
2.000000 1.652397 -0.467411 -0.014083 1.677278 -0.358355 0.003077
2.033333 1.709525 -0.479543 -0.019295 1.696360 -0.356584 0.000078
2.066667 1.766523 -0.491513 -0.025438 1.714695 -0.354525 -0.002017
2.100000 1.823525 -0.503363 -0.023145 1.732265 -0.352095 0.001334
2.133333 1.880500 -0.515083 -0.027057 1.748966 -0.349284 0.004134
2.166667 1.937415 -0.526664 -0.013487 1.764637 -0.346044 0.004780
2.200000 1.996091 -0.538325 -0.010494 1.779268 -0.342375 0.007473
2.233333 2.056045 -0.549846 -0.009588 1.792821 -0.338341 0.009514
2.266667 2.117590 -0.561191 0.009541 1.805302 -0.334024 0.008387
2.300000 2.179867 -0.572314 -0.017213 1.816592 -0.329500 0.002576
2.333333 2.241907 -0.583255 -0.024705 1.826626 -0.324834 -0.003944
2.366667 2.303669 -0.594006 -0.018355 1.835368 -0.320109 -0.007401
2.400000 2.365117 -0.604557 -0.021488 1.842617 -0.315349 -0.013176
2.433333 2.426211 -0.614899 -0.008384 1.848214 -0.310580 -0.017353
2.466667 2.486913 -0.625025 -0.014673 1.852165 -0.305882 -0.015113
2.500000 2.547185 -0.634926 -0.021190 1.853982 -0.301273 -0.011372
2.533333 2.609574 -0.645121 -0.004119 1.852597 -0.296708 -0.008591
2.566667 2.672506 -0.654966 -0.022596 1.846860 -0.292153 -0.008122
2.600000 2.735602 -0.664622 -0.023497 1.835626 -0.287590 -0.004618
2.633333 2.798729 -0.674090 -0.022215 1.817673 -0.282987 0.000333
2.666667 2.861396 -0.683633 -0.020610 1.791731 -0.278165 0.002881
2.700000 2.923385 -0.692900 -0.005546 1.757609 -0.273037 0.006585
2.733333 2.984654 -0.701881 -0.025947 1.715580 -0.267521 0.015686
2.766667 3.045160 -0.710568 -0.016153 1.666098 -0.261516 0.025726
2.800000 3.104601 -0.719692 -0.007696 1.609291 -0.254818 0.031985
2.833333 3.156602 -0.728008 -0.027952 1.545513 -0.247208 0.038151
2.866667 3.203725 -0.736471 -0.019814 1.475040 -0.238448 0.044044
2.900000 3.249941 -0.744601 -0.017033 1.397602 -0.228262 0.051368
2.933333 3.295225 -0.752389 -0.002360 1.313708 -0.216436 0.055267
2.966667 3.339548 -0.759827 -0.007384 1.223519 -0.202631 0.061069
3.000000 3.382884 -0.766907 -0.002463 1.128056 -0.186738 0.071654
3.033333 3.425208 -0.773620 -0.000182 1.028024 -0.168587 0.078131
3.066667 3.458574 -0.779541 0.003325 0.924977 -0.148302 0.079591
3.100000 3.490886 -0.785078 -0.006573 0.820550 -0.125937 0.073780
3.133333 3.516396 -0.789577 -0.006327 0.716301 -0.101512 0.061745
3.166667 3.535657 -0.792880 0.008352 0.614754 -0.075389 0.039859
3.200000 3.548661 -0.794561 0.006235 0.518471 -0.047900 0.007964
3.233333 3.560590 -0.795830 0.017628 0.430185 -0.019557 -0.027122
3.266667 3.571448 -0.796685 0.030771 0.351168 0.009370 -0.059940
3.300000 3.578027 -0.795471 0.029064 0.282767 0.038346 -0.088947
3.333333 3.583551 -0.793837 0.036523 0.225072 0.066868 -0.112504
3.366667 3.587681 -0.790545 0.008303 0.177014 0.094648 -0.124737
3.400000 3.590777 -0.786832 -0.022930 0.136458 0.121618 -0.124415
3.433333 3.593799 -0.781857 -0.029855 0.101152 0.147747 -0.110833
3.466667 3.597056 -0.775783 -0.044037 0.069462 0.172841 -0.086854
3.500000 3.599312 -0.769295 -0.046545 0.039339 0.197031 -0.055548
3.533333 3.601368 -0.762133 -0.037264 0.009419 0.220347 -0.017549
3.566667 3.602444 -0.754564 -0.039997 -0.021233 0.242960 0.020717
3.600000 3.602144 -0.746162 -0.020582 -0.052939 0.264881 0.052745
3.633333 3.600608 -0.737218 -0.006423 -0.085838 0.286249 0.075323
3.666667 3.597105 -0.727391 -0.006627 -0.119824 0.307354 0.087547
3.700000 3.592164 -0.716651 -0.002062 -0.154503 0.328317 0.091617
3.733333 3.585549 -0.704762 0.001766 -0.189366 0.349311 0.087181
3.766667 3.578034 -0.692496 0.005514 -0.223818 0.370253 0.075343
3.800000 3.569635 -0.679861 0.004287 -0.257309 0.391093 0.061742
3.833333 3.560369 -0.666866 -0.006312 -0.289413 0.411734 0.048757
3.866667 3.550252 -0.653518 -0.005544 -0.319949 0.432019 0.036523
3.900000 3.538968 -0.638792 -0.002623 -0.348929 0.451957 0.024149
3.933333 3.526334 -0.622758 -0.002550 -0.376522 0.471520 0.013317
3.966667 3.512907 -0.606400 0.008533 -0.403166 0.490934 0.002008
4.000000 3.498520 -0.589226 0.017139 -0.429294 0.510309 -0.010369
4.033333 3.483380 -0.571749 0.016035 -0.455313 0.529746 -0.025618
4.066667 3.467563 -0.553607 0.006283 -0.481569 0.549313 -0.042992
4.100000 3.451519 -0.535464 0.001800 -0.508189 0.568905 -0.060117
4.133333 3.434782 -0.516351 -0.005499 -0.535789 0.588455 -0.076826
4.166667 3.417376 -0.496984 -0.004381 -0.564629 0.607636 -0.084429
4.200000 3.399322 -0.477378 0.002687 -0.595001 0.626261 -0.082197
4.233333 3.379018 -0.455576 -0.008343 -0.627056 0.643980 -0.068951
4.266667 3.358111 -0.433562 -0.006739 -0.660938 0.660508 -0.046630
4.300000 3.334746 -0.409905 -0.041983 -0.697036 0.675506 -0.013461
4.333333 3.310829 -0.386067 -0.033277 -0.734756 0.688731 0.024542
4.366667 3.286388 -0.362067 -0.029527 -0.773660 0.700061 0.060913
4.400000 3.261448 -0.337922 -0.026529 -0.813372 0.709363 0.091275
4.433333 3.236037 -0.313650 -0.024743 -0.853783 0.716835 0.112202
4.466667 3.204564 -0.289602 -0.013404 -0.894426 0.722789 0.122223
4.500000 3.172680 -0.265460 0.007570 -0.934449 0.727809 0.113054
4.533333 3.140419 -0.241241 0.029666 -0.973441 0.732436 0.090805
4.566667 3.107815 -0.216962 0.030767 -1.010993 0.737212 0.055368
4.600000 3.074900 -0.192640 0.028309 -1.046536 0.742618 0.010904
4.633333 3.037141 -0.167846 0.040815 -1.078725 0.748944 -0.040423
4.666667 2.999145 -0.143043 0.013118 -1.106949 0.756184 -0.090406
4.700000 2.960952 -0.118250 0.025314 -1.130660 0.764136 -0.135357
4.733333 2.921643 -0.093141 0.005731 -1.149291 0.772481 -0.174361
4.766667 2.882217 -0.068076 -0.014193 -1.162078 0.780861 -0.205015
4.800000 2.841490 -0.041649 -0.041354 -1.167971 0.788753 -0.225717
4.833333 2.800391 -0.014362 -0.030566 -1.166810 0.795430 -0.234416
4.866667 2.759632 0.013343 -0.026607 -1.157604 0.799936 -0.237134
4.900000 2.718921 0.040924 -0.029760 -1.139617 0.801305 -0.228067
4.933333 2.678299 0.068360 -0.042467 -1.112254 0.798672 -0.207815
4.966667 2.640958 0.095726 -0.059561 -1.075596 0.791252 -0.176623
5.000000 2.603784 0.122904 -0.061695 -1.029865 0.778077 -0.136707
5.033333 2.568132 0.150430 -0.073372 -0.975566 0.758640 -0.086537
5.066667 2.532720 0.177728 -0.081845 -0.914163 0.733193 -0.026514
5.100000 2.499997 0.204285 -0.089880 -0.847219 0.702078 0.034035
5.133333 2.470819 0.229723 -0.095748 -0.776145 0.665333 0.090461
5.166667 2.446485 0.252624 -0.097840 -0.701775 0.622945 0.138803
5.200000 2.428531 0.271240 -0.076507 -0.626302 0.576184 0.173604
5.233333 2.410947 0.289535 -0.047571 -0.551036 0.526051 0.188238
5.266667 2.393748 0.307496 -0.027133 -0.476811 0.473179 0.183927
5.300000 2.376950 0.325112 -0.019136 -0.404057 0.418121 0.166409
5.333333 2.367922 0.335585 0.004988 -0.333683 0.362487 0.137817
5.366667 2.359313 0.345696 0.015502 -0.266571 0.307934 0.102408
5.400000 2.351127 0.355443 0.011414 -0.201981 0.254892 0.069115
5.433333 2.343370 0.364821 -0.020514 -0.139800 0.203936 0.044247
5.466667 2.340195 0.369555 -0.026972 -0.080261 0.155995 0.026829
5.500000 2.340239 0.371331 -0.038314 -0.024023 0.112249 0.017318
5.533333 2.340711 0.372741 -0.051242 0.029238 0.072435 0.016996
5.566667 2.344734 0.372628 -0.044550 0.079448 0.036353 0.024115
5.600000 2.349172 0.372160 -0.018052 0.126032 0.004129 0.031423
5.633333 2.354015 0.371345 -0.021085 0.168682 -0.024211 0.036359
5.666667 2.362661 0.369191 -0.005675 0.207502 -0.049273 0.039466
5.700000 2.371690 0.366705 0.012314 0.243266 -0.072250 0.036933
5.733333 2.381089 0.363895 0.020669 0.275928 -0.093472 0.028004
5.766667 2.390845 0.360770 -0.002253 0.306051 -0.113559 0.013741
5.800000 2.400944 0.357339 -0.012668 0.334206 -0.133134 0.000357
5.833333 2.411372 0.353612 -0.016687 0.360960 -0.152821 -0.014617
5.866667 2.425096 0.347301 -0.031092 0.386860 -0.172862 -0.029457
5.900000 2.439116 0.340715 -0.021146 0.411743 -0.192966 -0.041464
5.933333 2.453413 0.333865 -0.022548 0.435449 -0.212890 -0.049965
5.966667 2.467970 0.326765 -0.016035 0.457383 -0.232101 -0.055293
6.000000 2.482767 0.319426 -0.008106 0.476951 -0.250068 -0.062578
6.033333 2.500227 0.310056 -0.010165 0.492853 -0.265742 -0.064753
6.066667 2.517887 0.300475 -0.005117 0.504002 -0.278378 -0.062457
6.100000 2.536781 0.289547 -0.016270 0.509573 -0.287318 -0.052791
6.133333 2.555830 0.278438 -0.020363 0.508601 -0.291712 -0.034994
6.166667 2.575010 0.267165 -0.043926 0.500218 -0.290810 -0.008583
6.200000 2.594299 0.255742 -0.048642 0.483563 -0.283868 0.028780
6.233333 2.612858 0.244370 -0.053747 0.459277 -0.271195 0.067769
6.266667 2.628504 0.234629 -0.052203 0.428004 -0.253063 0.103767
6.300000 2.644194 0.224787 -0.029386 0.390268 -0.229682 0.127172
6.333333 2.659909 0.214857 -0.042486 0.347489 -0.201916 0.135969
6.366667 2.669541 0.209249 -0.008377 0.301603 -0.171001 0.125786
6.400000 2.679169 0.203579 0.015863 0.254263 -0.138048 0.098076
6.433333 2.688780 0.197856 0.029443 0.206277 -0.103622 0.060197
6.466667 2.690699 0.197939 0.043697 0.158595 -0.068484 0.018024
6.500000 2.692588 0.197983 0.046746 0.112215 -0.033651 -0.015995
6.533333 2.694443 0.197991 0.021725 0.067768 -0.000007 -0.040145
6.566667 2.696262 0.197966 -0.003413 0.024554 0.032432 -0.049088
6.600000 2.698041 0.197911 -0.028592 -0.017556 0.063391 -0.042654
6.633333 2.696875 0.200743 -0.056471 -0.058382 0.092341 -0.025080
6.666667 2.694051 0.205708 -0.060016 -0.098743 0.119519 -0.000471
6.700000 2.691188 0.210643 -0.041433 -0.139007 0.145129 0.021074
6.733333 2.684866 0.217110 -0.019357 -0.179552 0.169559 0.033490
6.766667 2.678515 0.223539 0.006301 -0.219631 0.192554 0.033113
6.800000 2.672140 0.229926 0.018417 -0.258974 0.214138 0.017951
6.833333 2.661590 0.237944 0.044696 -0.297481 0.234743 -0.010914
6.866667 2.651035 0.245910 0.041044 -0.334523 0.254465 -0.047728
6.900000 2.636777 0.255476 0.022288 -0.369497 0.273370 -0.084409
6.933333 2.622542 0.264974 0.015116 -0.402047 0.291528 -0.110929
6.966667 2.608345 0.274396 -0.019407 -0.432130 0.309141 -0.122184
7.000000 2.592977 0.285142 -0.049762 -0.459222 0.326006 -0.115448
7.033333 2.577679 0.295792 -0.055214 -0.482934 0.341725 -0.089772
7.066667 2.560533 0.307928 -0.072740 -0.502603 0.355660 -0.048567
7.100000 2.543494 0.319946 -0.062755 -0.517817 0.367295 -0.000129
7.133333 2.524285 0.333598 -0.036364 -0.527852 0.375971 0.045304
7.166667 2.504819 0.347826 -0.022472 -0.531576 0.380674 0.081036
7.200000 2.485020 0.362174 -0.008562 -0.528217 0.380754 0.098740
7.233333 2.465586 0.376033 -0.001626 -0.516858 0.375381 0.098352
7.266667 2.446368 0.389706 0.010966 -0.496955 0.364017 0.077745
7.300000 2.427387 0.403179 -0.000042 -0.468257 0.346164 0.045058
7.333333 2.408667 0.416438 0.012858 -0.430902 0.321622 0.009216
7.366667 2.393226 0.428149 0.000674 -0.386095 0.290930 -0.023604
7.400000 2.378085 0.439617 0.004136 -0.334975 0.254455 -0.044986
7.433333 2.368083 0.448309 -0.009999 -0.279516 0.213320 -0.053766
7.466667 2.358411 0.456735 -0.027351 -0.221481 0.168443 -0.047436
7.500000 2.353661 0.461315 -0.031097 -0.162904 0.121207 -0.031815
7.533333 2.349257 0.465612 -0.044871 -0.105627 0.072848 -0.010534
7.566667 2.349451 0.465422 -0.039794 -0.050839 0.024484 0.011355
7.600000 2.349999 0.464943 -0.028291 0.000363 -0.022656 0.031590
7.633333 2.353312 0.461470 -0.015590 0.047831 -0.067862 0.046284
7.666667 2.356978 0.457710 -0.002817 0.091314 -0.110277 0.053832
7.700000 2.361276 0.452546 0.000313 0.131275 -0.149610 0.055528
7.733333 2.366636 0.445811 0.006157 0.168123 -0.185468 0.049816
7.766667 2.372342 0.438801 0.009000 0.202575 -0.218026 0.040598
7.800000 2.379027 0.430626 -0.001411 0.235176 -0.247422 0.027622
7.833333 2.387424 0.421215 -0.003468 0.266481 -0.274047 0.014436
7.866667 2.396151 0.411551 -0.017317 0.297177 -0.298401 0.004688
7.900000 2.406840 0.400662 -0.024589 0.327690 -0.320908 0.000227
7.933333 2.419844 0.388580 -0.007786 0.358402 -0.342130 0.001437
7.966667 2.433150 0.376273 -0.005914 0.389280 -0.362272 0.006738
8.000000 2.446747 0.363753 0.002570 0.420419 -0.381655 0.014994
8.033333 2.460622 0.351030 0.000888 0.451797 -0.400452 0.024361
8.066667 2.474765 0.338117 -0.011949 0.483239 -0.418776 0.030252
8.100000 2.490317 0.324486 -0.002304 0.514528 -0.436697 0.028845
8.133333 2.507948 0.309652 -0.007526 0.545709 -0.454314 0.025152
8.166667 2.527290 0.293580 -0.005614 0.576938 -0.471710 0.019393
8.200000 2.547759 0.277001 0.008756 0.608279 -0.488860 0.014361
8.233333 2.569586 0.259892 0.012380 0.639495 -0.505528 0.013010
8.266667 2.591581 0.242673 -0.003497 0.670426 -0.521504 0.019292
8.300000 2.613722 0.225361 0.005364 0.701063 -0.536625 0.037844
8.333333 2.637861 0.207278 0.005284 0.731104 -0.550634 0.063585
8.366667 2.663382 0.187989 0.000265 0.760108 -0.563309 0.094890
8.400000 2.688981 0.168655 -0.006907 0.787498 -0.574489 0.127875
8.433333 2.714634 0.149295 -0.016523 0.813000 -0.584180 0.156538
8.466667 2.741991 0.129175 -0.008262 0.836205 -0.592324 0.173891
8.500000 2.771033 0.108732 0.003444 0.856222 -0.598681 0.174972
8.533333 2.802415 0.087963 0.029021 0.872155 -0.603020 0.158585
8.566667 2.833739 0.067243 0.057459 0.883024 -0.605034 0.125130
8.600000 2.864976 0.046589 0.072106 0.888078 -0.604404 0.077714
8.633333 2.896093 0.026022 0.087206 0.886474 -0.600785 0.021651
8.666667 2.927060 0.005562 0.085790 0.877654 -0.593956 -0.034212
8.700000 2.957846 -0.014774 0.073857 0.861839 -0.583987 -0.080397
8.733333 2.987812 -0.035013 0.051083 0.839769 -0.571046 -0.111494
8.766667 3.017536 -0.055088 0.022382 0.812183 -0.555252 -0.121846
8.800000 3.046988 -0.074981 0.002190 0.779298 -0.536397 -0.109728
8.833333 3.073209 -0.093292 -0.013910 0.741194 -0.514121 -0.075687
8.866667 3.097756 -0.110791 -0.018859 0.697930 -0.488056 -0.026290
8.900000 3.118163 -0.125521 -0.009228 0.649500 -0.457901 0.024223
8.933333 3.138198 -0.139999 0.000291 0.595336 -0.423161 0.071197
8.966667 3.157843 -0.154214 0.016165 0.535550 -0.383800 0.103504
9.000000 3.177077 -0.168151 0.033496 0.471195 -0.340420 0.114479
9.033333 3.195881 -0.181798 0.073457 0.403607 -0.293916 0.099642
9.066667 3.214237 -0.195143 0.055858 0.333832 -0.245029 0.065434
9.100000 3.225719 -0.203613 0.064353 0.262815 -0.194462 0.023353
9.133333 3.231018 -0.207764 0.070222 0.192158 -0.143407 -0.024744
9.166667 3.231182 -0.208334 0.068173 0.123464 -0.093125 -0.067608
9.200000 3.230867 -0.208575 0.050377 0.057903 -0.044616 -0.097417
9.233333 3.230075 -0.208488 0.020717 -0.003502 0.001231 -0.107369
9.266667 3.226889 -0.206464 0.015238 -0.059306 0.043232 -0.104061
9.300000 3.222335 -0.203062 -0.009198 -0.108750 0.080668 -0.092146
9.333333 3.217066 -0.198898 -0.014607 -0.151874 0.113412 -0.070618
9.366667 3.211301 -0.194153 -0.001086 -0.189574 0.141956 -0.048073
9.400000 3.204180 -0.188407 0.014181 -0.222863 0.166880 -0.033212
9.433333 3.196614 -0.182360 0.030160 -0.252764 0.188792 -0.030962
9.466667 3.186295 -0.174711 0.023152 -0.280505 0.208520 -0.037525
9.500000 3.175551 -0.166777 0.038266 -0.306931 0.226693 -0.052690
9.533333 3.164391 -0.158568 0.042814 -0.332472 0.243697 -0.077231
9.566667 3.152827 -0.150093 0.027824 -0.357443 0.259745 -0.104117
9.600000 3.140871 -0.141361 0.021769 -0.381977 0.274948 -0.124208
9.633333 3.128535 -0.132382 -0.004253 -0.406403 0.289431 -0.135992
9.666667 3.114766 -0.122608 -0.008328 -0.431187 0.303355 -0.138877
9.700000 3.100643 -0.112607 -0.023342 -0.456719 0.316794 -0.130678
9.733333 3.084162 -0.101084 -0.045049 -0.483258 0.329663 -0.110113
9.766667 3.067355 -0.089357 -0.032405 -0.510831 0.341849 -0.084723
9.800000 3.050239 -0.077438 -0.027876 -0.539630 0.353273 -0.059208
9.833333 3.032830 -0.065339 -0.020871 -0.569452 0.363840 -0.036103
9.866667 3.015145 -0.053073 -0.010071 -0.600079 0.373437 -0.019820
9.900000 2.993969 -0.040033 -0.014923 -0.631019 0.381902 -0.013143
9.933333 2.972554 -0.026850 -0.007579 -0.661835 0.389243 -0.020340
9.966667 2.948565 -0.013420 -0.036821 -0.691533 0.395318 -0.030205
10.000000 2.924380 0.000126 -0.010113 -0.718979 0.400016 -0.044213
10.033333 2.900021 0.013774 -0.013567 -0.743236 0.403236 -0.056889
10.066667 2.875890 0.026773 -0.008693 -0.762663 0.404616 -0.064166
10.100000 2.847888 0.041014 -0.037755 -0.775851 0.403799 -0.060902
10.133333 2.818914 0.055129 -0.025826 -0.781824 0.400616 -0.045132
10.166667 2.789868 0.069292 -0.052377 -0.779617 0.394711 -0.023622
10.200000 2.760779 0.083487 -0.044465 -0.768348 0.385715 0.005988
10.233333 2.731674 0.097702 -0.051513 -0.746740 0.373071 0.042217
10.266667 2.706765 0.109888 -0.048472 -0.714940 0.356718 0.082622
10.300000 2.681890 0.122065 -0.036782 -0.673382 0.336670 0.117981
10.333333 2.657073 0.134222 -0.026384 -0.622324 0.312731 0.148817
10.366667 2.632338 0.146346 -0.028028 -0.563237 0.285313 0.171883
10.400000 2.615502 0.155073 -0.010913 -0.498248 0.255111 0.186059
10.433333 2.598783 0.163745 0.005784 -0.430376 0.223251 0.188721
10.466667 2.582194 0.172354 0.006114 -0.361674 0.190534 0.180636
10.500000 2.574141 0.177223 0.021918 -0.294737 0.158118 0.165785
10.533333 2.566235 0.182016 0.018144 -0.232057 0.127197 0.146558
10.566667 2.563335 0.184447 0.030502 -0.175825 0.098849 0.124158
10.600000 2.562669 0.185422 0.031589 -0.127101 0.073704 0.101633
10.633333 2.563058 0.185442 0.026342 -0.086457 0.052176 0.079666
10.666667 2.563423 0.185248 0.024114 -0.054650 0.034773 0.059452
10.700000 2.563919 0.184972 0.027279 -0.030950 0.021316 0.044460
10.733333 2.564539 0.184618 0.023892 -0.014630 0.011612 0.031553
10.766667 2.564385 0.184772 0.046119 -0.004113 0.005049 0.022111
10.800000 2.564343 0.184849 0.039485 0.001886 0.001063 0.013455
10.833333 2.564409 0.184852 0.023436 0.004732 -0.001007 0.008104
10.866667 2.564577 0.184782 0.034684 0.005829 -0.001920 0.004443
10.900000 2.564840 0.184640 0.028739 0.005875 -0.002123 0.000332
