t x y theta dxdt dydt dthetadt
0.000000 0.000000 0.000000 1.675516 -0.142969 0.054188 4.832059
0.033333 -0.004844 0.001844 1.955063 -0.145797 0.056629 4.117879
0.066667 -0.009855 0.003788 2.235113 -0.148573 0.059092 3.079567
0.100000 -0.014895 0.005801 2.363730 -0.151269 0.061574 1.806704
0.133333 -0.020112 0.007924 2.424566 -0.153876 0.064075 0.388721
0.166667 -0.025360 0.010114 2.395095 -0.156377 0.066593 -1.109744
0.200000 -0.030637 0.012372 2.311988 -0.158764 0.069125 -2.623238
0.233333 -0.035946 0.014698 2.180424 -0.161036 0.071662 -4.079729
0.266667 -0.041285 0.017090 1.927846 -0.163206 0.074206 -4.857245
0.300000 -0.046656 0.019550 1.636101 -0.165292 0.076762 -4.948009
0.333333 -0.052205 0.022149 1.316882 -0.167324 0.079345 -4.855753
0.366667 -0.057929 0.024893 1.044355 -0.169323 0.081972 -4.533128
0.400000 -0.063682 0.027703 0.645501 -0.171312 0.084662 -3.948477
0.433333 -0.069466 0.030578 0.448883 -0.173300 0.087424 -3.147275
0.466667 -0.075280 0.033517 0.129062 -0.175284 0.090263 -3.199262
0.500000 -0.081123 0.036521 -0.449549 -0.177246 0.093166 -4.086108
0.533333 -0.086995 0.039587 -0.761535 -0.179174 0.096120 -4.774675
0.566667 -0.092991 0.042816 -0.884820 -0.181060 0.099101 -5.311788
0.600000 -0.099015 0.046107 -1.231634 -0.182893 0.102082 -5.748302
0.633333 -0.105150 0.049558 -1.520550 -0.184673 0.105044 -6.057471
0.666667 -0.111388 0.053168 -1.794091 -0.186391 0.107957 -5.734461
0.700000 -0.117722 0.056929 -1.998597 -0.188040 0.110792 -4.845543
0.733333 -0.124080 0.060748 -1.998597 -0.189602 0.113514 -3.961055
0.766667 -0.130460 0.064623 -2.172285 -0.191069 0.116106 -3.062975
0.800000 -0.136861 0.068554 -2.272185 -0.192435 0.118550 -2.169295
0.833333 -0.143281 0.072539 -2.299933 -0.193696 0.120837 -1.328306
0.866667 -0.149782 0.076641 -2.308635 -0.194860 0.122972 -0.572435
0.900000 -0.156300 0.080794 -2.308635 -0.195950 0.124972 0.102800
0.933333 -0.162834 0.084996 -2.239119 -0.196985 0.126857 0.726939
0.966667 -0.169447 0.089293 -2.169488 -0.197972 0.128634 1.238651
1.000000 -0.176074 0.093636 -2.134160 -0.198916 0.130311 1.643049
1.033333 -0.182712 0.098026 -2.034987 -0.199824 0.131893 1.942636
1.066667 -0.189429 0.102480 -2.034987 -0.200686 0.133382 2.167404
1.100000 -0.196153 0.106977 -1.813865 -0.201490 0.134776 2.310491
1.133333 -0.202884 0.111514 -1.695855 -0.202221 0.136073 2.356111
1.166667 -0.209619 0.116091 -1.608938 -0.202875 0.137277 2.343422
1.200000 -0.216421 0.120703 -1.608938 -0.203444 0.138393 2.278149
1.233333 -0.223223 0.125351 -1.498662 -0.203923 0.139424 2.177040
1.266667 -0.230086 0.130026 -1.377955 -0.204310 0.140371 2.018915
1.300000 -0.236945 0.134734 -1.377955 -0.204605 0.141232 1.839338
1.333333 -0.243798 0.139472 -1.261789 -0.204807 0.142008 1.647051
1.366667 -0.250645 0.144239 -1.261789 -0.204904 0.142697 1.445563
1.400000 -0.257483 0.149033 -1.193354 -0.204893 0.143295 1.231893
1.433333 -0.264310 0.153852 -1.137689 -0.204769 0.143803 1.010467
1.466667 -0.271152 0.158677 -1.106753 -0.204529 0.144219 0.802557
1.500000 -0.278002 0.163506 -1.083988 -0.204160 0.144547 0.592449
1.533333 -0.284835 0.168355 -1.071537 -0.203657 0.144791 0.389146
1.566667 -0.291657 0.173205 -1.073286 -0.203015 0.144956 0.189308
1.600000 -0.298458 0.178054 -1.078589 -0.202222 0.145051 0.009169
1.633333 -0.305231 0.182901 -1.092990 -0.201260 0.145081 -0.147396
1.666667 -0.311966 0.187745 -1.097278 -0.200121 0.145054 -0.279541
1.700000 -0.318655 0.192584 -1.113839 -0.198802 0.144975 -0.379082
1.733333 -0.325292 0.197417 -1.137103 -0.197302 0.144848 -0.445566
1.766667 -0.331896 0.202257 -1.153203 -0.195622 0.144677 -0.477294
1.800000 -0.338429 0.207087 -1.187475 -0.193768 0.144462 -0.480213
1.833333 -0.344883 0.211907 -1.216601 -0.191753 0.144203 -0.465293
1.866667 -0.351299 0.216728 -1.249958 -0.189584 0.143899 -0.438775
1.900000 -0.357620 0.221533 -1.260753 -0.187267 0.143549 -0.407264
1.933333 -0.363840 0.226321 -1.267110 -0.184807 0.143149 -0.377829
1.966667 -0.369954 0.231089 -1.266488 -0.182220 0.142701 -0.352908
2.000000 -0.376022 0.235851 -1.265068 -0.179521 0.142206 -0.334445
2.033333 -0.381973 0.240591 -1.272768 -0.176731 0.141666 -0.314125
2.066667 -0.387875 0.245322 -1.261776 -0.173860 0.141085 -0.291954
2.100000 -0.393651 0.250028 -1.259012 -0.170927 0.140466 -0.264048
2.133333 -0.399297 0.254706 -1.275072 -0.167954 0.139816 -0.229745
2.166667 -0.404815 0.259355 -1.333997 -0.164951 0.139138 -0.185843
2.200000 -0.410279 0.263989 -1.365655 -0.161929 0.138435 -0.131477
2.233333 -0.415614 0.268594 -1.386075 -0.158898 0.137708 -0.070240
2.266667 -0.420818 0.273169 -1.362935 -0.155893 0.136961 -0.002956
2.300000 -0.425965 0.277723 -1.344826 -0.152924 0.136194 0.065861
2.333333 -0.431054 0.282256 -1.329227 -0.150002 0.135404 0.132553
2.366667 -0.436005 0.286762 -1.311775 -0.147138 0.134590 0.188164
2.400000 -0.440818 0.291242 -1.303170 -0.144348 0.133748 0.230346
2.433333 -0.445571 0.295694 -1.281911 -0.141635 0.132875 0.253550
2.466667 -0.450185 0.300120 -1.265279 -0.138985 0.131964 0.259267
2.500000 -0.454737 0.304515 -1.269690 -0.136395 0.131013 0.250437
2.533333 -0.459227 0.308877 -1.280795 -0.133860 0.130018 0.231512
2.566667 -0.463655 0.313206 -1.264246 -0.131362 0.128979 0.207689
2.600000 -0.468019 0.317499 -1.257475 -0.128865 0.127896 0.179548
2.633333 -0.472252 0.321755 -1.246884 -0.126340 0.126770 0.152534
2.666667 -0.476422 0.325972 -1.239336 -0.123762 0.125605 0.125858
2.700000 -0.480528 0.330147 -1.237783 -0.121110 0.124400 0.096958
2.733333 -0.484569 0.334281 -1.230437 -0.118367 0.123159 0.061266
2.766667 -0.488545 0.338369 -1.226985 -0.115531 0.121882 0.018916
2.800000 -0.492397 0.342415 -1.222812 -0.112617 0.120570 -0.031589
2.833333 -0.496125 0.346418 -1.225468 -0.109645 0.119220 -0.094296
2.866667 -0.499731 0.350377 -1.231943 -0.106637 0.117830 -0.171322
2.900000 -0.503217 0.354291 -1.239340 -0.103617 0.116400 -0.263411
2.933333 -0.506581 0.358160 -1.248695 -0.100611 0.114925 -0.368664
2.966667 -0.509827 0.361984 -1.245327 -0.097653 0.113401 -0.489159
