t x y theta dxdt dydt dthetadt
0.000000 0.000000 0.000000 -2.798536 -0.091485 -0.037777 2.724123
0.033333 -0.003054 -0.001355 -2.688996 -0.091214 -0.042858 2.140584
0.066667 -0.006091 -0.002860 -2.591418 -0.090925 -0.047985 1.500438
0.100000 -0.009112 -0.004515 -2.545118 -0.090619 -0.053152 0.821442
0.133333 -0.012124 -0.006352 -2.518754 -0.090293 -0.058348 0.105428
0.166667 -0.015128 -0.008369 -2.528040 -0.089941 -0.063563 -0.620156
0.200000 -0.018124 -0.010567 -2.562741 -0.089556 -0.068786 -1.336650
0.233333 -0.021111 -0.012948 -2.630104 -0.089129 -0.074006 -2.029975
0.266667 -0.024088 -0.015510 -2.722831 -0.088650 -0.079211 -2.673652
0.300000 -0.027054 -0.018254 -2.880526 -0.088110 -0.084389 -3.250610
0.333333 -0.030008 -0.021178 -3.005028 -0.087500 -0.089532 -3.732592
0.366667 -0.032947 -0.024281 3.124607 -0.086810 -0.094631 -4.099620
0.400000 -0.035853 -0.027539 2.949116 -0.086035 -0.099684 -4.341385
0.433333 -0.038726 -0.030953 2.798748 -0.085170 -0.104692 -4.444499
0.466667 -0.041562 -0.034522 2.592826 -0.084212 -0.109659 -4.408660
0.500000 -0.044373 -0.038264 2.381610 -0.083162 -0.114592 -4.235006
0.533333 -0.047145 -0.042162 2.233215 -0.082019 -0.119497 -3.935080
0.566667 -0.049881 -0.046230 2.033888 -0.080785 -0.124383 -3.529015
0.600000 -0.052575 -0.050454 1.930175 -0.079459 -0.129256 -3.039354
0.633333 -0.055224 -0.054846 1.801452 -0.078041 -0.134116 -2.490582
0.666667 -0.057822 -0.059404 1.723051 -0.076526 -0.138961 -1.917415
0.700000 -0.060372 -0.064119 1.710002 -0.074910 -0.143792 -1.354475
0.733333 -0.062862 -0.068999 1.684301 -0.073187 -0.148603 -0.824771
0.766667 -0.065289 -0.074043 1.693765 -0.071357 -0.153391 -0.356877
0.800000 -0.067664 -0.079243 1.742553 -0.069416 -0.158150 0.034189
0.833333 -0.069983 -0.084598 1.772284 -0.067368 -0.162881 0.333652
0.866667 -0.072227 -0.090113 1.809882 -0.065218 -0.167583 0.540747
0.900000 -0.074391 -0.095786 1.851877 -0.062975 -0.172255 0.661127
0.933333 -0.076473 -0.101614 1.890922 -0.060651 -0.176900 0.698369
0.966667 -0.078471 -0.107595 1.920023 -0.058257 -0.181520 0.671679
1.000000 -0.080382 -0.113728 1.945406 -0.055812 -0.186119 0.602144
1.033333 -0.082205 -0.120013 1.969848 -0.053331 -0.190701 0.515821
1.066667 -0.083939 -0.126447 1.993903 -0.050832 -0.195268 0.438319
1.100000 -0.085583 -0.133032 2.002635 -0.048327 -0.199825 0.398648
1.133333 -0.087137 -0.139767 2.006919 -0.045827 -0.204373 0.426965
1.166667 -0.088621 -0.146655 2.015177 -0.043338 -0.208917 0.535406
1.200000 -0.090014 -0.153694 1.996450 -0.040861 -0.213459 0.733680
1.233333 -0.091336 -0.160885 1.940307 -0.038393 -0.218001 1.016920
1.266667 -0.092566 -0.168230 1.935821 -0.035927 -0.222545 1.373920
1.300000 -0.093722 -0.175724 1.952568 -0.033454 -0.227092 1.780640
1.333333 -0.094803 -0.183370 1.999273 -0.030967 -0.231643 2.194922
1.366667 -0.095808 -0.191164 2.135590 -0.028455 -0.236198 2.585962
1.400000 -0.096736 -0.199108 2.250545 -0.025910 -0.240759 2.911180
1.433333 -0.097570 -0.207207 2.373611 -0.023328 -0.245327 3.137441
1.466667 -0.098308 -0.215464 2.602989 -0.020705 -0.249900 3.232968
1.500000 -0.098966 -0.223867 2.732871 -0.018041 -0.254475 3.185551
1.533333 -0.099528 -0.232427 2.917814 -0.015338 -0.259050 2.997308
1.566667 -0.100008 -0.241132 3.048489 -0.012603 -0.263619 2.683018
1.600000 -0.100392 -0.249994 -3.135522 -0.009842 -0.268176 2.268651
1.633333 -0.100679 -0.259012 -3.080469 -0.007062 -0.272715 1.787565
1.666667 -0.100868 -0.268186 -3.045910 -0.004269 -0.277230 1.290622
1.700000 -0.100958 -0.277517 -3.023672 -0.001467 -0.281719 0.811699
1.733333 -0.100950 -0.287002 -3.033632 0.001339 -0.286176 0.389402
1.766667 -0.100855 -0.296628 -3.046439 0.004145 -0.290595 0.047234
1.800000 -0.100672 -0.306393 -3.081970 0.006950 -0.294972 -0.193538
1.833333 -0.100400 -0.316297 -3.136310 0.009755 -0.299308 -0.321546
1.866667 -0.100029 -0.326353 3.107834 0.012558 -0.303601 -0.344542
1.900000 -0.099562 -0.336562 3.066078 0.015361 -0.307848 -0.268951
1.933333 -0.099004 -0.346905 3.023389 0.018165 -0.312053 -0.110023
1.966667 -0.098354 -0.357383 3.020175 0.020972 -0.316220 0.111298
2.000000 -0.097608 -0.368009 3.031615 0.023784 -0.320348 0.364139
2.033333 -0.096769 -0.378767 3.053606 0.026599 -0.324436 0.608254
2.066667 -0.095837 -0.389655 3.071103 0.029418 -0.328483 0.812606
2.100000 -0.094811 -0.400672 3.109545 0.032239 -0.332491 0.941133
2.133333 -0.093690 -0.411832 -3.112776 0.035060 -0.336457 0.964087
2.166667 -0.092473 -0.423119 -3.011355 0.037879 -0.340379 0.857732
2.200000 -0.091163 -0.434544 -2.924750 0.040696 -0.344257 0.614155
2.233333 -0.089757 -0.446093 -2.859888 0.043511 -0.348089 0.251893
2.266667 -0.088261 -0.457777 -2.806681 0.046323 -0.351872 -0.213788
2.300000 -0.086667 -0.469582 -2.786283 0.049129 -0.355604 -0.747825
2.333333 -0.084976 -0.481506 -2.810656 0.051930 -0.359283 -1.310579
2.366667 -0.083202 -0.493560 -2.901851 0.054726 -0.362908 -1.847146
2.400000 -0.081330 -0.505730 -2.982371 0.057515 -0.366477 -2.311458
2.433333 -0.079359 -0.518014 3.119991 0.060294 -0.369991 -2.670453
2.466667 -0.077311 -0.530421 2.988210 0.063066 -0.373452 -2.896597
2.500000 -0.075164 -0.542940 2.800778 0.065834 -0.376859 -2.971420
2.533333 -0.072918 -0.555569 2.624417 0.068597 -0.380214 -2.893596
2.566667 -0.070571 -0.568306 2.529568 0.071357 -0.383518 -2.687219
2.600000 -0.068145 -0.581156 2.444303 0.074116 -0.386771 -2.375940
2.633333 -0.065638 -0.594116 2.340305 0.076882 -0.389972 -1.995463
2.666667 -0.063030 -0.607179 2.310410 0.079656 -0.393121 -1.578716
2.700000 -0.060338 -0.620348 2.276751 0.082442 -0.396219 -1.163403
2.733333 -0.057544 -0.633618 2.258918 0.085245 -0.399264 -0.780762
2.766667 -0.054664 -0.646989 2.268611 0.088072 -0.402255 -0.446112
2.800000 -0.051682 -0.660458 2.288295 0.090924 -0.405191 -0.175093
2.833333 -0.048612 -0.674026 2.293006 0.093801 -0.408073 0.025673
2.866667 -0.045453 -0.687693 2.314129 0.096704 -0.410901 0.157506
2.900000 -0.042191 -0.701451 2.334092 0.099632 -0.413675 0.224562
2.933333 -0.038826 -0.715299 2.353354 0.102581 -0.416397 0.234836
2.966667 -0.035357 -0.729233 2.361652 0.105547 -0.419070 0.195983
3.000000 -0.031786 -0.743253 2.378019 0.108527 -0.421696 0.118826
3.033333 -0.028123 -0.757367 2.400595 0.111518 -0.424275 0.014440
3.066667 -0.024356 -0.771562 2.408392 0.114516 -0.426810 -0.107909
3.100000 -0.020485 -0.785836 2.406369 0.117518 -0.429299 -0.237975
3.133333 -0.016521 -0.800201 2.384706 0.120523 -0.431741 -0.361826
3.166667 -0.012453 -0.814641 2.344055 0.123532 -0.434127 -0.466663
3.200000 -0.008281 -0.829154 2.322051 0.126546 -0.436454 -0.538723
3.233333 -0.004013 -0.843752 2.312248 0.129565 -0.438715 -0.563624
3.266667 0.000352 -0.858435 2.281186 0.132591 -0.440905 -0.532015
3.300000 0.004815 -0.873199 2.243141 0.135627 -0.443018 -0.441064
3.333333 0.009381 -0.888028 2.202132 0.138674 -0.445052 -0.292422
3.366667 0.014051 -0.902919 2.154587 0.141731 -0.447005 -0.091251
3.400000 0.018825 -0.917872 2.141083 0.144798 -0.448878 0.142428
3.433333 0.023701 -0.932882 2.146234 0.147876 -0.450670 0.390019
3.466667 0.028681 -0.947948 2.165467 0.150961 -0.452383 0.624378
3.500000 0.033764 -0.963069 2.197441 0.154053 -0.454022 0.820834
3.533333 0.038949 -0.978240 2.267198 0.157148 -0.455586 0.946914
3.566667 0.044237 -0.993461 2.335096 0.160243 -0.457079 0.972945
3.600000 0.049632 -1.008739 2.416748 0.163337 -0.458499 0.882025
3.633333 0.055128 -1.024062 2.456833 0.166425 -0.459847 0.656591
3.666667 0.060732 -1.039435 2.528113 0.169507 -0.461120 0.295267
3.700000 0.066437 -1.054848 2.610219 0.172577 -0.462318 -0.203106
3.733333 0.072243 -1.070299 2.597363 0.175635 -0.463438 -0.817868
3.766667 0.078149 -1.085785 2.604874 0.178677 -0.464479 -1.528310
3.800000 0.084160 -1.101303 2.545116 0.181700 -0.465442 -2.292383
3.833333 0.090275 -1.116849 2.430135 0.184704 -0.466326 -3.058413
3.866667 0.096489 -1.132422 2.293881 0.187693 -0.467131 -3.778099
3.900000 0.102801 -1.148021 2.192382 0.190672 -0.467859 -4.389933
3.933333 0.109210 -1.163644 1.980763 0.193651 -0.468507 -4.842853
3.966667 0.115717 -1.179289 1.737083 0.196638 -0.469075 -5.087026
4.000000 0.122320 -1.194952 1.521169 0.199646 -0.469561 -5.107741
4.033333 0.129019 -1.210631 1.217331 0.202689 -0.469964 -4.896599
4.066667 0.135812 -1.226324 0.928076 0.205773 -0.470284 -4.452537
4.100000 0.142700 -1.242029 0.715644 0.208907 -0.470522 -3.795962
4.133333 0.149681 -1.257743 0.573306 0.212092 -0.470679 -2.970752
4.166667 0.156779 -1.273454 0.508513 0.215331 -0.470757 -2.033506
4.200000 0.163998 -1.289162 0.456468 0.218624 -0.470761 -1.020057
4.233333 0.171338 -1.304865 0.468129 0.221967 -0.470694 0.008231
4.266667 0.178802 -1.320563 0.522490 0.225361 -0.470558 0.989851
4.300000 0.186355 -1.336257 0.606289 0.228800 -0.470358 1.879954
4.333333 0.194037 -1.351944 0.695038 0.232278 -0.470095 2.667674
4.366667 0.201851 -1.367622 0.876120 0.235779 -0.469770 3.345349
4.400000 0.209749 -1.383290 1.055238 0.239290 -0.469384 3.891380
4.433333 0.217784 -1.398945 1.210174 0.242794 -0.468935 4.306856
4.466667 0.225901 -1.414585 1.349676 0.246271 -0.468421 4.602131
4.500000 0.234159 -1.430207 1.480575 0.249702 -0.467840 4.782597
4.533333 0.242557 -1.445809 1.690461 0.253072 -0.467192 4.823987
4.566667 0.251096 -1.461388 1.885390 0.256373 -0.466475 4.728543
4.600000 0.259776 -1.476939 2.054215 0.259586 -0.465690 4.507160
4.633333 0.268529 -1.492464 2.221400 0.262707 -0.464840 4.177608
4.666667 0.277354 -1.507958 2.477453 0.265726 -0.463926 3.744873
4.700000 0.286250 -1.523421 2.630504 0.268646 -0.462951 3.221223
4.733333 0.295278 -1.538849 2.769616 0.271474 -0.461918 2.646990
4.766667 0.304372 -1.554240 2.819249 0.274210 -0.460830 2.050237
4.800000 0.313595 -1.569596 2.843552 0.276868 -0.459686 1.458458
4.833333 0.322880 -1.584910 2.838559 0.279450 -0.458488 0.890768
4.866667 0.332225 -1.600179 2.810008 0.281964 -0.457236 0.385221
4.900000 0.341691 -1.615413 2.780083 0.284397 -0.455927 -0.032340
4.933333 0.351213 -1.630597 2.737723 0.286741 -0.454557 -0.352166
4.966667 0.360851 -1.645744 2.724245 0.288985 -0.453123 -0.577711
5.000000 0.370539 -1.660836 2.695296 0.291120 -0.451623 -0.714457
5.033333 0.380339 -1.675891 2.640379 0.293135 -0.450052 -0.766803
5.066667 0.390183 -1.690887 2.619298 0.295017 -0.448405 -0.757682
5.100000 0.400070 -1.705821 2.584022 0.296770 -0.446681 -0.705614
5.133333 0.409996 -1.720690 2.555865 0.298392 -0.444880 -0.625208
5.166667 0.420023 -1.735518 2.524254 0.299893 -0.443001 -0.523076
5.200000 0.430083 -1.750277 2.497522 0.301275 -0.441049 -0.407208
5.233333 0.440175 -1.764964 2.497691 0.302552 -0.439025 -0.290617
5.266667 0.450294 -1.779577 2.490352 0.303737 -0.436935 -0.175596
5.300000 0.460440 -1.794113 2.490473 0.304845 -0.434784 -0.066377
5.333333 0.470607 -1.808569 2.502011 0.305890 -0.432581 0.029897
5.366667 0.480855 -1.822975 2.521714 0.306879 -0.430328 0.106733
5.400000 0.491120 -1.837296 2.514078 0.307825 -0.428030 0.161669
5.433333 0.501399 -1.851531 2.524742 0.308730 -0.425691 0.196234
5.466667 0.511687 -1.865676 2.551487 0.309605 -0.423316 0.209774
5.500000 0.522040 -1.879761 2.552651 0.310445 -0.420903 0.205698
5.533333 0.532397 -1.893751 2.563473 0.311243 -0.418449 0.190493
5.566667 0.542808 -1.907675 2.583336 0.311994 -0.415951 0.171746
5.600000 0.553218 -1.921500 2.573566 0.312685 -0.413401 0.153021
5.633333 0.563670 -1.935252 2.584682 0.313300 -0.410791 0.140277
5.666667 0.574161 -1.948926 2.585285 0.313810 -0.408103 0.139374
5.700000 0.584639 -1.962494 2.579013 0.314195 -0.405326 0.149831
5.733333 0.595145 -1.975978 2.576476 0.314438 -0.402450 0.172899
5.766667 0.605673 -1.989374 2.570244 0.314524 -0.399464 0.205761
5.800000 0.616217 -2.002678 2.570843 0.314437 -0.396359 0.246006
5.833333 0.626772 -2.015886 2.588941 0.314171 -0.393130 0.288188
5.866667 0.637297 -2.028974 2.600860 0.313729 -0.389781 0.325216
5.900000 0.647790 -2.041940 2.627027 0.313111 -0.386309 0.353671
5.933333 0.658246 -2.054781 2.632684 0.312320 -0.382717 0.368901
5.966667 0.668663 -2.067495 2.661805 0.311360 -0.379008 0.367007
6.000000 0.679036 -2.080079 2.682883 0.310241 -0.375189 0.346843
6.033333 0.689381 -2.092539 2.693690 0.308972 -0.371266 0.309030
6.066667 0.699693 -2.104871 2.719316 0.307557 -0.367240 0.254753
6.100000 0.709963 -2.117070 2.717861 0.305997 -0.363115 0.187295
6.133333 0.720176 -2.129130 2.715264 0.304295 -0.358891 0.106646
6.166667 0.730327 -2.141047 2.720943 0.302448 -0.354570 0.018794
6.200000 0.740413 -2.152820 2.714838 0.300451 -0.350148 -0.071573
6.233333 0.750428 -2.164440 2.717229 0.298303 -0.345625 -0.160680
6.266667 0.760367 -2.175905 2.722273 0.296003 -0.341005 -0.245235
6.300000 0.770231 -2.187217 2.707865 0.293557 -0.336289 -0.320507
6.333333 0.780015 -2.198376 2.693358 0.290968 -0.331480 -0.379294
6.366667 0.789702 -2.209365 2.668789 0.288238 -0.326581 -0.420078
6.400000 0.799285 -2.220181 2.652095 0.285371 -0.321594 -0.442661
6.433333 0.808778 -2.230836 2.625427 0.282368 -0.316520 -0.444523
6.466667 0.818154 -2.241308 2.593304 0.279234 -0.311363 -0.423080
6.500000 0.827434 -2.251615 2.579017 0.275967 -0.306121 -0.383488
6.533333 0.836614 -2.261756 2.561175 0.272570 -0.300798 -0.330107
6.566667 0.845691 -2.271727 2.550560 0.269041 -0.295392 -0.266917
6.600000 0.854630 -2.281501 2.528460 0.265379 -0.289902 -0.191194
6.633333 0.863458 -2.291103 2.544198 0.261580 -0.284327 -0.112133
6.666667 0.872137 -2.300501 2.557678 0.257639 -0.278661 -0.034402
6.700000 0.880661 -2.309692 2.554906 0.253555 -0.272906 0.038964
6.733333 0.889065 -2.318705 2.552702 0.249329 -0.267065 0.104953
6.766667 0.897348 -2.327537 2.565649 0.244968 -0.261141 0.159375
6.800000 0.905506 -2.336187 2.552553 0.240476 -0.255142 0.189346
6.833333 0.913493 -2.344620 2.561911 0.235862 -0.249076 0.197216
6.866667 0.921304 -2.352835 2.577244 0.231133 -0.242949 0.182860
6.900000 0.928936 -2.360830 2.582425 0.226293 -0.236766 0.147790
6.933333 0.936385 -2.368604 2.633724 0.221354 -0.230537 0.089096
6.966667 0.943696 -2.376188 2.631382 0.216319 -0.224266 0.012141
7.000000 0.950866 -2.383580 2.654012 0.211198 -0.217961 -0.076163
7.033333 0.957841 -2.390748 2.631995 0.205994 -0.211624 -0.167238
7.066667 0.964618 -2.397691 2.631995 0.200715 -0.205262 -0.262790
7.100000 0.971247 -2.404438 2.604449 0.195358 -0.198875 -0.354773
7.133333 0.977673 -2.410959 2.569073 0.189919 -0.192458 -0.430473
7.166667 0.983946 -2.417283 2.530837 0.184404 -0.186013 -0.485093
7.200000 0.990010 -2.423379 2.543955 0.178811 -0.179540 -0.516110
7.233333 0.995918 -2.429274 2.505136 0.173143 -0.173037 -0.528054
7.266667 1.001613 -2.434942 2.492760 0.167398 -0.166504 -0.515362
7.300000 1.007094 -2.440379 2.457986 0.161581 -0.159942 -0.482910
7.333333 1.012412 -2.445614 2.445599 0.155695 -0.153355 -0.439155
7.366667 1.017512 -2.450619 2.449403 0.149744 -0.146742 -0.394713
7.400000 1.022393 -2.455392 2.415363 0.143736 -0.140109 -0.347655
7.433333 1.027106 -2.459962 2.415621 0.137688 -0.133463 -0.302309
7.466667 1.031597 -2.464299 2.403232 0.131616 -0.126813 -0.260285
7.500000 1.035919 -2.468431 2.398218 0.125534 -0.120166 -0.225909
7.533333 1.040016 -2.472331 2.393830 0.119464 -0.113533 -0.198752
7.566667 1.043890 -2.476000 2.399920 0.113416 -0.106918 -0.171549
7.600000 1.047539 -2.479436 2.388404 0.107392 -0.100325 -0.148180
7.633333 1.050962 -2.482641 2.394736 0.101392 -0.093752 -0.127669
7.666667 1.054210 -2.485639 2.390521 0.095410 -0.087197 -0.112248
7.700000 1.057282 -2.488430 2.365808 0.089435 -0.080656 -0.094903
7.733333 1.060176 -2.491013 2.354923 0.083450 -0.074120 -0.074016
7.766667 1.062892 -2.493389 2.367226 0.077440 -0.067583 -0.052833
7.800000 1.065381 -2.495534 2.371286 0.071394 -0.061039 -0.034966
7.833333 1.067690 -2.497472 2.368782 0.065303 -0.054485 -0.022395
7.866667 1.069821 -2.499202 2.362883 0.059162 -0.047918 -0.017768
7.900000 1.071723 -2.500703 2.365901 0.052979 -0.041342 -0.033648
7.933333 1.073397 -2.501974 2.371639 0.046766 -0.034762 -0.077338
7.966667 1.074843 -2.503016 2.368860 0.040539 -0.028186 -0.153509
8.000000 1.076061 -2.503830 2.369916 0.034312 -0.021622 -0.262499
8.033333 1.077050 -2.504415 2.393272 0.028100 -0.015075 -0.402842
8.066667 1.077860 -2.504795 2.390605 0.021913 -0.008551 -0.571971
8.100000 1.078489 -2.504969 2.386333 0.015750 -0.002050 -0.759496
8.133333 1.078890 -2.504917 2.358418 0.009608 0.004429 -0.952177
8.166667 1.079112 -2.504661 2.301853 0.003481 0.010891 -1.132532
8.200000 1.079154 -2.504201 2.258308 -0.002641 0.017338 -1.288501
8.233333 1.078972 -2.503516 2.204173 -0.008770 0.023777 -1.414348
8.266667 1.078610 -2.502630 2.140240 -0.014911 0.030208 -1.505512
8.300000 1.078027 -2.501520 2.051307 -0.021062 0.036631 -1.562615
8.333333 1.077223 -2.500190 1.967128 -0.027221 0.043044 -1.593291
8.366667 1.076202 -2.498639 1.909055 -0.033378 0.049442 -1.612827
8.400000 1.074964 -2.496870 1.856618 -0.039514 0.055813 -1.629479
8.433333 1.073514 -2.494885 1.814675 -0.045610 0.062149 -1.645813
8.466667 1.071890 -2.492703 1.798051 -0.051648 0.068440 -1.668527
8.500000 1.070058 -2.490308 1.795570 -0.057613 0.074677 -1.698878
8.533333 1.068020 -2.487702 1.758217 -0.063489 0.080851 -1.733080
8.566667 1.065780 -2.484887 1.664131 -0.069268 0.086959 -1.757444
8.600000 1.063341 -2.481865 1.593040 -0.074946 0.092998 -1.760436
8.633333 1.060705 -2.478639 1.478461 -0.080519 0.098964 -1.725733
8.666667 1.057905 -2.475224 1.394911 -0.085981 0.104857 -1.630116
8.700000 1.054940 -2.471620 1.347713 -0.091332 0.110675 -1.458873
8.733333 1.051790 -2.467821 1.293842 -0.096575 0.116421 -1.206325
8.766667 1.048456 -2.463828 1.222621 -0.101711 0.122096 -0.880689
8.800000 1.044942 -2.459643 1.161074 -0.106746 0.127703 -0.495803
8.833333 1.041272 -2.455276 1.129893 -0.111686 0.133247 -0.083409
8.866667 1.037447 -2.450729 1.127934 -0.116539 0.138735 0.319278
8.900000 1.033470 -2.446003 1.165792 -0.121309 0.144171 0.679632
8.933333 1.029341 -2.441100 1.224045 -0.125999 0.149561 0.960748
8.966667 1.025049 -2.436016 1.286735 -0.130614 0.154909 1.129444
9.000000 1.020609 -2.430759 1.399123 -0.135154 0.160220 1.158084
9.033333 1.016013 -2.425324 1.496709 -0.139619 0.165497 1.039654
9.066667 1.011263 -2.419712 1.581162 -0.144005 0.170741 0.768156
9.100000 1.006373 -2.413931 1.664348 -0.148309 0.175952 0.343659
9.133333 1.001337 -2.407975 1.696857 -0.152524 0.181130 -0.213525
9.166667 0.996159 -2.401843 1.668581 -0.156645 0.186272 -0.872295
9.200000 0.990844 -2.395536 1.656859 -0.160666 0.191371 -1.601811
9.233333 0.985394 -2.389056 1.621463 -0.164581 0.196421 -2.372122
9.266667 0.979816 -2.382418 1.478113 -0.168391 0.201413 -3.139032
9.300000 0.974112 -2.375609 1.319482 -0.172097 0.206339 -3.865301
9.333333 0.968288 -2.368632 1.159008 -0.175703 0.211189 -4.513676
9.366667 0.962348 -2.361491 1.000975 -0.179213 0.215955 -5.062596
9.400000 0.956297 -2.354188 0.797996 -0.182634 0.220629 -5.475420
9.433333 0.950137 -2.346728 0.590692 -0.185972 0.225205 -5.731504
9.466667 0.943874 -2.339115 0.325431 -0.189234 0.229676 -5.823482
9.500000 0.937499 -2.331358 0.073322 -0.192424 0.234039 -5.742654
9.533333 0.931015 -2.323459 -0.208103 -0.195546 0.238292 -5.496722
9.566667 0.924436 -2.315424 -0.398244 -0.198605 0.242437 -5.092148
9.600000 0.917752 -2.307251 -0.576324 -0.201604 0.246473 -4.563971
9.633333 0.910967 -2.298943 -0.795815 -0.204544 0.250405 -3.938892
9.666667 0.904084 -2.290502 -0.903172 -0.207428 0.254233 -3.264786
9.700000 0.897108 -2.281941 -1.028846 -0.210256 0.257961 -2.585655
9.733333 0.890040 -2.273264 -1.058647 -0.213032 0.261590 -1.951021
9.766667 0.882880 -2.264474 -1.072108 -0.215753 0.265123 -1.396668
9.800000 0.875632 -2.255561 -1.031010 -0.218419 0.268563 -0.950379
9.833333 0.868299 -2.246526 -1.009949 -0.221028 0.271915 -0.641300
9.866667 0.860884 -2.237373 -0.979782 -0.223580 0.275181 -0.469421
9.900000 0.853379 -2.228120 -0.958930 -0.226071 0.278365 -0.435963
9.933333 0.845787 -2.218770 -0.941407 -0.228498 0.281472 -0.521414
9.966667 0.838108 -2.209328 -0.938881 -0.230858 0.284504 -0.710892
10.000000 0.830345 -2.199795 -0.973299 -0.233147 0.287462 -0.976150
10.033333 0.822514 -2.190156 -1.019790 -0.235358 0.290354 -1.288039
10.066667 0.814617 -2.180411 -1.073787 -0.237484 0.293183 -1.616521
10.100000 0.806657 -2.170563 -1.127035 -0.239523 0.295953 -1.939352
10.133333 0.798623 -2.160634 -1.201294 -0.241471 0.298662 -2.238531
10.166667 0.790517 -2.150625 -1.279811 -0.243326 0.301312 -2.499573
10.200000 0.782343 -2.140537 -1.409979 -0.245087 0.303899 -2.713607
10.233333 0.774118 -2.130355 -1.518618 -0.246753 0.306420 -2.878251
10.266667 0.765844 -2.120083 -1.626906 -0.248325 0.308872 -3.002379
10.300000 0.757525 -2.109722 -1.736372 -0.249800 0.311257 -3.085600
10.333333 0.749152 -2.099289 -1.858148 -0.251173 0.313577 -3.140835
10.366667 0.740740 -2.088773 -1.976018 -0.252443 0.315832 -3.179942
10.400000 0.732283 -2.078190 -2.063169 -0.253608 0.318025 -3.228093
10.433333 0.723784 -2.067541 -2.187658 -0.254666 0.320158 -3.297961
10.466667 0.715248 -2.056830 -2.273329 -0.255614 0.322234 -3.392081
10.500000 0.706685 -2.046045 -2.362221 -0.256448 0.324256 -3.524090
10.533333 0.698095 -2.035199 -2.445298 -0.257166 0.326227 -3.692699
10.566667 0.689483 -2.024283 -2.568528 -0.257766 0.328149 -3.895324
10.600000 0.680853 -2.013298 -2.689282 -0.258245 0.330025 -4.107953
10.633333 0.672211 -2.002257 -2.807038 -0.258597 0.331856 -4.312255
10.666667 0.663556 -1.991151 -2.980890 -0.258823 0.333640 -4.503937
10.700000 0.654902 -1.979991 3.133365 -0.258921 0.335375 -4.659720
10.733333 0.646240 -1.968771 2.925705 -0.258887 0.337058 -4.759485
10.766667 0.637574 -1.957494 2.691332 -0.258716 0.338686 -4.779840
10.800000 0.628924 -1.946165 2.583458 -0.258405 0.340256 -4.723526
10.833333 0.620294 -1.934784 2.385585 -0.257957 0.341766 -4.580814
10.866667 0.611669 -1.923353 2.225245 -0.257372 0.343215 -4.335761
10.900000 0.603051 -1.911874 2.041272 -0.256650 0.344598 -3.979677
10.933333 0.594473 -1.900349 1.920540 -0.255801 0.345915 -3.519392
10.966667 0.585941 -1.888780 1.817600 -0.254837 0.347163 -2.974979
11.000000 0.577424 -1.877170 1.663316 -0.253768 0.348341 -2.336752
11.033333 0.568964 -1.865522 1.564054 -0.252597 0.349447 -1.621063
11.066667 0.560566 -1.853839 1.495376 -0.251329 0.350478 -0.854875
11.100000 0.552192 -1.842122 1.471295 -0.249966 0.351434 -0.073978
11.133333 0.543889 -1.830377 1.451066 -0.248507 0.352312 0.696704
11.166667 0.535613 -1.818601 1.509463 -0.246935 0.353113 1.438223
11.200000 0.527369 -1.806797 1.601782 -0.245244 0.353836 2.105925
11.233333 0.519207 -1.794976 1.770399 -0.243431 0.354481 2.659765
11.266667 0.511080 -1.783131 1.922925 -0.241493 0.355052 3.083927
11.300000 0.502990 -1.771264 2.060454 -0.239432 0.355550 3.362849
11.333333 0.494992 -1.759386 2.197673 -0.237259 0.355978 3.490630
11.366667 0.487087 -1.747499 2.399891 -0.235000 0.356342 3.464296
11.400000 0.479277 -1.735603 2.493415 -0.232680 0.356645 3.307881
11.433333 0.471564 -1.723700 2.675370 -0.230323 0.356892 3.054044
11.466667 0.463949 -1.711792 2.763580 -0.227959 0.357085 2.728664
11.500000 0.456434 -1.699879 2.865254 -0.225614 0.357230 2.362394
11.533333 0.448969 -1.687959 2.917096 -0.223310 0.357327 1.981726
11.566667 0.441607 -1.676038 2.951843 -0.221050 0.357378 1.620309
11.600000 0.434299 -1.664114 2.986329 -0.218835 0.357384 1.287571
11.633333 0.427047 -1.652190 2.996600 -0.216661 0.357342 1.002327
11.666667 0.419852 -1.640268 3.006623 -0.214517 0.357253 0.770112
11.700000 0.412717 -1.628349 3.019235 -0.212379 0.357114 0.595764
11.733333 0.405642 -1.616436 3.028721 -0.210229 0.356923 0.476540
11.766667 0.398675 -1.604528 3.033356 -0.208051 0.356680 0.400628
11.800000 0.391771 -1.592630 3.033822 -0.205832 0.356383 0.363083
11.833333 0.384932 -1.580744 3.042805 -0.203554 0.356033 0.347201
11.866667 0.378159 -1.568872 3.049690 -0.201203 0.355631 0.343741
11.900000 0.371496 -1.557011 3.065766 -0.198776 0.355177 0.343631
11.933333 0.364901 -1.545167 3.085763 -0.196269 0.354673 0.340462
11.966667 0.358376 -1.533342 3.101067 -0.193676 0.354117 0.327013
12.000000 0.351922 -1.521540 3.120048 -0.190993 0.353511 0.299954
12.033333 0.345578 -1.509755 3.132591 -0.188224 0.352853 0.259129
12.066667 0.339308 -1.497995 -3.136727 -0.185379 0.352141 0.204165
12.100000 0.333152 -1.486257 -3.121591 -0.182457 0.351373 0.135858
12.133333 0.327109 -1.474544 -3.125400 -0.179466 0.350547 0.059589
12.166667 0.321180 -1.462858 -3.129468 -0.176420 0.349659 -0.015008
12.200000 0.315364 -1.451200 -3.127833 -0.173337 0.348705 -0.080355
12.233333 0.309626 -1.439577 -3.128045 -0.170228 0.347681 -0.130210
12.266667 0.303999 -1.427988 -3.131265 -0.167110 0.346583 -0.158270
12.300000 0.298483 -1.416436 3.120264 -0.164000 0.345409 -0.158114
12.333333 0.293074 -1.404923 3.105231 -0.160913 0.344159 -0.132098
12.366667 0.287770 -1.393452 3.084748 -0.157859 0.342832 -0.084478
12.400000 0.282569 -1.382027 3.074698 -0.154843 0.341430 -0.020773
12.433333 0.277471 -1.370651 3.066853 -0.151874 0.339952 0.053369
12.466667 0.272473 -1.359327 3.076833 -0.148958 0.338402 0.129943
12.500000 0.267573 -1.348059 3.083933 -0.146094 0.336779 0.197647
12.533333 0.262771 -1.336849 3.112756 -0.143283 0.335085 0.251110
12.566667 0.258063 -1.325700 3.134454 -0.140523 0.333321 0.281977
12.600000 0.253437 -1.314606 -3.118918 -0.137813 0.331492 0.279513
12.633333 0.248892 -1.303567 -3.103188 -0.135147 0.329603 0.239022
12.666667 0.244428 -1.292586 -3.095694 -0.132520 0.327656 0.157247
12.700000 0.240056 -1.281679 -3.097953 -0.129927 0.325653 0.033904
12.733333 0.235774 -1.270850 -3.085842 -0.127363 0.323600 -0.136214
12.766667 0.231580 -1.260099 -3.084623 -0.124824 0.321501 -0.345950
12.800000 0.227467 -1.249412 -3.080715 -0.122306 0.319355 -0.585079
12.833333 0.223435 -1.238791 -3.091479 -0.119810 0.317166 -0.853210
12.866667 0.219490 -1.228253 -3.095843 -0.117334 0.314937 -1.149376
12.900000 0.215625 -1.217784 3.134039 -0.114879 0.312672 -1.468038
12.933333 0.211841 -1.207384 3.052198 -0.112445 0.310373 -1.787781
12.966667 0.208138 -1.197071 3.007763 -0.110030 0.308041 -2.103712
13.000000 0.204515 -1.186829 2.931030 -0.107634 0.305679 -2.401082
13.033333 0.200970 -1.176675 2.842210 -0.105256 0.303288 -2.656688
13.066667 0.197505 -1.166596 2.702969 -0.102893 0.300869 -2.837060
13.100000 0.194117 -1.156607 2.621829 -0.100545 0.298424 -2.921681
13.133333 0.190808 -1.146694 2.502969 -0.098209 0.295955 -2.904115
13.166667 0.187574 -1.136873 2.367516 -0.095886 0.293463 -2.762932
13.200000 0.184418 -1.127131 2.212345 -0.093575 0.290951 -2.488415
13.233333 0.181339 -1.117469 2.070276 -0.091278 0.288416 -2.083185
13.266667 0.178339 -1.107889 1.975888 -0.088994 0.285856 -1.571758
13.300000 0.175415 -1.098392 1.900468 -0.086728 0.283265 -0.969837
13.333333 0.172564 -1.088990 1.866818 -0.084479 0.280639 -0.300650
13.366667 0.169789 -1.079673 1.867229 -0.082250 0.277974 0.398270
13.400000 0.167090 -1.070442 1.912250 -0.080042 0.275267 1.078289
13.433333 0.164466 -1.061298 1.986342 -0.077857 0.272515 1.700356
13.466667 0.161916 -1.052241 2.070950 -0.075694 0.269721 2.242454
13.500000 0.159435 -1.043285 2.213076 -0.073550 0.266892 2.675938
13.533333 0.157026 -1.034419 2.383431 -0.071425 0.264033 2.983572
13.566667 0.154685 -1.025657 2.513066 -0.069316 0.261147 3.155844
13.600000 0.152410 -1.017002 2.643800 -0.067222 0.258238 3.206692
13.633333 0.150201 -1.008455 2.779188 -0.065139 0.255309 3.149542
13.666667 0.148064 -1.000001 2.886273 -0.063066 0.252359 2.993918
13.700000 0.145997 -0.991641 3.022455 -0.061003 0.249383 2.757191
13.733333 0.144000 -0.983374 3.091811 -0.058948 0.246377 2.467466
13.766667 0.142072 -0.975202 -3.131706 -0.056903 0.243335 2.147561
13.800000 0.140212 -0.967125 -3.045318 -0.054870 0.240250 1.810314
13.833333 0.138420 -0.959145 -2.980553 -0.052853 0.237120 1.470982
13.866667 0.136696 -0.951261 -2.939019 -0.050855 0.233938 1.142300
13.900000 0.135040 -0.943496 -2.929574 -0.048879 0.230706 0.842245
13.933333 0.133450 -0.935852 -2.908440 -0.046928 0.227429 0.567395
13.966667 0.131927 -0.928328 -2.912488 -0.045006 0.224115 0.324122
14.000000 0.130468 -0.920902 -2.912669 -0.043115 0.220770 0.117707
14.033333 0.129070 -0.913598 -2.933592 -0.041257 0.217401 -0.048045
14.066667 0.127733 -0.906416 -2.925321 -0.039433 0.214020 -0.171291
14.100000 0.126455 -0.899355 -2.968005 -0.037646 0.210634 -0.259807
14.133333 0.125238 -0.892394 -2.971081 -0.035894 0.207249 -0.312211
14.166667 0.124081 -0.885534 -2.987704 -0.034177 0.203866 -0.334287
14.200000 0.122978 -0.878794 -3.009641 -0.032494 0.200494 -0.330478
14.233333 0.121934 -0.872155 -3.021335 -0.030841 0.197136 -0.309964
14.266667 0.120942 -0.865636 -3.034611 -0.029217 0.193793 -0.277008
14.300000 0.120000 -0.859237 -3.046711 -0.027621 0.190466 -0.236112
14.333333 0.119108 -0.852956 -3.052837 -0.026052 0.187154 -0.191385
14.366667 0.118265 -0.846794 -3.051445 -0.024508 0.183861 -0.145511
14.400000 0.117476 -0.840733 -3.040736 -0.022989 0.180588 -0.103975
14.433333 0.116741 -0.834771 -3.061914 -0.021495 0.177336 -0.066218
14.466667 0.116059 -0.828910 -3.056128 -0.020026 0.174105 -0.036407
14.500000 0.115422 -0.823164 -3.055917 -0.018583 0.170895 -0.014329
14.533333 0.114836 -0.817518 -3.053594 -0.017164 0.167707 0.001185
14.566667 0.114293 -0.811985 -3.049423 -0.015773 0.164534 0.009111
14.600000 0.113799 -0.806552 -3.045521 -0.014412 0.161376 0.012053
14.633333 0.113347 -0.801230 -3.047489 -0.013080 0.158229 0.009423
14.666667 0.112935 -0.796019 -3.050788 -0.011778 0.155096 0.006521
14.700000 0.112570 -0.790906 -3.039876 -0.010505 0.151977 0.002130
14.733333 0.112250 -0.785892 -3.040537 -0.009261 0.148874 -0.004070
