t x y theta dxdt dydt dthetadt
0.000000 0.000000 0.000000 0.257089 0.004836 -0.002512 0.002348
0.033333 0.000041 -0.000139 0.257913 0.007057 -0.002473 0.006269
0.066667 -0.000108 -0.000082 0.260217 0.010817 -0.002499 0.014965
0.100000 -0.000429 0.000101 0.265866 0.017033 -0.002666 0.033840
0.133333 -0.000221 0.000096 0.259771 0.026564 -0.003019 0.068435
0.166667 -0.000427 0.000274 0.255936 0.040226 -0.003684 0.121949
0.200000 -0.000072 0.000251 0.261572 0.059115 -0.004787 0.203395
0.233333 0.000862 0.000022 0.257908 0.083929 -0.006437 0.314134
0.266667 0.002390 -0.000422 0.258882 0.115334 -0.008710 0.451945
0.300000 0.004622 -0.000487 0.268198 0.153274 -0.011643 0.614101
0.333333 0.007481 -0.000779 0.255705 0.197686 -0.015270 0.799439
0.366667 0.012362 -0.001002 0.277635 0.248399 -0.019544 1.000028
0.400000 0.020176 -0.001274 0.337572 0.304371 -0.024493 1.201424
0.433333 0.032226 -0.002029 0.392255 0.364447 -0.030138 1.392380
0.466667 0.044949 -0.003045 0.443170 0.426945 -0.036545 1.562740
0.500000 0.058349 -0.004329 0.506715 0.490519 -0.043907 1.699765
0.533333 0.076975 -0.005873 0.591908 0.553440 -0.052417 1.785896
0.566667 0.096286 -0.007702 0.657599 0.614055 -0.062438 1.817004
0.600000 0.120885 -0.009611 0.730438 0.671013 -0.074198 1.795570
0.633333 0.146163 -0.011821 0.810888 0.723563 -0.087956 1.724913
0.666667 0.172113 -0.014337 0.901121 0.771302 -0.104058 1.611837
0.700000 0.200467 -0.017069 0.951274 0.813716 -0.122642 1.470198
0.733333 0.229906 -0.020848 1.009322 0.851015 -0.143779 1.316523
0.766667 0.259993 -0.024953 1.046624 0.883345 -0.167197 1.161903
0.800000 0.290719 -0.029387 1.061782 0.911469 -0.192762 1.015338
0.833333 0.321677 -0.036331 1.065690 0.935892 -0.220137 0.888081
0.866667 0.353252 -0.043611 1.088601 0.957200 -0.248775 0.788255
0.900000 0.386035 -0.053380 1.093825 0.976254 -0.277915 0.717640
0.933333 0.419413 -0.063487 1.113103 0.993610 -0.306918 0.675579
0.966667 0.453374 -0.073930 1.129256 1.009878 -0.335326 0.661102
1.000000 0.487442 -0.085958 1.157752 1.025323 -0.362398 0.669484
1.033333 0.521671 -0.099517 1.183781 1.040185 -0.387689 0.690865
1.066667 0.556446 -0.113405 1.212864 1.054639 -0.410870 0.718256
1.100000 0.591754 -0.127617 1.234083 1.068785 -0.432081 0.742635
1.133333 0.627583 -0.143324 1.252035 1.082685 -0.451308 0.761606
1.166667 0.663921 -0.159344 1.279750 1.096402 -0.468536 0.770012
1.200000 0.700753 -0.175672 1.312424 1.109958 -0.484136 0.765434
1.233333 0.738067 -0.192300 1.350393 1.123364 -0.498514 0.748401
1.266667 0.775849 -0.209223 1.366146 1.136683 -0.512053 0.719389
1.300000 0.814086 -0.226433 1.398961 1.149926 -0.524958 0.680272
1.333333 0.852763 -0.243924 1.429898 1.163105 -0.537632 0.628892
1.366667 0.891951 -0.262059 1.449523 1.176280 -0.550525 0.565997
1.400000 0.931232 -0.280590 1.476001 1.189543 -0.563851 0.492828
1.433333 0.970909 -0.299379 1.478562 1.202951 -0.577610 0.414502
1.466667 1.010967 -0.318417 1.489681 1.216537 -0.591808 0.330618
1.500000 1.051391 -0.337696 1.504924 1.230330 -0.606454 0.245275
1.533333 1.092603 -0.358145 1.510653 1.244325 -0.621379 0.164138
1.566667 1.134578 -0.379698 1.518365 1.258540 -0.636210 0.091562
1.600000 1.176868 -0.401465 1.524834 1.272898 -0.650609 0.033911
1.633333 1.219457 -0.423433 1.510103 1.287358 -0.664307 -0.009875
1.666667 1.262328 -0.445593 1.504984 1.301879 -0.677039 -0.034610
1.700000 1.306139 -0.468892 1.491994 1.316363 -0.688458 -0.036619
1.733333 1.350656 -0.492776 1.477021 1.330747 -0.698341 -0.016632
1.766667 1.395397 -0.516815 1.486873 1.344770 -0.706722 0.024368
1.800000 1.440344 -0.540995 1.477229 1.358347 -0.713536 0.081906
1.833333 1.485475 -0.565304 1.465233 1.371395 -0.718721 0.152712
1.866667 1.530772 -0.589729 1.473641 1.383880 -0.722130 0.230466
1.900000 1.578116 -0.613902 1.480867 1.395750 -0.723771 0.307803
1.933333 1.625583 -0.638164 1.507734 1.406993 -0.723644 0.378313
1.966667 1.673150 -0.662504 1.525145 1.417706 -0.721631 0.439412
2.000000 1.720794 -0.686906 1.550002 1.427954 -0.717895 0.484976
2.033333 1.768492 -0.711359 1.574188 1.437801 -0.712601 0.512987
2.066667 1.816221 -0.735848 1.591854 1.447211 -0.706081 0.524537
2.100000 1.863957 -0.760360 1.621562 1.456354 -0.698610 0.516731
2.133333 1.913008 -0.783407 1.640471 1.465249 -0.690549 0.492600
2.166667 1.962018 -0.806453 1.646212 1.473947 -0.682292 0.450411
2.200000 2.011570 -0.828474 1.659510 1.482306 -0.674232 0.396996
2.233333 2.061357 -0.850008 1.679944 1.490160 -0.666795 0.334630
2.266667 2.111028 -0.871507 1.692491 1.497421 -0.660442 0.261751
2.300000 2.160371 -0.892764 1.719082 1.504079 -0.655777 0.183136
2.333333 2.211824 -0.914355 1.707164 1.510343 -0.653248 0.100959
2.366667 2.263079 -0.935879 1.710473 1.516400 -0.653286 0.018028
2.400000 2.314106 -0.957326 1.721044 1.522474 -0.655983 -0.065962
2.433333 2.364876 -0.978684 1.705244 1.528998 -0.661370 -0.148358
2.466667 2.415361 -0.999942 1.699251 1.536343 -0.669243 -0.223673
2.500000 2.465530 -1.021089 1.682707 1.544597 -0.679124 -0.286295
2.533333 2.516909 -1.043306 1.675883 1.553727 -0.690387 -0.336607
2.566667 2.567913 -1.065389 1.664124 1.563699 -0.702404 -0.372391
2.600000 2.618879 -1.088716 1.638847 1.574528 -0.714614 -0.393239
2.633333 2.671748 -1.113562 1.618530 1.585910 -0.726411 -0.399686
2.666667 2.726338 -1.139720 1.597227 1.597391 -0.737182 -0.391942
2.700000 2.780416 -1.165689 1.580479 1.608451 -0.746390 -0.374929
2.733333 2.833947 -1.191450 1.583916 1.618606 -0.753762 -0.348825
2.766667 2.888802 -1.217204 1.556447 1.627214 -0.759005 -0.314087
2.800000 2.943036 -1.242718 1.547747 1.633799 -0.762113 -0.270918
2.833333 2.998273 -1.268456 1.550239 1.637848 -0.763146 -0.220372
2.866667 3.054098 -1.294085 1.544940 1.639097 -0.762416 -0.166021
2.900000 3.109184 -1.319421 1.541975 1.637554 -0.760381 -0.112326
2.933333 3.163491 -1.344447 1.527464 1.633296 -0.757473 -0.061622
2.966667 3.219693 -1.370272 1.509551 1.626490 -0.754067 -0.018195
3.000000 3.275031 -1.395751 1.518166 1.617070 -0.750326 0.012743
3.033333 3.329463 -1.420867 1.527326 1.605098 -0.746382 0.025921
3.066667 3.382948 -1.445599 1.541052 1.590692 -0.742249 0.015306
3.100000 3.435442 -1.469929 1.545750 1.573300 -0.737559 -0.018373
3.133333 3.488155 -1.494418 1.563279 1.551582 -0.731553 -0.079318
3.166667 3.539793 -1.518468 1.569609 1.524499 -0.723640 -0.170735
3.200000 3.590202 -1.542207 1.583988 1.490523 -0.712955 -0.293545
3.233333 3.641047 -1.566758 1.560249 1.448217 -0.698614 -0.442592
3.266667 3.691714 -1.591491 1.536801 1.395951 -0.679676 -0.607864
3.300000 3.741136 -1.615709 1.522971 1.333055 -0.655647 -0.785097
3.333333 3.789271 -1.639391 1.510754 1.259654 -0.626359 -0.965629
3.366667 3.833949 -1.661757 1.461926 1.175428 -0.591408 -1.139641
3.400000 3.877258 -1.683546 1.412682 1.081262 -0.551047 -1.297604
3.433333 3.914278 -1.702735 1.358702 0.978210 -0.505733 -1.435488
3.466667 3.943697 -1.718556 1.297604 0.867714 -0.456220 -1.551318
3.500000 3.971656 -1.733745 1.241499 0.750819 -0.403095 -1.637489
3.533333 3.990846 -1.744525 1.176904 0.629630 -0.347566 -1.687663
3.566667 4.008538 -1.754648 1.095243 0.506724 -0.291143 -1.697551
3.600000 4.024717 -1.764104 1.046306 0.383832 -0.235083 -1.665017
3.633333 4.039369 -1.772886 0.987076 0.262411 -0.180437 -1.587735
3.666667 4.046085 -1.777523 0.930473 0.143793 -0.128146 -1.469565
3.700000 4.046326 -1.778914 0.870532 0.029715 -0.079363 -1.321941
3.733333 4.045027 -1.779612 0.798507 -0.079840 -0.034319 -1.155829
3.766667 4.038136 -1.778209 0.735039 -0.184789 0.006787 -0.983072
3.800000 4.026077 -1.775430 0.709638 -0.284253 0.043846 -0.813756
3.833333 4.012496 -1.771958 0.712663 -0.377293 0.076706 -0.660796
3.866667 3.997406 -1.767798 0.713979 -0.463655 0.105630 -0.530329
3.900000 3.980820 -1.762954 0.723990 -0.543984 0.131301 -0.423882
3.933333 3.959775 -1.758275 0.734114 -0.618074 0.154162 -0.344139
3.966667 3.937263 -1.752919 0.741733 -0.686411 0.174917 -0.293479
4.000000 3.911468 -1.746919 0.735681 -0.750186 0.194320 -0.268849
4.033333 3.884245 -1.740248 0.702214 -0.810548 0.213112 -0.258765
4.066667 3.855616 -1.732911 0.674793 -0.868004 0.231734 -0.255315
4.100000 3.825603 -1.724913 0.663667 -0.922518 0.250466 -0.251043
4.133333 3.794229 -1.716260 0.658132 -0.974553 0.269442 -0.241022
4.166667 3.761516 -1.706957 0.649368 -1.024147 0.288674 -0.219763
4.200000 3.725930 -1.696937 0.642447 -1.071213 0.308101 -0.189722
4.233333 3.688223 -1.686444 0.627959 -1.115698 0.327705 -0.162193
4.266667 3.649254 -1.675319 0.629155 -1.157547 0.347527 -0.145115
4.300000 3.608952 -1.663290 0.621244 -1.196764 0.367528 -0.145145
4.333333 3.567448 -1.650643 0.632494 -1.233111 0.387740 -0.167939
4.366667 3.525367 -1.637534 0.646428 -1.266501 0.408274 -0.216745
4.400000 3.482142 -1.623824 0.646908 -1.296959 0.429254 -0.290867
4.433333 3.437790 -1.609258 0.649782 -1.324600 0.450743 -0.383905
4.466667 3.392354 -1.594106 0.640919 -1.349780 0.472803 -0.490224
4.500000 3.346721 -1.577936 0.614618 -1.372945 0.495526 -0.602950
4.533333 3.300065 -1.561200 0.592964 -1.394545 0.519004 -0.710543
4.566667 3.252419 -1.543908 0.549541 -1.414883 0.543189 -0.802525
4.600000 3.205422 -1.525389 0.519491 -1.434266 0.567970 -0.871149
4.633333 3.157496 -1.506336 0.484223 -1.452985 0.593413 -0.911549
4.666667 3.108670 -1.486761 0.429866 -1.471313 0.619486 -0.918862
4.700000 3.059562 -1.465263 0.385259 -1.489476 0.646157 -0.895377
4.733333 3.009617 -1.443268 0.347341 -1.507701 0.673396 -0.844350
4.766667 2.958865 -1.420790 0.321749 -1.526355 0.701145 -0.774363
4.800000 2.907701 -1.396485 0.290092 -1.545767 0.729440 -0.689356
4.833333 2.855792 -1.371727 0.277587 -1.566168 0.758044 -0.595376
4.866667 2.803171 -1.346532 0.266506 -1.587791 0.786750 -0.499178
4.900000 2.750753 -1.319901 0.249292 -1.610809 0.815317 -0.403427
4.933333 2.697685 -1.292867 0.250140 -1.635535 0.843542 -0.314776
4.966667 2.643433 -1.263980 0.245254 -1.662277 0.871145 -0.230833
5.000000 2.587881 -1.233900 0.234924 -1.690959 0.897766 -0.157484
5.033333 2.531138 -1.202616 0.217784 -1.721599 0.923065 -0.093864
5.066667 2.473876 -1.171005 0.227570 -1.753967 0.946675 -0.042171
5.100000 2.416174 -1.138914 0.209930 -1.787856 0.968320 0.000236
5.133333 2.355659 -1.105465 0.231208 -1.822615 0.987530 0.034099
5.166667 2.294732 -1.071753 0.235347 -1.857467 1.004080 0.057146
5.200000 2.231578 -1.037224 0.254072 -1.891826 1.017812 0.071302
5.233333 2.168089 -1.002478 0.246004 -1.925192 1.028840 0.076404
5.266667 2.102595 -0.967108 0.251865 -1.957244 1.037336 0.074221
5.300000 2.035534 -0.931707 0.265363 -1.987477 1.043467 0.058222
5.333333 1.968261 -0.896160 0.259387 -2.015846 1.047689 0.032495
5.366667 1.899571 -0.860890 0.255517 -2.042261 1.050434 -0.003325
5.400000 1.830754 -0.825521 0.254524 -2.066881 1.052163 -0.045884
5.433333 1.761014 -0.790290 0.259398 -2.089471 1.053135 -0.096568
5.466667 1.690779 -0.755430 0.251896 -2.109624 1.053609 -0.151073
5.500000 1.620512 -0.721005 0.257592 -2.127061 1.053760 -0.201397
5.533333 1.550296 -0.686575 0.255187 -2.141349 1.053640 -0.247312
5.566667 1.477921 -0.651457 0.255058 -2.152079 1.053135 -0.286060
5.600000 1.403719 -0.615826 0.230796 -2.158526 1.052037 -0.314999
5.633333 1.329712 -0.580255 0.201793 -2.160029 1.050035 -0.328422
5.666667 1.255949 -0.544769 0.182309 -2.156210 1.046788 -0.328334
5.700000 1.182478 -0.509393 0.158774 -2.146920 1.042022 -0.314712
5.733333 1.109348 -0.474148 0.151418 -2.132012 1.035467 -0.289154
5.766667 1.036608 -0.439060 0.142290 -2.111618 1.027001 -0.251610
5.800000 0.965398 -0.404326 0.136937 -2.086295 1.016614 -0.207913
5.833333 0.896609 -0.370594 0.131156 -2.056892 1.004485 -0.161838
5.866667 0.828348 -0.337089 0.133260 -2.023818 0.990649 -0.114639
5.900000 0.760658 -0.303833 0.125335 -1.986964 0.974939 -0.068893
5.933333 0.693582 -0.270847 0.141163 -1.945823 0.956978 -0.024630
5.966667 0.630401 -0.239658 0.144728 -1.899476 0.936203 0.019003
6.000000 0.567914 -0.208783 0.135592 -1.846667 0.911977 0.066445
6.033333 0.506160 -0.178241 0.131872 -1.785545 0.883338 0.115578
6.066667 0.445177 -0.148050 0.127874 -1.714895 0.849664 0.167965
6.100000 0.385002 -0.118230 0.123419 -1.634228 0.810687 0.222672
6.133333 0.325671 -0.088799 0.134615 -1.543871 0.766566 0.280730
6.166667 0.271361 -0.061534 0.162664 -1.444954 0.717874 0.339268
6.200000 0.221703 -0.036703 0.168287 -1.339024 0.665370 0.395750
6.233333 0.177287 -0.014437 0.180520 -1.228666 0.610386 0.452179
6.266667 0.138640 0.004855 0.198197 -1.116216 0.554118 0.504307
6.300000 0.106911 0.020607 0.229169 -1.003897 0.497711 0.550851
6.333333 0.076153 0.035884 0.266277 -0.893384 0.442010 0.586841
6.366667 0.054723 0.046334 0.272243 -0.786124 0.387794 0.612512
6.400000 0.034265 0.056299 0.283701 -0.682940 0.335511 0.623714
6.433333 0.014776 0.065783 0.288527 -0.584405 0.285389 0.615982
6.466667 -0.003748 0.074786 0.312439 -0.491166 0.237655 0.590536
6.500000 -0.021312 0.083312 0.356173 -0.403360 0.192289 0.545307
6.533333 -0.037920 0.091363 0.407306 -0.321615 0.149547 0.481282
6.566667 -0.047214 0.095878 0.429131 -0.246205 0.109461 0.394868
6.600000 -0.051422 0.097773 0.423206 -0.178057 0.072407 0.289589
6.633333 -0.051760 0.097574 0.437185 -0.118045 0.038962 0.171970
6.666667 -0.049401 0.095805 0.438258 -0.066874 0.009708 0.048972
6.700000 -0.046178 0.093594 0.450986 -0.025587 -0.014581 -0.070298
6.733333 -0.042117 0.090954 0.457421 0.005319 -0.033408 -0.176968
6.766667 -0.038596 0.087782 0.418166 0.026089 -0.046573 -0.260319
6.800000 -0.036497 0.084912 0.394073 0.037792 -0.054233 -0.315615
6.833333 -0.033634 0.081656 0.369692 0.042099 -0.057092 -0.342045
6.866667 -0.032334 0.079105 0.347903 0.040998 -0.056074 -0.343857
6.900000 -0.032369 0.077426 0.324433 0.036819 -0.052311 -0.323364
6.933333 -0.031703 0.075401 0.305243 0.031702 -0.046849 -0.284601
