t x y theta dxdt dydt dthetadt
0.000000 0.000000 0.000000 2.519307 -0.003219 -0.151734 0.006618
0.033333 -0.000109 -0.005076 2.534909 -0.003337 -0.153890 0.005599
0.066667 -0.000222 -0.010232 2.538165 -0.003456 -0.156058 0.005820
0.100000 -0.000339 -0.015468 2.538643 -0.003575 -0.158240 0.008387
0.133333 -0.000460 -0.020785 2.538050 -0.003695 -0.160434 0.009081
0.166667 -0.000585 -0.026165 2.531938 -0.003816 -0.162639 0.005709
0.200000 -0.000714 -0.031626 2.520697 -0.003938 -0.164852 -0.001578
0.233333 -0.000847 -0.037167 2.531380 -0.004060 -0.167067 -0.008433
0.266667 -0.000984 -0.042770 2.538666 -0.004183 -0.169278 -0.016075
0.300000 -0.001126 -0.048454 2.545518 -0.004307 -0.171483 -0.023843
0.333333 -0.001271 -0.054198 2.542132 -0.004432 -0.173679 -0.028683
0.366667 -0.001421 -0.060022 2.527069 -0.004558 -0.175865 -0.026462
0.400000 -0.001575 -0.065928 2.526330 -0.004686 -0.178038 -0.016947
0.433333 -0.001733 -0.071913 2.530417 -0.004815 -0.180198 -0.000302
0.466667 -0.001895 -0.077955 2.524015 -0.004946 -0.182343 0.026533
0.500000 -0.002062 -0.084078 2.515524 -0.005078 -0.184470 0.066291
0.533333 -0.002232 -0.090255 2.517157 -0.005213 -0.186578 0.118664
0.566667 -0.002407 -0.096511 2.522616 -0.005351 -0.188664 0.179164
0.600000 -0.002588 -0.102845 2.524856 -0.005491 -0.190726 0.244323
0.633333 -0.002773 -0.109254 2.537616 -0.005634 -0.192763 0.308374
0.666667 -0.002962 -0.115716 2.537841 -0.005781 -0.194770 0.365330
0.700000 -0.003157 -0.122252 2.556509 -0.005929 -0.196743 0.404914
0.733333 -0.003355 -0.128838 2.583951 -0.006081 -0.198676 0.422823
0.766667 -0.003559 -0.135496 2.606286 -0.006235 -0.200566 0.416227
0.800000 -0.003769 -0.142225 2.630508 -0.006391 -0.202411 0.382908
0.833333 -0.003985 -0.149023 2.663031 -0.006549 -0.204207 0.328166
0.866667 -0.004208 -0.155889 2.673981 -0.006710 -0.205952 0.254804
0.900000 -0.004434 -0.162799 2.695437 -0.006873 -0.207645 0.173062
0.933333 -0.004664 -0.169752 2.699545 -0.007037 -0.209286 0.091432
0.966667 -0.004901 -0.176767 2.684821 -0.007204 -0.210874 0.019846
1.000000 -0.005142 -0.183824 2.679499 -0.007371 -0.212408 -0.030546
1.033333 -0.005390 -0.190939 2.650954 -0.007541 -0.213892 -0.055759
1.066667 -0.005645 -0.198112 2.641786 -0.007713 -0.215326 -0.051339
1.100000 -0.005904 -0.205321 2.628434 -0.007886 -0.216711 -0.015513
1.133333 -0.006171 -0.212583 2.601593 -0.008060 -0.218048 0.048348
1.166667 -0.006440 -0.219878 2.624490 -0.008236 -0.219335 0.130708
1.200000 -0.006718 -0.227222 2.627375 -0.008413 -0.220571 0.222292
1.233333 -0.007002 -0.234612 2.636246 -0.008589 -0.221749 0.315271
1.266667 -0.007290 -0.242032 2.659749 -0.008764 -0.222868 0.402469
1.300000 -0.007585 -0.249492 2.676817 -0.008936 -0.223923 0.477167
1.333333 -0.007887 -0.256991 2.701309 -0.009105 -0.224912 0.534940
1.366667 -0.008196 -0.264525 2.728820 -0.009268 -0.225832 0.580865
1.400000 -0.008508 -0.272083 2.762510 -0.009427 -0.226681 0.616246
1.433333 -0.008827 -0.279671 2.792472 -0.009580 -0.227460 0.641732
1.466667 -0.009153 -0.287286 2.800590 -0.009726 -0.228166 0.662880
1.500000 -0.009482 -0.294920 2.808326 -0.009867 -0.228801 0.683314
1.533333 -0.009812 -0.302570 2.810589 -0.010002 -0.229366 0.708972
1.566667 -0.010151 -0.310241 2.847264 -0.010133 -0.229863 0.739352
1.600000 -0.010491 -0.317924 2.878432 -0.010259 -0.230295 0.779011
1.633333 -0.010833 -0.325620 2.914081 -0.010381 -0.230663 0.830289
1.666667 -0.011183 -0.333328 2.936003 -0.010499 -0.230969 0.889242
1.700000 -0.011535 -0.341045 2.962315 -0.010612 -0.231215 0.950540
1.733333 -0.011888 -0.348769 2.980609 -0.010719 -0.231401 1.011524
1.766667 -0.012249 -0.356498 3.017895 -0.010821 -0.231527 1.069177
1.800000 -0.012617 -0.364231 3.065184 -0.010915 -0.231595 1.114268
1.833333 -0.012986 -0.371966 3.110237 -0.011001 -0.231604 1.139690
1.866667 -0.013357 -0.379700 -3.139514 -0.011078 -0.231552 1.135471
1.900000 -0.013729 -0.387432 -3.096100 -0.011148 -0.231440 1.094117
1.933333 -0.014103 -0.395160 -3.040427 -0.011209 -0.231267 0.996437
1.966667 -0.014479 -0.402878 -2.989843 -0.011263 -0.231032 0.832802
2.000000 -0.014858 -0.410585 -2.944582 -0.011311 -0.230733 0.600599
2.033333 -0.015237 -0.418283 -2.926174 -0.011355 -0.230367 0.297951
2.066667 -0.015616 -0.425972 -2.874868 -0.011397 -0.229935 -0.070754
2.100000 -0.015995 -0.433648 -2.859112 -0.011437 -0.229436 -0.497135
2.133333 -0.016373 -0.441311 -2.858202 -0.011475 -0.228867 -0.957978
2.166667 -0.016757 -0.448946 -2.875864 -0.011514 -0.228225 -1.437132
2.200000 -0.017144 -0.456550 -2.954607 -0.011550 -0.227514 -1.915629
2.233333 -0.017531 -0.464135 -3.054246 -0.011581 -0.226735 -2.371589
2.266667 -0.017917 -0.471701 3.089201 -0.011605 -0.225892 -2.776779
2.300000 -0.018302 -0.479245 2.974397 -0.011619 -0.224984 -3.106167
2.333333 -0.018693 -0.486742 2.871066 -0.011617 -0.224016 -3.344844
2.366667 -0.019089 -0.494191 2.726584 -0.011596 -0.222993 -3.476009
2.400000 -0.019482 -0.501613 2.582847 -0.011551 -0.221913 -3.494616
2.433333 -0.019874 -0.509008 2.420970 -0.011478 -0.220775 -3.397081
2.466667 -0.020263 -0.516351 2.276617 -0.011374 -0.219577 -3.190152
2.500000 -0.020649 -0.523662 2.143514 -0.011235 -0.218320 -2.881145
2.533333 -0.021033 -0.530942 2.041602 -0.011062 -0.217002 -2.474740
2.566667 -0.021406 -0.538166 1.941432 -0.010854 -0.215617 -1.979741
2.600000 -0.021776 -0.545356 1.862593 -0.010616 -0.214168 -1.405202
2.633333 -0.022132 -0.552488 1.835965 -0.010349 -0.212657 -0.763189
2.666667 -0.022475 -0.559560 1.816416 -0.010062 -0.211088 -0.061315
2.700000 -0.022813 -0.566593 1.808067 -0.009758 -0.209461 0.691720
2.733333 -0.023136 -0.573562 1.827130 -0.009447 -0.207783 1.487177
2.766667 -0.023443 -0.580465 1.870082 -0.009132 -0.206061 2.311413
2.800000 -0.023733 -0.587297 1.961610 -0.008821 -0.204303 3.162122
2.833333 -0.024019 -0.594086 2.094682 -0.008518 -0.202518 4.033086
2.866667 -0.024289 -0.600799 2.249437 -0.008227 -0.200708 4.897642
2.900000 -0.024555 -0.607466 2.431343 -0.007952 -0.198883 5.725664
2.933333 -0.024817 -0.614086 2.592612 -0.007693 -0.197048 6.487913
2.966667 -0.025063 -0.620621 2.831386 -0.007451 -0.195207 7.148365
3.000000 -0.025306 -0.627106 3.131335 -0.007225 -0.193356 7.654968
3.033333 -0.025537 -0.633502 -2.820415 -0.007013 -0.191492 7.955197
3.066667 -0.025763 -0.639845 -2.476673 -0.006813 -0.189614 8.025989
3.100000 -0.025985 -0.646137 -2.169409 -0.006623 -0.187720 7.853186
3.133333 -0.026202 -0.652375 -1.788160 -0.006442 -0.185807 7.419199
3.166667 -0.026415 -0.658560 -1.403695 -0.006267 -0.183870 6.736425
3.200000 -0.026619 -0.664651 -1.165806 -0.006098 -0.181914 5.849027
3.233333 -0.026819 -0.670687 -0.932023 -0.005933 -0.179943 4.818889
3.266667 -0.027014 -0.676666 -0.728902 -0.005771 -0.177958 3.702063
3.300000 -0.027204 -0.682587 -0.675899 -0.005612 -0.175961 2.556311
3.333333 -0.027388 -0.688419 -0.661222 -0.005454 -0.173956 1.450258
3.366667 -0.027566 -0.694162 -0.722695 -0.005299 -0.171948 0.443639
3.400000 -0.027739 -0.699845 -0.808967 -0.005146 -0.169934 -0.434942
3.433333 -0.027908 -0.705468 -0.907603 -0.004995 -0.167909 -1.167666
3.466667 -0.028071 -0.711030 -0.978422 -0.004846 -0.165872 -1.748762
3.500000 -0.028230 -0.716531 -1.081014 -0.004699 -0.163822 -2.181362
3.533333 -0.028384 -0.721969 -1.173471 -0.004553 -0.161754 -2.483102
3.566667 -0.028532 -0.727346 -1.234256 -0.004409 -0.159661 -2.686139
3.600000 -0.028676 -0.732659 -1.301696 -0.004265 -0.157543 -2.816196
3.633333 -0.028816 -0.737882 -1.419221 -0.004122 -0.155402 -2.902454
3.666667 -0.028952 -0.743041 -1.527030 -0.003977 -0.153239 -2.961754
3.700000 -0.029083 -0.748111 -1.660024 -0.003832 -0.151056 -3.013883
3.733333 -0.029209 -0.753092 -1.778469 -0.003684 -0.148859 -3.068563
