t x y theta dxdt dydt dthetadt
0.000000 0.000000 0.000000 -0.083528 0.134294 0.073309 -0.018033
0.033333 0.004537 0.002469 -0.099463 0.138906 0.074842 -0.016876
0.066667 0.009235 0.005000 -0.101077 0.143586 0.076370 -0.012760
0.100000 0.014097 0.007594 -0.088377 0.148334 0.077896 -0.005755
0.133333 0.019111 0.010225 -0.087573 0.153156 0.079427 0.002213
0.166667 0.024278 0.012893 -0.089669 0.158060 0.080973 0.012065
0.200000 0.029600 0.015597 -0.089097 0.163046 0.082540 0.026067
0.233333 0.035099 0.018368 -0.099784 0.168118 0.084131 0.035759
0.266667 0.040755 0.021174 -0.089085 0.173273 0.085745 0.041661
0.300000 0.046593 0.024046 -0.090103 0.178511 0.087383 0.041378
0.333333 0.052617 0.026988 -0.101519 0.183819 0.089036 0.040258
0.366667 0.058801 0.029963 -0.065200 0.189190 0.090691 0.034330
0.400000 0.065178 0.033008 -0.084690 0.194610 0.092338 0.025542
0.433333 0.071752 0.036124 -0.062759 0.200069 0.093965 0.012451
0.466667 0.078525 0.039312 -0.075430 0.205560 0.095562 -0.004050
0.500000 0.085500 0.042573 -0.076044 0.211069 0.097115 -0.037625
0.533333 0.092638 0.045862 -0.077554 0.216599 0.098624 -0.114362
0.566667 0.099941 0.049179 -0.080696 0.222150 0.100091 -0.260526
0.600000 0.107408 0.052522 -0.092694 0.227735 0.101527 -0.505446
0.633333 0.115090 0.055941 -0.092694 0.233378 0.102950 -0.871375
0.666667 0.122937 0.059384 -0.081113 0.239102 0.104381 -1.381013
0.700000 0.131006 0.062903 -0.097125 0.244944 0.105850 -2.031093
0.733333 0.139240 0.066445 -0.077932 0.250928 0.107371 -2.804933
0.766667 0.147639 0.070007 -0.110486 0.257074 0.108962 -3.654098
0.800000 0.156270 0.073647 -0.139957 0.263391 0.110620 -4.548862
0.833333 0.165066 0.077306 -0.311734 0.269884 0.112345 -5.421791
0.866667 0.174102 0.081044 -0.566824 0.276547 0.114125 -6.205812
0.900000 0.183382 0.084864 -0.991302 0.283357 0.115936 -6.851596
0.933333 0.192914 0.088763 -1.275792 0.290292 0.117759 -7.308342
0.966667 0.202703 0.092742 -1.659343 0.297313 0.119566 -7.548431
1.000000 0.212752 0.096796 -1.931058 0.304375 0.121333 -7.534103
1.033333 0.223063 0.100924 -2.251215 0.311413 0.123022 -7.290395
1.066667 0.233536 0.105057 -2.562008 0.318366 0.124602 -6.854726
1.100000 0.244270 0.109255 -2.803670 0.325183 0.126055 -6.259390
1.133333 0.255267 0.113512 -3.060087 0.331813 0.127359 -5.538876
1.166667 0.266520 0.117824 -3.135296 0.338222 0.128505 -4.756956
1.200000 0.278029 0.122189 -3.135296 0.344381 0.129486 -3.974330
1.233333 0.289691 0.126549 2.878239 0.350289 0.130308 -3.202683
1.266667 0.301546 0.130958 2.796977 0.355940 0.130971 -2.468179
1.300000 0.313550 0.135357 2.747961 0.361336 0.131474 -1.788560
1.333333 0.325739 0.139798 2.747961 0.366490 0.131819 -1.197170
1.366667 0.338073 0.144225 2.704053 0.371419 0.132006 -0.678556
1.400000 0.350551 0.148636 2.737723 0.376155 0.132046 -0.217127
1.433333 0.363199 0.153074 2.722305 0.380720 0.131940 0.162600
1.466667 0.375985 0.157492 2.788491 0.385140 0.131698 0.462802
1.500000 0.388934 0.161928 2.826166 0.389437 0.131327 0.686943
1.533333 0.402016 0.166338 2.868169 0.393636 0.130837 0.852392
1.566667 0.415230 0.170719 2.914227 0.397758 0.130235 0.951387
1.600000 0.428572 0.175069 2.952811 0.401819 0.129517 0.985677
1.633333 0.442040 0.179386 2.988572 0.405845 0.128688 0.970400
1.666667 0.455631 0.183666 3.030421 0.409858 0.127748 0.925167
1.700000 0.469360 0.187927 3.063175 0.413883 0.126701 0.854625
1.733333 0.483224 0.192166 3.096226 0.417925 0.125546 0.765335
1.766667 0.497202 0.196360 -3.141417 0.421988 0.124280 0.667896
1.800000 0.511294 0.200508 3.129317 0.426064 0.122906 0.567176
1.833333 0.525511 0.204615 -3.131314 0.430137 0.121419 0.466689
1.866667 0.539903 0.208669 -3.119794 0.434189 0.119813 0.367252
1.900000 0.554466 0.212667 -3.126446 0.438200 0.118081 0.275196
1.933333 0.569195 0.216597 -3.110103 0.442152 0.116217 0.190579
1.966667 0.584089 0.220457 -3.086486 0.446019 0.114216 0.115745
2.000000 0.599077 0.224255 -3.086417 0.449780 0.112068 0.044474
2.033333 0.614154 0.227989 -3.112914 0.453414 0.109765 -0.014747
2.066667 0.629319 0.231658 -3.103955 0.456899 0.107305 -0.069647
2.100000 0.644634 0.235230 -3.113292 0.460219 0.104683 -0.120432
2.133333 0.660029 0.238731 -3.111216 0.463367 0.101889 -0.167950
2.166667 0.675564 0.242121 -3.131714 0.466344 0.098923 -0.212484
2.200000 0.691237 0.245396 -3.115334 0.469143 0.095791 -0.253850
2.233333 0.706979 0.248593 3.133804 0.471763 0.092503 -0.298412
2.266667 0.722799 0.251665 3.133129 0.474199 0.089065 -0.339855
2.300000 0.738693 0.254606 3.127840 0.476448 0.085484 -0.380537
2.333333 0.754656 0.257410 3.104556 0.478504 0.081775 -0.417116
2.366667 0.770682 0.260070 3.105951 0.480362 0.077950 -0.450922
2.400000 0.786758 0.262644 3.073647 0.482030 0.074012 -0.470884
2.433333 0.802888 0.265063 3.066305 0.483516 0.069959 -0.478585
2.466667 0.819068 0.267321 3.048272 0.484828 0.065803 -0.473075
2.500000 0.835285 0.269488 3.021420 0.485971 0.061549 -0.451424
2.533333 0.851539 0.271482 2.978805 0.486953 0.057211 -0.414135
2.566667 0.867822 0.273382 2.967205 0.487776 0.052785 -0.360008
2.600000 0.884130 0.275102 2.954934 0.488439 0.048282 -0.297859
2.633333 0.900458 0.276639 2.952731 0.488942 0.043723 -0.223415
2.666667 0.916799 0.277992 2.946341 0.489286 0.039114 -0.141315
2.700000 0.933154 0.279247 2.947994 0.489471 0.034473 -0.058116
2.733333 0.949508 0.280312 2.953888 0.489498 0.029803 0.019452
2.766667 0.965856 0.281189 2.944568 0.489366 0.025129 0.089657
2.800000 0.982204 0.281965 2.955990 0.489080 0.020462 0.150422
2.833333 0.998533 0.282550 2.968476 0.488637 0.015801 0.197880
2.866667 1.014855 0.283033 2.973744 0.488038 0.011143 0.233108
2.900000 1.031146 0.283325 2.983384 0.487283 0.006481 0.259774
2.933333 1.047400 0.283427 3.000736 0.486370 0.001816 0.281126
2.966667 1.063634 0.283427 3.023394 0.485298 -0.002866 0.294102
3.000000 1.079823 0.283242 3.031834 0.484068 -0.007564 0.301450
3.033333 1.095984 0.282954 3.030423 0.482679 -0.012277 0.303622
3.066667 1.112091 0.282488 3.034400 0.481132 -0.016992 0.298997
3.100000 1.128139 0.281848 3.046519 0.479431 -0.021695 0.287562
3.133333 1.144126 0.281038 3.054082 0.477580 -0.026372 0.270006
3.166667 1.160047 0.280062 3.071863 0.475586 -0.030999 0.248566
3.200000 1.175897 0.278926 3.090243 0.473452 -0.035559 0.221764
3.233333 1.191671 0.277634 3.098441 0.471187 -0.040023 0.190337
3.266667 1.207365 0.276191 3.103047 0.468797 -0.044374 0.155905
3.300000 1.222974 0.274602 3.110617 0.466287 -0.048595 0.118240
3.333333 1.238495 0.272871 3.114671 0.463661 -0.052675 0.078369
3.366667 1.253924 0.271002 3.104417 0.460923 -0.056606 0.040282
3.400000 1.269256 0.269002 3.100350 0.458076 -0.060384 0.007460
3.433333 1.284517 0.266909 3.112482 0.455119 -0.064012 -0.019882
3.466667 1.299672 0.264694 3.104733 0.452055 -0.067495 -0.040633
3.500000 1.314717 0.262360 3.097756 0.448882 -0.070837 -0.054556
3.533333 1.329649 0.259914 3.093479 0.445603 -0.074041 -0.062175
3.566667 1.344464 0.257359 3.087547 0.442225 -0.077113 -0.066954
3.600000 1.359158 0.254700 3.082388 0.438757 -0.080057 -0.069644
3.633333 1.373761 0.251959 3.088681 0.435215 -0.082877 -0.069176
3.666667 1.388235 0.249124 3.087197 0.431607 -0.085574 -0.067308
3.700000 1.402576 0.246199 3.090395 0.427950 -0.088151 -0.063051
3.733333 1.416780 0.243191 3.087149 0.424255 -0.090612 -0.055864
3.766667 1.430843 0.240103 3.082474 0.420530 -0.092959 -0.046543
3.800000 1.444802 0.236942 3.076559 0.416771 -0.095196 -0.036444
3.833333 1.458613 0.233712 3.069843 0.412979 -0.097327 -0.026258
3.866667 1.472313 0.230413 3.063535 0.409157 -0.099357 -0.014424
3.900000 1.485901 0.227047 3.067693 0.405297 -0.101290 -0.004886
3.933333 1.499374 0.223615 3.077815 0.401382 -0.103125 0.000276
3.966667 1.512730 0.220121 3.077460 0.397394 -0.104859 0.000649
4.000000 1.525918 0.216582 3.068305 0.393322 -0.106492 -0.003749
4.033333 1.538984 0.212984 3.085169 0.389149 -0.108022 -0.013905
4.066667 1.551926 0.209329 3.089899 0.384851 -0.109441 -0.031366
4.100000 1.564687 0.205645 3.082396 0.380419 -0.110750 -0.050552
4.133333 1.577320 0.201907 3.089940 0.375854 -0.111950 -0.069882
4.166667 1.589822 0.198119 3.078464 0.371159 -0.113044 -0.083406
4.200000 1.602192 0.194283 3.073696 0.366330 -0.114031 -0.091434
4.233333 1.614365 0.190435 3.057601 0.361360 -0.114913 -0.088960
4.266667 1.626338 0.186578 3.060749 0.356266 -0.115698 -0.080713
4.300000 1.638106 0.182716 3.039686 0.351044 -0.116388 -0.078815
4.333333 1.649734 0.178814 3.042398 0.345702 -0.116988 -0.086049
4.366667 1.661221 0.174874 3.044529 0.340253 -0.117510 -0.109183
4.400000 1.672488 0.170936 3.041450 0.334717 -0.117962 -0.147419
4.433333 1.683611 0.166964 3.046741 0.329108 -0.118354 -0.207790
4.466667 1.694506 0.162999 3.051330 0.323433 -0.118689 -0.276368
4.500000 1.705169 0.159041 3.072668 0.317704 -0.118971 -0.335729
4.533333 1.715684 0.155056 3.074466 0.311923 -0.119200 -0.378215
4.566667 1.725958 0.151083 3.093712 0.306089 -0.119375 -0.400595
4.600000 1.736083 0.147085 3.022959 0.300207 -0.119494 -0.397783
4.633333 1.745962 0.143104 2.902292 0.294293 -0.119560 -0.356137
4.666667 1.755691 0.139102 2.872663 0.288350 -0.119569 -0.281640
4.700000 1.765269 0.135080 2.879903 0.282378 -0.119518 -0.179921
4.733333 1.774602 0.131076 2.887664 0.276400 -0.119410 -0.057650
4.766667 1.783691 0.127092 2.894000 0.270431 -0.119249 0.084534
4.800000 1.792629 0.123094 2.925706 0.264486 -0.119037 0.233417
4.833333 1.801324 0.119121 2.944132 0.258574 -0.118776 0.367187
4.866667 1.809779 0.115178 2.976115 0.252736 -0.118484 0.477288
4.900000 1.818082 0.111226 3.011524 0.247008 -0.118179 0.556085
4.933333 1.826233 0.107266 3.016916 0.241405 -0.117865 0.603133
4.966667 1.834151 0.103346 3.026713 0.235941 -0.117548 0.615694
5.000000 1.841839 0.099466 3.053416 0.230636 -0.117238 0.600765
5.033333 1.849376 0.095584 3.086891 0.225495 -0.116934 0.566624
5.066667 1.856764 0.091700 3.107327 0.220502 -0.116626 0.519249
5.100000 1.864002 0.087817 3.133193 0.215641 -0.116302 0.464517
5.133333 1.871091 0.083936 -3.135379 0.210904 -0.115960 0.403117
5.166667 1.878032 0.080057 -3.118841 0.206280 -0.115597 0.336908
5.200000 1.884825 0.076183 -3.103957 0.201742 -0.115198 0.266933
5.233333 1.891472 0.072315 -3.104792 0.197270 -0.114759 0.198163
5.266667 1.897964 0.068497 -3.109588 0.192856 -0.114282 0.133755
5.300000 1.904312 0.064687 -3.109745 0.188491 -0.113764 0.075505
5.333333 1.910515 0.060887 -3.109397 0.184165 -0.113196 0.027174
5.366667 1.916572 0.057138 -3.110838 0.179877 -0.112577 -0.010140
5.400000 1.922486 0.053402 -3.109193 0.175631 -0.111909 -0.033210
5.433333 1.928259 0.049681 -3.111526 0.171433 -0.111188 -0.043571
5.466667 1.933893 0.045974 -3.121692 0.167285 -0.110411 -0.045674
5.500000 1.939387 0.042284 -3.122298 0.163189 -0.109574 -0.042169
5.533333 1.944743 0.038612 -3.130499 0.159147 -0.108683 -0.035866
5.566667 1.949962 0.034959 -3.139633 0.155160 -0.107732 -0.025167
5.600000 1.955053 0.031360 -3.127021 0.151229 -0.106718 -0.016650
5.633333 1.960019 0.027817 -3.125792 0.147356 -0.105642 -0.011773
5.666667 1.964862 0.024329 -3.119678 0.143543 -0.104509 -0.008711
5.700000 1.969573 0.020865 -3.132269 0.139789 -0.103326 -0.006815
5.733333 1.974153 0.017426 -3.111722 0.136096 -0.102096 -0.006810
5.766667 1.978616 0.014043 -3.114165 0.132463 -0.100832 -0.012098
5.800000 1.982951 0.010686 -3.124123 0.128886 -0.099545 -0.016807
5.833333 1.987174 0.007386 -3.125567 0.125360 -0.098246 -0.020417
5.866667 1.991272 0.004114 -3.131163 0.121884 -0.096938 -0.022486
5.900000 1.995264 0.000899 -3.126294 0.118458 -0.095621 -0.024839
5.933333 1.999152 -0.002259 -3.131710 0.115076 -0.094303 -0.025088
