t x y theta dxdt dydt dthetadt
0.000000 0.000000 0.000000 -2.120085 0.023877 0.052319 0.127324
0.033333 0.000920 0.001205 -2.105223 0.020158 0.043517 0.125004
0.066667 0.001516 0.002110 -2.097303 0.015663 0.034646 0.112864
0.100000 0.002117 0.002901 -2.104161 0.010540 0.026004 0.093926
0.133333 0.002447 0.003407 -2.106374 0.004943 0.017764 0.069671
0.166667 0.002539 0.003735 -2.107450 -0.000928 0.009952 0.044405
0.200000 0.002333 0.003782 -2.103921 -0.006867 0.002586 0.022012
0.233333 0.002134 0.003697 -2.095083 -0.012962 -0.004679 0.003119
0.266667 0.001514 0.003575 -2.102035 -0.019245 -0.012157 -0.007838
0.300000 0.000660 0.003301 -2.104217 -0.025957 -0.020365 -0.012531
0.333333 -0.000184 0.002883 -2.111512 -0.033617 -0.029986 -0.011087
0.366667 -0.001142 0.002216 -2.108827 -0.043012 -0.041811 -0.007924
0.400000 -0.002829 0.000719 -2.114778 -0.055125 -0.056767 -0.007236
0.433333 -0.004497 -0.000932 -2.115519 -0.070565 -0.075359 -0.010114
0.466667 -0.006146 -0.002743 -2.113517 -0.090093 -0.098148 -0.023212
0.500000 -0.007770 -0.004714 -2.109986 -0.114027 -0.125258 -0.046099
0.533333 -0.009368 -0.006849 -2.103462 -0.142201 -0.156396 -0.080539
0.566667 -0.013108 -0.011436 -2.105172 -0.173818 -0.190716 -0.123256
0.600000 -0.016814 -0.016190 -2.089114 -0.207756 -0.227124 -0.169752
0.633333 -0.023320 -0.023747 -2.102302 -0.242835 -0.264496 -0.215888
0.666667 -0.032541 -0.033830 -2.101669 -0.277077 -0.300962 -0.256072
0.700000 -0.044381 -0.046318 -2.119466 -0.308058 -0.334143 -0.284398
0.733333 -0.058663 -0.061005 -2.152117 -0.333380 -0.361693 -0.295057
0.766667 -0.072857 -0.075830 -2.174901 -0.350855 -0.381324 -0.287356
0.800000 -0.087490 -0.091264 -2.192836 -0.358407 -0.390832 -0.262498
0.833333 -0.102001 -0.106815 -2.212268 -0.354111 -0.388083 -0.224028
0.866667 -0.116373 -0.122473 -2.215268 -0.337136 -0.371995 -0.174125
0.900000 -0.130589 -0.138228 -2.223243 -0.307989 -0.342953 -0.119188
0.933333 -0.144631 -0.154068 -2.209588 -0.267445 -0.301402 -0.067454
0.966667 -0.158484 -0.169984 -2.206671 -0.216843 -0.248620 -0.023559
1.000000 -0.166858 -0.180222 -2.201799 -0.158065 -0.186458 0.009917
1.033333 -0.169741 -0.184061 -2.183638 -0.093904 -0.117771 0.031349
1.066667 -0.172398 -0.187963 -2.173574 -0.027098 -0.045443 0.038949
1.100000 -0.170419 -0.185856 -2.180086 0.039906 0.027856 0.033493
1.133333 -0.168207 -0.183825 -2.190563 0.104358 0.098964 0.018505
1.166667 -0.161802 -0.177293 -2.198276 0.163341 0.164747 -0.002368
1.200000 -0.151517 -0.166671 -2.199018 0.214561 0.222727 -0.028189
1.233333 -0.141007 -0.156169 -2.188892 0.256790 0.271502 -0.057407
1.266667 -0.128329 -0.142245 -2.179138 0.288946 0.309734 -0.086580
1.300000 -0.115441 -0.128482 -2.193028 0.310437 0.336876 -0.115430
1.333333 -0.102355 -0.114904 -2.201823 0.320917 0.352575 -0.141855
1.366667 -0.089584 -0.100477 -2.195798 0.321167 0.357356 -0.166054
1.400000 -0.076633 -0.086279 -2.206934 0.312145 0.351977 -0.183568
1.433333 -0.063511 -0.072335 -2.203877 0.294814 0.337187 -0.191602
1.466667 -0.052498 -0.059523 -2.222603 0.270316 0.314094 -0.188421
1.500000 -0.043792 -0.048158 -2.236419 0.239752 0.283596 -0.170179
1.533333 -0.034936 -0.037111 -2.260713 0.204246 0.246772 -0.136270
1.566667 -0.028799 -0.028980 -2.267965 0.164543 0.204623 -0.085749
1.600000 -0.022519 -0.021204 -2.261571 0.121090 0.157805 -0.021809
1.633333 -0.019196 -0.016571 -2.271084 0.074357 0.106995 0.056338
1.666667 -0.019359 -0.015447 -2.267250 0.025116 0.053046 0.147829
1.700000 -0.019376 -0.014718 -2.259025 -0.025766 -0.003306 0.250258
1.733333 -0.019240 -0.014392 -2.250078 -0.076815 -0.061207 0.362707
1.766667 -0.018947 -0.014479 -2.236096 -0.126809 -0.120557 0.487287
1.800000 -0.022665 -0.018763 -2.219537 -0.174183 -0.180936 0.628420
1.833333 -0.030981 -0.026723 -2.188001 -0.217080 -0.242285 0.787118
1.866667 -0.043968 -0.038402 -2.171530 -0.253691 -0.304472 0.965469
1.900000 -0.056753 -0.050501 -2.156927 -0.281913 -0.367151 1.164594
1.933333 -0.069314 -0.063018 -2.125141 -0.300253 -0.429911 1.384930
1.966667 -0.081635 -0.075947 -2.085957 -0.306963 -0.491796 1.626814
2.000000 -0.095601 -0.092637 -2.018564 -0.300565 -0.552234 1.880595
2.033333 -0.109688 -0.112602 -1.952874 -0.280655 -0.610387 2.133618
2.066667 -0.122302 -0.135015 -1.886048 -0.247293 -0.665921 2.371166
2.100000 -0.132418 -0.160654 -1.805212 -0.201299 -0.718443 2.583212
2.133333 -0.142199 -0.186647 -1.704912 -0.143409 -0.767732 2.757852
2.166667 -0.146704 -0.214961 -1.574742 -0.075069 -0.813517 2.874355
2.200000 -0.150845 -0.243590 -1.441378 0.001743 -0.855716 2.927126
2.233333 -0.149526 -0.273624 -1.343764 0.084822 -0.894541 2.920509
2.266667 -0.147827 -0.303929 -1.231729 0.172177 -0.930303 2.859573
2.300000 -0.141050 -0.336292 -1.076649 0.261572 -0.963492 2.744873
2.333333 -0.130595 -0.369210 -0.982984 0.350493 -0.994573 2.585344
2.366667 -0.116537 -0.402290 -0.920582 0.436750 -1.024147 2.402692
2.400000 -0.098393 -0.436782 -0.860119 0.518274 -1.052464 2.214762
2.433333 -0.076072 -0.472862 -0.791067 0.593935 -1.079930 2.026793
2.466667 -0.053405 -0.509055 -0.730994 0.662337 -1.106411 1.847648
2.500000 -0.026671 -0.547421 -0.684645 0.722741 -1.132013 1.689417
2.533333 0.000373 -0.585835 -0.649628 0.774964 -1.156900 1.557548
2.566667 0.027706 -0.624265 -0.605099 0.819270 -1.181236 1.448924
2.600000 0.058177 -0.665515 -0.561851 0.856356 -1.205257 1.355151
2.633333 0.088892 -0.706711 -0.506695 0.886965 -1.228674 1.277937
2.666667 0.119827 -0.747816 -0.466505 0.912029 -1.251337 1.214044
2.700000 0.150958 -0.788793 -0.427172 0.932633 -1.272836 1.161122
2.733333 0.182261 -0.829606 -0.375545 0.949404 -1.292403 1.111539
2.766667 0.214868 -0.874244 -0.346484 0.962605 -1.308939 1.062084
2.800000 0.247595 -0.918638 -0.311279 0.972583 -1.321522 1.013580
2.833333 0.280890 -0.965507 -0.307922 0.979383 -1.329221 0.962309
2.866667 0.314253 -1.012047 -0.274234 0.983175 -1.331304 0.905260
2.900000 0.347658 -1.058214 -0.229445 0.983862 -1.327103 0.833796
2.933333 0.381617 -1.105135 -0.206225 0.981690 -1.316515 0.750566
2.966667 0.415830 -1.151584 -0.157500 0.977079 -1.300120 0.651381
3.000000 0.449266 -1.196356 -0.137093 0.970319 -1.278461 0.537848
3.033333 0.482636 -1.240576 -0.112043 0.961649 -1.251912 0.414042
3.066667 0.513595 -1.280237 -0.101149 0.951213 -1.220561 0.290593
3.100000 0.544439 -1.319264 -0.087061 0.938928 -1.184058 0.187859
3.133333 0.575144 -1.357618 -0.073188 0.924611 -1.141925 0.120141
3.166667 0.605686 -1.395263 -0.087323 0.907610 -1.093007 0.110717
3.200000 0.636041 -1.432159 -0.104452 0.886745 -1.035658 0.167260
3.233333 0.666187 -1.468270 -0.148891 0.860638 -0.969066 0.291435
3.266667 0.696100 -1.503558 -0.174019 0.827475 -0.892608 0.467601
3.300000 0.725757 -1.537988 -0.205778 0.785904 -0.806556 0.668393
3.333333 0.755135 -1.571523 -0.188701 0.734536 -0.711095 0.857099
3.366667 0.782366 -1.596535 -0.143321 0.672689 -0.607657 0.987086
3.400000 0.806531 -1.614296 -0.086720 0.600798 -0.498911 1.022091
3.433333 0.827640 -1.625774 0.007510 0.520232 -0.387809 0.929849
3.466667 0.848400 -1.636262 0.137017 0.433357 -0.277608 0.701581
3.500000 0.863754 -1.641636 0.256220 0.342736 -0.171526 0.335754
3.533333 0.873858 -1.642347 0.345854 0.251384 -0.073184 -0.148266
3.566667 0.877945 -1.639507 0.379540 0.162657 0.014941 -0.710472
3.600000 0.875518 -1.633173 0.308940 0.079552 0.091526 -1.301908
3.633333 0.872733 -1.625830 0.198324 0.004328 0.156461 -1.867345
3.666667 0.869601 -1.617482 0.054461 -0.061206 0.209992 -2.358881
3.700000 0.862837 -1.607145 -0.112576 -0.115751 0.253130 -2.728335
3.733333 0.855752 -1.595815 -0.274285 -0.158917 0.287710 -2.941568
3.766667 0.847339 -1.584015 -0.431309 -0.191255 0.315799 -2.991172
3.800000 0.838583 -1.572246 -0.543812 -0.214119 0.339441 -2.894379
3.833333 0.829556 -1.560244 -0.680852 -0.228764 0.360232 -2.674804
3.866667 0.820767 -1.548491 -0.796337 -0.236632 0.379848 -2.366129
3.900000 0.812309 -1.536968 -0.840756 -0.239233 0.399895 -2.010115
3.933333 0.803623 -1.524493 -0.867256 -0.237629 0.421574 -1.648227
3.966667 0.794927 -1.510881 -0.895752 -0.232567 0.445602 -1.309363
4.000000 0.786839 -1.496692 -0.903340 -0.224362 0.472349 -1.004603
4.033333 0.779329 -1.481225 -0.925841 -0.213148 0.502234 -0.747669
4.066667 0.771651 -1.464833 -0.927179 -0.198710 0.535649 -0.544833
4.100000 0.765528 -1.446231 -0.939090 -0.181033 0.572370 -0.388676
4.133333 0.759266 -1.426722 -0.951883 -0.160107 0.612172 -0.269839
4.166667 0.752876 -1.406317 -0.956797 -0.136215 0.654712 -0.176612
4.200000 0.746372 -1.385027 -0.961915 -0.109505 0.699670 -0.102718
4.233333 0.742712 -1.361347 -0.962151 -0.080641 0.746597 -0.037118
4.266667 0.738961 -1.336808 -0.960354 -0.050725 0.794940 0.029741
4.300000 0.738433 -1.309664 -0.967311 -0.020656 0.844657 0.098168
4.333333 0.737831 -1.281690 -0.952532 0.008665 0.895701 0.168748
4.366667 0.739870 -1.250668 -0.957566 0.036374 0.947971 0.237346
4.400000 0.744319 -1.216333 -0.949716 0.061333 1.001182 0.302060
4.433333 0.748705 -1.181229 -0.928758 0.082930 1.055182 0.358371
4.466667 0.753029 -1.145378 -0.933028 0.100726 1.109589 0.403905
4.500000 0.757293 -1.108805 -0.899445 0.114641 1.163913 0.436056
4.533333 0.761497 -1.071532 -0.884234 0.124555 1.217780 0.457045
4.566667 0.766315 -1.030536 -0.849181 0.130744 1.270931 0.467974
4.600000 0.771316 -0.986270 -0.824741 0.133881 1.323311 0.471414
4.633333 0.776214 -0.938801 -0.806426 0.134495 1.374316 0.469221
4.666667 0.781056 -0.890752 -0.795901 0.133133 1.423560 0.461854
4.700000 0.785843 -0.842157 -0.795088 0.130061 1.470578 0.451976
4.733333 0.790574 -0.793052 -0.791766 0.125643 1.514675 0.436237
4.766667 0.795036 -0.740701 -0.771928 0.120107 1.555262 0.414857
4.800000 0.799444 -0.687913 -0.768599 0.113520 1.591980 0.386694
4.833333 0.803123 -0.633070 -0.748589 0.105975 1.624995 0.350749
4.866667 0.806160 -0.576498 -0.723779 0.097642 1.654225 0.306222
4.900000 0.809148 -0.519611 -0.702301 0.088869 1.679302 0.251222
4.933333 0.812088 -0.462451 -0.676384 0.079990 1.699721 0.185455
4.966667 0.814982 -0.405062 -0.673329 0.071326 1.715170 0.111313
5.000000 0.817832 -0.347484 -0.664744 0.063175 1.725125 0.026827
5.033333 0.819195 -0.288273 -0.684402 0.055913 1.728780 -0.062241
5.066667 0.820519 -0.228961 -0.697813 0.049774 1.725849 -0.153406
5.100000 0.821327 -0.169485 -0.708349 0.044964 1.716258 -0.239752
5.133333 0.822104 -0.109998 -0.711225 0.041637 1.700206 -0.315135
5.166667 0.822854 -0.050543 -0.732598 0.039922 1.677385 -0.378228
5.200000 0.823819 0.007148 -0.728885 0.039899 1.647361 -0.424117
5.233333 0.824758 0.062586 -0.757463 0.041292 1.610260 -0.455751
5.266667 0.826037 0.114796 -0.778126 0.043822 1.566012 -0.470884
5.300000 0.827301 0.166810 -0.793557 0.046943 1.514693 -0.474651
5.333333 0.828553 0.218594 -0.822481 0.050048 1.456407 -0.468825
5.366667 0.830547 0.267454 -0.840498 0.052465 1.392065 -0.455408
5.400000 0.832534 0.316015 -0.864358 0.053619 1.322855 -0.433026
5.433333 0.835152 0.361122 -0.871518 0.053082 1.249765 -0.403635
5.466667 0.837842 0.402867 -0.877102 0.050565 1.173937 -0.372049
5.500000 0.840547 0.440762 -0.889163 0.046069 1.096915 -0.335575
5.533333 0.842909 0.474949 -0.895288 0.039859 1.020752 -0.297337
5.566667 0.844726 0.506590 -0.914583 0.032495 0.947025 -0.260026
5.600000 0.846054 0.535340 -0.908104 0.024731 0.877507 -0.231783
5.633333 0.846428 0.560967 -0.928329 0.017829 0.814075 -0.209050
5.666667 0.845888 0.583476 -0.937385 0.013067 0.758374 -0.189746
5.700000 0.845357 0.605525 -0.942313 0.011565 0.711368 -0.175609
5.733333 0.844839 0.627112 -0.931836 0.014159 0.673164 -0.167874
5.766667 0.843453 0.646850 -0.945559 0.021367 0.643675 -0.162761
5.800000 0.842089 0.666120 -0.944174 0.033243 0.622158 -0.155407
5.833333 0.841220 0.684141 -0.936889 0.049178 0.607313 -0.150922
5.866667 0.841290 0.702146 -0.938038 0.068388 0.597544 -0.150656
5.900000 0.842789 0.720681 -0.972779 0.090037 0.591294 -0.153687
5.933333 0.846789 0.740225 -0.985472 0.113189 0.587190 -0.156828
5.966667 0.853397 0.761456 -0.985408 0.136704 0.583708 -0.162709
6.000000 0.860038 0.782207 -0.982694 0.159623 0.579630 -0.173526
6.033333 0.866711 0.802473 -0.965012 0.181122 0.573674 -0.187601
6.066667 0.873411 0.822250 -0.979243 0.200484 0.564975 -0.203087
6.100000 0.880134 0.841535 -0.991597 0.217153 0.553029 -0.224055
6.133333 0.887273 0.860456 -1.004555 0.230892 0.537414 -0.248930
6.166667 0.895578 0.879461 -1.011427 0.241872 0.518137 -0.274431
6.200000 0.904623 0.897266 -1.012208 0.250146 0.495186 -0.294644
6.233333 0.914105 0.913417 -1.010013 0.255883 0.469237 -0.305205
6.266667 0.923586 0.929063 -1.038855 0.259238 0.440875 -0.306193
6.300000 0.933058 0.944202 -1.052176 0.260288 0.410510 -0.293499
6.333333 0.942515 0.958835 -1.085318 0.258994 0.378827 -0.267152
6.366667 0.951410 0.970091 -1.096107 0.255340 0.346671 -0.227721
6.400000 0.960277 0.980844 -1.099200 0.249618 0.314959 -0.179935
6.433333 0.969109 0.991098 -1.109164 0.242150 0.284178 -0.127481
6.466667 0.977132 0.998959 -1.110779 0.233326 0.254970 -0.072332
6.500000 0.985108 1.006331 -1.106450 0.223532 0.227978 -0.019703
6.533333 0.991929 1.012085 -1.093626 0.213148 0.203614 0.021737
6.566667 0.998694 1.017366 -1.081824 0.202364 0.181760 0.046256
6.600000 1.005399 1.022183 -1.089727 0.191219 0.162257 0.053519
6.633333 1.012040 1.026543 -1.085896 0.179637 0.145083 0.043741
6.666667 1.017300 1.031193 -1.080548 0.167522 0.129834 0.016510
6.700000 1.022489 1.035404 -1.062379 0.154778 0.116102 -0.024463
6.733333 1.027604 1.039185 -1.059135 0.141471 0.103411 -0.068832
6.766667 1.032642 1.042545 -1.065695 0.127714 0.091524 -0.110126
6.800000 1.037601 1.045493 -1.060211 0.113605 0.080279 -0.147880
6.833333 1.042478 1.048038 -1.086575 0.099407 0.069433 -0.179419
6.866667 1.044544 1.049830 -1.112114 0.085455 0.059052 -0.199739
6.900000 1.046526 1.051238 -1.122409 0.072082 0.049205 -0.204737
6.933333 1.048424 1.052273 -1.135251 0.059488 0.040021 -0.197993
6.966667 1.049264 1.053429 -1.131640 0.047951 0.031592 -0.182165
7.000000 1.050022 1.054231 -1.137977 0.037781 0.023917 -0.156096
7.033333 1.050700 1.054690 -1.153809 0.029218 0.017083 -0.122302
7.066667 1.051300 1.054816 -1.141633 0.022169 0.011109 -0.088435
7.100000 1.051821 1.054619 -1.143694 0.016539 0.006015 -0.059159
7.133333 1.052109 1.055034 -1.148848 0.012243 0.001740 -0.035668
7.166667 1.052322 1.055146 -1.146941 0.009054 -0.001656 -0.017500
7.200000 1.052464 1.054964 -1.142917 0.006721 -0.004174 -0.004660
