t x y theta dxdt dydt dthetadt
0.000000 0.000000 0.000000 -2.232235 -0.001926 -0.005612 0.005510
0.033333 0.000263 -0.000155 -2.234188 -0.004920 -0.005481 0.009039
0.066667 0.000309 -0.000297 -2.232055 -0.009613 -0.005223 0.018808
0.100000 0.000464 -0.000338 -2.230980 -0.016876 -0.004992 0.042270
0.133333 0.000401 -0.000543 -2.233247 -0.027430 -0.004981 0.088432
0.166667 0.000054 -0.000781 -2.234755 -0.041805 -0.005376 0.160942
0.200000 -0.000536 -0.001006 -2.229900 -0.060518 -0.006330 0.263340
0.233333 -0.001377 -0.001216 -2.233367 -0.084189 -0.008298 0.392395
0.266667 -0.003036 -0.001211 -2.231504 -0.113395 -0.011729 0.539936
0.300000 -0.005698 -0.001268 -2.233931 -0.147677 -0.016729 0.693888
0.333333 -0.008627 -0.001314 -2.236344 -0.186639 -0.023404 0.838489
0.366667 -0.014583 -0.001211 -2.201146 -0.230006 -0.031911 0.959916
0.400000 -0.020809 -0.001098 -2.139296 -0.277504 -0.042424 1.046510
0.433333 -0.032846 -0.002947 -2.061123 -0.327447 -0.054411 1.087834
0.466667 -0.045148 -0.004788 -1.965446 -0.378338 -0.067215 1.076383
0.500000 -0.057710 -0.006621 -1.908734 -0.429372 -0.080335 1.010586
0.533333 -0.070526 -0.008444 -1.879023 -0.479867 -0.093229 0.894299
0.566667 -0.090850 -0.013405 -1.849463 -0.528569 -0.104952 0.738474
0.600000 -0.111405 -0.018355 -1.832253 -0.574257 -0.114413 0.556930
0.633333 -0.132176 -0.023289 -1.815122 -0.617157 -0.120880 0.368907
0.666667 -0.153151 -0.028202 -1.814653 -0.657252 -0.123812 0.203923
0.700000 -0.177363 -0.033482 -1.833190 -0.693788 -0.122387 0.084810
0.733333 -0.201745 -0.038732 -1.851421 -0.725446 -0.115540 0.030641
0.766667 -0.226278 -0.043949 -1.869592 -0.751672 -0.102554 0.057470
0.800000 -0.252142 -0.048095 -1.893013 -0.771761 -0.083098 0.176726
0.833333 -0.279080 -0.051835 -1.893119 -0.784180 -0.057034 0.393730
0.866667 -0.307548 -0.055261 -1.909331 -0.787383 -0.024168 0.699710
0.900000 -0.337131 -0.058065 -1.914024 -0.780210 0.014808 1.080888
0.933333 -0.367123 -0.059038 -1.916005 -0.762265 0.058485 1.525310
0.966667 -0.396112 -0.057169 -1.893714 -0.733328 0.104881 2.012068
1.000000 -0.425106 -0.055252 -1.792557 -0.693420 0.152331 2.516085
1.033333 -0.450924 -0.049608 -1.670333 -0.643837 0.198862 3.008439
1.066667 -0.472716 -0.040421 -1.554384 -0.586459 0.242257 3.460030
1.100000 -0.490884 -0.027316 -1.394706 -0.523959 0.280317 3.849569
1.133333 -0.509000 -0.014189 -1.239265 -0.458421 0.311060 4.152396
1.166667 -0.521473 0.000695 -1.068863 -0.391782 0.332918 4.349253
1.200000 -0.533881 0.015576 -0.869851 -0.325980 0.344126 4.426971
1.233333 -0.538365 0.028211 -0.701563 -0.262533 0.343838 4.385530
1.266667 -0.542783 0.040818 -0.532681 -0.202544 0.331960 4.231843
1.300000 -0.547139 0.053381 -0.371361 -0.146728 0.309744 3.975909
1.333333 -0.551438 0.065885 -0.194195 -0.096699 0.279230 3.632976
1.366667 -0.555687 0.078317 -0.083196 -0.053705 0.243082 3.227340
1.400000 -0.559888 0.090662 0.013340 -0.018949 0.204261 2.787958
1.433333 -0.558330 0.097350 0.122729 0.006773 0.165540 2.335187
1.466667 -0.552879 0.099394 0.189795 0.022765 0.129428 1.889443
1.500000 -0.545720 0.098560 0.229330 0.028120 0.097986 1.466374
1.533333 -0.539734 0.096129 0.243451 0.022945 0.072683 1.084852
1.566667 -0.533758 0.093594 0.218553 0.007073 0.054584 0.753682
1.600000 -0.532291 0.093049 0.216334 -0.019067 0.044356 0.473426
1.633333 -0.530864 0.092395 0.224071 -0.054659 0.041972 0.250146
1.666667 -0.532980 0.093625 0.236631 -0.098574 0.046754 0.080216
1.700000 -0.537587 0.095874 0.238388 -0.148675 0.057236 -0.039649
1.733333 -0.544102 0.098564 0.236639 -0.203202 0.071848 -0.121813
1.766667 -0.552761 0.101390 0.215149 -0.259621 0.088740 -0.176829
1.800000 -0.561489 0.104080 0.204435 -0.316021 0.106352 -0.211930
1.833333 -0.573364 0.107960 0.174847 -0.370350 0.123293 -0.236520
1.866667 -0.585305 0.111691 0.174605 -0.420946 0.138686 -0.252308
1.900000 -0.601670 0.117299 0.167761 -0.466586 0.152014 -0.261202
1.933333 -0.618092 0.122738 0.160598 -0.506165 0.162929 -0.261421
1.966667 -0.637752 0.129235 0.172498 -0.538214 0.170670 -0.258909
2.000000 -0.660560 0.136751 0.157105 -0.561186 0.174414 -0.254432
2.033333 -0.683392 0.144065 0.134770 -0.574320 0.173671 -0.248532
2.066667 -0.706815 0.151499 0.120531 -0.576789 0.167862 -0.240682
2.100000 -0.729385 0.158602 0.117747 -0.568367 0.156666 -0.231729
2.133333 -0.748644 0.164199 0.108661 -0.549013 0.139856 -0.221579
2.166667 -0.767869 0.169556 0.105396 -0.520569 0.118052 -0.198308
2.200000 -0.787047 0.174664 0.106550 -0.485132 0.091975 -0.160972
2.233333 -0.806168 0.179513 0.097725 -0.444720 0.062042 -0.114873
2.266667 -0.825219 0.184095 0.101344 -0.401450 0.028732 -0.069611
2.300000 -0.832721 0.181855 0.061249 -0.358368 -0.007231 -0.031126
2.333333 -0.840139 0.179347 0.044871 -0.317972 -0.045335 -0.013686
2.366667 -0.847473 0.176570 0.064517 -0.282799 -0.084821 -0.038717
2.400000 -0.854725 0.173522 0.087351 -0.255120 -0.125035 -0.120252
2.433333 -0.861897 0.170202 0.094522 -0.236865 -0.164937 -0.261188
2.466667 -0.868990 0.166610 0.120627 -0.229908 -0.203518 -0.457763
2.500000 -0.872105 0.157660 0.137763 -0.234192 -0.240265 -0.704474
2.533333 -0.875144 0.148445 0.146621 -0.249924 -0.274559 -0.981833
2.566667 -0.880111 0.136668 0.131842 -0.275580 -0.306106 -1.257219
2.600000 -0.885010 0.124638 0.092988 -0.309628 -0.334616 -1.499360
2.633333 -0.895507 0.111004 0.003499 -0.350282 -0.360116 -1.683642
2.666667 -0.905936 0.097128 -0.124466 -0.395751 -0.382639 -1.784477
2.700000 -0.923643 0.083561 -0.269166 -0.443316 -0.402557 -1.781676
2.733333 -0.941268 0.069764 -0.398310 -0.490133 -0.420437 -1.662513
2.766667 -0.958801 0.055747 -0.479810 -0.534180 -0.437406 -1.435173
2.800000 -0.976229 0.041520 -0.530569 -0.573286 -0.454738 -1.114160
2.833333 -1.000063 0.026373 -0.556137 -0.605339 -0.473509 -0.723022
2.866667 -1.023763 0.011030 -0.571810 -0.628237 -0.494792 -0.297210
2.900000 -1.047312 -0.004497 -0.544204 -0.641795 -0.519277 0.121308
2.933333 -1.070691 -0.020200 -0.519459 -0.646081 -0.547263 0.489697
2.966667 -1.094650 -0.038956 -0.484988 -0.640929 -0.577979 0.779686
3.000000 -1.118400 -0.057863 -0.417139 -0.626482 -0.610355 0.969837
3.033333 -1.141923 -0.076907 -0.355571 -0.603548 -0.642765 1.053620
3.066667 -1.163735 -0.098389 -0.269505 -0.572381 -0.672551 1.031441
3.100000 -1.183795 -0.122640 -0.200087 -0.533123 -0.696735 0.922221
3.133333 -1.201754 -0.148757 -0.145735 -0.485957 -0.712384 0.750536
3.166667 -1.216820 -0.176363 -0.117267 -0.431828 -0.717544 0.542226
3.200000 -1.231578 -0.204006 -0.089888 -0.371540 -0.710419 0.323812
3.233333 -1.243830 -0.232560 -0.110630 -0.306249 -0.690337 0.118388
3.266667 -1.255756 -0.261102 -0.144962 -0.238243 -0.658705 -0.048412
3.300000 -1.264165 -0.287330 -0.190301 -0.169647 -0.617652 -0.160063
3.333333 -1.272240 -0.313500 -0.233078 -0.102284 -0.569616 -0.202491
3.366667 -1.274447 -0.332824 -0.265763 -0.037669 -0.517413 -0.169740
3.400000 -1.268107 -0.341993 -0.284536 0.021999 -0.464704 -0.056539
3.433333 -1.261461 -0.351055 -0.291016 0.075360 -0.414737 0.133574
3.466667 -1.254522 -0.360007 -0.275132 0.121461 -0.368353 0.388292
3.500000 -1.247303 -0.368848 -0.247119 0.159768 -0.325786 0.686438
3.533333 -1.239819 -0.377574 -0.227848 0.189603 -0.287121 0.999939
3.566667 -1.232082 -0.386184 -0.213994 0.211002 -0.251190 1.304577
3.600000 -1.224107 -0.394676 -0.193470 0.225381 -0.215145 1.572933
3.633333 -1.215906 -0.403047 -0.143928 0.233978 -0.176065 1.783678
3.666667 -1.207495 -0.411295 -0.035704 0.238358 -0.133777 1.920931
3.700000 -1.198887 -0.419420 0.081991 0.239594 -0.088477 1.979080
3.733333 -1.190097 -0.427419 0.220891 0.238764 -0.040362 1.956948
3.766667 -1.181138 -0.435291 0.335387 0.236096 0.009400 1.852825
3.800000 -1.173960 -0.426542 0.418141 0.231299 0.057423 1.668001
3.833333 -1.166653 -0.417682 0.457697 0.224085 0.100328 1.414966
3.866667 -1.159231 -0.408728 0.480549 0.214010 0.136110 1.115150
3.900000 -1.151705 -0.399696 0.505016 0.200889 0.162892 0.789826
3.933333 -1.144088 -0.390603 0.519958 0.184461 0.178671 0.465418
3.966667 -1.136393 -0.381466 0.520905 0.165274 0.182184 0.168846
4.000000 -1.128631 -0.372301 0.517453 0.143648 0.174887 -0.072978
4.033333 -1.123567 -0.365221 0.495998 0.120133 0.158421 -0.250133
4.066667 -1.118457 -0.358147 0.476939 0.095391 0.134414 -0.362321
4.100000 -1.117992 -0.355968 0.441762 0.070657 0.105200 -0.412429
4.133333 -1.117490 -0.353822 0.371162 0.047525 0.073221 -0.409753
4.166667 -1.116955 -0.351719 0.342427 0.027145 0.040675 -0.371159
4.200000 -1.116391 -0.349667 0.332221 0.010851 0.008247 -0.314333
4.233333 -1.118271 -0.350461 0.322121 -0.000135 -0.023786 -0.252033
4.266667 -1.121080 -0.352954 0.334641 -0.004742 -0.054965 -0.200108
4.300000 -1.123578 -0.356493 0.348682 -0.002875 -0.086137 -0.171562
4.333333 -1.124982 -0.360661 0.367040 0.004986 -0.117895 -0.179874
4.366667 -1.126359 -0.364907 0.376648 0.018148 -0.151225 -0.226637
4.400000 -1.126363 -0.369503 0.406732 0.035024 -0.186961 -0.318457
4.433333 -1.126342 -0.374180 0.406932 0.053547 -0.225645 -0.457035
4.466667 -1.123899 -0.380990 0.377878 0.071404 -0.267940 -0.634443
4.500000 -1.121438 -0.387883 0.322631 0.086635 -0.313585 -0.843525
4.533333 -1.116539 -0.397698 0.297151 0.097463 -0.362341 -1.076605
4.566667 -1.109858 -0.411057 0.264381 0.102041 -0.413071 -1.325491
4.600000 -1.103178 -0.424485 0.218055 0.099520 -0.464406 -1.571181
4.633333 -1.096022 -0.442056 0.181367 0.089369 -0.514694 -1.801162
4.666667 -1.088882 -0.459677 0.123495 0.071350 -0.562369 -2.006106
4.700000 -1.084539 -0.481084 0.047877 0.045480 -0.605815 -2.177230
4.733333 -1.085731 -0.506066 -0.053690 0.012524 -0.643195 -2.300287
4.766667 -1.086951 -0.531057 -0.150293 -0.025907 -0.673049 -2.370334
4.800000 -1.088198 -0.556039 -0.251049 -0.067926 -0.693497 -2.388745
4.833333 -1.089472 -0.580993 -0.357258 -0.111297 -0.702768 -2.355795
4.866667 -1.090774 -0.605898 -0.484621 -0.153592 -0.699173 -2.273910
4.900000 -1.096732 -0.630930 -0.563047 -0.192461 -0.681643 -2.154087
4.933333 -1.106962 -0.656839 -0.629360 -0.226259 -0.650108 -2.011974
4.966667 -1.117204 -0.682648 -0.686845 -0.253473 -0.604622 -1.859319
5.000000 -1.129796 -0.706890 -0.717315 -0.273017 -0.546529 -1.711661
5.033333 -1.142379 -0.730994 -0.738753 -0.284391 -0.478005 -1.580056
5.066667 -1.155338 -0.750669 -0.796885 -0.287088 -0.401304 -1.474415
5.100000 -1.168211 -0.764303 -0.840254 -0.281156 -0.318902 -1.389278
5.133333 -1.179459 -0.771310 -0.865837 -0.267087 -0.233638 -1.316507
5.166667 -1.187449 -0.771184 -0.920109 -0.246480 -0.149634 -1.247704
5.200000 -1.195389 -0.770883 -0.950113 -0.221281 -0.070720 -1.165863
5.233333 -1.203271 -0.770414 -1.001142 -0.193240 -0.000666 -1.054978
5.266667 -1.211088 -0.769783 -1.066510 -0.164525 0.057144 -0.905031
5.300000 -1.213832 -0.761861 -1.112830 -0.137320 0.099741 -0.715762
5.333333 -1.216506 -0.753795 -1.159435 -0.113224 0.125538 -0.487721
5.366667 -1.219109 -0.745602 -1.188888 -0.092949 0.134440 -0.225985
5.400000 -1.219535 -0.735318 -1.198626 -0.077082 0.126911 0.055339
5.433333 -1.219889 -0.724938 -1.175856 -0.066160 0.104370 0.334111
5.466667 -1.220472 -0.718249 -1.145341 -0.060483 0.068377 0.590597
5.500000 -1.220979 -0.711495 -1.129736 -0.059604 0.021398 0.807152
5.533333 -1.222452 -0.710487 -1.063105 -0.063048 -0.033273 0.961773
5.566667 -1.224652 -0.715771 -0.990030 -0.070443 -0.091334 1.038570
5.600000 -1.226763 -0.721014 -0.935753 -0.080997 -0.148354 1.030445
5.633333 -1.228782 -0.726214 -0.874085 -0.093810 -0.200198 0.946507
5.666667 -1.231715 -0.736320 -0.816022 -0.107749 -0.242282 0.805340
5.700000 -1.235383 -0.749754 -0.777825 -0.121852 -0.270728 0.628883
5.733333 -1.239847 -0.764802 -0.747427 -0.135198 -0.283630 0.450174
5.766667 -1.245268 -0.781179 -0.734130 -0.146595 -0.280734 0.301464
5.800000 -1.250565 -0.797486 -0.749513 -0.155104 -0.262104 0.212943
5.833333 -1.256774 -0.811395 -0.795804 -0.159792 -0.228129 0.203191
5.866667 -1.263741 -0.820907 -0.840001 -0.160020 -0.181165 0.278646
5.900000 -1.271067 -0.824441 -0.892156 -0.155188 -0.124346 0.442472
5.933333 -1.278247 -0.827885 -0.939425 -0.144838 -0.060257 0.684503
5.966667 -1.285270 -0.831241 -0.911512 -0.129276 0.008166 0.987510
6.000000 -1.289722 -0.826431 -0.841862 -0.108927 0.076997 1.321057
6.033333 -1.294008 -0.821544 -0.772184 -0.084346 0.142335 1.653488
6.066667 -1.298124 -0.816593 -0.671666 -0.056316 0.201553 1.952418
6.100000 -1.298431 -0.804785 -0.589453 -0.026366 0.251903 2.181919
6.133333 -1.298565 -0.792940 -0.485778 0.004047 0.290786 2.312164
6.166667 -1.298523 -0.781075 -0.367167 0.033659 0.315741 2.323135
6.200000 -1.296137 -0.766006 -0.265012 0.061114 0.325568 2.212591
6.233333 -1.291804 -0.749880 -0.154361 0.084906 0.319519 1.980108
6.266667 -1.287301 -0.733796 -0.072547 0.103665 0.296418 1.643267
6.300000 -1.282632 -0.717776 0.011669 0.117093 0.257117 1.229457
6.333333 -1.276795 -0.705575 0.055774 0.124814 0.202798 0.772606
6.366667 -1.270236 -0.697792 0.109119 0.126993 0.135733 0.304012
6.400000 -1.263515 -0.690128 0.102138 0.124529 0.058293 -0.143847
6.433333 -1.258252 -0.690279 0.047355 0.118804 -0.026680 -0.532902
6.466667 -1.252829 -0.690570 -0.018862 0.111444 -0.115630 -0.840884
6.500000 -1.249700 -0.697685 -0.096770 0.103844 -0.205645 -1.053844
6.533333 -1.248169 -0.710374 -0.191652 0.097791 -0.294161 -1.166349
6.566667 -1.246469 -0.723204 -0.283665 0.094603 -0.379190 -1.172868
6.600000 -1.246077 -0.740399 -0.352216 0.094961 -0.458259 -1.086527
6.633333 -1.245509 -0.757716 -0.376143 0.099123 -0.530269 -0.930755
6.666667 -1.244762 -0.775144 -0.393764 0.107219 -0.594482 -0.725503
6.700000 -1.241730 -0.797428 -0.414180 0.118790 -0.650886 -0.488568
6.733333 -1.236208 -0.824223 -0.399959 0.132584 -0.698563 -0.241606
6.766667 -1.230498 -0.851074 -0.386901 0.147486 -0.736460 -0.006711
6.800000 -1.224603 -0.877958 -0.379139 0.162414 -0.764838 0.208660
6.833333 -1.218524 -0.904853 -0.368938 0.176261 -0.781940 0.404150
6.866667 -1.211268 -0.933904 -0.352169 0.187839 -0.785838 0.580721
6.900000 -1.203896 -0.964018 -0.328840 0.196519 -0.774765 0.738461
6.933333 -1.196879 -0.992692 -0.315457 0.202440 -0.749105 0.890088
6.966667 -1.189689 -1.021281 -0.282167 0.205738 -0.709345 1.044926
7.000000 -1.182330 -1.049761 -0.240889 0.206631 -0.655523 1.207683
7.033333 -1.174804 -1.078107 -0.190513 0.205550 -0.589441 1.380619
7.066667 -1.167758 -1.096990 -0.151135 0.203152 -0.514049 1.562167
7.100000 -1.160558 -1.115702 -0.098750 0.200071 -0.431411 1.748302
7.133333 -1.153209 -1.134231 -0.037812 0.196609 -0.342218 1.923160
7.166667 -1.147602 -1.135865 0.014691 0.193228 -0.248563 2.074735
7.200000 -1.141863 -1.137308 0.086829 0.190391 -0.152543 2.188443
7.233333 -1.135993 -1.138564 0.164701 0.188960 -0.056554 2.251797
7.266667 -1.129992 -1.139638 0.269337 0.190059 0.038955 2.255904
7.300000 -1.123861 -1.140536 0.377848 0.194489 0.132253 2.197062
7.333333 -1.117603 -1.141262 0.500039 0.203096 0.221499 2.077036
7.366667 -1.112457 -1.129442 0.604920 0.216935 0.306464 1.897025
7.400000 -1.107195 -1.117475 0.677330 0.237058 0.386925 1.666988
7.433333 -1.099874 -1.097144 0.719697 0.263543 0.462259 1.399306
7.466667 -1.092447 -1.076710 0.747641 0.295779 0.530368 1.109520
7.500000 -1.084915 -1.056203 0.767166 0.333364 0.589489 0.812758
7.533333 -1.077282 -1.035650 0.772958 0.375891 0.637865 0.526501
7.566667 -1.065346 -1.010592 0.767689 0.421695 0.674338 0.266850
7.600000 -1.047916 -0.982973 0.776300 0.468464 0.697001 0.040317
7.633333 -1.030414 -0.955398 0.765820 0.514563 0.705706 -0.151574
7.666667 -1.012854 -0.927900 0.751952 0.558477 0.701091 -0.315529
7.700000 -0.990116 -0.902237 0.730022 0.597692 0.684102 -0.459140
7.733333 -0.967353 -0.876717 0.708350 0.629239 0.655170 -0.599692
7.766667 -0.944582 -0.851374 0.678495 0.650905 0.613840 -0.754386
7.800000 -0.919848 -0.829595 0.667866 0.661606 0.561466 -0.934160
7.833333 -0.894518 -0.812353 0.640940 0.660057 0.499084 -1.147252
7.866667 -0.869239 -0.795374 0.617396 0.645149 0.427461 -1.391265
7.900000 -0.844034 -0.778683 0.584691 0.617400 0.347685 -1.658858
7.933333 -0.821224 -0.768840 0.549632 0.578371 0.262331 -1.927186
7.966667 -0.798525 -0.759329 0.496116 0.530308 0.174389 -2.170322
8.000000 -0.775955 -0.750167 0.420677 0.475247 0.085378 -2.361269
8.033333 -0.759152 -0.748166 0.333732 0.415895 -0.003456 -2.473982
8.066667 -0.748029 -0.752844 0.182019 0.355555 -0.090478 -2.488285
8.100000 -0.742877 -0.763536 0.017699 0.297704 -0.173772 -2.392937
8.133333 -0.737879 -0.774614 -0.117469 0.245311 -0.253053 -2.190871
8.166667 -0.733035 -0.786075 -0.257066 0.200897 -0.328429 -1.890110
8.200000 -0.728344 -0.797912 -0.336432 0.166624 -0.399419 -1.511363
8.233333 -0.726596 -0.812232 -0.364630 0.143697 -0.465889 -1.079340
8.266667 -0.725981 -0.828308 -0.356278 0.132210 -0.528370 -0.629393
8.300000 -0.724825 -0.846621 -0.340187 0.130873 -0.588489 -0.194139
8.333333 -0.722696 -0.867161 -0.297049 0.138052 -0.646796 0.198896
8.366667 -0.719566 -0.889567 -0.253765 0.151754 -0.703401 0.524439
8.400000 -0.714998 -0.913899 -0.213451 0.169941 -0.758440 0.772367
8.433333 -0.709100 -0.939975 -0.168835 0.190529 -0.812095 0.936967
8.466667 -0.701217 -0.969260 -0.122340 0.211621 -0.864319 1.029072
8.500000 -0.691593 -1.001646 -0.084538 0.231494 -0.914156 1.059327
8.533333 -0.682103 -1.034253 -0.050721 0.248788 -0.961214 1.041222
8.566667 -0.672750 -1.067056 -0.002297 0.262278 -1.005569 0.986762
8.600000 -0.663541 -1.100028 0.021686 0.271004 -1.047571 0.904518
8.633333 -0.652907 -1.137585 0.059754 0.274395 -1.086761 0.803596
8.666667 -0.642425 -1.175251 0.092497 0.272222 -1.122658 0.686558
8.700000 -0.632103 -1.212995 0.117688 0.264646 -1.155130 0.556914
8.733333 -0.621945 -1.250786 0.144307 0.251742 -1.183893 0.415344
8.766667 -0.612189 -1.291623 0.143404 0.233940 -1.208340 0.268628
8.800000 -0.603321 -1.334468 0.159112 0.211356 -1.227254 0.118919
8.833333 -0.596157 -1.378499 0.159675 0.184207 -1.239911 -0.030064
8.866667 -0.589175 -1.422436 0.152925 0.152823 -1.245358 -0.174603
8.900000 -0.584914 -1.465910 0.131829 0.118012 -1.242521 -0.307156
8.933333 -0.580839 -1.509217 0.118068 0.080602 -1.229920 -0.420069
8.966667 -0.576950 -1.552318 0.097776 0.041178 -1.206562 -0.509990
9.000000 -0.575855 -1.594424 0.084047 0.000908 -1.171854 -0.572175
9.033333 -0.577981 -1.634643 0.054892 -0.038870 -1.125740 -0.601773
9.066667 -0.580286 -1.674553 0.018942 -0.076730 -1.067810 -0.595637
9.100000 -0.582763 -1.714119 -0.021538 -0.111997 -0.998058 -0.555708
9.133333 -0.588361 -1.749544 -0.041815 -0.143798 -0.917630 -0.483411
9.166667 -0.595937 -1.781240 -0.067799 -0.171092 -0.827705 -0.381619
9.200000 -0.604733 -1.809062 -0.092095 -0.193361 -0.730429 -0.249219
9.233333 -0.613249 -1.832941 -0.094153 -0.210568 -0.626909 -0.092695
9.266667 -0.621619 -1.851396 -0.100616 -0.222950 -0.519495 0.087378
9.300000 -0.630109 -1.869370 -0.090338 -0.230498 -0.410281 0.287606
9.333333 -0.638794 -1.879193 -0.081360 -0.233671 -0.300958 0.502344
9.366667 -0.647579 -1.888520 -0.047030 -0.233232 -0.192665 0.723514
9.400000 -0.654966 -1.886841 -0.033851 -0.230043 -0.086266 0.937237
9.433333 -0.662439 -1.884670 -0.005179 -0.224815 0.016450 1.134709
9.466667 -0.669987 -1.882017 0.034600 -0.217897 0.114465 1.297444
9.500000 -0.677598 -1.878892 0.074847 -0.209327 0.207022 1.414542
9.533333 -0.685262 -1.875305 0.145324 -0.198913 0.294332 1.475475
9.566667 -0.691940 -1.863023 0.218966 -0.186395 0.375650 1.479001
9.600000 -0.697512 -1.842630 0.321396 -0.171116 0.451324 1.424407
9.633333 -0.703121 -1.821831 0.410226 -0.152234 0.522235 1.313955
9.666667 -0.708757 -1.800655 0.464277 -0.129517 0.588923 1.162727
9.700000 -0.714412 -1.779131 0.503558 -0.103372 0.651419 0.983935
9.733333 -0.720078 -1.757287 0.517031 -0.074197 0.709123 0.798507
9.766667 -0.725746 -1.735154 0.527965 -0.042210 0.762707 0.620898
9.800000 -0.726825 -1.708608 0.514583 -0.008297 0.812123 0.471378
9.833333 -0.724123 -1.678758 0.511962 0.026017 0.856458 0.362907
9.866667 -0.721420 -1.648714 0.486205 0.059418 0.894521 0.300065
9.900000 -0.718715 -1.618513 0.488615 0.090874 0.924680 0.279745
9.933333 -0.714064 -1.584993 0.488287 0.119193 0.945044 0.291663
9.966667 -0.707799 -1.549881 0.493116 0.142941 0.953127 0.323319
10.000000 -0.700537 -1.513283 0.512910 0.161479 0.947148 0.354513
10.033333 -0.693295 -1.476692 0.546465 0.175059 0.926704 0.370412
10.066667 -0.686080 -1.440154 0.573521 0.184015 0.892299 0.355550
10.100000 -0.678730 -1.404970 0.610490 0.188748 0.845959 0.303486
10.133333 -0.671686 -1.372888 0.634563 0.190007 0.790505 0.208639
10.166667 -0.665376 -1.345353 0.637189 0.188888 0.729280 0.074875
10.200000 -0.659093 -1.322644 0.651025 0.185951 0.664917 -0.087033
10.233333 -0.653298 -1.308617 0.647579 0.181424 0.600136 -0.263121
10.266667 -0.647549 -1.294859 0.647248 0.175443 0.536921 -0.437823
10.300000 -0.641852 -1.281390 0.625363 0.168135 0.476340 -0.593265
10.333333 -0.636213 -1.268232 0.580441 0.159461 0.418397 -0.713010
10.366667 -0.630636 -1.255406 0.530497 0.149135 0.362236 -0.793624
10.400000 -0.625126 -1.242931 0.485382 0.137474 0.307319 -0.833428
10.433333 -0.619690 -1.230828 0.439099 0.124800 0.251389 -0.837049
10.466667 -0.614331 -1.219116 0.382603 0.111619 0.192347 -0.811415
10.500000 -0.609055 -1.207815 0.352146 0.098428 0.128202 -0.773380
10.533333 -0.607388 -1.205917 0.328383 0.085960 0.058566 -0.737183
10.566667 -0.605802 -1.204460 0.320254 0.075003 -0.016575 -0.708877
10.600000 -0.605421 -1.207697 0.322790 0.065950 -0.096658 -0.697912
10.633333 -0.605119 -1.211390 0.354721 0.059082 -0.179797 -0.714387
10.666667 -0.604406 -1.219175 0.345935 0.054547 -0.263047 -0.762498
10.700000 -0.603769 -1.227419 0.297729 0.052485 -0.343462 -0.837752
10.733333 -0.602049 -1.239614 0.262295 0.052392 -0.419607 -0.934560
10.766667 -0.599528 -1.255947 0.234616 0.053684 -0.489744 -1.050627
10.800000 -0.597102 -1.279363 0.172869 0.055688 -0.552586 -1.173463
10.833333 -0.594746 -1.303203 0.131079 0.057673 -0.607489 -1.288395
10.866667 -0.592462 -1.327450 0.089276 0.058985 -0.654975 -1.385698
10.900000 -0.590253 -1.352087 0.045053 0.058948 -0.695790 -1.461563
10.933333 -0.588121 -1.377097 -0.008819 0.057405 -0.730625 -1.515207
10.966667 -0.586066 -1.402461 -0.056208 0.054425 -0.760896 -1.540377
11.000000 -0.584092 -1.428161 -0.128707 0.050169 -0.788775 -1.541654
11.033333 -0.582199 -1.454178 -0.199471 0.045095 -0.815794 -1.520614
11.066667 -0.580390 -1.480495 -0.240064 0.039622 -0.843179 -1.477542
11.100000 -0.578667 -1.507091 -0.314131 0.034218 -0.871731 -1.409438
11.133333 -0.577030 -1.533949 -0.348494 0.029198 -0.901746 -1.315767
11.166667 -0.577041 -1.564950 -0.391444 0.024775 -0.932683 -1.197882
11.200000 -0.577138 -1.596171 -0.438722 0.021090 -0.963334 -1.056553
11.233333 -0.577602 -1.630163 -0.471024 0.018025 -0.992445 -0.899581
11.266667 -0.577803 -1.665571 -0.507779 0.015331 -1.018453 -0.734063
11.300000 -0.577141 -1.702346 -0.536822 0.012521 -1.039849 -0.573961
11.333333 -0.576559 -1.739232 -0.553093 0.008993 -1.055063 -0.427951
11.366667 -0.575660 -1.776272 -0.565794 0.003931 -1.063282 -0.309590
11.400000 -0.574842 -1.813362 -0.557024 -0.003455 -1.063592 -0.232528
11.433333 -0.574105 -1.850473 -0.548713 -0.013797 -1.055814 -0.200596
11.466667 -0.573451 -1.887575 -0.537240 -0.027470 -1.040399 -0.217900
11.500000 -0.572879 -1.924639 -0.513357 -0.044473 -1.017645 -0.279959
11.533333 -0.573288 -1.960297 -0.484807 -0.064595 -0.987728 -0.379741
11.566667 -0.574799 -1.994134 -0.493433 -0.087342 -0.950660 -0.510216
11.600000 -0.577562 -2.025344 -0.511146 -0.112143 -0.906545 -0.660696
11.633333 -0.582069 -2.055678 -0.554903 -0.138349 -0.855195 -0.824722
11.666667 -0.588335 -2.083840 -0.600736 -0.165297 -0.796285 -0.991713
11.700000 -0.594674 -2.111819 -0.660785 -0.192418 -0.730314 -1.150267
11.733333 -0.602559 -2.135642 -0.720392 -0.218807 -0.658557 -1.295281
11.766667 -0.610503 -2.159248 -0.768779 -0.243764 -0.582002 -1.414934
11.800000 -0.618498 -2.182619 -0.817844 -0.266507 -0.502238 -1.499806
11.833333 -0.627258 -2.199859 -0.851987 -0.286476 -0.421226 -1.542690
11.866667 -0.637852 -2.209923 -0.844036 -0.303009 -0.341247 -1.548390
11.900000 -0.648476 -2.219731 -0.929811 -0.315506 -0.264090 -1.522956
11.933333 -0.661500 -2.221211 -1.031854 -0.323898 -0.191735 -1.469706
11.966667 -0.674535 -2.222442 -1.135181 -0.327901 -0.126366 -1.393578
12.000000 -0.687566 -2.223433 -1.194166 -0.327205 -0.069766 -1.298730
12.033333 -0.700580 -2.224191 -1.218705 -0.321489 -0.022786 -1.192833
12.066667 -0.711133 -2.220859 -1.228737 -0.311149 0.014503 -1.071358
12.100000 -0.721645 -2.217314 -1.242208 -0.296497 0.041941 -0.941222
12.133333 -0.732104 -2.213568 -1.278519 -0.277880 0.060682 -0.808032
12.166667 -0.742499 -2.209634 -1.288618 -0.255919 0.072025 -0.682684
12.200000 -0.750032 -2.206462 -1.304098 -0.231730 0.077445 -0.572323
12.233333 -0.757479 -2.203125 -1.333406 -0.206371 0.077931 -0.475412
12.266667 -0.764832 -2.199637 -1.355516 -0.180356 0.074570 -0.394728
12.300000 -0.770460 -2.196823 -1.371136 -0.154514 0.068718 -0.323201
12.333333 -0.774465 -2.194678 -1.370163 -0.129686 0.061193 -0.262034
12.366667 -0.778354 -2.192415 -1.379102 -0.106610 0.052734 -0.204447
12.400000 -0.780770 -2.190634 -1.368494 -0.085541 0.043991 -0.150672
12.433333 -0.782000 -2.189946 -1.387540 -0.066817 0.035715 -0.100906
12.466667 -0.782609 -2.189566 -1.380868 -0.050911 0.028300 -0.060225
12.500000 -0.783087 -2.189106 -1.381181 -0.037932 0.021905 -0.031055
12.533333 -0.783481 -2.189083 -1.375278 -0.027690 0.016563 -0.009595
12.566667 -0.783741 -2.188998 -1.378952 -0.019919 0.012342 0.002742
12.600000 -0.784063 -2.188816 -1.369707 -0.014393 0.009262 0.010938
12.633333 -0.784249 -2.188588 -1.368079 -0.010708 0.007140 0.011487
12.666667 -0.784298 -2.188323 -1.375516 -0.008352 0.005779 0.011773
