t x y theta dxdt dydt dthetadt
0.000000 0.000000 0.000000 0.700949 0.089255 0.056962 0.974375
0.033333 0.002988 0.001874 0.684024 0.086898 0.052261 1.202990
0.066667 0.005862 0.003581 0.711982 0.084506 0.047385 1.387669
0.100000 0.008615 0.005107 0.843371 0.082101 0.042337 1.484076
0.133333 0.011309 0.006474 0.891599 0.079697 0.037105 1.461475
0.166667 0.013881 0.007634 1.038089 0.077309 0.031691 1.309935
0.200000 0.016393 0.008628 1.147276 0.074951 0.026096 1.013399
0.233333 0.018844 0.009451 1.271706 0.072636 0.020317 0.575454
0.266667 0.021233 0.010102 1.358754 0.070366 0.014333 0.006040
0.300000 0.023520 0.010497 1.324506 0.068137 0.008146 -0.648401
0.333333 0.025745 0.010713 1.299263 0.065946 0.001768 -1.349596
0.366667 0.027906 0.010748 1.203612 0.063780 -0.004814 -2.052233
0.400000 0.030002 0.010599 1.078842 0.061623 -0.011617 -2.707204
0.433333 0.032021 0.010137 0.917625 0.059457 -0.018656 -3.266775
0.466667 0.033965 0.009348 0.744369 0.057275 -0.025909 -3.682579
0.500000 0.035843 0.008368 0.592966 0.055062 -0.033387 -3.942120
0.533333 0.037655 0.007194 0.420900 0.052805 -0.041084 -4.038891
0.566667 0.039399 0.005824 0.282498 0.050503 -0.048966 -3.981892
0.600000 0.041059 0.004095 0.067852 0.048156 -0.056985 -3.784826
0.633333 0.042652 0.002167 -0.107773 0.045767 -0.065090 -3.475625
0.666667 0.044151 -0.000120 -0.198115 0.043339 -0.073250 -3.091810
0.700000 0.045554 -0.002769 -0.325220 0.040882 -0.081404 -2.663350
0.733333 0.046889 -0.005622 -0.400243 0.038394 -0.089515 -2.218159
0.766667 0.048119 -0.008832 -0.435573 0.035876 -0.097546 -1.777090
0.800000 0.049279 -0.012248 -0.479083 0.033316 -0.105499 -1.368199
0.833333 0.050320 -0.016012 -0.470709 0.030695 -0.113376 -1.011551
0.866667 0.051292 -0.019985 -0.473372 0.027991 -0.121194 -0.714574
0.900000 0.052194 -0.024167 -0.484806 0.025189 -0.128987 -0.481262
0.933333 0.053027 -0.028559 -0.483139 0.022287 -0.136767 -0.310235
0.966667 0.053791 -0.033161 -0.479348 0.019282 -0.144571 -0.193213
1.000000 0.054485 -0.037974 -0.458741 0.016174 -0.152411 -0.120933
1.033333 0.055022 -0.043131 -0.484548 0.012985 -0.160291 -0.073533
1.066667 0.055393 -0.048629 -0.490648 0.009745 -0.168191 -0.041876
1.100000 0.055696 -0.054339 -0.490801 0.006467 -0.176099 -0.019568
1.133333 0.055824 -0.060392 -0.488117 0.003166 -0.184006 -0.009369
1.166667 0.055771 -0.066788 -0.487584 -0.000133 -0.191877 -0.027887
1.200000 0.055652 -0.073394 -0.487231 -0.003389 -0.199665 -0.092160
1.233333 0.055466 -0.080209 -0.503746 -0.006582 -0.207346 -0.224672
1.266667 0.055215 -0.087234 -0.517110 -0.009721 -0.214928 -0.439533
1.300000 0.054899 -0.094468 -0.470560 -0.012804 -0.222406 -0.747843
1.333333 0.054385 -0.102048 -0.462720 -0.015847 -0.229797 -1.143694
1.366667 0.053807 -0.109835 -0.445280 -0.018895 -0.237152 -1.607494
1.400000 0.053168 -0.117827 -0.446657 -0.022018 -0.244543 -2.100941
1.433333 0.052319 -0.126169 -0.481550 -0.025275 -0.252028 -2.595696
1.466667 0.051410 -0.134714 -0.610955 -0.028699 -0.259645 -3.058187
1.500000 0.050443 -0.143461 -0.759387 -0.032310 -0.267417 -3.450111
1.533333 0.049419 -0.152408 -1.035201 -0.036119 -0.275359 -3.734567
1.566667 0.048339 -0.161553 -1.227213 -0.040100 -0.283453 -3.892586
1.600000 0.047047 -0.171032 -1.403457 -0.044200 -0.291654 -3.922218
1.633333 0.045551 -0.180842 -1.554511 -0.048354 -0.299910 -3.818535
1.666667 0.043855 -0.190978 -1.724902 -0.052482 -0.308148 -3.595906
1.700000 0.041971 -0.201435 -1.813084 -0.056504 -0.316297 -3.282178
1.733333 0.039908 -0.212210 -1.894369 -0.060329 -0.324273 -2.924248
1.766667 0.037676 -0.223295 -1.983448 -0.063871 -0.331995 -2.552755
1.800000 0.035294 -0.234681 -2.040470 -0.067055 -0.339390 -2.195146
1.833333 0.032871 -0.246246 -2.089740 -0.069824 -0.346407 -1.869895
1.866667 0.030411 -0.257988 -2.147113 -0.072145 -0.353026 -1.584375
1.900000 0.027915 -0.269902 -2.173780 -0.074007 -0.359246 -1.332961
1.933333 0.025342 -0.282070 -2.210259 -0.075407 -0.365080 -1.091191
1.966667 0.022739 -0.294404 -2.235051 -0.076364 -0.370563 -0.841976
2.000000 0.020108 -0.306901 -2.270245 -0.076901 -0.375736 -0.558510
2.033333 0.017451 -0.319558 -2.296648 -0.077032 -0.380632 -0.224218
2.066667 0.014772 -0.332371 -2.325582 -0.076779 -0.385273 0.178206
2.100000 0.012073 -0.345337 -2.346028 -0.076137 -0.389666 0.666102
2.133333 0.009432 -0.358457 -2.372971 -0.075111 -0.393828 1.242649
2.166667 0.006871 -0.371709 -2.337211 -0.073707 -0.397762 1.908453
2.200000 0.004415 -0.385078 -2.285062 -0.071951 -0.401475 2.640556
2.233333 0.001949 -0.398586 -2.219828 -0.069881 -0.404982 3.423807
2.266667 -0.000379 -0.412183 -2.076508 -0.067534 -0.408299 4.227630
2.300000 -0.002713 -0.425912 -1.924292 -0.064981 -0.411450 5.012906
2.333333 -0.004880 -0.439714 -1.717437 -0.062299 -0.414465 5.735797
2.366667 -0.006870 -0.453582 -1.501135 -0.059555 -0.417378 6.357849
2.400000 -0.008861 -0.467571 -1.238560 -0.056774 -0.420215 6.860128
2.433333 -0.010663 -0.481620 -0.928887 -0.054005 -0.423010 7.209631
2.466667 -0.012275 -0.495733 -0.610448 -0.051286 -0.425799 7.390268
2.500000 -0.013884 -0.509956 -0.282034 -0.048637 -0.428618 7.383010
2.533333 -0.015489 -0.524284 -0.051353 -0.046061 -0.431485 7.195127
2.566667 -0.016914 -0.538695 0.232446 -0.043572 -0.434411 6.831775
2.600000 -0.018334 -0.553205 0.482357 -0.041211 -0.437401 6.299018
2.633333 -0.019748 -0.567810 0.733458 -0.038981 -0.440446 5.622812
2.666667 -0.021023 -0.582518 0.925249 -0.036891 -0.443520 4.836771
2.700000 -0.022179 -0.597334 1.088389 -0.034963 -0.446591 3.995319
2.733333 -0.023237 -0.612264 1.238784 -0.033230 -0.449627 3.130285
2.766667 -0.024220 -0.627319 1.346818 -0.031711 -0.452595 2.280277
2.800000 -0.025150 -0.642502 1.393881 -0.030425 -0.455462 1.485257
2.833333 -0.026052 -0.657817 1.361574 -0.029403 -0.458196 0.781438
2.866667 -0.026946 -0.673202 1.304000 -0.028664 -0.460765 0.189705
2.900000 -0.027830 -0.688653 1.250691 -0.028202 -0.463148 -0.288376
2.933333 -0.028706 -0.704167 1.170475 -0.027997 -0.465328 -0.639677
2.966667 -0.029572 -0.719739 1.111214 -0.028021 -0.467295 -0.860426
3.000000 -0.030503 -0.735401 1.057007 -0.028229 -0.469041 -0.963859
3.033333 -0.031426 -0.751113 1.052931 -0.028563 -0.470568 -0.985124
3.066667 -0.032339 -0.766873 1.023819 -0.028969 -0.471877 -0.957951
3.100000 -0.033323 -0.782675 0.974098 -0.029391 -0.472955 -0.909444
3.133333 -0.034297 -0.798516 0.952628 -0.029783 -0.473790 -0.874763
3.166667 -0.035330 -0.814374 0.935799 -0.030097 -0.474352 -0.880169
3.200000 -0.036411 -0.830230 0.908212 -0.030293 -0.474622 -0.935218
3.233333 -0.037483 -0.846115 0.899985 -0.030333 -0.474560 -1.021860
3.266667 -0.038546 -0.862024 0.906558 -0.030189 -0.474144 -1.117439
3.300000 -0.039599 -0.877953 0.914161 -0.029849 -0.473358 -1.203011
3.333333 -0.040639 -0.893805 0.894171 -0.029303 -0.472195 -1.252875
3.366667 -0.041669 -0.909671 0.809632 -0.028561 -0.470670 -1.242344
3.400000 -0.042654 -0.925426 0.681750 -0.027647 -0.468802 -1.151911
3.433333 -0.043583 -0.941057 0.564149 -0.026601 -0.466649 -0.973394
3.466667 -0.044502 -0.956693 0.473844 -0.025460 -0.464260 -0.706584
3.500000 -0.045350 -0.972183 0.433375 -0.024260 -0.461700 -0.357046
3.533333 -0.046121 -0.987518 0.428070 -0.023045 -0.459034 0.056895
3.566667 -0.046816 -1.002686 0.460059 -0.021848 -0.456320 0.500310
3.600000 -0.047503 -1.017846 0.510945 -0.020692 -0.453605 0.928846
3.633333 -0.048120 -1.032819 0.565072 -0.019592 -0.450916 1.296811
3.666667 -0.048730 -1.047781 0.628996 -0.018559 -0.448276 1.569388
3.700000 -0.049333 -1.062729 0.726588 -0.017595 -0.445690 1.725897
3.733333 -0.049877 -1.077485 0.843135 -0.016699 -0.443161 1.759771
3.766667 -0.050417 -1.092223 0.984591 -0.015862 -0.440683 1.677296
3.800000 -0.050952 -1.106941 1.084207 -0.015083 -0.438260 1.493817
3.833333 -0.051435 -1.121492 1.137879 -0.014356 -0.435890 1.216047
3.866667 -0.051915 -1.136020 1.149349 -0.013681 -0.433582 0.841275
3.900000 -0.052346 -1.150408 1.150080 -0.013066 -0.431355 0.365895
3.933333 -0.052732 -1.164668 1.135306 -0.012517 -0.429218 -0.208582
3.966667 -0.053119 -1.178900 1.119034 -0.012049 -0.427191 -0.882871
4.000000 -0.053471 -1.193032 1.100670 -0.011673 -0.425287 -1.653766
4.033333 -0.053825 -1.207133 1.091878 -0.011406 -0.423515 -2.492526
4.066667 -0.054184 -1.221204 1.079242 -0.011257 -0.421874 -3.356609
4.100000 -0.054526 -1.235213 1.051494 -0.011230 -0.420350 -4.204860
4.133333 -0.054876 -1.249190 0.959490 -0.011324 -0.418927 -5.004167
4.166667 -0.055223 -1.263122 0.693868 -0.011536 -0.417586 -5.699925
4.200000 -0.055580 -1.277021 0.318313 -0.011857 -0.416299 -6.234711
4.233333 -0.055954 -1.290877 -0.031143 -0.012273 -0.415049 -6.573199
4.266667 -0.056353 -1.304689 -0.302921 -0.012773 -0.413820 -6.697582
4.300000 -0.056765 -1.318465 -0.634919 -0.013345 -0.412599 -6.594621
4.333333 -0.057211 -1.332197 -0.932409 -0.013982 -0.411383 -6.262137
4.366667 -0.057696 -1.345886 -1.164477 -0.014669 -0.410165 -5.739130
4.400000 -0.058197 -1.359536 -1.358384 -0.015396 -0.408944 -5.085611
4.433333 -0.058716 -1.373148 -1.486247 -0.016157 -0.407714 -4.357834
4.466667 -0.059254 -1.386721 -1.565752 -0.016944 -0.406473 -3.602216
4.500000 -0.059833 -1.400253 -1.638357 -0.017750 -0.405217 -2.871609
4.533333 -0.060433 -1.413745 -1.691457 -0.018570 -0.403941 -2.211141
4.566667 -0.061057 -1.427197 -1.744262 -0.019406 -0.402643 -1.639074
4.600000 -0.061715 -1.440605 -1.777889 -0.020258 -0.401323 -1.159086
4.633333 -0.062405 -1.453971 -1.801035 -0.021125 -0.399977 -0.767039
4.666667 -0.063124 -1.467290 -1.790396 -0.022007 -0.398605 -0.461435
4.700000 -0.063871 -1.480559 -1.788705 -0.022905 -0.397204 -0.229987
4.733333 -0.064645 -1.493774 -1.778693 -0.023819 -0.395770 -0.059730
4.766667 -0.065449 -1.506947 -1.765039 -0.024744 -0.394293 0.058149
4.800000 -0.066287 -1.520078 -1.743968 -0.025679 -0.392762 0.130364
4.833333 -0.067150 -1.533144 -1.732982 -0.026624 -0.391175 0.161206
4.866667 -0.068048 -1.546167 -1.723867 -0.027579 -0.389521 0.157966
4.900000 -0.068983 -1.559148 -1.721294 -0.028542 -0.387791 0.122800
4.933333 -0.069957 -1.572088 -1.713679 -0.029513 -0.385982 0.059858
4.966667 -0.070956 -1.584947 -1.700799 -0.030497 -0.384103 -0.028167
5.000000 -0.071996 -1.597764 -1.709163 -0.031499 -0.382163 -0.135081
5.033333 -0.073061 -1.610492 -1.701724 -0.032521 -0.380170 -0.259713
5.066667 -0.074152 -1.623126 -1.719814 -0.033569 -0.378139 -0.397013
5.100000 -0.075267 -1.635662 -1.723414 -0.034648 -0.376096 -0.543551
5.133333 -0.076430 -1.648159 -1.743199 -0.035758 -0.374053 -0.691271
5.166667 -0.077642 -1.660615 -1.750203 -0.036892 -0.372008 -0.833245
5.200000 -0.078879 -1.672967 -1.792177 -0.038040 -0.369960 -0.959775
5.233333 -0.080140 -1.685211 -1.835808 -0.039188 -0.367900 -1.055194
5.266667 -0.081455 -1.697417 -1.896825 -0.040324 -0.365818 -1.107986
5.300000 -0.082825 -1.709586 -1.941519 -0.041438 -0.363700 -1.091995
5.333333 -0.084253 -1.721718 -1.998504 -0.042525 -0.361539 -0.988879
5.366667 -0.085740 -1.733816 -2.049016 -0.043590 -0.359339 -0.778384
5.400000 -0.087244 -1.745806 -2.089671 -0.044645 -0.357107 -0.453497
5.433333 -0.088765 -1.757692 -2.150288 -0.045710 -0.354856 -0.020257
5.466667 -0.090299 -1.769476 -2.182551 -0.046810 -0.352605 0.505817
5.500000 -0.091849 -1.781161 -2.204324 -0.047976 -0.350373 1.082413
5.533333 -0.093415 -1.792749 -2.186291 -0.049243 -0.348193 1.659403
5.566667 -0.095004 -1.804244 -2.139843 -0.050659 -0.346101 2.184011
5.600000 -0.096663 -1.815710 -2.056701 -0.052258 -0.344131 2.613021
5.633333 -0.098397 -1.827151 -1.855353 -0.054068 -0.342308 2.904768
5.666667 -0.100178 -1.838510 -1.648572 -0.056109 -0.340657 3.022944
5.700000 -0.102019 -1.849800 -1.427981 -0.058392 -0.339194 2.947902
5.733333 -0.103934 -1.861031 -1.215861 -0.060916 -0.337929 2.682666
5.766667 -0.105939 -1.872217 -1.110834 -0.063664 -0.336860 2.240080
5.800000 -0.108046 -1.883369 -1.018436 -0.066624 -0.335992 1.635708
5.833333 -0.110271 -1.894501 -0.998846 -0.069787 -0.335339 0.915532
5.866667 -0.112627 -1.905622 -1.042353 -0.073138 -0.334908 0.141398
5.900000 -0.115127 -1.916737 -1.072231 -0.076661 -0.334710 -0.618944
5.933333 -0.117717 -1.927840 -1.062141 -0.080342 -0.334753 -1.318374
5.966667 -0.120399 -1.938934 -1.119578 -0.084161 -0.335033 -1.916402
6.000000 -0.123250 -1.950059 -1.243300 -0.088099 -0.335550 -2.374553
6.033333 -0.126195 -1.961178 -1.421817 -0.092130 -0.336288 -2.678848
6.066667 -0.129313 -1.972350 -1.560248 -0.096230 -0.337223 -2.838297
6.100000 -0.132605 -1.983583 -1.724839 -0.100370 -0.338319 -2.868568
6.133333 -0.135996 -1.994813 -1.844571 -0.104521 -0.339534 -2.776321
6.166667 -0.139552 -2.006117 -1.956381 -0.108653 -0.340832 -2.577722
6.200000 -0.143267 -2.017496 -2.043429 -0.112738 -0.342173 -2.298028
6.233333 -0.147135 -2.028953 -2.099882 -0.116744 -0.343518 -1.966283
6.266667 -0.151148 -2.040488 -2.163894 -0.120648 -0.344844 -1.596127
6.300000 -0.155267 -2.052029 -2.198393 -0.124438 -0.346143 -1.207220
6.333333 -0.159519 -2.063651 -2.211594 -0.128106 -0.347408 -0.818711
6.366667 -0.163878 -2.075279 -2.226393 -0.131653 -0.348632 -0.441185
6.400000 -0.168346 -2.086916 -2.229523 -0.135090 -0.349819 -0.083082
6.433333 -0.172923 -2.098563 -2.236168 -0.138439 -0.350972 0.253615
6.466667 -0.177610 -2.110221 -2.233470 -0.141725 -0.352102 0.555730
6.500000 -0.182400 -2.121947 -2.223791 -0.144967 -0.353208 0.816936
6.533333 -0.187287 -2.133739 -2.180736 -0.148191 -0.354300 1.028284
6.566667 -0.192270 -2.145595 -2.126895 -0.151416 -0.355386 1.177437
6.600000 -0.197346 -2.157516 -2.040428 -0.154659 -0.356465 1.257592
6.633333 -0.202536 -2.169451 -1.968390 -0.157931 -0.357539 1.263080
6.666667 -0.207841 -2.181401 -1.892410 -0.161239 -0.358605 1.195110
6.700000 -0.213262 -2.193368 -1.814193 -0.164589 -0.359665 1.056729
6.733333 -0.218799 -2.205351 -1.768924 -0.167983 -0.360719 0.856503
6.766667 -0.224453 -2.217352 -1.742487 -0.171421 -0.361777 0.610956
6.800000 -0.230216 -2.229425 -1.732255 -0.174899 -0.362856 0.338283
6.833333 -0.236097 -2.241516 -1.743352 -0.178413 -0.363960 0.058440
6.866667 -0.242094 -2.253679 -1.751772 -0.181959 -0.365092 -0.209711
6.900000 -0.248210 -2.265860 -1.781421 -0.185533 -0.366251 -0.448868
6.933333 -0.254447 -2.278062 -1.809898 -0.189132 -0.367434 -0.649036
6.966667 -0.260806 -2.290332 -1.850025 -0.192753 -0.368622 -0.804991
7.000000 -0.267289 -2.302669 -1.894943 -0.196396 -0.369800 -0.913082
7.033333 -0.273893 -2.315027 -1.928241 -0.200056 -0.370956 -0.978558
7.066667 -0.280619 -2.327406 -1.972323 -0.203731 -0.372092 -1.003798
7.100000 -0.287471 -2.339850 -2.007599 -0.207415 -0.373209 -0.996505
7.133333 -0.294445 -2.352315 -2.057303 -0.211104 -0.374310 -0.958978
7.166667 -0.301543 -2.364801 -2.086344 -0.214792 -0.375413 -0.896575
7.200000 -0.308764 -2.377352 -2.117745 -0.218476 -0.376533 -0.818156
7.233333 -0.316110 -2.389924 -2.142031 -0.222152 -0.377679 -0.724762
7.266667 -0.323580 -2.402518 -2.177789 -0.225820 -0.378855 -0.620612
7.300000 -0.331175 -2.415132 -2.195173 -0.229479 -0.380065 -0.506560
7.333333 -0.338894 -2.427767 -2.201195 -0.233131 -0.381308 -0.387913
7.366667 -0.346731 -2.440470 -2.221212 -0.236778 -0.382577 -0.265435
7.400000 -0.354685 -2.453241 -2.218894 -0.240421 -0.383863 -0.137539
7.433333 -0.362756 -2.466081 -2.224387 -0.244064 -0.385156 -0.004133
7.466667 -0.370942 -2.478991 -2.226876 -0.247710 -0.386444 0.130856
7.500000 -0.379255 -2.491920 -2.213019 -0.251364 -0.387720 0.264247
7.533333 -0.387692 -2.504868 -2.212998 -0.255030 -0.388974 0.396966
7.566667 -0.396255 -2.517835 -2.205286 -0.258714 -0.390207 0.525148
7.600000 -0.404936 -2.530875 -2.175892 -0.262418 -0.391418 0.643837
7.633333 -0.413743 -2.543932 -2.149310 -0.266146 -0.392620 0.747017
7.666667 -0.422669 -2.557065 -2.117307 -0.269903 -0.393828 0.831593
7.700000 -0.431721 -2.570214 -2.083447 -0.273691 -0.395046 0.896890
7.733333 -0.440898 -2.583377 -2.038133 -0.277514 -0.396279 0.935643
7.766667 -0.450199 -2.596554 -1.991798 -0.281375 -0.397526 0.944464
7.800000 -0.459630 -2.609807 -1.957524 -0.285278 -0.398787 0.925035
7.833333 -0.469196 -2.623135 -1.923674 -0.289224 -0.400045 0.879975
7.866667 -0.478900 -2.636537 -1.883716 -0.293209 -0.401281 0.812822
7.900000 -0.488727 -2.649949 -1.857520 -0.297230 -0.402479 0.724126
7.933333 -0.498676 -2.663370 -1.833042 -0.301276 -0.403621 0.621401
7.966667 -0.508777 -2.676858 -1.806986 -0.305344 -0.404686 0.511853
8.000000 -0.519034 -2.690412 -1.803743 -0.309430 -0.405655 0.396992
8.033333 -0.529412 -2.703971 -1.781971 -0.313534 -0.406518 0.275633
8.066667 -0.539953 -2.717587 -1.781976 -0.317666 -0.407274 0.152606
8.100000 -0.550613 -2.731205 -1.793230 -0.321840 -0.407923 0.029048
8.133333 -0.561392 -2.744824 -1.791574 -0.326075 -0.408468 -0.095974
8.166667 -0.572343 -2.758485 -1.779194 -0.330385 -0.408915 -0.224938
8.200000 -0.583411 -2.772144 -1.791050 -0.334777 -0.409272 -0.357451
8.233333 -0.594595 -2.785799 -1.802440 -0.339249 -0.409543 -0.486667
8.266667 -0.605894 -2.799448 -1.818347 -0.343798 -0.409732 -0.617755
8.300000 -0.617376 -2.813116 -1.839502 -0.348412 -0.409841 -0.746022
8.333333 -0.629044 -2.826797 -1.878433 -0.353076 -0.409869 -0.867462
8.366667 -0.640897 -2.840483 -1.913331 -0.357772 -0.409817 -0.974611
8.400000 -0.652938 -2.854170 -1.930210 -0.362474 -0.409684 -1.062907
8.433333 -0.665167 -2.867856 -1.990912 -0.367160 -0.409467 -1.132963
8.466667 -0.677502 -2.881524 -2.035918 -0.371792 -0.409160 -1.177439
8.500000 -0.690025 -2.895182 -2.090097 -0.376341 -0.408762 -1.196428
8.533333 -0.702650 -2.908819 -2.148964 -0.380771 -0.408277 -1.188898
8.566667 -0.715376 -2.922435 -2.170080 -0.385066 -0.407706 -1.161099
8.600000 -0.728287 -2.936029 -2.229952 -0.389211 -0.407054 -1.114982
8.633333 -0.741383 -2.949601 -2.256084 -0.393209 -0.406328 -1.055851
8.666667 -0.754661 -2.963149 -2.299890 -0.397060 -0.405537 -0.987279
8.700000 -0.768031 -2.976667 -2.331134 -0.400773 -0.404687 -0.915904
8.733333 -0.781491 -2.990154 -2.345114 -0.404357 -0.403784 -0.851159
8.766667 -0.795037 -3.003606 -2.375946 -0.407820 -0.402831 -0.792561
8.800000 -0.808668 -3.017023 -2.403936 -0.411179 -0.401832 -0.741722
8.833333 -0.822476 -3.030415 -2.419739 -0.414438 -0.400785 -0.699427
8.866667 -0.836364 -3.043768 -2.429309 -0.417617 -0.399686 -0.672782
8.900000 -0.850327 -3.057078 -2.451546 -0.420723 -0.398531 -0.655175
8.933333 -0.864365 -3.070345 -2.482034 -0.423765 -0.397312 -0.638045
8.966667 -0.878570 -3.083588 -2.502344 -0.426732 -0.396018 -0.614756
9.000000 -0.892842 -3.096782 -2.511031 -0.429607 -0.394637 -0.582817
9.033333 -0.907266 -3.109944 -2.540195 -0.432377 -0.393160 -0.528630
9.066667 -0.921751 -3.123054 -2.563908 -0.435016 -0.391583 -0.437337
9.100000 -0.936360 -3.136116 -2.594841 -0.437503 -0.389898 -0.308723
9.133333 -0.951023 -3.149121 -2.586298 -0.439816 -0.388103 -0.146440
9.166667 -0.965776 -3.162059 -2.629760 -0.441952 -0.386202 0.041315
9.200000 -0.980601 -3.174921 -2.671372 -0.443910 -0.384202 0.250103
9.233333 -0.995472 -3.187720 -2.648481 -0.445698 -0.382108 0.460377
9.266667 -1.010396 -3.200434 -2.645006 -0.447326 -0.379928 0.656126
9.300000 -1.025368 -3.213058 -2.584759 -0.448814 -0.377674 0.820801
9.333333 -1.040375 -3.225615 -2.519867 -0.450183 -0.375356 0.946461
9.366667 -1.055413 -3.238100 -2.447004 -0.451452 -0.372984 1.022381
9.400000 -1.070478 -3.250513 -2.391622 -0.452639 -0.370563 1.039010
9.433333 -1.085585 -3.262838 -2.331809 -0.453754 -0.368097 1.000304
9.466667 -1.100736 -3.275075 -2.289409 -0.454810 -0.365589 0.908027
9.500000 -1.115931 -3.287225 -2.270024 -0.455805 -0.363040 0.777123
9.533333 -1.131175 -3.299288 -2.254290 -0.456733 -0.360446 0.617597
9.566667 -1.146427 -3.311268 -2.234254 -0.457592 -0.357804 0.445689
9.600000 -1.161686 -3.323164 -2.232664 -0.458373 -0.355116 0.276281
9.633333 -1.176995 -3.334969 -2.234643 -0.459065 -0.352377 0.117632
9.666667 -1.192355 -3.346680 -2.231311 -0.459656 -0.349585 -0.021774
9.700000 -1.207708 -3.358301 -2.241989 -0.460140 -0.346740 -0.142129
9.733333 -1.223111 -3.369821 -2.260108 -0.460508 -0.343840 -0.243514
9.766667 -1.238500 -3.381248 -2.260573 -0.460742 -0.340885 -0.329281
9.800000 -1.253872 -3.392579 -2.279860 -0.460835 -0.337873 -0.399925
9.833333 -1.269222 -3.403813 -2.296342 -0.460786 -0.334801 -0.457117
9.866667 -1.284615 -3.414935 -2.317543 -0.460598 -0.331668 -0.498974
9.900000 -1.300045 -3.425939 -2.332536 -0.460263 -0.328473 -0.522380
9.933333 -1.315442 -3.436841 -2.356728 -0.459787 -0.325216 -0.524050
9.966667 -1.330801 -3.447639 -2.377285 -0.459172 -0.321894 -0.497354
10.000000 -1.346118 -3.458332 -2.393634 -0.458412 -0.318507 -0.444679
10.033333 -1.361388 -3.468917 -2.416135 -0.457496 -0.315058 -0.364843
10.066667 -1.376609 -3.479394 -2.447531 -0.456420 -0.311546 -0.264408
10.100000 -1.391835 -3.489734 -2.474739 -0.455187 -0.307970 -0.151923
10.133333 -1.407062 -3.499935 -2.478018 -0.453784 -0.304327 -0.040010
10.166667 -1.422227 -3.510023 -2.491436 -0.452200 -0.300618 0.052981
10.200000 -1.437324 -3.519996 -2.467724 -0.450430 -0.296843 0.114905
10.233333 -1.452350 -3.529852 -2.433096 -0.448457 -0.292995 0.131508
10.266667 -1.467301 -3.539591 -2.407496 -0.446253 -0.289060 0.092324
10.300000 -1.482192 -3.549153 -2.366937 -0.443780 -0.285019 -0.011331
10.333333 -1.496999 -3.558595 -2.354126 -0.441012 -0.280858 -0.178890
10.366667 -1.511719 -3.567915 -2.337762 -0.437917 -0.276551 -0.405054
10.400000 -1.526347 -3.577113 -2.338382 -0.434461 -0.272072 -0.683629
10.433333 -1.540880 -3.586186 -2.357109 -0.430632 -0.267412 -1.018992
10.466667 -1.555243 -3.595043 -2.398992 -0.426441 -0.262583 -1.412091
10.500000 -1.569504 -3.603775 -2.483639 -0.421908 -0.257610 -1.857302
10.533333 -1.583656 -3.612379 -2.563360 -0.417054 -0.252532 -2.356136
10.566667 -1.597587 -3.620761 -2.625108 -0.411921 -0.247416 -2.902340
10.600000 -1.611286 -3.628926 -2.708454 -0.406560 -0.242331 -3.478591
10.633333 -1.624746 -3.636876 -2.804782 -0.401023 -0.237351 -4.032177
10.666667 -1.637968 -3.644615 -2.912151 -0.395350 -0.232531 -4.504951
10.700000 -1.650953 -3.652151 -3.035765 -0.389595 -0.227925 -4.845187
10.733333 -1.663810 -3.659555 3.085075 -0.383816 -0.223569 -4.992631
10.766667 -1.676536 -3.666828 2.782238 -0.378058 -0.219474 -4.888000
10.800000 -1.689128 -3.673967 2.480293 -0.372343 -0.215636 -4.494479
10.833333 -1.701468 -3.681045 2.180877 -0.366681 -0.212039 -3.817175
10.866667 -1.713565 -3.688058 1.881282 -0.361073 -0.208653 -2.883075
10.900000 -1.725424 -3.695007 1.685828 -0.355516 -0.205423 -1.736425
10.933333 -1.737140 -3.701821 1.590356 -0.349994 -0.202298 -0.443924
10.966667 -1.748709 -3.708501 1.654717 -0.344504 -0.199223 0.889110
11.000000 -1.760130 -3.715046 1.833922 -0.339053 -0.196152 2.154338
11.033333 -1.771333 -3.721539 2.038392 -0.333653 -0.193029 3.263011
11.066667 -1.782383 -3.727898 2.279523 -0.328306 -0.189810 4.138748
11.100000 -1.793218 -3.734214 2.560631 -0.323005 -0.186466 4.733295
11.133333 -1.803897 -3.740394 2.837952 -0.317741 -0.182957 5.023543
11.166667 -1.814362 -3.746537 3.082747 -0.312501 -0.179246 5.033168
11.200000 -1.824667 -3.752542 -2.990684 -0.307276 -0.175294 4.818142
11.233333 -1.834817 -3.758378 -2.846138 -0.302046 -0.171093 4.432041
11.266667 -1.844804 -3.764077 -2.715183 -0.296807 -0.166641 3.935162
11.300000 -1.854625 -3.769636 -2.613036 -0.291552 -0.161959 3.380689
11.333333 -1.864280 -3.775057 -2.563245 -0.286272 -0.157072 2.815413
11.366667 -1.873764 -3.780276 -2.496029 -0.280934 -0.152016 2.267177
11.400000 -1.883069 -3.785281 -2.439338 -0.275506 -0.146830 1.740561
11.433333 -1.892180 -3.790058 -2.385362 -0.269952 -0.141536 1.235531
11.466667 -1.901082 -3.794595 -2.335989 -0.264237 -0.136154 0.737615
11.500000 -1.909811 -3.798992 -2.315435 -0.258315 -0.130680 0.224199
11.533333 -1.918365 -3.803250 -2.272117 -0.252164 -0.125123 -0.331895
11.566667 -1.926744 -3.807369 -2.303373 -0.245788 -0.119503 -0.951648
11.600000 -1.934948 -3.811349 -2.327107 -0.239177 -0.113822 -1.651519
11.633333 -1.942974 -3.815191 -2.380993 -0.232343 -0.108097 -2.434695
11.666667 -1.950679 -3.818746 -2.452029 -0.225305 -0.102339 -3.282954
11.700000 -1.958050 -3.822014 -2.536984 -0.218120 -0.096597 -4.161130
11.733333 -1.965242 -3.825144 -2.628784 -0.210837 -0.090905 -5.029118
11.766667 -1.972085 -3.827992 -2.789550 -0.203490 -0.085300 -5.840694
11.800000 -1.978750 -3.830705 -3.038803 -0.196135 -0.079825 -6.542004
11.833333 -1.985073 -3.833143 2.908636 -0.188817 -0.074525 -7.076614
11.866667 -1.991217 -3.835448 2.612131 -0.181548 -0.069424 -7.411980
11.900000 -1.997182 -3.837621 2.248993 -0.174294 -0.064508 -7.528186
11.933333 -2.002771 -3.839643 1.897196 -0.167033 -0.059761 -7.411475
11.966667 -2.008182 -3.841537 1.551387 -0.159744 -0.055154 -7.068503
12.000000 -2.013417 -3.843302 1.256472 -0.152408 -0.050658 -6.524637
12.033333 -2.018476 -3.844942 1.036907 -0.145003 -0.046228 -5.835344
12.066667 -2.023360 -3.846458 0.867580 -0.137535 -0.041838 -5.042665
12.100000 -2.027906 -3.847805 0.749890 -0.130057 -0.037486 -4.199429
12.133333 -2.032124 -3.848984 0.639266 -0.122598 -0.033167 -3.358243
12.166667 -2.036027 -3.849998 0.611598 -0.115198 -0.028891 -2.567006
12.200000 -2.039626 -3.850848 0.556515 -0.107911 -0.024671 -1.856087
12.233333 -2.042934 -3.851539 0.519426 -0.100800 -0.020535 -1.234651
12.266667 -2.046076 -3.852115 0.517507 -0.093925 -0.016508 -0.712883
12.300000 -2.049054 -3.852578 0.509841 -0.087307 -0.012609 -0.286839
12.333333 -2.051780 -3.852896 0.515858 -0.080971 -0.008855 0.052219
12.366667 -2.054346 -3.853106 0.538757 -0.074917 -0.005261 0.323784
12.400000 -2.056683 -3.853185 0.571662 -0.069121 -0.001829 0.537412
12.433333 -2.058865 -3.853158 0.606736 -0.063545 0.001443 0.704473
12.466667 -2.060838 -3.853018 0.642101 -0.058158 0.004556 0.834882
12.500000 -2.062662 -3.852776 0.672870 -0.052947 0.007511 0.940335
12.533333 -2.064338 -3.852436 0.716591 -0.047893 0.010314 1.032981
12.566667 -2.065831 -3.852005 0.746363 -0.042999 0.012974 1.129904
12.600000 -2.067148 -3.851489 0.785284 -0.038266 0.015503 1.256093
12.633333 -2.068296 -3.850897 0.804395 -0.033706 0.017907 1.433965
