t x y theta dxdt dydt dthetadt
0.000000 0.000000 0.000000 1.519978 0.098252 -0.110500 -0.203819
0.033333 0.003298 -0.003740 1.526599 0.099850 -0.115365 -0.322154
0.066667 0.006638 -0.007645 1.536945 0.101455 -0.120327 -0.481820
0.100000 0.010038 -0.011716 1.527270 0.103066 -0.125388 -0.688088
0.133333 0.013500 -0.015957 1.512568 0.104674 -0.130547 -0.947610
0.166667 0.017022 -0.020373 1.497335 0.106274 -0.135801 -1.262930
0.200000 0.020606 -0.024967 1.451898 0.107861 -0.141149 -1.626849
0.233333 0.024230 -0.029738 1.407917 0.109433 -0.146590 -2.025911
0.266667 0.027911 -0.034696 1.372183 0.110987 -0.152122 -2.448963
0.300000 0.031650 -0.039843 1.282141 0.112520 -0.157744 -2.870986
0.333333 0.035426 -0.045174 1.152145 0.114037 -0.163457 -3.259444
0.366667 0.039257 -0.050700 1.014297 0.115542 -0.169265 -3.583418
0.400000 0.043143 -0.056425 0.899971 0.117039 -0.175168 -3.822486
0.433333 0.047064 -0.062339 0.732294 0.118532 -0.181166 -3.959052
0.466667 0.051040 -0.068457 0.545985 0.120024 -0.187260 -3.976939
0.500000 0.055051 -0.074768 0.349619 0.121516 -0.193446 -3.868131
0.533333 0.059117 -0.081291 0.149891 0.123004 -0.199718 -3.621923
0.566667 0.063238 -0.088028 -0.005286 0.124478 -0.206065 -3.234143
0.600000 0.067415 -0.094986 -0.114080 0.125930 -0.212477 -2.693108
0.633333 0.071648 -0.102166 -0.175149 0.127347 -0.218940 -2.009252
0.666667 0.075935 -0.109571 -0.222500 0.128717 -0.225441 -1.203902
0.700000 0.080276 -0.117203 -0.266363 0.130024 -0.231963 -0.323101
0.733333 0.084645 -0.125039 -0.317347 0.131261 -0.238499 0.557839
0.766667 0.089065 -0.133104 -0.351776 0.132424 -0.245043 1.367825
0.800000 0.093532 -0.141398 -0.365423 0.133509 -0.251597 2.033082
0.833333 0.098024 -0.149902 -0.249647 0.134522 -0.258164 2.498643
0.866667 0.102541 -0.158614 0.015989 0.135468 -0.264749 2.714675
0.900000 0.107081 -0.167538 0.279974 0.136358 -0.271365 2.668551
0.933333 0.111643 -0.176674 0.592347 0.137201 -0.278022 2.376546
0.966667 0.116226 -0.186023 0.783770 0.138008 -0.284727 1.872787
1.000000 0.120842 -0.195608 0.898864 0.138787 -0.291489 1.199018
1.033333 0.125477 -0.205409 0.897814 0.139549 -0.298316 0.422576
1.066667 0.130142 -0.215449 0.791164 0.140299 -0.305211 -0.359718
1.100000 0.134839 -0.225733 0.647953 0.141040 -0.312175 -1.068995
1.133333 0.139566 -0.236262 0.528002 0.141771 -0.319203 -1.636509
1.166667 0.144306 -0.247009 0.355907 0.142489 -0.326285 -2.019730
1.200000 0.149059 -0.257973 0.175775 0.143191 -0.333416 -2.200059
1.233333 0.153841 -0.269187 0.061724 0.143867 -0.340582 -2.203119
1.266667 0.158652 -0.280650 -0.007298 0.144510 -0.347774 -2.092399
1.300000 0.163491 -0.292363 -0.043083 0.145114 -0.354980 -1.937431
1.333333 0.168356 -0.304325 -0.060823 0.145671 -0.362191 -1.801960
1.366667 0.173244 -0.316536 -0.082085 0.146174 -0.369397 -1.740802
1.400000 0.178136 -0.328966 -0.080841 0.146613 -0.376587 -1.785474
1.433333 0.183046 -0.341642 -0.076527 0.146984 -0.383749 -1.933998
1.466667 0.187970 -0.354561 -0.078642 0.147279 -0.390877 -2.168630
1.500000 0.192905 -0.367723 -0.086018 0.147498 -0.397963 -2.456804
1.533333 0.197847 -0.381124 -0.202318 0.147636 -0.405001 -2.756481
1.566667 0.202792 -0.394766 -0.376391 0.147696 -0.411986 -3.016787
1.600000 0.207732 -0.408624 -0.545737 0.147679 -0.418916 -3.189551
1.633333 0.212666 -0.422698 -0.742826 0.147586 -0.425790 -3.237028
1.666667 0.217599 -0.437021 -0.908426 0.147420 -0.432608 -3.122726
1.700000 0.222523 -0.451557 -1.030834 0.147182 -0.439371 -2.819572
1.733333 0.227443 -0.466350 -1.147301 0.146875 -0.446087 -2.333072
1.766667 0.232349 -0.481354 -1.219090 0.146500 -0.452771 -1.695817
1.800000 0.237241 -0.496569 -1.316796 0.146058 -0.459441 -0.949435
1.833333 0.242117 -0.511994 -1.403545 0.145550 -0.466114 -0.145875
1.866667 0.246974 -0.527627 -1.428903 0.144976 -0.472817 0.655171
1.900000 0.251812 -0.543467 -1.359519 0.144335 -0.479587 1.390477
1.933333 0.256625 -0.559572 -1.250050 0.143628 -0.486455 2.017754
1.966667 0.261414 -0.575880 -1.086402 0.142857 -0.493441 2.505270
2.000000 0.266179 -0.592390 -0.904951 0.142024 -0.500548 2.822981
2.033333 0.270919 -0.609101 -0.699906 0.141131 -0.507796 2.943636
2.066667 0.275623 -0.626089 -0.552737 0.140181 -0.515188 2.863953
2.100000 0.280290 -0.643360 -0.427513 0.139178 -0.522701 2.602103
2.133333 0.284919 -0.660920 -0.349451 0.138124 -0.530311 2.183650
2.166667 0.289516 -0.678672 -0.261995 0.137024 -0.537999 1.652639
2.200000 0.294074 -0.696722 -0.213968 0.135878 -0.545746 1.057784
2.233333 0.298591 -0.715077 -0.169014 0.134692 -0.553498 0.455684
2.266667 0.303066 -0.733741 -0.130691 0.133467 -0.561185 -0.120179
2.300000 0.307502 -0.752587 -0.197253 0.132206 -0.568780 -0.647043
2.333333 0.311900 -0.771611 -0.303602 0.130909 -0.576265 -1.110570
2.366667 0.316250 -0.790961 -0.437910 0.129575 -0.583610 -1.504251
2.400000 0.320554 -0.810641 -0.530391 0.128206 -0.590789 -1.821568
2.433333 0.324813 -0.830489 -0.563436 0.126800 -0.597809 -2.062663
2.466667 0.329022 -0.850675 -0.584533 0.125356 -0.604690 -2.222430
2.500000 0.333184 -0.871020 -0.625978 0.123873 -0.611431 -2.311943
2.533333 0.337298 -0.891522 -0.744734 0.122352 -0.618021 -2.345659
2.566667 0.341362 -0.912176 -0.873513 0.120793 -0.624477 -2.345613
2.600000 0.345375 -0.932978 -0.986084 0.119195 -0.630851 -2.333056
2.633333 0.349330 -0.954128 -1.071629 0.117558 -0.637166 -2.325232
2.666667 0.353227 -0.975630 -1.133076 0.115882 -0.643470 -2.334868
2.700000 0.357068 -0.997266 -1.216863 0.114167 -0.649783 -2.358302
2.733333 0.360853 -1.019031 -1.276913 0.112414 -0.656105 -2.389942
2.766667 0.364580 -1.040920 -1.319764 0.110624 -0.662440 -2.414840
2.800000 0.368249 -1.062929 -1.341726 0.108798 -0.668757 -2.422524
2.833333 0.371854 -1.085292 -1.395760 0.106937 -0.675037 -2.398523
2.866667 0.375393 -1.108004 -1.499040 0.105043 -0.681226 -2.329931
2.900000 0.378870 -1.130818 -1.662286 0.103117 -0.687289 -2.208940
2.933333 0.382281 -1.153965 -1.798245 0.101158 -0.693204 -2.026775
2.966667 0.385627 -1.177203 -1.936571 0.099168 -0.698913 -1.780223
3.000000 0.388904 -1.200754 -2.001587 0.097145 -0.704338 -1.468969
3.033333 0.392115 -1.224383 -2.047628 0.095089 -0.709421 -1.102281
3.066667 0.395258 -1.248084 -2.054525 0.092997 -0.714155 -0.700535
3.100000 0.398331 -1.272059 -2.037456 0.090865 -0.718522 -0.286898
3.133333 0.401333 -1.296290 -2.012949 0.088687 -0.722506 0.110304
3.166667 0.404264 -1.320574 -1.989103 0.086456 -0.726110 0.463366
3.200000 0.407122 -1.344902 -1.943778 0.084167 -0.729374 0.752940
3.233333 0.409907 -1.369268 -1.925236 0.081812 -0.732320 0.969436
3.266667 0.412610 -1.393810 -1.865086 0.079387 -0.734920 1.108963
3.300000 0.415238 -1.418375 -1.810540 0.076884 -0.737167 1.173377
3.333333 0.417778 -1.443070 -1.755437 0.074303 -0.739061 1.170129
3.366667 0.420240 -1.467775 -1.704180 0.071643 -0.740602 1.107962
3.400000 0.422606 -1.492569 -1.654785 0.068909 -0.741769 0.997341
3.433333 0.424872 -1.517431 -1.589897 0.066104 -0.742528 0.838339
3.466667 0.427032 -1.542336 -1.566233 0.063230 -0.742862 0.646716
3.500000 0.429112 -1.567218 -1.549038 0.060294 -0.742742 0.433270
3.533333 0.431078 -1.592100 -1.542110 0.057294 -0.742130 0.212539
3.566667 0.432964 -1.616944 -1.521936 0.054228 -0.740986 -0.004601
3.600000 0.434725 -1.641731 -1.544492 0.051088 -0.739279 -0.209691
3.633333 0.436358 -1.666437 -1.553830 0.047868 -0.736991 -0.392488
3.666667 0.437908 -1.691082 -1.607098 0.044564 -0.734101 -0.554328
3.700000 0.439375 -1.715658 -1.657116 0.041174 -0.730611 -0.690409
3.733333 0.440759 -1.740159 -1.679054 0.037699 -0.726523 -0.807480
3.766667 0.442001 -1.764485 -1.707308 0.034145 -0.721848 -0.901648
3.800000 0.443101 -1.788610 -1.716243 0.030520 -0.716606 -0.977790
3.833333 0.444057 -1.812511 -1.745042 0.026840 -0.710843 -1.027643
3.866667 0.444869 -1.836163 -1.779586 0.023126 -0.704615 -1.049516
3.900000 0.445596 -1.859702 -1.824766 0.019392 -0.697949 -1.044498
3.933333 0.446179 -1.882949 -1.850098 0.015661 -0.690909 -1.001160
3.966667 0.446617 -1.905888 -1.924441 0.011956 -0.683556 -0.917310
4.000000 0.446911 -1.928501 -1.976226 0.008300 -0.675977 -0.787060
4.033333 0.447121 -1.950976 -1.996727 0.004706 -0.668220 -0.620508
4.066667 0.447189 -1.973097 -2.074237 0.001188 -0.660351 -0.419917
4.100000 0.447174 -1.995068 -2.085185 -0.002236 -0.652457 -0.195348
4.133333 0.447018 -2.016665 -2.086867 -0.005562 -0.644574 0.039203
4.166667 0.446780 -2.038101 -2.053395 -0.008793 -0.636702 0.261940
4.200000 0.446404 -2.059145 -2.032079 -0.011938 -0.628815 0.458509
4.233333 0.445891 -2.079792 -1.985278 -0.015000 -0.620901 0.620637
4.266667 0.445298 -2.100263 -1.943151 -0.017993 -0.612907 0.735517
4.300000 0.444628 -2.120555 -1.891232 -0.020927 -0.604780 0.801089
4.333333 0.443882 -2.140662 -1.855057 -0.023814 -0.596481 0.815662
4.366667 0.443059 -2.160580 -1.807196 -0.026651 -0.588023 0.789217
4.400000 0.442161 -2.180305 -1.801623 -0.029442 -0.579396 0.729114
4.433333 0.441144 -2.199612 -1.778874 -0.032191 -0.570593 0.643017
4.466667 0.440011 -2.218502 -1.758006 -0.034895 -0.561640 0.543286
4.500000 0.438767 -2.236975 -1.750868 -0.037547 -0.552581 0.439657
4.533333 0.437453 -2.255240 -1.733122 -0.040138 -0.543464 0.339786
4.566667 0.436036 -2.273091 -1.711159 -0.042660 -0.534320 0.248566
4.600000 0.434550 -2.290728 -1.712414 -0.045101 -0.525200 0.166710
4.633333 0.432970 -2.307956 -1.709783 -0.047449 -0.516167 0.095993
4.666667 0.431324 -2.324964 -1.716268 -0.049699 -0.507245 0.037019
4.700000 0.429614 -2.341751 -1.727581 -0.051853 -0.498422 -0.011364
4.733333 0.427842 -2.358314 -1.728766 -0.053914 -0.489679 -0.050304
4.766667 0.425993 -2.374482 -1.732092 -0.055885 -0.480990 -0.079779
4.800000 0.424085 -2.390421 -1.732751 -0.057770 -0.472330 -0.100025
4.833333 0.422109 -2.405974 -1.741062 -0.059574 -0.463650 -0.111215
4.866667 0.420076 -2.421296 -1.739316 -0.061299 -0.454920 -0.118117
4.900000 0.417985 -2.436241 -1.750639 -0.062943 -0.446147 -0.121494
4.933333 0.415839 -2.450951 -1.753282 -0.064508 -0.437354 -0.122204
4.966667 0.413642 -2.465427 -1.756685 -0.065996 -0.428563 -0.122012
5.000000 0.411393 -2.479666 -1.755569 -0.067412 -0.419794 -0.121523
5.033333 0.409103 -2.493548 -1.762336 -0.068762 -0.411081 -0.122127
5.066667 0.406775 -2.507078 -1.766610 -0.070049 -0.402465 -0.118615
5.100000 0.404413 -2.520261 -1.777098 -0.071278 -0.393956 -0.113063
5.133333 0.402007 -2.533205 -1.776602 -0.072452 -0.385553 -0.105821
5.166667 0.399574 -2.545812 -1.772960 -0.073573 -0.377266 -0.096729
5.200000 0.397099 -2.558180 -1.791726 -0.074638 -0.369098 -0.084305
5.233333 0.394585 -2.570309 -1.787662 -0.075645 -0.361038 -0.069835
5.266667 0.392033 -2.582199 -1.790765 -0.076588 -0.353064 -0.057419
5.300000 0.389444 -2.593850 -1.796392 -0.077462 -0.345153 -0.045457
5.333333 0.386821 -2.605262 -1.798835 -0.078263 -0.337281 -0.033140
5.366667 0.384164 -2.616437 -1.792350 -0.078981 -0.329411 -0.022711
5.400000 0.381497 -2.627308 -1.782728 -0.079615 -0.321521 -0.017722
5.433333 0.378821 -2.637880 -1.791921 -0.080161 -0.313598 -0.016653
5.466667 0.376116 -2.648215 -1.793438 -0.080619 -0.305643 -0.018310
5.500000 0.373406 -2.658261 -1.785170 -0.080993 -0.297671 -0.025071
5.533333 0.370692 -2.668022 -1.794423 -0.081293 -0.289708 -0.037108
5.566667 0.367954 -2.677550 -1.791244 -0.081532 -0.281788 -0.051563
5.600000 0.365215 -2.686801 -1.795233 -0.081723 -0.273940 -0.064141
5.633333 0.362476 -2.695781 -1.794469 -0.081880 -0.266189 -0.075428
5.666667 0.359739 -2.704495 -1.790753 -0.082017 -0.258560 -0.085677
5.700000 0.357004 -2.712947 -1.799729 -0.082140 -0.251066 -0.090882
5.733333 0.354275 -2.721142 -1.810144 -0.082251 -0.243713 -0.091742
5.766667 0.351552 -2.729086 -1.816101 -0.082350 -0.236506 -0.088603
5.800000 0.348816 -2.736805 -1.818966 -0.082430 -0.229443 -0.083421
5.833333 0.346067 -2.744303 -1.827755 -0.082481 -0.222521 -0.075424
5.866667 0.343306 -2.751582 -1.824723 -0.082491 -0.215732 -0.064062
5.900000 0.340536 -2.758642 -1.822818 -0.082452 -0.209067 -0.052234
5.933333 0.337757 -2.765487 -1.824849 -0.082358 -0.202515 -0.039610
5.966667 0.334971 -2.772118 -1.823747 -0.082201 -0.196065 -0.028375
6.000000 0.332204 -2.778531 -1.824885 -0.081978 -0.189708 -0.018931
6.033333 0.329456 -2.784729 -1.826302 -0.081695 -0.183439 -0.011741
6.066667 0.326729 -2.790717 -1.826672 -0.081354 -0.177259 -0.006916
6.100000 0.324024 -2.796500 -1.823898 -0.080963 -0.171170 -0.003443
6.133333 0.321341 -2.802082 -1.826251 -0.080527 -0.165177 -0.002170
6.166667 0.318682 -2.807468 -1.828357 -0.080057 -0.159287 -0.000967
6.200000 0.316024 -2.812655 -1.827077 -0.079562 -0.153502 0.000902
6.233333 0.313368 -2.817648 -1.827784 -0.079047 -0.147823 0.002763
6.266667 0.310716 -2.822447 -1.818057 -0.078518 -0.142250 0.003998
6.300000 0.308091 -2.827067 -1.824431 -0.077974 -0.136782 0.004706
6.333333 0.305493 -2.831511 -1.831333 -0.077417 -0.131415 0.005174
6.366667 0.302923 -2.835785 -1.825279 -0.076842 -0.126150 0.004658
6.400000 0.300382 -2.839891 -1.825637 -0.076248 -0.120982 0.003674
6.433333 0.297849 -2.843818 -1.823472 -0.075637 -0.115911 0.001405
6.466667 0.295346 -2.847586 -1.822535 -0.075010 -0.110935 -0.000110
