t x y theta dxdt dydt dthetadt
0.000000 0.000000 0.000000 0.232699 0.041907 0.003765 0.007319
0.033333 0.001430 0.000135 0.233846 0.046603 0.005493 0.009424
0.066667 0.003000 0.000320 0.224425 0.051479 0.007300 0.012217
0.100000 0.004716 0.000556 0.235490 0.056589 0.009210 0.011085
0.133333 0.006585 0.000848 0.231179 0.061970 0.011242 0.008246
0.166667 0.008690 0.001234 0.236051 0.067636 0.013403 0.005741
0.200000 0.010960 0.001681 0.228803 0.073599 0.015697 0.003746
0.233333 0.013403 0.002191 0.250409 0.079868 0.018130 0.000038
0.266667 0.016099 0.002803 0.233587 0.086433 0.020697 -0.004643
0.300000 0.019054 0.003520 0.230636 0.093260 0.023380 -0.006919
0.333333 0.022202 0.004310 0.229982 0.100321 0.026166 -0.008602
0.366667 0.025621 0.005210 0.231147 0.107601 0.029048 -0.009572
0.400000 0.029315 0.006223 0.234269 0.115085 0.032017 -0.011298
0.433333 0.033291 0.007351 0.229590 0.122749 0.035061 -0.009696
0.466667 0.037492 0.008565 0.230141 0.130582 0.038177 -0.008253
0.500000 0.041926 0.009868 0.233222 0.138591 0.041366 -0.006477
0.533333 0.046602 0.011264 0.230149 0.146781 0.044632 -0.004653
0.566667 0.051582 0.012785 0.228944 0.155160 0.047978 -0.003876
0.600000 0.056873 0.014434 0.238121 0.163733 0.051408 -0.002877
0.633333 0.062431 0.016186 0.223918 0.172518 0.054929 -0.002123
0.666667 0.068263 0.018046 0.230070 0.181524 0.058543 -0.000104
0.700000 0.074381 0.020016 0.236389 0.190753 0.062252 0.001863
0.733333 0.080832 0.022125 0.230597 0.200206 0.066056 0.003568
0.766667 0.087622 0.024375 0.229299 0.209882 0.069954 0.005194
0.800000 0.094756 0.026770 0.227446 0.219783 0.073949 0.007915
0.833333 0.102212 0.029291 0.229698 0.229906 0.078042 0.007455
0.866667 0.109999 0.031942 0.231935 0.240249 0.082234 0.005647
0.900000 0.118127 0.034728 0.229693 0.250808 0.086526 0.003907
0.933333 0.126606 0.037654 0.232092 0.261585 0.090921 0.002646
0.966667 0.135446 0.040724 0.241857 0.272582 0.095425 0.001527
1.000000 0.144664 0.043953 0.235333 0.283807 0.100039 -0.001181
1.033333 0.154262 0.047334 0.235433 0.295270 0.104767 -0.001893
1.066667 0.164248 0.050879 0.230943 0.306982 0.109613 -0.001530
1.100000 0.174627 0.054589 0.224595 0.318947 0.114576 -0.001613
1.133333 0.185403 0.058469 0.232214 0.331167 0.119655 -0.003283
1.166667 0.196582 0.062519 0.227679 0.343641 0.124846 -0.003367
1.200000 0.208168 0.066742 0.228985 0.356359 0.130142 -0.002445
1.233333 0.220199 0.071146 0.232119 0.369301 0.135535 -0.002064
1.266667 0.232647 0.075726 0.236757 0.382457 0.141021 -0.002610
1.300000 0.245564 0.080497 0.233390 0.395818 0.146597 -0.003296
1.333333 0.258960 0.085462 0.231837 0.409373 0.152258 -0.002291
1.366667 0.272848 0.090627 0.237420 0.423106 0.158002 -0.003695
1.400000 0.287169 0.095978 0.232671 0.437005 0.163825 -0.006527
1.433333 0.301927 0.101516 0.225046 0.451069 0.169730 -0.015664
1.466667 0.317125 0.107243 0.222154 0.465278 0.175709 -0.038103
1.500000 0.332862 0.113191 0.234487 0.479610 0.181755 -0.079439
1.533333 0.349046 0.119332 0.229304 0.494053 0.187863 -0.144986
1.566667 0.365681 0.125666 0.231604 0.508607 0.194030 -0.237782
1.600000 0.382891 0.132237 0.232042 0.523258 0.200253 -0.362400
1.633333 0.400558 0.139005 0.230196 0.537992 0.206524 -0.511393
1.666667 0.418683 0.145971 0.227326 0.552804 0.212841 -0.674005
1.700000 0.437421 0.153190 0.230606 0.567709 0.219208 -0.842555
1.733333 0.456623 0.160610 0.219672 0.582733 0.225638 -1.010080
1.766667 0.476291 0.168231 0.146368 0.597898 0.232138 -1.164768
1.800000 0.496426 0.176056 0.051370 0.613264 0.238734 -1.292319
1.833333 0.517032 0.184086 0.000878 0.628893 0.245448 -1.387348
1.866667 0.538109 0.192320 -0.060180 0.644844 0.252306 -1.445758
1.900000 0.559865 0.200839 -0.115827 0.661159 0.259323 -1.463141
1.933333 0.582095 0.209564 -0.176131 0.677860 0.266509 -1.435733
1.966667 0.604800 0.218497 -0.219146 0.694948 0.273865 -1.370549
2.000000 0.627980 0.227637 -0.272960 0.712394 0.281379 -1.277519
2.033333 0.651868 0.237078 -0.304674 0.730147 0.289032 -1.165903
2.066667 0.676465 0.246820 -0.342483 0.748161 0.296806 -1.043679
2.100000 0.701775 0.256868 -0.387639 0.766367 0.304676 -0.916909
2.133333 0.727798 0.267222 -0.426335 0.784656 0.312597 -0.792383
2.166667 0.754296 0.277784 -0.428857 0.802959 0.320540 -0.672326
2.200000 0.781268 0.288554 -0.450549 0.821208 0.328479 -0.559806
2.233333 0.808955 0.299635 -0.460439 0.839350 0.336393 -0.454278
2.266667 0.837357 0.311028 -0.473477 0.857311 0.344249 -0.356027
2.300000 0.866226 0.322627 -0.486421 0.875080 0.352042 -0.268326
2.333333 0.895808 0.334539 -0.486038 0.892706 0.359794 -0.192428
2.366667 0.925852 0.346654 -0.491770 0.910217 0.367516 -0.125711
2.400000 0.956607 0.359083 -0.495636 0.927599 0.375202 -0.063962
2.433333 0.987816 0.371714 -0.487040 0.944859 0.382853 -0.005921
2.466667 1.019478 0.384543 -0.485784 0.962067 0.390501 0.047677
2.500000 1.051838 0.397686 -0.483041 0.979230 0.398148 0.099291
2.533333 1.084891 0.411138 -0.489447 0.996332 0.405788 0.149356
2.566667 1.118383 0.424785 -0.488792 1.013356 0.413413 0.195239
2.600000 1.152308 0.438624 -0.476738 1.030370 0.421052 0.233089
2.633333 1.186914 0.452771 -0.467214 1.047397 0.428717 0.261528
2.666667 1.222189 0.467222 -0.449218 1.064382 0.436383 0.280018
2.700000 1.258128 0.481975 -0.443048 1.081293 0.444031 0.287037
2.733333 1.294477 0.496911 -0.419954 1.098117 0.451658 0.282563
2.766667 1.331230 0.512025 -0.401165 1.114842 0.459254 0.267523
2.800000 1.368616 0.527430 -0.392452 1.131394 0.466784 0.244928
2.833333 1.406622 0.543120 -0.369045 1.147735 0.474230 0.214611
2.866667 1.445239 0.559091 -0.374939 1.163888 0.481603 0.180751
2.900000 1.484466 0.575343 -0.387352 1.179874 0.488913 0.145265
2.933333 1.524295 0.591872 -0.382880 1.195655 0.496142 0.111748
2.966667 1.564479 0.608559 -0.380038 1.211180 0.503264 0.084582
3.000000 1.605011 0.625399 -0.378681 1.226419 0.510265 0.064109
3.033333 1.646112 0.642503 -0.371914 1.241323 0.517119 0.054346
3.066667 1.687760 0.659860 -0.365665 1.255821 0.523791 0.052406
3.100000 1.729935 0.677462 -0.373803 1.269842 0.530247 0.058701
3.133333 1.772626 0.695304 -0.371085 1.283366 0.536476 0.070525
3.166667 1.815816 0.713379 -0.373228 1.296388 0.542476 0.082301
3.200000 1.859495 0.731683 -0.369719 1.308891 0.548241 0.093673
3.233333 1.903643 0.750206 -0.378575 1.320864 0.553767 0.101884
3.266667 1.948056 0.768844 -0.365195 1.332314 0.559057 0.106524
3.300000 1.992720 0.787591 -0.350543 1.343261 0.564125 0.104127
3.333333 2.037624 0.806442 -0.349483 1.353721 0.568977 0.094858
3.366667 2.082914 0.825476 -0.338937 1.363713 0.573625 0.080114
3.400000 2.128570 0.844682 -0.331887 1.373263 0.578082 0.058938
3.433333 2.174578 0.864056 -0.328569 1.382396 0.582359 0.031365
3.466667 2.220917 0.883586 -0.323647 1.391102 0.586449 -0.002916
3.500000 2.267557 0.903260 -0.342189 1.399341 0.590332 -0.038523
3.533333 2.314485 0.923072 -0.337525 1.407060 0.593978 -0.075207
3.566667 2.361691 0.943016 -0.346377 1.414200 0.597360 -0.109219
3.600000 2.409138 0.963076 -0.345704 1.420705 0.600446 -0.139628
3.633333 2.456808 0.983245 -0.353300 1.426519 0.603204 -0.165720
3.666667 2.504587 1.003454 -0.354755 1.431614 0.605621 -0.183547
3.700000 2.552540 1.023749 -0.372047 1.435983 0.607692 -0.194774
3.733333 2.600642 1.044118 -0.373897 1.439630 0.609415 -0.199074
3.766667 2.648867 1.064549 -0.373897 1.442563 0.610787 -0.199486
3.800000 2.697143 1.084993 -0.398946 1.444794 0.611815 -0.194237
3.833333 2.745488 1.105475 -0.408856 1.446340 0.612510 -0.181601
3.866667 2.793874 1.125983 -0.408426 1.447212 0.612870 -0.162183
3.900000 2.842272 1.146504 -0.411574 1.447416 0.612898 -0.135602
3.933333 2.890664 1.167009 -0.418684 1.446963 0.612600 -0.099139
3.966667 2.939036 1.187489 -0.424351 1.445872 0.611987 -0.051436
4.000000 2.987342 1.207948 -0.425653 1.444162 0.611063 0.006433
4.033333 3.035599 1.228368 -0.423427 1.441835 0.609830 0.071606
4.066667 3.083793 1.248743 -0.427308 1.438893 0.608294 0.142122
4.100000 3.131835 1.269056 -0.424525 1.435345 0.606462 0.214094
4.133333 3.179691 1.289292 -0.434967 1.431184 0.604333 0.282545
4.166667 3.227441 1.309461 -0.416980 1.426377 0.601896 0.345410
4.200000 3.275071 1.329555 -0.393531 1.420905 0.599147 0.398009
4.233333 3.322448 1.349540 -0.361720 1.414762 0.596085 0.437419
4.266667 3.369678 1.369436 -0.336025 1.407926 0.592697 0.458811
4.300000 3.416745 1.389234 -0.325526 1.400379 0.588977 0.463598
4.333333 3.463482 1.408886 -0.302728 1.392117 0.584919 0.450405
4.366667 3.509871 1.428381 -0.280962 1.383181 0.580536 0.416835
4.400000 3.556058 1.447759 -0.262510 1.373604 0.575835 0.365541
4.433333 3.601850 1.466956 -0.255969 1.363411 0.570823 0.300116
4.466667 3.647215 1.485955 -0.258496 1.352660 0.565516 0.228398
4.500000 3.692140 1.504749 -0.235727 1.341416 0.559931 0.149371
4.533333 3.736813 1.523398 -0.234850 1.329724 0.554078 0.067713
4.566667 3.780999 1.541816 -0.226933 1.317604 0.547961 -0.012540
4.600000 3.824683 1.559991 -0.237540 1.305096 0.541592 -0.086802
4.633333 3.868081 1.578002 -0.237536 1.292251 0.534988 -0.154730
4.666667 3.910931 1.595743 -0.248201 1.279107 0.528167 -0.217960
4.700000 3.953473 1.613308 -0.261808 1.265639 0.521118 -0.270427
4.733333 3.995698 1.630691 -0.280757 1.251834 0.513836 -0.310102
4.766667 4.037304 1.647762 -0.298425 1.237650 0.506300 -0.333713
4.800000 4.078263 1.664504 -0.301854 1.222996 0.498470 -0.344901
4.833333 4.118877 1.681047 -0.316004 1.207740 0.490286 -0.342546
4.866667 4.158807 1.697237 -0.333839 1.191757 0.481690 -0.327560
4.900000 4.198374 1.713217 -0.353013 1.175001 0.472661 -0.303803
4.933333 4.237568 1.728982 -0.360829 1.157463 0.463197 -0.276193
4.966667 4.276382 1.744527 -0.381225 1.139173 0.453315 -0.249663
5.000000 4.314440 1.759671 -0.377026 1.120191 0.443046 -0.225696
5.033333 4.351717 1.774402 -0.381198 1.100676 0.432470 -0.206306
5.066667 4.388207 1.788712 -0.379762 1.080821 0.421684 -0.196608
5.100000 4.423887 1.802590 -0.376958 1.060822 0.410786 -0.201169
5.133333 4.458758 1.816035 -0.381122 1.040876 0.399873 -0.222629
5.166667 4.492813 1.829040 -0.398402 1.021170 0.389041 -0.262309
5.200000 4.526042 1.841601 -0.396569 1.001898 0.378384 -0.317636
5.233333 4.558844 1.853911 -0.406256 0.983123 0.367937 -0.385078
5.266667 4.591216 1.865965 -0.413618 0.964840 0.357699 -0.454078
5.300000 4.623153 1.877763 -0.425159 0.946974 0.347638 -0.512460
5.333333 4.654240 1.889102 -0.443046 0.929395 0.337693 -0.548299
5.366667 4.684887 1.900178 -0.457226 0.911969 0.327801 -0.555847
5.400000 4.715093 1.910990 -0.492699 0.894528 0.317883 -0.530818
5.433333 4.744856 1.921536 -0.535161 0.876973 0.307891 -0.472474
5.466667 4.774174 1.931813 -0.590471 0.859236 0.297793 -0.383274
5.500000 4.802664 1.941643 -0.626396 0.841314 0.287590 -0.269197
5.533333 4.830341 1.951034 -0.637089 0.823250 0.277298 -0.140549
5.566667 4.857220 1.959990 -0.621302 0.805099 0.266945 -0.003168
5.600000 4.883650 1.968672 -0.595449 0.786942 0.256574 0.132308
5.633333 4.909633 1.977078 -0.560913 0.768861 0.246227 0.253248
5.666667 4.934865 1.985072 -0.538441 0.750943 0.235954 0.348662
5.700000 4.959652 1.992788 -0.529790 0.733194 0.225771 0.411493
5.733333 4.983714 2.000106 -0.516790 0.715594 0.215680 0.442812
5.766667 5.007063 2.007033 -0.489444 0.698122 0.205681 0.444558
5.800000 5.029972 2.013681 -0.470926 0.680762 0.195771 0.422664
5.833333 5.052442 2.020051 -0.441172 0.663497 0.185949 0.390397
5.866667 5.074476 2.026141 -0.443692 0.646296 0.176200 0.358935
5.900000 5.095836 2.031871 -0.433633 0.629202 0.166538 0.336821
5.933333 5.116534 2.037252 -0.425967 0.612262 0.156975 0.329559
5.966667 5.136580 2.042288 -0.428869 0.595499 0.147518 0.341646
6.000000 5.155986 2.046989 -0.423832 0.578960 0.138176 0.373560
6.033333 5.174764 2.051363 -0.414578 0.562722 0.128963 0.417532
6.066667 5.193129 2.055460 -0.412747 0.546868 0.119894 0.465849
6.100000 5.211084 2.059282 -0.396426 0.531444 0.110977 0.507211
6.133333 5.228457 2.062802 -0.391556 0.516493 0.102214 0.531104
6.166667 5.245267 2.066027 -0.347267 0.502077 0.093612 0.522389
6.200000 5.261683 2.068980 -0.324354 0.488204 0.085163 0.471796
6.233333 5.277573 2.071649 -0.276263 0.474849 0.076855 0.374476
6.266667 5.293081 2.074048 -0.233057 0.461988 0.068677 0.227047
6.300000 5.308114 2.076177 -0.198308 0.449616 0.060618 0.036652
6.333333 5.322777 2.078040 -0.196656 0.437727 0.052675 -0.188520
6.366667 5.337078 2.079637 -0.214111 0.426310 0.044852 -0.430404
6.400000 5.351022 2.080970 -0.236534 0.415381 0.037164 -0.670308
6.433333 5.364597 2.082066 -0.280370 0.404946 0.029616 -0.884764
6.466667 5.377829 2.082903 -0.319390 0.395006 0.022216 -1.053465
6.500000 5.390725 2.083480 -0.370467 0.385564 0.014976 -1.164175
6.533333 5.403292 2.083800 -0.451915 0.376630 0.007907 -1.209007
6.566667 5.415597 2.083919 -0.529958 0.368219 0.001012 -1.186773
6.600000 5.427588 2.083784 -0.601267 0.360321 -0.005720 -1.101974
6.633333 5.439270 2.083398 -0.639171 0.352956 -0.012285 -0.971304
6.666667 5.450771 2.082832 -0.662549 0.346153 -0.018679 -0.807236
6.700000 5.462114 2.082091 -0.691628 0.339904 -0.024919 -0.622290
6.733333 5.473321 2.081179 -0.695063 0.334165 -0.031033 -0.431933
6.766667 5.484249 2.080023 -0.682857 0.328895 -0.037043 -0.250118
6.800000 5.494903 2.078625 -0.682954 0.324069 -0.042966 -0.088120
6.833333 5.505485 2.077065 -0.672364 0.319627 -0.048834 0.053747
6.866667 5.516011 2.075342 -0.665330 0.315493 -0.054681 0.172719
6.900000 5.526494 2.073456 -0.656991 0.311632 -0.060527 0.266204
6.933333 5.536729 2.071335 -0.639988 0.308052 -0.066372 0.339303
6.966667 5.546945 2.069046 -0.640001 0.304715 -0.072230 0.397627
7.000000 5.557151 2.066587 -0.620695 0.301565 -0.078118 0.444938
7.033333 5.567127 2.063898 -0.604016 0.298576 -0.084038 0.483288
7.066667 5.576881 2.060983 -0.591066 0.295744 -0.089987 0.513290
7.100000 5.586649 2.057888 -0.561909 0.293052 -0.095962 0.537838
7.133333 5.596204 2.054570 -0.539677 0.290467 -0.101966 0.557821
7.166667 5.605786 2.051067 -0.513106 0.288014 -0.107991 0.572669
7.200000 5.615398 2.047377 -0.492792 0.285734 -0.114021 0.583013
7.233333 5.625043 2.043497 -0.485726 0.283634 -0.120047 0.587826
7.266667 5.634498 2.039402 -0.463209 0.281687 -0.126068 0.587726
7.300000 5.643766 2.035093 -0.448370 0.279865 -0.132078 0.582864
7.333333 5.652852 2.030573 -0.427580 0.278146 -0.138073 0.570889
7.366667 5.661985 2.025859 -0.392198 0.276469 -0.144051 0.550013
7.400000 5.671168 2.020951 -0.388026 0.274793 -0.150009 0.521975
7.433333 5.680403 2.015850 -0.372435 0.273078 -0.155943 0.486178
7.466667 5.689475 2.010545 -0.344899 0.271304 -0.161844 0.442577
7.500000 5.698605 2.005046 -0.312404 0.269432 -0.167708 0.391492
7.533333 5.707579 1.999349 -0.303888 0.267423 -0.173533 0.336479
7.566667 5.716618 1.993460 -0.287725 0.265271 -0.179314 0.280107
7.600000 5.725506 1.987376 -0.288613 0.262957 -0.185049 0.222518
7.633333 5.734249 1.981100 -0.297835 0.260495 -0.190736 0.167041
7.666667 5.742848 1.974634 -0.300164 0.257916 -0.196371 0.116642
7.700000 5.751307 1.967980 -0.289228 0.255306 -0.201953 0.071978
7.733333 5.759837 1.961140 -0.289281 0.252744 -0.207481 0.032094
7.766667 5.768234 1.954118 -0.281363 0.250300 -0.212952 -0.004052
7.800000 5.776499 1.946915 -0.292392 0.248051 -0.218367 -0.037579
7.833333 5.784637 1.939534 -0.290627 0.246060 -0.223727 -0.073835
7.866667 5.792650 1.931977 -0.290957 0.244369 -0.229033 -0.114423
7.900000 5.800739 1.924241 -0.298801 0.242952 -0.234286 -0.157322
7.933333 5.808708 1.916334 -0.294638 0.241799 -0.239484 -0.203921
7.966667 5.816561 1.908259 -0.288344 0.240911 -0.244630 -0.251845
8.000000 5.824492 1.900010 -0.308800 0.240249 -0.249725 -0.301903
8.033333 5.832500 1.891587 -0.327402 0.239770 -0.254773 -0.348554
8.066667 5.840580 1.882991 -0.333461 0.239404 -0.259772 -0.391576
8.100000 5.848552 1.874238 -0.361638 0.239135 -0.264726 -0.432694
8.133333 5.856589 1.865316 -0.371749 0.238912 -0.269637 -0.470638
8.166667 5.864521 1.856242 -0.395465 0.238662 -0.274502 -0.505746
8.200000 5.872505 1.847001 -0.412729 0.238332 -0.279323 -0.538617
8.233333 5.880387 1.837614 -0.424658 0.237885 -0.284096 -0.573507
8.266667 5.888301 1.828061 -0.440318 0.237316 -0.288824 -0.620265
8.300000 5.896240 1.818344 -0.453731 0.236580 -0.293504 -0.687023
8.333333 5.904193 1.808463 -0.487096 0.235663 -0.298142 -0.786632
8.366667 5.912146 1.798420 -0.505682 0.234540 -0.302740 -0.933195
8.400000 5.920001 1.788246 -0.524823 0.233198 -0.307302 -1.134069
8.433333 5.927831 1.777910 -0.552331 0.231609 -0.311831 -1.399481
8.466667 5.935565 1.767449 -0.580837 0.229751 -0.316323 -1.719918
8.500000 5.943246 1.756827 -0.611933 0.227628 -0.320771 -2.080769
8.533333 5.950863 1.746044 -0.663117 0.225239 -0.325165 -2.456984
8.566667 5.958385 1.735147 -0.700605 0.222603 -0.329496 -2.823406
8.600000 5.965822 1.724091 -0.843702 0.219725 -0.333751 -3.151994
8.633333 5.973154 1.712877 -0.949248 0.216624 -0.337917 -3.411534
8.666667 5.980371 1.701508 -1.153794 0.213301 -0.341984 -3.576961
8.700000 5.987452 1.689987 -1.336692 0.209755 -0.345945 -3.638941
8.733333 5.994382 1.678314 -1.499035 0.206006 -0.349788 -3.592009
8.766667 6.001218 1.666547 -1.700403 0.202079 -0.353496 -3.425027
8.800000 6.007961 1.654689 -1.856543 0.198017 -0.357054 -3.141355
8.833333 6.014611 1.642744 -1.897241 0.193856 -0.360453 -2.749606
8.866667 6.021059 1.630661 -1.971789 0.189660 -0.363679 -2.262423
8.900000 6.027298 1.618444 -2.028648 0.185483 -0.366721 -1.691793
8.933333 6.033324 1.606099 -2.087718 0.181368 -0.369574 -1.042360
8.966667 6.039258 1.593683 -2.140874 0.177351 -0.372236 -0.336542
9.000000 6.044976 1.581153 -2.172474 0.173456 -0.374703 0.414163
9.033333 6.050605 1.568561 -2.170419 0.169704 -0.376967 1.205155
9.066667 6.056146 1.555908 -2.142741 0.166089 -0.379029 2.013367
9.100000 6.061600 1.543200 -2.084872 0.162595 -0.380890 2.828718
9.133333 6.066967 1.530440 -1.970098 0.159193 -0.382559 3.616415
9.166667 6.072249 1.517632 -1.835485 0.155842 -0.384042 4.355588
9.200000 6.077446 1.504781 -1.588230 0.152487 -0.385353 5.008025
9.233333 6.082469 1.491880 -1.409439 0.149083 -0.386504 5.543101
9.266667 6.087409 1.478944 -1.120830 0.145584 -0.387503 5.937882
9.300000 6.092267 1.465977 -0.905131 0.141949 -0.388355 6.171805
9.333333 6.096963 1.452982 -0.616935 0.138153 -0.389061 6.236883
9.366667 6.101497 1.439969 -0.371839 0.134182 -0.389623 6.129923
9.400000 6.105954 1.426937 -0.150290 0.130031 -0.390042 5.874136
9.433333 6.110246 1.413898 0.072927 0.125699 -0.390321 5.477908
9.466667 6.114463 1.400847 0.275552 0.121193 -0.390466 4.972450
9.500000 6.118505 1.387799 0.438166 0.116546 -0.390482 4.377835
9.533333 6.122364 1.374758 0.595585 0.111767 -0.390375 3.723844
9.566667 6.126031 1.361725 0.717619 0.106882 -0.390150 3.034926
9.600000 6.129496 1.348705 0.796984 0.101949 -0.389814 2.324401
9.633333 6.132750 1.335699 0.860960 0.097018 -0.389370 1.615467
9.666667 6.135939 1.322706 0.881325 0.092161 -0.388823 0.919229
9.700000 6.138903 1.309732 0.875282 0.087420 -0.388172 0.251396
9.733333 6.141638 1.296781 0.875866 0.082871 -0.387418 -0.376705
9.766667 6.144314 1.283852 0.843175 0.078564 -0.386558 -0.948675
9.800000 6.146744 1.270958 0.807966 0.074518 -0.385587 -1.452617
9.833333 6.149121 1.258093 0.742669 0.070719 -0.384494 -1.877865
9.866667 6.151246 1.245274 0.633930 0.067145 -0.383267 -2.214536
9.900000 6.153324 1.232492 0.519095 0.063787 -0.381897 -2.453513
9.933333 6.155357 1.219752 0.406205 0.060600 -0.380375 -2.585093
9.966667 6.157350 1.207056 0.293481 0.057539 -0.378688 -2.614164
10.000000 6.159303 1.194408 0.180691 0.054560 -0.376828 -2.542110
10.033333 6.161035 1.181844 0.059047 0.051671 -0.374794 -2.374221
10.066667 6.162735 1.169335 -0.068907 0.048867 -0.372594 -2.121444
10.100000 6.164406 1.156885 -0.127418 0.046137 -0.370228 -1.801156
10.133333 6.165898 1.144540 -0.183422 0.043498 -0.367701 -1.436152
10.166667 6.167225 1.132306 -0.218202 0.040990 -0.365027 -1.040853
10.200000 6.168400 1.120187 -0.236832 0.038681 -0.362229 -0.633111
10.233333 6.169560 1.108140 -0.245541 0.036591 -0.359320 -0.235175
10.266667 6.170709 1.096167 -0.232923 0.034750 -0.356303 0.131476
10.300000 6.171762 1.084325 -0.219085 0.033198 -0.353196 0.457219
10.333333 6.172740 1.072618 -0.197800 0.031960 -0.350011 0.734598
10.366667 6.173717 1.060994 -0.145186 0.031033 -0.346752 0.953422
10.400000 6.174698 1.049456 -0.091151 0.030384 -0.343415 1.108587
10.433333 6.175641 1.038056 -0.030330 0.030005 -0.340008 1.201078
10.466667 6.176595 1.026748 0.019696 0.029891 -0.336539 1.238136
10.500000 6.177535 1.015577 0.090800 0.030021 -0.333009 1.220834
10.533333 6.178494 1.004504 0.146882 0.030373 -0.329422 1.152948
10.566667 6.179463 0.993571 0.189192 0.030935 -0.325784 1.045227
10.600000 6.180454 0.982783 0.217936 0.031707 -0.322108 0.907069
10.633333 6.181475 0.972098 0.248827 0.032689 -0.318391 0.747841
10.666667 6.182545 0.961565 0.267198 0.033882 -0.314632 0.576589
10.700000 6.183652 0.951140 0.282730 0.035289 -0.310826 0.404187
10.733333 6.184800 0.940824 0.290862 0.036932 -0.306965 0.240353
10.766667 6.185993 0.930620 0.291266 0.038850 -0.303023 0.090038
10.800000 6.187300 0.920592 0.278479 0.041086 -0.298966 -0.038390
10.833333 6.188659 0.910678 0.277206 0.043668 -0.294777 -0.140228
10.866667 6.190072 0.900882 0.266759 0.046625 -0.290429 -0.213733
10.900000 6.191543 0.891205 0.257995 0.050005 -0.285895 -0.258822
10.933333 6.193076 0.881649 0.233000 0.053830 -0.281158 -0.273575
10.966667 6.194804 0.872294 0.204452 0.058100 -0.276220 -0.255294
11.000000 6.196741 0.863143 0.189626 0.062782 -0.271098 -0.211694
11.033333 6.198749 0.854117 0.173816 0.067876 -0.265792 -0.143833
11.066667 6.200998 0.845306 0.168439 0.073342 -0.260325 -0.053442
11.100000 6.203499 0.836712 0.163191 0.079086 -0.254745 0.057403
11.133333 6.206268 0.828340 0.189230 0.085016 -0.249098 0.178507
11.166667 6.209116 0.820097 0.185941 0.091034 -0.243433 0.298054
11.200000 6.212256 0.812085 0.192833 0.097080 -0.237776 0.413070
11.233333 6.215699 0.804308 0.194745 0.103035 -0.232186 0.516914
11.266667 6.219226 0.796661 0.232315 0.108825 -0.226696 0.600383
11.300000 6.223074 0.789258 0.275908 0.114405 -0.221324 0.657112
11.333333 6.227009 0.781986 0.299879 0.119762 -0.216075 0.688501
11.366667 6.231273 0.774960 0.326810 0.124891 -0.210950 0.696557
11.400000 6.235624 0.768065 0.368506 0.129769 -0.205958 0.678906
11.433333 6.240064 0.761302 0.391058 0.134450 -0.201075 0.634050
11.466667 6.244593 0.754670 0.433383 0.138989 -0.196276 0.566779
11.500000 6.249210 0.748168 0.438250 0.143468 -0.191525 0.482124
11.533333 6.254157 0.741909 0.448216 0.147933 -0.186801 0.381309
11.566667 6.259194 0.735780 0.457946 0.152448 -0.182077 0.267163
11.600000 6.264318 0.729781 0.461856 0.157079 -0.177323 0.147840
11.633333 6.269532 0.723910 0.474022 0.161839 -0.172534 0.029232
11.666667 6.274833 0.718168 0.484793 0.166720 -0.167712 -0.083929
11.700000 6.280449 0.712653 0.479974 0.171676 -0.162880 -0.189570
11.733333 6.286152 0.707265 0.460534 0.176717 -0.158034 -0.282315
11.766667 6.292158 0.702096 0.437994 0.181797 -0.153194 -0.358492
11.800000 6.298458 0.697143 0.423429 0.186871 -0.148380 -0.417457
11.833333 6.304842 0.692313 0.398000 0.191922 -0.143603 -0.457496
11.866667 6.311307 0.687606 0.379981 0.196931 -0.138872 -0.479817
11.900000 6.318049 0.683102 0.351981 0.201903 -0.134187 -0.487364
11.933333 6.324870 0.678717 0.328418 0.206793 -0.129569 -0.487231
11.966667 6.331768 0.674451 0.313267 0.211606 -0.125015 -0.485155
12.000000 6.338926 0.670378 0.300704 0.216343 -0.120527 -0.486469
12.033333 6.346157 0.666419 0.291601 0.220986 -0.116110 -0.496475
12.066667 6.353634 0.662644 0.293905 0.225491 -0.111781 -0.518252
12.100000 6.361179 0.658980 0.271711 0.229837 -0.107550 -0.550363
12.133333 6.368952 0.655490 0.271070 0.234008 -0.103423 -0.591615
12.166667 6.376941 0.652165 0.256667 0.237955 -0.099422 -0.639072
12.200000 6.385135 0.649000 0.234383 0.241649 -0.095561 -0.695319
12.233333 6.393386 0.645939 0.192761 0.245057 -0.091856 -0.760424
12.266667 6.401690 0.642979 0.155554 0.248188 -0.088305 -0.842546
12.300000 6.410044 0.640119 0.109983 0.251024 -0.084915 -0.945011
12.333333 6.418445 0.637356 0.088748 0.253565 -0.081685 -1.076645
12.366667 6.426980 0.634715 0.065383 0.255829 -0.078605 -1.250640
12.400000 6.435556 0.632167 0.045550 0.257840 -0.075661 -1.473424
12.433333 6.444235 0.629724 0.017642 0.259624 -0.072838 -1.760608
12.466667 6.453001 0.627376 -0.017731 0.261188 -0.070126 -2.102082
12.500000 6.461795 0.625113 -0.058083 0.262544 -0.067515 -2.506415
12.533333 6.470638 0.622923 -0.142633 0.263695 -0.064998 -2.950722
12.566667 6.479501 0.620814 -0.224651 0.264645 -0.062570 -3.412089
12.600000 6.488382 0.618784 -0.399765 0.265389 -0.060230 -3.856213
12.633333 6.497277 0.616830 -0.483040 0.265933 -0.057973 -4.242229
12.666667 6.506182 0.614951 -0.666022 0.266276 -0.055804 -4.545596
12.700000 6.515093 0.613143 -0.869171 0.266404 -0.053739 -4.723847
12.733333 6.524005 0.611404 -1.081983 0.266287 -0.051801 -4.769503
12.766667 6.532916 0.609732 -1.363764 0.265873 -0.050031 -4.664413
12.800000 6.541821 0.608124 -1.531496 0.265111 -0.048464 -4.421490
12.833333 6.550716 0.606578 -1.744381 0.263927 -0.047151 -4.045558
12.866667 6.559598 0.605091 -1.843043 0.262261 -0.046132 -3.562618
12.900000 6.568463 0.603662 -1.983740 0.260083 -0.045429 -3.000972
12.933333 6.577306 0.602286 -2.070900 0.257394 -0.045041 -2.380372
12.966667 6.586123 0.600964 -2.131141 0.254219 -0.044959 -1.738138
13.000000 6.594727 0.599580 -2.146443 0.250593 -0.045161 -1.090888
13.033333 6.603107 0.598128 -2.147356 0.246591 -0.045608 -0.464622
13.066667 6.611255 0.596604 -2.136899 0.242320 -0.046236 0.144979
13.100000 6.619167 0.595001 -2.138427 0.237875 -0.046993 0.727180
13.133333 6.627037 0.593440 -2.092235 0.233326 -0.047840 1.269631
13.166667 6.634671 0.591798 -2.063072 0.228767 -0.048724 1.773335
13.200000 6.642074 0.590072 -2.006021 0.224269 -0.049606 2.237924
13.233333 6.649426 0.588383 -1.909339 0.219869 -0.050463 2.655791
13.266667 6.656725 0.586728 -1.772873 0.215557 -0.051307 3.001166
13.300000 6.663810 0.584993 -1.661777 0.211323 -0.052140 3.263600
13.333333 6.670838 0.583289 -1.536586 0.207180 -0.052947 3.440978
13.366667 6.677663 0.581507 -1.388448 0.203107 -0.053736 3.525764
13.400000 6.684426 0.579754 -1.182407 0.199080 -0.054515 3.502131
13.433333 6.690994 0.577926 -1.040250 0.195106 -0.055268 3.376977
13.466667 6.697372 0.576025 -0.918266 0.191213 -0.055966 3.171114
13.500000 6.703682 0.574150 -0.814647 0.187410 -0.056596 2.901078
13.533333 6.709811 0.572207 -0.694947 0.183696 -0.057154 2.580339
13.566667 6.715761 0.570201 -0.633497 0.180066 -0.057635 2.229482
13.600000 6.721640 0.568218 -0.570808 0.176531 -0.058027 1.883867
13.633333 6.727446 0.566257 -0.535124 0.173070 -0.058344 1.560326
13.666667 6.733179 0.564319 -0.507342 0.169651 -0.058607 1.266225
13.700000 6.738837 0.562401 -0.472076 0.166252 -0.058829 1.008565
13.733333 6.744332 0.560439 -0.471135 0.162850 -0.059028 0.798125
13.766667 6.749749 0.558496 -0.465727 0.159423 -0.059219 0.633712
13.800000 6.755011 0.556517 -0.437126 0.155957 -0.059414 0.502261
13.833333 6.760194 0.554556 -0.429600 0.152452 -0.059615 0.398131
13.866667 6.765226 0.552567 -0.418870 0.148921 -0.059811 0.316471
13.900000 6.770112 0.550550 -0.410588 0.145386 -0.059989 0.252983
13.933333 6.774853 0.548512 -0.396436 0.141865 -0.060134 0.196494
13.966667 6.779513 0.546490 -0.397022 0.138389 -0.060226 0.143883
14.000000 6.784035 0.544455 -0.393854 0.134972 -0.060253 0.098413
