t x y theta dxdt dydt dthetadt
0.000000 0.000000 0.000000 -2.707588 0.088221 -0.122410 -1.387742
0.033333 0.002995 -0.004175 -2.191016 0.090441 -0.126461 -1.406292
0.066667 0.006063 -0.008498 -1.860417 0.092595 -0.130439 -0.665481
0.100000 0.009198 -0.012940 -1.463259 0.094685 -0.134341 0.852656
0.133333 0.012399 -0.017500 -1.109837 0.096716 -0.138171 2.106110
0.166667 0.015666 -0.022177 -0.821084 0.098691 -0.141926 3.166885
0.200000 0.018999 -0.026990 -0.594033 0.100611 -0.145608 3.586759
0.233333 0.022395 -0.031915 -0.467034 0.102481 -0.149220 3.458977
0.266667 0.025853 -0.036952 -0.381434 0.104303 -0.152767 2.834888
0.300000 0.029371 -0.042117 -0.413038 0.106080 -0.156250 1.769655
0.333333 0.032949 -0.047389 -0.468142 0.107810 -0.159673 0.831759
0.366667 0.036581 -0.052784 -0.557046 0.109496 -0.163034 0.032196
0.400000 0.040266 -0.058299 -0.620823 0.111139 -0.166330 -0.635186
0.433333 0.044008 -0.063916 -0.660756 0.112740 -0.169558 -1.195606
0.466667 0.047804 -0.069632 -0.671050 0.114299 -0.172714 -1.662623
0.500000 0.051649 -0.075459 -0.690352 0.115818 -0.175795 -2.066332
0.533333 0.055539 -0.081395 -0.704860 0.117299 -0.178796 -2.443025
0.566667 0.059481 -0.087424 -0.790300 0.118741 -0.181716 -2.816900
0.600000 0.063474 -0.093545 -0.908768 0.120147 -0.184557 -3.200933
0.633333 0.067508 -0.099765 -1.050349 0.121517 -0.187316 -3.601282
0.666667 0.071591 -0.106071 -1.197715 0.122854 -0.189993 -4.012361
0.700000 0.075721 -0.112463 -1.338462 0.124159 -0.192589 -4.423781
0.733333 0.079888 -0.118943 -1.495749 0.125432 -0.195104 -4.799218
0.766667 0.084091 -0.125510 -1.657710 0.126674 -0.197539 -5.119496
0.800000 0.088338 -0.132155 -1.844477 0.127889 -0.199889 -5.357963
0.833333 0.092627 -0.138875 -2.007783 0.129081 -0.202153 -5.483804
0.866667 0.096956 -0.145669 -2.278600 0.130252 -0.204325 -5.458516
0.900000 0.101324 -0.152534 -2.450049 0.131408 -0.206401 -5.249144
0.933333 0.105730 -0.159469 -2.669693 0.132553 -0.208376 -4.836884
0.966667 0.110169 -0.166471 -2.916768 0.133689 -0.210247 -4.197502
1.000000 0.114642 -0.173537 3.137172 0.134813 -0.212017 -3.326116
1.033333 0.119150 -0.180665 2.943092 0.135924 -0.213688 -2.233879
1.066667 0.123691 -0.187853 2.801315 0.137017 -0.215265 -0.970718
1.100000 0.128275 -0.195081 2.749315 0.138084 -0.216757 0.406766
1.133333 0.132903 -0.202347 2.773500 0.139120 -0.218170 1.827785
1.166667 0.137574 -0.209649 2.891041 0.140117 -0.219513 3.202285
1.200000 0.142286 -0.216984 3.094954 0.141067 -0.220795 4.438471
1.233333 0.147025 -0.224367 -2.926865 0.141963 -0.222022 5.449812
1.266667 0.151788 -0.231796 -2.633541 0.142800 -0.223201 6.174803
1.300000 0.156576 -0.239267 -2.283878 0.143573 -0.224336 6.573009
1.333333 0.161388 -0.246776 -1.931452 0.144280 -0.225428 6.624088
1.366667 0.166222 -0.254320 -1.592193 0.144921 -0.226475 6.336986
1.400000 0.171076 -0.261898 -1.301734 0.145500 -0.227473 5.748257
1.433333 0.175948 -0.269510 -1.114002 0.146017 -0.228417 4.915010
1.466667 0.180836 -0.277154 -0.928836 0.146472 -0.229301 3.902307
1.500000 0.185738 -0.284828 -0.808429 0.146866 -0.230121 2.778687
1.533333 0.190653 -0.292529 -0.753665 0.147196 -0.230871 1.609704
1.566667 0.195577 -0.300251 -0.744851 0.147457 -0.231549 0.458168
1.600000 0.200510 -0.307996 -0.799839 0.147644 -0.232152 -0.628036
1.633333 0.205453 -0.315762 -0.888742 0.147754 -0.232677 -1.620220
1.666667 0.210403 -0.323547 -0.971434 0.147788 -0.233124 -2.502850
1.700000 0.215359 -0.331347 -1.115826 0.147744 -0.233490 -3.272085
1.733333 0.220306 -0.339157 -1.266683 0.147623 -0.233774 -3.929203
1.766667 0.225241 -0.346972 -1.432092 0.147431 -0.233976 -4.479738
1.800000 0.230160 -0.354790 -1.595035 0.147176 -0.234095 -4.929511
1.833333 0.235080 -0.362616 -1.769038 0.146863 -0.234129 -5.279669
1.866667 0.239981 -0.370439 -1.958838 0.146502 -0.234075 -5.514258
1.900000 0.244860 -0.378256 -2.166462 0.146102 -0.233934 -5.613463
1.933333 0.249716 -0.386064 -2.380317 0.145676 -0.233707 -5.556018
1.966667 0.254567 -0.393871 -2.578698 0.145233 -0.233399 -5.319471
2.000000 0.259413 -0.401675 -2.822881 0.144777 -0.233013 -4.881280
2.033333 0.264234 -0.409462 -3.071452 0.144315 -0.232559 -4.221298
2.066667 0.269029 -0.417230 2.991554 0.143852 -0.232045 -3.341921
2.100000 0.273810 -0.424959 2.810499 0.143386 -0.231477 -2.265128
2.133333 0.278580 -0.432676 2.701283 0.142913 -0.230862 -1.027259
2.166667 0.283336 -0.440350 2.647711 0.142429 -0.230201 0.315474
2.200000 0.288079 -0.448008 2.674485 0.141930 -0.229499 1.683352
2.233333 0.292808 -0.455649 2.790684 0.141410 -0.228754 2.977802
2.266667 0.297521 -0.463270 2.937936 0.140860 -0.227962 4.110075
2.300000 0.302218 -0.470869 -3.089044 0.140274 -0.227118 4.998804
2.333333 0.306897 -0.478446 -2.796410 0.139647 -0.226218 5.582313
2.366667 0.311557 -0.485997 -2.452877 0.138975 -0.225254 5.815758
2.400000 0.316197 -0.493522 -2.107170 0.138252 -0.224217 5.689798
2.433333 0.320802 -0.500993 -1.800149 0.137474 -0.223098 5.234600
2.466667 0.325386 -0.508434 -1.553900 0.136643 -0.221896 4.494112
2.500000 0.329931 -0.515816 -1.357216 0.135759 -0.220612 3.543291
2.533333 0.334451 -0.523164 -1.267138 0.134821 -0.219245 2.468960
2.566667 0.338947 -0.530475 -1.270060 0.133833 -0.217799 1.372930
2.600000 0.343397 -0.537718 -1.272586 0.132802 -0.216287 0.348436
2.633333 0.347820 -0.544922 -1.340449 0.131734 -0.214718 -0.530310
2.666667 0.352215 -0.552085 -1.438119 0.130631 -0.213097 -1.213618
2.700000 0.356557 -0.559170 -1.586778 0.129493 -0.211421 -1.679914
2.733333 0.360843 -0.566174 -1.763390 0.128326 -0.209700 -1.933672
2.766667 0.365098 -0.573133 -1.924690 0.127133 -0.207938 -2.003113
2.800000 0.369322 -0.580044 -2.016514 0.125911 -0.206130 -1.928352
2.833333 0.373513 -0.586908 -2.056564 0.124658 -0.204269 -1.756366
2.866667 0.377644 -0.593682 -2.060671 0.123373 -0.202356 -1.529146
2.900000 0.381741 -0.600405 -2.076514 0.122058 -0.200394 -1.286076
2.933333 0.385803 -0.607076 -2.068156 0.120708 -0.198373 -1.062385
2.966667 0.389829 -0.613693 -2.063000 0.119320 -0.196288 -0.882922
3.000000 0.393794 -0.620220 -2.090754 0.117891 -0.194136 -0.757118
3.033333 0.397699 -0.626655 -2.129922 0.116425 -0.191922 -0.685987
3.066667 0.401566 -0.633033 -2.158285 0.114922 -0.189646 -0.658731
3.100000 0.405373 -0.639320 -2.191903 0.113385 -0.187312 -0.662083
3.133333 0.409141 -0.645548 -2.220999 0.111819 -0.184926 -0.678015
3.166667 0.412848 -0.651684 -2.210433 0.110230 -0.182501 -0.692640
3.200000 0.416496 -0.657728 -2.240517 0.108626 -0.180045 -0.698809
3.233333 0.420084 -0.663681 -2.273243 0.107012 -0.177567 -0.693758
3.266667 0.423631 -0.669570 -2.296979 0.105395 -0.175076 -0.678884
3.300000 0.427119 -0.675368 -2.321695 0.103778 -0.172581 -0.657681
3.333333 0.430547 -0.681074 -2.348065 0.102169 -0.170093 -0.632311
3.366667 0.433916 -0.686689 -2.371189 0.100573 -0.167619 -0.600202
3.400000 0.437243 -0.692238 -2.391836 0.098994 -0.165166 -0.564055
3.433333 0.440511 -0.697696 -2.409522 0.097432 -0.162736 -0.523585
3.466667 0.443722 -0.703063 -2.434709 0.095890 -0.160332 -0.479780
3.500000 0.446889 -0.708362 -2.444912 0.094366 -0.157953 -0.432208
3.533333 0.449998 -0.713571 -2.449187 0.092860 -0.155597 -0.382274
3.566667 0.453064 -0.718712 -2.467282 0.091368 -0.153260 -0.332892
3.600000 0.456085 -0.723783 -2.466342 0.089887 -0.150938 -0.285498
3.633333 0.459062 -0.728785 -2.484265 0.088417 -0.148629 -0.239923
3.666667 0.461983 -0.733698 -2.496660 0.086956 -0.146331 -0.197642
3.700000 0.464859 -0.738541 -2.500584 0.085503 -0.144044 -0.158312
3.733333 0.467690 -0.743314 -2.503408 0.084058 -0.141766 -0.121151
3.766667 0.470466 -0.747999 -2.504458 0.082619 -0.139497 -0.088125
3.800000 0.473187 -0.752597 -2.499863 0.081188 -0.137238 -0.057240
3.833333 0.475863 -0.757123 -2.507232 0.079765 -0.134990 -0.029843
3.866667 0.478493 -0.761579 -2.504317 0.078349 -0.132750 -0.007287
3.900000 0.481079 -0.765963 -2.498214 0.076937 -0.130517 0.009768
3.933333 0.483619 -0.770275 -2.504683 0.075531 -0.128289 0.021461
