t x y theta dxdt dydt dthetadt
0.000000 0.000000 0.000000 0.471220 -0.016460 0.007256 -0.004441
0.033333 -0.000433 0.000258 0.476532 -0.021261 0.007108 0.003617
0.066667 -0.001049 0.000574 0.484596 -0.026987 0.006913 0.010826
0.100000 -0.001845 0.000813 0.473315 -0.033864 0.006673 0.012922
0.133333 -0.002920 0.001111 0.473639 -0.042245 0.006428 0.011188
0.166667 -0.004190 0.001331 0.459229 -0.052380 0.006206 0.010648
0.200000 -0.005662 0.001473 0.470793 -0.064368 0.006023 0.008389
0.233333 -0.007343 0.001536 0.483373 -0.078607 0.005891 0.011666
0.266667 -0.009239 0.001518 0.484984 -0.095288 0.005818 0.027556
0.300000 -0.011898 0.001684 0.465899 -0.114548 0.005790 0.067205
0.333333 -0.015639 0.001992 0.481623 -0.136141 0.005754 0.136320
0.366667 -0.019609 0.002217 0.463928 -0.159868 0.005666 0.240016
0.400000 -0.025082 0.002513 0.472620 -0.185833 0.005557 0.386031
0.433333 -0.030789 0.002722 0.476984 -0.213880 0.005506 0.574953
0.466667 -0.038795 0.003012 0.474170 -0.244091 0.005659 0.804093
0.500000 -0.047035 0.003213 0.481033 -0.276636 0.006205 1.059543
0.533333 -0.055508 0.003322 0.489006 -0.311990 0.007374 1.338297
0.566667 -0.067722 0.003518 0.538889 -0.350332 0.009378 1.620257
0.600000 -0.080159 0.003620 0.609339 -0.391601 0.012379 1.894197
0.633333 -0.092814 0.003624 0.725470 -0.435554 0.016454 2.141186
0.666667 -0.105679 0.003529 0.814695 -0.481674 0.021550 2.345652
0.700000 -0.118748 0.003333 0.929377 -0.529530 0.027581 2.497744
0.733333 -0.135992 0.003966 1.006483 -0.578435 0.034317 2.582052
0.766667 -0.157347 0.005424 1.115495 -0.627958 0.041482 2.605747
0.800000 -0.182569 0.007721 1.217473 -0.677246 0.048539 2.571286
0.833333 -0.207935 0.009903 1.312221 -0.725464 0.054809 2.494128
0.866667 -0.233423 0.011964 1.434279 -0.771964 0.059579 2.385087
0.900000 -0.259011 0.013899 1.486454 -0.815826 0.062163 2.264469
0.933333 -0.287252 0.016631 1.562604 -0.856285 0.062039 2.145761
0.966667 -0.317766 0.019939 1.623565 -0.892759 0.058773 2.035871
1.000000 -0.348302 0.023103 1.666667 -0.925292 0.052290 1.939071
1.033333 -0.380470 0.025985 1.703700 -0.953786 0.042755 1.856682
1.066667 -0.414371 0.028181 1.750552 -0.977787 0.030550 1.794522
1.100000 -0.448203 0.030214 1.817805 -0.996831 0.016033 1.742029
1.133333 -0.483014 0.030996 1.892274 -1.010461 -0.000311 1.691868
1.166667 -0.518451 0.030383 1.957539 -1.018205 -0.017849 1.636028
1.200000 -0.554278 0.028414 2.012316 -1.019385 -0.035906 1.571561
1.233333 -0.589896 0.026267 2.065004 -1.013779 -0.053805 1.491081
1.266667 -0.625269 0.023937 2.128379 -1.001785 -0.070939 1.388233
1.300000 -0.660361 0.021425 2.186435 -0.984117 -0.086668 1.266848
1.333333 -0.694807 0.018042 2.220096 -0.961946 -0.100483 1.136304
1.366667 -0.728080 0.014003 2.269159 -0.936645 -0.112020 1.002348
1.400000 -0.759545 0.009465 2.297409 -0.909775 -0.121148 0.866981
1.433333 -0.788765 0.004547 2.316585 -0.883085 -0.127789 0.736055
1.466667 -0.815699 -0.000519 2.307745 -0.858131 -0.131982 0.617570
1.500000 -0.842151 -0.005770 2.312816 -0.836439 -0.133762 0.517488
1.533333 -0.868091 -0.011207 2.340843 -0.818919 -0.133345 0.434146
1.566667 -0.893149 -0.016282 2.358455 -0.805936 -0.131130 0.371384
1.600000 -0.918122 -0.020760 2.375630 -0.797525 -0.127535 0.331611
1.633333 -0.942497 -0.025424 2.383004 -0.792866 -0.123100 0.313556
1.666667 -0.968135 -0.029319 2.375363 -0.790707 -0.118377 0.311443
1.700000 -0.995327 -0.032465 2.375883 -0.789362 -0.114045 0.316745
1.733333 -1.021830 -0.035804 2.384121 -0.787328 -0.110644 0.327618
1.766667 -1.049823 -0.038718 2.391303 -0.783113 -0.108559 0.333360
1.800000 -1.077059 -0.041830 2.404701 -0.774932 -0.108106 0.324051
1.833333 -1.105006 -0.044841 2.427999 -0.761016 -0.109597 0.292315
1.866667 -1.132127 -0.048056 2.436785 -0.739561 -0.113295 0.229603
1.900000 -1.158388 -0.051480 2.463593 -0.709268 -0.119277 0.131182
1.933333 -1.183753 -0.055114 2.496387 -0.668843 -0.127620 -0.011224
1.966667 -1.206364 -0.059338 2.499615 -0.617554 -0.138308 -0.193954
2.000000 -1.228014 -0.063780 2.513318 -0.555631 -0.151210 -0.412021
2.033333 -1.248670 -0.068441 2.498670 -0.484417 -0.165964 -0.655628
2.066667 -1.268303 -0.073325 2.487585 -0.406124 -0.182072 -0.909949
2.100000 -1.286882 -0.078435 2.433285 -0.322423 -0.199168 -1.155514
2.133333 -1.298443 -0.084853 2.378879 -0.235162 -0.216834 -1.368950
2.166667 -1.302863 -0.092732 2.317388 -0.146205 -0.234664 -1.533773
2.200000 -1.300069 -0.102142 2.244032 -0.057432 -0.252232 -1.631617
2.233333 -1.296145 -0.111778 2.165471 0.030148 -0.269246 -1.652599
2.266667 -1.291086 -0.121639 2.079543 0.116242 -0.285503 -1.591019
2.300000 -1.284883 -0.131722 1.994568 0.200020 -0.300652 -1.452184
2.333333 -1.277532 -0.142025 1.916866 0.280996 -0.314444 -1.248096
2.366667 -1.269027 -0.152545 1.854365 0.359537 -0.326803 -0.990767
2.400000 -1.259363 -0.163281 1.835547 0.437032 -0.337874 -0.701035
2.433333 -1.244160 -0.174907 1.819324 0.514088 -0.347630 -0.397990
2.466667 -1.223904 -0.187225 1.827289 0.590571 -0.356037 -0.101929
2.500000 -1.202494 -0.199749 1.848659 0.666382 -0.363071 0.170455
2.533333 -1.179937 -0.212474 1.880699 0.741253 -0.368658 0.408362
2.566667 -1.153317 -0.225433 1.909812 0.814168 -0.372621 0.602373
2.600000 -1.123089 -0.238386 1.958970 0.883402 -0.374692 0.757347
2.633333 -1.089471 -0.251077 1.991831 0.947875 -0.374978 0.881987
2.666667 -1.054759 -0.263952 2.013563 1.007277 -0.373493 0.987796
2.700000 -1.018974 -0.277008 2.060842 1.061401 -0.370463 1.086996
2.733333 -0.982134 -0.290240 2.094171 1.110044 -0.366119 1.188202
2.766667 -0.943431 -0.302326 2.112061 1.153440 -0.360784 1.294750
2.800000 -0.903716 -0.314582 2.154368 1.192275 -0.354776 1.397873
2.833333 -0.862450 -0.325507 2.173040 1.227304 -0.348343 1.488630
2.866667 -0.820218 -0.336597 2.211949 1.259185 -0.342083 1.553957
2.900000 -0.777044 -0.347851 2.264738 1.288665 -0.336566 1.585011
2.933333 -0.732951 -0.359267 2.371118 1.316494 -0.332359 1.571433
2.966667 -0.687966 -0.370844 2.468941 1.343293 -0.329847 1.510131
3.000000 -0.643225 -0.380662 2.562338 1.369555 -0.329662 1.406572
3.033333 -0.597641 -0.390639 2.633024 1.395620 -0.332122 1.260335
3.066667 -0.551239 -0.400776 2.684061 1.421663 -0.337244 1.081486
3.100000 -0.503902 -0.410825 2.679523 1.447851 -0.345001 0.882310
3.133333 -0.455411 -0.421295 2.678945 1.474390 -0.355460 0.678959
3.166667 -0.405829 -0.432525 2.686140 1.501398 -0.368724 0.484218
3.200000 -0.355113 -0.444746 2.677255 1.528754 -0.384403 0.306452
3.233333 -0.303232 -0.458263 2.673445 1.556335 -0.402275 0.160831
3.266667 -0.250699 -0.471935 2.684056 1.584095 -0.422257 0.047493
3.300000 -0.197543 -0.485757 2.676264 1.611884 -0.444063 -0.041119
3.333333 -0.143189 -0.501134 2.692242 1.639448 -0.467154 -0.111478
3.366667 -0.088274 -0.516653 2.669989 1.666593 -0.491093 -0.165537
3.400000 -0.032830 -0.532309 2.674560 1.693318 -0.515696 -0.208873
3.433333 0.024134 -0.549635 2.680823 1.719578 -0.540709 -0.251801
3.466667 0.082410 -0.568517 2.664823 1.745169 -0.565609 -0.287884
3.500000 0.141116 -0.587514 2.636652 1.769957 -0.590024 -0.310478
3.533333 0.200831 -0.607954 2.616191 1.793848 -0.613673 -0.315917
3.566667 0.261573 -0.629588 2.620010 1.816708 -0.636132 -0.311665
3.600000 0.323174 -0.652182 2.587141 1.838236 -0.656808 -0.296241
3.633333 0.385060 -0.674844 2.566872 1.858213 -0.675255 -0.269062
3.666667 0.447504 -0.698344 2.570101 1.876668 -0.691280 -0.241542
3.700000 0.510158 -0.721886 2.559286 1.893730 -0.704703 -0.222869
3.733333 0.573988 -0.746222 2.551197 1.909518 -0.715451 -0.218716
3.766667 0.638801 -0.771178 2.541891 1.924103 -0.723592 -0.220364
3.800000 0.703706 -0.796131 2.562639 1.937734 -0.729396 -0.231513
3.833333 0.768662 -0.821064 2.578435 1.950645 -0.733060 -0.248595
3.866667 0.833628 -0.845961 2.591882 1.962906 -0.734747 -0.265024
3.900000 0.899120 -0.870777 2.564396 1.974378 -0.734580 -0.274230
3.933333 0.964889 -0.895410 2.535537 1.985000 -0.732668 -0.271083
3.966667 1.030959 -0.919848 2.483500 1.994808 -0.729139 -0.258794
4.000000 1.097979 -0.944275 2.466735 2.003612 -0.724061 -0.231175
4.033333 1.165915 -0.968666 2.446095 2.011036 -0.717523 -0.189647
4.066667 1.233609 -0.992924 2.450469 2.016617 -0.709595 -0.136445
4.100000 1.301019 -1.017035 2.471750 2.019923 -0.700384 -0.076425
4.133333 1.368885 -1.040643 2.468794 2.020298 -0.689979 -0.018089
4.166667 1.437133 -1.063842 2.479426 2.017021 -0.678422 0.031674
4.200000 1.505499 -1.086489 2.495165 2.009308 -0.665773 0.065355
4.233333 1.573616 -1.108526 2.482906 1.996302 -0.652049 0.084587
4.266667 1.641127 -1.129870 2.506628 1.977341 -0.637322 0.089308
4.300000 1.708086 -1.150977 2.508528 1.951970 -0.621704 0.082987
4.333333 1.774568 -1.171473 2.514620 1.920136 -0.605329 0.070143
4.366667 1.840409 -1.191706 2.498358 1.881885 -0.588307 0.058226
4.400000 1.904742 -1.211366 2.500491 1.837548 -0.570711 0.051925
4.433333 1.966971 -1.230352 2.503772 1.788141 -0.552723 0.044628
4.466667 2.026561 -1.248541 2.491498 1.734458 -0.534384 0.038083
4.500000 2.085348 -1.266420 2.496739 1.677186 -0.515702 0.031980
4.533333 2.140269 -1.283277 2.491802 1.617065 -0.496670 0.028022
4.566667 2.190615 -1.298913 2.513047 1.554828 -0.477312 0.019394
4.600000 2.240058 -1.314207 2.529264 1.491126 -0.457666 0.002465
4.633333 2.288572 -1.329152 2.521558 1.425789 -0.437594 -0.017143
4.666667 2.336130 -1.343739 2.510653 1.358931 -0.417075 -0.043452
4.700000 2.382705 -1.357960 2.519089 1.290392 -0.396022 -0.077396
4.733333 2.424676 -1.370862 2.513273 1.219800 -0.374340 -0.121675
4.766667 2.465617 -1.383383 2.499834 1.146425 -0.351856 -0.170956
4.800000 2.501989 -1.394555 2.495775 1.069884 -0.328512 -0.220592
4.833333 2.537295 -1.405334 2.496072 0.990441 -0.304425 -0.273167
4.866667 2.571520 -1.415714 2.486915 0.908223 -0.279671 -0.322898
4.900000 2.601618 -1.424936 2.481146 0.824166 -0.254527 -0.368251
4.933333 2.627566 -1.432948 2.458584 0.739116 -0.229236 -0.402752
4.966667 2.649244 -1.439716 2.451400 0.654724 -0.204250 -0.425170
5.000000 2.669808 -1.446072 2.416149 0.572276 -0.179902 -0.433453
5.033333 2.685945 -1.451203 2.413119 0.493064 -0.156521 -0.424818
5.066667 2.700971 -1.455919 2.383430 0.418392 -0.134451 -0.402389
5.100000 2.711930 -1.459546 2.355288 0.349034 -0.113909 -0.364624
5.133333 2.719087 -1.462233 2.337362 0.285772 -0.095099 -0.318716
5.166667 2.725157 -1.464507 2.324436 0.228622 -0.077997 -0.267565
5.200000 2.730153 -1.466369 2.327751 0.177593 -0.062586 -0.218176
5.233333 2.734088 -1.467821 2.322413 0.132103 -0.048714 -0.173771
5.266667 2.736977 -1.468864 2.334009 0.091482 -0.036189 -0.136947
5.300000 2.738777 -1.469681 2.339203 0.054698 -0.024716 -0.111876
5.333333 2.739809 -1.470335 2.339627 0.020496 -0.013957 -0.095408
5.366667 2.739840 -1.470587 2.343017 -0.012307 -0.003611 -0.085707
5.400000 2.739042 -1.470636 2.325135 -0.045064 0.006697 -0.078114
5.433333 2.737386 -1.470411 2.327825 -0.079056 0.017359 -0.070416
5.466667 2.734779 -1.469789 2.315771 -0.115435 0.028736 -0.057921
5.500000 2.731240 -1.468774 2.307499 -0.154900 0.041056 -0.038752
5.533333 2.726519 -1.467502 2.311981 -0.198170 0.054547 -0.014105
5.566667 2.720492 -1.465885 2.294035 -0.245557 0.069343 0.015829
5.600000 2.712910 -1.463810 2.285608 -0.296863 0.085413 0.049718
5.633333 2.703255 -1.461145 2.301979 -0.351568 0.102628 0.086258
5.666667 2.692771 -1.458100 2.317780 -0.409204 0.120864 0.122928
5.700000 2.679266 -1.454126 2.340137 -0.469501 0.140043 0.156980
5.733333 2.662316 -1.449077 2.344818 -0.531681 0.159938 0.188238
5.766667 2.641481 -1.442914 2.342435 -0.594956 0.180296 0.214515
5.800000 2.619934 -1.436390 2.334829 -0.658885 0.200951 0.235222
5.833333 2.597711 -1.429510 2.340604 -0.722916 0.221701 0.253830
5.866667 2.571083 -1.421437 2.355611 -0.786185 0.242275 0.271824
5.900000 2.543854 -1.413023 2.368667 -0.847618 0.262368 0.293779
5.933333 2.516064 -1.404275 2.388190 -0.906427 0.281756 0.320686
5.966667 2.484256 -1.394349 2.391403 -0.962068 0.300238 0.354116
6.000000 2.451972 -1.384105 2.405846 -1.013949 0.317610 0.393265
6.033333 2.415803 -1.372810 2.412158 -1.061379 0.333659 0.434817
6.066667 2.375885 -1.360597 2.420399 -1.103925 0.348192 0.477144
6.100000 2.335641 -1.348096 2.434802 -1.141259 0.361031 0.516781
6.133333 2.295123 -1.335316 2.453476 -1.172683 0.371904 0.550984
6.166667 2.254387 -1.322269 2.479638 -1.197725 0.380684 0.573326
6.200000 2.213484 -1.308965 2.505325 -1.215919 0.387244 0.578068
6.233333 2.172470 -1.295414 2.527136 -1.227382 0.391586 0.557984
6.266667 2.130146 -1.281852 2.555149 -1.232024 0.393658 0.505077
6.300000 2.087212 -1.268443 2.579774 -1.229712 0.393443 0.409198
6.333333 2.044331 -1.254819 2.609197 -1.220879 0.391161 0.259752
6.366667 2.001558 -1.240990 2.629626 -1.205227 0.386684 0.051821
6.400000 1.960105 -1.227847 2.641069 -1.182104 0.379708 -0.218139
6.433333 1.918869 -1.214518 2.647449 -1.150136 0.369638 -0.549002
6.466667 1.880637 -1.202542 2.646588 -1.109119 0.356351 -0.935016
6.500000 1.842728 -1.190398 2.621700 -1.058959 0.339664 -1.355843
6.533333 1.805190 -1.178095 2.582164 -0.999031 0.319138 -1.780904
6.566667 1.768074 -1.165639 2.525137 -0.929463 0.294759 -2.177570
6.600000 1.738034 -1.156061 2.452884 -0.851469 0.267092 -2.508980
6.633333 1.708506 -1.146343 2.330945 -0.767008 0.237186 -2.738954
6.666667 1.679533 -1.136489 2.185657 -0.676854 0.205664 -2.835306
6.700000 1.657107 -1.129506 2.023565 -0.582231 0.173432 -2.785269
6.733333 1.640808 -1.125374 1.847037 -0.485452 0.141914 -2.589452
6.766667 1.630460 -1.123915 1.695152 -0.389359 0.112823 -2.258725
6.800000 1.620785 -1.122316 1.559583 -0.295724 0.087253 -1.817214
6.833333 1.611806 -1.120572 1.493630 -0.206220 0.066211 -1.307940
6.866667 1.607287 -1.120293 1.491155 -0.123219 0.050843 -0.785612
6.900000 1.606513 -1.120762 1.511705 -0.048346 0.041865 -0.299561
6.933333 1.608850 -1.121449 1.571051 0.017896 0.039608 0.101440
6.966667 1.613686 -1.121776 1.645577 0.076159 0.043527 0.379025
7.000000 1.620261 -1.121221 1.717384 0.126670 0.053234 0.506213
7.033333 1.627590 -1.120476 1.772915 0.170066 0.068197 0.484509
7.066667 1.635672 -1.119531 1.837929 0.207860 0.087858 0.335450
7.100000 1.643564 -1.116525 1.893261 0.241808 0.111782 0.088746
7.133333 1.652215 -1.113308 1.919362 0.273637 0.139458 -0.220459
7.166667 1.661004 -1.107708 1.888342 0.304898 0.170607 -0.557528
7.200000 1.670555 -1.101890 1.798262 0.337496 0.205230 -0.886149
7.233333 1.680867 -1.095851 1.703167 0.373156 0.243231 -1.185932
7.266667 1.692909 -1.086913 1.623232 0.413069 0.284182 -1.441807
7.300000 1.705711 -1.077752 1.574231 0.457704 0.327670 -1.652508
7.333333 1.719271 -1.068369 1.514016 0.507030 0.373157 -1.816528
7.366667 1.735439 -1.056253 1.460990 0.560723 0.420355 -1.942204
7.400000 1.754242 -1.041607 1.392171 0.617838 0.468394 -2.041915
7.433333 1.775649 -1.024573 1.355083 0.677062 0.516134 -2.127599
7.466667 1.800036 -1.005062 1.282819 0.736948 0.562681 -2.212574
7.500000 1.825140 -0.985362 1.213185 0.796284 0.607171 -2.296082
7.533333 1.853183 -0.963523 1.133117 0.853860 0.648767 -2.379013
7.566667 1.884108 -0.939717 1.030656 0.908421 0.686489 -2.454469
7.600000 1.917824 -0.914077 0.951510 0.959040 0.719769 -2.520803
7.633333 1.952184 -0.888309 0.848501 1.005285 0.748558 -2.569150
7.666667 1.987163 -0.862432 0.748924 1.047099 0.772865 -2.591374
7.700000 2.024075 -0.835059 0.642150 1.084438 0.792489 -2.584884
7.733333 2.061556 -0.807617 0.576836 1.117633 0.807563 -2.552438
7.766667 2.099580 -0.780126 0.490303 1.147344 0.818430 -2.498073
7.800000 2.139249 -0.751625 0.393640 1.174337 0.825449 -2.418453
7.833333 2.179406 -0.723116 0.317507 1.199226 0.828798 -2.316480
7.866667 2.220021 -0.694622 0.246402 1.222362 0.828712 -2.198243
7.900000 2.261066 -0.666164 0.157837 1.244221 0.825741 -2.069387
7.933333 2.302510 -0.637763 0.095434 1.265205 0.820144 -1.930176
7.966667 2.344324 -0.609442 0.007303 1.285533 0.812036 -1.777680
8.000000 2.387507 -0.582182 -0.044234 1.305405 0.801487 -1.618651
8.033333 2.432424 -0.556202 -0.078910 1.324902 0.788670 -1.455745
8.066667 2.477617 -0.530362 -0.120029 1.344220 0.773544 -1.288817
8.100000 2.523050 -0.504681 -0.173466 1.363277 0.755952 -1.120105
8.133333 2.568691 -0.479177 -0.200115 1.381720 0.735830 -0.952071
8.166667 2.614506 -0.453869 -0.231874 1.399195 0.713118 -0.791572
8.200000 2.660460 -0.428775 -0.255568 1.415145 0.687618 -0.637315
8.233333 2.708182 -0.405326 -0.261177 1.429118 0.659064 -0.490568
8.266667 2.757291 -0.383654 -0.287313 1.440200 0.627378 -0.352789
8.300000 2.806431 -0.362246 -0.287997 1.447625 0.592650 -0.227009
8.333333 2.856234 -0.342878 -0.297281 1.450799 0.555319 -0.112366
8.366667 2.905992 -0.323802 -0.289952 1.448695 0.515619 -0.012985
8.400000 2.955989 -0.306627 -0.282542 1.440571 0.474228 0.070493
8.433333 3.005815 -0.291448 -0.269032 1.425314 0.431627 0.133790
8.466667 3.054817 -0.278569 -0.276868 1.402720 0.388492 0.154975
8.500000 3.103623 -0.266017 -0.249137 1.372587 0.345354 0.110301
8.533333 3.150190 -0.256054 -0.242813 1.334945 0.302477 -0.011932
8.566667 3.196487 -0.246426 -0.223989 1.290291 0.260316 -0.206297
8.600000 3.238897 -0.239613 -0.217995 1.239318 0.219076 -0.471090
8.633333 3.280972 -0.233136 -0.204091 1.183650 0.179197 -0.796589
8.666667 3.322683 -0.226995 -0.201698 1.124398 0.140708 -1.139811
8.700000 3.358787 -0.223723 -0.212314 1.062943 0.103789 -1.445309
8.733333 3.394473 -0.220782 -0.194821 1.000155 0.068359 -1.687486
8.766667 3.423270 -0.220556 -0.225787 0.937702 0.034782 -1.855460
8.800000 3.451610 -0.220650 -0.481062 0.876631 0.003141 -1.922966
8.833333 3.479475 -0.221055 -0.776064 0.817452 -0.026541 -1.867124
8.866667 3.506852 -0.221765 -0.905605 0.760679 -0.054004 -1.690905
8.900000 3.528830 -0.225535 -0.917029 0.706709 -0.078974 -1.416617
8.933333 3.550296 -0.229590 -0.900450 0.656349 -0.100933 -1.055478
8.966667 3.571240 -0.233920 -0.883267 0.609200 -0.119867 -0.621863
9.000000 3.591653 -0.238513 -0.892074 0.565158 -0.135563 -0.164941
9.033333 3.609517 -0.244071 -0.897383 0.524283 -0.147748 0.264699
9.066667 3.625343 -0.250228 -0.856133 0.486788 -0.156070 0.635013
9.100000 3.639195 -0.256613 -0.799073 0.452303 -0.160415 0.935750
9.133333 3.652500 -0.263212 -0.728080 0.420328 -0.160705 1.161401
9.166667 3.665255 -0.270012 -0.697476 0.390481 -0.156619 1.319890
9.200000 3.676881 -0.276089 -0.637644 0.362426 -0.147917 1.436343
9.233333 3.688063 -0.281277 -0.583408 0.335244 -0.134252 1.540193
9.266667 3.698696 -0.286630 -0.518078 0.307849 -0.115683 1.655533
9.300000 3.709281 -0.290639 -0.467093 0.279555 -0.092579 1.797845
9.333333 3.719320 -0.294793 -0.423953 0.249680 -0.065313 1.978051
9.366667 3.728815 -0.299081 -0.388425 0.218015 -0.034735 2.190964
9.400000 3.736996 -0.300986 -0.341756 0.184319 -0.001754 2.423950
9.433333 3.743041 -0.300030 -0.281672 0.149145 0.032065 2.654099
9.466667 3.748553 -0.299190 -0.203056 0.112963 0.065563 2.850953
9.500000 3.750948 -0.294885 -0.097799 0.076386 0.097882 2.977224
9.533333 3.752822 -0.290693 0.041197 0.040029 0.128169 2.999106
9.566667 3.751364 -0.282778 0.204680 0.004343 0.155573 2.889793
9.600000 3.749407 -0.274981 0.380595 -0.030490 0.179573 2.636875
9.633333 3.746964 -0.267309 0.557744 -0.064986 0.200314 2.240982
9.666667 3.744048 -0.259766 0.698454 -0.099553 0.217529 1.715756
9.700000 3.740672 -0.252356 0.787247 -0.134785 0.231221 1.087837
9.733333 3.736851 -0.245086 0.788668 -0.171272 0.241395 0.395954
9.766667 3.732598 -0.237961 0.751505 -0.209830 0.248494 -0.310860
9.800000 3.726236 -0.228992 0.680381 -0.250685 0.252624 -0.982455
9.833333 3.717734 -0.218941 0.587484 -0.293409 0.253669 -1.573516
9.866667 3.708849 -0.209055 0.508308 -0.337278 0.251609 -2.050585
9.900000 3.697453 -0.199051 0.382010 -0.381317 0.246210 -2.385295
9.933333 3.683407 -0.189434 0.239343 -0.424123 0.237000 -2.568606
9.966667 3.666822 -0.180769 0.120316 -0.463512 0.223350 -2.602602
10.000000 3.647839 -0.173324 0.014641 -0.497608 0.205037 -2.499649
10.033333 3.628593 -0.166085 -0.099320 -0.525010 0.181987 -2.275337
10.066667 3.609115 -0.159058 -0.167101 -0.544224 0.154381 -1.943439
10.100000 3.588058 -0.154131 -0.248667 -0.554007 0.122612 -1.525312
10.133333 3.566828 -0.149426 -0.309926 -0.553981 0.087559 -1.042245
10.166667 3.545457 -0.144948 -0.354135 -0.544393 0.050348 -0.513779
10.200000 3.525006 -0.143622 -0.374859 -0.525320 0.012142 0.039999
10.233333 3.504474 -0.142528 -0.368094 -0.496704 -0.026001 0.595431
10.266667 3.486713 -0.144748 -0.322514 -0.459550 -0.062708 1.124670
10.300000 3.472636 -0.150110 -0.265591 -0.414760 -0.096462 1.598654
10.333333 3.458558 -0.155694 -0.181322 -0.362821 -0.125985 1.994626
10.366667 3.444500 -0.161493 -0.088822 -0.304706 -0.150277 2.293521
10.400000 3.435898 -0.169299 0.041412 -0.242455 -0.168840 2.490692
10.433333 3.427354 -0.177305 0.172435 -0.178112 -0.181185 2.590803
10.466667 3.418886 -0.185503 0.301410 -0.112524 -0.187316 2.604097
10.500000 3.416365 -0.193343 0.419003 -0.047054 -0.187977 2.549714
10.533333 3.419670 -0.199876 0.527280 0.016461 -0.184040 2.444225
10.566667 3.423077 -0.206577 0.614359 0.076719 -0.176311 2.298430
10.600000 3.426587 -0.213439 0.663366 0.133720 -0.165532 2.107921
10.633333 3.435828 -0.217531 0.663665 0.186994 -0.152693 1.869504
10.666667 3.445170 -0.221774 0.667048 0.235177 -0.138956 1.585184
10.700000 3.454608 -0.226164 0.678443 0.277539 -0.125284 1.256024
10.733333 3.464139 -0.230697 0.820968 0.314311 -0.112396 0.883609
10.766667 3.473757 -0.235369 0.962116 0.345635 -0.101059 0.476609
10.800000 3.486784 -0.238086 1.022862 0.370793 -0.092212 0.052502
10.833333 3.502044 -0.239366 1.044289 0.389712 -0.086568 -0.375510
10.866667 3.517365 -0.240781 0.999398 0.402823 -0.084510 -0.792434
10.900000 3.533317 -0.242016 0.892090 0.410369 -0.086205 -1.176910
10.933333 3.549305 -0.243386 0.783770 0.411990 -0.092001 -1.497576
10.966667 3.565318 -0.244891 0.685681 0.407239 -0.102234 -1.727888
11.000000 3.579996 -0.247471 0.573233 0.396611 -0.116514 -1.850196
11.033333 3.592923 -0.251580 0.461678 0.380739 -0.133981 -1.854786
11.066667 3.605841 -0.255822 0.397771 0.360019 -0.153757 -1.748353
11.100000 3.618740 -0.260195 0.335304 0.334962 -0.174755 -1.553510
11.133333 3.630002 -0.266453 0.278816 0.306406 -0.195541 -1.303696
11.166667 3.639742 -0.274471 0.251792 0.275565 -0.214445 -1.031580
11.200000 3.649440 -0.282607 0.223366 0.243040 -0.230274 -0.767624
11.233333 3.657479 -0.291882 0.222644 0.209317 -0.242425 -0.534640
11.266667 3.663909 -0.301934 0.230986 0.175272 -0.250424 -0.340449
11.300000 3.668581 -0.312341 0.238580 0.141958 -0.254093 -0.185116
11.333333 3.673197 -0.322835 0.260767 0.110276 -0.253968 -0.064482
11.366667 3.675899 -0.332665 0.267301 0.080957 -0.251056 0.028988
11.400000 3.676987 -0.341487 0.271786 0.054932 -0.246389 0.106072
11.433333 3.676712 -0.349173 0.274109 0.032891 -0.240989 0.177473
11.466667 3.675512 -0.355877 0.256084 0.015197 -0.236209 0.246578
11.500000 3.673861 -0.361968 0.252040 0.001844 -0.233399 0.315430
11.533333 3.672424 -0.368058 0.244550 -0.007332 -0.233302 0.385503
11.566667 3.671352 -0.374818 0.254727 -0.012753 -0.236291 0.453026
11.600000 3.670256 -0.381621 0.289541 -0.015086 -0.242549 0.512050
11.633333 3.669140 -0.388463 0.319329 -0.015014 -0.252104 0.557916
11.666667 3.669193 -0.397603 0.351700 -0.013268 -0.264145 0.587894
11.700000 3.669236 -0.406771 0.388935 -0.010438 -0.277700 0.602945
11.733333 3.669272 -0.415961 0.429976 -0.006974 -0.291976 0.603747
11.766667 3.669305 -0.425166 0.464467 -0.003109 -0.306343 0.593442
11.800000 3.669207 -0.437024 0.471622 0.001184 -0.319845 0.577935
11.833333 3.669114 -0.448881 0.471700 0.005963 -0.331465 0.560784
11.866667 3.669030 -0.460728 0.463786 0.011586 -0.340629 0.546422
11.900000 3.668958 -0.472555 0.467161 0.018302 -0.346869 0.535595
11.933333 3.668903 -0.484352 0.482739 0.026343 -0.349725 0.529312
11.966667 3.669312 -0.497079 0.510077 0.035866 -0.348611 0.527760
12.000000 3.670331 -0.510038 0.533555 0.046725 -0.343752 0.531213
12.033333 3.672194 -0.522643 0.568386 0.058874 -0.335270 0.538701
12.066667 3.674085 -0.535179 0.606529 0.071946 -0.323516 0.544993
12.100000 3.676003 -0.547635 0.634425 0.085729 -0.308646 0.545249
12.133333 3.679343 -0.557632 0.637400 0.099897 -0.291013 0.535813
12.166667 3.682713 -0.567532 0.643110 0.114194 -0.271138 0.513381
12.200000 3.687719 -0.574973 0.645419 0.128364 -0.249278 0.473114
12.233333 3.692752 -0.582304 0.648829 0.142020 -0.226077 0.414101
12.266667 3.697810 -0.589521 0.671141 0.154912 -0.201984 0.341547
12.300000 3.702890 -0.596619 0.694326 0.166362 -0.177770 0.264954
12.333333 3.707991 -0.603594 0.731974 0.175923 -0.153812 0.191521
12.366667 3.714690 -0.607851 0.768880 0.182744 -0.130612 0.128635
12.400000 3.721402 -0.611979 0.773577 0.186386 -0.108431 0.084453
12.433333 3.729176 -0.613857 0.745894 0.186242 -0.087492 0.065127
12.466667 3.736953 -0.615606 0.721342 0.181630 -0.067993 0.072248
12.500000 3.744729 -0.617229 0.685688 0.172473 -0.050001 0.102712
12.533333 3.751363 -0.617663 0.662470 0.158765 -0.033870 0.151678
12.566667 3.757986 -0.617975 0.653446 0.141427 -0.019561 0.212860
12.600000 3.764593 -0.618169 0.661115 0.121158 -0.007142 0.275339
12.633333 3.768128 -0.617866 0.687128 0.099378 0.003602 0.326049
12.666667 3.771641 -0.617452 0.749376 0.077673 0.012836 0.354167
12.700000 3.772268 -0.616793 0.796349 0.057602 0.020717 0.349916
12.733333 3.772874 -0.616028 0.833704 0.040361 0.027585 0.307596
12.766667 3.771725 -0.614900 0.852922 0.026553 0.033593 0.227405
12.800000 3.769578 -0.613385 0.851592 0.016855 0.038873 0.117464
12.833333 3.767502 -0.611588 0.839946 0.011554 0.043352 -0.006997
