t x y theta dxdt dydt dthetadt
0.000000 0.000000 0.000000 0.258444 -0.000754 -0.005789 -0.011818
0.033333 0.000182 -0.000135 0.254875 -0.001818 -0.009155 -0.024840
0.066667 0.000338 -0.000430 0.259555 -0.003347 -0.014250 -0.040909
0.100000 0.000030 -0.000462 0.251798 -0.005357 -0.021827 -0.058457
0.133333 0.000090 -0.000613 0.257293 -0.007935 -0.032571 -0.075191
0.166667 -0.000162 -0.000927 0.253916 -0.011245 -0.047358 -0.087134
0.200000 -0.000442 -0.001415 0.255272 -0.015280 -0.066630 -0.088947
0.233333 -0.000989 -0.002467 0.254485 -0.019896 -0.090480 -0.073861
0.266667 -0.001339 -0.004105 0.250525 -0.025017 -0.119062 -0.041466
0.300000 -0.001717 -0.005927 0.231465 -0.030662 -0.152039 0.008093
0.333333 -0.002562 -0.010366 0.218728 -0.036727 -0.188895 0.073048
0.366667 -0.004285 -0.017587 0.187239 -0.043200 -0.228636 0.149757
0.400000 -0.006030 -0.024990 0.204538 -0.050133 -0.270490 0.230077
0.433333 -0.007972 -0.035970 0.224655 -0.057828 -0.313689 0.302361
0.466667 -0.009927 -0.047120 0.249040 -0.066458 -0.357338 0.358346
0.500000 -0.012204 -0.061041 0.269409 -0.076080 -0.400445 0.391477
0.533333 -0.014488 -0.075113 0.293157 -0.086860 -0.442428 0.395508
0.566667 -0.016859 -0.091071 0.328548 -0.098762 -0.482851 0.366028
0.600000 -0.019797 -0.108312 0.353433 -0.111804 -0.521551 0.308140
0.633333 -0.023122 -0.126861 0.382878 -0.125645 -0.558369 0.229045
0.666667 -0.026439 -0.145508 0.394996 -0.140011 -0.593209 0.140510
0.700000 -0.031767 -0.166407 0.382940 -0.154476 -0.626515 0.051215
0.733333 -0.037076 -0.187372 0.363357 -0.168526 -0.658616 -0.025990
0.766667 -0.044398 -0.211860 0.343983 -0.181589 -0.689813 -0.079502
0.800000 -0.051683 -0.236376 0.314273 -0.192902 -0.719842 -0.101848
0.833333 -0.058925 -0.260899 0.325143 -0.201922 -0.748648 -0.091648
0.866667 -0.066115 -0.285405 0.304741 -0.208110 -0.776176 -0.050365
0.900000 -0.073246 -0.309874 0.302333 -0.211296 -0.802054 0.014365
0.933333 -0.081513 -0.338705 0.292284 -0.211310 -0.825360 0.093225
0.966667 -0.089699 -0.367449 0.292982 -0.208322 -0.845610 0.175608
1.000000 -0.097795 -0.396080 0.309284 -0.202728 -0.862624 0.246633
1.033333 -0.104991 -0.426768 0.333869 -0.194920 -0.875700 0.301001
1.066667 -0.111476 -0.458374 0.355344 -0.185317 -0.883759 0.327420
1.100000 -0.117844 -0.489778 0.380158 -0.174270 -0.885920 0.324161
1.133333 -0.123060 -0.520776 0.407159 -0.162343 -0.881806 0.287007
1.166667 -0.128146 -0.551511 0.416569 -0.149932 -0.870756 0.213425
1.200000 -0.133093 -0.581954 0.441075 -0.137284 -0.851802 0.108604
1.233333 -0.136936 -0.610933 0.429829 -0.124568 -0.824600 -0.023291
1.266667 -0.140632 -0.639562 0.434233 -0.111821 -0.789287 -0.173074
1.300000 -0.144177 -0.667810 0.433829 -0.098957 -0.745665 -0.332303
1.333333 -0.147566 -0.695651 0.419894 -0.085669 -0.693844 -0.487889
1.366667 -0.150277 -0.720143 0.406743 -0.071599 -0.634125 -0.624954
1.400000 -0.152551 -0.740697 0.378328 -0.056409 -0.567608 -0.734534
1.433333 -0.154665 -0.760771 0.328092 -0.039689 -0.495337 -0.810777
1.466667 -0.156337 -0.776183 0.292325 -0.021014 -0.418752 -0.848540
1.500000 -0.157848 -0.791080 0.224954 0.000267 -0.339587 -0.843224
1.533333 -0.158404 -0.801839 0.194551 0.024985 -0.259347 -0.802494
1.566667 -0.157489 -0.808112 0.159253 0.053766 -0.179497 -0.736051
1.600000 -0.155419 -0.810312 0.129209 0.086983 -0.101112 -0.651083
1.633333 -0.152733 -0.809042 0.088852 0.124694 -0.025487 -0.556811
1.666667 -0.149899 -0.807221 0.091995 0.166612 0.046753 -0.462988
1.700000 -0.145839 -0.804137 0.104914 0.211942 0.115009 -0.382420
1.733333 -0.139948 -0.799322 0.104489 0.259250 0.178786 -0.315882
1.766667 -0.132136 -0.792702 0.114112 0.307304 0.238234 -0.265887
1.800000 -0.121363 -0.783595 0.121051 0.354950 0.293936 -0.235343
1.833333 -0.106878 -0.771592 0.104021 0.400960 0.346871 -0.225640
1.866667 -0.088547 -0.756663 0.078550 0.443935 0.397733 -0.233815
1.900000 -0.070142 -0.741216 0.055766 0.482585 0.447100 -0.253309
1.933333 -0.051684 -0.725266 0.050369 0.516023 0.495630 -0.282737
1.966667 -0.033190 -0.708829 0.043098 0.543387 0.543325 -0.318710
2.000000 -0.014679 -0.691919 0.049084 0.563958 0.589724 -0.360892
2.033333 0.005596 -0.671747 0.048972 0.577221 0.634147 -0.408670
2.066667 0.025844 -0.651136 0.032023 0.583252 0.676116 -0.465435
2.100000 0.047069 -0.626870 0.010454 0.581982 0.714916 -0.534476
2.133333 0.068608 -0.599835 0.003786 0.573097 0.749462 -0.612913
2.166667 0.090047 -0.572428 -0.023591 0.556230 0.778838 -0.694773
2.200000 0.110500 -0.543530 -0.050528 0.530892 0.802224 -0.770517
2.233333 0.129849 -0.513869 -0.071023 0.496765 0.819289 -0.830941
2.266667 0.147506 -0.484108 -0.097772 0.453357 0.829620 -0.864949
2.300000 0.164979 -0.454087 -0.139267 0.400844 0.833531 -0.864810
2.333333 0.180016 -0.424991 -0.181110 0.340208 0.832036 -0.827671
2.366667 0.192208 -0.397349 -0.227650 0.272391 0.826346 -0.757781
2.400000 0.201932 -0.369614 -0.291067 0.198940 0.817863 -0.657296
2.433333 0.208005 -0.342598 -0.334486 0.121811 0.807732 -0.529234
2.466667 0.209818 -0.316752 -0.332796 0.043462 0.797195 -0.382988
2.500000 0.211388 -0.290814 -0.325732 -0.034021 0.787154 -0.226222
2.533333 0.208273 -0.265313 -0.320257 -0.108825 0.777803 -0.067555
2.566667 0.200684 -0.240098 -0.312812 -0.178510 0.768680 0.089164
2.600000 0.189257 -0.215000 -0.297893 -0.240771 0.758770 0.234718
2.633333 0.177612 -0.189915 -0.292586 -0.294037 0.747026 0.362749
2.666667 0.165763 -0.164865 -0.262132 -0.337591 0.732198 0.474972
2.700000 0.150551 -0.139206 -0.256563 -0.370460 0.712983 0.575770
2.733333 0.135164 -0.113628 -0.233192 -0.392435 0.688601 0.668382
2.766667 0.118944 -0.089220 -0.210517 -0.403954 0.658625 0.754323
2.800000 0.102584 -0.064936 -0.191728 -0.406367 0.623451 0.839092
2.833333 0.086100 -0.040799 -0.161205 -0.400807 0.583465 0.923728
2.866667 0.070724 -0.019861 -0.122892 -0.387971 0.539244 1.006219
2.900000 0.057443 -0.002678 -0.091884 -0.369156 0.491701 1.077387
2.933333 0.047040 0.009297 -0.046381 -0.345348 0.441913 1.131111
2.966667 0.036587 0.021074 -0.013147 -0.317981 0.391470 1.164659
3.000000 0.026093 0.032647 0.030431 -0.287950 0.341552 1.169971
3.033333 0.015571 0.044008 0.088718 -0.256144 0.293347 1.143985
3.066667 0.005031 0.055150 0.144313 -0.223676 0.247888 1.086159
3.100000 -0.000394 0.060339 0.180215 -0.191695 0.206220 1.002649
3.133333 -0.005814 0.065308 0.239344 -0.161057 0.168675 0.897877
3.166667 -0.011223 0.070055 0.272122 -0.132106 0.135220 0.774794
3.200000 -0.014058 0.072530 0.295410 -0.105394 0.105988 0.641549
3.233333 -0.015488 0.073860 0.298282 -0.081592 0.081190 0.507979
3.266667 -0.015753 0.074466 0.301937 -0.061345 0.061165 0.380746
3.300000 -0.016146 0.074909 0.305266 -0.044481 0.045471 0.263873
3.333333 -0.016515 0.075148 0.302245 -0.030961 0.033956 0.163492
3.366667 -0.016755 0.075273 0.300344 -0.020785 0.026411 0.082783
3.400000 -0.016912 0.075364 0.306290 -0.013559 0.022247 0.023241
3.433333 -0.017127 0.075702 0.307042 -0.008664 0.020651 -0.018722
3.466667 -0.017387 0.076343 0.303343 -0.005269 0.020636 -0.046833
3.500000 -0.017581 0.077244 0.298482 -0.003003 0.021624 -0.064213
