t x y theta dxdt dydt dthetadt
0.000000 0.000000 0.000000 0.751917 -0.000750 0.004393 -0.009390
0.033333 -0.000438 -0.000174 0.753132 -0.001919 -0.000527 -0.005758
0.066667 -0.000825 -0.000151 0.753300 -0.003536 -0.006949 -0.001662
0.100000 -0.000776 -0.000033 0.757972 -0.005684 -0.014952 0.002856
0.133333 -0.000286 0.000027 0.761429 -0.008427 -0.024507 0.005588
0.166667 -0.000112 -0.000382 0.756616 -0.011788 -0.035580 0.013448
0.200000 -0.000265 -0.001271 0.756769 -0.016085 -0.048406 0.023516
0.233333 -0.000753 -0.002657 0.757594 -0.021904 -0.063624 0.035297
0.266667 -0.001586 -0.004553 0.759173 -0.029823 -0.081812 0.047544
0.300000 -0.002771 -0.006973 0.746877 -0.040492 -0.103841 0.060919
0.333333 -0.003557 -0.010514 0.759976 -0.054542 -0.130526 0.075741
0.366667 -0.004714 -0.014605 0.760019 -0.072596 -0.162675 0.083145
0.400000 -0.006250 -0.019258 0.762647 -0.094756 -0.200474 0.085405
0.433333 -0.008173 -0.024487 0.761936 -0.120771 -0.243756 0.086166
0.466667 -0.010492 -0.030304 0.765492 -0.150529 -0.292672 0.090049
0.500000 -0.013215 -0.036719 0.805175 -0.183581 -0.346645 0.094961
0.533333 -0.019083 -0.047743 0.804338 -0.219182 -0.404888 0.105667
0.566667 -0.028245 -0.063408 0.794566 -0.256440 -0.466402 0.126868
0.600000 -0.037818 -0.079696 0.786065 -0.294691 -0.530519 0.158011
0.633333 -0.050158 -0.101216 0.772468 -0.333284 -0.595954 0.195112
0.666667 -0.062904 -0.123357 0.773885 -0.371546 -0.660914 0.229869
0.700000 -0.076053 -0.146116 0.778808 -0.409206 -0.724008 0.265834
0.733333 -0.089600 -0.169489 0.788009 -0.446515 -0.784465 0.294991
0.766667 -0.105145 -0.197352 0.810992 -0.483996 -0.841559 0.312477
0.800000 -0.122443 -0.229096 0.847397 -0.522101 -0.894246 0.316858
0.833333 -0.140117 -0.261428 0.864738 -0.561329 -0.942412 0.305157
0.866667 -0.158159 -0.294333 0.897630 -0.601955 -0.986142 0.281983
0.900000 -0.177711 -0.329356 0.909526 -0.643750 -1.025360 0.244941
0.933333 -0.197610 -0.364923 0.908515 -0.686093 -1.059704 0.200430
0.966667 -0.220711 -0.402005 0.905106 -0.728010 -1.089264 0.155406
1.000000 -0.246605 -0.440097 0.882676 -0.768468 -1.114741 0.116054
1.033333 -0.275253 -0.478900 0.886849 -0.806271 -1.136521 0.092308
1.066667 -0.304183 -0.518182 0.878976 -0.839971 -1.155072 0.091071
1.100000 -0.334810 -0.557384 0.882087 -0.868221 -1.171188 0.115198
1.133333 -0.366158 -0.596428 0.909661 -0.889921 -1.185616 0.160927
1.166667 -0.397722 -0.635896 0.887977 -0.904445 -1.198897 0.225578
1.200000 -0.430393 -0.675790 0.895634 -0.911435 -1.211333 0.299885
1.233333 -0.463229 -0.716071 0.899621 -0.911254 -1.223202 0.375116
1.266667 -0.494287 -0.757221 0.907534 -0.905130 -1.234659 0.438322
1.300000 -0.525461 -0.798719 0.926176 -0.895172 -1.245512 0.481105
1.333333 -0.556726 -0.840544 0.952826 -0.883804 -1.255453 0.502260
1.366667 -0.588059 -0.882679 0.987944 -0.873213 -1.264091 0.493971
1.400000 -0.615715 -0.925600 1.036321 -0.866157 -1.270864 0.456152
1.433333 -0.641237 -0.968820 1.058597 -0.864755 -1.275309 0.389354
1.466667 -0.666343 -1.012066 1.075949 -0.870523 -1.277115 0.300190
1.500000 -0.691439 -1.055537 1.086096 -0.884231 -1.276073 0.197419
1.533333 -0.716506 -1.099214 1.089541 -0.906368 -1.272082 0.085962
1.566667 -0.745191 -1.142349 1.089648 -0.937110 -1.265099 -0.025301
1.600000 -0.773809 -1.185652 1.079929 -0.975295 -1.255364 -0.128724
1.633333 -0.806777 -1.227639 1.044024 -1.019625 -1.243029 -0.217284
1.666667 -0.843497 -1.268571 1.026847 -1.068561 -1.228270 -0.290119
1.700000 -0.880072 -1.309622 1.009782 -1.120511 -1.211369 -0.348643
1.733333 -0.920241 -1.349606 0.999628 -1.172984 -1.192868 -0.392243
1.766667 -0.960198 -1.389678 0.989808 -1.224097 -1.173189 -0.419610
1.800000 -0.999906 -1.429822 0.995001 -1.272504 -1.152448 -0.433253
1.833333 -1.042914 -1.467785 0.982009 -1.316890 -1.131008 -0.438036
1.866667 -1.091017 -1.504225 0.967048 -1.356084 -1.109049 -0.434335
1.900000 -1.138751 -1.540703 0.937547 -1.388619 -1.086691 -0.420988
1.933333 -1.186071 -1.577207 0.906704 -1.414116 -1.063728 -0.398394
1.966667 -1.236476 -1.611882 0.894786 -1.431037 -1.039911 -0.369375
2.000000 -1.286372 -1.646566 0.881243 -1.438034 -1.015324 -0.330253
2.033333 -1.337872 -1.679488 0.855501 -1.433194 -0.989548 -0.274461
2.066667 -1.388762 -1.712403 0.859705 -1.415379 -0.962272 -0.197909
2.100000 -1.438991 -1.745306 0.858564 -1.384122 -0.933372 -0.096236
2.133333 -1.487428 -1.776179 0.849925 -1.337799 -0.902772 0.036793
2.166667 -1.535106 -1.807027 0.858657 -1.276526 -0.870607 0.212854
2.200000 -1.580902 -1.836231 0.858583 -1.200432 -0.836982 0.438765
2.233333 -1.622971 -1.863401 0.848830 -1.111304 -0.802367 0.715409
2.266667 -1.664141 -1.890536 0.860309 -1.010098 -0.767087 1.041375
2.300000 -1.697590 -1.914528 0.861504 -0.897959 -0.731475 1.411043
2.333333 -1.730064 -1.938485 0.885552 -0.777780 -0.695936 1.802520
2.366667 -1.750520 -1.959466 0.958080 -0.652566 -0.661050 2.183728
2.400000 -1.769949 -1.980418 1.037491 -0.525158 -0.627246 2.520128
2.433333 -1.788330 -2.001350 1.136866 -0.397809 -0.595097 2.775247
2.466667 -1.794263 -2.019634 1.273335 -0.274327 -0.565687 2.919944
2.500000 -1.799126 -2.037911 1.439711 -0.157677 -0.540034 2.923928
2.533333 -1.802913 -2.056189 1.610481 -0.049916 -0.519523 2.783059
2.566667 -1.799674 -2.072241 1.786137 0.048364 -0.505528 2.507055
2.600000 -1.791690 -2.086576 1.916207 0.136200 -0.499465 2.114125
2.633333 -1.780849 -2.099944 2.031247 0.212739 -0.502395 1.636336
2.666667 -1.769180 -2.112936 2.040477 0.279364 -0.514826 1.110743
2.700000 -1.757040 -2.126419 2.030249 0.337134 -0.537253 0.584458
2.733333 -1.743952 -2.141404 1.999276 0.387100 -0.569320 0.093646
2.766667 -1.729778 -2.158921 1.933534 0.430310 -0.609613 -0.331979
2.800000 -1.714594 -2.176553 1.882285 0.468426 -0.656536 -0.670851
2.833333 -1.698288 -2.197799 1.812336 0.503388 -0.708484 -0.911965
2.866667 -1.680972 -2.223321 1.758677 0.536185 -0.763852 -1.059312
2.900000 -1.662474 -2.253471 1.727816 0.567603 -0.820132 -1.127383
2.933333 -1.643013 -2.283757 1.684750 0.598415 -0.875393 -1.134283
2.966667 -1.622602 -2.314178 1.668976 0.628928 -0.928914 -1.099427
3.000000 -1.601257 -2.344732 1.628828 0.659144 -0.980120 -1.039690
3.033333 -1.578377 -2.380748 1.597457 0.688917 -1.028154 -0.969168
3.066667 -1.554593 -2.416886 1.566409 0.718059 -1.072473 -0.896347
3.100000 -1.529922 -2.453139 1.526971 0.746516 -1.113697 -0.823708
3.133333 -1.504381 -2.489497 1.498627 0.774242 -1.152328 -0.749609
3.166667 -1.478185 -2.528982 1.464218 0.801199 -1.187934 -0.674358
3.200000 -1.450771 -2.571045 1.451631 0.827494 -1.220081 -0.598087
3.233333 -1.422539 -2.613177 1.440910 0.853389 -1.249161 -0.520945
3.266667 -1.393510 -2.655365 1.404884 0.879174 -1.275430 -0.440456
3.300000 -1.363672 -2.700502 1.415246 0.905208 -1.298469 -0.361144
3.333333 -1.333075 -2.745659 1.391529 0.931976 -1.317780 -0.283847
3.366667 -1.301738 -2.790819 1.392927 0.959930 -1.333616 -0.209052
3.400000 -1.269683 -2.835963 1.391549 0.989225 -1.346244 -0.136076
3.433333 -1.236931 -2.881072 1.383762 1.019918 -1.355418 -0.065231
3.466667 -1.203505 -2.926127 1.389293 1.052173 -1.360797 0.000375
3.500000 -1.169425 -2.971108 1.377140 1.085976 -1.362659 0.069057
3.533333 -1.132548 -3.018443 1.372936 1.120867 -1.361113 0.137942
3.566667 -1.094170 -3.065329 1.390409 1.156326 -1.356047 0.207625
3.600000 -1.055213 -3.112078 1.402381 1.192069 -1.347309 0.276344
3.633333 -1.014634 -3.157886 1.401607 1.227644 -1.335024 0.342774
3.666667 -0.972020 -3.202573 1.428542 1.262267 -1.319593 0.403771
3.700000 -0.928910 -3.247061 1.442490 1.295276 -1.301120 0.448501
3.733333 -0.885337 -3.291330 1.449614 1.326545 -1.280315 0.473578
3.766667 -0.840041 -3.333851 1.461724 1.355987 -1.257964 0.477920
3.800000 -0.793084 -3.374935 1.496284 1.383236 -1.235029 0.459561
3.833333 -0.745763 -3.415745 1.529980 1.408278 -1.212370 0.418377
3.866667 -0.698260 -3.454746 1.558732 1.431471 -1.190722 0.359712
3.900000 -0.650461 -3.493441 1.586191 1.453101 -1.170808 0.288419
3.933333 -0.601343 -3.531359 1.585625 1.473201 -1.153079 0.211479
3.966667 -0.551220 -3.568722 1.580578 1.491908 -1.137823 0.129676
4.000000 -0.500909 -3.605738 1.579828 1.509661 -1.125091 0.052207
4.033333 -0.449991 -3.642427 1.566613 1.526399 -1.114730 -0.015730
4.066667 -0.398697 -3.679050 1.548352 1.541889 -1.106383 -0.072013
4.100000 -0.347374 -3.715281 1.554898 1.555797 -1.099621 -0.112835
4.133333 -0.296012 -3.751111 1.532309 1.567659 -1.093727 -0.140470
4.166667 -0.242306 -3.787964 1.536045 1.576795 -1.087854 -0.154382
4.200000 -0.188638 -3.824386 1.544542 1.582322 -1.081198 -0.160750
4.233333 -0.135050 -3.860362 1.530066 1.583719 -1.073091 -0.164115
4.266667 -0.080714 -3.896703 1.529543 1.580458 -1.062980 -0.169771
4.300000 -0.026303 -3.933147 1.512780 1.572031 -1.050250 -0.177824
4.333333 0.027907 -3.969098 1.520655 1.558292 -1.034597 -0.190844
4.366667 0.081328 -4.004479 1.514143 1.539186 -1.015870 -0.208072
4.400000 0.134468 -4.039337 1.508540 1.514864 -0.994035 -0.228748
4.433333 0.185550 -4.072780 1.504050 1.485121 -0.968875 -0.250070
4.466667 0.234049 -4.104488 1.479654 1.449719 -0.940180 -0.267239
4.500000 0.282152 -4.135634 1.471949 1.408315 -0.907736 -0.282908
4.533333 0.328603 -4.165533 1.480710 1.360490 -0.871289 -0.292072
4.566667 0.374591 -4.194848 1.455090 1.306157 -0.830782 -0.294588
4.600000 0.420083 -4.223568 1.436618 1.245136 -0.786105 -0.289144
4.633333 0.462150 -4.249807 1.438451 1.177157 -0.737188 -0.276850
4.666667 0.503659 -4.275433 1.411818 1.102210 -0.684119 -0.258160
4.700000 0.540909 -4.298510 1.403246 1.021317 -0.627634 -0.233132
4.733333 0.577549 -4.320962 1.398684 0.935304 -0.568357 -0.202277
4.766667 0.608465 -4.339815 1.398816 0.845165 -0.507007 -0.167518
4.800000 0.634557 -4.355507 1.383445 0.752246 -0.444516 -0.130625
4.833333 0.654112 -4.366463 1.392149 0.659158 -0.382550 -0.094058
4.866667 0.672997 -4.376799 1.393741 0.568350 -0.322661 -0.062981
4.900000 0.691207 -4.386519 1.377175 0.481242 -0.265839 -0.037624
4.933333 0.708740 -4.395630 1.376248 0.399350 -0.213129 -0.021152
4.966667 0.714841 -4.398505 1.385160 0.324441 -0.165757 -0.013098
5.000000 0.720267 -4.400793 1.389081 0.257575 -0.124525 -0.014019
5.033333 0.725029 -4.402505 1.394033 0.198689 -0.089351 -0.021171
5.066667 0.729138 -4.403655 1.403494 0.147709 -0.060145 -0.031408
5.100000 0.732603 -4.404254 1.400740 0.104711 -0.036761 -0.043782
5.133333 0.735437 -4.404315 1.398173 0.069760 -0.019046 -0.056429
5.166667 0.734552 -4.403122 1.386888 0.041567 -0.005913 -0.067059
5.200000 0.733063 -4.401418 1.378595 0.019183 0.003516 -0.074017
5.233333 0.731881 -4.400491 1.369905 0.001809 0.009950 -0.076236
5.266667 0.730126 -4.399079 1.366221 -0.011248 0.014010 -0.071942
5.300000 0.730282 -4.399784 1.365900 -0.020738 0.016365 -0.062365
5.333333 0.729894 -4.400025 1.371215 -0.027412 0.017684 -0.048790
5.366667 0.728977 -4.399812 1.362034 -0.031693 0.018262 -0.033485
5.400000 0.727543 -4.399155 1.358913 -0.034010 0.018391 -0.018483
