t x y theta dxdt dydt dthetadt
0.000000 0.000000 0.000000 -0.183618 -0.004713 -0.005706 -0.014767
0.033333 -0.000044 -0.000120 -0.178653 -0.006577 -0.006388 -0.010816
0.066667 -0.000236 -0.000450 -0.183507 -0.009579 -0.007192 -0.000217
0.100000 -0.000495 -0.001011 -0.172740 -0.014630 -0.008307 0.016714
0.133333 -0.000856 -0.001613 -0.183801 -0.022521 -0.009945 0.040325
0.166667 -0.001318 -0.002255 -0.182005 -0.034285 -0.012320 0.071766
0.200000 -0.001741 -0.002378 -0.188736 -0.051226 -0.015660 0.104515
0.233333 -0.002091 -0.002212 -0.197999 -0.074389 -0.020222 0.134692
0.266667 -0.002799 -0.002037 -0.181601 -0.104596 -0.026127 0.154557
0.300000 -0.004285 -0.002268 -0.180496 -0.142193 -0.033377 0.163518
0.333333 -0.006369 -0.003000 -0.168325 -0.187740 -0.041993 0.157218
0.366667 -0.010197 -0.003968 -0.135993 -0.241108 -0.052034 0.133102
0.400000 -0.017132 -0.005825 -0.123475 -0.301230 -0.063338 0.095261
0.433333 -0.028194 -0.008572 -0.116978 -0.367012 -0.075746 0.049592
0.466667 -0.039348 -0.011342 -0.106321 -0.437178 -0.089141 0.003429
0.500000 -0.055291 -0.014559 -0.101370 -0.509994 -0.103415 -0.040802
0.533333 -0.075479 -0.018346 -0.121834 -0.582983 -0.118378 -0.078211
0.566667 -0.095712 -0.022135 -0.149750 -0.653687 -0.133683 -0.103187
0.600000 -0.119680 -0.026461 -0.173260 -0.719531 -0.149114 -0.117852
0.633333 -0.146691 -0.031208 -0.189899 -0.776851 -0.164258 -0.127153
0.666667 -0.176162 -0.036692 -0.190405 -0.821767 -0.178519 -0.137616
0.700000 -0.207763 -0.043329 -0.185533 -0.851213 -0.191289 -0.159058
0.733333 -0.239274 -0.049924 -0.169657 -0.863128 -0.202056 -0.206116
0.766667 -0.273214 -0.057812 -0.157086 -0.855857 -0.210345 -0.294122
0.800000 -0.308812 -0.066659 -0.155599 -0.829324 -0.215738 -0.433298
0.833333 -0.344217 -0.075430 -0.152750 -0.786066 -0.218164 -0.628231
0.866667 -0.378637 -0.084266 -0.161615 -0.729269 -0.217749 -0.876114
0.900000 -0.409447 -0.092650 -0.180256 -0.662380 -0.214813 -1.161680
0.933333 -0.431923 -0.100214 -0.208805 -0.588031 -0.209268 -1.457874
0.966667 -0.440812 -0.106311 -0.253993 -0.510111 -0.201336 -1.735192
1.000000 -0.449363 -0.112318 -0.311250 -0.431139 -0.190964 -1.961827
1.033333 -0.457567 -0.118230 -0.410632 -0.352277 -0.177949 -2.108243
1.066667 -0.465415 -0.124039 -0.534528 -0.274355 -0.162048 -2.154710
1.100000 -0.472899 -0.129738 -0.659939 -0.197459 -0.142867 -2.093379
1.133333 -0.480012 -0.135322 -0.794538 -0.122054 -0.120651 -1.928009
1.166667 -0.486744 -0.140784 -0.909925 -0.046181 -0.095309 -1.669340
1.200000 -0.493089 -0.146118 -0.989425 0.030872 -0.067348 -1.338636
1.233333 -0.499040 -0.151317 -1.031270 0.110012 -0.037284 -0.965057
1.266667 -0.491520 -0.151224 -1.026299 0.190993 -0.006052 -0.577951
1.300000 -0.483599 -0.151009 -1.002679 0.273451 0.025393 -0.203397
1.333333 -0.466900 -0.146612 -0.945391 0.355819 0.055929 0.132807
1.366667 -0.449822 -0.142108 -0.898264 0.435334 0.084338 0.411259
1.400000 -0.432383 -0.137501 -0.869918 0.509932 0.109746 0.624035
1.433333 -0.414603 -0.132798 -0.843287 0.576911 0.131288 0.773002
1.466667 -0.390959 -0.126811 -0.816190 0.635036 0.148858 0.867592
1.500000 -0.367016 -0.120746 -0.784852 0.682551 0.162325 0.920620
1.533333 -0.342800 -0.114610 -0.754346 0.719572 0.172344 0.948310
1.566667 -0.315972 -0.108477 -0.734858 0.745882 0.179557 0.967305
1.600000 -0.288925 -0.102290 -0.706952 0.760914 0.184503 0.984680
1.633333 -0.259680 -0.095905 -0.668980 0.764643 0.187721 1.005152
1.666667 -0.230276 -0.089484 -0.631402 0.756873 0.189384 1.027323
1.700000 -0.201820 -0.082856 -0.592449 0.738072 0.189675 1.045511
1.733333 -0.173265 -0.076204 -0.553743 0.708022 0.188441 1.056916
1.766667 -0.147652 -0.069633 -0.528525 0.667723 0.185516 1.055715
1.800000 -0.125045 -0.063147 -0.494645 0.619171 0.180966 1.042724
1.833333 -0.104790 -0.056706 -0.432848 0.564650 0.174879 1.015447
1.866667 -0.084539 -0.050260 -0.408760 0.506792 0.167538 0.977840
1.900000 -0.068226 -0.043670 -0.352652 0.447966 0.159141 0.930395
1.933333 -0.056323 -0.038411 -0.329122 0.390805 0.149905 0.875094
1.966667 -0.044474 -0.033156 -0.298697 0.336917 0.140048 0.811543
2.000000 -0.039029 -0.029745 -0.287275 0.287561 0.129810 0.739184
2.033333 -0.033656 -0.026340 -0.269942 0.243432 0.119412 0.665294
2.066667 -0.028359 -0.022941 -0.257944 0.204664 0.108899 0.587900
2.100000 -0.023140 -0.019554 -0.221215 0.171263 0.098521 0.512636
2.133333 -0.018004 -0.016180 -0.196629 0.142709 0.088453 0.438055
2.166667 -0.012955 -0.012824 -0.178470 0.118729 0.078873 0.367296
2.200000 -0.007996 -0.009488 -0.166021 0.098279 0.069661 0.301533
2.233333 -0.005749 -0.007355 -0.177695 0.080726 0.060801 0.237927
2.266667 -0.004790 -0.006299 -0.177373 0.065579 0.052401 0.179792
2.300000 -0.003926 -0.005264 -0.165292 0.052453 0.044461 0.128255
2.333333 -0.003158 -0.004250 -0.174771 0.041146 0.037084 0.087552
2.366667 -0.002483 -0.003258 -0.149845 0.031457 0.030372 0.055426
2.400000 -0.002172 -0.002520 -0.158629 0.023652 0.024582 0.033850
2.433333 -0.001952 -0.001805 -0.168258 0.017622 0.019788 0.021106
2.466667 -0.001677 -0.001518 -0.180730 0.013054 0.015878 0.014251
2.500000 -0.001490 -0.001255 -0.173102 0.009632 0.012744 0.009700
2.533333 -0.000936 -0.001047 -0.179078 0.007105 0.010228 0.004919
