0.0333333 -0.165907 -0.169495 -0.0552618
0.0666667 -0.0573723 -0.0836227 0.0225728
0.1 0.15921 -0.0663404 -0.0044806
0.133333 -0.0289514 -0.10344 0.0445467
0.166667 0.0105861 -0.129293 0.107371
0.2 0.0227113 0.177658 -0.0151009
0.233333 -0.00654744 -0.158394 0.0946847
0.266667 -0.035892 0.00984725 0.0501346
0.3 0.0960254 -0.00288635 0.0938438
0.333333 0.121245 -0.0264013 0.104614
0.366667 0.0592848 -0.144834 0.125764
0.4 0.140526 0.174712 0.102404
0.433333 -0.0860607 0.102174 0.167955
0.466667 0.111899 -0.17084 0.162261
0.5 0.02015 -0.0601868 0.193558
0.533333 0.222308 -0.0366077 0.130692
0.566667 0.0502759 -0.0188751 0.213452
0.6 0.0919663 0.0413202 0.20817
0.633333 0.0630384 -0.26226 0.22506
0.666667 0.198707 0.0586953 0.298749
0.7 0.0909962 -0.0250369 0.235216
0.733333 0.250747 0.018851 0.330819
0.766667 0.157494 0.0812842 0.285965
0.8 0.0826287 0.0141511 0.314006
0.833333 0.0629701 0.0450767 0.338894
0.866667 0.115933 0.013425 0.378699
0.9 -0.0456381 0.107321 0.286149
0.933333 -0.0659234 -0.0907237 0.322956
0.966667 0.116801 -0.0865575 0.385651
1 0.0143108 -0.0193155 0.332997
1.03333 0.0507606 -0.0613821 0.455416
1.06667 0.134168 -0.147979 0.364414
1.1 0.124935 0.16814 0.388739
1.13333 0.158137 0.166352 0.442257
1.16667 0.151064 0.0542457 0.414007
1.2 0.245101 0.0862422 0.458663
1.23333 0.213996 -0.108153 0.368071
1.26667 0.0980162 0.033978 0.477295
1.3 0.0558028 0.00642007 0.445684
1.33333 0.0549005 -0.115551 0.510596
1.36667 0.127703 -0.0259236 0.50301
1.4 0.0175931 0.0085043 0.496147
1.43333 0.20921 0.174187 0.473539
1.46667 0.0817252 0.0686673 0.528191
1.5 0.0654062 0.0814394 0.487112
1.53333 0.0724895 0.278882 0.534723
1.56667 0.236129 -0.0764835 0.555295
1.6 0.169926 -0.0251056 0.557761
1.63333 0.301001 0.192896 0.553486
1.66667 0.356535 0.229973 0.549583
1.7 0.174061 0.052007 0.601396
1.73333 0.0701044 0.135147 0.618004
1.76667 0.103104 0.0549979 0.621857
1.8 0.117752 -0.0451757 0.577874
1.83333 0.126223 -0.0155477 0.600157
1.86667 0.159804 0.150086 0.641175
1.9 0.388717 0.0392831 0.696957
1.93333 0.196414 0.145177 0.691224
1.96667 0.043352 0.111838 0.758956
2 0.247218 0.0988391 0.683242
2.03333 0.246139 0.195464 0.633629
2.06667 0.189931 0.0925612 0.654092
2.1 0.034803 0.033628 0.709607
2.13333 0.144286 0.126132 0.768339
2.16667 0.0353952 0.094625 0.789165
2.2 0.0569507 -0.0495564 0.804855
2.23333 0.291403 0.132696 0.76541
2.26667 0.124658 0.240434 0.76397
2.3 0.29462 0.0770956 0.684812
2.33333 0.292619 0.0228214 0.791902
2.36667 0.0245498 0.109471 0.908305
2.4 0.102212 0.196278 0.861691
2.43333 0.125113 0.0390808 0.795439
2.46667 0.381665 0.139044 0.791183
2.5 0.201337 -0.0484449 0.862945
2.53333 0.345632 0.137092 0.87147
2.56667 0.0880274 0.0121855 0.937594
2.6 0.221499 0.320805 0.896617
2.63333 0.281923 0.247695 0.911953
2.66667 0.265798 0.107836 0.918784
2.7 0.200386 -0.0411308 0.96185
2.73333 0.178318 0.153921 0.953016
2.76667 0.182146 0.0815213 0.948087
2.8 0.31546 0.201229 0.94231
2.83333 0.194807 0.00423943 0.917818
2.86667 0.351324 -0.00230054 1.04866
2.9 0.25016 0.0388734 0.957605
2.93333 0.317499 0.157525 1.00796
2.96667 0.377987 0.146258 1.01041
3 0.219644 0.291204 1.06854
3.03333 0.0600497 0.162819 1.06368
3.06667 0.342044 0.091623 1.09967
3.1 0.248059 0.247842 1.01079
3.13333 0.111796 0.0221372 1.04718
3.16667 0.280249 0.227691 1.07742
3.2 0.334161 0.188722 1.06796
3.23333 0.321331 0.120643 1.13423
3.26667 0.301013 0.242467 1.11264
3.3 0.374283 0.010103 1.13664
3.33333 0.15981 0.0698333 1.21316
3.36667 0.399008 0.246686 1.17499
3.4 0.293172 0.156246 1.16947
3.43333 0.279316 0.128378 1.2081
3.46667 0.263789 0.0651902 1.23804
3.5 0.207199 0.100839 1.26679
3.53333 0.387376 0.23714 1.28644
3.56667 0.320773 0.131182 1.25047
3.6 0.147809 0.0240812 1.15288
3.63333 0.425307 0.187332 1.23368
3.66667 0.24634 0.102662 1.17181
3.7 0.460269 0.268201 1.21126
3.73333 0.289015 0.205813 1.24829
3.76667 0.204575 -0.0196377 1.32538
3.8 0.270085 0.187153 1.29773
3.83333 0.335097 0.111246 1.30204
3.86667 0.350127 0.236241 1.32624
3.9 0.362231 0.062531 1.39499
3.93333 0.259653 0.184881 1.32226
3.96667 0.221523 0.22925 1.25844
4 0.48289 0.228756 1.40661
4.03333 0.136408 0.225557 1.41685
4.06667 0.159189 0.285388 1.37546
4.1 0.17113 0.400838 1.35222
4.13333 0.283288 0.0542917 1.42252
4.16667 0.286566 0.167238 1.51347
4.2 0.278235 0.491584 1.50863
4.23333 0.277224 0.165728 1.35383
4.26667 0.408208 0.070059 1.4606
4.3 0.267731 0.205892 1.42888
4.33333 0.289365 0.281082 1.49328
4.36667 0.206842 0.269611 1.50464
4.4 0.3136 0.306006 1.50417
4.43333 0.0660651 0.241835 1.5118
4.46667 0.244707 0.311406 1.57701
4.5 0.280081 0.305304 1.52839
4.53333 0.277489 0.0937669 1.63617
4.56667 0.246616 0.359832 1.5325
4.6 0.352387 0.301986 1.6555
4.63333 0.305761 0.0743662 1.54599
4.66667 0.250926 0.188744 1.62128
4.7 0.292399 0.100322 1.62051
4.73333 0.420759 0.185847 1.6272
4.76667 0.24217 0.28695 1.63919
4.8 0.328126 0.0771149 1.60991
4.83333 0.127907 0.177205 1.60516
4.86667 0.398885 0.264012 1.74112
4.9 0.352908 0.31604 1.67599
4.93333 0.213291 0.167319 1.69489
4.96667 0.0998935 0.303956 1.70105
5 0.367534 0.312196 1.75405
5.03333 0.302163 0.228002 1.73726
5.06667 0.128897 0.310285 1.72975
5.1 0.355579 0.31328 1.80243
5.13333 0.268417 0.304278 1.71699
5.16667 0.346379 0.296497 1.71434
5.2 0.322077 0.103508 1.79295
5.23333 0.185318 0.316391 1.77818
5.26667 0.227402 0.403793 1.81708
5.3 0.16471 0.107289 1.79919
5.33333 0.353973 0.256651 1.8364
5.36667 0.252949 0.195848 1.87345
5.4 0.46185 0.314337 1.86217
5.43333 0.355142 0.302762 1.85166
5.46667 0.232057 0.240041 1.88092
5.5 0.47056 0.192343 1.9042
5.53333 0.336881 0.326767 1.95221
5.56667 0.129715 0.464747 1.90675
5.6 0.295611 0.443664 1.98364
5.63333 0.287303 0.414623 2.00835
5.66667 0.324016 0.426962 1.98109
5.7 0.138825 0.402579 1.9476
5.73333 0.358946 0.322047 2.00037
5.76667 0.195204 0.246344 2.00791
5.8 0.215224 0.516712 2.06679
5.83333 0.181906 0.383714 2.03674
5.86667 0.323535 0.414404 1.96829
5.9 0.315213 0.29538 2.07777
5.93333 0.174412 0.380717 2.07592
5.96667 0.218137 0.268872 2.10294
6 0.221516 0.416723 2.08295
6.03333 0.333198 0.333803 2.11348
6.06667 0.30501 0.343638 2.13215
6.1 0.126887 0.44723 2.13585
6.13333 0.397054 0.310035 2.11392
6.16667 0.348403 0.411113 2.02888
6.2 0.314773 0.322056 2.08843
6.23333 0.255405 0.513316 2.12795
6.26667 0.30516 0.686928 2.26206
6.3 0.0425816 0.426138 2.23742
6.33333 0.233687 0.495442 2.17015
6.36667 0.185268 0.405207 2.29385
6.4 0.272882 0.413438 2.22558
6.43333 0.264033 0.56918 2.22415
6.46667 0.108846 0.375275 2.23276
6.5 0.269629 0.420513 2.25158
6.53333 0.287658 0.437609 2.33238
6.56667 0.200345 0.368364 2.34921
6.6 0.0578885 0.389419 2.24807
6.63333 0.220018 0.277506 2.26049
6.66667 0.233557 0.31327 2.2399
6.7 0.000771127 0.569007 2.33024
6.73333 0.274492 0.42602 2.31879
6.76667 0.0833516 0.545875 2.28497
6.8 0.125975 0.447615 2.29487
6.83333 0.079259 0.406197 2.35127
6.86667 0.295079 0.382052 2.39453
6.9 0.198498 0.377631 2.30606
6.93333 0.216068 0.537622 2.37745
6.96667 0.121848 0.48642 2.42371
7 0.191679 0.412752 2.4339
7.03333 0.0203635 0.470837 2.44602
7.06667 0.340435 0.641704 2.40658
7.1 0.231886 0.347584 2.41378
7.13333 0.221393 0.501378 2.48649
7.16667 0.188256 0.432079 2.49229
7.2 0.144169 0.287387 2.45816
7.23333 0.370177 0.584955 2.46286
7.26667 0.054044 0.711675 2.53577
7.3 0.00268702 0.48694 2.50034
7.33333 0.249349 0.385144 2.54296
7.36667 0.218965 0.391739 2.59156
7.4 0.343252 0.372031 2.56174
7.43333 0.345967 0.406628 2.58188
7.46667 0.105778 0.247622 2.56869
7.5 0.282228 0.452803 2.6311
7.53333 0.0450777 0.340865 2.55849
7.56667 -0.00601197 0.56006 2.59705
7.6 0.235051 0.473773 2.5879
7.63333 0.115167 0.564281 2.67082
7.66667 0.0813148 0.51655 2.69293
7.7 0.218272 0.530645 2.66556
7.73333 0.105486 0.50951 2.73364
7.76667 0.253399 0.597966 2.65558
7.8 -0.0937185 0.598119 2.69064
7.83333 0.159735 0.539844 2.71279
7.86667 0.145988 0.416983 2.78015
7.9 0.0933353 0.389533 2.73426
7.93333 0.0182675 0.615736 2.86968
7.96667 0.187583 0.392553 2.75299
8 -0.0731608 0.556599 2.82849
8.03333 0.1606 0.671917 2.78715
8.06667 0.326125 0.589607 2.85176
8.1 0.197514 0.712965 2.81642
8.13333 0.2806 0.586347 2.8436
8.16667 0.0931024 0.624056 2.9312
8.2 0.0384085 0.665284 2.82216
8.23333 0.0619955 0.541453 2.8397
8.26667 0.121753 0.703207 2.86948
8.3 0.120279 0.405248 2.82634
8.33333 0.138852 0.472987 2.86855
8.36667 0.131424 0.564035 2.96509
8.4 0.0341581 0.602087 2.94537
8.43333 -0.105546 0.588709 2.91278
8.46667 0.119893 0.526685 2.85882
8.5 0.113069 0.474622 3.0437
8.53333 0.0602189 0.529264 2.91501
8.56667 0.235158 0.47321 2.93225
8.6 0.0571951 0.373611 3.00375
8.63333 0.129488 0.38228 2.99535
8.66667 0.0773328 0.442996 3.09256
8.7 -0.00143448 0.675841 3.02333
8.73333 -0.0582782 0.609627 -3.1412
8.76667 0.0156322 0.410535 3.03461
8.8 0.158173 0.582775 3.01307
8.83333 0.051955 0.478077 3.08229
8.86667 0.152168 0.269661 3.12804
8.9 0.0771568 0.50659 3.04924
8.93333 0.0697918 0.592571 3.05858
8.96667 0.121143 0.582378 3.11434
9 -0.0519597 0.477098 -3.12731
9.03333 0.0341377 0.410764 -3.08513
9.06667 -0.0920384 0.602369 -3.06352
9.1 -0.162651 0.75051 -3.03858
9.13333 0.110116 0.545894 -3.09241
9.16667 0.0959687 0.398645 3.12799
9.2 0.112022 0.402042 -3.09182
9.23333 -0.0167683 0.632032 -3.07024
9.26667 -0.184679 0.632851 -3.00748
9.3 -0.0135856 0.680401 -3.04486
9.33333 -0.065195 0.410338 -2.92625
9.36667 -0.158434 0.438484 -3.01123
9.4 -0.129354 0.485244 -3.11736
9.43333 -0.151855 0.627516 -3.01947
9.46667 0.148159 0.62031 -3.04359
9.5 -0.0374844 0.330781 -2.98763
9.53333 -0.122929 0.488825 -2.99404
9.56667 -0.105236 0.627779 -3.00695
9.6 -0.186058 0.639812 -3.0148
9.63333 0.00218346 0.595068 -2.94904
9.66667 -0.342365 0.51951 -2.88589
9.7 0.0127813 0.620854 -2.88424
9.73333 -0.23256 0.631564 -2.91522
9.76667 0.145267 0.49108 -2.89525
9.8 -0.232709 0.380903 -2.87398
9.83333 0.0115727 0.445428 -2.93794
9.86667 -0.299103 0.57657 -2.85213
9.9 -0.203023 0.484541 -2.8759
9.93333 -0.0519004 0.442799 -2.77616
9.96667 -0.115087 0.483274 -2.75653
10 -0.142969 0.425544 -2.77411
10.0333 -0.118684 0.469138 -2.82392
