1,27
2,54
3,81
4,108
5,135
6,162
7,189
8,216
9,243
10,270
11,297
12,324
13,351
14,378
15,405
16,432
17,459
18,486
19,513
20,540
21,567
22,594
23,621
24,648
25,675
26,702
27,729
28,756
29,783
30,810
31,837
32,864
33,891
34,918
35,945
36,972
37,999
38,1026
39,1053
40,1080
41,1107
42,1134
43,1161
44,1188
45,1215
46,1242
47,1269
48,1296
49,1323
50,1350
51,1377
52,1404
53,1431
54,1458
55,1485
56,1512
57,1539
58,1566
59,1593
60,1620
61,1647
62,1674
63,1701
64,1728
65,1755
66,1782
67,1809
68,1836
69,1863
70,1890
71,1917
72,1944
73,1971
74,1998
75,2025
76,2052
77,2079
78,2106
79,2133
80,2160
81,2187
82,2214
83,2241
84,2268
85,2295
86,2322
87,2349
88,2376
89,2403
90,2430
91,2457
92,2484
93,2511
94,2538
95,2565
96,2592
97,2619
98,2646
99,2673
100,2700
101,2727
102,2754
103,2781
104,2808
105,2835
106,2862
107,2889
108,2916
109,2943
110,2970
111,2997
112,3024
113,3051
114,3078
115,3105
116,3132
117,3159
118,3186
119,3213
120,3240
121,3267
122,3294
123,3321
124,3348
125,3375
126,3402
127,3429
128,3456
129,3483
130,3510
131,3537
132,3564
133,3591
134,3618
135,3645
136,3672
137,3699
138,3726
139,3753
140,3780
141,3807
142,3834
143,3861
144,3888
145,3915
146,3942
147,3969
148,3996
149,4023
150,4050
151,4077
152,4104
153,4131
154,4158
155,4185
156,4212
157,4239
158,4266
159,4293
160,4320
161,4347
162,4374
163,4401
164,4428
165,4455
166,4482
167,4509
168,4536
169,4563
170,4590
171,4617
172,4644
173,4671
174,4698
175,4725
176,4752
177,4779
178,4806
179,4833
180,4860
181,4887
182,4914
183,4941
184,4968
185,4995
186,5022
187,5049
188,5076
189,5103
190,5130
191,5157
192,5184
193,5211
194,5238
195,5265
196,5292
197,5319
198,5346
199,5373
200,5400
201,5427
202,5454
203,5481
204,5508
205,5535
206,5562
207,5589
208,5616
209,5643
210,5670
211,5697
212,5724
213,5751
214,5778
215,5805
216,5832
217,5859
218,5886
219,5913
220,5940
221,5967
222,5994
223,6021
224,6048
225,6075
226,6102
227,6129
228,6156
229,6183
230,6210
231,6237
232,6264
233,6291
234,6318
235,6345
236,6372
237,6399
238,6426
239,6453
240,6480
241,6507
242,6534
243,6561
244,6588
245,6615
246,6642
247,6669
248,6696
249,6723
250,6750
251,6777
252,6804
253,6831
254,6858
255,6885
256,6912
257,6939
258,6966
259,6993
260,7020
261,7047
262,7074
263,7101
264,7128
265,7155
266,7182
267,7209
268,7236
269,7263
270,7290
271,7317
272,7344
273,7371
274,7398
275,7425
276,7452
277,7479
278,7506
279,7533
280,7560
281,7587
282,7614
283,7641
284,7668
285,7695
286,7722
287,7749
288,7776
289,7803
290,7830
291,7857
292,7884
293,7911
294,7938
295,7965
296,7992
297,8019
298,8046
299,8073
300,8100
301,8127
302,8154
303,8181
304,8208
305,8235
306,8262
307,8289
308,8316
309,8343
310,8370
311,8397
312,8424
313,8451
314,8478
315,8505
316,8532
317,8559
318,8586
319,8613
320,8640
321,8667
322,8694
323,8721
324,8748
325,8775
326,8802
327,8829
328,8856
329,8883
330,8910
331,8937
332,8964
333,8991
334,9018
335,9045
336,9072
337,9099
338,9126
339,9153
340,9180
341,9207
342,9234
343,9261
344,9288
345,9315
346,9342
347,9369
348,9396
349,9423
350,9450
351,9477
352,9504
353,9531
354,9558
355,9585
356,9612
357,9639
358,9666
359,9693
360,9720
361,9747
362,9774
363,9801
364,9828
365,9855
366,9882
367,9909
368,9936
369,9963
370,9990
371,10017
372,10044
373,10071
374,10098
375,10125
376,10152
377,10179
378,10206
379,10233
380,10260
381,10287
382,10314
383,10341
384,10368
385,10395
386,10422
387,10449
388,10476
389,10503
390,10530
391,10557
392,10584
393,10611
394,10638
395,10665
396,10692
397,10719
398,10746
399,10773
400,10800
401,10827
402,10854
403,10881
404,10908
405,10935
406,10962
407,10989
408,11016
409,11043
410,11070
411,11097
412,11124
413,11151
414,11178
415,11205
416,11232
417,11259
418,11286
419,11313
420,11340
421,11367
422,11394
423,11421
424,11448
425,11475
426,11502
427,11529
428,11556
429,11583
430,11610
431,11637
432,11664
433,11691
434,11718
435,11745
436,11772
437,11799
438,11826
439,11853
440,11880
441,11907
442,11934
443,11961
444,11988
445,12015
446,12042
447,12069
448,12096
449,12123
450,12150
451,12177
452,12204
453,12231
454,12258
455,12285
456,12312
457,12339
458,12366
459,12393
460,12420
461,12447
462,12474
463,12501
464,12528
465,12555
466,12582
467,12609
468,12636
469,12663
470,12690
471,12717
472,12744
473,12771
474,12798
475,12825
476,12852
477,12879
478,12906
479,12933
480,12960
481,12987
482,13014
483,13041
484,13068
485,13095
486,13122
487,13149
488,13176
489,13203
490,13230
491,13257
492,13284
493,13311
494,13338
495,13365
496,13392
497,13419
498,13446
499,13473
500,13500
501,13527
502,13554
503,13581
504,13608
505,13635
506,13662
507,13689
508,13716
509,13743
510,13770
511,13797
512,13824
513,13851
514,13878
515,13905
516,13932
517,13959
518,13986
519,14013
520,14040
521,14067
522,14094
523,14121
524,14148
525,14175
526,14202
527,14229
528,14256
529,14283
530,14310
531,14337
532,14364
533,14391
534,14418
535,14445
536,14472
537,14499
538,14526
539,14553
540,14580
541,14607
542,14634
543,14661
544,14688
545,14715
546,14742
547,14769
548,14796
549,14823
550,14850
551,14877
552,14904
553,14931
554,14958
555,14985
556,15012
557,15039
558,15066
559,15093
560,15120
561,15147
562,15174
563,15201
564,15228
565,15255
566,15282
567,15309
568,15336
569,15363
570,15390
571,15417
572,15444
573,15471
574,15498
575,15525
576,15552
577,15579
578,15606
579,15633
580,15660
581,15687
582,15714
583,15741
584,15768
585,15795
586,15822
587,15849
588,15876
589,15903
590,15930
591,15957
592,15984
593,16011
594,16038
595,16065
596,16092
597,16119
598,16146
599,16173
600,16200
601,16227
602,16254
603,16281
604,16308
605,16335
606,16362
607,16389
608,16416
609,16443
610,16470
611,16497
612,16524
613,16551
614,16578
615,16605
616,16632
617,16659
618,16686
619,16713
620,16740
621,16767
622,16794
623,16821
624,16848
625,16875
626,16902
627,16929
628,16956
629,16983
630,17010
631,17037
632,17064
633,17091
634,17118
635,17145
636,17172
637,17199
638,17226
639,17253
640,17280
641,17307
642,17334
643,17361
644,17388
645,17415
646,17442
647,17469
648,17496
649,17523
650,17550
651,17577
652,17604
653,17631
654,17658
655,17685
656,17712
657,17739
658,17766
659,17793
660,17820
661,17847
662,17874
663,17901
664,17928
665,17955
666,17982
667,18009
668,18036
669,18063
670,18090
671,18117
672,18144
673,18171
674,18198
675,18225
676,18252
677,18279
678,18306
679,18333
680,18360
681,18387
682,18414
683,18441
684,18468
685,18495
686,18522
687,18549
688,18576
689,18603
690,18630
691,18657
692,18684
693,18711
694,18738
695,18765
696,18792
697,18819
698,18846
699,18873
