%YAML 1.1
%TAG !u! tag:unity3d.com,2011:
--- !u!1045 &1
EditorBuildSettings:
  m_ObjectHideFlags: 0
  serializedVersion: 2
  m_Scenes:
  - enabled: 1
    path: Assets/Scenes/Main_Menu.unity
    guid: 9fc0d4010bbf28b4594072e72b8655ab
  - enabled: 1
    path: Assets/Scenes/monopoly_2_Player.unity
    guid: c2967bb895011164697b71dfc74ae3b9
  - enabled: 1
    path: Assets/Scenes/monopoly_3_Player.unity
    guid: 2649d362e0ce1d140905a5e5569de83b
  - enabled: 1
    path: Assets/Scenes/monopoly_4_Player.unity
    guid: bc3eee0b41fc2ff448931052516a82ee
  m_configObjects: {}
