<svg width="120" height="60" viewBox="0 0 120 60" fill="none" xmlns="http://www.w3.org/2000/svg">
<path d="M50.7104 40.208H55.8352V33.7421H60.8752C64.941 33.7421 67.694 30.6927 67.694 26.4856C67.694 22.2785 64.941 19.2856 60.8752 19.2856H50.7246V40.2221L50.7104 40.208ZM99.4587 40.208H104.569L104.541 27.9538L112.983 40.208H118.574V19.2715H113.463V32.0338L104.626 19.2715H99.4446V40.208H99.4587ZM75.6704 40.208H90.7904V35.8174H80.781V19.2715H75.6563V40.208H75.6704ZM55.821 29.3515V23.6762H59.8869C61.581 23.6762 62.4563 24.8197 62.4563 26.4856C62.4563 28.1515 61.581 29.3515 59.7881 29.3515H55.8069H55.821Z" fill="#28A8E0"/>
<path d="M42.3106 8.4707H0V50.7813H42.3106V8.4707Z" fill="#F7E82E"/>
<path fill-rule="evenodd" clip-rule="evenodd" d="M8.52734 23.8028C9.65676 23.1816 11.252 22.6875 12.5226 22.6875C14.9509 22.6875 15.5156 23.8028 16.7015 23.8028C17.8873 23.8028 19.1156 22.6875 21.332 22.6875C23.3368 22.6875 24.3956 23.8028 26.1885 23.8028C27.9815 23.8028 27.6003 22.6875 30.1273 22.6875C32.6544 22.6875 33.7838 23.8028 33.7838 23.8028V26.6546C33.7838 26.6546 32.4426 25.4687 30.3391 25.4404C28.2497 25.4122 28.3062 26.6546 26.2026 26.6546C24.0991 26.6546 23.9156 25.4404 21.445 25.4404C18.9744 25.4404 18.5932 26.6546 16.6732 26.6546C14.7532 26.6546 14.4003 25.384 12.3956 25.4122C10.3909 25.4404 8.52734 26.6546 8.52734 26.6546V23.8028V23.8028Z" fill="#28A8E0"/>
<path fill-rule="evenodd" clip-rule="evenodd" d="M8.52734 30.4649C9.65676 29.8437 11.252 29.3496 12.5226 29.3496C14.9509 29.3496 15.5156 30.4649 16.7015 30.4649C17.8873 30.4649 19.1156 29.3496 21.332 29.3496C23.3368 29.3496 24.3956 30.4649 26.1885 30.4649C27.9815 30.4649 27.6003 29.3496 30.1273 29.3496C32.6544 29.3496 33.7838 30.4649 33.7838 30.4649V33.3167C33.7838 33.3167 32.4426 32.1167 30.3391 32.1026C28.2497 32.0884 28.3062 33.3167 26.2026 33.3167C24.0991 33.3167 23.9156 32.1026 21.445 32.1026C18.9744 32.1026 18.5932 33.3167 16.6732 33.3167C14.7532 33.3167 14.4003 32.0461 12.3956 32.0743C10.3909 32.0884 8.52734 33.3167 8.52734 33.3167V30.4649V30.4649Z" fill="#28A8E0"/>
<path fill-rule="evenodd" clip-rule="evenodd" d="M8.52734 37.1153C9.65676 36.48 11.252 36 12.5226 36C14.9509 36 15.5156 37.1153 16.7015 37.1153C17.8873 37.1153 19.1156 36 21.332 36C23.3368 36 24.3956 37.1153 26.1885 37.1153C27.9815 37.1153 27.6003 36 30.1273 36C32.6544 36 33.7838 37.1153 33.7838 37.1153V39.9812C33.7838 39.9812 32.4426 38.7812 30.3391 38.7529C28.2497 38.7247 28.3062 39.9812 26.2026 39.9812C24.0991 39.9812 23.9156 38.7529 21.445 38.7529C18.9744 38.7529 18.5932 39.9812 16.6732 39.9812C14.7532 39.9812 14.4003 38.7106 12.3956 38.7388C10.3909 38.7671 8.52734 39.9812 8.52734 39.9812V37.1153V37.1153Z" fill="#28A8E0"/>
<path fill-rule="evenodd" clip-rule="evenodd" d="M19.9622 46.3341L23.1669 30.2541L11.7739 35.2518L18.4375 14.1177H23.8445L17.5339 28.7718L28.7716 24.2259L19.9622 46.3341Z" fill="#E62A2B"/>
</svg>
