<svg width="512" height="512" viewBox="0 0 512 512" fill="none" xmlns="http://www.w3.org/2000/svg">
<rect width="512" height="512" rx="24" fill="white"/>
<path d="M313.859 218.529V187H282.435H253.004V218.529H282.435V248.228H313.859V218.529Z" fill="url(#paint0_linear_9107_89255)"/>
<path d="M313.404 263.163H282.55H282.436V263.735C278.736 280.845 263.65 293.663 245.547 293.663C224.712 293.663 207.747 276.668 207.747 255.667C207.747 237.241 220.784 221.906 238.09 218.415V187.458C203.876 191.177 177.234 220.304 177.234 255.667C177.234 293.548 207.804 324.277 245.49 324.277C259.096 324.277 271.734 320.271 282.379 313.404V324.277H313.746V263.163H313.404Z" fill="#002759"/>
<path d="M109.091 215.668C94.0048 215.668 85.6934 219.903 85.6934 228.028C85.6934 236.383 93.2647 239.301 109.603 240.388C133.797 241.933 164.481 247.427 164.481 281.703C164.481 304.477 146.036 324.333 109.318 324.333C89.0521 324.333 68.7291 320.671 50 301.044L70.4369 280.845C80.6838 290.401 95.5988 296.066 109.888 296.295C121.842 296.581 133.057 290.286 133.057 280.845C133.057 271.975 125.77 268.313 107.553 267.226C83.3594 265.395 54.3834 258.299 54.4973 229.001C54.5542 196.842 85.1811 187 108.578 187H157.08V215.668H109.091Z" fill="#002759"/>
<path d="M361.22 267.112C363.326 283.077 377.103 294.578 399.475 294.578C411.202 294.578 426.515 290.115 433.802 282.562L454.068 302.704C440.52 316.838 418.432 323.647 398.906 323.647C354.673 323.647 328.43 296.18 328.43 254.866C328.487 215.611 355.015 187.401 396.629 187.401C439.552 187.401 466.365 214.066 461.412 267.169H361.22V267.112ZM430.956 240.732C428.849 224.023 415.87 215.611 397.653 215.611C380.461 215.611 366.457 223.966 361.732 240.732H430.956Z" fill="#002759"/>
<defs>
<linearGradient id="paint0_linear_9107_89255" x1="260.355" y1="179.618" x2="321.533" y2="240.481" gradientUnits="userSpaceOnUse">
<stop stop-color="#00E2B2"/>
<stop offset="0.0569473" stop-color="#02DDB4"/>
<stop offset="0.1265" stop-color="#09CEB9"/>
<stop offset="0.2026" stop-color="#14B5C1"/>
<stop offset="0.2835" stop-color="#2492CC"/>
<stop offset="0.368" stop-color="#3866DA"/>
<stop offset="0.4545" stop-color="#5031EC"/>
<stop offset="0.4658" stop-color="#5329EE"/>
<stop offset="1" stop-color="#002759"/>
</linearGradient>
</defs>
</svg>
