<svg width="2547" height="2259" viewBox="0 0 2547 2259" fill="none" xmlns="http://www.w3.org/2000/svg">
<path opacity="0.3" fill-rule="evenodd" clip-rule="evenodd" d="M220.146 2195.14C432.068 2088.15 888.853 1862.06 1020.62 1813.55C1169.55 1988.79 1578.88 2321.07 2024.79 2248.27C2162.05 2232.22 2455.02 2138.71 2528.78 1893.08C2556.44 1807.86 2572.75 1612.4 2416.72 1512.27C2166.99 1366.69 1738.06 1273.85 1269.63 1460.37L1119.41 1528.91L0.411567 0.842215L266.1 903.753L894.095 1631.72L131.83 1977.72L220.146 2195.14ZM1291.55 1704.15C1290.71 1704.49 1278.16 1709.21 1255.59 1718.18L1255.67 1718.15C1406.36 1862.74 1565.65 1996.8 1688.1 2032.86C1688.26 2032.9 1688.92 2033.16 1690.04 2033.59C1719.3 2044.84 2066.45 2178.3 2294.34 2018.7C2424.19 1927.84 2407.05 1865.78 2385.41 1800.14C2360.39 1724.08 2262.78 1678.62 2220.15 1658.77C2218.29 1657.9 2216.54 1657.08 2214.89 1656.31C2214.78 1656.26 2214.64 1656.21 2214.48 1656.14C2204.72 1652.15 2103.37 1610.65 1946.25 1595.04C1727.26 1573.28 1508.69 1609.37 1296.72 1702.12C1295.86 1702.45 1294.99 1702.8 1294.11 1703.14C1293.25 1703.48 1292.39 1703.82 1291.55 1704.15Z" fill="white"/>
</svg>
