<svg width="258" height="228" viewBox="0 0 258 228" fill="none" xmlns="http://www.w3.org/2000/svg">
<mask id="mask0_1912_965" style="mask-type:alpha" maskUnits="userSpaceOnUse" x="0" y="0" width="258" height="228">
<rect width="258" height="228" fill="#D9D9D9"/>
</mask>
<g mask="url(#mask0_1912_965)">
<g opacity="0.25">
<path d="M486 119.078C485.83 119.078 485.83 119.078 486 119.078C486 85.7559 486 52.254 485.83 18.9323C485.83 11.1873 485.491 11.1873 478.533 11.0071C477.854 11.0071 477.005 11.0071 476.327 11.0071C445.1 11.0071 413.873 11.0071 382.646 11.0071C381.119 11.0071 379.761 11.0071 378.234 11.0071C375.518 11.0071 373.651 12.0879 372.972 15.1498C372.124 20.013 370.087 24.3358 368.56 29.0189C358.547 58.5581 340.049 80.7126 315.271 96.743C259.775 132.406 188.157 122.32 144.711 75.6693C121.461 50.633 109.242 20.9136 109.072 -14.0292C108.902 -43.2082 117.048 -69.5054 134.189 -92.5604C146.408 -109.311 161.513 -122.1 179.162 -131.826C189.345 -137.41 200.037 -141.372 211.238 -144.074C214.972 -144.975 216.838 -146.596 216.499 -150.738C216.329 -151.999 216.499 -153.26 216.499 -154.521C216.499 -184.6 216.499 -214.5 216.499 -244.579C216.499 -246.381 216.499 -248.182 216.499 -249.983C216.499 -252.865 215.141 -254.306 212.426 -253.946C211.068 -253.765 209.541 -253.585 208.183 -253.405C163.719 -246.741 123.497 -229.45 87.858 -200.271C62.9105 -179.737 42.7149 -154.701 27.1015 -125.702C16.7491 -106.429 9.28183 -85.7159 5.03905 -64.1018C-2.08881 -28.2585 -1.91912 7.5849 7.24527 43.2481C14.7126 72.0669 26.5923 98.3641 43.224 122.5C57.9889 143.754 75.4691 162.126 95.6647 177.256C136.395 207.875 182.048 224.086 231.773 226.247C275.558 228.229 317.307 219.043 356.68 198.149C360.923 195.808 365.166 193.286 369.409 190.944C372.124 189.504 373.482 190.404 373.651 193.646C373.651 195.628 373.821 197.789 373.821 199.77C373.821 206.615 373.651 213.639 373.821 220.484C373.991 225.707 374.5 226.067 379.252 226.428C381.119 226.608 383.155 226.428 385.022 226.428C413.533 226.428 442.045 226.428 470.726 226.428C473.611 226.428 476.496 226.428 479.381 226.428C485.491 226.247 485.661 226.067 486 219.223C486 216.881 486 214.54 486 212.378C486 181.218 486 150.238 486 119.078Z" fill="#BBC5CA"/>
</g>
</g>
</svg>
