<svg width="120" height="60" viewBox="0 0 120 60" fill="none" xmlns="http://www.w3.org/2000/svg">
<path d="M104.527 30.353C108.067 30.353 110.936 27.4834 110.936 23.9436C110.936 20.4038 108.067 17.5342 104.527 17.5342C100.987 17.5342 98.1177 20.4038 98.1177 23.9436C98.1177 27.4834 100.987 30.353 104.527 30.353Z" fill="#31BBAC"/>
<path d="M113.577 21.2895C117.117 21.2895 119.986 18.4199 119.986 14.8801C119.986 11.3403 117.117 8.4707 113.577 8.4707C110.037 8.4707 107.167 11.3403 107.167 14.8801C107.167 18.4199 110.037 21.2895 113.577 21.2895Z" fill="#FFC320"/>
<path d="M109.03 28.7015C114.192 28.7015 118.376 24.5172 118.376 19.3556C118.376 14.1941 114.192 10.0098 109.03 10.0098C103.869 10.0098 99.6846 14.1941 99.6846 19.3556C99.6846 24.5172 103.869 28.7015 109.03 28.7015Z" fill="#EC1C25"/>
<path fill-rule="evenodd" clip-rule="evenodd" d="M99.6992 19.7224C99.8827 24.6495 103.878 28.5883 108.833 28.7012C110.132 27.5295 110.951 25.8354 110.951 23.9436C110.951 22.3059 110.344 20.8095 109.327 19.6801C109.158 19.4965 108.975 19.313 108.791 19.1436C107.662 18.1412 106.165 17.5342 104.542 17.5342C102.622 17.5342 100.885 18.3812 99.7133 19.7224H99.6992Z" fill="#BE268E"/>
<path fill-rule="evenodd" clip-rule="evenodd" d="M113.576 21.2893C115.482 21.2893 117.205 20.4564 118.376 19.1293C118.263 14.1881 114.31 10.207 109.383 10.0234C108.014 11.1952 107.153 12.9458 107.153 14.8799C107.153 16.5176 107.76 18.014 108.776 19.1434C108.96 19.3128 109.143 19.4964 109.313 19.6799C110.442 20.6823 111.939 21.2893 113.562 21.2893H113.576Z" fill="#EC228F"/>
<path fill-rule="evenodd" clip-rule="evenodd" d="M3.68456 25.9213C4.94103 25.9213 5.9575 24.9049 5.9575 23.6484C5.9575 22.3919 4.94103 21.3613 3.68456 21.3613C2.42809 21.3613 1.41162 22.3778 1.41162 23.6343C1.41162 24.8907 2.42809 25.9213 3.68456 25.9213Z" fill="#47474B"/>
<path fill-rule="evenodd" clip-rule="evenodd" d="M14.8513 26.9238C10.4748 26.9238 7.45361 30.312 7.45361 34.4908V41.6203H11.4066V34.4767C11.4066 32.2885 12.6489 30.5097 14.8371 30.5097C17.0254 30.5097 18.2677 32.2885 18.2677 34.4767V41.6203H22.2348V34.4767C22.2348 30.2979 19.2277 26.9097 14.8513 26.9097V26.9238Z" fill="#47474B"/>
<path fill-rule="evenodd" clip-rule="evenodd" d="M31.7651 26.924C27.4592 26.924 23.958 30.3122 23.958 34.491C23.958 38.6698 27.4733 42.044 31.7933 42.044C33.4309 42.044 34.9698 41.2534 35.9298 39.9263V41.6204H39.6286V22.5898H35.6757V28.364C34.5886 27.4322 33.2051 26.9098 31.7651 26.9098V26.924ZM27.911 34.491C27.911 32.3028 29.6757 30.524 31.8639 30.524C34.0521 30.524 35.8309 32.3028 35.8309 34.491C35.8309 36.6793 34.0662 38.4581 31.878 38.4581C29.6757 38.4581 27.911 36.6934 27.911 34.491Z" fill="#47474B"/>
<path fill-rule="evenodd" clip-rule="evenodd" d="M49.3411 26.9238C44.9787 26.9238 41.4775 30.3262 41.4775 34.505C41.4775 38.6838 44.9928 42.0579 49.3411 42.0579C53.6893 42.0579 57.2046 38.6556 57.2046 34.4909C57.2046 30.3262 53.6893 26.9238 49.3411 26.9238ZM45.6422 32.9379C46.2775 31.4415 47.7034 30.5238 49.3411 30.5238C51.5011 30.5238 53.2517 32.2885 53.2517 34.4909C53.2517 36.6932 51.4587 38.4579 49.2987 38.4579C46.4611 38.4579 44.5411 35.5497 45.6564 32.9379H45.6422Z" fill="#47474B"/>
<path fill-rule="evenodd" clip-rule="evenodd" d="M64.2921 26.9379C61.2285 26.9379 58.645 28.745 58.645 31.6391C58.645 33.8838 61.3132 35.5779 64.0803 35.9168C65.2662 36.0721 66.1415 36.6791 66.1415 37.3427C66.1415 38.2744 65.1673 38.7121 64.2921 38.7121C63.4168 38.7121 62.4426 38.4015 62.4426 37.1732H58.4756C58.4756 40.2368 61.2144 42.0438 64.2779 42.0438C67.3415 42.0438 70.0803 40.2509 70.0803 37.1874C70.0803 34.7874 67.9485 33.4603 65.8591 33.2203C64.3344 33.0368 62.5838 32.3732 62.5838 31.5262C62.5838 30.5803 63.4026 30.2556 64.2779 30.2556C65.1532 30.2556 65.9721 30.5662 65.9721 31.7944H69.925C69.925 28.7309 67.3415 26.9238 64.2921 26.9238V26.9379Z" fill="#47474B"/>
<path fill-rule="evenodd" clip-rule="evenodd" d="M88.8989 22.5898V34.491C88.8989 38.6698 91.906 42.0581 96.2825 42.0581H96.8048V38.4581C94.6166 38.4581 92.8519 36.6793 92.8519 34.5051V30.4534H96.8048V27.0651H92.8519V22.604H88.8989V22.5898Z" fill="#47474B"/>
<path d="M5.67507 27.3613H1.70801V41.6343H5.67507V27.3613Z" fill="#47474B"/>
<path fill-rule="evenodd" clip-rule="evenodd" d="M87.0348 41.6345V34.505C87.0348 30.3262 83.5337 26.938 79.1996 26.938C74.8654 26.938 71.3643 30.3262 71.3643 34.505C71.3643 38.6839 74.8796 42.058 79.1996 42.058C80.8513 42.058 82.4043 41.2392 83.336 39.8698V41.6345H87.0348ZM80.7948 30.8345C82.2772 31.4556 83.2372 32.8956 83.2372 34.505C83.2372 38.8392 77.2795 40.025 75.6137 36.0156C75.0066 34.5333 75.3454 32.825 76.4748 31.6956C77.6043 30.5662 79.3125 30.2274 80.7948 30.8345V30.8345Z" fill="#47474B"/>
<path fill-rule="evenodd" clip-rule="evenodd" d="M2.68261 48.1966C2.34379 47.5613 2.34379 46.7848 2.68261 46.1495C2.83791 45.8672 3.07791 45.6272 3.37438 45.4719C3.67085 45.3166 4.00967 45.2319 4.3485 45.2319C4.68732 45.2319 5.01203 45.3025 5.3085 45.4719C5.59085 45.6272 5.83085 45.8672 5.98614 46.1495C6.15555 46.4601 6.24026 46.8131 6.24026 47.166C6.24026 47.5189 6.16967 47.8719 5.98614 48.1966C5.83085 48.4789 5.59085 48.7189 5.3085 48.8742C5.01203 49.0437 4.68732 49.1142 4.3485 49.1142C4.00967 49.1142 3.68497 49.0437 3.3885 48.8742C3.10614 48.7189 2.86614 48.4789 2.71085 48.1966H2.68261ZM2.04732 45.8107C1.59555 46.6578 1.59555 47.6742 2.04732 48.5213C2.2732 48.9025 2.59791 49.2272 2.9932 49.4389C3.40261 49.6648 3.8685 49.7778 4.33438 49.7637C4.80026 49.7637 5.26614 49.6507 5.67555 49.4389C6.07085 49.2272 6.39556 48.9025 6.62144 48.5213C7.0732 47.6742 7.0732 46.6578 6.62144 45.8107C6.39556 45.4154 6.07085 45.1048 5.67555 44.8931C5.26614 44.6672 4.80026 44.5684 4.33438 44.5684C3.8685 44.5684 3.40261 44.6813 2.9932 44.8931C2.59791 45.1048 2.2732 45.4295 2.04732 45.8107V45.8107Z" fill="#47474B"/>
<path fill-rule="evenodd" clip-rule="evenodd" d="M9.84037 44.8932C9.44508 45.1049 9.12037 45.4296 8.89449 45.8108C8.44272 46.6579 8.44272 47.6744 8.89449 48.5214C9.12037 48.9026 9.44508 49.2273 9.84037 49.4391C10.6874 49.8767 11.6898 49.8767 12.5368 49.4391C12.9321 49.2273 13.2568 48.9026 13.4827 48.5214C13.9345 47.6744 13.9345 46.6579 13.4827 45.8108C13.2568 45.4155 12.9321 45.1049 12.5368 44.8932C11.6898 44.4555 10.6874 44.4555 9.84037 44.8932V44.8932ZM10.2215 45.472C10.518 45.3167 10.8568 45.232 11.1957 45.232C11.5345 45.232 11.8592 45.3026 12.1557 45.472C12.438 45.6273 12.678 45.8673 12.8333 46.1496C13.158 46.7849 13.158 47.5473 12.8333 48.1967C12.678 48.4791 12.438 48.7191 12.1557 48.8744C11.5486 49.1991 10.8427 49.1991 10.2357 48.8744C9.95331 48.7191 9.71331 48.4791 9.55802 48.1967C9.21919 47.5614 9.21919 46.7849 9.55802 46.1496C9.71331 45.8673 9.95331 45.6273 10.2498 45.472H10.2215Z" fill="#47474B"/>
<path fill-rule="evenodd" clip-rule="evenodd" d="M15.6006 44.6674V49.6651H16.3206V47.6886H17.4218L18.4806 49.6651H19.2288L18.1276 47.6321C18.4524 47.5615 18.7488 47.378 18.9606 47.1098C19.1582 46.8415 19.2571 46.5168 19.2571 46.178C19.2853 45.7545 19.13 45.3451 18.8335 45.0486C18.4806 44.7662 18.0571 44.6392 17.6053 44.6674H15.6006V44.6674ZM16.3206 45.2886H17.4782C17.7465 45.2745 18.0147 45.3451 18.2406 45.5004C18.4382 45.6698 18.5371 45.938 18.5088 46.1921C18.5229 46.4462 18.4241 46.7004 18.2265 46.8557C18.0006 47.011 17.7465 47.0957 17.4641 47.0815H16.3065V45.2886H16.3206Z" fill="#47474B"/>
<path fill-rule="evenodd" clip-rule="evenodd" d="M21.0356 44.6675V49.6792H24.3251V49.0581H21.7698V47.4769H23.6756V46.8698H21.7698V45.2887H24.3251V44.6675H21.0356Z" fill="#47474B"/>
<path fill-rule="evenodd" clip-rule="evenodd" d="M27.6993 45.2745C28.2075 45.2181 28.7157 45.4016 29.0828 45.7545C29.4498 46.1216 29.6334 46.6157 29.591 47.1381C29.591 47.7592 29.4216 48.2392 29.0828 48.564C28.7581 48.8887 28.2498 49.0581 27.5863 49.0581H26.824V45.2745H27.7134H27.6993ZM26.0898 44.6675V49.6651H27.6004C28.4616 49.6651 29.1393 49.4534 29.6051 49.0298C30.0851 48.6063 30.3251 47.9851 30.3251 47.1522C30.3251 46.7004 30.2263 46.2487 30.0146 45.8392C29.8028 45.4722 29.4781 45.1757 29.0969 44.9781C28.6593 44.7663 28.1793 44.6675 27.6993 44.6816H26.0898V44.6675Z" fill="#47474B"/>
<path fill-rule="evenodd" clip-rule="evenodd" d="M33.2334 44.8932C32.8381 45.1049 32.5134 45.4296 32.2876 45.8108C31.8358 46.6579 31.8358 47.6744 32.2876 48.5214C32.5134 48.9026 32.8381 49.2273 33.2334 49.4391C34.0805 49.8767 35.0828 49.8767 35.9299 49.4391C36.3252 49.2273 36.6499 48.9026 36.8758 48.5214C37.3276 47.6744 37.3276 46.6579 36.8758 45.8108C36.6499 45.4155 36.3252 45.1049 35.9299 44.8932C35.0828 44.4555 34.0805 44.4555 33.2334 44.8932V44.8932ZM33.6287 45.472C33.9252 45.3167 34.264 45.232 34.6028 45.232C34.9276 45.232 35.2664 45.3026 35.5629 45.472C35.8452 45.6414 36.0852 45.8673 36.2405 46.1496C36.4099 46.4602 36.4946 46.8132 36.4805 47.1661C36.4805 47.5191 36.3958 47.8861 36.2264 48.1967C36.0711 48.4791 35.8311 48.7191 35.5487 48.8744C34.9417 49.1991 34.2217 49.1991 33.6287 48.8744C33.3464 48.7191 33.1064 48.4791 32.9511 48.1967C32.6123 47.5614 32.6123 46.7849 32.9511 46.1496C33.1064 45.8673 33.3464 45.6273 33.6428 45.472H33.6287Z" fill="#47474B"/>
<path fill-rule="evenodd" clip-rule="evenodd" d="M39.1484 45.8108C38.6966 46.6579 38.6966 47.6744 39.1484 48.5214C39.3743 48.9026 39.699 49.2273 40.0943 49.4391C40.9413 49.8767 41.9437 49.8767 42.7907 49.4391C43.186 49.2273 43.5107 48.9026 43.7366 48.5214C44.1884 47.6744 44.1884 46.6579 43.7366 45.8108C43.5107 45.4155 43.186 45.1049 42.7907 44.8932C41.9437 44.4555 40.9413 44.4555 40.0943 44.8932C39.699 45.1049 39.3743 45.4296 39.1484 45.8108V45.8108ZM39.7978 48.1967C39.4731 47.5614 39.4731 46.7849 39.7978 46.1496C39.9672 45.8673 40.1931 45.6273 40.4896 45.472C40.786 45.3167 41.1249 45.232 41.4637 45.232C41.8025 45.232 42.1272 45.3026 42.4237 45.472C42.706 45.6414 42.946 45.8673 43.1013 46.1496C43.2707 46.4602 43.3555 46.8132 43.3413 47.1661C43.3413 47.5191 43.2707 47.8861 43.0872 48.1967C42.9319 48.4791 42.6919 48.7191 42.4096 48.8744C41.8025 49.1991 41.0825 49.1991 40.4896 48.8744C40.2072 48.7191 39.9672 48.4791 39.7978 48.1967V48.1967Z" fill="#47474B"/>
<path fill-rule="evenodd" clip-rule="evenodd" d="M52.8288 44.6675V46.8134H50.217V44.6675H49.4829V49.6651H50.217V47.4204H52.8288V49.6651H53.5488V44.6675H52.8288Z" fill="#47474B"/>
<path fill-rule="evenodd" clip-rule="evenodd" d="M55.4408 44.6675V47.8016C55.4126 48.3381 55.5961 48.8604 55.9632 49.2557C56.3161 49.6087 56.8385 49.7922 57.502 49.7922C58.1655 49.7922 58.6879 49.6228 59.0408 49.2698C59.4079 48.8745 59.5914 48.3522 59.5632 47.8157V44.6816H58.8291V47.844C58.8573 48.1969 58.7302 48.5498 58.4761 48.804C57.8973 49.2416 57.1067 49.2416 56.5279 48.804C56.2738 48.5498 56.1467 48.1969 56.1749 47.844V44.6816H55.4549L55.4408 44.6675Z" fill="#47474B"/>
<path fill-rule="evenodd" clip-rule="evenodd" d="M61.1577 44.6533V45.2745H62.7107V49.6651H63.4448V45.2745H64.9977V44.6533H61.1577Z" fill="#47474B"/>
<path fill-rule="evenodd" clip-rule="evenodd" d="M67.3698 44.8793C66.9745 45.0911 66.6498 45.4017 66.438 45.797C66.2121 46.2205 66.0851 46.7005 66.0992 47.1805C66.0992 47.6605 66.198 48.1264 66.438 48.5499C66.6498 48.9311 66.9745 49.2558 67.3698 49.4676C67.7933 49.6935 68.2592 49.8064 68.7392 49.7923C69.5016 49.7923 70.0945 49.6087 70.518 49.2558V48.5499C70.2921 48.7476 70.0239 48.9029 69.7416 49.0017C69.4451 49.1005 69.1204 49.1429 68.7957 49.1429C68.4427 49.1429 68.0898 49.0723 67.7792 48.9029C67.4827 48.7476 67.2427 48.5076 67.0733 48.2252C66.7345 47.5758 66.7345 46.8135 67.0733 46.164C67.2286 45.8817 67.4827 45.6417 67.7651 45.4864C68.0757 45.317 68.4286 45.2464 68.7816 45.2464C69.3886 45.2182 69.9816 45.4158 70.4333 45.797V45.0911C69.9392 44.724 69.3321 44.5405 68.711 44.5687C68.231 44.5687 67.7651 44.6676 67.3416 44.8935L67.3698 44.8793Z" fill="#47474B"/>
<path fill-rule="evenodd" clip-rule="evenodd" d="M75.6428 44.6675V46.8134H73.031V44.6675H72.311V49.6651H73.031V47.4204H75.6428V49.6651H76.3628V44.6675H75.6428Z" fill="#47474B"/>
<path d="M79.031 44.6675H78.2969V49.6651H79.031V44.6675Z" fill="#47474B"/>
<path fill-rule="evenodd" clip-rule="evenodd" d="M81.0641 45.2039C80.923 45.4156 80.8524 45.6556 80.8524 45.8956C80.8524 46.2203 80.9512 46.5309 81.163 46.7568C81.4594 47.0392 81.7983 47.2509 82.1794 47.378C82.5324 47.5192 82.7724 47.6321 82.9277 47.7027C83.0688 47.7733 83.1818 47.858 83.2806 47.9709C83.3653 48.098 83.4077 48.2392 83.3935 48.3803C83.3935 48.8886 83.0265 49.1286 82.2783 49.1286C81.77 49.1286 81.2618 49.0297 80.7959 48.8039V49.4674C81.0077 49.5662 81.2477 49.6368 81.4735 49.6792C81.7559 49.7215 82.0382 49.7497 82.3206 49.7497C82.9277 49.7497 83.3794 49.6368 83.69 49.3968C84.0006 49.1568 84.17 48.7897 84.1559 48.3945C84.1841 47.9286 83.9582 47.4909 83.5488 47.265C83.2947 47.1097 83.0265 46.9827 82.7583 46.8697C82.4618 46.7427 82.2218 46.6439 82.0665 46.5592C81.9253 46.4886 81.8124 46.3897 81.7135 46.2768C81.6288 46.1639 81.6006 46.0227 81.6006 45.8815C81.6006 45.6697 81.6853 45.4721 81.8688 45.345C82.1088 45.2039 82.3771 45.1474 82.6594 45.1615C83.0971 45.1615 83.5206 45.2603 83.9159 45.4439V44.8227C83.7041 44.7239 83.4924 44.6533 83.2806 44.6109C83.0406 44.5686 82.7865 44.5403 82.5465 44.5545C82.25 44.5545 81.9394 44.6109 81.6571 44.7239C81.4171 44.8227 81.2053 44.9921 81.0641 45.1897V45.2039Z" fill="#47474B"/>
<path fill-rule="evenodd" clip-rule="evenodd" d="M86.1606 45.8108C85.7088 46.6579 85.7088 47.6744 86.1606 48.5214C86.3865 48.9026 86.7112 49.2273 87.1065 49.4391C87.9535 49.8767 88.9559 49.8767 89.803 49.4391C90.1982 49.2273 90.523 48.9026 90.7488 48.5214C91.2006 47.6744 91.2006 46.6579 90.7488 45.8108C90.523 45.4155 90.1982 45.1049 89.803 44.8932C88.9559 44.4555 87.9535 44.4555 87.1065 44.8932C86.7112 45.1049 86.3865 45.4296 86.1606 45.8108V45.8108ZM86.7959 46.1496C86.9653 45.8673 87.1912 45.6273 87.4877 45.472C87.7841 45.3167 88.1229 45.232 88.4618 45.232C88.8006 45.232 89.1253 45.3026 89.4218 45.472C89.7041 45.6414 89.9441 45.8673 90.0994 46.1496C90.4241 46.7849 90.4241 47.5473 90.0994 48.1967C89.93 48.4791 89.7041 48.7191 89.4218 48.8744C88.8147 49.1991 88.0947 49.1991 87.5018 48.8744C87.2194 48.7191 86.9794 48.4791 86.8241 48.1967C86.6547 47.8861 86.57 47.5332 86.57 47.1661C86.57 46.8132 86.6547 46.4602 86.8241 46.1496H86.7959Z" fill="#47474B"/>
<path fill-rule="evenodd" clip-rule="evenodd" d="M92.8521 44.6675V49.6651H93.5862V45.8957L96.1273 49.6651H96.8191V44.6675H96.085V48.4369L93.5438 44.6675H92.8521Z" fill="#47474B"/>
</svg>
