<svg width="120" height="120" viewBox="0 0 120 120" fill="none" xmlns="http://www.w3.org/2000/svg">
<rect width="120" height="120" rx="60" fill="#BBC5CA"/>
<path d="M86.7334 32.14C86.4925 28.2436 81.5985 30.864 81.5985 30.864L53.7721 46.1831C50.6991 47.9544 50.149 48.3456 53.6559 47.0764L85.2848 36.2909C85.2848 36.2909 85.389 36.2568 85.5701 36.2072C86.4037 35.9783 86.9606 35.1925 86.8974 34.3299L86.7351 32.1383L86.7334 32.14Z" fill="white"/>
<path d="M43.0421 41.5065C43.0421 41.5065 44.2037 38.2422 46.2142 37.3386C46.2142 37.3386 47.468 36.6741 48.1069 37.6375C48.1069 37.6375 49.7707 39.8394 47.0376 42.1369C47.0376 42.1369 45.6727 43.5017 43.4265 44.0808C43.4265 44.0808 41.7046 44.8666 43.0421 41.5065Z" fill="white"/>
<path d="M37.9196 30.7029C37.9196 30.7029 39.3699 29.1946 41.0866 30.597C41.0866 30.597 42.636 32.2949 42.3097 35.6361C42.3097 35.6361 42.2482 38.3317 40.7552 41.649C40.7552 41.649 40.113 43.1624 39.129 41.7156C39.129 41.7156 36.8042 39.0474 36.8008 34.7257C36.8008 34.7257 36.8435 32.148 37.9196 30.7029Z" fill="white"/>
<path d="M45.0543 63.8281C40.601 64.3747 34.2585 65.2049 27.9023 66.4416L26.0336 45.0038C26.0336 45.0038 25.3093 40.542 30.591 42.9112L36.9233 45.9006C39.4087 51.4078 44.523 62.6118 45.056 63.8281H45.0543Z" fill="white"/>
<path d="M51.7441 67.7449C52.2446 67.6987 52.5214 67.6782 52.5402 67.6765C52.5777 67.6731 52.617 67.6697 52.6546 67.6663C57.4051 67.0633 61.9557 67.6236 66.1767 69.3352C69.2565 70.5839 71.0347 72.0273 71.1526 72.1212C71.8239 72.7157 73.6432 74.2445 73.6978 75.9732C73.7439 77.403 73.7217 78.7354 70.6128 79.7808C64.945 81.6888 58.5701 76.5694 58.4932 76.5198C56.2726 75.0884 53.893 71.496 51.7459 67.7449H51.7441Z" fill="white"/>
<path d="M87.8322 39.1899L53.8529 50.7766C50.0863 52.1397 47.5018 50.8944 47.5018 50.8944L45.3546 49.8815C46.7434 54.0119 48.5831 59.3466 50.0658 63.19C51.5537 63.0397 51.8782 63.0226 52.1174 63.0021C65.5779 61.3144 73.8627 68.265 74.2094 68.5623C74.218 68.5708 74.2248 68.5759 74.2333 68.5845C76.659 70.7214 77.7402 73.0121 77.4481 75.3916C76.9886 79.153 73.2084 81.2148 72.778 81.4386C70.7657 82.4755 68.6783 82.8632 66.6848 82.8632C60.988 82.8632 56.0548 79.6963 55.778 79.5152C52.5632 77.4432 49.5175 73.6749 46.6819 68.2702C42.1159 68.798 35.3788 69.7119 28.3086 71.1348L28.3991 72.1819C29.0192 76.7103 31.8804 78.2836 31.8804 78.2836L50.7662 88.7394C55.0059 91.575 60.8497 88.7394 60.8497 88.7394L87.1643 78.5825C90.4748 77.2142 90.7105 71.7634 90.7105 71.7634L93.3685 41.402C93.7887 37.2255 87.8271 39.1865 87.8271 39.1865L87.8322 39.1899ZM88.1517 61.4801C87.4325 62.7954 86.1241 63.4667 85.2307 62.9765C84.3356 62.4879 84.1682 59.7446 84.889 58.4293C85.6082 57.1122 86.9149 56.4426 87.81 56.9312C88.7051 57.4214 88.8708 60.1631 88.1517 61.4801Z" fill="white"/>
</svg>
