// Jest Snapshot v1, https://goo.gl/fbAQLP

exports[`Details page renders the components when data received 1`] = `
<div
  class="details gl-mx-3"
>
  <div
    class="gl-py-6 gl-inset-border-b-1-gray-200"
  >
    <a
      class="gl-link gl-text-decoration-none gl-display-inline-flex gl-align-items-center"
      data-qa-selector="incident-back-button"
    >
      <gl-icon-stub
        class="gl-vertical-align-middle gl-mr-2"
        name="arrow-left"
        size="14"
        title="Back"
      />
      
      Return to status overview
    
    </a>
  </div>
   
  <div
    class="gl-px-5"
  >
    <div
      class="gl-pb-3"
    >
      <h1
        class="gl-my-5"
        data-qa-selector="incident-title"
      >
        Title
      </h1>
       
      <div
        class="gl-mb-6"
      >
        <gl-badge-stub
          data-qa-selector="incident-status"
          iconsize="md"
          pill=""
          size="md"
          variant="success"
        >
          <span
            class="text-capitalize"
          >
            closed
          </span>
        </gl-badge-stub>
      </div>
       
      <gl-markdown-stub
        data-qa-selector="incident-details"
        text="incident"
      />
       
      <div
        class="gl-display-inline-block gl-mt-5 gl-font-sm gl-text-gray-700"
      >
        
        Edited 3 months ago
      
      </div>
       
      <gl-tooltip-stub
        target="function () {
                        return _vm.$refs.updatedAtDateTime
                      }"
      >
        <div
          class="gl-display-block gl-align-items-center gl-font-sm"
        >
          <div
            class="mb-1"
          >
            Feb 21, 2020 9:20am
          </div>
           
          <div>
            GMT+2
          </div>
        </div>
      </gl-tooltip-stub>
    </div>
     
    <!---->
  </div>
</div>
`;
