{
  "Rules": [
    {
      "ID": "AbortIncompleteMultipartUpload",
      "Status": "Enabled",
      "Filter": {
        "Prefix": "data"
      },
      "AbortIncompleteMultipartUpload": {
        "DaysAfterInitiation": 7
      }
    }
  ]
}
