[
  {
    "Region": "KALIMANTAN REGION",
    "Area": "BANJARMASIN",
    "Business": "O/S BUSINESS",
    "Gender": "PRIA",
    "Location": "BANJARMASIN",
    "Name": "CHAIRI RAMADHAN",
    "Nrk": "210180871",
    "PhoneNumber": "+6285251020501",
    "PlaceOfBirth": "PELAIHARI",
    "Position": "ACCOUNT OFFICER",
    "Region_1": "KALIMANTAN REGION",
    "UkDir": "BISNIS",
    "UkMgr": "KALIMANTAN",
    "UkSpv": "BUS",
    "REF 2023 (YA/(TIDAK)": "YA",
    "Password": "$2a$10$k4MWVO6tXtIfM4lUl7tl5O.XcoYrjucbIliSXL9DuaiATkDzLG6IW"
  },
  {
    "Region": "KALIMANTAN REGION",
    "Area": "BANJARMASIN",
    "Business": "O/S BUSINESS",
    "Gender": "WANITA",
    "Location": "BANJARMASIN",
    "Name": "DINA AULIA",
    "Nrk": "210160692",
    "PhoneNumber": "+6282152128529",
    "PlaceOfBirth": "BANJARMASIN",
    "Position": "ADMIN SUPPORT",
    "Region_1": "KALIMANTAN REGION",
    "UkDir": "BISNIS",
    "UkMgr": "KALIMANTAN",
    "UkSpv": "BUS",
    "REF 2023 (YA/(TIDAK)": "YA",
    "Password": "$2a$10$8pXN.wDGD3A8wilFGXOMjuqPHK69hJWrgWlMaKuKzKCUmn4D6Jcjq"
  },
  {
    "Region": "KALIMANTAN REGION",
    "Area": "BANJARMASIN",
    "Business": "O/S BUSINESS",
    "Gender": "PRIA",
    "Location": "BANJARMASIN",
    "Name": "MUHAMMAD HENDRA",
    "Nrk": "210160625",
    "PhoneNumber": "+6285849800260",
    "PlaceOfBirth": "KOTABARU",
    "Position": "OFFICE SUPPORT",
    "Region_1": "KALIMANTAN REGION",
    "UkDir": "BISNIS",
    "UkMgr": "KALIMANTAN",
    "UkSpv": "BUS",
    "REF 2023 (YA/(TIDAK)": "YA",
    "Password": "$2a$10$RMVaDIWHYdyGRrk7f5J.Ie4k06y24N6YyZfb4XpDjGjZv1R7dARFy"
  },
  {
    "Region": "KALIMANTAN REGION",
    "Area": "BANJARMASIN",
    "Business": "O/S BUSINESS",
    "Gender": "PRIA",
    "Location": "BANJARMASIN",
    "Name": "MUKTI",
    "Nrk": "210180945",
    "PhoneNumber": "+6281250966060",
    "PlaceOfBirth": "BAWAHAN PASAR",
    "Position": "BUSINESS MANAGER",
    "Region_1": "KALIMANTAN REGION",
    "UkDir": "BISNIS",
    "UkMgr": "KALIMANTAN",
    "UkSpv": "BUS",
    "REF 2023 (YA/(TIDAK)": "YA",
    "Password": "$2a$10$iQBNCKN10rEhvMmes.TLBORfu03OSSm2GGbe9XZr5FJbWZ/8hs4vK"
  },
  {
    "Region": "KALIMANTAN REGION",
    "Area": "KALIMANTAN",
    "Business": "O/S BUSINESS",
    "Gender": "WANITA",
    "Location": "KALIMANTAN",
    "Name": "NURUL HIDAYATI",
    "Nrk": "0210211163",
    "PhoneNumber": "+6285754454901",
    "PlaceOfBirth": "BANJARMASIN",
    "Position": "BUSINESS SUPPORT",
    "Region_1": "KALIMANTAN",
    "UkDir": "BISNIS",
    "UkMgr": "KALIMANTAN",
    "UkSpv": "BISNIS",
    "REF 2023 (YA/(TIDAK)": "YA",
    "Password": "$2a$10$iW5NYAGHM8kp00h28FArYOZvdnglEXhupn2j3b7jdnlajx0GvyIhm"
  },
  {
    "Region": "MAKASSAR REGION",
    "Area": "MAMUJU",
    "Business": "O/S BUSINESS",
    "Gender": "WANITA",
    "Location": "MAMUJU",
    "Name": "A. FITRI FARADILLA D",
    "Nrk": "202191036",
    "PhoneNumber": "+6281355355510",
    "PlaceOfBirth": "LOMBANG ",
    "Position": "PIC MAMUJU",
    "Region_1": "MAKASSAR REGION",
    "UkDir": "BISNIS",
    "UkMgr": "SULAMPA",
    "UkSpv": "BUS",
    "REF 2023 (YA/(TIDAK)": "YA",
    "Password": "$2a$10$zM6Jfkhq143H0fOQmqqiuuBZGoM4LXI/RrLSY3AUsEypJMi7hggD."
  },
  {
    "Region": "MAKASSAR REGION",
    "Area": "MAKASAR",
    "Business": "O/S BUSINESS",
    "Gender": "WANITA",
    "Location": "MANADO",
    "Name": "ARYANCE AMELIA PALENEWEN",
    "Nrk": "206170833",
    "PhoneNumber": "+6285395646517",
    "PlaceOfBirth": "MANADO",
    "Position": "PIC MANADO",
    "Region_1": "MAKASSAR REGION",
    "UkDir": "BISNIS",
    "UkMgr": "SULAMPA",
    "UkSpv": "BUS",
    "REF 2023 (YA/(TIDAK)": "YA",
    "Password": "$2a$10$fpnzUUFfI6veC6xKxcpeJOT7CKK9iPV2rB6G2h/vA0LZqdtphRV2W"
  },
  {
    "Region": "MAKASSAR REGION",
    "Area": "GORONTALO",
    "Business": "O/S BUSINESS",
    "Gender": "WANITA",
    "Location": "GORONTALO",
    "Name": "ASRI DWI UNTARI",
    "Nrk": "202191044",
    "PhoneNumber": "+6282393415533",
    "PlaceOfBirth": "GORONTALO",
    "Position": "PIC GORONTALO",
    "Region_1": "MAKASSAR REGION",
    "UkDir": "BISNIS",
    "UkMgr": "SULAMPA",
    "UkSpv": "BUS",
    "REF 2023 (YA/(TIDAK)": "YA",
    "Password": "$2a$10$8BqH4y/WYCBmvkiZz/GVzOJ7FfE.j16CVcrOKAQb/SA1jU.cGrqgO"
  },
  {
    "Region": "MAKASSAR REGION",
    "Area": "MAKASAR",
    "Business": "O/S BUSINESS",
    "Gender": "PRIA",
    "Location": "KENDARI",
    "Name": "BUDIONO",
    "Nrk": "206170764",
    "PhoneNumber": "+6285341162887",
    "PlaceOfBirth": "ASEMBU MULYA",
    "Position": "PIC KENDARI",
    "Region_1": "MAKASSAR REGION",
    "UkDir": "BISNIS",
    "UkMgr": "SULAMPA",
    "UkSpv": "BUS",
    "REF 2023 (YA/(TIDAK)": "YA",
    "Password": "$2a$10$Yi2z3mEn7JxdibqDZlME9.ap9R6JOJzFVjL0JaFAyfv2vpuLp0bdC"
  },
  {
    "Region": "MAKASSAR REGION",
    "Area": "MAKASSAR",
    "Business": "O/S BUSINESS",
    "Gender": "WANITA",
    "Location": "MAKASSAR",
    "Name": "JUMRIANI NUR",
    "Nrk": "206211142",
    "PhoneNumber": "+6282292843533",
    "PlaceOfBirth": "MAKASSAR",
    "Position": "RECRUITMENT OFFICER",
    "Region_1": "MAKASSAR REGION",
    "UkDir": "BISNIS",
    "UkMgr": "SULAMPA",
    "UkSpv": "BUS",
    "REF 2023 (YA/(TIDAK)": "YA",
    "Password": "$2a$10$hP0KZY8uXP2uxFW.rW7tz.iNOxF4qJAqqF9eDVsFXLycxCflF6Jna"
  },
  {
    "Region": "MAKASSAR REGION",
    "Area": "MAKASAR",
    "Business": "O/S BUSINESS",
    "Gender": "WANITA",
    "Location": "PALU",
    "Name": "MERRY INDRAYANI SIAHAAN",
    "Nrk": "206170832",
    "PhoneNumber": "+6282195337088",
    "PlaceOfBirth": "TOILI",
    "Position": "PIC PALU",
    "Region_1": "MAKASSAR REGION",
    "UkDir": "BISNIS",
    "UkMgr": "SULAMPA",
    "UkSpv": "BUS",
    "REF 2023 (YA/(TIDAK)": "YA",
    "Password": "$2a$10$HGJGJ3uauL3jkhAi/M8mLuzrPb.0KLMVRUTATIrpH3TxNrhX4zhAW"
  },
  {
    "Region": "MAKASSAR REGION",
    "Area": "MAKASSAR",
    "Business": "O/S BUSINESS",
    "Gender": "PRIA",
    "Location": "MAKASSAR",
    "Name": "MUWAHHIDULLAH AL-FARRAQ",
    "Nrk": "206201093",
    "PhoneNumber": "+6285258586556",
    "PlaceOfBirth": "UJUNG PANDANG",
    "Position": "ACCOUNT MANAGER",
    "Region_1": "MAKASSAR REGION",
    "UkDir": "BISNIS",
    "UkMgr": "SULAMPA",
    "UkSpv": "BUS",
    "REF 2023 (YA/(TIDAK)": "YA",
    "Password": "$2a$10$MIMLM/q4JezGDIGe5tiu8ejpNSg0979R7Ts4f.RQtVaXvaAxvXtt6"
  },
  {
    "Region": "MAKASSAR REGION",
    "Area": "MAKASSAR",
    "Business": "O/S BUSINESS",
    "Gender": "WANITA",
    "Name": "A.NURASISA ASKARI ",
    "Nrk": "206211178",
    "PhoneNumber": "+628114630303",
    "PlaceOfBirth": "PALOPO",
    "Position": "BUSINESS SUPPORT",
    "Region_1": "MAKASSAR REGION",
    "UkDir": "BISNIS",
    "UkMgr": "SULAMPA",
    "UkSpv": "BUS",
    "REF 2023 (YA/(TIDAK)": "YA",
    "Password": "$2a$10$yY/lUMxNe0gULOzFxkCxI.HgzBlGxkEsn3rhyYdNbNrEqmqPxuWBi"
  },
  {
    "Region": "MAKASSAR REGION",
    "Area": "MAKASSAR",
    "Business": "O/S BUSINESS",
    "Gender": "PRIA",
    "Name": "MUH.SIDIQ RAMADHAN",
    "Nrk": "206221219",
    "PhoneNumber": "+6289527073974",
    "PlaceOfBirth": "UJUNG PANDANG",
    "Position": "ACCOUNT OFFICER",
    "Region_1": "MAKASSAR REGION",
    "UkDir": "BISNIS",
    "UkMgr": "SULAMPA",
    "UkSpv": "BUS",
    "REF 2023 (YA/(TIDAK)": "YA",
    "Password": "$2a$10$0TRRR1SPyZBHBY/wIFjz/e8Od3B8Js0nfxwwYlyZDr80OfEsP.gL2"
  },
  {
    "Region": "MAKASSAR REGION",
    "Area": "MAKASSAR",
    "Business": "O/S BUSINESS",
    "Gender": "WANITA",
    "Name": "JENNIFER WINARSO",
    "Nrk": "201221259",
    "PhoneNumber": "+6285105202008",
    "PlaceOfBirth": "UJUNG PANDANG",
    "Position": "BUSINESS MANAGER",
    "Region_1": "MAKASSAR REGION",
    "UkDir": "BISNIS",
    "UkMgr": "SULAMPA",
    "UkSpv": "BUS",
    "REF 2023 (YA/(TIDAK)": "YA",
    "Password": "$2a$10$Ahjho2e9BKiJERCCGBFNLeCCzJxysO7sjJwqQmKmzNBkXc1GdF0h2"
  },
  {
    "Region": "SEMARANG REGION",
    "Area": "SEMARANG",
    "Business": "O/S BUSINESS",
    "Gender": "PRIA",
    "Location": "SEMARANG",
    "Name": "ANDHIKA FAWZUL KHABIR",
    "Nrk": "204110232",
    "PhoneNumber": "+628562783888",
    "PlaceOfBirth": "SEMARANG",
    "Position": "SALES MANAGER",
    "Region_1": "SEMARANG REGION",
    "UkDir": "BISNIS",
    "UkMgr": "JATENG",
    "UkSpv": "BUS",
    "REF 2023 (YA/(TIDAK)": "YA",
    "Password": "$2a$10$r844FItWiGic2TRperE34uRA/BvKmrDBdB7Rh8wkm9DxN.AJZAb76"
  },
  {
    "Region": "SEMARANG REGION",
    "Area": "SEMARANG",
    "Business": "O/S BUSINESS",
    "Gender": "WANITA",
    "Location": "SEMARANG",
    "Name": "INDAH RETNO WATI",
    "Nrk": "204190985",
    "PhoneNumber": "+6282139530582",
    "PlaceOfBirth": "SEMARANG",
    "Position": "RECRUITMENT OFFICER ",
    "Region_1": "SEMARANG REGION",
    "UkDir": "BISNIS",
    "UkMgr": "JATENG",
    "UkSpv": "BUS",
    "REF 2023 (YA/(TIDAK)": "YA",
    "Password": "$2a$10$wKxcfNWOHvJ8ApOD211JVO6el9/rSlt9Ffnk1dtMKb0hZ8QBG5Rba"
  },
  {
    "Region": "SEMARANG REGION",
    "Area": "SEMARANG",
    "Business": "O/S BUSINESS",
    "Gender": "PRIA",
    "Location": "SEMARANG",
    "Name": "IWAN WIJAYANTO",
    "Nrk": "204170799",
    "PhoneNumber": "+6281947788999",
    "PlaceOfBirth": "SEMARANG",
    "Position": "ACCOUNT OFFICER",
    "Region_1": "SEMARANG REGION",
    "UkDir": "BISNIS",
    "UkMgr": "JATENG",
    "UkSpv": "BUS",
    "REF 2023 (YA/(TIDAK)": "YA",
    "Password": "$2a$10$yFAtKPyhHzkRaIYpeGUpL.4ViwEtxxxsoyM1miEVrmJq1MnzOAeWu"
  },
  {
    "Region": "SEMARANG REGION",
    "Area": "SEMARANG",
    "Business": "O/S BUSINESS",
    "Gender": "WANITA",
    "Location": "SEMARANG",
    "Name": "KUMALA ASRI PAMUNGKAS",
    "Nrk": "204191010",
    "PhoneNumber": "+6281542606970",
    "PlaceOfBirth": "SEMARANG ",
    "Position": "BUSINESS SUPPORT",
    "Region_1": "SEMARANG REGION",
    "UkDir": "BISNIS",
    "UkMgr": "JATENG",
    "UkSpv": "BUS",
    "REF 2023 (YA/(TIDAK)": "YA",
    "Password": "$2a$10$LH/1IzIcJVmpnNhK5L/f6eCjWydXD0uOv/PUWQOimpf7s/2ojaHQy"
  },
  {
    "Region": "SEMARANG REGION",
    "Area": "SEMARANG",
    "Business": "O/S BUSINESS",
    "Gender": "PRIA",
    "Location": "SEMARANG",
    "Name": "MOCH ERWIN WIDIAWAN",
    "Nrk": "204160618",
    "PhoneNumber": "+6289666769774",
    "PlaceOfBirth": "SEMARANG",
    "Position": "RECRUITMENT OFFICER JUNIOR",
    "Region_1": "SEMARANG REGION",
    "UkDir": "BISNIS",
    "UkMgr": "JATENG",
    "UkSpv": "BUS",
    "REF 2023 (YA/(TIDAK)": "YA",
    "Password": "$2a$10$c4d2vQhPyWnxaZpsvdsGUuTgIuBfhy.fKYvZSE6Fh7O1CmOygNCC."
  },
  {
    "Region": "SEMARANG REGION",
    "Area": "SEMARANG",
    "Business": "O/S BUSINESS",
    "Gender": "PRIA",
    "Location": "SEMARANG",
    "Name": "NUNUNG NURHIDAYAH",
    "Nrk": "204140425",
    "PhoneNumber": "+6285641838559",
    "PlaceOfBirth": "PEKALONGAN",
    "Position": "RECRUITMENT OFFICER SENIOR",
    "Region_1": "SEMARANG REGION",
    "UkDir": "BISNIS",
    "UkMgr": "JATENG",
    "UkSpv": "BUS",
    "REF 2023 (YA/(TIDAK)": "YA",
    "Password": "$2a$10$3ljhy1SK7TscmaSSe5oxBe83OkyDwMj6MghyRwJEaRYYME1xJsY76"
  },
  {
    "Region": "SEMARANG REGION",
    "Area": "SEMARANG",
    "Business": "O/S BUSINESS",
    "Gender": "WANITA",
    "Location": "SEMARANG",
    "Name": "VERONICA CHANDRA DEWI",
    "Nrk": "204110137",
    "PhoneNumber": "+628562917108",
    "PlaceOfBirth": "MAGELANG",
    "Position": "BUSINESS MANAGER",
    "Region_1": "SEMARANG REGION",
    "UkDir": "BISNIS",
    "UkMgr": "JATENG",
    "UkSpv": "BUS",
    "REF 2023 (YA/(TIDAK)": "YA",
    "Password": "$2a$10$/1k15oyb59uPjKvNGJou4eVmT4DarUsAyf.NNBcvUetttOLSoo9XC"
  },
  {
    "Region": "SEMARANG REGION",
    "Area": "SEMARANG",
    "Business": "O/S BUSINESS",
    "Gender": "PRIA",
    "Location": "SEMARANG",
    "Name": "NURUL ARIS ZULIYANTO",
    "Nrk": "204221230",
    "PhoneNumber": "+628985976733",
    "PlaceOfBirth": "JEPARA",
    "Position": "RECRUITMENT OFFICER - JUNIOR ",
    "Region_1": "SEMARANG REGION",
    "UkDir": "BISNIS",
    "UkMgr": "JATENG",
    "UkSpv": "BUS",
    "REF 2023 (YA/(TIDAK)": "BARU",
    "Password": "$2a$10$otmoy.fImgKLZ1gAgyOX3edmKx93M3OAYx2jcuCVNSBDHSghcu6SW"
  },
  {
    "Region": "JAKARTA 6 REGION",
    "Area": "JAKARTA",
    "Business": "O/S BUSINESS",
    "Gender": "WANITA",
    "Location": "JAKARTA",
    "Name": "FITRI OKTAVIA NINGSIH",
    "Nrk": "201211157",
    "PhoneNumber": "+6281319900314",
    "PlaceOfBirth": "TANGERANG",
    "Position": "BUSINESS MANAGER",
    "Region_1": "JAKARTA REGION 6",
    "UkDir": "BISNIS",
    "UkMgr": "JAKARTA-6",
    "UkSpv": "BUS",
    "REF 2023 (YA/(TIDAK)": "BARU",
    "Password": "$2a$10$EY6KE8wim2l1db20M2Ryr.ZJoZSzJwcdBfiIVJutuaflCG43E58ES"
  },
  {
    "Region": "JAKARTA 6 REGION",
    "Area": "JAKARTA",
    "Business": "O/S BUSINESS",
    "Gender": "WANITA",
    "Location": "JAKARTA",
    "Name": "SITI NURHAYATI",
    "Nrk": "201211200",
    "PhoneNumber": "+628998851236",
    "PlaceOfBirth": "TANGERANG",
    "Position": "ADMIN FMCG",
    "Region_1": "JAKARTA REGION 6",
    "UkDir": "BISNIS",
    "UkMgr": "JAKARTA-6",
    "UkSpv": "BUS",
    "REF 2023 (YA/(TIDAK)": "BARU",
    "Password": "$2a$10$17qlAYn5o2c4BYqC1wuHNuJMQtYW7aQ6i5OKiNyd6sM0gkFsyA3/S"
  },
  {
    "Region": "JAKARTA 6 REGION",
    "Area": "JAKARTA",
    "Business": "O/S BUSINESS",
    "Gender": "WANITA",
    "Location": "JAKARTA",
    "Name": "UMMU HAEBAH",
    "Nrk": "201211185",
    "PhoneNumber": "+6289503558209",
    "PlaceOfBirth": "BANYUMAS",
    "Position": "PIC ",
    "Region_1": "JAKARTA REGION 6",
    "UkDir": "BISNIS",
    "UkMgr": "JAKARTA-6",
    "UkSpv": "BUS",
    "REF 2023 (YA/(TIDAK)": "BARU",
    "Password": "$2a$10$VPKW6maASDElP17r9S/u7OmLc7EKkh.V8c92w3GhreEPOvOfkC0Vu"
  },
  {
    "Region": "JAKARTA 6 REGION",
    "Area": "JAKARTA",
    "Business": "O/S BUSINESS",
    "Gender": "WANITA",
    "Location": "JAKARTA",
    "Name": "DINDA PUJI MIRANTI",
    "Nrk": "201221271",
    "PhoneNumber": "+6285810250173",
    "PlaceOfBirth": "JAKARTA",
    "Position": "PIC",
    "Region_1": "JAKARTA REGION 6",
    "UkDir": "BISNIS",
    "UkMgr": "JAKARTA-6",
    "UkSpv": "BUS",
    "REF 2023 (YA/(TIDAK)": "BARU",
    "Password": "$2a$10$25k656A2ViFkbGZUpAlDTedfY9LX0gTOsySR1OE6d/usxUWbf/1GK"
  },
  {
    "Region": "JAKARTA 6 REGION",
    "Area": "JAKARTA",
    "Business": "O/S BUSINESS",
    "Gender": "PRIA",
    "Location": "JAKARTA",
    "Name": "TIO FIKRI SUPRIYANTO",
    "Nrk": "201221275",
    "PhoneNumber": "+6285697353830",
    "PlaceOfBirth": "BOGOR",
    "Position": "PIC ",
    "Region_1": "JAKARTA REGION 6",
    "UkDir": "BISNIS",
    "UkMgr": "JAKARTA-6",
    "UkSpv": "BUS",
    "REF 2023 (YA/(TIDAK)": "BARU",
    "Password": "$2a$10$VwIyAPWEqcRHxrGTdPO8fOTCMASE9FXj/gQY0G79q3QTfky.s80KK"
  },
  {
    "Region": "JAKARTA 6 REGION",
    "Area": "JAKARTA",
    "Business": "O/S BUSINESS",
    "Gender": "WANITA",
    "Location": "JAKARTA",
    "Name": "FABILA IBTISAMAH",
    "Nrk": "201221239",
    "PhoneNumber": "+6281932452109",
    "PlaceOfBirth": "JAKARTA",
    "Position": "RECRUITMENT OFFICER ",
    "Region_1": "JAKARTA REGION 6",
    "UkDir": "BISNIS",
    "UkMgr": "JAKARTA-6",
    "UkSpv": "BUS",
    "REF 2023 (YA/(TIDAK)": "BARU",
    "Password": "$2a$10$iUZ88DWjOjHfKHybZzEwReSou21uOr.0ZbXfAryZ9WTJeuH24LoHO"
  },
  {
    "Region": "BANDUNG REGION",
    "Area": "JABAR",
    "Business": "O/S BUSINESS",
    "Gender": "WANITA",
    "Location": "BANDUNG",
    "Name": "EKA HARDIANTI",
    "Nrk": "205180942",
    "PhoneNumber": "+6281296629786",
    "PlaceOfBirth": "KUNINGAN",
    "Position": "PIC KARAWANG",
    "Region_1": "BANDUNG REGION",
    "UkDir": "BUS",
    "UkMgr": "JABAR",
    "UkSpv": "BUS",
    "REF 2023 (YA/(TIDAK)": "YA",
    "Password": "$2a$10$NXCebH.mNdkvT8Y2z1/fPucUGhZifdzxQMOXYsPZJWuAZtxMhEldK"
  },
  {
    "Region": "BANDUNG REGION",
    "Area": "JABAR",
    "Business": "O/S BUSINESS",
    "Gender": "PRIA",
    "Location": "BANDUNG",
    "Name": "FIKRI FAUZI RIYANTO",
    "Nrk": "205180911",
    "PhoneNumber": "+6281910614796",
    "PlaceOfBirth": "BANDUNG",
    "Position": "RECRUITMENT OFFICER",
    "Region_1": "BANDUNG REGION",
    "UkDir": "BUS",
    "UkMgr": "JABAR",
    "UkSpv": "BUS",
    "REF 2023 (YA/(TIDAK)": "YA",
    "Password": "$2a$10$V5YzCs7q8Pd/giT9CCAZ1uiRmAYsUO4dfeEb5.NB0ptLELFsia4yy"
  },
  {
    "Region": "BANDUNG REGION",
    "Area": "JABAR",
    "Business": "O/S BUSINESS",
    "Gender": "WANITA",
    "Location": "BANDUNG",
    "Name": "FITRI WULAN ANDRIANI",
    "Nrk": "205180896",
    "PhoneNumber": "+6281993012931",
    "PlaceOfBirth": "BANDUNG",
    "Position": "BUSINESS SUPPORT",
    "Region_1": "BANDUNG REGION",
    "UkDir": "BUS",
    "UkMgr": "JABAR",
    "UkSpv": "BUS",
    "REF 2023 (YA/(TIDAK)": "YA",
    "Password": "$2a$10$mKSoOYRKxtMR6l5F2T5ZZeVtYAWOs6ts63ngVfE.AASof1F9l2AkK"
  },
  {
    "Region": "BANDUNG REGION",
    "Area": "JABAR",
    "Business": "O/S BUSINESS",
    "Gender": "PRIA",
    "Location": "BANDUNG",
    "Name": "HENDAR RISWARA",
    "Nrk": "205201146",
    "PhoneNumber": "+6285155122504",
    "PlaceOfBirth": "GARUT",
    "Position": "RECRUITMENT OFFICER",
    "Region_1": "BANDUNG REGION",
    "UkDir": "BUS",
    "UkMgr": "JABAR",
    "UkSpv": "BUS",
    "REF 2023 (YA/(TIDAK)": "YA",
    "Password": "$2a$10$zVPmaToTgDZeh55Mw22G8uCoXVQaDUddycglb/Mz1ccv/0SrOhG8S"
  },
  {
    "Region": "BANDUNG REGION",
    "Area": "JABAR",
    "Business": "O/S BUSINESS",
    "Gender": "PRIA",
    "Location": "BANDUNG",
    "Name": "ILHAM CAHYA FITRIAN YOLIA",
    "Nrk": "205201210",
    "PhoneNumber": "+6281223678755",
    "PlaceOfBirth": "CIAMIS",
    "Position": "PIC TASIKMALAYA",
    "Region_1": "BANDUNG REGION",
    "UkDir": "BUS",
    "UkMgr": "JABAR",
    "UkSpv": "BUS",
    "REF 2023 (YA/(TIDAK)": "YA",
    "Password": "$2a$10$QhOl614Bp6QXJACRPCbWXOZS2IHakjOUhZuViM9/ABCDOF7wLq2yi"
  },
  {
    "Region": "BANDUNG REGION",
    "Area": "JABAR",
    "Business": "O/S BUSINESS",
    "Gender": "WANITA",
    "Location": "BANDUNG",
    "Name": "JANNI MULIAWATI",
    "Nrk": "205110185",
    "PhoneNumber": "+6287822786020",
    "PlaceOfBirth": "BANDUNG",
    "Position": "BUSINESS MANAGER",
    "Region_1": "BANDUNG REGION",
    "UkDir": "BUS",
    "UkMgr": "JABAR",
    "UkSpv": "BUS",
    "REF 2023 (YA/(TIDAK)": "YA",
    "Password": "$2a$10$51Qgl1lqZyxq9LYh7q2JaulwCpnsBZX8EebIVvSgHGtSHbYfDjCje"
  },
  {
    "Region": "BANDUNG REGION",
    "Area": "JABAR",
    "Business": "O/S BUSINESS",
    "Gender": "PRIA",
    "Location": "BANDUNG",
    "Name": "RANDI HARDIANSYAH",
    "Nrk": "205170801",
    "PhoneNumber": "+6289656718699",
    "PlaceOfBirth": "BANDUNG",
    "Position": "OFFICE SUPPORT",
    "Region_1": "BANDUNG REGION",
    "UkDir": "CSO",
    "UkMgr": "JABAR",
    "UkSpv": "BUS",
    "REF 2023 (YA/(TIDAK)": "YA",
    "Password": "$2a$10$2pldEJ8jwaNHJ1Vo5EMhS.aMechcrzfC6Y2.G2WaH8S4swZAtqmUC"
  },
  {
    "Region": "BANDUNG REGION",
    "Area": "JABAR",
    "Business": "O/S BUSINESS",
    "Gender": "WANITA",
    "Location": "BANDUNG",
    "Name": "RAISHA RISHELLIA",
    "Nrk": "205211188",
    "PhoneNumber": "+6285314956569",
    "PlaceOfBirth": "BANDUNG",
    "Position": "RECRUITMENT OFFICER",
    "Region_1": "BANDUNG REGION",
    "UkMgr": "JABAR",
    "UkSpv": "BUS",
    "REF 2023 (YA/(TIDAK)": "BARU",
    "Password": "$2a$10$rS1kMXmjgchyDNCFeE0EA.brJcm8fdtiI18mOlrepa24aTZtQ/Mhq"
  },
  {
    "Region": "BANDUNG REGION",
    "Area": "JABAR",
    "Business": "O/S BUSINESS",
    "Gender": "PRIA",
    "Location": "BANDUNG",
    "Name": "RIZQI ROMDONI",
    "Nrk": "205221242",
    "PhoneNumber": "+6281320331933",
    "PlaceOfBirth": "GARUT",
    "Position": "RECRUITMENT OFFICER",
    "Region_1": "BANDUNG REGION",
    "UkMgr": "JABAR",
    "UkSpv": "BUS",
    "REF 2023 (YA/(TIDAK)": "BARU",
    "Password": "$2a$10$rJR9LFbOETwEMrweciGWB.L3dKYZj8tlvyTPL5nm0oZkv1jizsoCe"
  },
  {
    "Region": "BANDUNG REGION",
    "Area": "JABAR",
    "Business": "O/S BUSINESS",
    "Gender": "WANITA",
    "Location": "BANDUNG",
    "Name": "OSI TRIANI NURFALAH",
    "Nrk": "205221251",
    "PhoneNumber": "+6285759062330",
    "PlaceOfBirth": "BANDUNG",
    "Position": "RECRUITMENT OFFICER",
    "Region_1": "BANDUNG REGION",
    "UkMgr": "JABAR",
    "UkSpv": "BUS",
    "REF 2023 (YA/(TIDAK)": "BARU",
    "Password": "$2a$10$.wjb2JEJ7NVOGksFHCxX0OBse7AQQiRgt.SDFcZDlxrWSwTqmG38."
  },
  {
    "Region": "JAKARTA 3 REGION",
    "Area": "JAKARTA",
    "Business": "O/S BUSINESS",
    "Gender": "PRIA",
    "Location": "JAKARTA",
    "Name": "DJOKO PRIYATNO",
    "Nrk": "201191064",
    "PhoneNumber": "+62816758188",
    "PlaceOfBirth": "PASURUAN",
    "Position": "PIC & ADMIN",
    "Region_1": "JAKARTA REGION",
    "UkDir": "BISNIS",
    "UkMgr": "JAKARTA-3",
    "UkSpv": "BUS",
    "REF 2023 (YA/(TIDAK)": "YA",
    "Password": "$2a$10$vIAJzBiYCN7wE57zQPLAY.WxGY6b85/KrPLFOBCOoep5hnZnz9eHi"
  },
  {
    "Region": "JAKARTA 3 REGION",
    "Area": "JAKARTA",
    "Business": "O/S BUSINESS",
    "Gender": "PRIA",
    "Location": "JAKARTA",
    "Name": "VIRGO WIRAWANTO",
    "Nrk": "201180858",
    "PhoneNumber": "+628170999179",
    "PlaceOfBirth": "BLITAR",
    "Position": "BUSINESS MANAGER",
    "Region_1": "JAKARTA REGION",
    "UkDir": "BISNIS",
    "UkMgr": "JAKARTA-3",
    "UkSpv": "BUS",
    "REF 2023 (YA/(TIDAK)": "YA",
    "Password": "$2a$10$8YpQh8AhpKQ6BrpSG5mJFuOe6MJbGu01AH6Opv3zFD.w16dFxHjb6"
  },
  {
    "Region": "JAKARTA 3 REGION",
    "Area": "JAKARTA",
    "Business": "O/S BUSINESS",
    "Gender": "PRIA",
    "Location": "JAKARTA",
    "Name": "CHEVIN SETIAWAN KATO",
    "Nrk": "201211183",
    "PhoneNumber": "+6282247245986",
    "PlaceOfBirth": "SABU",
    "Position": "PIC & ADMIN",
    "Region_1": "JAKARTA REGION",
    "UkDir": "BISNIS",
    "UkMgr": "JAKARTA-3",
    "UkSpv": "BUS",
    "REF 2023 (YA/(TIDAK)": "BARU",
    "Password": "$2a$10$gy/xK57Lgt9k4BXjoaifCOTccwL/vAc5HzICSAVs/U7U3otglRxiC"
  },
  {
    "Region": "BALI REGION",
    "Area": "KUPANG",
    "Business": "O/S BUSINESS",
    "Gender": "WANITA",
    "Location": "KUPANG",
    "Name": "ERSIANA MICHELE ERESTASIA MALELAK",
    "Nrk": "207201115",
    "PhoneNumber": "+6281287585368",
    "PlaceOfBirth": "KUPANG",
    "Position": "PIC KUPANG",
    "Region_1": "BALI REGION",
    "UkDir": "BISNIS",
    "UkMgr": "BALI-NUSRA",
    "UkSpv": "BUS",
    "REF 2023 (YA/(TIDAK)": "YA",
    "Password": "$2a$10$iesP7vQ.IfPIiuKyqkMm8.eE1sZ/02x2zkusxKrAYyKr.V9nkCKcC"
  },
  {
    "Region": "BALI REGION",
    "Area": "BALI",
    "Business": "O/S BUSINESS",
    "Gender": "PRIA",
    "Location": "MATARAM",
    "Name": "I NYOMAN NING WIDIANA",
    "Nrk": "207170817",
    "PhoneNumber": "+6281237573736",
    "PlaceOfBirth": "MATARAM",
    "Position": "PIC MATARAM",
    "Region_1": "BALI REGION",
    "UkDir": "BISNIS",
    "UkMgr": "BALI-NUSRA",
    "UkSpv": "BUS",
    "REF 2023 (YA/(TIDAK)": "YA",
    "Password": "$2a$10$3FujLxSYZvi4HL.Y9KT3WOaexpN.PKdNdiEX/.zN0ETfGUuE5SOk2"
  },
  {
    "Region": "BALI REGION",
    "Area": "BALI",
    "Business": "O/S BUSINESS",
    "Gender": "PRIA",
    "Location": "DENPASAR",
    "Name": "NI PUTU MAS DESI MEKARSARI",
    "Nrk": "207160663",
    "PhoneNumber": "+6287883582503",
    "PlaceOfBirth": "KAYU PUTIH",
    "Position": "ADMINISTRASI SUPPORT",
    "Region_1": "BALI REGION",
    "UkDir": "BISNIS",
    "UkMgr": "BALI-NUSRA",
    "UkSpv": "BUS",
    "REF 2023 (YA/(TIDAK)": "YA",
    "Password": "$2a$10$7jg9wSeX6tQw22qTRVYSsOBIwyRXfpD6Adt4Y4168Oq1cvuv0CSny"
  },
  {
    "Region": "BALI REGION",
    "Area": "BALI",
    "Business": "O/S BUSINESS",
    "Gender": "PRIA",
    "Location": "DENPASAR",
    "Name": "NI WAYAN TITA CANDRA DEWI",
    "Nrk": "207191060",
    "PhoneNumber": "+6287702198809",
    "PlaceOfBirth": "PADANGANKAJA",
    "Position": "RECRUITMENT OFFICER",
    "Region_1": "BALI REGION",
    "UkDir": "BISNIS",
    "UkMgr": "BALI-NUSRA",
    "UkSpv": "BUS",
    "REF 2023 (YA/(TIDAK)": "YA",
    "Password": "$2a$10$N6FAW/aPBvHyyLhOB22utO1ONbiBLfkKqT2wFbEE/NZsit969rwdm"
  },
  {
    "Region": "BALI REGION",
    "Area": "BALI",
    "Business": "O/S BUSINESS",
    "Gender": "PRIA",
    "Location": "DENPASAR",
    "Name": "NIBENIA ZAI",
    "Nrk": "207170785",
    "PhoneNumber": "+6285338474998",
    "PlaceOfBirth": "NIAS",
    "Position": "RECRUITMENT OFFICER",
    "Region_1": "BALI REGION",
    "UkDir": "BISNIS",
    "UkMgr": "BALI-NUSRA",
    "UkSpv": "BUS",
    "REF 2023 (YA/(TIDAK)": "YA",
    "Password": "$2a$10$dXr6GRInbDUWe53jUkE1O.YsB4XXcMXgOW2cgauIKNQUmH8mmZMv."
  },
  {
    "Region": "BALI REGION",
    "Area": "BALI",
    "Business": "O/S BUSINESS",
    "Gender": "WANITA",
    "Location": "DENPASAR",
    "Name": "YOVITA RIZKHA AQUANIETA",
    "Nrk": "203130355",
    "PhoneNumber": "+6287850098906",
    "PlaceOfBirth": "JAKARTA",
    "Position": "BUSINESS MANAGER",
    "Region_1": "BALI REGION",
    "UkDir": "BISNIS",
    "UkMgr": "BALI-NUSRA",
    "UkSpv": "BUS",
    "REF 2023 (YA/(TIDAK)": "YA",
    "Password": "$2a$10$sIk0aW1Pcs3SzjyErCJ9.OTx5jSwnz2PaCzmdDieDJ9itABlhpY9i"
  },
  {
    "Region": "SURABAYA REGION",
    "Area": "SURABAYA",
    "Business": "O/S BUSINESS",
    "Gender": "PRIA",
    "Location": "SURABAYA",
    "Name": "IWAN FARIS",
    "Nrk": "203211148",
    "PhoneNumber": "+6285745733966",
    "PlaceOfBirth": "LAMONGAN",
    "Position": "RECRUITMENT OFFICER",
    "Region_1": "SURABAYA REGION",
    "UkDir": "BISNIS",
    "UkMgr": "JATIM",
    "UkSpv": "BUS",
    "REF 2023 (YA/(TIDAK)": "TIDAK",
    "Password": "$2a$10$gD7yf43BSGs1lzLaeiCtYOdOl7aBAkwswLTI3Pnl62W/ReJGZk1IG"
  },
  {
    "Region": "SURABAYA REGION",
    "Area": "SURABAYA",
    "Business": "O/S BUSINESS",
    "Gender": "PRIA",
    "Location": "MALANG",
    "Name": "TEGUH ESTU LEGOWO",
    "Nrk": "203160578",
    "PhoneNumber": "+6285333283388",
    "PlaceOfBirth": "MALANG",
    "Position": "RECRUITMENT OFFICER - MALANG",
    "Region_1": "SURABAYA REGION",
    "UkDir": "BISNIS",
    "UkMgr": "JATIM",
    "UkSpv": "BUS",
    "REF 2023 (YA/(TIDAK)": "TIDAK",
    "Password": "$2a$10$ZUvQVi73wYD/C8Lifi1gMupa7Ykv/brKoLjs6fhv3WqZqL09muojm"
  },
  {
    "Region": "SURABAYA REGION",
    "Area": "JAWA TIMUR",
    "Business": "O/S BUSINESS",
    "Gender": "PRIA",
    "Location": "SURABAYA",
    "Name": "AGUS HENDRO KARTIKO",
    "Nrk": "203100086",
    "PhoneNumber": "+628155111197",
    "PlaceOfBirth": "SURABAYA",
    "Position": "RO",
    "Region_1": "SURABAYA REGION",
    "UkDir": "BUSINESS",
    "UkMgr": "JATIM",
    "UkSpv": "BUS",
    "REF 2023 (YA/(TIDAK)": "YA",
    "Password": "$2a$10$DYFCdX3Vxs5jNev5Xa./Q.s2fYMlvTQJ4pQ2eW1Y2wuoGtiIp3Ce6"
  },
  {
    "Region": "SURABAYA REGION",
    "Area": "JAWA TIMUR",
    "Business": "O/S BUSINESS",
    "Gender": "PRIA",
    "Location": "SURABAYA",
    "Name": "DIMAS RIHARDHYKA",
    "Nrk": "203170815",
    "PhoneNumber": "+6285731064106",
    "PlaceOfBirth": "SURABAYA",
    "Position": "AO",
    "Region_1": "SURABAYA REGION",
    "UkDir": "BUSINESS",
    "UkMgr": "JATIM",
    "UkSpv": "BUS",
    "REF 2023 (YA/(TIDAK)": "YA",
    "Password": "$2a$10$WaTBuhijHLcUUoc5L7/j4OnvOKB65g92BbmHmM5GJyeHQqpjBfOKS"
  },
  {
    "Region": "SURABAYA REGION",
    "Area": "JAWA TIMUR",
    "Business": "O/S BUSINESS",
    "Gender": "PRIA",
    "Location": "SURABAYA",
    "Name": "JONI TEDDY RIANTO",
    "PhoneNumber": "+6285236870023",
    "PlaceOfBirth": "BANGKALAN",
    "Position": "RO",
    "Region_1": "SURABAYA REGION",
    "UkDir": "BUSINESS",
    "UkMgr": "JATIM",
    "UkSpv": "BUS",
    "REF 2023 (YA/(TIDAK)": "BARU",
    "Nrk": "undefined",
    "Password": "$2a$10$rRsJSLBLHS8nIz4zj0K3m.WVzS534tM8Es7vxv//fJtMR04wdyH86"
  },
  {
    "Region": "SURABAYA REGION",
    "Area": "JAWA TIMUR",
    "Business": "O/S BUSINESS",
    "Gender": "WANITA",
    "Location": "MALANG",
    "Name": "LAILI KURNIAWATI",
    "PhoneNumber": "+6281333192359",
    "PlaceOfBirth": "MALANG",
    "Position": "RO",
    "Region_1": "SURABAYA REGION",
    "UkDir": "BUSINESS",
    "UkMgr": "JATIM",
    "UkSpv": "BUS",
    "REF 2023 (YA/(TIDAK)": "BARU",
    "Nrk": "undefined",
    "Password": "$2a$10$nDbTsTPDkRhEKmWtN1cd8OyTFPeDQhUydZDb1eueHoARyWCEz1SXq"
  },
  {
    "Region": "SURABAYA REGION",
    "Area": "JAWA TIMUR",
    "Business": "O/S BUSINESS",
    "Gender": "PRIA",
    "Location": "SURABAYA",
    "Name": "MOCHAMMAD SHOLAHUDDIN",
    "PhoneNumber": "+6281515356190",
    "PlaceOfBirth": "JOMBANG",
    "Position": "RO",
    "Region_1": "SURABAYA REGION",
    "UkDir": "BUSINESS",
    "UkMgr": "JATIM",
    "UkSpv": "BUS",
    "REF 2023 (YA/(TIDAK)": "BARU",
    "Nrk": "undefined",
    "Password": "$2a$10$bRmWlpCrGE46yHnBu5iahORD.APkbzrOrPWGhUBayWozQzSCB0./6"
  },
  {
    "Region": "SURABAYA REGION",
    "Area": "JAWA TIMUR",
    "Business": "O/S BUSINESS",
    "Gender": "WANITA",
    "Location": "SURABAYA",
    "Name": "PRANING TYAS EKA PRATIWI",
    "Nrk": "203160577",
    "PhoneNumber": "+6289690781856",
    "PlaceOfBirth": "SURABAYA",
    "Position": "ADMIN",
    "Region_1": "SURABAYA REGION",
    "UkDir": "BUSINESS",
    "UkMgr": "JATIM",
    "UkSpv": "BUS",
    "REF 2023 (YA/(TIDAK)": "YA",
    "Password": "$2a$10$KwPJudnrbHpSQrW3Pz9ioe9SFEkdTvt0Ob5gJz..K77sNQf/PyMXu"
  },
  {
    "Region": "SURABAYA REGION",
    "Area": "JAWA TIMUR",
    "Business": "O/S BUSINESS",
    "Gender": "PRIA",
    "Location": "SURABAYA",
    "Name": "RIZKY SEPTYAN RACHMAWAB",
    "PhoneNumber": "+62895800365051",
    "PlaceOfBirth": "SURABAYA",
    "Position": "RO",
    "Region_1": "SURABAYA REGION",
    "UkDir": "BUSINESS",
    "UkMgr": "JATIM",
    "UkSpv": "BUS",
    "REF 2023 (YA/(TIDAK)": "BARU",
    "Nrk": "undefined",
    "Password": "$2a$10$D1Zj49NnqcoMPsd2/zDxduXBrrECHLFdK365In62UV8J9efiu/Z4K"
  },
  {
    "Region": "SURABAYA REGION",
    "Area": "JAWA TIMUR",
    "Business": "O/S BUSINESS",
    "Gender": "PRIA",
    "Location": "SURABAYA",
    "Name": "SYUKRON",
    "Nrk": "203160600",
    "PhoneNumber": "+6281333091667",
    "PlaceOfBirth": "GRESIK",
    "Position": "BM",
    "Region_1": "SURABAYA REGION",
    "UkDir": "BUSINESS",
    "UkMgr": "JATIM",
    "UkSpv": "BUS",
    "REF 2023 (YA/(TIDAK)": "YA",
    "Password": "$2a$10$e.DCDv/6MfMUog8w1fE5CuFK7drUSv63/Yn4S02FF7RDAm3Y1Ucii"
  },
  {
    "Region": "JAKARTA 5 REGION",
    "Area": "JAKARTA",
    "Business": "O/S BUSINESS",
    "Gender": "PRIA",
    "Location": "JAKARTA",
    "Name": "RUDIANSYAH",
    "Nrk": "201201098",
    "PhoneNumber": "+6281584554835",
    "PlaceOfBirth": "JAKARTA",
    "Position": "AO - PIC",
    "Region_1": "JAKARTA-5",
    "UkDir": "BISNIS",
    "UkMgr": "JAKARTA-5",
    "UkSpv": "BUS",
    "REF 2023 (YA/(TIDAK)": "YA",
    "KETERANGAN": "PINDAHAN DARI JKT 2",
    "Password": "$2a$10$nHTBw3QFpTuqIK105Grv5.HM7NyZRNofBwlxW2fnRES01unwKsPfW"
  },
  {
    "Region": "JAKARTA 5 REGION",
    "Area": "JAKARTA",
    "Business": "O/S BUSINESS",
    "Gender": "PRIA",
    "Location": "JAKARTA",
    "Name": "M INDRA HILMAN B",
    "Nrk": "201160613",
    "PhoneNumber": "+6289608937210",
    "PlaceOfBirth": "JAKARTA",
    "Position": "AO - PIC",
    "Region_1": "JAKARTA-5",
    "UkDir": "BISNIS",
    "UkMgr": "JAKARTA-5",
    "UkSpv": "BUS",
    "REF 2023 (YA/(TIDAK)": "YA",
    "KETERANGAN": "PINDAHAN DARI JKT 2",
    "Password": "$2a$10$BT9uxRDLo8cr5xwtgCzWjOLHxoIKTbbAcHTJKVmeFZBTZeUPE.6xO"
  },
  {
    "Region": "JAKARTA 5 REGION",
    "Area": "JAKARTA",
    "Business": "O/S BUSINESS",
    "Gender": "PRIA",
    "Location": "JAKARTA",
    "Name": "BAGUS NUGRAHA",
    "Nrk": "201221231",
    "PhoneNumber": "+62895325224111",
    "PlaceOfBirth": "JAKARTA",
    "Position": "RECRUITMENT OFFICER - SENIOR",
    "Region_1": "JAKARTA-5",
    "UkDir": "BISNIS",
    "UkMgr": "JAKARTA-5",
    "UkSpv": "BUS",
    "REF 2023 (YA/(TIDAK)": "BARU",
    "Password": "$2a$10$Jf4S.XLu6D7HxnkV7gNlK.9w0RFecdyeHhusYHi51XxwSnYli65aK"
  },
  {
    "Region": "JAKARTA 5 REGION",
    "Area": "JAKARTA",
    "Business": "O/S BUSINESS",
    "Gender": "PRIA",
    "Location": "JAKARTA",
    "Name": "HERLAMBANG ",
    "Nrk": "201211144",
    "PhoneNumber": "+6281210103603",
    "PlaceOfBirth": "JAKARTA",
    "Position": "RECRUITMENT OFFICER - SENIOR",
    "Region_1": "JAKARTA-5",
    "UkDir": "BISNIS",
    "UkMgr": "JAKARTA-5",
    "UkSpv": "BUS",
    "REF 2023 (YA/(TIDAK)": "BARU",
    "Password": "$2a$10$j7e8A1F/Jektak1WCmykxuoYxcC8txunNP4CAAaNEdS.WXlSZjvL2"
  },
  {
    "Region": "JAKARTA 5 REGION",
    "Area": "JAKARTA",
    "Business": "O/S BUSINESS",
    "Gender": "PREMPUAN",
    "Location": "JAKARTA",
    "Name": "NURLIA PRATIWI",
    "Nrk": "201211143",
    "PhoneNumber": "+6281218911644",
    "PlaceOfBirth": "JAKARTA",
    "Position": "RECRUITMENT OFFICER - SENIOR",
    "Region_1": "JAKARTA-5",
    "UkDir": "BISNIS",
    "UkMgr": "JAKARTA-5",
    "UkSpv": "BUS",
    "REF 2023 (YA/(TIDAK)": "BARU",
    "Password": "$2a$10$Ndnw6.jWzqp9Cgcylmxr..0sVwtev9ydvI5nn0az6pnaRaZaF32ua"
  },
  {
    "Region": "JAKARTA 5 REGION",
    "Area": "JAKARTA",
    "Business": "O/S BUSINESS",
    "Gender": "PREMPUAN",
    "Location": "JAKARTA",
    "Name": "ANITA FLORENTINA PITAULI",
    "Nrk": "201211127",
    "PhoneNumber": "+628871861121",
    "PlaceOfBirth": "JAKARTA",
    "Position": "AO - PIC",
    "Region_1": "JAKARTA-5",
    "UkDir": "BISNIS",
    "UkMgr": "JAKARTA-5",
    "UkSpv": "BUS",
    "REF 2023 (YA/(TIDAK)": "YA",
    "KETERANGAN": "PINDAHAN DARI JKT 2",
    "Password": "$2a$10$Fna6gsLWiC9qYpB0IVbmEuAkxgmXi853LsTZfoq1mF.H0v5OZqqJ6"
  },
  {
    "Region": "JAKARTA 5 REGION",
    "Area": "JAKARTA",
    "Business": "O/S BUSINESS",
    "Gender": "PRIA",
    "Location": "JAKARTA",
    "Name": "MUHAMMAD AKBAR HIKMA",
    "Nrk": "201221273",
    "PhoneNumber": "+6285775451800",
    "PlaceOfBirth": "JAKARTA",
    "Position": "RECRUITMENT OFFICER - SENIOR",
    "Region_1": "JAKARTA-5",
    "UkDir": "BISNIS",
    "UkMgr": "JAKARTA-5",
    "UkSpv": "BUS",
    "REF 2023 (YA/(TIDAK)": "BARU",
    "Password": "$2a$10$B5XCa6Dnq8mbVLK6WMlqdOz.HWM2bxQI/NqGj5htwMT9/igm72ltO"
  },
  {
    "Region": "JAKARTA 5 REGION",
    "Area": "JAKARTA",
    "Business": "O/S BUSINESS",
    "Gender": "PRIA",
    "Location": "JAKARTA",
    "Name": "ASRI IBRAHIM",
    "Nrk": "201100038",
    "PhoneNumber": "+628561467798",
    "PlaceOfBirth": "JAKARTA",
    "Position": "BUSINESS MANAGER",
    "Region_1": "JAKARTA 5 REGION",
    "UkDir": "BISNIS",
    "UkMgr": "JAKARTA-5",
    "UkSpv": "BUS",
    "REF 2023 (YA/(TIDAK)": "YA",
    "KETERANGAN": "PINDAHAN DARI JKT 2",
    "Password": "$2a$10$mZKtA4bge.RdKkUBJIumkeYIWhkkgHk81jqWjrenVjC.16qJFt84S"
  },
  {
    "Region": "JAKARTA 2 REGION",
    "Area": "JAKARTA",
    "Business": "OS/BUSINESS",
    "Gender": "PRIA",
    "Location": "JAKARTA",
    "Name": "AGUS GUNAWAN",
    "Nrk": "201201106",
    "PhoneNumber": "+6281285434440",
    "PlaceOfBirth": "JAKARTA",
    "Position": "KORLAP ANCOL",
    "Region_1": "JAKARTA 2 REGION",
    "UkDir": "BISNIS",
    "UkMgr": "JAKARTA-2",
    "UkSpv": "BUS",
    "REF 2023 (YA/(TIDAK)": "YA",
    "Password": "$2a$10$EbL/ntirMz/trKJEKQdvM.oM536/yEHvFVaKXYpGAb41CxKHU9rH."
  },
  {
    "Region": "JAKARTA 2 REGION",
    "Area": "JAKARTA",
    "Business": "OS/BUSINESS",
    "Gender": "PRIA",
    "Location": "JAKARTA",
    "Name": "AGUS SUTANTO",
    "Nrk": "201170747",
    "PhoneNumber": "+6281310008276",
    "PlaceOfBirth": "YOGYAKARTA",
    "Position": "KORLAP ANCOL ",
    "Region_1": "JAKARTA 2 REGION",
    "UkDir": "BISNIS",
    "UkMgr": "JAKARTA-2",
    "UkSpv": "BUS",
    "REF 2023 (YA/(TIDAK)": "YA",
    "Password": "$2a$10$dbes42zHYItqyvdLF0XFsOVy8dKuWnG1clgz.uv6Fpvaw9ZkLmhDy"
  },
  {
    "Region": "JAKARTA 2 REGION",
    "Area": "JAKARTA",
    "Business": "OS/BUSINESS",
    "Gender": "PRIA",
    "Location": "JAKARTA",
    "Name": "ANGGA FREDITYA NAT",
    "Nrk": "201211117",
    "PhoneNumber": "+6285776473145",
    "PlaceOfBirth": "JAKARTA",
    "Position": "AO - PIC",
    "Region_1": "JAKARTA 2 REGION",
    "UkDir": "BISNIS",
    "UkMgr": "JAKARTA-2",
    "UkSpv": "BUS",
    "REF 2023 (YA/(TIDAK)": "YA",
    "Password": "$2a$10$o6TrmHMbceRG8u9qGoMaNeG7CWqD7zg7ayDX539Ns17HmJ2fGMkPi"
  },
  {
    "Region": "JAKARTA 2 REGION",
    "Area": "JAKARTA",
    "Business": "OS/BUSINESS",
    "Gender": "PEREMPUAN",
    "Location": "JAKARTA",
    "Name": "ANNISA REGINA MEIDINA",
    "Nrk": "201160685",
    "PhoneNumber": "+6289501789259",
    "PlaceOfBirth": "JAKARTA",
    "Position": "AO - PIC",
    "Region_1": "JAKARTA 2 REGION",
    "UkDir": "BISNIS",
    "UkMgr": "JAKARTA-2",
    "UkSpv": "BUS",
    "REF 2023 (YA/(TIDAK)": "YA",
    "Password": "$2a$10$S2v4OV/5/1bO7EFYSMp7bev57r74E5PUayIWIamgQRYWM5e74Edge"
  },
  {
    "Region": "JAKARTA 2 REGION",
    "Area": "JAKARTA",
    "Business": "OS/BUSINESS",
    "Gender": "PRIA",
    "Location": "JAKARTA",
    "Name": "ANTON SETIAWAN",
    "Nrk": "201180919",
    "PhoneNumber": "+6287789817666",
    "PlaceOfBirth": "JAKARTA",
    "Position": "AO - PIC",
    "Region_1": "JAKARTA 2 REGION",
    "UkDir": "BISNIS",
    "UkMgr": "JAKARTA-2",
    "UkSpv": "BUS",
    "REF 2023 (YA/(TIDAK)": "YA",
    "Password": "$2a$10$cIJ25ALIzs.KP3oZtEtuLOvtmPt/o8wPjQk9xJSLiZhnDJh/4i84K"
  },
  {
    "Region": "JAKARTA 2 REGION",
    "Area": "JAKARTA",
    "Business": "OS/BUSINESS",
    "Gender": "PRIA",
    "Location": "JAKARTA",
    "Name": "HAIRUL ARIFIN",
    "Nrk": "201170839",
    "PhoneNumber": "+628158071775",
    "PlaceOfBirth": "JAKARTA",
    "Position": "AO - PIC",
    "Region_1": "JAKARTA 2 REGION",
    "UkDir": "BISNIS",
    "UkMgr": "JAKARTA-2",
    "UkSpv": "BUS",
    "REF 2023 (YA/(TIDAK)": "YA",
    "Password": "$2a$10$6bmpeaB5wkHHBnXnGWlyJOOkQ3RfyT3Qu3n1KSLLr8Ds.7KEzpvoy"
  },
  {
    "Region": "JAKARTA 2 REGION",
    "Area": "JAKARTA",
    "Business": "OS/BUSINESS",
    "Gender": "PRIA",
    "Location": "JAKARTA",
    "Name": "HANUNG KUSTRIANTO",
    "Nrk": "201160596",
    "PhoneNumber": "+6287784046519",
    "PlaceOfBirth": "NGAWI",
    "Position": "AO - PIC",
    "Region_1": "JAKARTA 2 REGION",
    "UkDir": "BISNIS",
    "UkMgr": "JAKARTA-2",
    "UkSpv": "BUS",
    "REF 2023 (YA/(TIDAK)": "YA",
    "Password": "$2a$10$xjyQSuojyoG.PVhkgc6K/.4eQzED55aBOCGuTcsBjX3Y7Q4tQWsZK"
  },
  {
    "Region": "JAKARTA 2 REGION",
    "Area": "JAKARTA",
    "Business": "OS/BUSINESS",
    "Gender": "PRIA",
    "Location": "JAKARTA",
    "Name": "IKBAL FAREZA",
    "Nrk": "201180908",
    "PhoneNumber": "+6282183775596",
    "PlaceOfBirth": "JAKARTA",
    "Position": "AO - PIC",
    "Region_1": "JAKARTA 2 REGION",
    "UkDir": "BISNIS",
    "UkMgr": "JAKARTA-2",
    "UkSpv": "BUS",
    "REF 2023 (YA/(TIDAK)": "YA",
    "Password": "$2a$10$S.jc911xx29YadjuYZxI3.4sQX1ghjLJjfbmL3b4XSmyFepKaiVZu"
  },
  {
    "Region": "JAKARTA 2 REGION",
    "Area": "JAKARTA",
    "Business": "OS/BUSINESS",
    "Gender": "PEREMPUAN",
    "Location": "JAKARTA",
    "Name": "LISZA ZULTALISZA",
    "Nrk": "201160655",
    "PhoneNumber": "+6282210033832",
    "PlaceOfBirth": "JAKARTA",
    "Position": "AM",
    "Region_1": "JAKARTA 2 REGION",
    "UkDir": "BISNIS",
    "UkMgr": "JAKARTA-2",
    "UkSpv": "BUS",
    "REF 2023 (YA/(TIDAK)": "YA",
    "Password": "$2a$10$6qmDlasLQ8KVdkkrYHBMO.pUAbgIBcQuV4i6Mmn7w.yiYXWuBP43W"
  },
  {
    "Region": "JAKARTA 2 REGION",
    "Area": "JAKARTA",
    "Business": "OS/BUSINESS",
    "Gender": "PRIA",
    "Location": "JAKARTA",
    "Name": "REDI FEBRIYADI PITRA GUSTI",
    "Nrk": "201191046",
    "PhoneNumber": "+6281514136452",
    "PlaceOfBirth": "SIMPANG CILACAP",
    "Position": "AO - PIC",
    "Region_1": "JAKARTA 2 REGION",
    "UkDir": "BISNIS",
    "UkMgr": "JAKARTA-2",
    "UkSpv": "BUS",
    "REF 2023 (YA/(TIDAK)": "YA",
    "Password": "$2a$10$8RPLELNXGVEa1I08LVPWCeZrBJC86MruDVz6LfUsddv1n.PbCScGu"
  },
  {
    "Region": "JAKARTA 2 REGION",
    "Area": "JAKARTA",
    "Business": "OS/BUSINESS",
    "Gender": "PEREMPUAN",
    "Location": "JAKARTA",
    "Name": "NURUL FAUZIAH",
    "Nrk": "201211132",
    "PhoneNumber": "+6289601052713",
    "PlaceOfBirth": "JAKARTA",
    "Position": "RELATION OFFICER",
    "Region_1": "JAKARTA 2 REGION",
    "UkDir": "BISNIS",
    "UkMgr": "JAKARTA-2",
    "UkSpv": "BUS",
    "REF 2023 (YA/(TIDAK)": "YA",
    "Password": "$2a$10$HS6rfEfLtUIyJXiMk1iJsu.tpVbWw20R5RUr/XJeNRsRdXIFqA7Ya"
  },
  {
    "Region": "JAKARTA 2 REGION",
    "Area": "JAKARTA",
    "Business": "OS/BUSINESS",
    "Gender": "PEREMPUAN",
    "Location": "JAKARTA",
    "Name": "SUNI PUTRI ANGGRAINI",
    "Nrk": "201221270",
    "PhoneNumber": "+6289655085609",
    "PlaceOfBirth": "TEGAL",
    "Position": "RELATION OFFICER",
    "Region_1": "JAKARTA 2 REGION",
    "UkDir": "BISNIS",
    "UkMgr": "JAKARTA-2",
    "UkSpv": "BUS",
    "REF 2023 (YA/(TIDAK)": "BARU",
    "Password": "$2a$10$VSgH1vVLm/2aG3/wgTJaDe/yeOpvB4F7LScxJCDkTCI5sM6arm7Ye"
  },
  {
    "Region": "JAKARTA 2 REGION",
    "Area": "JAKARTA",
    "Business": "OS/BUSINESS",
    "Gender": "PEREMPUAN",
    "Location": "JAKARTA",
    "Name": "SANTI NURMAYA",
    "Nrk": "201221261",
    "PhoneNumber": "+6281214037391",
    "PlaceOfBirth": "JAKARTA",
    "Position": "BUSINESS MANAGER",
    "Region_1": "JAKARTA 2 REGION",
    "UkDir": "BISNIS",
    "UkMgr": "JAKARTA-2",
    "UkSpv": "BUS",
    "REF 2023 (YA/(TIDAK)": "BARU",
    "Password": "$2a$10$yGMKaNu5snvNP9icgnEUheOV8kxuf6Q.ftyOAt70JymMNqRUWdsS6"
  },
  {
    "Region": "JAKARTA 6 REGION",
    "Area": "JAKARTA",
    "Business": "O/S BUSINESS",
    "Gender": "PRIA",
    "Location": "JAKARTA",
    "Name": "APIH DICKY ZULKARNAIN",
    "Nrk": "201211136",
    "PhoneNumber": "+6287899414179",
    "PlaceOfBirth": "TANGERANG",
    "Position": "ACCOUNT OFFICER",
    "Region_1": "JAKARTA 2 REGION",
    "UkDir": "BISNIS",
    "UkMgr": "JAKARTA-2",
    "UkSpv": "BUS",
    "REF 2023 (YA/(TIDAK)": "TIDAK",
    "KETERANGAN": "PINDAH KE JAKARTA-6",
    "Password": "$2a$10$hs7umhy497pf19EKPNAbfuuCTFc0PURk.XN.cUpdqDHoWKd0udj9m"
  },
  {
    "Region": "JAKARTA REGION",
    "Area": "JAKARTA",
    "Business": "O/S BUSINESS",
    "Gender": "WANITA",
    "Location": "JAKARTA",
    "Name": "ROBIATUL HANDAYANI",
    "Nrk": "201150554",
    "PhoneNumber": "+6287885584924",
    "PlaceOfBirth": "TANGERANG",
    "Position": "BUSINESS SUPPORT",
    "Region_1": "JAKARTA 2 REGION",
    "UkDir": "IT & OPS",
    "UkMgr": "ITBS",
    "UkSpv": "BS",
    "REF 2023 (YA/(TIDAK)": "YA",
    "KETERANGAN": "PERUBAHAN DATA",
    "Password": "$2a$10$ZtzmP727dICuiMp1OBmVhO65bAHlD.ZZzvV6I06myWlxrFTNfCG1a"
  },
  {
    "Region": "JAKARTA 2 REGION",
    "Area": "JAKARTA",
    "Business": "O/S BUSINESS",
    "Gender": "WANITA",
    "Location": "JAKARTA",
    "Name": "ANITA FLORENTINA PINTAULI",
    "Nrk": "201211127",
    "PhoneNumber": "+6281290656702",
    "PlaceOfBirth": "JAKARTA",
    "Position": "AO - PIC",
    "Region_1": "JAKARTA 2 REGION",
    "UkDir": "BISNIS",
    "UkMgr": "JAKARTA-5",
    "UkSpv": "BUS",
    "REF 2023 (YA/(TIDAK)": "TIDAK",
    "KETERANGAN": "PINDAH KE JAKARTA-5",
    "Password": "$2a$10$P1SfA2uMQlnRpPYWwDBrlOSSxm1ZTc.76lNPWFsnyYGYuLVw4mck."
  },
  {
    "Region": "JAKARTA REGION",
    "Area": "JAKARTA",
    "Business": "O/S BUSINESS",
    "Gender": "WANITA",
    "Location": "JAKARTA",
    "Name": "DESI MANDALASARI",
    "Nrk": "201191058",
    "PhoneNumber": "+6282112436567",
    "PlaceOfBirth": "CIAMIS",
    "Position": "OPERATION STAF",
    "Region_1": "JAKARTA REGION",
    "UkDir": "IT & OPS",
    "UkMgr": "OPS",
    "UkSpv": "OPS",
    "REF 2023 (YA/(TIDAK)": "YA",
    "Password": "$2a$10$EF4Q.LbZkI4dWBmdGULldOt70fb2j3FVmJTLaPiHcWLdPlD.DR6b."
  },
  {
    "Region": "JAKARTA REGION",
    "Area": "JAKARTA",
    "Business": "O/S BUSINESS",
    "Gender": "WANITA",
    "Location": "JAKARTA",
    "Name": "DESI YULYANTI",
    "Nrk": "201170744",
    "PhoneNumber": "+628972799778",
    "PlaceOfBirth": "SUBANG",
    "Position": "OPERATION STAF",
    "Region_1": "JAKARTA REGION",
    "UkDir": "IT & OPS",
    "UkMgr": "OPS",
    "UkSpv": "OPS",
    "REF 2023 (YA/(TIDAK)": "YA",
    "Password": "$2a$10$Zd2XFlg9wKZkCkfV8DoUHOlAkMVLxdlb.mshpKDrxjT8XlFUMjZ9G"
  },
  {
    "Region": "JAKARTA REGION",
    "Area": "JAKARTA",
    "Business": "O/S BUSINESS",
    "Gender": "WANITA",
    "Location": "JAKARTA",
    "Name": "EKA NOVITA SARI",
    "Nrk": "201191018",
    "PhoneNumber": "+6282176779673",
    "PlaceOfBirth": "BANJARAN",
    "Position": "OPERATION STAF",
    "Region_1": "JAKARTA REGION",
    "UkDir": "IT & OPS",
    "UkMgr": "OPS",
    "UkSpv": "OPS",
    "REF 2023 (YA/(TIDAK)": "YA",
    "Password": "$2a$10$B1HVI7A8r/89u6LX.5yYZ.gC0Qk2ZtwSN0M6LfhT2VzIzKoZHfmtS"
  },
  {
    "Region": "JAKARTA REGION",
    "Area": "JAKARTA",
    "Business": "O/S BUSINESS",
    "Gender": "WANITA",
    "Location": "JAKARTA",
    "Name": "FAIDA",
    "Nrk": "201160623",
    "PhoneNumber": "+6287723637444",
    "PlaceOfBirth": "JAKARTA",
    "Position": "OPERATION STAF",
    "Region_1": "JAKARTA REGION",
    "UkDir": "IT & OPS",
    "UkMgr": "OPS",
    "UkSpv": "OPS",
    "REF 2023 (YA/(TIDAK)": "YA",
    "Password": "$2a$10$p.PUsGfqvb28A4DjQ/C4U.vL8ZOX9QH8EUpef/3cyRf2JatDhKUgS"
  },
  {
    "Region": "JAKARTA REGION",
    "Area": "JAKARTA",
    "Business": "O/S BUSINESS",
    "Gender": "WANITA",
    "Location": "JAKARTA",
    "Name": "MELLIYANA SANTIKA",
    "Nrk": "201211151",
    "PhoneNumber": "+6281514675027",
    "PlaceOfBirth": "SUKABUMI",
    "Position": "OPERATION STAF",
    "Region_1": "JAKARTA REGION",
    "UkDir": "IT & OPS",
    "UkMgr": "OPS",
    "UkSpv": "OPS",
    "REF 2023 (YA/(TIDAK)": "YA",
    "Password": "$2a$10$30JVdy.OC3wv.LMwFddNx.IckQmfWHDIh2q1ePmR398idlmBDQXvy"
  },
  {
    "Region": "JAKARTA REGION",
    "Area": "JAKARTA",
    "Business": "O/S BUSINESS",
    "Gender": "WANITA",
    "Location": "JAKARTA",
    "Name": "NOVIA PUTRISANI",
    "Nrk": "201211122",
    "PhoneNumber": "+6288901162621",
    "PlaceOfBirth": "JAKARTA",
    "Position": "OPERATION STAF",
    "Region_1": "JAKARTA REGION",
    "UkDir": "IT & OPS",
    "UkMgr": "OPS",
    "UkSpv": "OPS",
    "REF 2023 (YA/(TIDAK)": "YA",
    "Password": "$2a$10$aixWzNsmiglNkQfWMDOi4ej5e6/2n0AeQt2YQnH/l.AOHeau6rwWu"
  },
  {
    "Region": "JAKARTA REGION",
    "Area": "JAKARTA",
    "Business": "O/S BUSINESS",
    "Gender": "WANITA",
    "Location": "JAKARTA",
    "Name": "NURHAYATI",
    "Nrk": "201120263",
    "PhoneNumber": "+6282123335375",
    "PlaceOfBirth": "SEPANG",
    "Position": "OPERATION SUPPORT SPV",
    "Region_1": "JAKARTA REGION",
    "UkDir": "IT & OPS",
    "UkMgr": "OPS",
    "UkSpv": "OPS",
    "REF 2023 (YA/(TIDAK)": "YA",
    "Password": "$2a$10$KS/wLwUT7LLcR3BpHi49tuLunhOdxWv7JrqyPXF4xHzmU7K6NEgjy"
  },
  {
    "Region": "JAKARTA REGION",
    "Area": "JAKARTA",
    "Business": "O/S BUSINESS",
    "Gender": "WANITA",
    "Location": "JAKARTA",
    "Name": "RIZKI DITA PANGESTI",
    "Nrk": "201160649",
    "PhoneNumber": "+6285695258013",
    "PlaceOfBirth": "JAKARTA",
    "Position": "OPERATION STAF",
    "Region_1": "JAKARTA REGION",
    "UkDir": "IT & OPS",
    "UkMgr": "OPS",
    "UkSpv": "OPS",
    "REF 2023 (YA/(TIDAK)": "YA",
    "Password": "$2a$10$NY5xhcAScxbHtdFTbnAaZeHOZGS6/MjbkQc9RTjksoxBTfI2ARp3u"
  },
  {
    "Region": "JAKARTA REGION",
    "Area": "JAKARTA",
    "Business": "O/S BUSINESS",
    "Gender": "WANITA",
    "Location": "JAKARTA",
    "Name": "SERLY ANDRIYANI",
    "Nrk": "201180955",
    "PhoneNumber": "+6282211776214",
    "PlaceOfBirth": "JAKARTA",
    "Position": "OPERATION STAF",
    "Region_1": "JAKARTA REGION",
    "UkDir": "IT & OPS",
    "UkMgr": "OPS",
    "UkSpv": "OPS",
    "REF 2023 (YA/(TIDAK)": "YA",
    "Password": "$2a$10$/8XkDBq2LRhg39PINyXWmO9f5LSRvi065lrYq866fpn7aqBDJfJXC"
  },
  {
    "Region": "JAKARTA REGION",
    "Area": "JAKARTA",
    "Business": "O/S BUSINESS",
    "Gender": "WANITA",
    "Location": "JAKARTA",
    "Name": "SRI HASTUTI",
    "Nrk": "201150472",
    "PhoneNumber": "+6289665366508",
    "PlaceOfBirth": "MAGETAN",
    "Position": "OPERATION SUPPORT SPV",
    "Region_1": "JAKARTA REGION",
    "UkDir": "IT & OPS",
    "UkMgr": "OPS",
    "UkSpv": "OPS",
    "REF 2023 (YA/(TIDAK)": "YA",
    "Password": "$2a$10$kXa1DVBrqa5oJsyuabp4S.G307p4eCHqsTpBijrg1x5ZlIaq9rL9S"
  },
  {
    "Region": "JAKARTA REGION",
    "Area": "JAKARTA",
    "Business": "O/S BUSINESS",
    "Gender": "WANITA",
    "Location": "JAKARTA",
    "Name": "USWAH BARORO FAROSYA T",
    "Nrk": "201170769",
    "PhoneNumber": "+6281315964109",
    "PlaceOfBirth": "JAKARTA",
    "Position": "OPERATION STAF",
    "Region_1": "JAKARTA REGION",
    "UkDir": "IT & OPS",
    "UkMgr": "OPS",
    "UkSpv": "OPS",
    "REF 2023 (YA/(TIDAK)": "YA",
    "Password": "$2a$10$2kKNIvu2UJOauq4EiakiNeKMUEhn7PSnrzh2HeO0XOzGjPQCT3XmS"
  },
  {
    "Region": "JAKARTA REGION",
    "Area": "JAKARTA",
    "Business": "O/S BUSINESS",
    "Gender": "WANITA",
    "Location": "JAKARTA",
    "Name": "UTAMI",
    "Nrk": "201191006",
    "PhoneNumber": "+6281381775025",
    "PlaceOfBirth": "SUKOHARJO",
    "Position": "OPERATION STAF",
    "Region_1": "JAKARTA REGION",
    "UkDir": "IT & OPS",
    "UkMgr": "OPS",
    "UkSpv": "OPS",
    "REF 2023 (YA/(TIDAK)": "YA",
    "Password": "$2a$10$MgO1dC0qMv67AXVug2ulfeivYVKX4OihiDy3n8qR3S4w.X/8N8Lja"
  },
  {
    "Region": "SUMATERA",
    "Area": "BENGKULU",
    "Business": "O/S BUSINESS",
    "Gender": "PRIA",
    "Location": "BENGKULU",
    "Name": "ABDU RAB ARRASUL SYAYYAF",
    "Nrk": "0202191023",
    "PhoneNumber": "+6282398708815",
    "PlaceOfBirth": "PONDOK KUBANG",
    "Position": "PEOPLE IN CHARGE (PIC-BENGKULU)",
    "Region_1": "SUMATERA",
    "UkDir": "BUSINESS",
    "UkMgr": "SUMATERA",
    "UkSpv": "BUSINESS",
    "REF 2023 (YA/(TIDAK)": "YA",
    "Password": "$2a$10$aw9JXw8UTa0iQaitYmF/UOhMVV2eePMaex2WDvOzkjtD8nUS13EQS"
  },
  {
    "Region": "SUMATERA",
    "Area": "LAMPUNG",
    "Business": "O/S BUSINESS",
    "Gender": "PRIA",
    "Location": "BANDAR LAMPUNG",
    "Name": "AKHMAD SYAIFULLOH",
    "Nrk": "0202211149",
    "PhoneNumber": "+6282178741209",
    "PlaceOfBirth": "GAYAU SAKTI",
    "Position": "PEOPLE IN CHARGE (PIC-LAMPUNG)",
    "Region_1": "SUMATERA",
    "UkDir": "BUSINESS",
    "UkMgr": "SUMATERA",
    "UkSpv": "BUSINESS",
    "REF 2023 (YA/(TIDAK)": "YA",
    "Password": "$2a$10$8nzKqLMen.oKkOnwcyzJIOZ9PuBPZmn5tTW2aE4ubi5PT9b3cHInO"
  },
  {
    "Region": "SUMATERA",
    "Area": "RIAU DARATAN",
    "Business": "O/S BUSINESS",
    "Gender": "PRIA",
    "Location": "PEKANBARU",
    "Name": "AL FAHMI FAJRI",
    "Nrk": "0202201103",
    "PhoneNumber": "+6281310671077",
    "PlaceOfBirth": "PEKANBARU",
    "Position": "RECRUITMENT OFFICER (SR)",
    "Region_1": "SUMATERA",
    "UkDir": "BUSINESS",
    "UkMgr": "SUMATERA",
    "UkSpv": "BUSINESS",
    "REF 2023 (YA/(TIDAK)": "YA",
    "Password": "$2a$10$5qN.9sax1EGUmwJpjnH5i.37NJnU3OOqRybbmvf1mpWAU/mXJoibW"
  },
  {
    "Region": "SUMATERA",
    "Area": "SUMATERA BARAT",
    "Business": "O/S BUSINESS",
    "Gender": "WANITA",
    "Location": "PADANG",
    "Name": "BUNGA PERMATA SARI",
    "Nrk": "0202211187",
    "PhoneNumber": "+6281275976325",
    "PlaceOfBirth": "PADANG",
    "Position": "RECRUITMENT OFFICER (JR)",
    "Region_1": "SUMATERA",
    "UkDir": "BUSINESS",
    "UkMgr": "SUMATERA",
    "UkSpv": "BUSINESS",
    "REF 2023 (YA/(TIDAK)": "BARU",
    "Password": "$2a$10$HR45.ffrnhtMl/UwXXtKKOXET4Oz/q/zPkVZrwnHvHfNXAPZ1kbQW"
  },
  {
    "Region": "SUMATERA",
    "Area": "SUMATERA UTARA",
    "Business": "O/S BUSINESS",
    "Gender": "PRIA",
    "Location": "MEDAN",
    "Name": "DANIEL VICTORI SITUMORANG",
    "Nrk": "0202170771",
    "PhoneNumber": "+6282384574500",
    "PlaceOfBirth": "LABUHAN",
    "Position": "RECRUITMENT OFFICER (SR)",
    "Region_1": "SUMATERA",
    "UkDir": "BUSINESS",
    "UkMgr": "SUMATERA",
    "UkSpv": "BUSINESS",
    "REF 2023 (YA/(TIDAK)": "YA",
    "Password": "$2a$10$uBJxNw6EzJABY7Z/at0SFOhabKOZ1Odfy.EAgR2OKGPUAw0J82x1q"
  },
  {
    "Region": "SUMATERA",
    "Area": "SUMATERA SELATAN",
    "Business": "O/S BUSINESS",
    "Gender": "WANITA",
    "Location": "PALEMBANG",
    "Name": "ESTIKA SARI GIRSANG",
    "Nrk": "0202211140",
    "PhoneNumber": "+6283160285850",
    "PlaceOfBirth": "MEDAN",
    "Position": "PEOPLE IN CHARGE (PIC-NAD)",
    "Region_1": "SUMATERA",
    "UkDir": "BUSINESS",
    "UkMgr": "SUMATERA",
    "UkSpv": "BUSINESS",
    "REF 2023 (YA/(TIDAK)": "YA",
    "Password": "$2a$10$1oAepvi4WHBUMNcV804Vj./ml2J9rFGJVR/risEReG0gMo478hiVC"
  },
  {
    "Region": "SUMATERA",
    "Area": "RIAU KEPULAUAN",
    "Business": "O/S BUSINESS",
    "Gender": "PRIA",
    "Location": "BATAM",
    "Name": "FATHUR RAHMAD HADI",
    "Nrk": " 0205221262",
    "PhoneNumber": "+6282283599452",
    "PlaceOfBirth": "MUARA BULIAN",
    "Position": "RECRUITMENT OFFICER",
    "Region_1": "SUMATERA",
    "UkDir": "BUSINESS",
    "UkMgr": "SUMATERA",
    "UkSpv": "BUSINESS",
    "REF 2023 (YA/(TIDAK)": "BARU",
    "Password": "$2a$10$eaXU09ncg5xCrEHc0LDKTuHkqhDuRQX9YGSMYgw6OS06/fOtZlXma"
  },
  {
    "Region": "SUMATERA",
    "Area": "SUMATERA UTARA",
    "Business": "O/S BUSINESS",
    "Gender": "PRIA",
    "Location": "MEDAN",
    "Name": "GITA JAYADI PUTRA",
    "Nrk": "0202090013",
    "PhoneNumber": "+6285270072223",
    "PlaceOfBirth": "BANDUNG",
    "Position": "ACCOUNT MANAGER",
    "Region_1": "SUMATERA",
    "UkDir": "BUSINESS",
    "UkMgr": "SUMATERA",
    "UkSpv": "BUSINESS",
    "REF 2023 (YA/(TIDAK)": "YA",
    "Password": "$2a$10$bulMw/8jrKkly/1jUJg..uPq/mHnwzDJxBU1dx6ueB8SiLyoyCvy6"
  },
  {
    "Region": "SUMATERA",
    "Area": "BANGKA BELITUNG",
    "Business": "O/S BUSINESS",
    "Gender": "PRIA",
    "Location": "PANGKAL PINANG",
    "Name": "HAMZAH",
    "Nrk": "0202180918",
    "PhoneNumber": "+6285279026595",
    "PlaceOfBirth": "MENDO",
    "Position": "PEOPLE IN CHARGE (PIC-BABEL)",
    "Region_1": "SUMATERA",
    "UkDir": "BUSINESS",
    "UkMgr": "SUMATERA",
    "UkSpv": "BUSINESS",
    "REF 2023 (YA/(TIDAK)": "YA",
    "Password": "$2a$10$8.gapm/TH08jmPvxumybh.3n0PCF5c7H0bs2y2BhoXaAdoEILjVa2"
  },
  {
    "Region": "SUMATERA",
    "Area": "RIAU DARATAN",
    "Business": "O/S BUSINESS",
    "Gender": "WANITA",
    "Location": "PEKANBARU",
    "Name": "LISBETH CAROLINA SITEPU",
    "Nrk": "0202211123",
    "PhoneNumber": "+6281314811481",
    "PlaceOfBirth": "EMPLASMEN SRO",
    "Position": "RECRUITMENT OFFICER (SR)",
    "Region_1": "SUMATERA",
    "UkDir": "BUSINESS",
    "UkMgr": "SUMATERA",
    "UkSpv": "BUSINESS",
    "REF 2023 (YA/(TIDAK)": "YA",
    "Password": "$2a$10$TDpTMuMT3/WnYnS6zaLC4eSw.B3gOP371.kqFOpTPtJI/Qv0Hqfea"
  },
  {
    "Region": "SUMATERA",
    "Area": "JAMBI",
    "Business": "O/S BUSINESS",
    "Gender": "PRIA",
    "Location": "JAMBI",
    "Name": "MA'RUF",
    "Nrk": "0202201089",
    "PhoneNumber": "+6281228289655",
    "PlaceOfBirth": "PULAU KIJANG",
    "Position": "RECRUITMENT OFFICER (SR)",
    "Region_1": "SUMATERA",
    "UkDir": "BUSINESS",
    "UkMgr": "SUMATERA",
    "UkSpv": "BUSINESS",
    "REF 2023 (YA/(TIDAK)": "YA",
    "Password": "$2a$10$NEPNJjjAyNK/cj/5Yl74eeKfwQWSnFYPCrhzzBZH7iHuaXKoRk2ZC"
  },
  {
    "Region": "SUMATERA",
    "Area": "RIAU DARATAN",
    "Business": "O/S BUSINESS",
    "Gender": "WANITA",
    "Location": "PEKANBARU",
    "Name": "MELITHA YANTI PASARIBU",
    "Nrk": "0202150503",
    "PhoneNumber": "+6282283940430",
    "PlaceOfBirth": "PEKANBARU",
    "Position": "ACCOUNT MANAGER",
    "Region_1": "SUMATERA",
    "UkDir": "BUSINESS",
    "UkMgr": "SUMATERA",
    "UkSpv": "BUSINESS",
    "REF 2023 (YA/(TIDAK)": "YA",
    "Password": "$2a$10$f591nuqhe.hZkOa9.yoMie4cAAOWGfqDw4f4nmOSpltH5OnBmiaWe"
  },
  {
    "Region": "SUMATERA",
    "Area": "SUMATERA SELATAN",
    "Business": "O/S BUSINESS",
    "Gender": "PRIA",
    "Location": "PALEMBANG",
    "Name": "MUHAMMAD FAJAR MAULANA",
    "Nrk": "0202221226",
    "PhoneNumber": "+6282175076940",
    "PlaceOfBirth": "OKU TIMUR",
    "Position": "RECRUITMENT OFFICER (JR)",
    "Region_1": "SUMATERA",
    "UkDir": "BUSINESS",
    "UkMgr": "SUMATERA",
    "UkSpv": "BUSINESS",
    "REF 2023 (YA/(TIDAK)": "BARU",
    "Password": "$2a$10$kSqOo9bj9cU2Lu6f2Rs5S.kB6nU5/S/dvrVnZjWI2amy/WjqRFFgO"
  },
  {
    "Region": "SUMATERA",
    "Area": "NANGROE ACEH DARUSALAM",
    "Business": "O/S BUSINESS",
    "Gender": "PRIA",
    "Location": "BANDA ACEH",
    "Name": "MUHAMMAD FAJRI",
    "Nrk": "0202170828",
    "PhoneNumber": "+6282360009711",
    "PlaceOfBirth": "LAMEUE RAYA",
    "Position": "PIC - NAD",
    "Region_1": "SUMATERA",
    "UkDir": "BUSINESS",
    "UkMgr": "SUMATERA",
    "UkSpv": "BUSINESS",
    "REF 2023 (YA/(TIDAK)": "YA",
    "Password": "$2a$10$zDsRUkYhZZjU.BHdsV3iq.e7XcDKwyMUQCU10Rl4mhobgekpK5MhS"
  },
  {
    "Region": "SUMATERA",
    "Area": "SUMATERA UTARA",
    "Business": "O/S BUSINESS",
    "Gender": "PRIA",
    "Location": "MEDAN",
    "Name": "MUHAMMAD HAIQAL FIKRI",
    "Nrk": "0202211199",
    "PhoneNumber": "+6282161035546",
    "PlaceOfBirth": "TEBING TINGGI",
    "Position": "RECRUITMENT OFFICER (SR)",
    "Region_1": "SUMATERA",
    "UkDir": "BUSINESS",
    "UkMgr": "SUMATERA",
    "UkSpv": "BUSINESS",
    "REF 2023 (YA/(TIDAK)": "BARU",
    "Password": "$2a$10$M4CTmGN4/1B612JvvNo/Z.8JTA4ihBOFyfthGpK5LloZtYuHAuZn6"
  },
  {
    "Region": "SUMATERA",
    "Area": "RIAU DARATAN",
    "Business": "O/S BUSINESS",
    "Gender": "PRIA",
    "Location": "PEKANBARU",
    "Name": "MUHAMMAD ILHAM",
    "Nrk": " 0202221238",
    "PhoneNumber": "+6282283379141",
    "PlaceOfBirth": "BELAWAN",
    "Position": "RECRUITMENT OFFICER (SR)",
    "Region_1": "SUMATERA",
    "UkDir": "BUSINESS",
    "UkMgr": "SUMATERA",
    "UkSpv": "BUSINESS",
    "REF 2023 (YA/(TIDAK)": "BARU",
    "Password": "$2a$10$tsxTpbQk.aNfFamlqYmLGOomCDWVPm45HG6oLVik316E0dVl9HSIe"
  },
  {
    "Region": "SUMATERA",
    "Area": "SUMATERA UTARA",
    "Business": "O/S BUSINESS",
    "Gender": "WANITA",
    "Location": "MEDAN",
    "Name": "OCTAVIA YOSEPHINE PASARIBU",
    "Nrk": "0202110199",
    "PhoneNumber": "+6281973140220",
    "PlaceOfBirth": "PEMATANGSIANTAR",
    "Position": "BUSINESS MANAGER",
    "Region_1": "SUMATERA",
    "UkDir": "BUSINESS",
    "UkMgr": "SUMATERA",
    "UkSpv": "BUSINESS",
    "REF 2023 (YA/(TIDAK)": "YA",
    "Password": "$2a$10$BxZQdr9l6mJ0GK3D68svmuctcVuVqCZ5wNRIWmKVxaMjM3Z7JggKW"
  },
  {
    "Region": "SUMATERA",
    "Area": "SUMATERA UTARA",
    "Business": "O/S BUSINESS",
    "Gender": "PRIA",
    "Location": "MEDAN",
    "Name": "QADAVI RIDWAN NUR",
    "Nrk": "0205221264",
    "PhoneNumber": "+6282160112808",
    "PlaceOfBirth": "MEDAN",
    "Position": "RECRUITMENT OFFICER (SR)",
    "Region_1": "SUMATERA",
    "UkDir": "BUSINESS",
    "UkMgr": "SUMATERA",
    "UkSpv": "BUSINESS",
    "REF 2023 (YA/(TIDAK)": "BARU",
    "Password": "$2a$10$TS7kezWk2H/kGeTL6vWXzuPrG3t08cfb.OGwtcY9ARkdctQBeLgaa"
  },
  {
    "Region": "SUMATERA",
    "Area": "SUMATERA BARAT",
    "Business": "O/S BUSINESS",
    "Gender": "WANITA",
    "Location": "PADANG",
    "Name": "RATU LADY RUSLINA MEILANTI",
    "Nrk": "0202180940",
    "PhoneNumber": "+62811661123",
    "PlaceOfBirth": "PADANG",
    "Position": "PEOPLE IN CHARGE (PIC-SUMBAR)",
    "Region_1": "SUMATERA",
    "UkDir": "BUSINESS",
    "UkMgr": "SUMATERA",
    "UkSpv": "BUSINESS",
    "REF 2023 (YA/(TIDAK)": "YA",
    "Password": "$2a$10$tP80rPCoVXIjbcnqHAJozuavdJunz7aZDZc4kHtneBBRPiVy6U/CO"
  },
  {
    "Region": "SUMATERA",
    "Area": "SUMATERA UTARA",
    "Business": "O/S BUSINESS",
    "Gender": "WANITA",
    "Location": "MEDAN",
    "Name": "REGINA GOELA STEVANIE DEPARI",
    "Nrk": "0202201101",
    "PhoneNumber": "+6282124526726",
    "PlaceOfBirth": "MEDAN",
    "Position": "RECRUITMENT OFFICER (SR)",
    "Region_1": "SUMATERA",
    "UkDir": "BUSINESS",
    "UkMgr": "SUMATERA",
    "UkSpv": "BUSINESS",
    "REF 2023 (YA/(TIDAK)": "YA",
    "Password": "$2a$10$wnBWoO50om5buj4SOQCGt.2kZjTI3KmxjwU.Pd.nt3Y5Bsfrc4nvC"
  },
  {
    "Region": "SUMATERA",
    "Area": "SUMATERA UTARA",
    "Business": "O/S BUSINESS",
    "Gender": "PRIA",
    "Location": "MEDAN",
    "Name": "TEGUH HADI WIBOWO",
    "Nrk": "0202180905",
    "PhoneNumber": "+6281370756229",
    "PlaceOfBirth": "KERAWAN",
    "Position": "RECRUITMENT OFFICER (SR)",
    "Region_1": "SUMATERA",
    "UkDir": "BUSINESS",
    "UkMgr": "SUMATERA",
    "UkSpv": "BUSINESS",
    "REF 2023 (YA/(TIDAK)": "YA",
    "Password": "$2a$10$oDvsRJZHkWdvuR5NSqEPP.TjM468hAL0l/DsVIXIIu8yEOf55WLre"
  },
  {
    "Region": "SUMATERA",
    "Area": "RIAU KEPULAUAN",
    "Business": "O/S BUSINESS",
    "Gender": "PRIA",
    "Location": "BATAM",
    "Name": "TRI WAHYU HIDAYATNO",
    "Nrk": "0205221255",
    "PhoneNumber": "+6281318905018",
    "PlaceOfBirth": "ALANG LAWAS",
    "Position": "PEOPLE IN CHARGE (PIC-NAD)",
    "Region_1": "SUMATERA",
    "UkDir": "BUSINESS",
    "UkMgr": "SUMATERA",
    "UkSpv": "BUSINESS",
    "REF 2023 (YA/(TIDAK)": "BARU",
    "Password": "$2a$10$fPxIhIhlVOBadjO4WBk.ceHeIEA3Z2NcB.9Ik4lhgXCScpVhDziv6"
  },
  {
    "Region": "SUMATERA",
    "Area": "SUMATERA UTARA",
    "Business": "O/S BUSINESS",
    "Gender": "WANITA",
    "Location": "MEDAN",
    "Name": "TRI WANTY SIANTURI",
    "Nrk": " 0202211198",
    "PhoneNumber": "+6282165634571",
    "PlaceOfBirth": "KARING",
    "Position": "RECRUITMENT OFFICER (SR)",
    "Region_1": "SUMATERA",
    "UkDir": "BUSINESS",
    "UkMgr": "SUMATERA",
    "UkSpv": "BUSINESS",
    "REF 2023 (YA/(TIDAK)": "BARU",
    "Password": "$2a$10$Z8Nj/xMkX5k9.fxuXwNgkedJq71GJvVb23CFiIgpO.KZeWaym3NNW"
  },
  {
    "Region": "SUMATERA",
    "Area": "SUMATERA UTARA",
    "Business": "O/S BUSINESS",
    "Gender": "WANITA",
    "Location": "MEDAN",
    "Name": "WITA MARRIZA",
    "Nrk": "0202120317",
    "PhoneNumber": "+6285261454670",
    "PlaceOfBirth": "PEMATANGSIANTAR",
    "Position": "ACCOUNT MANAGER",
    "Region_1": "SUMATERA",
    "UkDir": "BUSINESS",
    "UkMgr": "SUMATERA",
    "UkSpv": "BUSINESS",
    "REF 2023 (YA/(TIDAK)": "YA",
    "Password": "$2a$10$C48iYYnu5XeP5jg6MUZ8wuprp1aovYCGMCRCda3fRz3jNbe4K2P6K"
  },
  {
    "Region": "SUMATERA",
    "Area": "NANGROE ACEH DARUSALAM",
    "Business": "O/S BUSINESS",
    "Gender": "PRIA",
    "Location": "BANDA ACEH",
    "Name": "ZIKRUL KHALIS",
    "Nrk": " 0205221252",
    "PhoneNumber": "+6282273877787",
    "PlaceOfBirth": "BEURACAN",
    "Position": "RECRUITMENT OFFICER",
    "Region_1": "SUMATERA",
    "UkDir": "BUSINESS",
    "UkMgr": "SUMATERA",
    "UkSpv": "BUSINESS",
    "REF 2023 (YA/(TIDAK)": "BARU",
    "Password": "$2a$10$mPrdHKnMcv5Pd4RpSMprg.WlzwQMB7fVLCGyj9o2CAx1Oa3jTiOEW"
  },
  {
    "Region": "JAKARTA 1 REGION",
    "Area": "JAKARTA",
    "Business": "O/S BUSINESS",
    "Gender": "PRIA",
    "Location": "JAKARTA",
    "Name": "ADHITYA EDDY PUTRA",
    "Nrk": "206120311",
    "PhoneNumber": "+6287884645197",
    "PlaceOfBirth": "JAKARTA",
    "Position": "BM BANKING",
    "Region_1": "JAKARTA 1 REGION",
    "UkDir": "BISNIS",
    "UkMgr": "JAKARTA-1",
    "UkSpv": "BUS",
    "REF 2023 (YA/(TIDAK)": "YA",
    "Password": "$2a$10$hF0UfiMW008iZvp.tVHTIe/VrMQnnbLK6SoLPsSqGTqTX.sgFU2Hu"
  },
  {
    "Region": "JAKARTA REGION",
    "Area": "JAKARTA",
    "Business": "O/S BUSINESS",
    "Gender": "PRIA",
    "Location": "JAKARTA",
    "Name": "APANDI NUGRAHA",
    "Nrk": "201170796",
    "PhoneNumber": "+6287876064050",
    "PlaceOfBirth": "JAKARTA",
    "Position": "BUSINESS SUPPORT",
    "Region_1": "JAKARTA 1 REGION",
    "UkDir": "IT & OPS",
    "UkMgr": "ITBS",
    "UkSpv": "BS",
    "REF 2023 (YA/(TIDAK)": "YA",
    "KETERANGAN": "PERUBAHAN DATA",
    "Password": "$2a$10$3WKem.rGwolBz3f99nXNLuUckzqA0L962qeFpPkImsVFoWc5uRUxy"
  },
  {
    "Region": "JAKARTA 1 REGION",
    "Area": "JAKARTA",
    "Business": "O/S BUSINESS",
    "Gender": "PRIA",
    "Location": "JAKARTA",
    "Name": "CHAIRUL TACHMAR SALMUN",
    "Nrk": "201211121",
    "PhoneNumber": "+6285954559908",
    "PlaceOfBirth": "JAKARTA",
    "Position": "ACCOUNT OFFICER",
    "Region_1": "JAKARTA 1 REGION",
    "UkDir": "BISNIS",
    "UkMgr": "JAKARTA-1",
    "UkSpv": "BUS",
    "REF 2023 (YA/(TIDAK)": "YA",
    "Password": "$2a$10$IicCCwArYqnvF0/APZ8Uce.aPU37gGh/PtPpqer8rQUwYGa4Q1SdC"
  },
  {
    "Region": "JAKARTA REGION",
    "Area": "JAKARTA",
    "Business": "O/S BUSINESS",
    "Gender": "PRIA",
    "Location": "JAKARTA",
    "Name": "ELSA DWI PANCA RETNO",
    "Nrk": "201191059",
    "PhoneNumber": "+6282112480385",
    "PlaceOfBirth": "JAKARTA",
    "Position": "BUSINESS SUPPORT",
    "Region_1": "JAKARTA 1 REGION",
    "UkDir": "IT & OPS",
    "UkMgr": "OPS",
    "UkSpv": "OPS",
    "REF 2023 (YA/(TIDAK)": "YA",
    "KETERANGAN": "PERUBAHAN DATA",
    "Password": "$2a$10$7rrulOJgpnV/gnU0ZEU6rO2XU6WRi4y/Kwo7hMIiGYchXu1CVFoKe"
  },
  {
    "Region": "JAKARTA REGION",
    "Area": "JAKARTA",
    "Business": "O/S BUSINESS",
    "Gender": "WANITA",
    "Location": "JAKARTA",
    "Name": "FARA ANANDA SUCIARTI",
    "Nrk": "201160684",
    "PhoneNumber": "+6287787088485",
    "PlaceOfBirth": "JAKARTA",
    "Position": "BUSINESS SUPPORT",
    "Region_1": "JAKARTA 1 REGION",
    "UkDir": "IT & OPS",
    "UkMgr": "ITBS",
    "UkSpv": "BS",
    "REF 2023 (YA/(TIDAK)": "YA",
    "KETERANGAN": "PERUBAHAN DATA",
    "Password": "$2a$10$SYwy3TuHvrnK2ivMiR9f5ewVPBhHGJHWXCIBOUamyWnl7ew0hdYVW"
  },
  {
    "Region": "JAKARTA 1 REGION",
    "Area": "JAKARTA",
    "Business": "O/S BUSINESS",
    "Gender": "WANITA",
    "Location": "JAKARTA",
    "Name": "FITRIA",
    "Nrk": "201160650",
    "PhoneNumber": "+6288213532740",
    "PlaceOfBirth": "JAKARTA",
    "Position": "ACCOUNT  MANAGER",
    "Region_1": "JAKARTA 1 REGION",
    "UkDir": "BISNIS",
    "UkMgr": "JAKARTA-1",
    "UkSpv": "AM-1",
    "REF 2023 (YA/(TIDAK)": "YA",
    "Password": "$2a$10$M8lUKAhRHkC3q6toy1fUkuvRZ52dRXT3QhClbPgF2i5TrT1WIEEra"
  },
  {
    "Region": "JAKARTA 1 REGION",
    "Area": "JAKARTA",
    "Business": "O/S BUSINESS",
    "Gender": "PRIA",
    "Location": "JAKARTA",
    "Name": "IRZATOMI RAHMAT",
    "Nrk": "201170751",
    "PhoneNumber": "+6281275594060",
    "PlaceOfBirth": "AIR KIJANG",
    "Position": "ACCOUNT OFFICER",
    "Region_1": "JAKARTA 1 REGION",
    "UkDir": "BISNIS",
    "UkMgr": "JAKARTA-1",
    "UkSpv": "BUS",
    "REF 2023 (YA/(TIDAK)": "YA",
    "Password": "$2a$10$Mixa4JepTTHUHD8LdeGXEOeFmLuRUmzxfTizim6t4brS2OMRcmNDq"
  },
  {
    "Region": "JAKARTA REGION",
    "Area": "JAKARTA",
    "Business": "O/S BUSINESS",
    "Gender": "PRIA",
    "Location": "JAKARTA",
    "Name": "RATRININGTYAS",
    "Nrk": "201160563",
    "PhoneNumber": "+6285772538848",
    "PlaceOfBirth": "BOYOLALI",
    "Position": "BUSINESS SUPPORT",
    "Region_1": "JAKARTA 1 REGION",
    "UkDir": "IT & OPS",
    "UkMgr": "OPS",
    "UkSpv": "OPS",
    "REF 2023 (YA/(TIDAK)": "YA",
    "KETERANGAN": "PERUBAHAN DATA",
    "Password": "$2a$10$a0HwEflmRsVu0uvC9i7/u.jcY0Rca1.Lp/J9ySbtnwDtzlYnbwT2e"
  },
  {
    "Region": "JAKARTA 1 REGION",
    "Area": "JAKARTA",
    "Business": "O/S BUSINESS",
    "Gender": "PRIA",
    "Location": "JAKARTA",
    "Name": "TARIMAN",
    "Nrk": "0201211162",
    "PhoneNumber": "+6285831323334",
    "Position": "RECRUITMENT OFFICER",
    "UkDir": "BISNIS",
    "UkMgr": "JAKARTA-1",
    "UkSpv": "BUS",
    "REF 2023 (YA/(TIDAK)": "BARU",
    "Password": "$2a$10$6IOwmqENJyjrTGqFlrAM0.cSm6XVezl1RVBp7fb0Th53c3yYC.F1O"
  },
  {
    "Region": "JAKARTA 1 REGION",
    "Area": "JAKARTA",
    "Business": "O/S BUSINESS",
    "Gender": "WANITA",
    "Location": "JAKARTA",
    "Name": "CINDY YULIANA",
    "Nrk": "0201211190",
    "PhoneNumber": "+6285695393432",
    "Position": "RECRUITMENT OFFICER",
    "UkDir": "BISNIS",
    "UkMgr": "JAKARTA-1",
    "UkSpv": "BUS",
    "REF 2023 (YA/(TIDAK)": "BARU",
    "Password": "$2a$10$P3dek2z5KmXe.sKAcFSPeeyjCgdNDKpxMj61c/9BAzbABf39fVzvi"
  },
  {
    "Region": "JAKARTA 1 REGION",
    "Area": "JAKARTA",
    "Business": "O/S BUSINESS",
    "Gender": "WANITA",
    "Location": "JAKARTA",
    "Name": "MIRA JUWITA RAIS",
    "Nrk": "0201221236",
    "PhoneNumber": "+6281311777522",
    "Position": "RECRUITMENT OFFICER",
    "UkDir": "BISNIS",
    "UkMgr": "JAKARTA-1",
    "UkSpv": "BUS",
    "REF 2023 (YA/(TIDAK)": "BARU",
    "Password": "$2a$10$63kIuMWP1FxTVb2i/nfOJOAp9NjWI4QOkdrnLNqQGwHIEh2v983nK"
  },
  {
    "Region": "JAKARTA 1 REGION",
    "Area": "JAKARTA",
    "Business": "O/S BUSINESS",
    "Gender": "PRIA",
    "Location": "JAKARTA",
    "Name": "GHIFFARIN SEKAR ANANDITI",
    "Nrk": "0201221253",
    "PhoneNumber": "+6287788346222",
    "Position": "RECRUITMENT OFFICER",
    "UkDir": "BISNIS",
    "UkMgr": "JAKARTA-1",
    "UkSpv": "BUS",
    "REF 2023 (YA/(TIDAK)": "BARU",
    "Password": "$2a$10$okfBh5AfXqQK7sKEnKH/Me3aQaLl0tXsKncwpuizp0GbhNLtNMFOi"
  },
  {
    "Region": "JAKARTA 1 REGION",
    "Area": "JAKARTA",
    "Business": "O/S BUSINESS",
    "Gender": "WANITA",
    "Location": "JAKARTA",
    "Name": "LISA NIODE",
    "Nrk": "0201221267",
    "PhoneNumber": "+6282244888008",
    "Position": "RECRUITMENT OFFICER",
    "UkDir": "BISNIS",
    "UkMgr": "JAKARTA-1",
    "UkSpv": "BUS",
    "REF 2023 (YA/(TIDAK)": "BARU",
    "Password": "$2a$10$mzlvNcW6OGEiYkHLwqhxAu9fkURGu3IdijBgaOrcLCe6Ny4SUBYO6"
  },
  {
    "Region": "JAKARTA 1 REGION",
    "Area": "JAKARTA",
    "Business": "O/S BUSINESS",
    "Gender": "PRIA",
    "Location": "JAKARTA",
    "Name": "SATRIA MAULANA BIMA SAKTI",
    "Nrk": "0201221272",
    "PhoneNumber": "+6281574749156",
    "Position": "RECRUITMENT OFFICER",
    "UkDir": "BISNIS",
    "UkMgr": "JAKARTA-1",
    "UkSpv": "BUS",
    "REF 2023 (YA/(TIDAK)": "BARU",
    "Password": "$2a$10$bsPXG.lInmBMTAUZsqiK2uNHt4cX9rWvxvKKKOM.46sg2SuubfaJy"
  }
]