﻿Name,ID,Initials
Bennet Michael ,1,BM
Biden Joe,2,BJ
Booker Cory,3,BC
Bloomberg Michael,4,MBg
Buttigieg Pete,5,BP
Bullock Steve,6,BS
Castro Julian,7,CJ
deBlasio Bill,8,dB
Delaney John,9,DJ
Gabbard Tulsi,10,GT
Harris Kamala,11,HK
Klobuchar Amy,12,KA
Messam Wayne,13,MW
O'Rourke Beto,14,OB
Patrick Deval,15,PD
Ryan Tim,16,RT
Sanders Bernie,17,SB
Sestak Joe ,18,SJ
Steyer Tom,19,ST
Warren Elizabeth,20,WE
Williamson Marianne,21,WM
Yang Andrew,22,YA
Unsure,23,U