"individual" "fc1" "fc2" "fc3" "fc4" "fc5" "fc6" "sc1" "sc2" "sc3" "sc4" "sc5" "sc6" "surv1" "surv2" "surv3" "surv4" "surv5" "surv6"
1 0 5 5 5 0 5 0 20 20 20 0 5 0 1 1 1 0 1
2 10 NA NA NA NA 0 16 NA NA NA 20 0 1 1 1 1 1 0
3 0 0 0 0 NA NA 0 0 0 0 20 NA 0 0 0 0 1 1
4 0 0 0 0 20 0 0 0 0 0 10 0 0 0 0 0 1 0
5 0 0 0 0 0 20 0 0 0 0 0 20 0 0 0 0 0 1
6 3 0 19 19 19 NA 19 0 3 3 NA NA 1 0 1 1 1 1
7 17 0 21 0 17 0 21 0 17 0 15 0 1 0 1 0 1 0
8 23 NA NA 0 NA NA 23 NA NA 0 20 NA 1 1 1 0 1 1
9 0 0 0 NA 0 NA 0 0 0 NA 0 23 0 0 0 1 0 1
10 2 2 2 2 2 4 3 12 12 3 NA 20 1 1 1 1 1 1
11 0 0 NA 0 0 0 0 0 NA 0 0 0 0 0 1 0 0 0
12 11 5 5 5 17 17 17 22 22 22 12 17 1 1 1 1 1 1
13 0 0 17 0 17 0 0 0 10 0 NA 0 0 0 1 0 1 0
14 0 17 17 0 17 0 0 20 20 0 15 0 0 1 1 0 1 0
15 19 0 0 0 0 0 1 0 0 0 0 0 1 0 0 0 0 0
16 0 NA 0 0 NA 0 0 NA 0 0 20 0 0 1 0 0 1 0
17 0 0 0 NA 0 NA 0 0 0 NA 0 NA 0 0 0 1 0 1
18 0 22 0 0 0 0 0 21 0 0 0 0 0 1 0 0 0 0
19 0 2 0 0 2 NA 0 19 0 0 12 NA 0 1 0 0 1 1
20 20 20 20 0 20 0 17 11 20 0 22 0 1 1 1 0 1 0
21 20 20 20 20 0 20 11 11 5 5 0 20 1 1 1 1 0 1
22 20 20 20 20 20 20 5 11 11 3 NA 20 1 1 1 1 1 1
23 0 0 0 12 0 0 0 0 0 NA 0 0 0 0 0 1 0 0
24 23 0 0 0 0 0 23 0 0 0 0 0 1 0 0 0 0 0
25 0 0 0 0 0 22 0 0 0 0 0 12 0 0 0 0 0 1
26 20 20 20 20 20 20 11 11 11 3 NA 20 1 1 1 1 1 1
27 0 0 2 2 0 0 0 0 0 12 0 0 0 1 1 1 0 0
28 0 0 0 0 2 0 0 0 0 0 NA 0 0 0 0 0 1 0
29 0 0 0 0 23 0 0 0 0 0 10 0 0 0 0 0 1 0
30 23 NA NA NA NA NA 23 NA NA NA 20 NA 1 1 1 1 1 1
31 0 NA NA NA 0 NA 0 NA NA NA 0 NA 1 1 1 1 1 1
32 0 0 0 0 0 NA 0 0 0 0 0 NA 0 0 0 0 0 1
33 2 0 0 0 0 0 10 0 0 0 0 0 1 0 0 0 0 0
34 22 0 22 22 22 0 2 0 23 23 NA 0 1 0 1 1 1 0
35 2 0 0 2 0 5 20 0 0 5 0 5 1 0 0 1 0 1
36 23 NA NA NA 0 0 23 NA NA NA 0 0 1 1 1 1 0 0
37 5 0 0 22 0 0 20 0 0 5 0 0 1 0 0 1 0 0
38 23 NA NA NA NA NA 23 NA NA NA 20 NA 1 1 1 1 1 1
39 0 23 23 23 20 12 0 23 23 23 NA 12 0 1 1 1 1 1
40 0 NA NA 0 0 NA 0 NA NA 0 0 NA 0 1 1 0 0 1
41 0 20 0 0 0 0 0 17 0 0 0 0 0 1 0 0 0 0
42 11 0 0 7 12 0 7 0 0 3 9 0 1 0 0 1 1 0
43 23 NA NA 0 NA NA 23 NA NA 0 20 NA 1 1 1 0 1 1
44 0 0 0 0 5 0 0 0 0 0 12 0 1 0 0 0 1 0
45 20 20 20 20 20 20 3 5 5 5 NA 20 1 1 1 1 1 1
46 0 5 0 5 20 20 0 20 0 20 4 12 0 1 0 1 1 1
47 0 0 0 0 23 0 0 0 0 0 22 0 0 0 0 0 1 0
48 0 0 0 NA 0 0 0 0 0 NA 0 0 0 0 0 1 0 0
49 0 0 0 0 17 0 0 0 0 0 5 0 0 0 0 0 1 0
50 17 17 17 17 17 0 20 20 20 20 15 0 1 1 1 1 1 0
51 0 NA 0 0 0 0 0 NA 0 0 0 0 0 1 0 0 0 0
52 5 2 2 2 4 5 2 5 5 5 NA 2 1 1 1 1 1 1
53 0 5 5 5 5 5 0 12 12 12 12 5 0 1 1 1 1 1
54 0 0 0 23 0 0 0 0 0 23 0 0 0 0 0 1 0 0
55 5 5 0 5 0 NA 2 2 0 2 0 NA 1 1 0 1 0 1
56 0 0 0 0 17 0 0 0 0 0 12 0 0 0 0 0 1 0
57 0 0 0 0 0 2 0 0 0 0 0 2 0 0 0 0 0 1
58 0 NA 0 0 0 0 0 NA 0 0 0 0 0 1 0 0 0 0
59 0 NA NA 0 0 NA 0 NA NA 0 0 NA 1 1 1 0 0 1
60 0 NA 0 0 0 0 0 NA 0 0 0 0 0 1 0 0 0 0
61 0 0 NA 10 NA 0 0 0 NA 23 20 0 0 0 1 1 1 0
62 0 NA 0 0 0 0 0 NA 0 0 0 0 0 1 0 0 0 0
63 0 0 0 0 17 0 0 0 0 0 15 0 0 0 0 0 1 0
64 23 0 23 0 0 0 23 0 23 0 0 0 1 0 1 0 0 0
65 19 0 0 0 0 0 19 0 0 0 0 0 1 0 0 0 0 0
66 0 0 0 5 0 0 0 0 0 2 0 0 0 0 0 1 0 0
67 20 20 2 2 20 20 5 5 20 12 NA 20 1 1 1 1 1 1
68 0 0 0 0 2 0 0 0 0 0 15 0 0 0 0 0 1 0
69 17 0 0 17 17 0 23 0 0 23 22 0 1 0 0 1 1 0
70 5 0 0 0 0 0 14 0 0 0 0 0 1 0 0 0 0 0
71 2 NA NA NA 0 NA 9 NA NA NA 0 NA 1 1 1 1 0 1
72 0 0 0 0 0 5 0 0 0 0 0 5 0 0 0 0 0 1
73 10 0 0 0 0 0 10 0 0 0 0 0 1 0 0 0 0 0
74 0 NA NA 0 0 0 0 NA NA 0 0 0 0 1 1 0 0 0
75 12 12 0 0 0 0 9 12 0 0 0 0 1 1 0 0 0 0
76 0 0 0 0 0 0 0 0 0 0 0 0 0 1 0 0 0 0
77 10 NA NA 0 0 NA 23 NA NA 0 0 NA 1 1 1 0 0 1
78 23 0 0 NA 0 NA 23 0 0 NA 0 NA 1 0 0 1 0 1
79 11 0 11 5 0 5 5 0 5 12 0 5 1 0 1 1 0 1
80 23 NA 0 NA NA NA 23 NA 0 NA 20 NA 1 1 0 1 1 1
81 0 23 0 0 12 NA 0 23 0 0 10 NA 0 1 0 0 1 1
82 23 0 0 0 0 0 23 0 0 0 0 0 1 0 0 0 0 0
83 5 0 5 0 0 0 20 0 17 0 0 0 1 0 1 0 0 0
84 0 0 23 0 0 NA 0 0 23 0 0 NA 0 0 1 0 0 1
85 0 0 0 0 0 0 0 5 0 0 0 0 0 1 0 0 0 0
86 20 20 0 0 0 0 11 11 0 0 0 0 1 1 0 0 0 0
87 5 0 0 0 0 0 2 0 0 0 0 0 1 0 0 0 0 0
88 0 0 0 NA 0 NA 0 0 0 NA 0 NA 0 0 0 1 0 1
89 17 0 17 17 0 17 10 0 10 10 0 17 1 0 1 1 0 1
90 0 12 10 0 0 0 0 23 19 0 0 0 0 1 1 0 0 0
91 20 20 0 0 20 0 2 5 0 0 NA 0 1 1 0 0 1 0
92 0 20 0 0 12 2 0 22 0 0 NA 2 0 1 0 0 1 1
93 0 0 0 0 2 5 0 0 0 0 4 5 0 0 0 0 1 1
94 0 20 0 20 17 17 0 20 0 17 15 17 0 1 0 1 1 1
95 0 0 20 20 20 0 0 0 12 2 NA 0 0 0 1 1 1 0
96 0 20 5 0 0 5 0 5 2 0 0 5 0 1 1 0 0 1
97 0 0 NA 0 0 0 0 0 NA 0 0 0 0 0 1 0 0 0
98 6 0 0 0 0 0 10 0 0 0 0 0 1 0 0 0 0 0
99 0 5 5 5 5 5 0 2 20 2 NA 5 0 1 1 1 1 1
100 0 0 0 0 0 NA 0 0 0 0 0 NA 0 0 0 0 0 1
101 0 0 23 0 19 0 0 0 23 0 NA 0 0 0 1 0 1 0
102 20 20 20 19 20 NA 2 17 5 20 22 NA 1 1 1 1 1 1
103 0 0 2 2 2 0 0 0 2 2 22 0 0 0 1 1 1 0
104 3 23 15 23 12 12 12 23 12 23 10 20 1 1 1 1 1 1
105 0 0 0 0 20 20 0 0 0 0 10 20 0 0 0 0 1 1
106 17 0 17 17 17 17 11 0 5 2 NA 17 1 0 1 1 1 1
107 0 5 0 23 4 0 0 12 0 23 4 0 0 1 0 1 1 0
108 0 20 0 0 0 0 0 11 0 0 0 0 0 1 0 0 0 0
109 0 20 0 12 2 2 0 5 0 2 NA 2 0 1 0 1 1 1
110 0 20 20 0 20 0 0 11 11 0 NA 0 0 1 1 0 1 0
111 23 0 0 0 0 10 23 0 0 0 0 23 1 0 0 0 0 1
112 2 0 0 20 0 2 5 0 0 1 0 2 1 0 0 1 0 1
113 2 1 2 2 0 0 12 12 5 12 0 0 1 1 1 1 0 0
114 0 NA NA NA NA 0 0 NA NA NA 20 0 1 1 1 1 1 0
115 20 0 0 0 0 0 11 0 0 0 0 0 1 0 0 0 0 0
116 11 11 11 2 0 2 19 12 2 12 0 12 1 1 1 1 0 1
117 20 0 0 0 0 0 11 0 0 0 0 0 1 0 0 0 0 0
118 20 0 0 0 0 0 11 0 0 0 0 0 1 0 0 0 0 0
119 23 0 0 0 0 0 23 0 0 0 0 0 1 0 0 0 0 0
120 17 17 NA 2 0 NA 5 5 0 5 0 23 1 1 1 1 0 1
121 20 0 0 20 20 20 11 0 0 5 4 12 1 0 0 1 1 1
122 2 0 0 0 0 0 2 0 0 0 0 0 1 0 0 0 0 0
123 0 0 5 5 5 5 0 0 23 12 NA 12 0 0 1 1 1 1
124 20 20 0 20 20 20 12 5 0 5 NA 2 1 1 0 1 1 1
125 0 17 0 0 0 0 0 20 0 0 0 0 0 1 0 0 0 0
126 0 19 0 0 0 0 0 5 0 0 0 0 0 1 0 0 0 0
127 20 0 20 20 20 20 3 0 5 3 12 20 1 0 1 1 1 1
128 0 3 0 0 0 17 0 22 0 0 0 0 0 1 0 0 0 1
129 17 0 0 0 0 NA 20 0 0 0 0 NA 1 0 0 0 0 1
130 5 0 0 0 0 0 12 0 0 0 0 0 1 0 0 0 0 0
131 0 20 0 20 0 0 0 17 0 17 0 0 0 1 0 1 0 0
132 0 0 0 0 NA 0 0 0 0 0 20 0 1 0 0 0 1 0
133 0 NA 0 0 0 0 0 NA 0 0 0 0 0 1 0 0 0 0
134 0 2 2 2 0 2 0 5 5 5 0 2 0 1 1 1 0 1
135 0 5 5 5 5 NA 0 5 19 2 4 NA 0 1 1 1 1 1
136 7 0 0 0 0 0 5 0 0 0 0 0 1 0 0 0 0 0
137 0 0 0 0 0 5 0 0 0 0 0 5 0 0 0 0 0 1
138 10 12 10 10 20 10 17 17 17 17 22 20 1 1 1 1 1 1
139 11 5 0 5 5 5 3 12 0 2 NA 5 1 1 0 1 1 1
140 0 0 5 0 5 20 0 0 5 0 4 20 0 0 1 0 1 1
141 20 20 20 20 17 17 17 17 17 17 15 17 1 1 1 1 1 1
142 0 0 0 0 0 0 0 0 0 0 0 0 1 0 0 0 0 0
143 0 0 0 0 2 0 0 0 0 0 4 0 0 0 0 0 1 0
144 23 0 0 20 20 20 23 0 0 23 12 NA 1 0 0 1 1 1
145 22 22 22 0 0 0 20 20 22 0 0 0 1 1 1 0 0 0
146 2 0 0 2 0 0 23 0 0 4 0 0 1 0 0 1 0 0
147 10 0 0 0 0 0 21 0 0 0 0 0 1 0 0 0 0 0
148 23 NA NA NA NA NA 23 NA NA NA 0 NA 1 1 1 1 1 1
149 0 0 23 0 0 0 0 0 2 0 0 0 0 0 1 0 0 0
150 0 0 12 0 0 0 0 0 2 0 0 0 0 1 1 0 0 0
151 23 NA 0 NA 0 0 23 NA 0 NA 0 0 1 1 0 1 0 0
152 2 2 2 20 12 20 17 17 20 22 5 20 1 1 1 1 1 1
153 20 20 20 20 20 20 11 19 22 5 4 20 1 1 1 1 1 1
154 23 0 0 0 0 0 16 0 0 0 0 0 1 0 0 0 0 0
155 0 0 0 NA 0 0 0 0 0 0 0 0 0 0 0 1 0 0
156 0 12 0 10 0 0 0 16 0 NA 0 0 0 1 0 1 0 0
157 0 0 0 0 20 20 0 0 0 0 NA 2 0 0 0 0 1 1
158 0 0 5 5 5 5 0 0 12 12 4 5 0 0 1 1 1 1
159 20 20 20 20 20 20 5 5 5 7 NA 20 1 1 1 1 1 1
160 23 0 NA NA 0 NA 23 0 NA NA 0 NA 1 0 1 1 0 1
161 12 12 12 0 0 12 5 5 5 0 0 5 1 1 1 0 0 1
162 0 2 0 0 2 2 0 5 0 0 4 0 0 1 0 0 1 1
163 23 0 NA 0 0 0 23 0 NA 0 0 0 1 0 1 0 0 0
164 0 0 20 20 17 NA 0 0 17 17 15 NA 0 0 1 1 1 1
165 23 NA 0 0 0 0 23 NA 0 0 0 0 1 1 0 0 0 0
166 2 0 0 0 0 0 0 0 0 0 0 0 1 0 0 0 0 0
167 2 12 12 2 2 2 12 2 2 12 NA 2 1 1 1 1 1 1
168 0 2 2 2 0 0 0 12 12 12 0 0 0 1 1 1 0 0
169 20 20 20 20 20 20 11 11 11 5 4 20 1 1 1 1 1 1
170 0 11 0 0 2 22 0 22 0 0 12 2 0 1 0 0 1 1
171 20 0 0 0 0 0 11 0 0 0 0 0 1 0 0 0 0 0
172 0 20 0 0 0 0 0 2 0 0 0 0 0 1 0 0 0 0
173 0 0 0 0 0 NA 0 0 0 0 0 0 0 0 0 0 0 1
174 2 0 0 0 0 0 17 0 0 0 0 0 1 0 0 0 0 0
175 23 0 0 0 0 0 23 0 0 0 0 0 1 0 0 0 0 0
176 0 0 0 0 0 2 0 0 0 0 0 12 0 0 0 0 0 1
177 17 17 0 0 0 0 17 20 0 0 0 0 1 1 0 0 0 0
178 0 0 0 0 5 0 0 0 0 0 NA 0 0 0 0 0 1 0
179 0 0 0 NA 0 0 0 0 0 NA 0 0 0 0 0 1 0 0
180 10 0 0 5 0 NA 23 0 0 NA 0 5 1 0 0 1 0 1
181 0 0 20 23 0 0 0 0 12 23 0 0 0 0 1 1 0 0
182 0 NA NA 0 0 0 0 NA NA 0 0 0 0 1 1 0 0 0
183 0 0 0 0 0 NA 0 0 0 0 0 NA 0 0 0 0 0 1
184 0 0 10 10 0 0 0 0 NA NA 0 0 0 0 1 1 0 0
185 0 0 0 0 0 NA 0 0 0 0 0 NA 0 0 0 0 0 1
186 21 0 0 0 12 0 5 0 0 0 19 0 1 0 0 0 1 0
187 0 0 0 0 0 NA 0 0 0 0 0 NA 0 0 0 0 0 1
188 0 0 0 0 2 2 0 0 0 0 NA 2 0 0 0 0 1 1
189 0 0 0 0 NA 0 0 0 0 0 20 0 0 0 0 0 1 0
190 23 NA 0 0 0 0 23 NA 0 0 0 0 1 1 0 0 0 0
191 23 0 0 0 12 5 23 0 0 0 4 20 1 0 0 0 1 1
192 2 0 0 0 0 0 12 0 0 0 0 0 1 0 0 0 0 0
193 23 0 0 0 0 23 23 0 0 0 0 23 1 0 0 0 0 1
194 0 NA 0 0 0 0 0 NA 0 0 0 0 0 1 0 0 0 0
195 0 0 0 NA 0 0 0 0 0 NA 0 0 0 0 0 1 0 0
196 2 23 2 2 2 2 2 23 5 5 NA 2 1 1 1 1 1 1
197 0 0 0 0 23 17 0 0 0 0 NA 17 0 0 0 0 1 1
198 0 0 0 0 0 0 0 0 0 0 0 0 1 0 0 0 0 0
199 0 0 0 10 23 23 0 0 0 23 10 17 0 0 0 1 1 1
200 20 20 12 20 12 5 3 7 3 17 NA 5 1 1 1 1 1 1
201 0 NA 0 0 0 0 0 NA 0 0 0 0 0 1 0 0 0 0
202 10 0 10 0 0 0 23 0 22 0 0 0 1 0 1 0 0 0
203 0 0 0 3 12 NA 0 0 0 12 15 NA 0 0 0 1 1 1
204 5 0 5 5 0 5 23 0 2 2 0 5 1 0 1 1 0 1
205 23 NA NA NA NA NA 23 NA NA NA 20 NA 1 1 1 1 1 1
206 0 0 0 0 0 0 0 0 0 0 0 0 0 0 0 0 1 0
207 0 0 0 10 0 12 0 0 0 9 0 10 0 0 0 1 0 1
208 0 17 0 17 17 NA 0 5 0 5 4 NA 0 1 0 1 1 1
209 23 0 NA NA 10 NA 23 0 10 NA 10 NA 1 0 1 1 1 1
210 5 5 5 5 5 NA 20 20 12 3 NA NA 1 1 1 1 1 1
211 0 0 0 0 NA 0 0 0 0 0 20 0 1 0 0 0 1 0
212 0 23 0 17 0 0 0 23 0 20 0 0 0 1 0 1 0 0
213 19 19 19 19 NA NA 23 12 10 10 20 NA 1 1 1 1 1 1
214 17 0 0 0 0 0 22 0 0 0 0 0 1 0 0 0 0 0
215 2 NA 0 0 NA NA 23 NA 0 0 20 NA 1 1 0 0 1 1
216 23 20 23 17 17 17 23 17 23 2 15 17 1 1 1 1 1 1
217 0 0 0 5 5 0 0 0 0 19 NA 0 0 0 0 1 1 0
218 0 NA NA 0 0 0 0 NA NA 0 0 0 1 1 1 0 0 0
219 0 5 0 0 0 0 0 19 0 0 0 0 0 1 0 0 0 0
220 0 0 0 0 0 17 0 0 0 0 0 17 0 0 0 0 0 1
221 0 0 0 NA 10 0 0 0 0 NA 20 0 0 0 0 1 1 0
222 20 20 0 0 20 12 11 14 0 0 4 12 1 1 0 0 1 1
223 17 0 0 0 0 0 23 0 0 0 0 0 1 1 0 0 0 0
224 0 0 0 0 0 23 0 0 0 0 0 19 0 0 0 0 0 1
225 0 0 5 0 5 5 0 0 22 0 NA 12 0 0 1 0 1 1
226 0 0 0 0 0 0 0 0 0 0 0 0 0 0 0 1 0 0
227 20 0 0 0 0 NA 11 0 0 0 0 NA 1 0 0 0 0 1
228 0 0 0 19 5 5 0 0 0 5 5 22 0 0 0 1 1 1
229 2 NA 0 0 0 NA 17 NA 0 0 0 NA 1 1 0 0 0 1
230 0 NA 0 0 NA 0 0 NA 0 0 20 0 0 1 0 0 1 0
231 0 23 0 0 0 0 0 23 0 0 0 0 0 1 0 0 0 0
232 23 NA 0 10 0 NA 23 NA 0 12 0 NA 1 1 0 1 0 1
233 0 0 0 0 0 NA 0 0 0 0 0 NA 0 0 0 0 0 1
234 0 0 0 0 0 5 0 0 0 0 0 5 0 0 0 0 0 1
235 23 0 NA 0 NA NA 23 0 NA 0 20 NA 1 0 1 0 1 1
236 23 0 NA 0 0 0 23 0 NA 0 0 0 1 0 1 0 0 0
237 0 0 0 0 0 NA 0 0 0 0 0 NA 0 0 0 0 0 1
238 0 NA 0 0 0 0 0 NA 0 0 0 0 0 1 0 0 0 0
239 0 20 20 0 0 0 0 5 5 0 0 0 0 1 1 0 0 0
240 0 0 0 0 17 17 0 0 0 0 12 17 0 0 0 0 1 1
241 0 0 20 10 20 20 0 0 2 7 22 20 0 0 1 1 1 1
242 23 NA NA NA NA NA 23 NA NA NA 20 NA 1 1 1 1 1 1
243 20 0 23 0 23 20 22 0 20 0 10 20 1 0 1 0 1 1
244 10 0 17 17 17 0 17 0 10 10 19 0 1 0 1 1 1 0
245 0 0 0 0 23 0 0 0 0 0 10 0 0 0 0 0 1 0
246 2 2 0 2 2 2 5 5 0 5 NA 2 1 1 0 1 1 1
247 10 12 0 0 0 0 23 NA 0 0 0 0 1 1 0 0 0 0
248 20 20 20 20 20 20 17 17 17 17 22 20 1 1 1 1 1 1
249 0 20 0 0 0 0 0 11 0 0 0 0 0 1 0 0 0 0
250 23 0 NA 0 0 0 23 0 NA 0 0 0 1 0 1 0 0 0
251 2 0 0 0 0 0 23 0 0 0 0 0 1 0 0 0 0 0
252 0 0 0 0 0 0 0 0 0 0 0 0 1 0 0 0 0 0
253 23 0 NA 0 NA NA 23 0 NA 0 20 NA 1 0 1 0 1 1
254 20 0 0 0 0 0 11 0 0 0 0 0 1 0 0 0 0 0
255 0 0 0 0 5 5 0 0 0 0 NA 5 0 0 0 0 1 1
256 0 0 2 0 0 2 0 0 6 0 0 23 0 0 1 0 0 1
257 0 0 0 0 0 NA 0 0 0 0 0 NA 0 0 0 0 0 1
258 23 0 NA 0 0 0 23 0 NA 0 0 0 1 0 1 0 0 0
259 20 20 20 20 0 20 11 17 17 3 0 20 1 1 1 1 0 1
260 0 0 0 NA 0 NA 0 0 0 NA 0 NA 0 0 0 1 0 1
261 10 NA 0 NA 0 5 13 NA 0 NA 0 NA 1 1 0 1 0 1
262 0 12 NA 0 NA 0 0 NA NA 0 20 0 0 1 1 0 1 0
263 0 0 0 0 12 NA 0 0 0 0 4 NA 0 0 0 0 1 1
264 5 0 0 23 5 0 11 0 0 5 NA 0 1 0 0 1 1 0
265 0 0 0 0 0 NA 0 0 0 0 0 NA 0 0 0 0 0 1
266 5 0 0 0 0 0 12 0 0 0 0 0 1 0 0 0 0 0
267 0 11 0 0 0 0 0 20 0 0 0 0 0 1 0 0 0 0
268 0 0 0 5 0 5 0 0 0 23 0 5 0 0 0 1 0 1
269 0 NA 0 0 0 0 0 NA 0 0 0 0 0 1 0 0 0 0
270 0 20 20 20 20 20 0 22 17 17 22 17 0 1 1 1 1 1
271 0 0 0 0 2 2 0 0 0 0 22 17 0 0 0 0 1 1
272 0 0 0 2 0 2 0 0 0 5 0 2 0 0 0 1 0 1
273 0 20 2 20 2 20 0 5 5 5 15 5 0 1 1 1 1 1
274 0 0 5 5 0 0 0 0 12 12 0 0 0 1 1 1 0 0
275 20 0 0 0 0 0 2 0 0 0 0 0 1 0 0 0 0 0
276 0 0 0 2 2 0 0 0 0 5 5 0 0 0 0 1 1 0
277 0 20 20 0 20 0 0 20 20 0 15 0 0 1 1 0 1 0
278 0 0 0 0 0 0 0 0 0 0 0 0 1 0 0 0 0 0
279 20 20 20 20 0 20 5 5 5 5 0 20 1 1 1 1 0 1
280 19 19 0 0 NA 0 10 19 0 0 20 0 1 1 0 0 1 0
281 0 0 0 0 20 0 0 0 0 0 NA 0 0 0 0 0 1 0
282 0 0 2 0 2 NA 0 0 2 0 NA 4 0 0 1 0 1 1
283 0 5 5 12 12 5 0 20 12 5 4 5 0 1 1 1 1 1
284 0 0 NA 0 0 0 0 0 NA 0 0 0 0 0 1 0 0 0
285 10 NA 10 0 0 0 22 NA NA 0 0 0 1 1 1 0 0 0
286 23 0 0 0 0 NA 23 0 0 0 0 NA 1 0 0 0 0 1
287 0 0 0 0 0 NA 0 0 0 0 0 NA 0 0 0 0 0 1
288 0 0 0 22 0 0 0 0 0 23 0 0 0 0 0 1 0 0
289 0 0 0 0 5 0 0 0 0 0 20 0 0 0 0 0 1 0
290 0 0 0 0 20 0 0 0 0 0 12 0 0 0 0 0 1 0
291 0 0 0 0 0 NA 0 0 0 0 0 NA 0 0 0 0 0 1
292 17 17 0 0 0 17 10 20 0 0 0 17 1 1 0 0 0 1
293 0 17 0 0 17 17 0 3 0 0 15 17 0 1 0 0 1 1
294 0 0 NA NA 0 NA 0 0 NA NA 0 NA 0 0 1 1 0 1
295 0 NA 0 0 0 0 0 NA 0 0 0 0 0 1 0 0 0 0
296 3 3 3 3 23 2 23 3 1 23 NA 2 1 1 1 1 1 1
297 3 0 0 0 0 NA 11 0 0 0 0 NA 1 0 0 0 0 1
298 0 0 0 17 0 0 0 0 0 20 0 0 0 0 0 1 0 0
299 10 0 0 0 NA NA 23 0 0 0 20 NA 1 0 0 0 1 1
300 2 5 5 5 22 0 2 22 2 22 5 0 1 1 1 1 1 0
301 0 20 2 0 0 0 0 5 12 0 0 0 0 1 1 0 0 0
302 20 0 0 0 0 NA 2 0 0 0 0 NA 1 0 0 0 0 1
303 20 20 19 0 0 20 5 12 20 0 0 20 1 1 1 0 0 1
304 23 NA NA 0 0 0 23 NA NA 0 0 0 1 1 1 0 0 0
305 0 12 0 0 0 2 0 20 0 0 0 10 0 1 0 0 0 1
306 0 0 0 0 10 0 0 0 0 0 12 0 0 0 0 0 1 0
307 10 0 0 0 0 0 21 0 0 0 0 0 1 0 0 0 0 0
308 0 0 0 0 4 0 0 0 0 0 17 0 0 0 0 0 1 0
309 0 0 0 0 NA NA 0 0 0 0 20 NA 0 0 0 0 1 1
310 23 NA 12 23 NA NA 23 NA 11 23 20 23 1 1 1 1 1 1
311 2 0 2 0 0 2 12 0 12 0 0 2 1 0 1 0 0 1
312 0 17 0 0 0 0 0 11 0 0 0 0 0 1 0 0 0 0
313 20 0 0 20 20 20 23 0 0 17 NA 20 1 0 0 1 1 1
314 0 0 0 20 0 0 0 0 0 2 0 0 0 0 0 1 0 0
315 0 0 0 17 0 0 0 0 0 20 0 0 0 0 0 1 0 0
316 0 11 0 23 0 NA 0 2 0 23 0 NA 0 1 0 1 0 1
317 14 20 0 5 0 5 3 5 0 20 0 5 1 1 0 1 0 1
318 0 2 0 0 0 0 0 2 0 0 0 0 0 1 0 0 0 0
319 0 0 0 0 2 0 0 0 0 0 15 0 0 0 0 0 1 0
320 0 0 7 5 0 5 0 0 5 5 0 5 0 0 1 1 0 1
321 22 0 0 0 0 0 22 0 0 0 0 0 1 0 0 0 0 0
322 11 11 2 5 12 5 20 5 5 2 4 5 1 1 1 1 1 1
323 0 0 0 22 0 0 0 0 0 2 0 0 0 0 0 1 0 0
324 20 0 0 0 22 0 11 0 0 0 4 0 1 0 0 0 1 0
325 23 NA 0 NA NA NA 23 NA 0 NA 20 NA 1 1 0 1 1 1
326 10 0 2 2 5 17 5 0 23 20 NA 5 1 0 1 1 1 1
327 2 2 2 2 12 NA 11 11 5 5 NA NA 1 1 1 1 1 1
328 17 0 0 17 0 0 10 0 0 10 0 0 1 0 0 1 0 0
329 0 0 0 0 0 NA 0 0 0 0 0 NA 0 0 0 0 0 1
330 10 0 0 0 0 0 9 0 0 0 0 0 1 0 0 0 0 0
331 20 20 2 2 2 0 20 2 2 5 NA 0 1 1 1 1 1 0
332 10 2 2 2 2 2 2 12 12 12 NA 2 1 1 1 1 1 1
333 11 0 0 0 0 0 20 0 0 0 0 0 1 0 0 0 0 0
334 0 12 0 0 0 0 0 23 0 0 0 0 0 1 0 0 0 0
335 12 12 12 12 0 0 12 19 12 23 0 0 1 1 1 1 0 0
336 0 0 0 0 0 0 0 0 0 0 0 0 1 0 0 0 0 0
337 11 12 2 2 12 12 12 11 5 12 NA 12 1 1 1 1 1 1
338 0 20 17 17 17 17 0 17 20 20 15 20 0 1 1 1 1 1
339 0 20 0 20 0 0 0 2 0 17 0 0 0 1 0 1 0 0
340 23 23 0 0 NA 0 23 23 0 0 20 0 1 1 0 0 1 0
341 0 0 0 0 0 NA 0 0 0 0 0 NA 0 0 0 0 0 1
342 0 0 20 0 0 0 0 0 5 0 0 0 0 0 1 0 0 0
343 0 5 0 5 0 0 0 12 0 2 0 0 0 1 0 1 0 0
344 0 0 0 5 5 NA 0 0 0 22 15 NA 0 0 0 1 1 1
345 10 0 0 10 0 20 20 0 0 20 0 20 1 0 0 1 0 1
346 6 22 15 5 12 NA 12 12 12 22 4 NA 1 1 1 1 1 1
347 0 0 17 17 0 17 0 0 6 19 0 17 0 0 1 1 0 1
348 0 NA 0 0 0 0 0 NA 0 0 0 0 0 1 0 0 0 0
349 0 NA NA 0 0 0 0 NA NA 0 0 0 0 1 1 0 0 0
350 0 NA NA 0 NA 0 0 NA NA 0 20 0 0 1 1 0 1 0
351 0 0 0 0 0 23 0 0 0 0 0 23 0 0 0 0 0 1
352 0 0 0 NA 0 0 0 0 0 NA 0 0 0 0 0 1 0 0
353 0 0 0 0 0 19 0 0 0 0 0 20 0 0 0 0 0 1
354 23 0 0 0 NA 0 23 0 0 0 20 0 1 0 0 0 1 0
355 18 NA NA 0 0 0 6 NA NA 0 0 0 1 1 1 0 0 0
356 0 0 0 0 0 17 0 0 0 0 0 17 0 0 0 0 0 1
357 0 NA 0 0 0 0 0 NA 0 0 0 0 0 1 0 0 0 0
358 0 2 0 0 0 0 0 20 0 0 0 0 0 1 0 0 0 0
359 17 0 17 0 0 17 22 0 10 0 0 17 1 0 1 0 0 1
360 0 0 0 0 NA 0 0 0 0 0 20 0 0 0 0 0 1 0
361 0 2 0 17 0 0 0 17 0 20 0 0 0 1 0 1 0 0
362 0 0 0 20 12 0 0 0 0 17 15 0 0 0 0 1 1 0
363 3 3 5 0 0 0 7 5 3 0 0 0 1 1 1 0 0 0
364 0 12 10 0 0 0 0 22 23 0 0 0 0 1 1 0 0 0
365 23 20 3 0 20 2 23 3 11 0 NA 20 1 1 1 0 1 1
366 17 17 0 17 17 17 10 7 0 10 12 17 1 1 0 1 1 1
367 0 0 0 4 22 NA 0 0 0 22 4 NA 0 0 0 1 1 1
368 0 0 0 0 0 NA 0 0 0 0 0 NA 0 0 0 0 0 1
369 23 0 23 3 23 NA 3 0 23 1 10 NA 1 0 1 1 1 1
370 2 0 0 0 2 17 11 0 0 0 22 17 1 0 0 0 1 1
371 0 0 23 23 0 0 0 0 23 23 0 0 0 0 1 1 0 0
372 0 20 0 0 22 NA 0 19 0 0 4 NA 0 1 0 0 1 1
373 0 0 0 NA 0 0 0 0 0 NA 0 0 0 0 0 1 0 0
374 14 20 0 0 22 0 11 17 0 0 NA 0 1 1 0 0 1 0
375 0 0 11 12 0 0 0 0 20 3 0 0 0 0 1 1 0 0
376 20 20 20 20 20 20 11 17 17 17 22 20 1 1 1 1 1 1
377 5 5 5 0 0 5 20 20 19 0 0 17 1 1 1 0 0 1
378 5 5 5 5 5 5 23 23 2 2 NA 23 1 1 1 1 1 1
379 23 NA NA 0 0 0 23 NA NA 0 0 0 1 1 1 0 0 0
380 5 5 0 5 5 0 20 20 0 20 NA 0 1 1 0 1 1 0
381 0 0 0 0 20 0 0 0 0 0 5 0 0 0 0 0 1 0
382 23 0 NA 0 NA 0 23 0 NA 0 20 0 1 0 1 0 1 0
383 14 NA 0 0 0 0 0 12 0 0 0 0 1 1 0 0 0 0
384 0 2 0 0 0 0 0 5 0 0 0 0 0 1 0 0 0 0
385 23 23 0 0 0 0 0 NA 0 0 0 0 1 1 0 0 0 0
386 5 0 0 0 0 0 12 0 0 0 0 0 1 0 0 0 0 0
387 0 0 23 0 0 0 0 0 23 0 0 0 0 0 1 0 0 0
388 0 0 NA 0 0 0 0 0 NA 0 0 0 0 0 1 0 0 0
389 23 NA NA 0 0 NA 23 NA NA 0 0 NA 1 1 1 0 0 1
390 0 0 0 0 NA 0 0 0 0 0 20 0 0 0 0 0 1 0
391 0 0 0 0 0 0 0 0 0 0 0 0 1 0 0 0 0 0
392 23 5 0 5 0 NA 23 3 0 20 0 NA 1 1 0 1 0 1
393 23 23 NA NA 19 NA 23 23 NA NA NA NA 1 1 1 1 1 1
394 12 12 0 0 0 0 12 23 0 0 0 0 1 1 0 0 0 0
395 0 20 17 22 22 22 0 22 19 19 5 20 1 1 1 1 1 1
396 0 0 0 0 23 0 0 0 0 0 10 0 0 0 0 0 1 0
397 0 0 0 NA 0 0 0 0 0 NA 0 0 0 0 0 1 0 0
398 17 0 17 0 0 0 23 0 23 0 0 0 1 0 1 0 0 0
399 0 0 0 17 0 0 0 0 0 2 0 0 0 0 0 1 0 0
400 23 0 0 0 0 NA 23 0 0 0 0 NA 1 0 0 0 0 1
401 23 NA NA 0 0 0 23 NA NA 0 0 0 1 1 1 0 0 0
402 23 NA NA NA 0 0 23 NA NA NA 0 0 1 1 1 1 0 0
403 10 12 10 10 0 0 2 2 2 22 0 0 1 1 1 1 0 0
404 0 20 0 0 0 0 0 7 0 0 0 0 0 1 0 0 0 0
405 0 0 20 0 0 0 0 0 7 0 0 0 0 0 1 0 0 0
406 11 0 0 0 0 0 17 0 0 0 0 0 1 0 0 0 0 0
407 0 0 2 2 2 0 0 0 5 5 4 0 0 0 1 1 1 0
408 23 NA NA NA 0 NA 23 NA NA NA 0 NA 1 1 1 1 0 1
409 19 NA 0 0 0 0 23 NA 0 0 0 0 1 1 0 0 0 0
410 0 0 0 0 0 2 0 0 0 0 0 20 0 0 0 0 0 1
411 20 5 20 9 19 NA 5 20 5 5 15 NA 1 1 1 1 1 1
412 0 0 5 0 0 5 0 0 2 0 0 5 0 0 1 0 0 1
413 20 20 20 20 0 20 17 20 17 17 0 20 1 1 1 1 0 1
414 17 0 17 17 17 0 17 0 17 17 5 0 1 0 1 1 1 0
415 0 0 20 23 0 0 0 0 11 12 0 0 0 0 1 1 0 0
416 3 3 22 19 19 17 19 5 5 3 22 17 1 1 1 1 1 1
417 0 0 0 17 0 0 0 0 0 20 0 0 0 0 0 1 0 0
418 0 23 NA 0 0 0 0 NA NA 0 0 0 0 1 1 0 0 0
419 0 0 2 0 0 0 0 0 12 0 0 0 0 0 1 0 0 0
420 0 0 0 0 17 0 0 0 0 0 15 0 0 0 0 0 1 0
421 0 0 0 0 0 NA 0 0 0 0 0 NA 0 0 0 0 0 1
422 0 0 0 0 NA 0 0 0 0 0 20 0 0 0 0 0 1 0
423 19 19 5 5 19 0 3 11 19 22 NA 0 1 1 1 1 1 0
424 5 5 5 5 0 0 11 3 20 3 0 0 1 1 1 1 0 0
425 20 20 20 20 17 17 17 17 17 17 15 17 1 1 1 1 1 1
426 0 11 11 0 0 0 0 5 5 0 0 0 0 1 1 0 0 0
427 23 17 17 17 0 0 23 2 5 5 0 0 1 1 1 1 0 0
428 0 11 0 0 0 0 0 20 0 0 0 0 0 1 0 0 0 0
429 12 0 12 12 12 0 12 0 6 2 NA 0 1 0 1 1 1 0
430 23 0 0 NA 0 NA 23 0 0 NA 0 NA 1 0 0 1 0 1
431 0 0 0 0 0 NA 0 0 0 0 0 NA 0 0 0 0 0 1
432 0 0 0 0 2 NA 0 0 0 0 4 NA 0 0 0 0 1 1
433 2 NA NA 0 0 NA 23 NA NA 0 0 NA 1 1 1 0 0 1
434 23 NA 10 NA NA NA 23 NA NA NA 20 NA 1 1 1 1 1 1
435 11 0 0 5 17 0 20 0 0 20 4 0 1 0 0 1 1 0
436 1 0 0 0 0 0 9 0 0 0 0 0 1 0 0 0 0 0
437 0 0 NA 0 0 NA 0 0 NA 0 0 NA 0 0 1 0 0 1
438 20 19 0 0 0 0 17 20 0 0 0 0 1 1 0 0 0 0
439 3 0 0 0 0 0 14 0 0 0 0 0 1 0 0 0 0 0
440 10 0 0 0 0 NA 23 0 0 0 0 NA 1 0 0 0 0 1
441 0 0 0 0 0 2 0 0 0 0 0 5 0 0 0 0 0 1
442 0 NA NA 0 NA 0 0 NA NA 0 20 0 0 1 1 0 1 0
443 0 0 0 3 0 0 0 0 0 2 0 0 0 0 0 1 0 0
444 0 0 2 0 0 0 0 0 19 0 0 0 0 0 1 0 0 0
445 0 12 0 0 0 12 0 5 0 0 0 12 0 1 0 0 0 1
446 20 0 0 0 17 0 11 0 0 0 15 0 1 0 0 0 1 0
447 17 0 0 0 0 0 2 0 0 0 0 0 1 0 0 0 0 0
448 11 0 20 20 17 22 20 0 20 17 15 17 1 0 1 1 1 1
449 0 9 9 0 0 0 0 5 9 0 0 0 0 1 1 0 0 0
450 0 0 NA 0 0 0 0 0 NA 0 0 0 0 0 1 0 0 0
451 2 0 0 0 0 0 8 0 0 0 0 0 1 0 0 0 0 0
452 23 NA NA 0 NA 0 23 NA NA 0 20 0 1 1 1 0 1 0
453 2 20 0 23 5 NA 20 17 0 23 5 NA 1 1 0 1 1 1
454 2 5 5 5 5 5 5 23 19 19 NA 5 1 1 1 1 1 1
455 0 0 10 0 0 0 0 0 23 0 0 0 0 0 1 0 0 0
456 10 5 0 5 0 0 5 19 0 19 0 0 1 1 0 1 0 0
457 0 2 0 0 0 0 0 20 0 0 0 0 0 1 0 0 0 0
458 2 2 2 2 2 2 1 1 1 5 4 5 1 1 1 1 1 1
459 0 0 0 2 2 2 0 0 0 17 22 17 0 0 0 1 1 1
460 0 20 17 17 17 17 0 20 20 17 22 17 0 1 1 1 1 1
461 20 0 5 23 20 5 5 0 12 5 4 5 1 0 1 1 1 1
462 0 0 0 0 12 0 0 0 0 0 NA 0 0 0 0 0 1 0
463 2 2 2 2 2 2 20 20 20 20 15 2 1 1 1 1 1 1
464 10 0 0 0 10 23 17 0 0 0 12 NA 1 0 0 0 1 1
465 0 NA NA 0 0 NA 0 NA NA 0 0 NA 1 1 1 0 0 1
466 0 0 0 23 0 0 0 0 0 23 0 0 0 0 0 1 0 0
467 0 0 0 NA 0 NA 0 0 0 NA 0 NA 1 0 0 1 0 1
468 2 12 2 5 12 2 20 2 12 20 22 17 1 1 1 1 1 1
469 0 0 0 20 0 0 0 0 0 20 0 0 0 0 0 1 0 0
470 0 0 0 0 20 0 0 0 0 0 5 0 0 0 0 0 1 0
471 0 17 17 17 17 17 0 5 5 5 NA 17 0 1 1 1 1 1
472 0 0 17 5 22 22 0 0 20 20 4 5 0 0 1 1 1 1
473 16 NA NA 0 0 NA 23 NA NA 0 0 NA 1 1 1 0 0 1
474 23 0 10 10 10 0 23 0 2 10 10 0 1 0 1 1 1 0
475 0 11 0 0 0 0 0 11 0 0 0 0 0 1 0 0 0 0
476 0 0 20 20 23 NA 0 0 2 5 10 NA 0 0 1 1 1 1
477 0 0 11 0 0 0 0 0 11 0 0 0 0 0 1 0 0 0
478 0 0 0 0 0 20 0 0 0 0 0 22 0 0 0 0 0 1
479 3 0 0 0 0 0 2 0 0 0 0 0 1 0 0 0 0 0
480 11 20 20 0 12 20 2 11 2 0 15 12 1 1 1 0 1 1
481 23 NA 0 0 0 0 23 NA 0 0 0 0 1 1 0 0 0 0
482 0 0 0 0 NA 0 0 0 0 0 10 0 0 0 0 0 1 0
483 0 0 0 0 20 NA 0 0 0 0 NA NA 0 0 0 0 1 1
484 0 0 0 0 17 17 0 0 0 0 15 17 0 0 0 0 1 1
485 0 0 0 NA 0 0 0 0 0 NA 0 0 0 0 0 1 0 0
486 0 NA 23 23 NA NA 0 NA 23 23 20 NA 0 1 1 1 1 1
487 0 NA NA 0 0 0 0 NA NA 0 0 0 1 1 1 0 0 0
488 0 NA 0 NA 0 0 0 NA 0 NA 0 0 0 1 0 1 0 0
489 0 0 2 0 0 0 0 0 2 0 0 0 0 0 1 0 0 0
490 23 5 0 23 0 NA 23 12 0 23 0 NA 1 1 0 1 0 1
491 10 12 10 0 23 17 10 17 17 0 10 17 1 1 1 0 1 1
492 0 0 0 20 20 20 0 0 5 12 NA 20 0 0 1 1 1 1
493 22 0 0 0 0 0 23 0 0 0 0 0 1 0 0 0 0 0
494 0 2 2 2 2 2 0 5 5 20 15 12 0 1 1 1 1 1
495 0 NA NA 0 0 NA 0 NA NA 0 0 NA 1 1 1 0 0 1
496 23 NA NA 0 0 NA 23 NA NA 0 0 NA 1 1 1 0 0 1
497 20 20 20 20 20 20 2 11 11 3 10 20 1 1 1 1 1 1
498 6 6 5 0 23 12 3 19 22 0 10 12 1 1 1 0 1 1
499 0 0 0 0 0 NA 0 0 0 0 0 NA 0 0 0 0 0 1
500 0 2 0 17 0 NA 0 19 0 20 0 12 0 1 0 1 0 1
501 11 5 5 5 12 NA 5 11 12 12 4 NA 1 1 1 1 1 1
502 11 22 0 0 0 0 23 12 0 0 0 0 1 1 0 0 0 0
503 0 0 NA 0 0 0 0 0 NA 0 0 0 1 0 1 0 0 0
504 23 0 0 0 0 NA 23 0 0 0 0 NA 1 0 0 0 0 1
505 20 20 20 0 12 12 14 14 1 0 15 12 1 1 1 0 1 1
506 0 20 11 17 20 NA 0 17 20 20 22 NA 0 1 1 1 1 1
507 0 0 0 0 12 0 0 0 0 0 NA 0 0 0 0 0 1 0
508 22 0 0 0 0 NA 6 0 0 0 0 NA 1 0 0 0 0 1
509 0 5 23 23 0 0 0 2 3 23 0 0 0 1 1 1 0 0
510 2 2 2 2 2 2 19 19 17 17 22 2 1 1 1 1 1 1
511 23 NA 0 0 0 0 23 NA 0 0 0 0 1 1 0 0 0 0
512 3 0 0 0 0 0 2 0 0 0 0 0 1 0 0 0 0 0
513 0 0 5 0 0 0 0 0 20 0 0 0 0 0 1 0 0 0
514 0 0 0 0 0 NA 0 0 0 0 0 NA 0 0 0 0 0 1
515 20 20 20 20 0 0 2 17 17 17 0 0 1 1 1 1 0 0
516 23 NA 0 0 10 0 23 NA 0 0 2 0 1 1 0 0 1 0
517 17 17 17 17 0 17 20 5 5 23 0 17 1 1 1 1 0 1
518 0 0 0 0 0 20 0 0 0 0 0 20 0 0 0 0 0 1
519 0 NA NA 0 NA NA 0 NA NA 0 20 NA 0 1 1 0 1 1
520 20 20 23 5 2 17 20 19 23 19 5 17 1 1 1 1 1 1
521 0 0 0 5 0 0 0 0 0 23 0 0 0 0 0 1 0 0
522 0 12 0 0 0 12 0 5 0 0 0 12 0 1 0 0 0 1
523 0 NA 0 0 0 0 0 NA 0 0 0 0 0 1 0 0 0 0
524 2 0 0 0 0 0 17 0 0 0 0 0 1 0 0 0 0 0
525 20 0 0 0 17 17 17 0 0 0 15 17 1 0 0 0 1 1
526 2 2 0 0 2 2 20 20 0 0 15 2 1 1 0 0 1 1
527 23 0 0 0 0 0 23 0 0 0 0 0 1 0 0 1 0 0
528 3 0 0 3 0 0 20 0 0 22 0 0 1 0 0 1 0 0
529 0 12 23 10 10 0 0 23 9 23 10 0 0 1 1 1 1 0
530 0 2 0 0 0 0 0 20 0 0 0 0 0 1 0 0 0 0
531 0 0 13 2 2 NA 0 0 5 2 NA NA 0 0 1 1 1 1
532 10 12 10 0 0 0 17 17 17 0 0 0 1 1 1 0 0 0
533 0 0 13 0 0 0 0 0 15 0 0 0 0 0 1 0 0 0
534 0 0 0 0 0 0 0 0 0 0 0 0 1 0 0 0 0 0
535 0 0 0 0 0 NA 0 0 0 0 0 NA 0 0 0 0 0 1
536 0 20 20 20 20 20 0 17 17 3 22 20 0 1 1 1 1 1
537 0 0 0 5 0 0 0 0 0 20 0 0 0 0 0 1 0 0
538 23 NA NA 0 0 0 23 NA NA 0 0 0 1 1 1 0 0 0
539 20 20 20 20 20 20 23 23 23 23 10 20 1 1 1 1 1 1
540 0 0 0 0 2 2 0 0 0 0 10 2 0 0 0 0 1 1
541 0 0 6 0 0 0 0 0 5 0 0 0 0 0 1 0 0 0
542 0 11 11 20 0 0 0 20 20 20 0 0 0 1 1 1 0 0
543 2 0 0 0 0 0 11 0 0 0 0 0 1 0 0 0 0 0
544 17 0 17 0 0 0 17 0 17 0 0 0 1 0 1 0 0 0
545 0 NA 6 0 22 0 0 NA NA 0 NA 0 0 1 1 0 1 0
546 0 0 0 0 0 17 0 0 0 0 0 17 0 0 0 0 0 1
547 5 20 20 5 5 5 5 5 5 20 15 5 1 1 1 1 1 1
548 23 0 0 0 0 0 23 0 0 0 0 0 1 0 0 0 0 0
549 0 12 NA 0 0 0 0 23 NA 0 0 0 0 1 1 0 0 0
550 23 0 23 0 0 0 23 0 23 0 0 0 1 0 1 0 0 0
551 0 0 0 0 17 17 0 0 0 0 4 17 0 0 0 0 1 1
552 23 5 5 5 5 5 6 6 6 3 10 5 1 1 1 1 1 1
553 0 0 NA 0 0 0 0 0 NA 0 0 0 0 0 1 0 0 0
554 0 20 0 20 0 0 0 20 0 5 0 0 0 1 0 1 0 0
555 10 0 0 0 0 0 20 0 0 0 0 0 1 0 0 0 0 0
556 20 20 0 20 0 0 17 17 0 17 0 0 1 1 0 1 0 0
557 0 0 0 0 0 20 0 0 0 0 0 20 0 0 0 0 0 1
558 0 NA 0 NA 0 NA 0 NA 0 NA 0 0 0 1 0 1 0 1
559 0 20 20 20 20 20 0 11 5 17 22 20 0 1 1 1 1 1
560 20 17 17 17 0 0 17 17 20 20 0 0 1 1 1 1 0 0
561 0 5 0 0 0 0 0 11 0 0 0 0 0 1 0 0 0 0
562 23 0 23 3 19 0 23 0 23 20 NA 0 1 0 1 1 1 0
563 23 NA NA 0 0 NA 23 NA NA 0 0 NA 1 1 1 0 0 1
564 3 12 10 0 10 NA 10 20 5 0 NA NA 1 1 1 0 1 1
565 19 19 NA NA 0 0 17 22 NA NA 0 0 1 1 1 1 0 0
566 0 0 0 0 17 0 0 0 0 0 4 0 0 0 0 0 1 0
567 20 20 20 20 20 20 3 3 3 3 22 20 1 1 1 1 1 1
568 0 0 0 NA 0 0 0 0 0 NA 0 0 0 0 0 1 0 0
569 20 20 20 0 20 20 5 11 11 0 22 20 1 1 1 0 1 1
570 0 0 0 0 17 17 0 0 0 0 5 17 0 0 0 0 1 1
571 0 0 0 0 2 0 0 0 0 0 NA 0 0 0 0 0 1 0
572 10 NA NA NA NA NA 21 NA NA NA 20 NA 1 1 1 1 1 1
573 2 2 5 5 0 5 12 5 2 2 0 5 1 1 1 1 0 1
574 0 0 0 NA NA NA 0 0 0 NA 20 NA 1 0 0 1 1 1
575 20 17 0 17 17 17 17 20 0 20 15 17 1 1 0 1 1 1
576 5 5 0 5 5 5 19 20 0 22 12 5 1 1 0 1 1 1
577 20 0 0 0 0 0 11 0 0 0 0 0 1 0 0 0 0 0
578 17 0 0 0 0 0 10 0 0 0 0 0 1 0 0 0 0 0
579 0 0 0 NA 0 0 0 0 0 NA 0 0 0 0 0 1 0 0
580 0 0 0 0 0 17 0 0 0 0 0 17 0 0 0 0 0 1
581 20 0 NA 0 0 0 2 0 NA 0 0 0 1 0 1 0 0 0
582 0 0 0 5 0 0 0 0 0 23 0 0 0 0 0 1 0 0
583 2 0 2 0 0 5 5 0 5 0 0 5 1 0 1 0 0 1
584 0 0 0 17 0 0 0 0 0 19 0 0 0 0 0 1 0 0
585 0 0 0 5 0 0 0 0 0 12 0 0 0 0 0 1 0 0
586 23 0 0 0 NA 0 23 0 0 0 20 0 1 0 0 0 1 0
587 0 0 0 0 10 NA 0 0 0 0 20 NA 0 0 0 0 1 1
588 9 NA NA NA NA NA 10 NA NA NA 20 NA 1 1 1 1 1 1
589 23 0 0 NA 0 0 23 0 0 NA 0 0 1 0 0 1 0 0
590 2 0 0 2 0 0 17 0 0 20 0 0 1 0 0 1 0 0
591 0 5 5 5 5 NA 0 19 23 23 10 NA 0 1 1 1 1 1
592 23 0 NA 0 0 0 23 0 NA 0 0 0 1 0 1 0 0 0
593 0 0 0 0 0 0 0 0 0 0 0 0 0 1 0 0 0 0
594 0 NA NA 0 0 0 0 NA NA 0 0 0 0 1 1 0 0 0
595 23 0 0 0 0 0 23 0 0 0 0 0 1 0 0 0 0 0
596 0 0 0 0 0 NA 0 0 0 0 0 NA 0 0 0 0 0 1
597 19 NA 0 0 0 0 22 NA 0 0 0 0 1 1 0 0 0 0
598 0 0 4 10 17 17 0 0 3 17 19 17 0 0 1 1 1 1
599 23 0 0 0 0 0 23 0 0 0 0 0 1 0 0 0 0 0
600 2 2 0 0 0 0 20 20 0 0 0 0 1 1 0 0 0 0
601 0 0 0 10 0 0 0 0 0 10 0 0 0 0 0 1 0 0
602 0 0 23 0 12 0 0 0 23 0 15 0 0 0 1 0 1 0
603 0 20 20 5 0 0 0 5 5 20 0 0 0 1 1 1 0 0
604 0 5 0 0 0 0 0 12 0 0 0 0 0 1 0 0 0 0
605 0 NA 4 4 NA NA 0 NA 4 NA 20 NA 0 1 1 1 1 1
606 23 NA NA NA 0 NA 23 NA NA NA 0 NA 1 1 1 1 0 1
607 2 12 5 23 23 12 20 5 20 23 10 12 1 1 1 1 1 1
608 0 0 0 0 2 NA 0 0 0 0 4 NA 0 0 0 0 1 1
609 0 0 0 0 0 17 0 0 0 0 0 17 0 0 0 0 0 1
610 0 0 5 0 0 0 0 0 20 0 0 0 0 0 1 0 0 0
611 20 0 20 0 0 0 14 0 7 0 0 0 1 0 1 0 0 0
612 23 NA NA 0 NA 0 23 NA NA 0 20 0 1 1 1 0 1 0
613 2 0 0 0 0 0 22 0 0 0 0 0 1 0 0 0 0 0
614 23 0 10 10 NA NA 23 0 NA 12 20 0 1 0 1 1 1 1
615 2 5 0 0 5 0 5 20 0 0 22 0 1 1 0 0 1 0
616 0 0 17 17 22 22 0 0 7 12 22 17 0 0 1 1 1 1
617 0 0 2 0 0 0 0 0 20 0 0 0 0 0 1 0 0 0
618 0 0 0 NA 0 0 0 0 0 NA 0 0 0 0 0 1 0 0
619 0 NA 0 0 0 0 0 NA 0 0 0 0 0 1 0 0 0 0
620 0 0 0 0 12 NA 0 0 0 0 4 NA 0 0 0 0 1 1
621 0 17 0 0 0 0 0 22 0 0 0 0 0 1 0 0 0 0
622 20 0 20 20 20 0 20 0 17 17 22 0 1 0 1 1 1 0
623 0 0 20 0 0 20 0 0 17 0 0 17 0 0 1 0 0 1
624 23 0 0 NA 0 0 23 0 0 NA 0 0 1 0 0 1 0 0
625 0 23 23 23 23 12 0 23 22 23 10 12 0 1 1 1 1 1
626 20 20 20 20 20 20 11 11 23 3 NA 20 1 1 1 1 1 1
627 0 20 20 0 0 0 0 5 2 0 0 0 0 1 1 0 0 0
628 0 2 6 2 2 2 0 6 2 23 9 2 0 1 1 1 1 1
629 0 23 0 0 0 0 0 23 0 0 0 0 0 1 0 0 0 0
630 0 NA 0 0 0 0 0 NA 0 0 0 0 1 1 0 0 0 0
631 9 NA NA NA 0 NA 23 NA NA NA 0 NA 1 1 1 1 0 1
632 0 0 17 0 0 0 0 0 20 0 0 0 0 0 1 0 0 0
633 23 0 0 0 0 0 23 0 0 0 0 0 1 0 0 0 0 0
634 21 NA NA NA NA NA 21 NA NA NA 20 NA 1 1 1 1 1 1
635 23 0 0 NA NA NA 23 0 0 NA 20 NA 1 0 0 1 1 1
636 17 17 17 17 17 17 20 20 20 20 5 17 1 1 1 1 1 1
637 0 0 0 19 0 0 0 0 0 4 0 0 0 0 0 1 0 0
638 20 0 0 0 0 0 5 0 0 0 0 0 1 0 0 0 0 0
639 0 0 0 0 17 0 0 0 0 0 20 0 0 0 0 0 1 0
640 0 17 0 17 17 0 0 20 0 20 15 0 0 1 0 1 1 0
641 23 0 0 0 0 0 23 0 0 0 0 0 1 0 0 0 0 0
642 9 NA 0 0 NA NA 23 NA 0 0 20 NA 1 1 0 0 1 1
643 23 NA 0 0 NA NA 23 NA 0 0 20 NA 1 1 1 0 1 1
644 0 23 0 0 0 0 0 23 0 0 0 0 0 1 0 0 0 0
645 19 19 19 19 19 0 11 11 20 17 15 0 1 1 1 1 1 0
646 0 0 0 0 0 19 0 0 0 0 0 20 0 0 0 0 0 1
647 2 0 0 0 0 0 23 0 0 0 0 0 1 0 0 0 0 0
648 0 NA 0 23 0 0 0 NA 0 NA 0 0 0 1 0 1 0 0
649 0 0 10 0 0 0 0 0 19 0 0 0 0 0 1 0 0 0
650 0 0 0 0 2 0 0 0 0 0 NA 0 0 0 0 0 1 0
651 6 12 6 0 0 0 23 NA 10 0 0 0 1 1 1 0 0 0
652 0 5 0 0 0 0 0 20 0 0 0 0 0 1 0 0 0 0
653 2 0 0 0 0 0 19 0 0 0 0 0 1 0 0 0 0 0
654 2 0 0 0 0 0 9 0 0 0 0 0 1 0 0 0 0 0
655 20 0 0 0 0 0 17 0 0 0 0 0 1 0 0 0 0 0
656 0 0 0 5 0 20 0 0 0 20 0 20 0 0 0 1 0 1
657 0 0 20 0 0 0 0 0 11 0 0 0 0 0 1 0 0 0
658 23 2 2 0 2 0 23 23 23 0 4 0 1 1 1 0 1 0
659 0 0 0 0 0 NA 0 0 0 0 0 NA 0 0 0 0 0 1
660 20 2 5 5 0 0 2 5 2 12 0 0 1 1 1 1 0 0
661 23 NA 0 NA NA NA 23 NA 0 NA 20 NA 1 1 0 1 1 1
662 0 0 0 23 0 0 0 0 0 23 0 0 0 0 0 1 0 0
663 0 0 NA 0 NA 0 0 0 NA 0 20 0 1 0 1 0 1 0
664 2 2 2 2 2 2 19 5 5 5 4 2 1 1 1 1 1 1
665 23 0 NA NA NA NA 23 0 NA NA 20 NA 1 0 1 1 1 1
666 0 0 0 NA 5 0 0 0 0 NA 10 0 0 0 0 1 1 0
667 0 11 0 0 0 0 0 3 0 0 0 0 0 1 0 0 0 0
668 0 0 NA 0 0 0 0 0 5 0 0 0 0 0 1 0 0 0
669 0 5 0 0 0 0 0 20 0 0 0 0 0 1 0 0 0 0
670 23 0 0 0 0 0 23 0 0 0 0 0 1 0 0 0 0 0
671 0 20 0 0 0 0 0 5 0 0 0 0 0 1 0 0 0 0
672 19 0 22 0 0 0 10 0 19 0 0 0 1 1 1 0 0 0
673 0 0 0 0 22 0 0 0 0 0 NA 0 0 0 0 0 1 0
674 23 0 0 0 0 0 23 0 0 0 0 0 1 0 0 0 0 0
675 0 0 0 17 0 0 0 0 0 2 0 0 0 0 0 1 0 0
676 0 0 23 20 0 20 0 0 23 23 0 20 0 0 1 1 0 1
677 0 0 0 5 17 17 0 0 0 5 4 17 0 0 0 1 1 1
678 10 NA 0 0 0 0 0 NA 0 0 0 0 1 1 0 0 0 0
679 0 17 0 0 0 0 0 20 0 0 0 0 0 1 0 0 0 0
680 0 0 NA NA NA NA 0 0 NA NA 20 NA 0 0 1 1 1 1
681 23 22 0 19 5 0 23 11 0 23 1 0 1 1 0 1 1 0
682 12 0 0 0 0 0 3 0 0 0 0 0 1 0 0 0 0 0
683 0 22 22 22 22 22 0 20 20 20 15 20 0 1 1 1 1 1
684 0 0 0 0 NA 0 0 0 0 0 20 0 0 0 0 0 1 0
685 0 0 0 5 0 0 0 0 0 20 0 0 0 0 0 1 0 0
686 0 0 0 0 17 17 0 0 0 0 12 17 0 0 0 0 1 1
687 5 5 5 5 5 5 20 12 12 12 NA 5 1 1 1 1 1 1
688 0 NA 0 0 0 0 0 NA 0 0 0 0 0 1 0 0 0 0
689 23 0 0 23 0 0 23 0 0 23 0 0 1 0 0 1 0 0
690 0 0 2 0 0 0 0 0 5 0 0 0 0 0 1 0 0 0
691 0 0 0 2 0 0 0 0 0 3 0 0 0 0 0 1 0 0
692 0 0 0 0 NA 0 0 0 0 0 10 0 0 0 0 0 1 0
693 10 12 0 0 10 0 22 NA 0 0 19 0 1 1 0 0 1 0
694 11 0 0 0 0 0 17 0 0 0 0 0 1 0 0 0 0 0
695 10 0 0 10 0 NA 22 0 0 22 0 NA 1 0 0 1 0 1
696 19 0 NA NA 0 NA 22 0 NA NA 0 NA 1 0 1 1 0 1
697 23 0 0 0 0 2 20 0 0 0 0 2 1 0 0 0 0 1
698 0 0 0 5 0 0 0 0 0 22 0 0 0 0 0 1 0 0
699 0 12 0 10 0 0 0 17 0 17 0 0 0 1 0 1 0 0
700 2 2 0 2 2 2 14 19 0 12 NA 2 1 1 0 1 1 1
701 23 0 0 0 0 0 23 0 0 0 0 0 1 0 0 0 0 0
702 0 0 2 2 0 0 0 0 12 23 0 0 0 0 1 1 0 0
703 0 0 0 0 NA 0 0 0 0 0 19 0 0 0 0 0 1 0
704 5 5 5 20 22 NA 19 17 11 19 15 NA 1 1 1 1 1 1
705 0 0 0 23 23 0 0 0 0 23 10 0 0 0 0 1 1 0
706 23 0 0 0 0 0 23 0 0 0 0 0 1 0 0 0 0 0
707 0 0 17 0 17 0 0 0 20 0 15 0 0 0 1 0 1 0
708 0 0 0 0 NA NA 0 0 0 0 20 NA 0 0 0 0 1 1
709 5 5 0 5 0 NA 19 22 0 22 0 NA 1 1 0 1 0 1
710 0 0 0 0 2 0 0 0 0 0 5 0 0 0 0 0 1 0
711 12 23 12 12 12 NA 11 23 5 5 10 NA 1 1 1 1 1 1
712 0 0 0 17 0 17 0 0 0 22 0 17 0 0 0 1 0 1
713 0 NA 0 0 NA 0 0 NA 0 0 20 0 0 1 0 0 1 0
714 10 12 0 10 0 0 23 19 0 23 0 0 1 1 0 1 0 0
715 5 23 5 23 12 12 14 5 2 2 NA 5 1 1 1 1 1 1
716 23 0 0 0 0 0 23 0 0 0 0 0 1 0 0 0 0 0
717 0 0 0 0 17 17 0 0 0 0 10 23 0 0 0 0 1 1
718 20 0 0 0 20 0 17 0 0 0 NA 0 1 0 0 0 1 0
719 0 0 0 NA 0 0 0 0 0 NA 0 0 0 0 0 1 0 0
720 0 0 0 0 2 0 0 0 0 0 5 0 0 0 0 0 1 0
721 0 0 0 17 0 0 0 0 0 20 0 0 0 0 0 1 0 0
722 20 0 0 0 0 0 17 0 0 0 0 0 1 0 0 0 0 0
723 23 23 5 23 0 0 23 23 23 23 0 0 1 1 1 1 0 0
724 0 0 0 10 0 0 0 0 0 NA 0 0 0 0 0 1 0 0
725 20 20 23 20 20 20 2 11 23 2 NA 20 1 1 1 1 1 1
726 0 0 0 0 0 NA 0 0 0 0 0 NA 0 0 0 0 0 1
727 0 12 0 0 0 0 0 12 0 0 0 0 1 1 0 0 0 0
728 0 0 0 0 23 19 0 0 0 0 10 5 0 0 0 0 1 1
729 10 NA 10 0 0 0 23 NA NA 0 0 0 1 1 1 0 0 0
730 23 NA 0 NA 0 NA 23 NA 0 NA 0 NA 1 1 0 1 0 1
731 0 0 0 5 0 0 0 0 0 2 0 0 0 0 0 1 0 0
732 0 0 5 0 0 0 0 0 12 0 0 0 0 0 1 0 0 0
733 10 0 0 NA 0 0 23 0 0 10 0 0 1 0 0 1 0 0
734 0 20 17 17 20 17 0 17 20 7 22 17 0 1 1 1 1 1
735 0 NA NA 0 0 0 0 NA NA 0 0 0 0 1 1 0 0 0
736 20 20 17 17 0 NA 17 17 20 20 0 0 1 1 1 1 0 1
737 17 0 0 0 0 0 22 0 0 0 0 0 1 0 0 0 0 0
738 0 5 5 5 0 0 0 20 2 2 0 0 0 1 1 1 0 0
739 0 5 0 0 0 0 0 20 0 0 0 0 0 1 0 0 0 0
740 0 0 5 0 0 0 0 0 6 0 0 0 0 0 1 0 0 0
741 23 NA 0 0 NA 0 23 NA 0 0 20 0 1 1 0 0 1 0
742 0 0 0 0 2 0 0 0 0 0 4 0 0 0 0 0 1 0
743 23 12 10 17 0 0 23 14 17 10 0 0 1 1 1 1 0 0
744 0 0 0 0 0 20 0 0 0 0 0 20 0 0 0 0 0 1
745 23 0 0 0 0 NA 23 0 0 0 0 NA 1 0 0 0 0 1
746 0 0 0 0 0 12 0 0 0 0 0 12 0 0 0 0 0 1
747 17 17 17 0 0 0 20 20 20 0 0 0 1 1 1 0 0 0
748 21 NA 0 0 0 NA 23 NA 0 0 0 NA 1 1 0 0 0 1
749 6 0 0 0 0 0 3 0 0 0 0 0 1 0 0 0 0 0
750 0 0 0 0 0 0 0 0 0 0 0 0 0 1 0 0 0 0
751 0 0 0 0 5 5 0 0 0 0 NA 5 0 0 0 0 1 1
752 0 20 0 0 0 0 0 20 0 0 0 0 0 1 0 0 0 0
753 20 0 0 20 0 0 11 0 0 17 0 0 1 0 0 1 0 0
754 10 NA 0 0 0 NA 2 NA 0 0 0 NA 1 1 0 0 0 1
755 0 17 0 0 0 0 0 14 0 0 0 0 0 1 0 0 0 0
756 0 0 0 10 0 0 0 0 0 23 0 0 0 0 0 1 0 0
757 10 23 22 0 22 5 5 22 5 0 19 5 1 1 1 0 1 1
758 0 20 5 23 4 5 0 3 11 23 9 5 0 1 1 1 1 1
759 0 NA 0 NA 0 0 0 NA 0 NA 0 0 0 1 0 1 0 0
760 0 0 2 0 0 2 0 0 5 0 0 5 0 0 1 0 0 1
761 0 0 0 0 0 5 0 0 0 0 0 5 0 0 0 0 0 1
762 0 0 0 0 0 0 0 0 0 0 0 0 1 0 0 0 0 0
763 0 0 NA 0 0 0 0 0 NA 0 0 0 0 0 1 0 0 0
764 0 0 0 0 0 NA 0 0 0 0 0 NA 0 0 0 0 0 1
765 10 0 0 0 0 0 10 0 0 0 0 0 1 0 0 0 0 0
766 23 0 0 NA 0 0 23 0 0 NA 0 0 1 0 0 1 0 0
767 0 20 0 3 23 NA 0 5 0 5 10 NA 0 1 0 1 1 1
768 10 NA NA 0 10 0 10 NA NA 0 5 0 1 1 1 0 1 0
769 0 5 5 5 5 5 0 14 11 2 NA 5 0 1 1 1 1 1
770 5 0 5 5 0 0 20 0 5 19 0 0 1 0 1 1 0 0
771 0 0 0 0 10 10 0 0 0 0 12 22 0 0 0 0 1 1
772 0 20 17 0 0 0 0 17 20 0 0 0 0 1 1 0 0 0
773 0 0 0 0 23 0 0 0 0 0 10 0 0 0 0 0 1 0
774 23 NA 0 NA NA 0 23 NA 0 NA 20 0 1 1 0 1 1 0
775 2 0 2 0 2 NA 5 0 5 0 NA NA 1 0 1 0 1 1
776 14 0 0 5 5 0 5 0 0 2 22 0 1 0 0 1 1 0
777 11 12 0 0 0 0 23 12 0 0 0 0 1 1 0 0 0 0
778 0 NA 0 0 0 0 0 NA 0 0 0 0 0 1 0 0 0 0
779 0 0 0 10 0 0 0 0 0 22 0 0 0 0 0 1 0 0
780 0 0 0 0 0 NA 0 0 0 0 0 NA 0 0 0 0 0 1
781 10 0 NA 0 NA 0 21 0 NA 0 20 0 1 0 1 0 1 0
782 0 12 0 1 0 0 0 6 0 15 0 0 0 1 0 1 0 0
783 0 0 0 0 17 0 0 0 0 0 19 0 0 0 0 0 1 0
784 0 0 20 0 0 0 0 0 5 0 0 0 0 0 1 0 0 0
785 17 17 17 17 17 17 10 12 10 22 5 17 1 1 1 1 1 1
786 0 1 1 1 0 0 0 22 7 7 0 0 0 1 1 1 0 0
787 23 0 0 0 0 0 23 0 0 0 0 0 1 0 0 0 0 0
788 23 0 12 0 0 NA 23 0 NA 0 0 NA 1 0 1 0 0 1
789 0 0 0 0 NA NA 0 0 0 0 20 NA 0 0 0 0 1 1
790 5 5 0 5 5 5 20 20 0 20 15 5 1 1 0 1 1 1
791 0 1 0 0 0 0 0 12 0 0 0 0 0 1 0 0 0 0
792 0 0 0 12 0 19 0 0 0 NA 0 2 0 0 0 1 0 1
793 2 23 18 0 19 0 20 23 23 0 4 0 1 1 1 0 1 0
794 0 0 0 NA 0 0 0 0 0 NA 0 0 0 0 0 1 0 0
795 0 0 0 0 0 0 0 0 0 0 0 0 1 0 0 0 0 0
796 0 2 2 NA 0 0 0 16 6 NA 0 0 0 1 1 1 0 0
797 23 0 0 0 0 0 23 0 0 0 0 0 1 0 0 0 0 0
798 23 0 0 0 0 NA 23 0 0 0 0 NA 1 0 0 0 0 1
799 0 0 0 23 0 0 0 0 0 19 0 0 0 0 0 1 0 0
800 0 5 5 5 0 0 0 20 20 20 0 0 0 1 1 1 0 0
801 12 0 12 5 5 NA 19 0 5 12 15 0 1 0 1 1 1 1
802 0 0 17 17 0 0 0 0 19 20 0 0 0 0 1 1 0 0
803 9 23 NA NA NA NA 9 23 NA NA 20 NA 1 1 1 1 1 1
804 23 0 0 0 0 0 23 0 0 0 0 0 1 0 0 0 0 0
805 23 0 0 0 0 0 5 0 0 0 0 0 1 0 0 0 0 0
806 2 0 NA NA NA NA 2 0 NA NA 20 NA 1 0 1 1 1 1
807 2 17 0 0 0 NA 14 2 0 0 0 NA 1 1 0 0 0 1
808 0 0 0 5 5 0 0 0 0 1 NA 0 0 0 0 1 1 0
809 0 22 3 2 NA 17 0 2 9 NA 20 12 0 1 1 1 1 1
810 20 20 0 0 0 0 5 7 0 0 0 0 1 1 0 0 0 0
811 9 0 0 0 0 0 23 0 0 0 0 0 1 0 0 0 0 0
812 0 16 0 0 0 0 0 19 0 0 0 0 0 1 0 0 0 0
813 23 5 5 5 5 NA 23 20 20 20 12 NA 1 1 1 1 1 1
814 20 2 13 5 2 0 2 20 20 20 15 0 1 1 1 1 1 0
815 11 0 5 0 5 0 11 0 23 0 NA 0 1 0 1 0 1 0
816 2 0 0 2 0 2 5 0 0 5 0 2 1 0 0 1 0 1
817 0 0 0 0 NA 0 0 0 0 0 20 0 0 0 0 0 1 0
818 0 21 0 0 0 NA 0 12 0 0 0 NA 0 1 0 0 0 1
819 23 0 NA 0 0 0 23 0 NA 0 0 0 1 0 1 0 0 0
820 23 0 0 0 0 0 23 0 0 0 0 0 1 0 0 0 0 0
821 0 20 0 0 0 0 0 5 0 0 0 0 0 1 0 0 0 0
822 0 0 17 0 0 17 0 0 20 0 0 17 0 0 1 0 0 1
823 0 0 0 0 0 NA 0 0 0 0 0 NA 0 0 0 0 0 1
824 0 NA 0 0 0 0 0 NA 0 0 0 0 0 1 0 0 0 0
825 0 0 NA 0 0 NA 0 0 NA 0 0 NA 0 0 1 0 0 1
826 0 0 0 0 22 0 0 0 0 0 10 0 0 0 0 0 1 0
827 0 20 0 20 12 20 0 1 0 5 15 5 0 1 0 1 1 1
828 23 23 0 0 0 0 23 23 23 0 0 0 1 1 1 0 0 0
829 2 0 0 0 0 0 11 0 0 0 0 0 1 0 0 0 0 0
830 0 0 0 NA 0 0 0 0 0 NA 0 0 0 0 0 1 0 0
831 10 12 0 0 0 0 23 6 0 0 0 0 1 1 0 0 0 0
832 23 NA 0 NA NA NA 23 NA 0 NA 20 NA 1 1 0 1 1 1
833 0 0 0 NA NA 0 0 0 0 NA NA 0 0 0 0 1 1 0
834 0 0 NA 0 0 0 0 0 NA 0 0 0 0 0 1 0 0 0
835 17 17 0 0 0 0 20 20 0 0 0 0 1 1 0 0 0 0
836 23 0 NA 0 0 0 23 0 NA 0 0 0 1 0 1 0 0 0
837 23 0 0 0 0 0 23 0 0 0 0 0 1 0 0 0 0 0
838 0 0 0 0 NA 0 0 0 0 0 20 0 0 0 0 0 1 0
839 0 5 5 5 20 20 0 11 20 17 22 20 0 1 1 1 1 1
840 5 23 5 23 23 NA 12 23 23 23 10 NA 1 1 1 1 1 1
841 0 0 NA NA NA 0 0 0 NA NA 20 0 0 0 1 1 1 0
842 0 19 0 0 0 0 0 2 0 0 0 0 0 1 0 0 0 0
843 0 0 0 0 NA NA 0 0 0 0 20 NA 0 0 0 0 1 1
844 23 0 0 0 NA 0 23 0 0 0 20 0 1 0 0 0 1 0
845 17 17 17 5 19 17 11 11 11 19 22 5 1 1 1 1 1 1
846 23 0 0 0 0 0 23 0 0 0 0 0 1 0 0 0 0 0
847 23 0 0 0 0 0 23 0 0 0 0 0 1 0 0 0 0 0
848 0 2 0 0 0 2 0 12 0 0 0 2 0 1 0 0 0 1
849 0 2 0 2 0 0 0 23 0 23 0 0 0 1 0 1 0 0
850 6 6 0 0 0 0 11 11 0 0 0 0 1 1 0 0 0 0
851 0 0 0 5 0 0 0 0 0 12 0 0 0 0 0 1 0 0
852 0 0 0 17 0 0 0 0 0 23 0 0 0 0 0 1 0 0
853 0 0 0 0 0 0 0 0 0 0 0 0 0 0 0 0 1 0
854 17 0 0 0 17 0 22 0 0 0 0 0 1 0 0 0 1 0
855 20 0 0 0 0 0 5 0 0 0 0 0 1 0 0 0 0 0
856 0 0 0 17 0 0 0 0 0 10 0 0 0 0 0 1 0 0
857 0 20 0 20 5 5 0 5 0 5 15 20 0 1 0 1 1 1
858 0 0 0 20 0 0 0 0 0 NA 0 0 0 0 0 1 0 0
859 23 0 0 0 0 0 23 0 0 0 0 0 1 0 0 0 0 0
860 0 5 0 0 0 0 0 20 0 0 0 0 0 1 0 0 0 0
861 23 12 NA 0 0 0 23 12 NA 0 0 0 1 1 1 0 0 0
862 0 0 0 0 0 5 0 0 0 0 0 5 0 0 0 0 0 1
863 0 NA 0 10 NA NA 0 NA 0 23 20 NA 0 1 0 1 1 1
864 2 0 0 0 0 0 23 0 0 0 0 0 1 0 0 0 0 0
865 23 NA NA 0 0 NA 23 NA NA 0 0 NA 1 1 1 0 0 1
866 20 20 20 20 0 20 20 12 11 12 0 20 1 1 1 1 0 1
867 11 23 0 0 0 0 20 23 0 0 0 0 1 1 0 0 0 0
868 23 0 0 NA NA NA 23 0 0 NA 20 NA 1 0 0 1 1 1
869 0 NA 0 0 0 0 0 NA 0 0 0 0 0 1 0 0 0 0
870 0 0 0 0 0 NA 0 0 0 0 0 NA 0 0 0 0 0 1
871 0 0 NA 0 0 0 0 0 NA 0 0 0 0 0 1 0 0 0
872 10 NA NA 0 0 0 23 NA NA 0 0 0 1 1 1 0 0 0
873 0 0 0 0 12 NA 0 0 0 0 NA NA 0 0 0 0 1 1
874 0 5 5 5 2 20 0 20 20 5 4 20 0 1 1 1 1 1
875 2 12 12 12 12 12 2 2 2 2 NA 12 1 1 1 1 1 1
876 20 20 5 0 5 0 2 5 20 0 10 0 1 1 1 0 1 0
877 2 0 0 0 2 NA 19 0 0 0 5 NA 1 0 0 0 1 1
878 10 12 2 0 0 0 23 2 23 0 0 0 1 1 1 0 0 0
879 0 5 5 0 0 0 0 11 11 0 0 0 0 1 1 0 0 0
880 20 20 6 3 12 20 3 0 12 12 9 20 1 1 1 1 1 1
881 0 0 5 0 0 NA 0 0 11 0 0 NA 0 0 1 0 0 1
882 20 20 20 23 20 20 11 12 5 23 10 20 1 1 1 1 1 1
883 9 NA NA NA NA NA 21 NA NA NA 20 NA 1 1 1 1 1 1
884 10 0 0 0 NA 0 23 0 0 0 20 0 1 0 0 0 1 0
885 0 0 0 0 0 17 0 0 0 0 0 17 0 0 0 0 0 1
886 23 NA NA NA 0 0 23 NA NA NA 0 0 1 1 1 1 0 0
887 2 0 0 0 0 0 9 0 0 0 0 0 1 0 0 0 0 0
888 0 0 0 23 0 0 0 0 0 22 0 0 0 0 0 1 0 0
889 23 NA NA NA 0 NA 23 NA NA NA 0 NA 1 1 1 1 0 1
890 0 19 19 0 0 0 0 2 11 0 0 0 0 1 1 0 0 0
891 0 5 5 5 5 NA 0 20 5 2 NA NA 0 1 1 1 1 1
892 17 17 17 17 17 0 20 19 19 23 22 0 1 1 1 1 1 0
893 17 0 0 0 0 0 10 0 0 0 0 0 1 0 0 0 0 0
894 0 0 0 0 0 NA 0 0 0 0 0 5 0 0 0 0 0 1
895 0 0 0 0 5 0 0 0 0 0 NA 0 0 0 0 0 1 0
896 0 0 0 0 20 0 0 0 0 0 NA 0 0 0 0 0 1 0
897 0 5 0 0 0 0 0 1 0 0 0 0 0 1 0 0 0 0
898 0 0 2 0 0 0 0 0 5 0 0 0 0 0 1 0 0 0
899 0 0 0 0 0 NA 0 0 0 0 0 NA 0 0 0 0 0 1
900 17 17 17 17 17 17 22 22 22 22 12 17 1 1 1 1 1 1
901 0 0 22 0 0 0 0 0 20 0 0 0 0 0 1 0 0 0
902 0 5 5 0 0 5 0 20 20 0 0 5 0 1 1 0 0 1
903 0 0 0 0 19 0 0 0 0 0 12 0 0 0 0 0 1 0
904 19 22 0 19 0 0 22 19 0 22 0 0 1 1 0 1 0 0
905 0 0 0 0 0 0 0 0 0 0 0 0 1 0 0 0 0 0
906 23 2 5 2 12 12 23 20 20 23 NA 12 1 1 1 1 1 1
907 23 0 0 12 12 0 23 0 0 5 20 0 1 0 0 1 1 0
908 0 0 0 0 0 NA 0 0 0 0 0 NA 0 0 0 0 0 1
909 20 0 0 0 17 NA 11 0 0 0 15 NA 1 0 0 0 1 1
910 0 0 5 0 0 0 0 0 22 0 0 0 0 0 1 0 0 0
911 0 0 0 0 0 NA 0 0 0 0 0 NA 0 0 0 0 0 1
912 0 5 0 5 0 0 0 2 0 2 0 0 0 1 0 1 0 0
913 0 0 5 0 0 2 0 0 2 0 0 5 0 0 1 0 0 1
914 5 0 0 0 0 0 20 0 0 0 0 0 1 0 0 0 0 0
915 21 0 0 0 0 0 12 0 0 0 0 0 1 0 0 0 0 0
916 20 20 6 0 20 20 6 6 3 0 NA 2 1 1 1 0 1 1
917 0 0 0 0 0 17 0 0 0 0 0 0 0 0 0 0 0 1
918 11 0 0 0 0 0 11 0 0 0 0 0 1 0 0 0 0 0
919 0 2 0 0 0 0 0 12 0 0 0 0 0 1 0 0 0 0
920 0 0 0 NA NA NA 0 0 0 NA 20 NA 0 0 0 1 1 1
921 0 0 0 3 0 0 0 0 0 20 0 0 0 0 0 1 0 0
922 5 5 5 5 0 NA 2 2 20 20 0 NA 1 1 1 1 0 1
923 0 0 0 0 NA 0 0 0 0 0 20 0 0 0 0 0 1 0
924 20 20 20 20 20 NA 2 2 5 2 NA NA 1 1 1 1 1 1
925 20 20 20 20 0 0 6 6 22 22 0 0 1 1 1 1 0 0
926 23 5 11 0 0 0 23 12 19 0 0 0 1 1 1 0 0 0
927 17 17 17 17 17 17 10 12 10 10 22 17 1 1 1 1 1 1
928 0 0 0 3 0 0 0 0 0 12 0 0 0 0 0 1 0 0
929 0 0 17 0 17 0 0 0 2 0 5 0 0 0 1 0 1 0
930 23 NA NA 0 NA NA 23 NA NA 0 20 NA 1 1 1 0 1 1
931 0 12 0 0 0 0 0 22 0 0 0 0 0 1 0 0 0 0
932 0 0 0 0 0 20 0 0 0 0 0 20 0 0 0 0 0 1
933 2 0 0 0 0 0 2 0 0 0 0 0 1 0 0 0 0 0
934 0 20 17 17 17 17 0 17 20 20 15 17 0 1 1 1 1 1
935 23 NA NA 0 0 0 23 NA NA 0 0 0 1 1 1 0 0 0
936 0 0 5 0 0 5 0 0 23 0 0 0 0 0 1 0 0 1
937 0 0 0 0 17 17 0 0 0 0 15 17 0 0 0 0 1 1
938 20 0 0 0 0 0 2 0 0 0 0 0 1 0 0 0 0 0
939 0 19 2 2 19 NA 0 2 19 19 NA NA 0 1 1 1 1 1
940 0 0 0 2 0 0 0 0 0 5 0 0 0 0 0 1 0 0
941 0 NA NA 0 0 NA 0 NA NA 0 0 NA 1 1 1 0 0 1
942 0 0 0 17 0 0 0 0 0 20 0 0 0 0 0 1 0 0
943 5 5 5 5 0 0 12 12 19 12 0 0 1 1 1 1 0 0
944 5 20 5 20 0 0 20 5 20 5 0 0 1 1 1 1 0 0
945 0 0 0 NA 0 0 0 0 0 NA 0 0 0 0 0 1 0 0
946 23 0 0 0 0 0 12 0 0 0 0 0 1 0 0 0 0 0
947 20 20 3 0 20 2 3 3 11 0 NA 20 1 1 1 0 1 1
948 0 0 12 0 0 0 0 0 9 0 0 0 0 0 1 0 0 0
949 0 NA 0 NA NA NA 0 NA 0 NA 20 NA 0 1 0 1 1 1
950 0 17 0 0 17 0 0 20 0 0 10 0 0 1 0 0 1 0
951 10 NA NA NA NA NA 23 NA NA NA 20 NA 1 1 1 1 1 1
952 23 0 5 0 0 0 12 0 23 0 0 0 1 0 1 0 0 0
953 5 5 5 5 5 NA 2 17 20 2 NA NA 1 1 1 1 1 1
954 20 20 20 20 20 20 23 23 17 3 10 20 1 1 1 1 1 1
955 0 0 0 5 17 0 0 0 0 17 17 0 0 0 0 1 1 0
956 0 0 23 0 0 0 0 0 23 0 0 0 0 0 1 0 0 0
957 0 20 2 0 0 0 0 2 20 0 0 0 0 1 1 0 0 0
958 0 NA NA 0 0 NA 0 NA NA 0 0 NA 0 1 1 0 0 1
959 0 12 12 12 12 12 0 20 6 2 NA 2 0 1 1 1 1 1
960 0 20 20 0 0 0 0 2 2 0 0 0 0 1 1 0 0 0
961 0 2 0 0 0 2 0 22 0 0 0 2 0 1 0 0 0 1
962 0 0 NA 0 0 0 0 0 NA 0 0 0 0 0 1 0 0 0
963 0 0 17 17 0 0 0 0 17 20 0 0 0 0 1 1 0 0
964 0 0 10 0 0 0 0 0 5 0 0 0 1 0 1 0 0 0
965 0 0 0 0 0 NA 0 0 0 0 0 12 0 0 0 0 0 1
966 0 0 2 2 0 0 0 0 20 20 0 0 0 0 1 1 0 0
967 0 0 0 0 0 NA 0 0 0 0 0 NA 0 0 0 0 0 1
968 17 17 17 17 17 17 19 23 11 2 4 17 1 1 1 1 1 1
969 10 12 0 10 0 0 10 12 0 10 0 0 1 1 0 1 0 0
970 0 0 0 22 0 NA 0 0 0 23 0 NA 0 0 0 1 0 1
971 23 0 0 0 0 0 23 0 0 0 0 0 1 0 0 0 0 0
972 5 20 12 12 0 12 20 5 5 5 0 12 1 1 1 1 0 1
973 0 0 0 1 0 0 0 0 0 2 0 0 0 0 0 1 0 0
974 0 5 0 0 0 0 0 12 0 0 0 0 0 1 0 0 0 0
975 0 20 0 20 0 20 0 11 0 12 0 12 0 1 0 1 0 1
976 20 0 20 0 0 0 10 0 17 0 0 0 1 0 1 0 0 0
977 23 NA 0 0 0 0 23 NA 0 0 0 0 1 1 0 0 0 0
978 0 0 0 0 0 NA 0 0 0 0 0 NA 0 0 0 0 0 1
979 0 20 20 20 20 20 0 5 5 12 22 20 0 1 1 1 1 1
980 23 0 0 0 0 0 23 0 0 0 0 0 1 0 0 0 0 0
981 0 0 0 0 0 2 0 0 0 0 0 2 0 0 0 0 0 1
982 0 NA 0 0 0 0 0 NA 0 0 0 0 1 1 0 0 0 0
983 0 0 5 0 12 0 0 0 12 0 4 0 0 0 1 0 1 0
984 0 0 0 0 2 0 0 0 0 0 12 0 0 0 0 0 1 0
985 10 NA 10 0 0 0 21 NA 21 0 0 0 1 1 1 0 0 0
986 22 0 0 0 0 0 20 0 0 0 0 0 1 0 0 0 0 0
987 0 0 2 2 0 2 0 0 9 19 0 2 0 0 1 1 0 1
988 23 23 NA NA 0 NA 23 23 NA NA 0 NA 1 1 1 1 0 1
989 0 0 0 NA NA 0 0 0 0 NA 20 0 0 0 0 1 1 0
990 0 0 0 NA NA NA 0 0 0 NA 20 NA 0 0 0 1 1 1
991 17 17 17 17 0 0 20 20 20 20 0 0 1 1 1 1 0 0
992 0 0 5 0 0 0 0 0 5 0 0 0 0 0 1 0 0 0
993 10 0 0 0 0 NA 10 0 0 0 0 NA 1 0 0 0 0 1
994 0 0 NA 0 0 NA 0 0 NA 0 0 NA 0 0 1 0 0 1
995 0 0 0 5 0 5 0 0 0 12 0 5 0 0 0 1 0 1
996 0 0 0 0 0 NA 0 0 0 0 0 NA 0 0 0 0 0 1
997 0 0 0 0 0 2 0 0 0 0 0 20 0 0 0 0 0 1
998 0 0 0 22 22 NA 0 0 0 19 4 23 0 0 0 1 1 1
999 0 12 0 0 0 0 0 12 0 0 0 0 0 1 0 0 0 0
1000 23 0 0 0 0 0 23 0 0 0 0 0 1 0 0 0 0 0
1001 0 5 5 5 5 0 0 20 20 20 15 0 0 1 1 1 1 0
1002 0 0 17 0 0 0 0 0 23 0 0 0 0 0 1 0 0 0
1003 23 0 0 0 NA NA 23 0 0 0 20 NA 1 0 0 0 1 1
1004 0 0 20 0 20 20 0 0 5 0 NA 5 0 0 1 0 1 1
1005 23 0 NA NA NA 0 23 0 NA NA 20 0 1 1 1 1 1 0
1006 17 0 0 0 0 0 20 0 0 0 0 0 1 0 0 0 0 0
1007 0 0 0 NA 0 NA 0 0 0 NA 0 10 0 0 0 1 0 1
1008 0 0 0 17 0 0 0 0 0 21 0 0 0 0 0 1 0 0
1009 0 5 5 5 5 5 0 20 20 2 NA 5 0 1 1 1 1 1
1010 0 0 0 22 0 0 0 0 0 20 0 0 0 0 0 1 0 0
1011 23 0 0 NA 0 0 20 0 0 NA 0 0 1 0 0 1 0 0
1012 12 5 5 5 2 5 5 2 2 2 NA 5 1 1 1 1 1 1
1013 0 0 0 0 NA 0 0 0 0 0 20 0 0 0 0 0 1 0
1014 23 12 0 22 0 0 23 22 0 12 0 0 1 1 0 1 0 0
1015 0 22 0 0 0 0 0 2 0 0 0 0 0 1 0 0 0 0
1016 17 0 0 0 0 0 5 0 0 0 0 0 1 0 0 0 0 0
1017 0 5 5 5 20 5 0 20 20 20 4 5 0 1 1 1 1 1
1018 0 20 5 20 0 20 0 12 20 23 0 20 0 1 1 1 0 1
1019 0 20 0 0 20 20 0 17 0 0 22 0 0 1 0 0 1 1
1020 0 0 5 5 5 5 0 0 11 12 NA 5 0 0 1 1 1 1
1021 0 0 0 0 NA 0 0 0 0 0 20 0 0 0 0 1 1 0
1022 0 0 0 0 12 17 0 0 0 0 4 12 0 0 0 0 1 1
1023 0 2 2 2 2 2 0 5 5 5 4 2 0 1 1 1 1 1
1024 0 0 0 22 0 0 0 0 0 5 0 0 0 0 0 1 0 0
1025 0 0 2 0 0 0 0 0 20 0 0 0 0 0 1 0 0 0
1026 0 0 0 17 0 NA 0 0 0 20 0 NA 0 0 0 1 0 1
1027 0 20 0 0 0 0 0 11 0 0 0 0 0 1 0 0 0 0
1028 0 0 17 0 0 0 0 0 20 0 0 0 0 0 1 0 0 0
1029 5 5 5 5 0 NA 20 12 20 23 0 NA 1 1 1 1 1 1
1030 0 0 0 0 NA 0 0 0 0 0 20 0 0 0 0 0 1 0
1031 23 0 NA NA NA NA 23 0 NA NA 20 NA 1 0 1 1 1 1
1032 0 20 20 2 0 5 0 20 20 20 0 5 0 1 1 1 0 1
1033 0 0 NA NA 0 NA 0 0 NA NA 0 NA 0 0 1 1 0 1
1034 0 0 20 0 0 0 0 0 21 0 0 0 0 0 1 0 0 0
1035 10 0 10 10 10 0 5 0 5 22 12 0 1 0 1 1 1 0
1036 0 NA NA 0 0 0 0 NA NA 0 0 0 0 1 1 0 0 0
1037 20 0 0 0 0 0 17 0 0 0 0 0 1 0 0 0 0 0
1038 0 0 0 0 NA 0 0 0 0 0 20 0 0 0 0 0 1 0
1039 0 0 0 0 0 17 0 0 0 0 0 17 0 0 0 0 0 1
1040 0 0 10 10 0 0 0 0 2 2 0 0 0 0 1 1 0 0
1041 0 NA NA 0 0 0 0 NA NA 0 0 0 1 1 1 0 0 0
1042 14 0 0 0 0 0 2 0 0 0 0 0 1 0 0 0 0 0
1043 0 0 0 NA NA NA 0 0 0 NA 20 1 0 0 0 1 1 1
1044 0 0 2 0 0 0 0 0 17 0 0 0 0 0 1 0 0 0
1045 0 0 0 2 0 0 0 0 0 2 0 0 0 0 0 1 0 0
1046 20 20 0 0 0 0 2 2 0 0 0 0 1 1 0 0 0 0
1047 23 NA NA 0 0 0 23 NA NA 0 0 0 1 1 1 0 0 0
1048 23 NA 0 23 0 NA 23 23 0 23 0 NA 1 1 0 1 0 1
1049 0 0 6 12 12 0 0 0 12 4 9 0 0 0 1 1 1 0
1050 0 0 0 2 0 0 0 0 0 20 0 0 0 0 0 1 0 0
1051 20 20 20 20 20 20 11 11 11 2 NA 20 1 1 1 1 1 1
1052 2 0 0 0 5 0 5 0 0 0 NA 0 1 0 0 0 1 0
1053 23 NA NA 19 NA NA 23 NA NA 5 20 NA 1 1 1 1 1 1
1054 23 23 23 3 12 12 23 23 23 12 12 12 1 1 1 1 1 1
1055 0 0 0 0 0 NA 0 0 0 0 0 NA 0 0 0 0 0 1
1056 17 17 17 17 17 17 3 3 7 3 10 17 1 1 1 1 1 1
1057 10 0 0 0 0 0 10 0 0 0 0 0 1 0 0 0 0 0
1058 23 0 5 5 0 17 23 0 17 17 0 17 1 0 1 1 0 1
1059 0 0 0 NA 0 0 0 0 0 NA 0 0 0 0 0 1 0 0
1060 23 NA 10 0 10 0 23 NA 1 0 10 0 1 1 1 0 1 0
1061 0 0 0 17 0 0 0 0 0 2 0 0 0 0 0 1 0 0
1062 0 0 0 0 12 0 0 0 0 0 4 0 0 0 0 0 1 0
1063 0 0 10 10 10 NA 0 0 12 23 20 10 0 0 1 1 1 1
1064 2 20 0 0 2 0 20 2 0 0 15 0 1 1 0 0 1 0
1065 23 NA NA NA 0 0 23 NA NA NA 0 0 1 1 1 1 0 0
1066 0 0 0 0 2 2 0 0 0 0 15 20 0 0 0 0 1 1
1067 2 NA 0 0 0 0 21 NA 0 0 0 0 1 1 0 0 0 0
1068 0 0 0 17 17 17 0 0 0 22 12 17 0 0 0 1 1 1
1069 0 20 20 2 0 5 0 19 2 5 0 20 0 1 1 1 0 1
1070 0 20 20 20 20 20 0 7 7 7 10 20 0 1 1 1 1 1
1071 23 0 0 0 0 0 23 0 0 0 0 0 1 0 0 0 0 0
1072 5 5 0 5 0 0 12 2 0 2 0 0 1 1 0 1 0 0
1073 0 23 0 0 0 0 0 23 0 0 0 0 0 1 0 0 0 0
1074 0 0 NA 0 0 0 0 0 NA 0 0 0 0 0 1 0 0 0
1075 0 0 0 0 0 17 0 0 0 0 0 17 0 0 0 0 0 1
1076 0 2 0 0 0 0 0 3 0 0 0 0 0 1 0 0 0 0
1077 0 NA NA NA 0 0 0 NA NA NA 0 0 0 1 1 1 0 0
1078 23 2 20 2 12 12 17 17 17 4 NA NA 1 1 1 1 1 1
1079 0 0 0 0 5 5 0 0 0 0 NA 5 0 0 0 0 1 1
1080 0 11 0 0 2 12 0 5 0 0 NA 12 0 1 0 0 1 1
1081 0 0 0 0 5 0 0 0 0 0 5 0 0 0 0 0 1 0
1082 0 0 0 NA 0 NA 0 0 0 NA 0 NA 1 0 0 1 0 1
1083 23 0 0 0 0 0 23 0 0 0 0 0 1 0 0 0 0 0
1084 0 0 0 0 NA 0 0 0 0 0 20 0 0 0 0 0 1 0
1085 17 0 0 17 0 0 23 0 0 0 0 0 1 0 0 1 0 0
1086 2 2 2 0 0 0 23 1 4 0 0 0 1 1 1 0 0 0
1087 23 0 0 0 0 0 23 0 0 0 0 0 1 0 0 0 0 0
1088 23 NA 0 0 NA 0 23 NA 0 0 20 0 1 1 0 0 1 0
1089 23 0 NA 0 NA 0 23 0 NA 0 20 0 1 0 1 0 1 0
1090 2 NA NA NA 0 NA 23 NA NA NA 0 NA 1 1 1 1 0 1
1091 12 12 12 12 12 12 2 3 5 3 10 2 1 1 1 1 1 1
1092 17 0 17 17 17 17 20 0 19 19 5 17 1 0 1 1 1 1
1093 23 0 19 0 0 0 23 0 23 0 0 0 1 0 1 0 0 0
1094 0 0 0 0 0 0 0 0 0 0 0 0 0 0 0 1 0 0
1095 10 0 NA 0 NA NA 23 0 NA 0 20 NA 1 0 1 0 1 1
1096 0 1 0 0 12 0 0 5 0 0 NA 0 0 1 0 0 1 0
1097 14 20 0 2 2 0 2 2 0 2 22 0 1 1 0 1 1 0
1098 0 0 17 0 0 0 0 0 2 0 0 0 0 0 1 0 0 0
1099 0 20 0 0 0 0 0 14 0 0 0 0 0 1 0 0 0 0
1100 0 20 0 23 0 NA 0 5 0 23 0 NA 0 1 0 1 0 1
1101 0 5 5 5 5 5 0 12 3 3 12 5 0 1 1 1 1 1
1102 12 23 0 0 0 0 12 23 0 0 0 0 1 1 0 0 0 0
1103 0 0 0 0 0 23 0 0 0 0 0 23 0 0 0 0 0 1
1104 0 0 0 0 10 0 0 0 0 0 19 0 0 0 0 0 1 0
1105 0 12 0 NA NA 0 0 NA 0 NA 20 0 0 1 0 1 1 0
1106 0 0 12 12 12 12 0 0 3 3 10 12 0 0 1 1 1 1
1107 6 1 10 0 0 0 18 18 15 0 0 0 1 1 1 0 0 0
1108 0 0 0 23 19 0 0 0 0 5 4 0 0 0 0 1 1 0
1109 0 0 0 0 0 NA 0 0 0 0 0 NA 0 0 0 0 0 1
1110 17 17 17 17 17 2 5 5 20 20 15 2 1 1 1 1 1 1
1111 0 0 0 0 2 0 0 0 0 0 10 0 0 0 0 0 1 0
1112 0 0 0 0 NA NA 0 0 0 0 20 NA 0 0 0 0 1 1
1113 0 17 0 0 0 0 0 17 0 0 0 0 0 1 0 0 0 0
1114 0 0 5 5 12 5 0 0 2 2 4 5 0 0 1 1 1 1
1115 0 0 0 0 17 0 0 0 0 0 15 0 0 0 0 0 1 0
1116 0 0 0 0 NA 0 0 0 0 0 20 0 0 0 0 0 1 0
1117 0 0 NA 0 0 NA 0 0 NA 0 0 NA 0 0 1 0 0 1
1118 10 0 0 0 0 0 10 0 0 0 0 0 1 0 0 0 0 0
1119 23 0 0 0 0 NA 20 0 0 0 0 22 1 0 0 0 0 1
1120 23 0 0 0 0 0 23 0 0 0 0 0 1 0 0 0 0 0
1121 0 0 0 0 0 NA 0 0 0 0 0 NA 0 0 0 0 0 1
1122 2 0 0 0 0 0 10 0 0 0 0 0 1 0 0 0 0 0
1123 20 0 20 0 20 20 17 0 5 0 5 20 1 0 1 0 1 1
1124 0 0 5 0 0 0 0 0 20 0 0 0 0 0 1 0 0 0
1125 20 0 0 0 0 0 2 0 0 0 0 0 1 0 0 0 0 0
1126 1 1 1 1 0 1 1 3 3 20 0 20 1 1 1 1 0 1
1127 0 NA 0 0 0 0 0 NA 0 0 0 0 0 1 0 0 0 0
1128 0 NA NA 0 0 0 0 NA NA 0 0 0 1 1 1 0 0 0
1129 2 0 0 0 0 12 3 0 0 0 0 12 1 0 0 0 0 1
1130 3 3 3 3 12 12 20 20 20 12 15 20 1 1 1 1 1 1
1131 23 0 0 0 0 0 23 0 0 0 0 0 1 0 0 0 0 0
1132 20 0 0 0 0 0 12 0 0 0 0 0 1 0 0 0 0 0
1133 20 20 23 20 20 20 17 17 23 17 10 20 1 1 1 1 1 1
1134 0 0 0 0 2 0 0 0 0 0 10 0 0 0 0 0 1 0
1135 0 0 0 0 0 10 0 0 0 0 0 10 0 0 0 0 0 1
1136 20 0 0 20 20 20 5 0 0 17 22 20 1 0 0 1 1 1
1137 21 0 0 0 0 0 11 0 0 0 0 0 1 0 0 0 0 0
1138 5 5 5 5 5 5 11 20 20 12 NA 5 1 1 1 1 1 1
1139 0 0 0 0 0 17 0 0 0 0 0 17 0 0 0 0 0 1
1140 0 0 0 NA 0 0 0 0 0 NA 0 0 0 0 0 1 0 0
1141 2 2 2 2 2 NA 11 11 11 23 22 NA 1 1 1 1 1 1
1142 23 0 0 NA 0 0 23 0 0 NA 0 0 1 0 0 1 0 0
1143 19 19 5 2 0 0 5 19 19 5 0 0 1 1 1 1 0 0
1144 20 0 0 20 20 0 17 0 0 17 22 0 1 0 0 1 1 0
1145 2 0 0 0 0 0 19 0 0 0 0 0 1 0 0 0 0 0
1146 0 0 0 0 20 0 0 0 0 0 22 0 0 0 0 0 1 0
1147 5 23 0 0 0 0 7 23 0 0 0 0 1 1 0 0 0 0
1148 16 0 0 0 0 NA 23 0 0 0 0 NA 1 0 0 0 0 1
1149 0 0 7 17 17 17 0 0 17 7 15 17 0 0 1 1 1 1
1150 20 20 0 0 0 0 12 17 0 0 0 0 1 1 0 0 0 0
1151 0 0 0 0 0 NA 0 0 0 0 0 NA 0 0 0 0 0 1
1152 23 NA 0 NA NA NA 22 NA 0 NA 20 NA 1 1 0 1 1 1
1153 20 0 5 20 20 20 5 0 20 3 NA 20 1 0 1 1 1 1
1154 10 NA NA 0 0 0 23 NA NA 0 0 0 1 1 1 0 0 0
1155 23 0 0 0 0 0 23 0 0 0 0 0 1 0 0 0 0 0
1156 0 5 0 0 0 0 0 20 0 0 0 0 0 1 0 0 0 0
1157 5 5 5 5 5 5 2 2 2 2 NA 5 1 1 1 1 1 1
1158 0 12 12 0 12 0 0 2 2 0 NA 0 0 1 1 0 1 0
1159 23 0 0 0 0 0 12 0 0 0 0 0 1 0 0 0 0 0
1160 0 0 0 0 NA NA 0 0 0 0 20 NA 0 0 0 0 1 1
1161 0 0 5 0 0 0 0 0 20 0 0 0 0 0 1 0 0 0
1162 5 5 5 5 5 5 2 2 2 2 NA 5 1 1 1 1 1 1
1163 0 23 0 23 5 5 0 23 0 23 10 5 0 1 0 1 1 1
1164 2 12 12 0 0 0 12 19 2 0 0 0 1 1 1 0 0 0
1165 23 0 NA NA 0 NA 23 0 NA NA 0 NA 1 0 1 1 0 1
1166 20 0 0 0 0 0 2 0 0 0 0 0 1 0 0 0 0 0
1167 0 0 11 0 0 0 0 0 20 0 0 0 0 0 1 0 0 0
1168 0 0 0 0 5 2 0 0 0 0 NA 5 0 0 0 0 1 1
1169 0 0 0 0 20 0 0 0 0 0 22 0 0 0 0 0 1 0
1170 19 0 0 0 4 NA 19 0 0 0 NA NA 1 0 0 0 1 1
1171 20 20 20 0 0 0 17 17 17 0 0 0 1 1 1 0 0 0
1172 23 0 NA 0 0 0 23 0 NA 0 0 0 1 1 1 0 0 0
1173 6 23 12 12 12 12 7 12 6 5 15 12 1 1 1 1 1 1
1174 0 0 0 0 10 0 0 0 0 0 4 0 0 0 0 0 1 0
1175 0 0 NA 0 0 0 0 0 NA 0 0 0 0 0 1 0 0 0
1176 20 20 20 0 0 20 2 2 2 0 0 20 1 1 1 1 0 1
1177 20 20 0 23 0 20 20 5 0 23 0 20 1 1 0 1 0 1
1178 0 0 0 0 2 2 0 0 0 0 NA 2 0 0 0 0 1 1
1179 5 0 5 5 2 NA 20 0 20 2 4 NA 1 0 1 1 1 1
1180 23 NA NA 0 NA 0 23 NA NA 0 20 0 1 1 1 0 1 0
1181 0 0 0 0 2 0 0 0 0 0 NA 0 0 0 0 0 1 0
1182 0 0 12 12 12 0 0 0 10 21 15 0 0 0 1 1 1 0
1183 20 0 20 20 0 0 2 0 2 2 0 0 1 0 1 1 0 0
1184 0 2 0 0 2 2 0 5 0 0 4 2 0 1 0 0 1 1
1185 0 0 20 20 0 0 0 0 2 2 0 0 0 0 1 1 0 0
1186 0 0 0 0 17 0 0 0 0 0 15 0 0 0 0 0 1 0
1187 6 0 0 0 0 0 12 0 0 0 0 0 1 0 0 0 0 0
1188 0 NA 3 NA 0 NA 0 NA NA NA 0 NA 1 1 1 1 0 1
1189 0 0 0 0 0 5 0 0 0 0 0 5 0 0 0 0 0 1
1190 0 20 0 2 22 0 0 11 0 5 15 0 0 1 0 1 1 0
1191 0 0 0 0 0 NA 0 0 0 0 0 NA 0 0 0 0 0 1
1192 0 0 2 2 2 0 0 0 12 12 1 0 0 0 1 1 1 0
1193 0 2 0 2 0 0 0 12 0 3 0 0 0 1 0 1 0 0
1194 22 0 22 0 0 0 22 0 22 0 0 0 1 0 1 0 0 0
1195 23 0 0 0 NA NA 23 0 0 0 20 NA 1 0 0 0 1 1
1196 17 0 17 17 0 0 20 0 20 20 0 0 1 0 1 1 0 0
1197 0 0 0 0 0 NA 0 0 0 0 0 NA 0 0 0 0 0 1
1198 0 0 0 0 0 NA 0 0 0 0 0 NA 0 0 0 0 0 1
1199 0 0 0 23 0 0 0 0 0 19 0 0 0 0 0 1 0 0
1200 10 0 10 0 0 NA 11 0 6 0 0 NA 1 0 1 0 0 1
1201 23 NA NA 0 0 NA 0 NA NA 0 0 NA 1 1 1 0 0 1
1202 0 5 0 0 0 0 0 2 0 0 0 0 0 1 0 0 0 0
1203 0 2 0 2 2 0 0 20 0 2 NA 0 0 1 0 1 1 0
1204 23 23 3 20 20 20 7 12 12 3 NA 20 1 1 1 1 1 1
1205 0 0 0 0 2 0 0 0 0 0 15 0 0 0 0 0 1 0
1206 10 NA 0 0 0 NA 10 NA 0 0 0 NA 1 1 0 0 0 1
1207 0 0 23 23 0 22 0 0 23 23 0 5 0 0 1 1 0 1
1208 0 2 0 0 0 0 0 17 0 0 0 0 0 1 0 0 0 0
1209 0 20 0 17 0 0 0 17 0 20 0 0 0 1 0 1 0 0
1210 0 0 0 0 NA 0 0 0 0 0 20 0 0 0 0 0 1 0
1211 0 0 0 0 5 0 0 0 0 0 NA 0 0 0 0 0 1 0
1212 0 5 0 0 0 0 0 20 0 0 0 0 0 1 0 0 0 0
1213 2 0 0 0 0 0 17 0 0 0 0 0 1 0 0 0 0 0
1214 0 NA 0 0 0 0 0 NA 0 0 0 0 0 1 0 0 0 0
1215 20 5 20 5 0 20 5 20 5 20 15 20 1 1 1 1 1 1
1216 0 0 0 23 0 0 0 0 0 23 0 0 0 0 0 1 0 0
1217 0 0 0 NA 0 0 0 0 0 NA 0 0 0 0 0 1 0 0
1218 0 0 20 0 0 20 0 0 11 0 0 20 0 0 1 0 0 1
1219 0 0 NA NA 0 0 0 0 NA NA 0 0 0 0 1 1 0 0
1220 0 0 NA 0 0 NA 0 0 NA 0 0 NA 0 0 1 0 0 1
1221 19 0 0 5 0 0 2 0 0 19 0 0 1 0 0 1 0 0
1222 12 5 5 12 12 12 20 20 20 5 NA 12 1 1 1 1 1 1
1223 20 11 0 0 0 5 5 20 0 0 0 5 1 1 0 0 0 1
1224 2 5 2 2 5 NA 19 20 5 5 NA NA 1 1 1 1 1 1
1225 0 0 NA 0 0 NA 0 0 NA 0 0 NA 0 0 1 0 0 1
1226 0 5 0 0 0 0 0 2 0 0 0 0 0 1 0 0 0 0
1227 0 0 2 0 0 0 0 0 20 0 0 0 0 0 1 0 0 0
1228 0 0 NA 0 0 NA 0 0 NA 0 0 NA 0 0 1 0 0 1
1229 22 0 0 22 0 0 17 0 0 10 0 0 1 0 0 1 0 0
1230 0 0 0 2 0 0 0 0 0 20 0 0 0 0 0 1 0 0
1231 0 20 20 0 20 20 0 11 11 0 NA 20 0 1 1 0 1 1
1232 2 0 0 0 0 0 11 0 0 0 0 0 1 0 0 0 0 0
1233 0 0 0 0 5 5 0 0 0 0 NA 5 0 0 0 0 1 1
1234 10 0 10 0 0 0 9 0 21 0 0 0 1 0 1 0 0 0
1235 5 0 0 0 0 5 11 0 0 0 0 5 1 0 0 0 0 1
1236 0 0 0 0 0 NA 0 0 0 0 0 NA 0 0 0 0 0 1
1237 0 0 NA 0 0 0 0 0 NA 0 0 0 0 0 1 0 0 0
1238 0 20 0 0 0 0 0 23 0 0 0 0 0 1 0 0 0 0
1239 0 0 0 0 0 5 0 0 0 0 0 5 0 0 0 0 0 1
1240 0 20 20 20 23 17 0 5 5 17 10 17 0 1 1 1 1 1
1241 0 0 0 0 17 0 0 0 0 0 5 0 0 0 0 0 1 0
1242 23 NA NA 0 0 0 23 NA NA 0 0 0 1 1 1 0 0 0
1243 0 0 0 0 0 NA 0 0 0 0 0 NA 0 0 0 0 0 1
1244 20 0 0 0 0 0 22 0 0 0 0 0 1 0 0 0 0 0
1245 23 0 0 NA 0 0 23 0 0 NA 0 0 1 0 0 1 0 0
1246 0 0 0 20 20 20 0 0 0 20 NA 12 0 0 0 1 1 1
1247 0 0 0 2 2 0 0 0 0 5 1 0 0 0 0 1 1 0
1248 2 2 2 2 2 2 2 5 6 12 NA 12 1 1 1 1 1 1
1249 0 0 0 0 NA NA 0 0 0 0 20 NA 1 1 1 0 1 1
1250 17 0 0 20 0 20 20 0 0 17 0 20 1 0 0 1 0 1
1251 10 19 0 10 12 12 8 14 0 20 10 12 1 1 1 1 1 1
1252 0 0 0 0 0 2 0 0 0 0 0 12 0 0 0 0 0 1
1253 10 12 21 21 10 NA 19 16 13 22 19 NA 1 1 1 1 1 1
1254 0 0 22 22 22 0 0 0 10 17 19 0 0 0 1 1 1 0
1255 0 0 NA 0 0 NA 0 0 NA 0 0 NA 0 0 1 0 0 1
1256 12 NA 0 NA NA NA 23 NA 0 NA 20 NA 1 1 0 1 1 1
1257 10 0 0 0 0 0 10 0 0 0 0 0 1 0 0 0 0 0
1258 0 0 0 0 23 0 0 0 0 0 10 0 0 0 0 0 1 0
1259 0 0 0 0 20 0 0 0 0 0 22 0 0 0 0 0 1 0
1260 0 0 0 0 20 0 0 0 0 0 22 0 0 0 0 0 1 0
1261 0 0 NA 0 0 0 0 0 NA 0 0 0 0 0 1 0 0 0
1262 0 17 17 0 0 0 0 17 17 0 0 0 0 1 1 0 0 0
1263 19 0 0 0 0 0 5 0 0 0 0 0 1 0 0 0 0 0
1264 0 0 0 5 0 0 0 0 0 12 0 0 0 0 0 1 0 0
1265 0 0 0 NA NA 0 0 0 0 NA 20 0 0 0 0 1 1 0
1266 2 0 17 0 2 0 14 0 20 0 22 0 1 0 1 0 1 0
1267 0 NA 0 NA NA 0 0 NA 0 NA 20 0 0 1 0 1 1 0
1268 17 0 17 17 0 0 20 0 20 20 0 0 1 0 1 1 0 0
1269 23 0 0 NA 0 0 23 0 0 NA 0 0 1 0 0 1 0 0
1270 0 NA 0 0 0 0 0 NA 0 0 0 0 0 1 0 0 0 0
1271 0 0 0 0 0 20 0 0 0 0 0 20 0 0 0 0 0 1
1272 0 12 0 0 0 0 0 5 0 0 0 0 0 1 0 0 0 0
1273 0 20 5 23 0 20 0 17 2 23 0 20 0 1 1 1 1 1
1274 17 0 0 0 0 0 20 0 0 0 0 0 1 0 0 0 0 0
1275 20 0 0 0 0 0 11 0 0 0 0 0 1 0 0 0 0 0
1276 23 NA 0 0 0 NA 23 NA 0 0 0 NA 1 1 0 0 0 1
1277 0 0 NA NA 0 0 0 0 NA NA 0 0 0 0 1 1 0 0
1278 17 0 0 0 0 0 20 0 0 0 0 0 1 0 0 0 0 0
1279 0 0 5 0 0 12 0 0 2 0 0 12 0 0 1 0 0 1
1280 0 0 0 0 0 2 0 0 0 0 0 2 0 0 0 0 0 1
1281 2 NA 0 0 0 0 12 12 0 0 0 0 1 1 0 0 0 0
1282 2 2 17 2 2 NA 20 20 17 20 22 NA 1 1 1 1 1 1
1283 23 NA 0 NA 0 NA 23 NA 0 NA 0 NA 1 1 0 1 0 1
1284 0 0 0 5 2 2 0 0 0 2 4 2 0 0 0 1 1 1
1285 20 20 20 20 20 20 11 11 11 20 15 20 1 1 1 1 1 1
1286 0 0 0 0 NA NA 0 0 0 0 20 NA 0 0 0 0 1 1
1287 22 0 0 0 0 0 8 0 0 0 0 0 1 0 0 0 0 0
1288 19 19 0 19 19 19 10 12 0 20 22 23 1 1 0 1 1 1
1289 0 0 0 3 0 0 0 0 0 20 0 0 0 0 0 1 0 0
1290 23 0 0 0 0 0 23 0 0 0 0 0 1 0 0 0 0 0
1291 0 0 0 0 NA 0 0 0 0 0 20 0 0 0 0 0 1 0
1292 0 0 20 0 0 20 0 0 5 0 0 20 0 0 1 0 0 1
1293 0 0 0 0 17 17 0 0 0 0 NA 17 0 0 0 0 1 1
1294 2 23 0 0 0 0 12 23 0 0 0 0 1 1 1 0 0 0
1295 14 19 5 5 5 5 19 11 19 19 NA 17 1 1 1 1 1 1
1296 20 20 13 20 12 NA 11 11 17 5 15 NA 1 1 1 1 1 1
1297 6 0 NA NA 0 0 14 0 NA NA 0 0 1 0 1 1 0 0
1298 0 NA NA 0 0 0 0 NA NA 0 0 0 0 1 1 0 0 0
1299 0 0 0 20 20 20 0 0 0 3 22 20 0 0 0 1 1 1
1300 23 NA 0 0 0 0 23 NA 0 0 0 0 1 1 0 0 0 0
1301 22 22 1 0 0 0 5 17 3 0 0 0 1 1 1 0 0 0
1302 20 0 0 0 0 0 3 0 0 0 0 0 1 0 0 0 0 0
1303 0 2 0 0 0 0 0 20 0 0 0 0 0 1 0 0 0 0
1304 0 0 0 0 0 NA 0 0 0 0 0 NA 0 1 0 0 0 1
1305 0 0 0 0 12 0 0 0 0 0 22 0 0 0 0 0 1 0
1306 0 5 5 5 2 NA 0 2 2 2 4 NA 0 1 1 1 1 1
1307 11 20 19 0 0 2 23 11 17 0 0 22 1 1 1 0 0 1
1308 23 0 0 2 0 NA 23 0 0 10 0 NA 1 0 0 1 0 1
1309 0 0 0 0 0 5 0 0 0 0 0 5 0 0 0 0 0 1
1310 23 0 0 0 0 0 23 0 0 0 0 0 1 0 0 0 0 0
1311 0 5 0 0 0 22 0 20 0 0 0 5 0 1 0 0 0 1
1312 0 0 2 0 0 NA 0 0 5 0 0 NA 0 0 1 0 0 1
1313 0 0 0 0 2 0 0 0 0 0 5 0 0 0 0 0 1 0
1314 0 0 0 0 20 20 0 0 0 0 10 20 0 0 0 0 1 1
1315 0 2 0 23 0 0 0 20 0 23 0 0 0 1 0 1 0 0
1316 10 NA 0 0 0 0 10 12 0 0 0 0 1 1 0 0 0 0
1317 2 2 2 2 2 NA 20 20 20 5 4 NA 1 1 1 1 1 1
1318 0 0 0 0 12 NA 0 0 0 0 NA NA 0 0 0 0 1 1
1319 23 NA 0 0 0 0 23 NA 0 0 0 0 1 1 0 0 0 0
1320 17 17 17 17 0 17 10 20 20 20 0 17 1 1 1 1 0 1
1321 20 20 5 5 0 NA 19 5 20 20 0 NA 1 1 1 1 0 1
1322 23 0 NA 0 5 NA 23 0 NA 0 NA NA 1 0 1 0 1 1
1323 0 0 NA 0 0 0 0 0 NA 0 0 0 0 0 1 0 0 0
1324 20 0 0 0 0 0 20 0 0 0 0 0 1 0 0 0 0 0
1325 0 0 5 0 0 0 0 0 20 0 0 0 0 0 1 0 0 0
1326 0 0 5 5 5 0 0 0 11 3 22 0 0 0 1 1 1 0
1327 0 0 0 0 17 17 0 0 0 0 4 17 0 0 0 0 1 1
1328 0 0 0 0 NA 0 0 0 0 0 20 0 0 0 0 0 1 0
1329 0 0 0 0 NA NA 0 0 0 0 20 NA 0 0 0 0 1 1
1330 0 0 2 0 0 0 0 0 11 0 0 0 0 0 1 0 0 0
1331 0 2 2 2 2 2 0 20 2 20 NA 2 0 1 1 1 1 1
1332 23 0 0 0 0 0 0 0 0 0 0 0 1 0 0 0 0 0
1333 0 19 19 19 19 NA 0 1 5 5 4 NA 0 1 1 1 1 1
1334 0 0 23 0 0 0 0 0 23 0 0 0 0 0 1 0 0 0
1335 23 0 0 0 0 0 23 0 0 0 0 0 1 0 0 0 0 0
1336 0 NA NA 0 0 0 0 NA NA 0 0 0 1 1 1 0 0 0
1337 1 0 0 12 0 0 12 0 0 3 0 0 1 0 0 1 0 0
1338 5 5 5 5 0 5 14 12 12 12 0 5 1 1 1 1 0 1
1339 0 0 5 2 2 0 0 0 2 5 4 0 0 0 1 1 1 0
1340 0 0 0 0 0 5 0 0 0 0 0 23 0 0 0 0 0 1
1341 0 0 0 0 0 23 0 0 0 0 0 23 0 0 0 0 0 1
1342 0 0 0 20 20 20 0 0 0 12 NA 20 0 0 0 1 1 1
1343 0 23 0 5 0 0 0 23 0 2 0 0 0 1 0 1 0 0
1344 0 0 0 0 NA 0 0 0 0 0 20 0 0 0 0 0 1 0
1345 0 0 0 0 0 NA 0 0 0 0 0 NA 0 0 0 0 0 1
1346 0 2 0 0 0 0 0 20 0 0 0 0 0 1 0 0 0 0
1347 20 17 17 17 17 17 17 20 20 20 15 17 1 1 1 1 1 1
1348 11 0 0 0 0 0 20 0 0 0 0 0 1 0 0 0 0 0
1349 0 0 5 0 0 0 0 0 5 0 0 0 0 0 1 0 0 0
1350 2 2 0 0 2 20 11 5 0 0 NA 20 1 1 0 0 1 1
1351 0 0 0 0 5 0 0 0 0 0 NA 0 0 0 0 0 1 0
1352 23 NA NA 0 0 0 23 NA NA 0 0 0 1 1 1 0 0 0
1353 0 0 2 0 0 0 0 0 5 0 0 0 0 0 1 0 0 0
1354 0 17 17 0 17 17 0 12 5 0 15 17 0 1 1 0 1 1
1355 0 0 0 0 NA NA 0 0 0 0 20 NA 0 0 0 0 1 1
1356 0 0 12 0 0 0 0 0 11 0 0 0 0 0 1 0 0 0
1357 12 12 12 12 0 NA 2 2 2 2 0 NA 1 1 1 1 1 1
1358 0 0 0 0 22 0 0 0 0 0 5 0 0 0 0 0 1 0
1359 0 0 0 3 0 0 0 0 0 5 0 0 0 0 0 1 0 0
1360 12 0 0 0 0 0 2 0 0 0 0 0 1 0 0 0 0 0
1361 0 NA NA 0 0 NA 0 NA NA 0 0 NA 0 1 1 0 0 1
1362 9 0 19 19 0 NA 7 0 9 22 0 NA 1 0 1 1 0 1
1363 23 NA NA NA 4 NA 23 NA NA 20 12 23 1 1 1 1 1 1
1364 0 2 0 0 0 0 0 20 0 0 0 0 0 1 0 0 0 0
1365 0 0 0 0 0 NA 0 0 0 0 0 NA 0 0 0 0 0 1
1366 0 NA 0 0 0 0 0 NA 0 0 0 0 0 1 0 0 0 0
1367 2 23 NA 0 0 23 9 23 NA 0 0 0 1 1 1 1 0 1
1368 0 12 10 10 10 10 0 3 10 2 NA 2 0 1 1 1 1 1
1369 20 0 0 0 0 0 17 0 0 0 0 0 1 0 0 0 1 0
1370 0 0 0 0 0 20 0 0 0 0 0 0 0 0 0 0 0 1
1371 19 0 19 19 19 12 5 0 23 12 NA 5 1 0 1 1 1 1
1372 2 0 0 2 2 2 2 0 0 5 22 5 1 0 0 1 1 1
1373 10 12 0 0 0 0 2 2 0 0 0 0 1 1 0 0 0 0
1374 2 0 0 2 2 2 14 0 0 2 NA 12 1 0 0 1 1 1
1375 0 0 NA 0 0 0 0 0 NA 0 0 0 0 0 1 0 0 0
1376 0 0 0 0 0 0 0 0 0 0 0 0 0 0 0 1 0 0
1377 10 12 0 10 0 0 10 5 0 22 0 0 1 1 0 1 0 0
1378 0 2 0 0 0 0 0 19 0 0 0 0 0 1 0 0 0 0
1379 23 0 0 0 NA 0 23 0 0 0 20 0 1 0 0 0 1 0
1380 0 20 5 0 0 0 0 5 20 0 0 0 0 1 1 0 0 0
1381 0 0 0 0 NA 0 0 0 0 0 20 0 0 0 0 0 1 0
1382 0 0 0 NA 0 0 0 0 0 NA 0 0 0 0 0 1 0 0
1383 2 2 0 0 0 0 20 20 0 0 0 0 1 1 0 0 0 0
1384 0 0 0 0 0 0 0 0 0 0 0 0 1 0 0 0 0 0
1385 0 0 0 5 2 5 0 0 0 2 4 5 0 0 0 1 1 1
1386 0 0 10 NA 0 0 0 0 NA NA 0 0 0 0 1 1 0 0
1387 20 0 0 0 0 0 3 0 0 0 0 0 1 0 0 0 0 0
1388 19 NA 10 0 0 0 23 NA 23 0 0 0 1 1 1 0 0 0
1389 0 0 0 NA 0 0 0 0 0 NA 0 0 0 0 0 1 0 0
1390 0 0 0 0 20 0 0 0 0 0 5 0 0 0 0 0 1 0
1391 12 20 20 20 12 12 20 12 12 12 15 12 1 1 1 1 1 1
1392 0 5 0 0 0 0 0 5 0 0 0 0 0 1 0 0 0 0
1393 0 0 0 NA NA 0 0 0 0 NA 20 0 0 0 0 1 1 0
1394 6 0 15 23 2 0 23 0 23 23 9 0 1 0 1 1 1 0
1395 0 20 20 20 20 20 0 11 11 17 22 20 0 1 1 1 1 1
1396 0 0 0 0 20 0 0 0 0 0 10 0 0 0 0 0 1 0
1397 0 2 2 2 2 2 0 17 5 5 4 5 0 1 1 1 1 1
1398 0 0 0 NA 0 NA 0 0 0 NA 0 NA 0 1 0 1 0 1
1399 20 0 0 0 20 0 17 0 0 0 10 0 1 0 0 0 1 0
1400 23 0 0 0 0 0 23 0 0 0 0 0 1 1 0 1 1 0
1401 2 19 19 19 0 0 19 2 2 2 0 0 1 1 1 1 0 0
1402 17 0 17 17 0 0 23 0 17 23 0 0 1 0 1 1 0 0
1403 0 20 20 20 20 20 0 11 11 3 22 20 0 1 1 1 1 1
1404 0 0 20 0 0 0 0 0 7 0 0 0 0 0 1 0 0 0
1405 2 0 2 2 0 0 20 0 20 20 0 0 1 0 1 1 0 0
1406 0 0 0 0 20 0 0 0 0 0 NA 0 0 0 0 0 1 0
1407 0 NA 0 0 0 0 0 0 0 0 0 0 1 1 0 0 0 0
1408 22 22 22 0 0 0 2 6 5 0 0 0 1 1 1 0 0 0
1409 14 0 0 0 0 0 3 0 0 0 0 0 1 0 0 0 0 0
1410 23 0 NA 0 NA NA 23 0 NA 0 20 NA 1 0 1 0 1 1
1411 0 0 17 0 0 0 0 0 20 0 0 0 0 0 1 0 0 0
1412 0 0 0 0 0 0 0 0 0 NA 0 0 0 0 0 1 0 0
1413 0 0 0 0 0 0 0 0 0 0 0 0 1 0 0 0 0 0
1414 21 0 10 10 0 0 10 0 6 22 0 0 1 0 1 1 0 0
1415 0 0 0 0 0 0 0 0 0 0 0 0 1 0 0 0 0 0
1416 0 0 5 0 0 0 0 0 19 0 0 0 0 0 1 0 0 0
1417 20 11 0 20 0 0 2 2 0 2 0 0 1 1 0 1 0 0
1418 5 5 5 5 0 0 22 20 22 22 0 0 1 1 1 1 0 0
1419 10 0 22 0 22 0 22 0 10 0 19 0 1 0 1 0 1 0
1420 0 NA 0 0 0 0 0 NA 0 0 0 0 0 1 0 0 0 0
1421 0 0 0 5 0 0 0 0 0 10 0 0 0 0 0 1 0 0
1422 0 0 0 0 0 NA 0 0 0 0 0 NA 0 0 0 0 0 1
1423 5 11 5 5 0 0 2 5 2 3 0 0 1 1 1 1 0 0
1424 0 0 3 3 0 0 0 0 20 12 0 0 0 0 1 1 0 0
1425 0 9 0 NA 0 NA 0 12 0 NA 0 NA 1 1 0 1 0 1
1426 0 0 0 0 23 0 0 0 0 0 22 0 0 0 0 0 1 0
1427 0 0 0 0 0 5 0 0 0 0 0 5 0 0 0 0 0 1
1428 0 20 0 0 0 0 0 3 0 0 0 0 0 1 0 0 0 0
1429 0 2 0 0 0 0 0 20 0 0 0 0 0 1 0 0 0 0
1430 2 2 2 2 2 2 12 12 12 12 NA 2 1 1 1 1 1 1
1431 0 0 0 NA NA NA 0 0 0 NA 20 NA 0 0 0 1 1 1
1432 0 0 NA NA NA NA 0 0 NA NA 20 NA 0 0 1 1 1 1
1433 23 23 23 0 0 0 23 23 NA 0 0 0 1 1 1 0 0 0
1434 23 NA 0 NA NA NA 23 NA 0 20 20 NA 1 1 0 1 1 1
1435 22 0 0 0 22 0 23 0 0 0 20 0 1 0 0 0 1 0
1436 19 5 5 5 19 12 2 3 2 19 NA 5 1 1 1 1 1 1
1437 10 0 0 0 0 0 21 0 0 0 0 0 1 0 0 0 0 0
1438 0 23 5 5 20 20 0 23 20 3 4 20 0 1 1 1 1 1
1439 17 17 17 17 17 17 20 20 20 20 15 17 1 1 1 1 1 1
1440 20 20 0 20 0 20 2 11 0 7 0 20 1 1 0 1 0 1
1441 0 0 0 0 20 20 0 0 0 0 NA 20 0 0 0 0 1 1
1442 0 0 0 20 0 0 0 0 0 3 0 0 0 0 0 1 0 0
1443 0 0 0 0 0 0 0 0 0 0 0 0 1 0 0 0 0 0
1444 0 0 0 21 0 NA 0 0 0 10 0 NA 0 0 0 1 0 1
1445 20 20 3 0 0 0 2 5 5 0 0 0 1 1 1 0 0 0
1446 17 17 17 17 17 17 20 20 20 20 15 17 1 1 1 1 1 1
1447 2 2 2 2 2 2 12 5 23 12 NA 2 1 1 1 1 1 1
1448 0 0 NA 0 0 0 0 0 NA 0 0 0 0 0 1 0 0 0
1449 0 5 5 0 5 5 0 17 17 0 NA 5 0 1 1 0 1 1
1450 22 22 22 22 0 0 10 12 22 22 0 0 1 1 1 1 0 0
1451 0 0 0 0 12 NA 0 0 0 0 NA 0 0 0 0 0 1 1
1452 0 0 0 0 0 NA 0 0 0 0 0 NA 0 0 0 0 0 1
1453 5 0 5 5 5 5 20 0 12 3 15 5 1 0 1 1 1 1
1454 0 5 5 3 17 5 0 11 12 20 NA 5 0 1 1 1 1 1
1455 0 0 12 2 12 20 0 0 5 3 NA 12 0 0 1 1 1 1
1456 0 0 NA 0 0 NA 0 0 NA 0 0 NA 0 0 1 0 0 1
1457 0 2 2 0 2 0 0 20 2 0 15 0 0 1 1 0 1 0
1458 20 0 20 0 20 0 5 0 5 0 4 0 1 0 1 0 1 0
1459 0 0 0 0 0 12 0 0 0 0 0 20 0 0 0 0 0 1
1460 0 0 0 0 0 NA 0 0 0 0 0 NA 0 0 0 0 0 1
1461 5 0 0 5 12 0 12 0 0 12 NA 0 1 0 0 1 1 0
1462 0 0 0 0 0 0 0 0 0 0 0 0 1 0 0 0 0 0
1463 0 20 0 0 0 20 0 5 0 0 0 20 0 1 0 0 0 1
1464 0 20 20 0 0 0 0 18 19 0 0 0 0 1 1 0 0 0
1465 0 0 0 0 20 20 0 0 0 0 12 20 0 0 0 0 1 1
1466 0 0 NA 0 0 0 0 0 NA 0 0 0 0 0 1 0 0 0
1467 0 0 0 0 0 10 0 0 0 0 0 5 0 0 0 0 0 1
1468 0 0 NA 0 0 NA 0 0 NA 0 0 NA 1 0 1 0 0 1
1469 18 NA 0 0 3 0 9 23 0 0 10 0 1 1 0 0 1 0
1470 23 0 0 0 0 0 23 0 0 0 0 0 1 0 0 0 0 0
1471 0 0 0 0 5 NA 0 0 0 0 NA NA 0 0 0 0 1 1
1472 11 11 11 2 0 0 2 14 2 2 0 0 1 1 1 1 0 0
1473 0 0 0 23 0 0 0 0 0 23 0 0 0 0 0 1 0 0
1474 5 0 5 0 0 0 19 0 11 0 0 0 1 0 1 0 0 0
1475 5 5 17 17 17 17 17 17 20 5 22 17 1 1 1 1 1 1
1476 0 0 0 0 22 NA 0 0 0 0 10 NA 0 0 0 0 1 1
1477 0 0 0 0 0 NA 0 0 0 0 0 NA 0 0 0 0 0 1
1478 0 17 0 0 0 0 0 19 0 0 0 0 0 1 0 0 0 0
1479 14 0 0 0 5 0 5 0 0 0 4 0 1 0 0 0 1 0
1480 10 12 9 NA 0 NA 9 NA 10 NA 0 NA 1 1 1 1 0 1
1481 0 NA NA 0 0 0 0 NA NA 0 0 0 0 1 1 0 0 0
1482 0 0 0 0 2 2 0 0 0 0 1 2 0 0 0 0 1 1
1483 2 0 5 5 5 5 20 0 2 2 NA 2 1 0 1 1 1 1
1484 17 0 17 17 17 0 20 0 5 17 12 0 1 0 1 1 1 0
1485 0 0 0 0 22 0 0 0 0 0 15 0 0 0 0 0 1 0
1486 2 9 9 9 9 NA 9 2 2 1 NA NA 1 1 1 1 1 1
1487 5 5 0 0 0 0 11 20 0 0 0 0 1 1 0 0 0 0
1488 17 17 0 0 17 17 10 12 0 0 12 17 1 1 0 0 1 1
1489 20 0 20 20 20 20 11 0 11 17 22 20 1 0 1 1 1 1
1490 0 20 0 0 0 0 0 17 0 0 0 0 0 1 0 0 0 0
1491 0 5 5 5 5 5 0 20 17 20 22 5 0 1 1 1 1 1
1492 0 0 0 0 19 0 0 0 0 0 NA 0 0 0 0 0 1 0
1493 0 0 22 0 0 0 0 0 12 0 0 0 0 0 1 0 0 0
1494 0 0 0 0 NA 0 0 0 0 0 20 0 0 0 0 1 1 0
1495 0 0 0 0 0 17 0 0 0 0 0 17 0 0 0 0 0 1
1496 0 0 0 5 0 0 0 0 0 4 0 0 0 0 0 1 0 0
1497 0 19 0 0 0 0 0 5 0 0 0 0 0 1 0 0 0 0
1498 0 0 0 0 0 5 0 0 0 0 0 23 0 0 0 0 0 1
1499 23 23 17 17 17 17 23 17 20 17 15 17 1 1 1 1 1 1
1500 2 0 0 0 2 0 1 0 0 0 9 0 1 0 0 0 1 0
1501 2 9 0 0 0 0 21 6 0 0 0 0 1 1 0 0 0 0
1502 2 19 19 19 0 19 19 1 19 2 0 2 1 1 1 1 0 1
1503 0 NA NA 0 0 0 0 NA NA 0 0 0 0 1 1 0 0 0
1504 23 0 NA 0 NA 0 23 0 NA 0 20 0 1 0 1 0 1 0
1505 5 5 5 5 5 5 20 20 20 20 15 5 1 1 1 1 1 1
1506 0 0 0 0 0 20 0 0 0 0 0 0 0 0 0 0 0 1
1507 0 5 5 0 5 0 0 2 12 0 NA 0 0 1 1 0 1 0
1508 17 0 0 17 0 0 20 0 0 20 0 0 1 0 0 1 0 0
1509 11 11 0 0 0 NA 20 20 0 0 0 NA 1 1 0 0 0 1
1510 0 0 5 0 0 0 0 0 5 0 0 0 0 0 1 0 0 0
1511 0 0 0 0 0 5 0 0 0 0 0 5 0 0 0 0 0 1
1512 23 23 0 0 0 0 23 23 0 0 0 0 1 1 0 0 0 0
1513 23 NA NA 0 0 0 23 NA NA 0 0 0 1 1 1 0 0 0
1514 2 2 2 2 2 2 14 17 17 17 22 17 1 1 1 1 1 1
1515 14 14 5 4 5 5 5 5 6 5 NA 5 1 1 1 1 1 1
1516 0 0 0 0 23 0 0 0 0 0 10 0 0 0 0 0 1 0
1517 17 17 17 17 17 17 20 20 20 10 10 17 1 1 1 1 1 1
1518 2 0 2 2 0 0 20 0 20 20 0 0 1 0 1 1 0 0
1519 0 3 5 17 0 0 0 22 17 5 0 0 0 1 1 1 0 0
1520 20 5 0 0 0 0 5 20 0 0 0 0 1 1 0 0 0 0
1521 20 20 20 0 20 20 17 17 5 0 22 20 1 1 1 0 1 1
1522 0 0 20 23 23 NA 0 0 19 5 NA NA 0 0 1 1 1 1
1523 0 0 0 NA 0 0 0 0 0 NA 0 0 0 0 0 1 0 0
1524 9 NA NA NA NA NA 0 NA NA NA 20 NA 1 1 1 1 1 1
1525 0 0 0 0 19 0 0 0 0 0 15 0 0 0 0 0 1 0
1526 0 0 0 0 12 NA 0 0 0 0 NA NA 0 0 0 0 1 1
1527 0 2 5 0 0 0 0 5 20 0 0 0 0 1 1 0 0 0
1528 0 17 0 0 0 0 0 12 0 0 0 0 0 1 0 0 0 0
1529 0 2 2 2 2 2 0 5 12 12 NA 23 0 1 1 1 1 1
1530 2 2 2 2 2 0 12 12 12 12 NA 0 1 1 1 1 1 0
1531 20 20 0 0 17 0 22 17 0 0 15 0 1 1 0 0 1 0
1532 0 0 20 0 0 0 0 0 17 0 0 0 0 0 1 0 0 0
1533 0 0 0 0 5 5 0 0 0 0 NA 5 0 0 0 0 1 1
1534 0 0 0 20 0 20 0 0 0 12 0 20 0 0 0 1 0 1
1535 20 0 0 5 0 0 11 0 0 20 0 0 1 0 0 1 0 0
1536 20 0 0 0 0 0 5 0 0 0 0 0 1 0 0 0 0 0
1537 17 0 0 17 0 17 17 0 0 17 0 17 1 0 0 1 0 1
1538 2 19 19 2 17 17 19 2 23 17 NA 17 1 1 1 1 1 1
1539 0 0 23 0 0 0 0 0 23 0 0 0 0 0 1 0 0 0
1540 20 20 20 20 20 20 11 11 11 3 10 5 1 1 1 1 1 1
1541 0 0 22 22 22 0 0 0 17 17 22 0 0 0 1 1 1 0
1542 20 20 0 0 20 20 11 11 0 0 NA 20 1 1 0 0 1 1
1543 0 0 NA 0 0 NA 0 0 NA 0 0 NA 0 0 1 0 0 1
1544 0 NA NA NA 0 0 0 NA NA NA 0 0 0 1 1 1 0 0
1545 0 0 0 2 0 2 0 0 0 20 0 20 0 0 0 1 0 1
1546 10 NA NA NA NA NA 10 NA NA NA 20 NA 1 1 1 1 1 1
1547 0 0 0 0 0 0 0 0 0 0 0 0 0 0 1 0 0 0
1548 0 5 0 0 0 0 0 12 0 0 0 0 0 1 0 0 0 0
1549 0 21 21 0 0 NA 0 20 20 0 0 NA 0 1 1 0 0 1
1550 0 0 0 0 17 0 0 0 0 0 15 0 0 0 0 0 1 0
1551 2 0 0 0 0 0 10 0 0 0 0 0 1 0 0 0 0 0
1552 5 0 5 0 5 0 20 0 17 0 10 0 1 0 1 0 1 0
1553 0 0 NA NA 2 NA 0 0 NA NA 10 NA 0 0 1 1 1 1
1554 0 5 5 0 5 5 0 12 11 0 NA 5 0 1 1 0 1 1
1555 0 0 0 0 17 17 0 0 0 0 15 20 0 0 0 0 1 1
1556 2 2 2 2 2 NA 20 20 23 19 5 NA 1 1 1 1 1 1
1557 0 0 0 0 0 NA 0 0 0 0 0 NA 0 0 0 0 0 1
1558 2 2 0 0 0 0 11 17 0 0 0 0 1 1 0 0 0 0
1559 20 0 0 23 0 0 17 0 0 23 0 0 1 0 0 1 0 0
1560 0 0 17 0 0 0 0 0 17 0 0 0 0 0 1 0 0 0
1561 10 0 0 NA NA NA 23 0 0 NA 20 NA 1 0 0 1 1 1
1562 0 0 2 2 2 0 0 0 5 5 20 0 0 0 1 1 1 0
1563 5 5 5 0 0 0 20 11 11 0 0 0 1 1 1 0 0 0
1564 0 0 0 0 NA 0 0 0 0 0 20 0 0 0 0 0 1 0
1565 0 0 23 0 0 0 0 0 NA 0 0 0 0 0 1 0 0 0
1566 23 23 0 2 2 0 23 23 0 23 5 0 1 1 0 1 1 0
1567 12 23 12 12 12 0 1 12 6 3 4 0 1 1 1 1 1 0
1568 23 NA 0 NA 0 NA 21 NA 0 NA 0 NA 1 1 0 1 0 1
1569 0 0 17 0 0 0 0 0 17 0 0 0 0 0 1 0 0 0
1570 0 NA NA 0 0 0 0 NA NA 0 0 0 0 1 1 0 0 0
1571 20 NA 0 0 0 0 23 0 0 0 0 0 1 1 0 0 0 0
1572 0 0 0 0 19 0 0 0 0 0 12 0 0 0 0 0 1 0
1573 0 0 0 0 0 20 0 0 0 0 0 20 0 0 0 0 0 1
1574 17 17 17 0 0 17 20 20 20 0 0 17 1 1 1 0 0 1
1575 0 5 5 5 5 5 0 11 20 3 NA 5 0 1 1 1 1 1
1576 0 0 0 3 0 0 0 0 0 12 0 0 0 0 0 1 0 0
1577 0 5 5 0 2 0 0 12 2 0 4 0 0 1 1 0 1 0
1578 0 0 5 5 0 0 0 0 19 5 0 0 0 0 1 1 0 0
1579 0 0 10 0 0 0 0 0 NA 0 0 0 0 0 1 0 0 0
1580 0 NA 20 20 0 20 0 23 23 23 0 20 0 1 1 1 0 1
1581 11 14 5 5 12 12 19 12 19 2 5 12 1 1 1 1 1 1
1582 23 0 0 0 0 NA 23 0 0 0 0 NA 1 0 0 0 0 1
1583 0 0 0 0 0 NA 0 0 0 0 0 NA 1 0 0 0 0 1
1584 0 0 0 0 0 NA 0 0 0 0 0 NA 0 0 0 0 0 1
1585 23 0 NA NA NA NA 23 0 NA NA 20 NA 1 0 1 1 1 1
1586 0 0 0 10 0 0 0 0 0 17 0 0 0 0 0 1 0 0
1587 0 20 5 5 0 5 0 5 20 3 0 5 0 1 1 1 0 1
1588 11 11 11 20 20 20 20 20 20 23 NA 20 1 1 1 1 1 1
1589 2 20 5 5 5 5 20 5 2 2 NA 5 1 1 1 1 1 1
1590 0 0 0 NA 0 0 0 0 0 NA 0 0 0 0 0 1 0 0
1591 5 0 0 5 0 5 2 0 0 2 0 5 1 0 0 1 0 1
1592 0 0 0 19 19 0 0 0 0 20 1 0 0 0 0 1 1 0
1593 10 0 0 0 0 NA 10 0 0 0 0 NA 1 0 0 0 0 1
1594 20 20 0 0 0 0 17 17 0 0 0 0 1 1 0 0 0 0
1595 0 0 0 0 0 5 0 0 0 0 0 5 0 0 0 0 0 1
1596 0 23 0 0 0 0 0 5 0 0 0 0 0 1 0 0 0 0
1597 0 NA 0 0 0 0 0 NA 0 0 0 0 0 1 0 0 0 0
1598 19 0 19 0 17 17 10 0 19 0 5 17 1 0 1 0 1 1
1599 20 20 20 20 20 20 3 3 3 3 NA 20 1 1 1 1 1 1
1600 0 0 17 17 17 17 0 0 10 10 15 17 0 0 1 1 1 1
1601 20 12 12 12 12 12 12 3 2 2 NA 2 1 1 1 1 1 1
1602 0 2 2 2 2 2 0 20 20 12 4 2 0 1 1 1 1 1
1603 0 0 0 0 5 0 0 0 0 0 NA 0 0 0 0 0 1 0
1604 23 5 5 5 5 0 23 19 19 22 22 0 1 1 1 1 1 0
1605 17 17 0 17 0 17 20 20 0 20 0 17 1 1 0 1 0 1
1606 0 0 0 0 20 0 0 0 0 0 4 0 0 0 0 0 1 0
1607 20 17 5 5 5 5 14 20 20 2 NA 5 1 1 1 1 1 1
1608 0 0 0 5 17 0 0 0 0 0 5 0 0 0 0 1 1 0
1609 20 0 0 0 0 0 17 0 0 0 0 0 1 0 0 0 0 0
1610 23 0 NA NA 0 0 23 0 NA NA 0 0 1 0 1 1 0 0
1611 0 NA NA NA NA NA 0 NA NA NA 0 NA 0 1 1 1 1 1
1612 0 0 0 0 NA 1 0 0 0 0 20 23 0 0 0 0 1 1
1613 0 0 0 NA 0 0 0 0 0 NA 0 0 0 0 0 1 0 0
1614 2 2 2 2 2 2 14 20 2 20 15 2 1 1 1 1 1 1
1615 0 12 0 0 0 NA 0 NA 0 0 0 NA 0 1 0 0 0 1
1616 17 0 0 0 0 0 5 0 0 0 0 0 1 0 0 0 0 0
1617 0 NA NA NA 0 NA 0 NA NA NA 0 NA 1 1 1 1 0 1
1618 0 0 0 0 0 NA 0 0 0 0 0 NA 0 0 0 0 0 1
1619 0 0 0 0 5 0 0 0 0 0 NA 0 0 0 0 0 1 0
1620 0 23 23 0 0 0 0 23 23 0 0 0 0 1 1 0 0 0
1621 5 0 0 0 0 12 16 0 0 0 0 12 1 0 0 0 0 1
1622 0 0 NA 0 0 0 0 0 NA 0 0 0 0 0 1 0 0 0
1623 0 0 10 10 10 10 0 0 21 9 2 23 0 0 1 1 1 1
1624 17 0 0 22 17 0 17 0 0 2 12 0 1 0 0 1 1 0
1625 0 0 11 12 12 12 0 0 5 5 NA 12 0 0 1 1 1 1
1626 0 0 NA NA 0 NA 0 0 NA NA 0 NA 1 1 1 1 0 1
1627 20 0 20 20 0 20 11 0 11 17 0 20 1 0 1 1 0 1
1628 0 0 0 0 19 0 0 0 0 0 4 0 0 0 0 0 1 0
1629 0 0 NA 0 0 0 0 0 NA 0 0 0 0 0 1 0 0 0
1630 0 0 NA NA 0 0 0 0 NA 0 0 0 0 0 1 1 0 0
1631 0 0 0 17 17 17 0 0 0 20 10 17 0 0 0 1 1 1
1632 0 0 17 0 17 17 0 0 17 0 15 20 0 0 1 0 1 1
1633 10 0 0 0 0 23 23 0 0 0 0 23 1 0 0 0 0 1
1634 0 22 0 0 0 0 0 19 0 0 0 0 0 1 0 0 0 0
1635 0 NA 0 0 0 0 0 NA 0 0 0 0 0 1 0 0 0 0
1636 17 17 17 0 0 0 10 12 5 0 0 0 1 1 1 0 0 0
1637 20 0 0 17 0 0 5 0 0 20 0 0 1 0 0 1 0 0
1638 17 17 17 20 0 20 20 20 20 17 0 17 1 1 1 1 0 1
1639 0 0 0 0 12 0 0 0 0 0 10 0 0 0 0 0 1 0
1640 0 0 0 20 0 0 0 0 0 3 0 0 0 0 0 1 0 0
1641 0 0 0 5 20 5 0 0 0 19 15 20 0 0 0 1 1 1
1642 8 0 0 0 0 0 19 0 0 0 0 0 1 0 0 0 0 0
1643 0 0 17 17 0 0 0 0 2 2 0 0 0 0 1 1 0 0
1644 0 0 20 0 0 0 0 0 3 0 0 0 0 0 1 0 0 0
1645 3 0 0 0 0 5 17 0 0 0 0 5 1 0 0 0 0 1
1646 14 0 0 0 0 0 17 0 0 0 0 0 1 0 0 0 0 0
1647 0 0 5 0 0 0 0 0 20 0 0 0 0 0 1 0 0 0
1648 0 0 0 0 0 2 0 0 0 0 0 5 0 0 0 0 0 1
1649 20 20 0 20 20 NA 11 11 0 12 NA NA 1 1 0 1 1 1
1650 23 0 NA NA 0 0 23 0 NA NA 0 0 1 0 1 1 0 0
1651 0 20 0 0 0 0 0 2 0 0 0 0 0 1 0 0 0 0
1652 10 12 10 10 19 10 6 6 10 19 10 19 1 1 1 1 1 1
1653 5 5 5 5 5 0 3 5 3 12 1 0 1 1 1 1 1 0
1654 0 0 0 5 0 0 0 0 0 20 0 0 0 0 0 1 0 0
1655 0 2 0 0 0 0 0 2 0 0 0 0 0 1 0 0 0 0
1656 10 0 0 0 0 10 23 0 0 0 0 10 1 0 0 0 0 1
1657 0 0 4 NA 0 NA 0 0 15 NA 0 NA 0 0 1 1 0 1
1658 0 0 0 0 0 NA 0 0 0 0 0 0 0 0 0 0 0 1
1659 5 0 5 5 5 5 6 0 6 19 NA 5 1 0 1 1 1 1
1660 0 0 0 0 10 0 0 0 0 0 10 0 0 0 0 0 1 0
1661 10 12 NA NA NA NA 23 NA NA NA 20 NA 1 1 1 1 1 1
1662 0 0 0 0 20 0 0 0 0 0 22 0 0 0 0 0 1 0
1663 0 17 17 17 0 0 0 20 20 20 0 0 0 1 1 1 0 0
1664 20 0 0 0 20 0 20 0 0 20 15 0 1 0 0 1 1 0
1665 0 0 2 0 0 0 0 0 11 0 0 0 0 0 1 0 0 0
1666 0 0 0 17 17 NA 0 0 0 20 12 NA 0 0 0 1 1 1
1667 0 0 NA 0 0 0 0 0 NA 0 0 0 1 0 1 0 0 0
1668 0 0 0 0 0 NA 0 0 0 0 0 NA 0 0 0 0 0 1
1669 0 20 0 20 0 0 0 3 0 2 0 0 0 1 0 1 0 0
1670 0 0 2 0 0 0 0 0 17 0 0 0 0 0 1 0 0 0
1671 0 17 17 0 0 0 0 20 22 0 0 0 0 1 1 0 0 0
1672 20 20 5 5 0 5 5 5 20 20 0 5 1 1 1 1 0 1
1673 0 0 0 NA 0 NA 0 0 0 NA 0 23 0 0 0 1 0 1
1674 17 0 0 0 0 0 2 0 0 0 0 0 1 0 0 0 0 0
1675 23 23 NA 0 0 0 23 23 NA 0 0 0 1 1 1 0 0 0
1676 23 0 0 NA 0 0 23 0 0 NA 0 0 1 0 0 1 0 0
1677 17 0 0 0 0 0 20 0 0 0 0 0 1 0 0 0 0 0
1678 20 0 0 0 0 0 17 0 0 0 0 0 1 0 0 0 0 0
1679 17 0 0 0 0 0 20 0 0 0 0 0 1 0 0 0 0 0
1680 7 7 7 7 17 17 20 5 17 20 15 17 1 1 1 1 1 1
1681 0 0 2 0 0 0 0 0 5 0 0 0 0 0 1 0 0 0
1682 0 0 0 0 0 NA 0 0 0 0 0 NA 0 0 0 0 0 1
1683 0 0 0 0 17 0 0 0 0 0 5 0 0 0 0 0 1 0
1684 20 0 0 5 20 NA 5 0 0 20 4 NA 1 0 0 1 1 1
1685 0 0 22 0 0 0 0 0 17 0 0 0 0 0 1 0 0 0
1686 0 0 0 0 NA NA 0 0 0 0 20 NA 0 0 0 0 1 1
1687 0 0 0 0 0 2 0 0 0 0 0 22 0 0 0 0 0 1
1688 17 0 0 0 0 0 2 0 0 0 0 0 1 0 0 0 0 0
1689 23 NA 0 0 0 0 23 NA 0 0 0 0 1 1 0 0 0 0
1690 10 0 0 0 0 0 21 0 0 0 0 0 1 0 0 0 0 0
1691 0 0 5 0 0 0 0 0 20 0 0 0 0 0 1 0 0 0
1692 10 NA NA 0 0 NA 10 NA NA 0 0 NA 1 1 1 0 0 1
1693 0 0 0 0 0 NA 0 0 0 0 0 NA 0 0 0 0 0 1
1694 0 0 0 0 0 0 0 0 0 0 0 0 1 0 0 0 0 0
1695 17 0 17 0 0 0 10 0 20 0 0 0 1 0 1 0 0 0
1696 0 14 11 0 0 0 0 11 3 0 0 0 0 1 1 0 0 0
1697 0 20 0 5 0 5 0 5 0 2 0 5 0 1 0 1 0 1
1698 16 0 0 0 0 0 23 0 0 0 0 0 1 0 0 0 0 0
1699 0 23 0 23 0 0 0 23 0 12 0 0 0 1 0 1 0 0
1700 0 0 0 0 0 0 0 0 0 0 0 0 0 0 0 1 0 0
1701 13 0 0 10 NA NA 6 0 0 10 20 NA 1 0 0 1 1 1
1702 0 0 5 0 0 2 0 0 4 0 0 2 0 0 1 0 0 1
1703 19 0 0 0 0 0 20 0 0 0 0 0 1 0 0 0 0 0
1704 0 2 0 0 0 5 0 22 0 0 0 5 0 1 0 0 0 1
1705 0 0 0 19 0 0 0 0 0 2 0 0 0 0 0 1 0 0
1706 20 20 5 5 5 5 5 5 20 17 NA 17 1 1 1 1 1 1
1707 20 20 0 0 20 5 5 5 0 0 NA 5 1 1 0 0 1 1
1708 0 5 0 5 0 0 0 20 0 17 0 0 0 1 0 1 0 0
1709 0 NA NA NA 0 NA 0 NA NA NA 0 NA 1 1 1 1 0 1
1710 0 0 20 0 0 0 0 0 5 0 0 0 0 0 1 0 0 0
1711 23 0 0 0 0 NA 23 0 0 0 0 NA 1 0 0 0 0 1
1712 0 0 5 0 0 0 0 0 20 0 0 0 0 0 1 0 0 0
1713 20 20 20 20 20 20 23 3 20 12 NA 20 1 1 1 1 1 1
1714 0 19 19 0 0 0 0 5 5 0 0 0 1 1 1 0 0 0
1715 0 0 0 20 0 0 0 0 0 3 0 0 0 0 0 1 0 0
1716 23 0 0 0 0 NA 23 0 0 0 0 NA 1 0 0 0 0 1
1717 10 1 1 0 0 0 23 11 10 0 0 0 1 1 1 0 0 0
1718 0 0 17 17 0 0 0 0 20 20 0 0 0 0 1 1 0 0
1719 0 0 NA 0 0 0 0 0 NA 0 0 0 0 0 1 0 0 0
1720 17 17 17 17 17 17 10 12 10 10 19 17 1 1 1 1 1 1
1721 0 0 0 20 0 0 0 0 0 4 0 0 0 0 0 1 0 0
1722 22 0 0 0 0 NA 23 0 0 0 0 NA 1 0 0 0 0 1
1723 5 5 5 5 0 0 20 2 2 2 0 0 1 1 1 1 0 0
1724 0 12 0 0 0 0 0 19 0 0 0 0 0 1 0 0 0 0
1725 0 0 NA NA NA 0 0 0 NA NA 20 0 0 0 1 1 1 0
1726 0 0 17 17 20 20 0 0 20 20 22 20 0 0 1 1 1 1
1727 0 0 0 0 0 20 0 0 0 0 0 20 0 0 0 0 0 1
1728 0 0 0 5 0 0 0 0 0 17 0 0 0 0 0 1 0 0
1729 20 20 0 0 0 0 11 5 0 0 0 0 1 1 0 0 0 0
1730 0 20 0 0 0 0 0 11 0 0 0 0 0 1 0 0 0 0
1731 0 0 0 0 0 NA 0 0 0 0 0 NA 0 0 0 0 0 1
1732 23 0 0 0 0 NA 23 0 0 0 0 NA 1 0 0 0 0 1
1733 0 0 20 0 20 0 0 0 20 0 NA 0 0 0 1 0 1 0
1734 19 23 0 0 0 0 23 23 0 0 0 0 1 1 0 0 0 0
1735 0 NA 5 5 5 0 0 NA 4 22 NA 0 0 1 1 1 1 0
1736 0 0 0 0 20 0 0 0 0 0 NA 0 0 0 0 0 1 0
1737 0 0 0 2 0 0 0 0 0 17 0 0 0 0 0 1 0 0
1738 0 0 19 0 0 0 0 0 20 0 0 0 0 0 1 0 0 0
1739 0 0 0 0 12 12 0 0 0 0 4 12 0 0 0 0 1 1
1740 19 19 19 19 19 19 19 20 5 5 NA 2 1 1 1 1 1 1
1741 20 0 0 5 0 0 11 0 0 23 0 0 1 0 0 1 0 0
1742 23 NA 0 0 0 0 23 NA 0 0 0 0 1 1 0 0 0 0
1743 23 0 0 0 0 0 23 0 0 0 0 0 1 0 0 0 0 0
1744 23 0 0 0 0 0 23 0 0 0 0 0 1 0 0 0 0 0
1745 0 0 12 0 0 12 0 0 19 0 0 2 0 0 1 0 0 1
1746 23 0 0 0 0 0 23 0 0 0 0 0 1 0 0 0 0 0
1747 10 NA 0 NA 0 NA 9 NA 0 NA 0 NA 1 1 0 1 0 1
1748 2 0 0 0 0 NA 0 0 0 0 0 NA 1 0 0 0 0 1
1749 0 0 0 0 0 NA 0 0 0 0 0 NA 0 0 0 0 0 1
1750 20 0 20 0 0 0 12 0 12 0 0 0 1 0 1 0 0 0
1751 0 0 0 0 17 0 0 0 0 0 15 0 0 0 0 0 1 0
1752 0 23 0 23 0 0 0 23 0 23 0 0 0 1 0 1 0 0
1753 5 0 5 0 0 0 11 0 20 0 0 0 1 0 1 0 0 0
1754 23 0 0 0 22 NA 10 0 0 0 19 NA 1 0 0 0 1 1
1755 0 0 0 20 20 20 0 0 0 3 NA 20 0 0 0 1 1 1
1756 0 0 NA 0 0 0 0 0 NA 0 0 0 0 0 1 0 0 0
1757 0 0 0 0 0 0 0 0 0 0 0 0 1 1 0 0 0 0
1758 0 0 0 17 0 0 0 0 0 2 0 0 0 0 0 1 0 0
1759 23 5 5 5 5 5 23 23 20 23 10 5 1 1 1 1 1 1
1760 6 0 0 0 0 0 5 0 0 0 0 0 1 0 0 0 0 0
1761 2 2 0 NA 2 0 18 20 0 NA 15 0 1 1 0 1 1 0
1762 10 12 NA NA 0 0 22 22 NA NA 0 0 1 1 1 1 0 0
1763 5 5 0 0 0 0 23 20 0 0 0 0 1 1 0 0 0 0
1764 0 12 0 0 0 0 0 19 0 0 0 0 0 1 0 0 0 0
1765 20 20 20 20 20 0 5 3 3 3 NA 0 1 1 1 1 1 0
1766 0 0 0 0 0 20 0 0 0 0 0 20 0 0 0 0 0 1
1767 0 0 0 0 0 NA 0 0 0 0 0 NA 0 0 0 0 0 1
1768 8 14 15 NA 17 NA 14 3 2 NA 22 NA 1 1 1 1 1 1
1769 0 0 0 0 0 NA 0 0 0 0 0 NA 0 0 0 0 0 1
1770 0 20 0 0 0 0 0 5 0 0 0 0 0 1 0 0 0 0
1771 0 0 NA 0 0 0 0 0 NA 0 0 0 0 0 1 0 0 0
1772 10 0 0 0 0 0 23 0 0 0 0 0 1 0 0 0 0 0
1773 0 0 0 19 0 19 0 0 0 5 0 5 0 0 0 1 0 1
1774 22 12 0 0 0 NA 10 12 0 0 0 NA 1 1 0 0 0 1
1775 10 12 NA 0 NA 0 10 NA NA 0 20 0 1 1 1 0 1 0
1776 17 0 0 0 0 0 10 0 0 0 0 0 1 0 0 0 0 0
1777 0 0 0 0 0 NA 0 0 0 0 0 NA 0 0 0 0 0 1
1778 0 0 0 0 0 20 0 0 0 0 0 20 0 0 0 0 0 1
1779 23 22 23 0 0 0 23 23 23 0 0 0 1 1 1 0 0 0
1780 21 0 0 0 0 0 19 0 0 0 0 0 1 0 0 0 0 0
1781 0 0 22 0 0 0 0 0 22 0 0 0 0 0 1 0 0 0
1782 23 17 0 0 0 NA 23 16 0 0 0 NA 1 1 0 0 0 1
1783 0 0 NA 0 0 0 0 0 NA 0 0 0 1 0 1 0 0 0
1784 0 0 0 0 0 5 0 0 0 0 0 5 0 0 0 0 0 1
1785 20 0 20 0 20 20 5 0 5 0 4 20 1 0 1 0 1 1
1786 0 0 0 0 10 0 0 0 0 0 4 0 0 0 0 0 1 0
1787 0 5 0 0 0 0 0 23 0 0 0 0 0 1 0 0 0 0
1788 0 0 0 0 5 0 0 0 0 0 NA 0 0 0 0 0 1 0
1789 0 0 0 0 0 5 0 0 0 0 0 5 0 0 0 0 0 1
1790 0 0 0 17 17 0 0 0 0 20 15 0 0 0 0 1 1 0
1791 0 NA 0 0 0 0 0 NA 0 0 0 0 0 1 0 0 0 0
1792 2 0 5 5 23 2 5 0 2 2 4 5 1 0 1 1 1 1
1793 20 5 5 5 5 NA 11 11 11 12 NA NA 1 1 1 1 1 1
1794 0 17 0 0 17 2 0 2 0 0 NA 17 0 1 0 0 1 1
1795 0 0 0 0 20 0 0 0 0 0 10 0 0 0 0 0 1 0
1796 0 0 NA NA 2 0 0 0 NA NA 10 0 0 0 1 1 1 0
1797 17 17 17 17 17 0 20 20 20 23 10 17 1 1 1 1 1 1
1798 23 NA NA 0 NA 0 23 NA NA 0 20 0 1 1 1 0 1 0
1799 23 0 20 23 12 0 23 0 5 23 15 0 1 0 1 1 1 0
1800 0 23 0 0 0 NA 0 14 0 0 0 NA 0 1 0 0 0 1
1801 0 0 0 0 20 NA 0 0 0 0 NA NA 0 0 0 0 1 1
1802 10 0 0 0 0 0 6 0 0 0 0 0 1 0 0 0 0 0
1803 5 5 5 5 5 0 2 2 2 2 NA 0 1 1 1 1 1 0
1804 0 0 0 0 2 23 0 0 0 0 5 12 0 0 0 0 1 1
1805 0 0 0 0 0 NA 0 0 0 0 0 NA 0 0 0 0 0 1
1806 0 20 0 0 0 0 0 16 0 0 0 0 0 1 0 0 0 0
1807 0 0 0 0 22 22 0 0 0 0 19 22 0 0 0 0 1 1
1808 0 0 0 0 17 17 0 0 0 0 10 17 0 0 0 0 1 1
1809 23 0 0 5 NA 0 23 0 0 10 20 0 1 0 0 1 1 0
1810 0 0 0 0 0 17 0 0 0 0 0 17 0 0 0 0 0 1
1811 0 0 0 0 0 20 0 0 0 0 0 20 0 0 0 0 0 1
1812 0 0 0 20 0 0 0 0 0 12 0 0 0 0 0 1 0 0
1813 2 2 NA NA 0 0 23 NA NA NA 0 0 1 1 1 1 0 0
1814 0 0 0 23 23 0 0 0 0 23 10 0 0 0 0 1 1 0
1815 23 NA 0 23 0 NA 23 NA 0 NA 0 NA 1 1 0 1 0 1
1816 19 0 0 19 0 0 20 0 0 4 0 0 1 0 0 1 0 0
1817 2 0 0 0 0 0 12 0 0 0 0 0 1 0 0 0 0 0
1818 20 0 0 0 20 20 17 0 0 0 22 20 1 0 0 0 1 1
1819 0 14 0 0 0 0 0 20 0 0 0 0 0 1 0 0 0 0
1820 0 0 5 5 0 0 0 0 12 12 0 0 0 0 1 1 0 0
1821 0 0 0 NA 0 NA 0 0 0 NA 0 NA 0 0 0 1 0 1
1822 0 0 0 0 22 0 0 0 0 0 5 0 0 0 0 0 1 0
1823 0 0 0 2 0 0 0 0 0 23 0 0 0 0 0 1 0 0
1824 2 2 2 2 2 2 5 20 5 2 NA 2 1 1 1 1 1 1
1825 0 12 2 5 12 NA 0 5 5 12 NA NA 0 1 1 1 1 1
1826 2 0 0 0 0 0 12 0 0 0 0 0 1 0 0 0 0 0
1827 19 0 0 0 0 0 2 0 0 0 0 0 1 0 0 0 0 0
1828 0 0 20 20 20 0 0 0 11 17 22 0 0 0 1 1 1 0
1829 0 20 0 0 20 20 0 23 0 0 10 20 0 1 0 0 1 1
1830 17 17 17 17 17 17 23 12 12 23 10 17 1 1 1 1 1 1
1831 0 0 0 0 5 0 0 0 0 0 12 0 0 0 0 0 1 0
1832 5 0 0 5 20 20 20 0 0 12 10 20 1 0 0 1 1 1
1833 0 NA NA 0 0 NA 0 NA NA 0 0 NA 1 1 1 0 0 1
1834 23 NA NA 0 0 0 0 NA NA 0 0 0 1 1 1 0 0 0
1835 0 0 0 0 0 12 0 0 0 0 0 23 0 0 0 0 0 1
1836 0 0 0 0 2 0 0 0 0 0 NA 0 0 0 0 0 1 0
1837 20 1 1 2 1 NA 20 6 0 1 NA NA 1 1 1 1 1 1
1838 0 0 0 0 0 NA 0 0 0 0 0 NA 0 0 0 0 0 1
1839 0 0 0 0 NA 0 0 0 0 0 20 0 0 0 0 0 1 0
1840 0 0 0 0 0 NA 0 0 0 0 0 NA 0 0 0 0 0 1
1841 0 17 0 17 17 0 0 17 0 10 19 0 0 1 0 1 1 0
1842 0 20 0 0 0 0 0 3 0 0 0 0 0 1 0 0 0 0
1843 2 2 0 0 0 0 11 20 0 0 0 0 1 1 0 0 0 0
1844 0 0 19 0 0 NA 0 0 2 0 0 NA 0 0 1 0 0 1
1845 0 0 0 0 0 2 0 0 0 0 0 2 0 0 0 0 0 1
1846 10 0 0 0 0 0 17 0 0 0 0 0 1 0 0 0 0 0
1847 0 0 2 2 2 2 0 0 12 12 1 2 0 0 1 1 1 1
1848 23 NA NA 0 0 NA 2 NA NA 0 0 NA 1 1 1 0 0 1
1849 0 0 0 0 0 NA 0 0 0 0 0 NA 0 0 0 0 0 1
1850 0 12 0 0 12 12 0 20 0 0 12 12 0 1 0 0 1 1
1851 2 2 2 2 2 2 7 14 5 22 NA 22 1 1 1 1 1 1
1852 0 20 20 20 17 17 0 11 17 17 15 17 0 1 1 1 1 1
1853 23 NA NA NA NA NA 23 NA NA NA 20 NA 1 1 1 1 1 1
1854 0 0 2 2 0 0 0 0 7 7 0 0 0 0 1 1 0 0
1855 23 NA NA NA 0 0 23 NA NA NA 0 0 1 1 1 1 0 0
1856 0 17 0 0 0 0 0 20 0 0 0 0 0 1 0 0 0 0
1857 0 0 0 NA 0 NA 0 0 0 NA 0 NA 0 0 0 1 0 1
1858 23 0 0 NA 0 0 0 0 0 NA 0 0 1 0 0 1 0 0
1859 0 0 0 0 0 0 0 0 0 0 0 0 0 1 0 0 0 0
1860 20 0 0 0 0 0 17 0 0 0 0 0 1 0 1 0 0 0
1861 23 0 0 0 0 NA 23 0 0 0 0 NA 1 0 0 0 0 1
1862 10 0 0 10 0 NA 23 0 0 23 0 NA 1 0 0 1 0 1
1863 0 20 6 3 0 20 0 12 20 12 0 20 0 1 1 1 0 1
1864 23 NA 0 NA 0 0 23 NA NA NA 0 0 1 1 1 1 0 0
1865 20 0 0 0 0 0 5 0 0 0 0 0 1 0 0 0 0 0
1866 17 0 0 0 0 17 11 0 0 0 0 17 1 0 0 0 0 1
1867 12 23 23 0 0 12 5 23 23 0 0 12 1 1 1 0 0 1
1868 20 20 17 17 22 17 5 17 20 20 22 17 1 1 1 1 1 1
1869 0 5 0 0 0 0 0 7 0 0 0 0 0 1 0 0 0 0
1870 0 0 0 5 0 0 0 0 0 12 0 0 0 0 0 1 0 0
1871 0 0 5 0 0 NA 0 0 0 0 0 NA 0 0 1 0 0 1
1872 0 0 22 2 0 0 0 0 5 19 0 0 0 0 1 1 0 0
1873 0 0 6 5 5 0 0 0 5 3 15 0 0 0 1 1 1 0
1874 23 0 0 0 0 0 23 0 0 0 0 0 1 0 0 0 0 0
1875 0 0 0 0 0 0 0 0 0 0 0 0 1 0 0 1 0 0
1876 0 0 0 20 20 20 0 0 0 10 4 12 0 0 0 1 1 1
1877 0 0 0 2 0 0 0 0 0 4 0 0 0 0 0 1 0 0
1878 0 NA NA 0 0 0 0 NA NA 0 0 0 0 1 1 0 0 0
1879 11 0 0 0 0 0 5 0 0 0 0 0 1 0 0 0 0 0
1880 0 NA NA 0 0 0 0 NA NA 0 0 0 0 1 1 0 0 0
1881 0 0 0 0 NA NA 0 0 0 0 20 NA 0 0 0 0 1 1
1882 0 0 5 0 0 0 0 0 17 0 0 0 0 0 1 0 0 0
1883 0 NA NA 0 NA 0 0 NA NA 0 20 0 1 1 1 0 1 0
1884 21 0 0 0 0 0 10 0 0 0 0 0 1 0 0 0 0 0
1885 0 0 0 0 0 NA 0 0 0 0 0 5 0 0 0 0 0 1
1886 0 0 5 0 0 5 0 0 23 0 0 23 0 0 1 0 0 1
1887 0 0 2 2 2 NA 0 0 5 20 4 NA 0 0 1 1 1 1
1888 0 2 0 2 0 0 0 20 0 20 0 0 0 1 0 1 0 0
1889 2 2 0 0 0 0 17 12 0 0 0 0 1 1 0 0 0 0
1890 0 14 0 0 0 0 0 3 0 0 0 0 0 1 0 0 0 0
1891 11 0 0 0 20 5 5 0 0 0 4 5 1 0 0 0 1 1
1892 5 0 0 0 0 0 8 0 0 0 0 0 1 0 0 0 0 0
1893 2 0 0 0 0 0 2 0 0 0 0 0 1 0 0 0 0 0
1894 20 20 0 2 2 0 2 2 0 20 15 0 1 1 0 1 1 0
1895 10 12 0 10 0 0 21 22 0 21 0 0 1 1 0 1 0 0
1896 0 0 23 0 0 0 0 0 5 0 0 0 0 0 1 0 0 0
1897 0 0 0 0 0 5 0 0 0 0 0 5 0 0 0 0 0 1
1898 23 0 0 NA 0 0 23 0 0 NA 0 0 1 0 0 1 0 0
1899 0 2 0 0 0 0 0 3 0 0 0 0 0 1 0 0 0 0
1900 12 0 0 0 0 0 1 0 0 0 0 0 1 0 0 0 0 0
1901 0 0 5 NA 0 0 0 0 19 NA 0 0 0 0 1 1 0 0
1902 0 0 0 22 0 0 0 0 0 17 0 0 0 0 0 1 0 0
1903 0 0 0 5 0 0 0 0 0 2 0 0 0 0 0 1 0 0
1904 0 0 0 0 0 5 0 0 0 0 0 5 0 0 0 0 0 1
1905 0 0 5 5 0 0 0 0 12 12 0 0 0 0 1 1 0 0
1906 0 2 0 0 0 0 0 12 0 0 0 0 0 1 0 0 0 0
1907 0 0 0 0 0 NA 0 0 0 0 0 NA 0 0 0 0 0 1
1908 22 0 0 0 0 0 2 0 0 0 0 0 1 0 0 0 0 0
1909 0 0 0 0 23 0 0 0 0 0 10 0 0 0 0 0 1 0
1910 17 17 17 0 17 17 10 19 20 0 5 17 1 1 1 0 1 1
1911 0 0 0 0 20 0 0 0 0 0 5 0 0 0 0 0 1 0
1912 23 0 0 0 0 0 23 0 0 0 0 0 1 0 0 0 0 0
1913 0 5 0 0 0 0 0 6 0 0 0 0 0 1 0 0 0 0
1914 0 0 0 17 0 0 0 0 0 20 0 0 0 0 0 1 0 0
1915 0 0 20 0 20 0 0 0 17 0 22 0 0 0 1 0 1 0
1916 0 0 0 0 0 20 0 0 0 0 0 NA 0 0 0 0 0 1
1917 0 3 0 0 2 0 0 2 0 0 NA 0 0 1 0 0 1 0
1918 3 0 20 0 0 0 20 0 17 0 0 0 1 0 1 0 0 0
1919 0 6 12 0 0 NA 0 5 2 0 0 NA 0 1 1 0 0 1
1920 23 NA NA NA NA NA 23 NA NA NA 20 NA 1 1 1 1 1 1
1921 0 0 0 0 0 17 0 0 0 0 0 17 0 0 0 0 0 1
1922 11 11 20 5 12 NA 20 5 5 20 4 NA 1 1 1 1 1 1
1923 0 0 0 0 2 0 0 0 0 0 NA 0 0 0 0 0 1 0
1924 23 0 0 0 0 0 23 0 0 0 0 0 1 0 0 0 0 0
1925 23 0 0 0 0 0 23 0 0 0 0 0 1 0 0 0 0 0
1926 20 20 20 20 20 20 11 11 11 22 12 20 1 1 1 1 1 1
1927 0 0 0 5 0 0 0 0 0 17 0 0 0 0 0 1 0 0
1928 23 NA NA 0 0 NA 23 NA NA 0 0 NA 1 1 1 0 0 1
1929 0 0 0 0 NA NA 0 0 0 0 20 NA 0 0 0 0 1 1
1930 0 0 0 20 0 20 0 0 0 5 0 20 0 0 0 1 0 1
1931 0 12 0 NA 0 0 0 22 0 NA 0 0 0 1 0 1 0 0
1932 0 0 0 17 0 0 0 0 0 2 0 0 0 0 0 1 0 0
1933 23 0 0 0 0 0 23 0 0 0 0 0 1 0 0 0 0 0
1934 18 NA 0 0 0 0 16 NA 0 0 0 0 1 1 0 0 0 0
1935 10 0 10 10 NA NA 22 0 23 23 20 NA 1 0 1 1 1 1
1936 23 0 NA NA NA NA 23 0 NA NA 20 NA 1 0 1 1 1 1
1937 0 0 0 0 0 NA 0 0 0 0 0 NA 0 0 0 0 0 1
1938 0 0 6 3 22 0 0 0 5 12 4 0 0 0 1 1 1 0
1939 0 0 NA 0 10 0 0 0 10 0 10 0 0 0 1 0 1 0
1940 21 NA 0 0 NA 0 10 NA 0 0 20 0 1 1 0 0 1 0
1941 0 17 0 0 0 0 0 12 0 0 0 0 0 1 0 0 0 0
1942 0 19 0 19 19 19 0 20 0 5 4 5 0 1 0 1 1 1
1943 19 0 0 0 0 0 3 0 0 0 0 0 1 0 0 0 0 0
1944 23 0 NA NA NA NA 23 0 NA NA 20 NA 1 0 1 1 1 1
1945 0 20 3 3 0 0 0 5 5 20 0 0 0 1 1 1 0 0
1946 23 NA NA NA 0 NA 23 NA NA NA 0 NA 1 1 1 1 0 1
1947 0 0 20 20 0 0 0 0 11 20 0 0 0 0 1 1 0 0
1948 23 22 0 0 0 0 23 23 0 0 0 0 1 1 0 0 0 0
1949 0 0 0 0 NA NA 0 0 0 0 20 NA 0 0 0 0 1 1
1950 1 0 0 0 0 0 7 0 0 0 0 0 1 0 0 0 0 0
1951 23 0 0 0 0 0 23 0 0 0 0 0 1 0 0 0 0 0
1952 23 NA 0 NA 5 0 23 NA 0 NA 12 0 1 1 0 1 1 0
1953 10 12 0 0 0 0 23 NA 0 0 0 0 1 1 0 0 0 0
1954 11 5 5 5 5 0 5 2 2 2 NA 0 1 1 1 1 1 0
1955 0 2 0 2 2 2 0 5 0 5 4 20 0 1 0 1 1 1
1956 20 0 0 0 0 20 23 0 0 0 0 20 1 0 0 0 0 1
1957 0 5 5 5 0 0 0 11 20 23 0 0 0 1 1 1 0 0
1958 0 0 NA 0 0 0 0 0 NA 0 0 0 0 0 1 0 0 0
1959 20 0 0 0 0 0 5 0 0 0 0 0 1 0 0 0 0 0
1960 14 14 20 20 0 0 20 20 5 19 0 0 1 1 1 1 0 0
1961 0 0 0 0 10 0 0 0 0 0 NA 0 0 0 0 0 1 0
1962 0 0 0 0 NA NA 0 0 0 0 20 NA 0 0 0 0 1 1
1963 0 0 0 NA 0 0 0 0 0 NA 0 0 0 0 0 1 0 0
1964 0 12 0 0 0 0 0 2 0 0 0 0 0 1 0 0 0 0
1965 10 NA 0 0 10 0 21 12 0 0 12 0 1 1 0 0 1 0
1966 23 NA 0 0 0 NA 23 NA 0 0 0 NA 1 1 0 0 0 1
1967 5 0 5 0 0 0 14 0 2 0 0 0 1 0 1 0 0 0
1968 0 0 0 20 20 20 0 0 0 17 NA 20 0 0 0 1 1 1
1969 0 0 0 0 0 NA 0 0 0 0 0 NA 0 0 0 0 0 1
1970 23 0 0 0 0 0 23 0 0 0 0 0 1 0 0 0 0 0
1971 0 0 0 5 0 0 0 0 0 20 0 0 0 0 0 1 0 0
1972 0 1 1 5 5 2 0 5 5 1 NA 12 0 1 1 1 1 1
1973 0 0 0 0 4 0 0 0 0 0 10 0 0 0 0 0 1 0
1974 22 22 0 0 0 0 2 5 0 0 0 0 1 1 0 0 0 0
1975 2 0 19 19 0 0 9 0 5 20 0 0 1 0 1 1 0 0
1976 0 0 0 10 0 0 0 0 0 22 0 0 0 0 0 1 0 0
1977 17 17 17 17 17 17 12 12 20 17 15 17 1 1 1 1 1 1
1978 0 0 0 0 0 0 0 0 0 0 0 0 0 0 0 1 0 0
1979 0 2 2 0 0 0 0 1 12 0 0 0 0 1 1 0 0 0
1980 0 20 0 0 0 0 0 11 0 0 0 0 0 1 0 0 0 0
1981 0 20 20 20 20 20 0 5 17 17 22 20 0 1 1 1 1 1
1982 0 0 0 5 0 0 0 0 0 17 0 0 0 0 0 1 0 0
1983 23 0 0 0 0 0 23 0 0 0 0 0 1 0 0 0 0 0
1984 17 0 17 0 0 0 17 0 20 0 0 0 1 0 1 0 0 0
1985 0 5 5 5 5 5 0 5 5 3 4 5 0 1 1 1 1 1
1986 23 0 0 NA 0 NA 23 0 0 NA 0 NA 1 0 0 1 0 1
1987 0 0 20 0 0 2 0 0 2 0 0 2 0 0 1 0 0 1
1988 0 NA 0 NA NA 0 0 NA 0 NA 20 0 1 1 0 1 1 0
1989 0 20 0 0 0 0 0 17 0 0 0 0 0 1 0 0 0 0
1990 0 17 0 0 0 17 0 17 0 0 0 17 0 1 0 0 0 1
1991 3 3 0 3 12 23 5 5 0 7 15 2 1 1 0 1 1 1
1992 10 12 0 10 10 10 22 22 0 22 12 22 1 1 0 1 1 1
1993 17 0 0 0 0 0 20 0 0 0 0 0 1 0 0 0 0 0
1994 20 20 5 5 5 5 5 5 20 20 15 5 1 1 1 1 1 1
1995 0 11 0 0 0 0 0 20 0 0 0 0 0 1 0 0 0 0
1996 0 0 0 0 2 0 0 0 0 0 4 0 0 0 0 0 1 0
1997 23 NA NA NA NA NA 23 NA NA NA 20 NA 1 1 1 1 1 1
1998 0 0 0 0 17 0 0 0 0 0 4 0 0 0 0 0 1 0
1999 10 0 NA 0 0 NA 23 0 NA 0 0 NA 1 0 1 0 0 1
2000 5 0 0 0 0 0 20 0 0 0 0 0 1 0 0 0 0 0
