"sow" "time" "wt" "bf" "lea"
2 1 394 8.5 49.28
2 2 436 17.2 49.05
2 3 481 21.5 52.33
2 4 504 21.9 54.53
2 5 537 25 56.68
3 1 534 11 53.22
3 2 567 15.5 54.29
3 3 618 17.8 61.77
3 4 604 18.9 63.23
3 5 620 18 60.49
4 1 551 25 44.55
4 2 565 37.6 47.06
4 3 626 40 46.32
4 4 622 45.5 50.66
4 5 666 47 53
5 1 440 12 38.64
5 2 491 17.8 47.37
5 3 536 26 46.15
5 4 549 24.1 51.15
5 5 558 28 57.64
6 1 420 18 44.19
6 2 481 24.1 45.24
6 3 491 22.4 48.07
6 4 535 28 50.69
6 5 591 35 52.42
8 1 500 17 42.05
8 2 574 31 46.64
8 3 631 37.6 45.91
8 4 646 43.2 45.28
8 5 672 49 50.56
9 1 500 22 48.85
9 2 564 35.7 47.44
9 3 620 39.3 53.28
9 4 630 47.5 59.18
9 5 675 61 52.23
11 1 478 7 55
11 2 523 13.8 56.25
11 3 575 21.5 70.22
11 4 604 25.8 67.15
11 5 655 37 70.68
12 1 598 25.5 30.42
12 2 609 28.4 33.36
12 3 627 27.5 36.09
12 4 646 24.7 36.47
12 5 648 27 41
13 1 590 25.5 49.83
13 2 650 30.7 55.9
13 3 696 34.4 61.31
13 4 702 38.3 62.22
13 5 728 42 65
14 1 569 26.5 45.32
14 2 593 31 43.91
14 3 626 35 49.85
14 4 642 37.4 52.51
14 5 634 37 45.8
15 1 379 17.5 37.18
15 2 409 21.1 37.42
15 3 434 23.7 38.39
15 4 454 28.4 41.71
15 5 462 31 41.35
16 1 532 32 46.77
16 2 565 33.6 51.53
16 3 597 44.3 49.85
16 4 620 48.6 49.19
16 5 634 50 47.6
17 1 424 23 42.22
17 2 446 31.8 42.13
17 3 489 34.6 45.35
17 4 495 39.6 45.1
17 5 532 48 44.45
19 1 514 14 46.51
19 2 578 21.5 48.14
19 3 582 23.4 53.42
19 4 639 33.1 57.78
19 5 646 31 56.4
21 1 467 14 46.43
21 2 518 15.9 47.27
21 3 581 22.4 51.11
21 4 593 22.4 55.79
21 5 595 25 53.77
22 1 578 25 47.16
22 2 610 30.3 41.5
22 3 663 31.8 46.78
22 4 673 34.6 44.96
22 5 703 37 46.41
25 1 540 12 48.55
25 2 610 23.4 54.53
25 3 640 29.3 57.64
25 4 673 39.6 56.67
25 5 706 43 58.5
26 1 485 13 42.18
26 2 575 19.8 49.15
26 3 603 21.9 52.4
26 4 632 30.7 53.59
26 5 677 37 58.5
27 1 540 21.5 50.13
27 2 572 27.7 52.3
27 3 600 31.8 55.34
27 4 617 35.7 59.88
27 5 628 37 56.85
28 1 650 18 46.5
28 2 674 21.5 49.4
28 3 700 29 53.45
28 4 709 29.3 56.35
28 5 720 34 53.6
29 1 580 12 43.29
29 2 633 20.6 43.18
29 3 663 28.8 43.49
29 4 698 28.4 46.99
29 5 740 31 46.8
