{
    "compilerOptions": {
        "target": "es2020",
        "module": "commonjs",
        "moduleResolution": "node",
        "sourceMap": false,
        "esModuleInterop": true
    },
    "exclude": [
        "node_modules"
    ]
}