<?xml version="1.0" encoding="UTF-8" standalone="no"?>
<!DOCTYPE svg  PUBLIC '-//W3C//DTD SVG 1.1//EN'  'http://www.w3.org/Graphics/SVG/1.1/DTD/svg11.dtd'>
<svg id="Layer_1" xmlns="http://www.w3.org/2000/svg" xml:space="preserve" height="380px" viewBox="0 0 25 380" width="25px" version="1.1" y="0px" x="0px" xmlns:xlink="http://www.w3.org/1999/xlink" enable-background="new 0 0 25 380">
<font horiz-adv-x="2048">
<font-face underline-position="-217" font-family="ArialMT" underline-thickness="150" units-per-em="2048"/>
<missing-glyph d="M256,0l0,1280l1024,0l0,-1280M288,32l960,0l0,1216l-960,0z" horiz-adv-x="1536"/>
<glyph horiz-adv-x="569" unicode=" "/>
<glyph horiz-adv-x="1479" unicode="D" d="M158,0l0,1466l505,0C777,1466 864,1459 924,1445C1008,1426 1080,1391 1139,1340C1216,1275 1274,1191 1313,1090C1351,988 1370,872 1370,741C1370,630 1357,531 1331,445C1305,359 1272,288 1231,232C1190,175 1146,131 1098,99C1049,66 991,42 923,25C854,8 776,0 687,0M352,173l313,0C762,173 838,182 893,200C948,218 991,243 1024,276C1070,322 1106,384 1132,462C1157,539 1170,633 1170,744C1170,897 1145,1015 1095,1098C1044,1180 983,1235 911,1263C859,1283 775,1293 660,1293l-308,0z"/>
<glyph horiz-adv-x="1593" unicode="G" d="M844,575l0,172l621,1l0,-544C1370,128 1271,71 1170,33C1069,-6 965,-25 858,-25C714,-25 583,6 466,68C348,129 259,218 199,335C139,452 109,582 109,726C109,869 139,1002 199,1126C258,1249 344,1341 456,1401C568,1461 697,1491 843,1491C949,1491 1045,1474 1131,1440C1216,1405 1283,1357 1332,1296C1381,1235 1418,1155 1443,1056l-175,-48C1246,1083 1219,1141 1186,1184C1153,1227 1107,1261 1046,1287C985,1312 918,1325 844,1325C755,1325 679,1312 614,1285C549,1258 497,1222 458,1178C418,1134 387,1086 365,1033C328,942 309,844 309,738C309,607 332,498 377,410C422,322 487,257 573,214C659,171 750,150 847,150C931,150 1013,166 1093,199C1173,231 1234,265 1275,302l0,273z"/>
<glyph horiz-adv-x="1024" unicode="c" d="M828,389l177,-23C986,244 936,149 857,80C777,11 679,-24 563,-24C418,-24 301,24 213,119C124,214 80,350 80,527C80,642 99,742 137,828C175,914 233,979 311,1022C388,1065 473,1086 564,1086C679,1086 774,1057 847,999C920,940 967,857 988,750l-175,-27C796,794 767,848 725,884C682,920 631,938 571,938C480,938 407,906 350,841C293,776 265,673 265,532C265,389 292,286 347,221C402,156 473,124 561,124C632,124 691,146 738,189C785,232 815,299 828,389z"/>
<glyph horiz-adv-x="1139" unicode="e" d="M862,342l186,-23C1019,210 964,126 885,66C806,6 704,-24 581,-24C426,-24 303,24 212,120C121,215 75,349 75,522C75,701 121,839 213,938C305,1037 424,1086 571,1086C713,1086 829,1038 919,941C1009,844 1054,708 1054,533C1054,522 1054,506 1053,485l-792,0C268,368 301,279 360,217C419,155 493,124 582,124C648,124 704,141 751,176C798,211 835,266 862,342M271,633l593,0C856,722 833,789 796,834C739,903 664,938 573,938C490,938 421,910 365,855C308,800 277,726 271,633z"/>
<glyph horiz-adv-x="1706" unicode="m" d="M135,0l0,1062l161,0l0,-149C329,965 374,1007 429,1039C484,1070 547,1086 618,1086C697,1086 761,1070 812,1037C862,1004 897,959 918,900C1002,1024 1111,1086 1246,1086C1351,1086 1432,1057 1489,999C1546,940 1574,850 1574,729l0,-729l-179,0l0,669C1395,741 1389,793 1378,825C1366,856 1345,882 1314,901C1283,920 1247,930 1206,930C1131,930 1069,905 1020,856C971,806 946,726 946,617l0,-617l-180,0l0,690C766,770 751,830 722,870C693,910 645,930 578,930C527,930 481,917 438,890C395,863 363,824 344,773C325,722 315,648 315,551l0,-551z"/>
<glyph horiz-adv-x="1139" unicode="n" d="M135,0l0,1062l162,0l0,-151C375,1028 488,1086 635,1086C699,1086 758,1075 812,1052C865,1029 905,998 932,961C959,924 977,879 988,828C995,795 998,736 998,653l0,-653l-180,0l0,646C818,719 811,774 797,811C783,847 758,876 723,898C687,919 645,930 597,930C520,930 454,906 399,857C343,808 315,716 315,580l0,-580z"/>
<glyph horiz-adv-x="1139" unicode="o" d="M68,531C68,728 123,873 232,968C323,1047 435,1086 566,1086C712,1086 831,1038 924,943C1017,847 1063,715 1063,546C1063,409 1043,302 1002,224C961,145 901,84 823,41C744,-2 659,-24 566,-24C417,-24 297,24 206,119C114,214 68,352 68,531M253,531C253,395 283,293 342,226C401,158 476,124 566,124C655,124 730,158 789,226C848,294 878,398 878,537C878,668 848,768 789,836C729,903 655,937 566,937C476,937 401,903 342,836C283,769 253,667 253,531z"/>
<glyph horiz-adv-x="569" unicode="t" d="M528,161l26,-159C503,-9 458,-14 418,-14C353,-14 302,-4 266,17C230,38 205,65 190,99C175,132 168,203 168,311l0,611l-132,0l0,140l132,0l0,263l179,108l0,-371l181,0l0,-140l-181,0l0,-621C347,250 350,217 357,202C363,187 373,176 388,167C402,158 422,154 449,154C469,154 495,156 528,161z"/>
<glyph horiz-adv-x="1139" unicode="u" d="M831,0l0,156C748,36 636,-24 494,-24C431,-24 373,-12 319,12C264,36 224,66 198,103C171,139 153,183 142,236C135,271 131,327 131,404l0,658l180,0l0,-589C311,379 315,316 322,283C333,236 357,199 394,172C431,145 476,131 530,131C584,131 635,145 682,173C729,200 763,238 783,286C802,333 812,402 812,493l0,569l180,0l0,-1062z"/>
<glyph horiz-adv-x="1024" unicode="v" d="M430,0l-404,1062l190,0l228,-636C469,357 491,286 512,212C528,268 550,335 579,414l236,648l185,0l-402,-1062z"/>
</font>
<rect width="25" height="380" fill="#F4B943"/>
<text font-size="20" font-family="&apos;ArialMT&apos;" transform="matrix(0 -1 1 0 18.371 280.38)" fill="#000000">iStandaarden Werkdocument</text>
<rect x="-.000488" height="380" width="25" fill="none"/>
<rect y="15" width="25" height="365" fill="none"/>
</svg>
