{
  "xs:schema": {
    "@xmlns:xs": "http://www.w3.org/2001/XMLSchema",
    "@xmlns:iwmo": "http://www.istandaarden.nl/iwmo/3_0/basisschema/schema",
    "@xmlns:wmo304": "http://www.istandaarden.nl/iwmo/3_0/wmo304/schema",
    "@targetNamespace": "http://www.istandaarden.nl/iwmo/3_0/wmo304/schema",
    "@elementFormDefault": "qualified",
    "xs:import": {
      "@namespace": "http://www.istandaarden.nl/iwmo/3_0/basisschema/schema",
      "@schemaLocation": "basisschema.xsd"
    },
    "xs:annotation": {
      "xs:appinfo": {
        "iwmo:standaard": "iwmo",
        "iwmo:bericht": "wmo304",
        "iwmo:release": "3.0",
        "iwmo:BerichtXsdVersie": "1.0.2",
        "iwmo:BerichtXsdMinVersie": "1.0.0",
        "iwmo:BerichtXsdMaxVersie": "1.0.2",
        "iwmo:BasisschemaXsdVersie": "1.2.0",
        "iwmo:BasisschemaXsdMinVersie": "1.0.0",
        "iwmo:BasisschemaXsdMaxVersie": "1.2.0"
      }
    },
    "xs:element": {
      "@name": "Bericht",
      "@type": "wmo304:Root"
    },
    "xs:complexType": [
      {
        "@name": "Root",
        "xs:annotation": {
          "xs:documentation": "Declaratie of factuur WMO-ondersteuning retour"
        },
        "xs:sequence": {
          "xs:element": [
            {
              "@name": "Header",
              "@type": "wmo304:Header"
            },
            {
              "@name": "Clienten",
              "@type": "wmo304:Clienten",
              "@minOccurs": "0"
            }
          ]
        }
      },
      {
        "@name": "Header",
        "xs:annotation": {
          "xs:documentation": "Metagegevens van het Bericht."
        },
        "xs:sequence": {
          "xs:element": [
            {
              "@name": "BerichtCode",
              "xs:annotation": {
                "xs:documentation": "Code ter identificatie van een soort bericht."
              },
              "xs:simpleType": {
                "xs:restriction": {
                  "@base": "iwmo:LDT_BerichtCode",
                  "xs:pattern": {
                    "@value": "417|449"
                  }
                }
              }
            },
            {
              "@name": "BerichtVersie",
              "xs:annotation": {
                "xs:documentation": "Volgnummer van de formele uitgifte van een major release van een iStandaard."
              },
              "xs:simpleType": {
                "xs:restriction": {
                  "@base": "iwmo:LDT_BerichtVersie",
                  "xs:pattern": {
                    "@value": "3"
                  }
                }
              }
            },
            {
              "@name": "BerichtSubversie",
              "xs:annotation": {
                "xs:documentation": "Volgnummer van de formele uitgifte van een minor release van een iStandaard."
              },
              "xs:simpleType": {
                "xs:restriction": {
                  "@base": "iwmo:LDT_BerichtSubversie",
                  "xs:pattern": {
                    "@value": "0"
                  }
                }
              }
            },
            {
              "@name": "Gemeente",
              "@type": "iwmo:LDT_Gemeente"
            },
            {
              "@name": "Servicebureau",
              "@minOccurs": "0",
              "xs:annotation": {
                "xs:documentation": "Identificerende code van een servicebureau. Een servicebureau is een dienstverlenende organisatie(eenheid), die een (elektronische) schakel vormt tussen zorgverleners (vrijgevestigde beroepsbeoefenaren en zorginstellingen) en betalers."
              },
              "xs:simpleType": {
                "xs:restriction": {
                  "@base": "iwmo:LDT_AgbCode",
                  "xs:pattern": {
                    "@value": "(0{8})|98((00000[1-9])|(0000[1-9][0-9])|(000[1-9][0-9]{2})|(00[1-9][0-9]{3})|(0[1-9][0-9]{4})|([1-9][0-9]{5}))"
                  }
                }
              }
            },
            {
              "@name": "Aanbieder",
              "@type": "iwmo:LDT_AgbCode",
              "xs:annotation": {
                "xs:documentation": "Identificerende code van een Wmo-aanbieder."
              }
            },
            {
              "@name": "BetalingAanID",
              "@type": "iwmo:LDT_BetalingAanID",
              "xs:annotation": {
                "xs:documentation": "Verwijzing naar degene, die de betaling dient te ontvangen."
              }
            },
            {
              "@name": "DeclaratieFactuurIdentificatie",
              "@type": "iwmo:CDT_DeclaratieFactuurIdentificatie",
              "xs:annotation": {
                "xs:documentation": "Samengestelde DeclaratieFactuurgegevens over Declaratieperiode, Factuurnummer, Dagtekening en BTW."
              }
            },
            {
              "@name": "XsdVersie",
              "@type": "iwmo:CDT_XsdVersie",
              "xs:annotation": {
                "xs:documentation": "Volgnummer van de formele uitgifte van een versie van de XSD's die zijn ingezet voor het opstellen van het heenbericht."
              }
            },
            {
              "@name": "RetourHeader",
              "@type": "iwmo:CDT_RetourHeader",
              "xs:annotation": {
                "xs:documentation": "Retourgegevens op hoofdniveau"
              }
            },
            {
              "@name": "RetourBedragen",
              "@type": "iwmo:CDT_RetourBedragen",
              "xs:annotation": {
                "xs:documentation": "Retour totaal bedragen."
              }
            },
            {
              "@name": "XsdVersieRetour",
              "@type": "iwmo:CDT_XsdVersie",
              "xs:annotation": {
                "xs:documentation": "Volgnummer van de formele uitgifte van een versie van de XSD's die zijn ingezet voor het opstellen van het retourbericht."
              }
            },
            {
              "@name": "XsltVersie",
              "@type": "iwmo:LDT_Versie",
              "@minOccurs": "0",
              "xs:annotation": {
                "xs:documentation": "Volgnummer van de formele uitgifte van een versie van de XSLT's die zijn ingezet voor de controle van het heenbericht."
              }
            },
            {
              "@name": "RetourCodes",
              "@type": "wmo304:RetourCodes"
            }
          ]
        }
      },
      {
        "@name": "RetourCodes",
        "xs:sequence": {
          "xs:element": {
            "@name": "RetourCode",
            "@type": "iwmo:LDT_RetourCode",
            "@maxOccurs": "unbounded",
            "xs:annotation": {
              "xs:documentation": "Gecodeerde aanduiding in een retourbericht van het resultaat van de beoordeling van een (deel van het) ontvangen bericht."
            }
          }
        }
      },
      {
        "@name": "Clienten",
        "xs:sequence": {
          "xs:element": {
            "@name": "Client",
            "@type": "wmo304:Client",
            "@maxOccurs": "unbounded"
          }
        }
      },
      {
        "@name": "Client",
        "xs:annotation": {
          "xs:documentation": "Gegevens van de client waarover een of meer uitgevoerde prestaties worden gedeclareerd."
        },
        "xs:sequence": {
          "xs:element": [
            {
              "@name": "Bsn",
              "@type": "iwmo:LDT_BurgerServicenummer",
              "xs:annotation": {
                "xs:documentation": "Een door de overheid toegekend identificerend nummer in het kader van het vereenvoudigen van het contact tussen overheid en burgers en het verminderen van de administratieve lasten."
              }
            },
            {
              "@name": "Geboortedatum",
              "@type": "iwmo:CDT_Geboortedatum",
              "xs:annotation": {
                "xs:documentation": "Datum waarop een natuurlijk persoon geboren is."
              }
            },
            {
              "@name": "Geslacht",
              "@type": "iwmo:LDT_Geslacht",
              "xs:annotation": {
                "xs:documentation": "De sekse van een persoon, zoals bij geboorte formeel vastgesteld of nadien formeel gewijzigd."
              }
            },
            {
              "@name": "Naam",
              "@type": "iwmo:CDT_VerkorteNaam",
              "xs:annotation": {
                "xs:documentation": "De naam van een natuurlijk persoon, aangeduid als Geslachtsnaam en eventueel Voornamen en/of Voorletters."
              }
            },
            {
              "@name": "Commentaar",
              "@type": "iwmo:LDT_Commentaar",
              "@minOccurs": "0"
            },
            {
              "@name": "Prestaties",
              "@type": "wmo304:Prestaties"
            },
            {
              "@name": "RetourCodes",
              "@type": "wmo304:RetourCodes",
              "@minOccurs": "0"
            }
          ]
        }
      },
      {
        "@name": "Prestaties",
        "xs:sequence": {
          "xs:element": {
            "@name": "Prestatie",
            "@type": "wmo304:Prestatie",
            "@maxOccurs": "unbounded"
          }
        }
      },
      {
        "@name": "Prestatie",
        "xs:annotation": {
          "xs:documentation": "Gegevens over een uitgevoerde prestatie bij een client en de te declareren/factureren bedragen bij deze prestatie."
        },
        "xs:sequence": {
          "xs:element": [
            {
              "@name": "BeschikkingNummer",
              "@type": "iwmo:LDT_Nummer",
              "@minOccurs": "0",
              "xs:annotation": {
                "xs:documentation": "Identificerend nummer van een beschikking zoals vastgesteld door de gemeente."
              }
            },
            {
              "@name": "ToewijzingNummer",
              "@type": "iwmo:LDT_Nummer",
              "@minOccurs": "0",
              "xs:annotation": {
                "xs:documentation": "Identificerend nummer van de opdracht om een zorg - of ondersteuningsproduct te leveren, zoals vastgesteld door de gemeente."
              }
            },
            {
              "@name": "ProductCategorie",
              "@type": "iwmo:LDT_ProductCategorie",
              "xs:annotation": {
                "xs:documentation": "Gecodeerde omschrijving van een product, dienst of resultaat ten behoeve van het leveren van ondersteuning aan een client."
              }
            },
            {
              "@name": "ProductCode",
              "@type": "iwmo:LDT_ProductCode"
            },
            {
              "@name": "ProductPeriode",
              "@type": "iwmo:CDT_GeslotenPeriode",
              "xs:annotation": {
                "xs:documentation": "Periode binnen de declaratie-/factuurperiode waarop het product feitelijk is of wordt uitgevoerd."
              }
            },
            {
              "@name": "IngediendeBedragPrestatie",
              "@type": "iwmo:CDT_IngediendeBedragPrestatie",
              "xs:annotation": {
                "xs:documentation": "Samenstelling van het te declareren bedrag."
              }
            },
            {
              "@name": "ProductReferentie",
              "@type": "iwmo:CDT_Referentie"
            },
            {
              "@name": "ToegekendeBedragPrestatie",
              "@type": "iwmo:CDT_ToegekendeBedragPrestatie",
              "xs:annotation": {
                "xs:documentation": "Toegekend bedrag van het ingediende bedrag."
              }
            },
            {
              "@name": "Commentaar",
              "@type": "iwmo:LDT_Commentaar",
              "@minOccurs": "0"
            },
            {
              "@name": "RetourCodes",
              "@type": "wmo304:RetourCodes",
              "@minOccurs": "0"
            }
          ]
        }
      }
    ]
  }
}
