[
    "vuepress-theme-book",
    "markdown-it-footnote",
    "vuepress-plugin-code-copy",
    "@vuepress/plugin-search",
    "vuepress-plugin-clean-urls",
    "vuepress-plugin-fulltext-search",
    "vuepress-plugin-glossary"
]
