{
	// See https://go.microsoft.com/fwlink/?LinkId=733558
	// for the documentation about the tasks.json format
	"version": "2.0.0",
	"tasks": [
        {
            "label": "dev:parse",
            "type": "shell",
            "command": "npm run dev:parse"
        },
        {
            "label": "build",
            "type": "shell",
            "command": "npm run build",
            "group": {
                "kind": "build",
                "isDefault": true
            },
            "problemMatcher": []
        },
        {
            "label": "docs:parse",
            "type": "shell",
            "command": "npm run docs:parse",
            "group": {
                "kind": "test",
                "isDefault": true
            },
            "problemMatcher": []
        },
        {
            "label": "docs:build",
            "type": "shell",
            "command": "npm run docs:parse"
        }
    ]
}