M 306 77
M 185 73
M 226 273
Schimini P 8 40
Jo P 8 80
C 248 200
C 88 200
C 328 200
C 288 200
C 208 200
C 168 200
C 128 200
C 48 200
C 8 200
C 248 320
C 88 320
C 328 320
C 208 320
C 168 320
C 48 320
C 8 320
C 248 280
C 88 280
C 328 280
C 208 280
C 168 280
C 48 280
C 8 280
C 248 240
C 88 240
C 328 240
C 208 240
C 168 240
C 48 240
C 8 240
C 248 160
C 88 160
C 328 160
C 288 160
C 208 160
C 168 160
C 128 160
C 48 160
C 8 160
C 328 120
C 288 120
C 208 120
C 168 120
C 128 120
C 48 120
C 8 120
C 328 80
C 288 80
C 208 80
C 168 80
C 128 80
C 48 80
C 328 40
C 288 40
C 208 40
C 168 40
C 128 40
C 48 40
