{
  "annotations": {
    "list": [
      {
        "builtIn": 1,
        "datasource": "-- Grafana --",
        "enable": true,
        "hide": true,
        "iconColor": "rgba(0, 211, 255, 1)",
        "name": "Annotations & Alerts",
        "type": "dashboard"
      }
    ]
  },
  "editable": true,
  "gnetId": null,
  "graphTooltip": 0,
  "iteration": 1615237636543,
  "links": [],
  "panels": [
    {
      "collapsed": false,
      "datasource": null,
      "gridPos": {
        "h": 1,
        "w": 24,
        "x": 0,
        "y": 0
      },
      "id": 41,
      "panels": [],
      "repeat": "observedproperties",
      "scopedVars": {
        "observedproperties": {
          "selected": true,
          "text": "water-temperature",
          "value": "water-temperature"
        }
      },
      "title": "Insitu",
      "type": "row"
    },
    {
      "aliasColors": {},
      "bars": false,
      "dashLength": 10,
      "dashes": false,
      "datasource": "istsos-localhost",
      "description": "",
      "fieldConfig": {
        "defaults": {
          "custom": {}
        },
        "overrides": []
      },
      "fill": 1,
      "fillGradient": 0,
      "gridPos": {
        "h": 7,
        "w": 24,
        "x": 0,
        "y": 1
      },
      "hiddenSeries": false,
      "id": 56,
      "legend": {
        "avg": false,
        "current": false,
        "max": false,
        "min": false,
        "show": true,
        "total": false,
        "values": false
      },
      "lines": true,
      "linewidth": 1,
      "nullPointMode": "null",
      "options": {
        "alertThreshold": true
      },
      "percentage": false,
      "pluginVersion": "7.4.3",
      "pointradius": 2,
      "points": false,
      "renderer": "flot",
      "repeat": "observedproperties",
      "scopedVars": {
        "observedproperties": {
          "selected": true,
          "text": "water-temperature",
          "value": "water-temperature"
        }
      },
      "seriesOverrides": [],
      "spaceLength": 10,
      "stack": false,
      "steppedLine": false,
      "targets": [
        {
          "format": "time_series",
          "group": [],
          "metricColumn": "none",
          "observedproperty": "air:temperature",
          "procedure": "LUGANO",
          "rawQuery": true,
          "rawSql": "select name_prc || ' (' || name_uom|| ')', val_msr, time_eti as time from (\n  select * from (\n    select * from (\n    \tselect id_pro, name_opr, def_opr, name_prc, id_uom_fk from  (\n    \t\tselect * from $service.observed_properties\n    \t\tINNER JOIN $service.proc_obs\n    \t\tON proc_obs.id_opr_fk = observed_properties.id_opr WHERE name_opr=$observedproperties) as t1\n    \tINNER JOIN $service.procedures\n    \tON procedures.id_prc = t1.id_prc_fk WHERE name_prc=ANY(array[$insitufixedpoints]) GROUP BY name_opr, def_opr, id_pro, name_prc, id_uom_fk) as t2\n\t\tINNER JOIN $service.uoms\n\t\tON t2.id_uom_fk = uoms.id_uom) as t3\n  INNER JOIN $service.measures\n  ON t3.id_pro = measures.id_pro_fk) as t4\nINNER JOIN $service.event_time\nON t4.id_eti_fk = event_time.id_eti WHERE $__timeFilter(time_eti) ORDER BY time_eti;",
          "refId": "A",
          "select": [
            [
              {
                "params": [
                  "value"
                ],
                "type": "column"
              }
            ]
          ],
          "service": "demo",
          "timeColumn": "time",
          "where": [
            {
              "name": "$__timeFilter",
              "params": [],
              "type": "macro"
            }
          ]
        }
      ],
      "thresholds": [],
      "timeFrom": null,
      "timeRegions": [],
      "timeShift": null,
      "title": "$observedproperties",
      "tooltip": {
        "shared": true,
        "sort": 0,
        "value_type": "individual"
      },
      "type": "graph",
      "xaxis": {
        "buckets": null,
        "mode": "time",
        "name": null,
        "show": true,
        "values": []
      },
      "yaxes": [
        {
          "$$hashKey": "object:126",
          "format": "short",
          "label": null,
          "logBase": 1,
          "max": null,
          "min": null,
          "show": true
        },
        {
          "$$hashKey": "object:127",
          "format": "short",
          "label": null,
          "logBase": 1,
          "max": null,
          "min": null,
          "show": true
        }
      ],
      "yaxis": {
        "align": false,
        "alignLevel": null
      }
    },
    {
      "collapsed": false,
      "datasource": null,
      "gridPos": {
        "h": 1,
        "w": 24,
        "x": 0,
        "y": 8
      },
      "id": 58,
      "panels": [],
      "repeat": "profile_observedproperties",
      "scopedVars": {
        "profile_observedproperties": {
          "selected": true,
          "text": "water-temperature",
          "value": "water-temperature"
        }
      },
      "title": "Profiles",
      "type": "row"
    },
    {
      "datasource": "istsos-localhost",
      "description": "",
      "fieldConfig": {
        "defaults": {
          "custom": {}
        },
        "overrides": []
      },
      "gridPos": {
        "h": 10,
        "w": 24,
        "x": 0,
        "y": 9
      },
      "id": 54,
      "options": {
        "seriesCountSize": "sm",
        "showSeriesCount": false,
        "text": "Default value of text input option"
      },
      "pluginVersion": "7.4.3",
      "repeat": "profile_observedproperties",
      "scopedVars": {
        "profile_observedproperties": {
          "selected": true,
          "text": "water-temperature",
          "value": "water-temperature"
        }
      },
      "targets": [
        {
          "format": "table",
          "group": [],
          "metricColumn": "none",
          "queryType": "randomWalk",
          "rawQuery": true,
          "rawSql": "select name_opr || ' (' || name_uom|| ')' as \"Parameter\", val_msr as \"Value\", time_eti as time, val_depth as \"Depth\" from (\n  select * from (\n    select * from (\n    \tselect id_pro, name_opr, def_opr, name_prc, id_uom_fk from  (\n    \t\tselect * from $service.observed_properties\n    \t\tINNER JOIN $service.proc_obs\n    \t\tON proc_obs.id_opr_fk = observed_properties.id_opr WHERE name_opr=ANY(array[$profile_observedproperties])) as t1\n    \tINNER JOIN $service.procedures\n    \tON procedures.id_prc = t1.id_prc_fk WHERE name_prc=$profiles GROUP BY name_opr, def_opr, id_pro, name_prc, id_uom_fk) as t2\n\t\tINNER JOIN $service.uoms\n\t\tON t2.id_uom_fk = uoms.id_uom) as t3\n  INNER JOIN $service.profiles\n  ON t3.id_pro = profiles.id_pro_fk) as t4\nINNER JOIN $service.event_time\nON t4.id_eti_fk = event_time.id_eti WHERE $__timeFilter(time_eti) ORDER BY time_eti, val_depth;",
          "refId": "A",
          "select": [
            [
              {
                "params": [
                  "value"
                ],
                "type": "column"
              }
            ]
          ],
          "timeColumn": "time",
          "where": [
            {
              "name": "$__timeFilter",
              "params": [],
              "type": "macro"
            }
          ]
        }
      ],
      "title": "$profile_observedproperties",
      "type": "supsi-profile-chart"
    },
    {
      "collapsed": false,
      "datasource": null,
      "gridPos": {
        "h": 1,
        "w": 24,
        "x": 0,
        "y": 19
      },
      "id": 60,
      "panels": [],
      "repeat": "virtual_profile_observedproperties",
      "scopedVars": {
        "virtual_profile_observedproperties": {
          "selected": true,
          "text": "water-temperature",
          "value": "water-temperature"
        }
      },
      "title": "Virtual profiles",
      "type": "row"
    },
    {
      "datasource": "istSOS profile",
      "description": "",
      "fieldConfig": {
        "defaults": {
          "color": {},
          "custom": {},
          "thresholds": {
            "mode": "absolute",
            "steps": []
          }
        },
        "overrides": []
      },
      "gridPos": {
        "h": 9,
        "w": 24,
        "x": 0,
        "y": 20
      },
      "id": 52,
      "options": {
        "seriesCountSize": "sm",
        "showSeriesCount": false,
        "text": "Default value of text input option"
      },
      "pluginVersion": "7.4.0",
      "repeat": "virtual_profile_observedproperties",
      "repeatDirection": "h",
      "scopedVars": {
        "virtual_profile_observedproperties": {
          "selected": true,
          "text": "water-temperature",
          "value": "water-temperature"
        }
      },
      "targets": [
        {
          "observedproperty": "$virtual_profile_observedproperties",
          "procedure": "$virtualprofiles",
          "refId": "A",
          "service": "$service"
        }
      ],
      "timeFrom": null,
      "timeShift": null,
      "title": "$virtual_profile_observedproperties",
      "type": "supsi-profile-chart"
    }
  ],
  "refresh": false,
  "schemaVersion": 27,
  "style": "dark",
  "tags": [],
  "templating": {
    "list": [
      {
        "allValue": null,
        "current": {
          "selected": false,
          "text": "verbano",
          "value": "verbano"
        },
        "datasource": "istsos-localhost",
        "definition": "select schema_name\nfrom information_schema.schemata\nwhere schema_name not in ('public', 'information_schema')\nand schema_name not like 'pg_%'",
        "description": null,
        "error": null,
        "hide": 0,
        "includeAll": false,
        "label": null,
        "multi": false,
        "name": "service",
        "options": [],
        "query": "select schema_name\nfrom information_schema.schemata\nwhere schema_name not in ('public', 'information_schema')\nand schema_name not like 'pg_%'",
        "refresh": 1,
        "regex": "",
        "skipUrlSync": false,
        "sort": 1,
        "tagValuesQuery": "",
        "tags": [],
        "tagsQuery": "",
        "type": "query",
        "useTags": false
      },
      {
        "allValue": null,
        "current": {
          "selected": true,
          "text": [
            "None"
          ],
          "value": [
            ""
          ]
        },
        "datasource": "istsos-localhost",
        "definition": "SELECT name_prc FROM $service.procedures \nINNER JOIN $service.obs_type ON procedures.id_oty_fk = obs_type.id_oty\nWHERE name_oty = 'insitu-fixed-point'\nORDER BY id_prc ASC ",
        "description": null,
        "error": null,
        "hide": 0,
        "includeAll": false,
        "label": null,
        "multi": true,
        "name": "insitufixedpoints",
        "options": [],
        "query": "SELECT name_prc FROM $service.procedures \nINNER JOIN $service.obs_type ON procedures.id_oty_fk = obs_type.id_oty\nWHERE name_oty = 'insitu-fixed-point'\nORDER BY id_prc ASC ",
        "refresh": 1,
        "regex": "",
        "skipUrlSync": false,
        "sort": 1,
        "tagValuesQuery": "",
        "tags": [],
        "tagsQuery": "",
        "type": "query",
        "useTags": false
      },
      {
        "allValue": null,
        "current": {
          "selected": true,
          "text": [
            "water-temperature"
          ],
          "value": [
            "water-temperature"
          ]
        },
        "datasource": "istsos-localhost",
        "definition": "SELECT name_opr FROM $service.observed_properties;",
        "description": null,
        "error": null,
        "hide": 0,
        "includeAll": false,
        "label": null,
        "multi": true,
        "name": "observedproperties",
        "options": [],
        "query": "SELECT name_opr FROM $service.observed_properties;",
        "refresh": 1,
        "regex": "",
        "skipUrlSync": false,
        "sort": 0,
        "tagValuesQuery": "",
        "tags": [],
        "tagsQuery": "",
        "type": "query",
        "useTags": false
      },
      {
        "allValue": null,
        "current": {
          "selected": false,
          "text": "GHIFFA_CHM",
          "value": "GHIFFA_CHM"
        },
        "datasource": "istsos-localhost",
        "definition": "SELECT name_prc FROM $service.procedures \nINNER JOIN $service.obs_type ON procedures.id_oty_fk = obs_type.id_oty\nWHERE name_oty = 'profile'\nORDER BY id_prc ASC ",
        "description": null,
        "error": null,
        "hide": 0,
        "includeAll": false,
        "label": null,
        "multi": true,
        "name": "profiles",
        "options": [],
        "query": "SELECT name_prc FROM $service.procedures \nINNER JOIN $service.obs_type ON procedures.id_oty_fk = obs_type.id_oty\nWHERE name_oty = 'profile'\nORDER BY id_prc ASC ",
        "refresh": 1,
        "regex": "",
        "skipUrlSync": false,
        "sort": 1,
        "tagValuesQuery": "",
        "tags": [],
        "tagsQuery": "",
        "type": "query",
        "useTags": false
      },
      {
        "allValue": null,
        "current": {
          "selected": true,
          "text": [
            "water-temperature"
          ],
          "value": [
            "water-temperature"
          ]
        },
        "datasource": "istsos-localhost",
        "definition": "SELECT name_opr FROM $service.observed_properties;",
        "description": null,
        "error": null,
        "hide": 0,
        "includeAll": false,
        "label": null,
        "multi": true,
        "name": "profile_observedproperties",
        "options": [],
        "query": "SELECT name_opr FROM $service.observed_properties;",
        "refresh": 1,
        "regex": "",
        "skipUrlSync": false,
        "sort": 0,
        "tagValuesQuery": "",
        "tags": [],
        "tagsQuery": "",
        "type": "query",
        "useTags": false
      },
      {
        "allValue": null,
        "current": {
          "selected": true,
          "text": [
            "water-temperature"
          ],
          "value": [
            "water-temperature"
          ]
        },
        "datasource": "istsos-localhost",
        "definition": "SELECT name_opr FROM $service.observed_properties;",
        "description": null,
        "error": null,
        "hide": 0,
        "includeAll": false,
        "label": null,
        "multi": true,
        "name": "virtual_profile_observedproperties",
        "options": [],
        "query": "SELECT name_opr FROM $service.observed_properties;",
        "refresh": 1,
        "regex": "",
        "skipUrlSync": false,
        "sort": 0,
        "tagValuesQuery": "",
        "tags": [],
        "tagsQuery": "",
        "type": "query",
        "useTags": false
      },
      {
        "allValue": null,
        "current": {
          "isNone": true,
          "selected": false,
          "text": "None",
          "value": ""
        },
        "datasource": "istsos-localhost",
        "definition": "SELECT name_prc FROM $service.procedures \nINNER JOIN $service.obs_type ON procedures.id_oty_fk = obs_type.id_oty\nWHERE name_oty = 'virtual-profile'\nORDER BY id_prc ASC ",
        "description": null,
        "error": null,
        "hide": 0,
        "includeAll": false,
        "label": null,
        "multi": true,
        "name": "virtualprofiles",
        "options": [],
        "query": "SELECT name_prc FROM $service.procedures \nINNER JOIN $service.obs_type ON procedures.id_oty_fk = obs_type.id_oty\nWHERE name_oty = 'virtual-profile'\nORDER BY id_prc ASC ",
        "refresh": 1,
        "regex": "",
        "skipUrlSync": false,
        "sort": 1,
        "tagValuesQuery": "",
        "tags": [],
        "tagsQuery": "",
        "type": "query",
        "useTags": false
      }
    ]
  },
  "time": {
    "from": "now-5y",
    "to": "now"
  },
  "timepicker": {},
  "timezone": "",
  "title": "istsos_insitu_profiles",
  "uid": "insitu_profiles",
  "version": 2
}