{
  "afdelingen": [
    {
      "id": 1,
      "naam": "Intensieve zorgen"
    },
    {
      "id": 2,
      "naam": "Heelkunde"
    },
    {
      "id": 3,
      "naam": "Inwendige Geneeskunde"
    },
    {
      "id": 4,
      "naam": "Geriatrie"
    },
    {
      "id": 5,
      "naam": "Pediatrie"
    }
  ],
  "kamers": [
    {
      "id": 101,
      "afdelingId": 1,
      "faciliteiten": [
        "fas fa-tv",
        "fas fa-wifi",
        "fas fa-restroom"
      ],
      "patient": 1,
      "x": 10,
      "y": 50,
      "width": 250,
      "height": 200,
      "hulpIngeroepen": false
    },
    {
      "id": 102,
      "afdelingId": 1,
      "faciliteiten": [
        "fas fa-wifi",
        "fas fa-restroom"
      ],
      "x": 10,
      "y": 450,
      "width": 250,
      "height": 200,
      "patient": null,
      "hulpIngeroepen": false
    },
    {
      "id": 103,
      "afdelingId": 1,
      "faciliteiten": [
        "fas fa-tv",
        "fas fa-restroom",
        "fas fa-baby-carriage"
      ],
      "x": 260,
      "y": 50,
      "width": 250,
      "height": 200,
      "patient": null,
      "hulpIngeroepen": false
    },
    {
      "id": 104,
      "afdelingId": 1,
      "faciliteiten": [
        "fas fa-wifi",
        "fas fa-restroom",
        "fas fa-wheelchair"
      ],
      "x": 260,
      "y": 450,
      "width": 250,
      "height": 200,
      "patient": 4,
      "hulpIngeroepen": false
    },
    {
      "id": 105,
      "afdelingId": 1,
      "faciliteiten": [
        "fas fa-tv",
        "fas fa-wifi",
        "fas fa-restroom",
        "fas fa-wheelchair"
      ],
      "x": 600,
      "y": 50,
      "width": 250,
      "height": 200,
      "patient": null,
      "hulpIngeroepen": false
    },
    {
      "id": 106,
      "afdelingId": 1,
      "faciliteiten": [
        "fas fa-tv",
        "fas fa-baby-carriage",
        "fas fa-restroom",
        "fas fa-wheelchair"
      ],
      "x": 600,
      "y": 450,
      "width": 250,
      "height": 200,
      "patient": 3,
      "hulpIngeroepen": true
    },
    {
      "id": 107,
      "afdelingId": 1,
      "faciliteiten": [
        "fas fa-baby-carriage",
        "fas fa-restroom",
        "fas fa-wheelchair"
      ],
      "x": 850,
      "y": 50,
      "width": 250,
      "height": 200,
      "patient": null,
      "hulpIngeroepen": false
    },
    {
      "id": 108,
      "afdelingId": 1,
      "faciliteiten": [
        "fas fa-baby-carriage",
        "fas fa-restroom",
        "fas fa-tv"
      ],
      "x": 850,
      "y": 450,
      "width": 250,
      "height": 200,
      "patient": null,
      "hulpIngeroepen": false
    },
    {
      "id": 109,
      "afdelingId": 1,
      "faciliteiten": [
        "fas fa-wifi",
        "fas fa-restroom",
        "fas fa-tv"
      ],
      "x": 1100,
      "y": 50,
      "width": 250,
      "height": 200,
      "patient": 2,
      "hulpIngeroepen": false
    },
    {
      "id": 110,
      "afdelingId": 1,
      "faciliteiten": [
        "fas fa-baby-carriage",
        "fas fa-restroom"
      ],
      "x": 1100,
      "y": 450,
      "width": 250,
      "height": 200,
      "patient": null,
      "hulpIngeroepen": false
    },
    {
      "id": 201,
      "afdelingId": 2,
      "faciliteiten": [
        "fas fa-tv",
        "fas fa-wifi",
        "fas fa-restroom"
      ],
      "patient": null,
      "x": 10,
      "y": 50,
      "width": 250,
      "height": 200,
      "hulpIngeroepen": false
    },
    {
      "id": 202,
      "afdelingId": 2,
      "faciliteiten": [
        "fas fa-wifi",
        "fas fa-restroom"
      ],
      "x": 10,
      "y": 450,
      "width": 250,
      "height": 200,
      "patient": 5,
      "hulpIngeroepen": false
    },
    {
      "id": 203,
      "afdelingId": 2,
      "faciliteiten": [
        "fas fa-tv",
        "fas fa-restroom",
        "fas fa-baby-carriage"
      ],
      "x": 260,
      "y": 50,
      "width": 250,
      "height": 200,
      "patient": null,
      "hulpIngeroepen": false
    },
    {
      "id": 204,
      "afdelingId": 2,
      "faciliteiten": [
        "fas fa-wifi",
        "fas fa-restroom",
        "fas fa-wheelchair"
      ],
      "x": 260,
      "y": 450,
      "width": 250,
      "height": 200,
      "patient": 6,
      "hulpIngeroepen": false
    },
    {
      "id": 205,
      "afdelingId": 2,
      "faciliteiten": [
        "fas fa-tv",
        "fas fa-wifi",
        "fas fa-restroom",
        "fas fa-wheelchair"
      ],
      "x": 510,
      "y": 50,
      "width": 250,
      "height": 200,
      "patient": null,
      "hulpIngeroepen": false
    },
    {
      "id": 206,
      "afdelingId": 2,
      "faciliteiten": [
        "fas fa-tv",
        "fas fa-baby-carriage",
        "fas fa-restroom",
        "fas fa-wheelchair"
      ],
      "x": 260,
      "y": 650,
      "width": 250,
      "height": 200,
      "patient": null,
      "hulpIngeroepen": false
    },
    {
      "id": 207,
      "afdelingId": 2,
      "faciliteiten": [
        "fas fa-baby-carriage",
        "fas fa-restroom",
        "fas fa-wheelchair"
      ],
      "x": 760,
      "y": 115,
      "width": 250,
      "height": 200,
      "patient": 7,
      "hulpIngeroepen": false
    },
    {
      "id": 208,
      "afdelingId": 2,
      "faciliteiten": [
        "fas fa-baby-carriage",
        "fas fa-restroom",
        "fas fa-tv"
      ],
      "x": 760,
      "y": 315,
      "width": 250,
      "height": 200,
      "patient": null,
      "hulpIngeroepen": false
    },
    {
      "id": 209,
      "afdelingId": 2,
      "faciliteiten": [
        "fas fa-wifi",
        "fas fa-restroom",
        "fas fa-tv"
      ],
      "x": 760,
      "y": 515,
      "width": 250,
      "height": 200,
      "patient": null,
      "hulpIngeroepen": false
    },
    {
      "id": 210,
      "afdelingId": 2,
      "faciliteiten": [
        "fas fa-baby-carriage",
        "fas fa-restroom"
      ],
      "x": 760,
      "y": 715,
      "width": 250,
      "height": 200,
      "patient": null,
      "hulpIngeroepen": false
    },
    {
      "id": 301,
      "afdelingId": 3,
      "faciliteiten": [
        "fas fa-wheelchair",
        "fas fa-tv",
        "fas fa-wifi",
        "fas fa-restroom",
        "fas fa-utensils"
      ],
      "patient": 10,
      "x": 250,
      "y": 50,
      "width": 250,
      "height": 400,
      "hulpIngeroepen": false
    },
    {
      "id": 302,
      "afdelingId": 3,
      "faciliteiten": [
        "fas fa-tv",
        "fas fa-wifi",
        "fas fa-restroom"
      ],
      "patient": null,
      "x": 700,
      "y": 50,
      "width": 250,
      "height": 400,
      "hulpIngeroepen": false
    },
    {
      "id": 303,
      "afdelingId": 3,
      "faciliteiten": [
        "fas fa-baby-carriage",
        "fas fa-restroom"
      ],
      "patient": 8,
      "x": 250,
      "y": 550,
      "width": 250,
      "height": 250,
      "hulpIngeroepen": false
    },
    {
      "id": 304,
      "afdelingId": 3,
      "faciliteiten": [
        "fas fa-utensils",
        "fas fa-wifi",
        "fas fa-restroom"
      ],
      "patient": null,
      "x": 500,
      "y": 550,
      "width": 250,
      "height": 250,
      "hulpIngeroepen": false
    },
    {
      "id": 305,
      "afdelingId": 3,
      "faciliteiten": [
        "fas fa-baby-carriage",
        "fas fa-tv",
        "fas fa-wifi",
        "fas fa-restroom",
        "fas fa-utensils"
      ],
      "patient": null,
      "x": 750,
      "y": 550,
      "width": 250,
      "height": 250,
      "hulpIngeroepen": false
    },
    {
      "id": 306,
      "afdelingId": 3,
      "faciliteiten": [
        "fas fa-tv",
        "fas fa-utensils",
        "fas fa-restroom"
      ],
      "patient": null,
      "x": 1000,
      "y": 550,
      "width": 250,
      "height": 250,
      "hulpIngeroepen": false
    },
    {
      "id": 307,
      "afdelingId": 3,
      "faciliteiten": [
        "fas fa-tv",
        "fas fa-wifi",
        "fas fa-restroom"
      ],
      "patient": 9,
      "x": 1250,
      "y": 300,
      "width": 250,
      "height": 250,
      "hulpIngeroepen": false
    },
    {
      "id": 308,
      "afdelingId": 3,
      "faciliteiten": [
        "fas fa-restroom",
        "fas fa-wheelchair"
      ],
      "patient": null,
      "x": 1250,
      "y": 50,
      "width": 250,
      "height": 250,
      "hulpIngeroepen": false
    },
    {
      "id": 309,
      "afdelingId": 3,
      "faciliteiten": [
        "fas fa-wifi",
        "fas fa-restroom",
        "fas fa-wheelchair"
      ],
      "patient": null,
      "x": 0,
      "y": 550,
      "width": 250,
      "height": 250,
      "hulpIngeroepen": false
    },
    {
      "id": 310,
      "afdelingId": 3,
      "faciliteiten": [
        "fas fa-tv",
        "fas fa-wifi",
        "fas fa-wheelchair"
      ],
      "patient": null,
      "x": 0,
      "y": 200,
      "width": 250,
      "height": 250,
      "hulpIngeroepen": false
    },
    {
      "id": 401,
      "afdelingId": 4,
      "faciliteiten": [
        "fas fa-tv",
        "fas fa-wifi",
        "fas fa-wheelchair"
      ],
      "patient": null,
      "x": 500,
      "y": 0,
      "width": 250,
      "height": 250,
      "hulpIngeroepen": false
    },
    {
      "id": 402,
      "afdelingId": 4,
      "faciliteiten": [
        "fas fa-tv",
        "fas fa-wifi",
        "fas fa-wheelchair"
      ],
      "patient": 14,
      "x": 850,
      "y": 0,
      "width": 250,
      "height": 250,
      "hulpIngeroepen": false
    },
    {
      "id": 403,
      "afdelingId": 4,
      "faciliteiten": [
        "fas fa-tv",
        "fas fa-wifi",
        "fas fa-wheelchair"
      ],
      "patient": 13,
      "x": 500,
      "y": 250,
      "width": 250,
      "height": 250,
      "hulpIngeroepen": false
    },
    {
      "id": 404,
      "afdelingId": 4,
      "faciliteiten": [
        "fas fa-tv",
        "fas fa-wifi",
        "fas fa-wheelchair"
      ],
      "patient": null,
      "x": 850,
      "y": 250,
      "width": 250,
      "height": 250,
      "hulpIngeroepen": false
    },
    {
      "id": 405,
      "afdelingId": 4,
      "faciliteiten": [
        "fas fa-tv",
        "fas fa-wifi",
        "fas fa-wheelchair"
      ],
      "patient": 12,
      "x": 500,
      "y": 500,
      "width": 250,
      "height": 250,
      "hulpIngeroepen": false
    },
    {
      "id": 406,
      "afdelingId": 4,
      "faciliteiten": [
        "fas fa-tv",
        "fas fa-wifi",
        "fas fa-wheelchair"
      ],
      "patient": 11,
      "x": 850,
      "y": 500,
      "width": 250,
      "height": 250,
      "hulpIngeroepen": true
    },
    {
      "id": 407,
      "afdelingId": 4,
      "faciliteiten": [
        "fas fa-tv",
        "fas fa-wifi",
        "fas fa-wheelchair"
      ],
      "patient": null,
      "x": 500,
      "y": 750,
      "width": 250,
      "height": 150,
      "hulpIngeroepen": false
    },
    {
      "id": 408,
      "afdelingId": 4,
      "faciliteiten": [
        "fas fa-tv",
        "fas fa-wifi",
        "fas fa-wheelchair"
      ],
      "patient": null,
      "x": 850,
      "y": 750,
      "width": 250,
      "height": 150,
      "hulpIngeroepen": false
    },
    {
      "id": 501,
      "afdelingId": 5,
      "faciliteiten": [
        "fas fa-tv",
        "fas fa-wheelchair"
      ],
      "patient": 16,
      "x": 450,
      "y": 0,
      "width": 250,
      "height": 500,
      "hulpIngeroepen": true
    },
    {
      "id": 502,
      "afdelingId": 5,
      "faciliteiten": [
        "fas fa-tv",
        "fas fa-wifi",
        "fas fa-wheelchair"
      ],
      "patient": null,
      "x": 450,
      "y": 500,
      "width": 550,
      "height": 250,
      "hulpIngeroepen": false
    },
    {
      "id": 503,
      "afdelingId": 5,
      "faciliteiten": [
        "fas fa-tv",
        "fas fa-wifi",
        "fas fa-wheelchair",
        "fas fa-baby-carriage"
      ],
      "patient": 17,
      "x": 1000,
      "y": 500,
      "width": 350,
      "height": 250,
      "hulpIngeroepen": false
    },
    {
      "id": 504,
      "afdelingId": 5,
      "faciliteiten": [
        "fas fa-tv",
        "fas fa-wifi"
      ],
      "patient": null,
      "x": 1100,
      "y": 350,
      "width": 250,
      "height": 150,
      "hulpIngeroepen": false
    },
    {
      "id": 505,
      "afdelingId": 5,
      "faciliteiten": [
        "fas fa-baby-carriage",
        "fas fa-tv",
        "fas fa-wifi",
        "fas fa-wheelchair"
      ],
      "patient": 18,
      "x": 1100,
      "y": 0,
      "width": 250,
      "height": 350,
      "hulpIngeroepen": false
    }
  ],
  "patienten": [
    {
      "id": 1,
      "naam": "Issam El Nasiri",
      "foto": "issam.jpg",
      "hartslag": 56,
      "bloeddruk": 23,
      "datumOpname": "23/12/2019",
      "redenOpname": "Ziekte",
      "arts": "Peter Verstoppen",
      "Vegetarisch": false,
      "opmerkingen": [
        "test"
      ]
    },
    {
      "id": 2,
      "naam": "Suraya van der Eerden",
      "foto": "suraya.jpg",
      "hartslag": 30,
      "bloeddruk": 23,
      "datumOpname": "test",
      "redenOpname": "Breuken na vechtpartij",
      "arts": "Jan De Ridder",
      "Vegetarisch": false,
      "opmerkingen": [
        "allergisch aan katten"
      ]
    },
    {
      "id": 3,
      "naam": "Ophélie Van Der Meiren",
      "foto": "ophelie.jpg",
      "hartslag": 55,
      "bloeddruk": 50,
      "datumOpname": "21/11/2019",
      "redenOpname": "Ongeval met de brommer",
      "arts": "Jan De Ridder",
      "Vegetarisch": false,
      "opmerkingen": []
    },
    {
      "id": 4,
      "naam": "Lieselot Decoster",
      "foto": "lieselot.jpg",
      "hartslag": 85,
      "bloeddruk": 23,
      "datumOpname": "31/12/2019",
      "redenOpname": "2de graads brandwonden",
      "arts": "Lieve Ridder",
      "Vegetarisch": true,
      "opmerkingen": []
    },
    {
      "id": 5,
      "naam": "Ricky Lort",
      "foto": "ricky.jpg",
      "hartslag": 65,
      "bloeddruk": 36,
      "datumOpname": "30/12/2019",
      "redenOpname": "Val van balkon",
      "arts": "Lieve Ridder",
      "Vegetarisch": false,
      "opmerkingen": [
        "Eerder in het ziekenhuis gelegen voor rugklachten"
      ]
    },
    {
      "id": 6,
      "naam": "Tara Selma",
      "foto": "tara.jpg",
      "hartslag": 50,
      "bloeddruk": 53,
      "datumOpname": "29/12/2019",
      "redenOpname": "slachtoffer van zinloos geweld",
      "arts": "Lieve Ridder",
      "Vegetarisch": true,
      "opmerkingen": [
        "Heeft Melkallergie"
      ]
    },
    {
      "id": 7,
      "naam": "Peter Klopper",
      "foto": "peter.jpg",
      "hartslag": 78,
      "bloeddruk": 67,
      "datumOpname": "29/12/2019",
      "redenOpname": "Aangevallen door Wolf",
      "arts": "Peter Verstoppen",
      "Vegetarisch": false,
      "opmerkingen": []
    },
    {
      "id": 8,
      "naam": "Ariane Van Damme",
      "foto": "ariane.png",
      "hartslag": 90,
      "bloeddruk": 88,
      "datumOpname": "30/12/2019",
      "redenOpname": "Aangevallen door agent",
      "arts": "Peter Verstoppen",
      "Vegetarisch": false,
      "opmerkingen": []
    },
    {
      "id": 9,
      "naam": "Lily Veria",
      "foto": "lily.png",
      "hartslag": 50,
      "bloeddruk": 65,
      "datumOpname": "28/12/2019",
      "redenOpname": "Ziekte",
      "arts": "Peter Verstoppen",
      "Vegetarisch": false,
      "opmerkingen": []
    },
    {
      "id": 10,
      "naam": "René Lirao",
      "foto": "rené.jpg",
      "hartslag": 50,
      "bloeddruk": 65,
      "datumOpname": "26/12/2019",
      "redenOpname": "Ziekte",
      "arts": "Peter Verstoppen",
      "Vegetarisch": false,
      "opmerkingen": [
        "Alleenstaand"
      ]
    },
    {
      "id": 11,
      "naam": "Henno Loker",
      "foto": "henno.png",
      "hartslag": 35,
      "bloeddruk": 52,
      "datumOpname": "30/12/2019",
      "redenOpname": "Boom gevallen op hem",
      "arts": "Peter Verstoppen",
      "Vegetarisch": false,
      "opmerkingen": [
        "Spreekt alleen Engels"
      ]
    },
    {
      "id": 12,
      "naam": "Dina De Loof",
      "foto": "dina.jpg",
      "hartslag": 45,
      "bloeddruk": 61,
      "datumOpname": "31/12/2019",
      "redenOpname": "Blikseminslag op slachtoffer",
      "arts": "Peter Verstoppen",
      "Vegetarisch": true,
      "opmerkingen": []
    },
    {
      "id": 13,
      "naam": "Carolien Plas",
      "foto": "carolien.jpg",
      "hartslag": 25,
      "bloeddruk": 42,
      "datumOpname": "31/12/2019",
      "redenOpname": "Ongeval",
      "arts": "Peter Verstoppen",
      "Vegetarisch": false,
      "opmerkingen": []
    },
    {
      "id": 14,
      "naam": "Yasmine Desramaut",
      "foto": "yasmine.jpg",
      "hartslag": 36,
      "bloeddruk": 51,
      "datumOpname": "31/12/2019",
      "redenOpname": "Ziekte",
      "arts": "Peter Verstoppen",
      "Vegetarisch": false,
      "opmerkingen": []
    },
    {
      "id": 15,
      "naam": "Kato De Smedt",
      "foto": "kato.jpg",
      "hartslag": 71,
      "bloeddruk": 63,
      "datumOpname": "31/12/2019",
      "redenOpname": "Ziekte",
      "arts": "Peter Verstoppen",
      "Vegetarisch": true,
      "opmerkingen": []
    },
    {
      "id": 16,
      "naam": "Steffie Fremault",
      "foto": "steffie.jpeg",
      "hartslag": 45,
      "bloeddruk": 23,
      "datumOpname": "15/12/2019",
      "redenOpname": "Chronische Ziekte",
      "arts": "Peter Verstoppen",
      "Vegetarisch": true,
      "opmerkingen": [
        "hallo"
      ]
    },
    {
      "id": 17,
      "naam": "Nina Harnie",
      "foto": "nina.jpg",
      "hartslag": 45,
      "bloeddruk": 23,
      "datumOpname": "19/12/2019",
      "redenOpname": "Ongeval",
      "arts": "Peter Verstoppen",
      "Vegetarisch": true,
      "opmerkingen": []
    },
    {
      "id": 18,
      "naam": "Aline Declercq",
      "foto": "aline.jpg",
      "hartslag": 21,
      "bloeddruk": 86,
      "datumOpname": "17/12/2019",
      "redenOpname": "Slachtoffer zinloos geweld",
      "arts": "Peter Verstoppen",
      "Vegetarisch": false,
      "opmerkingen": []
    }
  ],
  "acties": [
    {
      "id": 1,
      "type": "Medicatie",
      "omschrijving": "Zorgt ervoor dat je beter wordt",
      "tijdstip": "2019-12-27 16:30",
      "uitgevoerd": true,
      "patientId": 1
    },
    {
      "id": 2,
      "type": "Infuus",
      "omschrijving": "doet pijn",
      "tijdstip": "2019-12-27 14:45",
      "uitgevoerd": true,
      "patientId": 1
    },
    {
      "id": 4,
      "type": "infuus",
      "omschrijving": "doet pijn",
      "tijdstip": "2019-12-28 21:10",
      "uitgevoerd": true,
      "patientId": 2
    },
    {
      "id": 5,
      "type": "Injectie",
      "omschrijving": "Pijn verminderen",
      "tijdstip": "2019-11-23 02:10",
      "uitgevoerd": true,
      "patientId": 3
    },
    {
      "id": 6,
      "type": "Medicatie",
      "omschrijving": "",
      "tijdstip": "2019-12-31 00:10",
      "uitgevoerd": true,
      "patientId": 4
    },
    {
      "id": 7,
      "type": "Infuus",
      "omschrijving": "",
      "tijdstip": "2019-12-31 02:10",
      "uitgevoerd": true,
      "patientId": 4
    },
    {
      "id": 8,
      "type": "Infuus",
      "omschrijving": "",
      "tijdstip": "2019-12-31 14:10",
      "uitgevoerd": true,
      "patientId": 5
    },
    {
      "id": 9,
      "type": "Medicatie",
      "omschrijving": "",
      "tijdstip": "2019-12-29 10:38",
      "uitgevoerd": false,
      "patientId": 6
    },
    {
      "id": 10,
      "type": "Medicatie",
      "omschrijving": "",
      "tijdstip": "2019-12-29 10:38",
      "uitgevoerd": true,
      "patientId": 7
    },
    {
      "id": 11,
      "type": "Infuus",
      "omschrijving": "",
      "tijdstip": "2019-12-30 18:18",
      "uitgevoerd": true,
      "patientId": 7
    },
    {
      "id": 12,
      "type": "Omkeren",
      "omschrijving": "heeft nog steeds last en kan het zelf niet",
      "tijdstip": "2019-12-30 22:45",
      "uitgevoerd": true,
      "patientId": 7
    },
    {
      "id": 13,
      "type": "Eten",
      "omschrijving": "",
      "tijdstip": "2019-12-31 17:20",
      "uitgevoerd": false,
      "patientId": 7
    },
    {
      "id": 14,
      "type": "Medicatie",
      "omschrijving": "",
      "tijdstip": "2019-12-31 11:12",
      "uitgevoerd": true,
      "patientId": 8
    },
    {
      "id": 15,
      "type": "Medicatie",
      "omschrijving": "",
      "tijdstip": "2019-12-29 01:30",
      "uitgevoerd": true,
      "patientId": 9
    },
    {
      "id": 16,
      "type": "Infuus",
      "omschrijving": "",
      "tijdstip": "2019-12-31 20:05",
      "uitgevoerd": false,
      "patientId": 9
    },
    {
      "id": 17,
      "type": "Medicatie",
      "omschrijving": "",
      "tijdstip": "2019-12-28 07:55",
      "uitgevoerd": true,
      "patientId": 10
    },
    {
      "id": 18,
      "type": "Infuus",
      "omschrijving": "",
      "tijdstip": "2019-12-29 19:25",
      "uitgevoerd": true,
      "patientId": 10
    },
    {
      "id": 19,
      "type": "Wassen",
      "omschrijving": "kan haar armen niet meer bewegen",
      "tijdstip": "2019-12-31 22:05",
      "uitgevoerd": false,
      "patientId": 10
    },
    {
      "id": 20,
      "type": "Infuus",
      "omschrijving": "",
      "tijdstip": "2019-12-30 01:25",
      "uitgevoerd": true,
      "patientId": 11
    },
    {
      "id": 21,
      "type": "Infuus",
      "omschrijving": "",
      "tijdstip": "2019-12-30 17:58",
      "uitgevoerd": true,
      "patientId": 11
    },
    {
      "id": 22,
      "type": "Omkeren",
      "omschrijving": "kan moeilijk draaien",
      "tijdstip": "2019-12-31 19:05",
      "uitgevoerd": true,
      "patientId": 11
    },
    {
      "id": 23,
      "type": "Eten",
      "omschrijving": "",
      "tijdstip": "2019-12-31 01:25",
      "uitgevoerd": true,
      "patientId": 12
    },
    {
      "id": 24,
      "type": "Omkeren",
      "omschrijving": "",
      "tijdstip": "2019-12-31 11:25",
      "uitgevoerd": true,
      "patientId": 13
    },
    {
      "id": 25,
      "type": "Wassen",
      "omschrijving": "Hygiëne is belangrijk",
      "tijdstip": "2019-12-31 20:25",
      "uitgevoerd": true,
      "patientId": 13
    },
    {
      "id": 26,
      "type": "Medicatie",
      "omschrijving": "",
      "tijdstip": "2019-12-31 12:20",
      "uitgevoerd": true,
      "patientId": 14
    },
    {
      "id": 27,
      "type": "Eten",
      "omschrijving": "",
      "tijdstip": "2019-12-31 19:25",
      "uitgevoerd": true,
      "patientId": 14
    },
    {
      "id": 28,
      "type": "Medicatie",
      "omschrijving": "",
      "tijdstip": "2019-12-31 12:20",
      "uitgevoerd": true,
      "patientId": 15
    },
    {
      "id": 29,
      "type": "Wassen",
      "omschrijving": "",
      "tijdstip": "2020-01-04 16:45",
      "uitgevoerd": false,
      "patientId": 15
    },
    {
      "id": 30,
      "type": "Eten",
      "omschrijving": "",
      "tijdstip": "2020-01-01 15:15",
      "uitgevoerd": false,
      "patientId": 15
    },
    {
      "type": "Eten",
      "omschrijving": "sdfdsfdsfsdf",
      "tijdstip": "2020-01-04 22:15",
      "uitgevoerd": false,
      "patientId": "4",
      "id": 31
    },
    {
      "type": "Eten",
      "omschrijving": "",
      "tijdstip": "2020-01-17 22:50",
      "uitgevoerd": true,
      "patientId": "17",
      "id": 34
    },
    {
      "type": "Eten",
      "omschrijving": "test",
      "tijdstip": "2020-01-04 20:44",
      "uitgevoerd": false,
      "patientId": "5",
      "id": 35
    },
    {
      "type": "Eten",
      "omschrijving": "test",
      "tijdstip": "2020-01-04 21:29",
      "uitgevoerd": false,
      "patientId": "16",
      "id": 36
    },
    {
      "type": "Omkeren",
      "omschrijving": "test 2",
      "tijdstip": "2020-01-05 14:46",
      "uitgevoerd": false,
      "patientId": "1",
      "id": 38
    }
  ]
}