<?xml version="1.0" encoding="UTF-8" standalone="no"?>
<!-- Created with Inkscape (http://www.inkscape.org/) -->

<svg
   width="48"
   height="48"
   viewBox="0 0 12.7 12.7"
   version="1.1"
   id="svg962"
   xmlns="http://www.w3.org/2000/svg"
   xmlns:svg="http://www.w3.org/2000/svg">
  <defs
     id="defs959" />
  <g
     id="layer1"
     transform="translate(-69.666127,-73.111577)">
    <g
       id="g1559">
      <rect
         style="font-variation-settings:'wght' 400;fill:none;stroke:#ffffff;stroke-width:0.261511;stroke-linecap:round;stroke-opacity:1"
         id="rect1498"
         width="12.438489"
         height="12.438489"
         x="69.796883"
         y="73.242332" />
      <text
         xml:space="preserve"
         style="font-style:normal;font-variant:normal;font-weight:normal;font-stretch:normal;font-size:11.2889px;line-height:1.25;font-family:'Noto Nastaliq Urdu';-inkscape-font-specification:'Noto Nastaliq Urdu, Normal';font-variant-ligatures:normal;font-variant-caps:normal;font-variant-numeric:normal;font-variant-east-asian:normal;fill:#fcfbfb;fill-opacity:1;stroke:none;stroke-width:0.264583"
         x="72.509377"
         y="81.730644"
         id="text1554"><tspan
           id="tspan1552"
           style="font-style:normal;font-variant:normal;font-weight:normal;font-stretch:normal;font-size:11.2889px;font-family:'Noto Nastaliq Urdu';-inkscape-font-specification:'Noto Nastaliq Urdu, Normal';font-variant-ligatures:normal;font-variant-caps:normal;font-variant-numeric:normal;font-variant-east-asian:normal;fill:#fcfbfb;stroke-width:0.264583"
           x="72.509377"
           y="81.730644">ع</tspan></text>
    </g>
  </g>
</svg>
