(;GM[1]FF[4]AP[Drago:4.23]CA[UTF-8]SZ[9]AB[aa][ab][ac][bc][cb][ca][ba][cc][ga][gb][gc][gd][ge][gf][hf][if]
[af][bf][cf][df][dg][dh][di]AW[da][db][dc][cd][dd][bd][ad][ha][hb][hc][hd][he][ie][ib][ic][ag]
[bg][cg][ch][ci][bi][ah][ai]C[Remember, you must not place a stone that would have none, or occupy the last liberty of your group, unless you capture something by that move.]LB[bh:D];B[bh]TE[1])
