(;GM[1]FF[4]AP[Drago:4.23]CA[UTF-8]SZ[13]C[And some examples of 4 stones shapes is as far as I will go. There are much more though.]AB[jj][kj][kh][cd][cc][dc]LB[dd:A][ki:B][ih:D][ii:E][jh:C]
(;B[dd]C[This is the only move that is even worse than an empty triangle. It is basically two empty triangles combined. We call it a dumpling. Because it gets eaten.])
(;B[ki]SQ[jj][kj][ki]C[Nah, not too good.
You basically just created an extended empty triangle.Do not imagine shapes separately. They are usually mixed up and combined with other stones, but are still there.])
(;B[jh]C[A bamboo joint.
This is a very strong shape for connections. These stones cannot possibly be separated. Not that good if you are trying to create an eye though.])
(;B[ih]C[A table shape. Very strong and robust shape. Good in fights.])
(;B[ii]C[Sometimes called J-shape. If there are stones around and you need to protect your cuts (and only then) it can be a very strong move.]))
