(;GM[1]FF[4]AP[Drago:4.23]CA[UTF-8]SZ[9]AB[cd][cc][dc][ec][fd][fe][ff][gc][ef]AW[dd][ed][ce][cf][df][be][dg][bg]C[Capture the two white stones.]
(;B[ee]
;W[de]C[Ummmmm, no.])
(;B[de]
;W[ee]C[Ahaaaa, white captured your stone. But does that help her/him in any way?];B[de]TE[1]C[No. No it doesn't help white in any way. Very good.
<br><a class="puzzleNext" onclick="loadTsumego('11-2','pzl2',tsumego)">Next puzzle</a>]))
