(;GM[1]FF[4]AP[Drago:4.23]CA[UTF-8]SZ[9]AW[dd][cd][bc][cf][fc][gc][hd][id][hb][df][ef][eg]AB[dc][ed][fe][ge][he][dg][cg][fg][ff][eh][bg]C[Prevent White from separating ANY of your stones from the rest.]
(;B[ec];W[ee]
(;B[fd];W[dh]
(;B[fh]C[Perfect. All your stones remain safely connected.]TE[1])
(;B[ch]MA[dh]C[Perfect. All your stones remain safely connected.]TE[1]))
(;B[dh];W[fd])
(;B[fh];W[fd]))
(;B[fd];W[ec])
(;B[dh];W[ec])
(;B[fh];W[ec])
(;B[ee];W[ec]))
