(;GM[1]FF[4]AP[Drago:4.23]CA[UTF-8]SZ[9]AB[ee][eg][ge][fc][df][gd][cf]AW[ce][cg][dc][ec][fd][fb][bf]LB[fb:1][ec:2][fd:3]C[This is just a simple case of locating the stone or group with a single remaining liberty. If you can't see it, don't worry, it is a developed skill.

Three liberties out of four are already taken. All Black needs to do to survive is connect to his remaining stones.];B[gc]TE[1])
