[gd_scene load_steps=4 format=2]

[ext_resource path="res://arena/ball.gd" type="Script" id=1]

[sub_resource type="CircleShape2D" id=1]

[sub_resource type="GDScript" id=2]
script/source = "extends CollisionShape2D

func _draw():
	draw_circle(Vector2.ZERO, 10, Color(0.972656, 0.129454, 0.129454))
"

[node name="Ball" type="KinematicBody2D"]
script = ExtResource( 1 )
__meta__ = {
"_edit_group_": true
}

[node name="BallShape" type="CollisionShape2D" parent="."]
shape = SubResource( 1 )
script = SubResource( 2 )
