[gd_scene load_steps=2 format=2]

[ext_resource path="res://levels/level_template.tscn" type="PackedScene" id=1]

[node name="Level3" instance=ExtResource( 1 )]

[node name="Line" parent="." index="0"]
points = PoolVector2Array( 64, 40, 168, 80, 232, 56, 376, 40, 488, 40, 688, 16, 712, 192, 733, 460.8, 504, 480, 384, 488, 208, 488, 56, 328, 24, 152 )

[node name="BackgroundShape" parent="Layout" index="0"]
position = Vector2( -408, -136 )
color = Color( 0.611765, 0.843137, 0.882353, 1 )
polygon = PoolVector2Array( 481, 120.8, 580.416, 115.981, 654.198, 134.294, 674.6, 240.8, 664.035, 415.09, 639.441, 451.715, 580.416, 482.237, 422.145, 460.808, 365.8, 378.4, 323.4, 235.2, 339.396, 152.607, 403.34, 134.294 )
