<?xml version="1.0" encoding="UTF-8" standalone="no"?>
<!DOCTYPE svg PUBLIC "-//W3C//DTD SVG 1.1//EN" "http://www.w3.org/Graphics/SVG/1.1/DTD/svg11.dtd">
<svg width="100%" height="100%" viewBox="780 850 1100 1100" version="1.1" xmlns="http://www.w3.org/2000/svg" xmlns:xlink="http://www.w3.org/1999/xlink" xml:space="preserve" style="fill-rule:evenodd;clip-rule:evenodd;stroke-linecap:round;stroke-linejoin:round;stroke-miterlimit:1.5;">
    <g transform="matrix(1.24342,0,0,1.14276,-529.759,-115.638)">
        <ellipse cx="1601.25" cy="1176.44" rx="132.244" ry="132.57" style="fill:none;stroke:rgb(35,31,32);stroke-width:64.89px;"/>
    </g>
    <g transform="matrix(1,0,0,1,6.09973,-4.92472)">
        <path d="M1214.15,1281.38C1214.15,1281.38 1266.49,1381.71 1302.75,1451.23C1324.1,1492.15 1324.88,1540.75 1304.85,1582.34C1267.2,1660.49 1209.59,1780.1 1209.59,1780.1C1209.59,1780.1 1161.59,1686.33 1123.15,1611.22C1093.78,1553.85 1095.6,1485.49 1127.96,1429.76C1167.13,1362.32 1214.15,1281.38 1214.15,1281.38Z"/>
    </g>
    <g transform="matrix(0.997728,0,0,0.874016,282.138,154.135)">
        <ellipse cx="705.032" cy="1216.55" rx="146.556" ry="238.964" style="fill:none;stroke:rgb(35,31,32);stroke-width:82.62px;"/>
    </g>
    <g transform="matrix(2.25062,0,0,2.01121,-1239.78,-1254.05)">
        <ellipse cx="997.17" cy="1238.88" rx="26.787" ry="28.794"/>
    </g>
    <g transform="matrix(1.63553,0,0,2.12704,-960.969,-1397.44)">
        <ellipse cx="1460.08" cy="1251.33" rx="33.8" ry="25.855"/>
    </g>
</svg>
