{
    "scripts": [
        "create path (sling:OrderedFolder) /content/dam/we-train",
        "create path (nt:unstructured) /content/dam/we-train/jcr:content",
        "set properties on /content/dam/we-train/jcr:content\n  set cq:conf{String} to /conf/we-train\n  set jcr:title{String} to \"We.Train\"\nend"
    ]
}
