﻿Shared by Namvi.Net

. Xem thêm các tài liệu, giáo trình, ebook, phần mềm, phim truyện... trên trang
. Download/Online hoàn toàn miễn phí.

--------------------------------------------------------------------------
Thư viện số 1 Việt Nam, http://www.namvi.net
Copyright (c) 2014 Namvi Libraries, https://plus.google.com/+NamviNet9x