{"frames": {

"bannerHanging.png":
{
	"frame": {"x":5,"y":5,"w":268,"h":59},
	"rotated": false,
	"trimmed": false,
	"spriteSourceSize": {"x":0,"y":0,"w":268,"h":59},
	"sourceSize": {"w":268,"h":59}
},
"bannerModern.png":
{
	"frame": {"x":278,"y":5,"w":264,"h":50},
	"rotated": false,
	"trimmed": false,
	"spriteSourceSize": {"x":0,"y":0,"w":264,"h":50},
	"sourceSize": {"w":264,"h":50}
},
"bannerScroll.png":
{
	"frame": {"x":5,"y":69,"w":261,"h":63},
	"rotated": false,
	"trimmed": false,
	"spriteSourceSize": {"x":0,"y":0,"w":261,"h":63},
	"sourceSize": {"w":261,"h":63}
},
"button_metalBlank.png":
{
	"frame": {"x":536,"y":469,"w":24,"h":24},
	"rotated": false,
	"trimmed": false,
	"spriteSourceSize": {"x":0,"y":0,"w":24,"h":24},
	"sourceSize": {"w":24,"h":24}
},
"button_metalCircle.png":
{
	"frame": {"x":565,"y":469,"w":24,"h":24},
	"rotated": false,
	"trimmed": false,
	"spriteSourceSize": {"x":0,"y":0,"w":24,"h":24},
	"sourceSize": {"w":24,"h":24}
},
"button_metalClose.png":
{
	"frame": {"x":284,"y":469,"w":24,"h":24},
	"rotated": false,
	"trimmed": false,
	"spriteSourceSize": {"x":0,"y":0,"w":24,"h":24},
	"sourceSize": {"w":24,"h":24}
},
"button_rectangleMetal.png":
{
	"frame": {"x":199,"y":472,"w":40,"h":20},
	"rotated": false,
	"trimmed": false,
	"spriteSourceSize": {"x":0,"y":0,"w":40,"h":20},
	"sourceSize": {"w":40,"h":20}
},
"button_rectangleMetalClose.png":
{
	"frame": {"x":536,"y":419,"w":40,"h":20},
	"rotated": false,
	"trimmed": false,
	"spriteSourceSize": {"x":0,"y":0,"w":40,"h":20},
	"sourceSize": {"w":40,"h":20}
},
"button_rectangleRed.png":
{
	"frame": {"x":728,"y":350,"w":40,"h":20},
	"rotated": false,
	"trimmed": false,
	"spriteSourceSize": {"x":0,"y":0,"w":40,"h":20},
	"sourceSize": {"w":40,"h":20}
},
"button_rectangleRedClose.png":
{
	"frame": {"x":536,"y":444,"w":40,"h":20},
	"rotated": false,
	"trimmed": false,
	"spriteSourceSize": {"x":0,"y":0,"w":40,"h":20},
	"sourceSize": {"w":40,"h":20}
},
"button_rectangleWood.png":
{
	"frame": {"x":581,"y":419,"w":40,"h":20},
	"rotated": false,
	"trimmed": false,
	"spriteSourceSize": {"x":0,"y":0,"w":40,"h":20},
	"sourceSize": {"w":40,"h":20}
},
"button_rectangleWoodClose.png":
{
	"frame": {"x":728,"y":375,"w":40,"h":20},
	"rotated": false,
	"trimmed": false,
	"spriteSourceSize": {"x":0,"y":0,"w":40,"h":20},
	"sourceSize": {"w":40,"h":20}
},
"button_woodBlank.png":
{
	"frame": {"x":313,"y":469,"w":24,"h":24},
	"rotated": false,
	"trimmed": false,
	"spriteSourceSize": {"x":0,"y":0,"w":24,"h":24},
	"sourceSize": {"w":24,"h":24}
},
"button_woodCircle.png":
{
	"frame": {"x":342,"y":469,"w":24,"h":24},
	"rotated": false,
	"trimmed": false,
	"spriteSourceSize": {"x":0,"y":0,"w":24,"h":24},
	"sourceSize": {"w":24,"h":24}
},
"button_woodClose.png":
{
	"frame": {"x":371,"y":469,"w":24,"h":24},
	"rotated": false,
	"trimmed": false,
	"spriteSourceSize": {"x":0,"y":0,"w":24,"h":24},
	"sourceSize": {"w":24,"h":24}
},
"button_woodPaperBlank.png":
{
	"frame": {"x":594,"y":469,"w":24,"h":24},
	"rotated": false,
	"trimmed": false,
	"spriteSourceSize": {"x":0,"y":0,"w":24,"h":24},
	"sourceSize": {"w":24,"h":24}
},
"button_woodPaperCircle.png":
{
	"frame": {"x":728,"y":400,"w":24,"h":24},
	"rotated": false,
	"trimmed": false,
	"spriteSourceSize": {"x":0,"y":0,"w":24,"h":24},
	"sourceSize": {"w":24,"h":24}
},
"button_woodPaperClose.png":
{
	"frame": {"x":725,"y":429,"w":24,"h":24},
	"rotated": false,
	"trimmed": false,
	"spriteSourceSize": {"x":0,"y":0,"w":24,"h":24},
	"sourceSize": {"w":24,"h":24}
},
"hexagon_metal.png":
{
	"frame": {"x":486,"y":129,"w":52,"h":64},
	"rotated": false,
	"trimmed": false,
	"spriteSourceSize": {"x":0,"y":0,"w":52,"h":64},
	"sourceSize": {"w":52,"h":64}
},
"hexagon_metalDark.png":
{
	"frame": {"x":486,"y":198,"w":52,"h":64},
	"rotated": false,
	"trimmed": false,
	"spriteSourceSize": {"x":0,"y":0,"w":52,"h":64},
	"sourceSize": {"w":52,"h":64}
},
"hexagon_metalGreen.png":
{
	"frame": {"x":486,"y":267,"w":52,"h":64},
	"rotated": false,
	"trimmed": false,
	"spriteSourceSize": {"x":0,"y":0,"w":52,"h":64},
	"sourceSize": {"w":52,"h":64}
},
"hexagon_metalRed.png":
{
	"frame": {"x":422,"y":405,"w":52,"h":64},
	"rotated": false,
	"trimmed": false,
	"spriteSourceSize": {"x":0,"y":0,"w":52,"h":64},
	"sourceSize": {"w":52,"h":64}
},
"hexagon_wood.png":
{
	"frame": {"x":479,"y":405,"w":52,"h":64},
	"rotated": false,
	"trimmed": false,
	"spriteSourceSize": {"x":0,"y":0,"w":52,"h":64},
	"sourceSize": {"w":52,"h":64}
},
"hexagon_woodPaper.png":
{
	"frame": {"x":536,"y":350,"w":52,"h":64},
	"rotated": false,
	"trimmed": false,
	"spriteSourceSize": {"x":0,"y":0,"w":52,"h":64},
	"sourceSize": {"w":52,"h":64}
},
"hexagon_woodPaperWear.png":
{
	"frame": {"x":593,"y":350,"w":52,"h":64},
	"rotated": false,
	"trimmed": false,
	"spriteSourceSize": {"x":0,"y":0,"w":52,"h":64},
	"sourceSize": {"w":52,"h":64}
},
"hexagon_woodWear.png":
{
	"frame": {"x":650,"y":350,"w":52,"h":64},
	"rotated": false,
	"trimmed": false,
	"spriteSourceSize": {"x":0,"y":0,"w":52,"h":64},
	"sourceSize": {"w":52,"h":64}
},
"minimapDirection_E.png":
{
	"frame": {"x":244,"y":472,"w":16,"h":21},
	"rotated": false,
	"trimmed": false,
	"spriteSourceSize": {"x":0,"y":0,"w":16,"h":21},
	"sourceSize": {"w":16,"h":21}
},
"minimapDirection_N.png":
{
	"frame": {"x":174,"y":472,"w":20,"h":21},
	"rotated": false,
	"trimmed": false,
	"spriteSourceSize": {"x":0,"y":0,"w":20,"h":21},
	"sourceSize": {"w":20,"h":21}
},
"minimapDirection_S.png":
{
	"frame": {"x":400,"y":469,"w":17,"h":22},
	"rotated": false,
	"trimmed": false,
	"spriteSourceSize": {"x":0,"y":0,"w":17,"h":22},
	"sourceSize": {"w":17,"h":22}
},
"minimapDirection_W.png":
{
	"frame": {"x":143,"y":472,"w":26,"h":21},
	"rotated": false,
	"trimmed": false,
	"spriteSourceSize": {"x":0,"y":0,"w":26,"h":21},
	"sourceSize": {"w":26,"h":21}
},
"minimapIcon_arrowA.png":
{
	"frame": {"x":443,"y":474,"w":16,"h":16},
	"rotated": false,
	"trimmed": false,
	"spriteSourceSize": {"x":0,"y":0,"w":16,"h":16},
	"sourceSize": {"w":16,"h":16}
},
"minimapIcon_arrowB.png":
{
	"frame": {"x":422,"y":474,"w":16,"h":18},
	"rotated": false,
	"trimmed": false,
	"spriteSourceSize": {"x":0,"y":0,"w":16,"h":18},
	"sourceSize": {"w":16,"h":18}
},
"minimapIcon_arrowC.png":
{
	"frame": {"x":826,"y":110,"w":12,"h":16},
	"rotated": false,
	"trimmed": false,
	"spriteSourceSize": {"x":0,"y":0,"w":12,"h":16},
	"sourceSize": {"w":12,"h":16}
},
"minimapIcon_arrowD.png":
{
	"frame": {"x":464,"y":474,"w":16,"h":16},
	"rotated": false,
	"trimmed": false,
	"spriteSourceSize": {"x":0,"y":0,"w":16,"h":16},
	"sourceSize": {"w":16,"h":16}
},
"minimapIcon_exclamationRed.png":
{
	"frame": {"x":832,"y":383,"w":6,"h":14},
	"rotated": false,
	"trimmed": false,
	"spriteSourceSize": {"x":0,"y":0,"w":6,"h":14},
	"sourceSize": {"w":6,"h":14}
},
"minimapIcon_exclamationWhite.png":
{
	"frame": {"x":832,"y":429,"w":6,"h":14},
	"rotated": false,
	"trimmed": false,
	"spriteSourceSize": {"x":0,"y":0,"w":6,"h":14},
	"sourceSize": {"w":6,"h":14}
},
"minimapIcon_exclamationYellow.png":
{
	"frame": {"x":785,"y":458,"w":6,"h":14},
	"rotated": false,
	"trimmed": false,
	"spriteSourceSize": {"x":0,"y":0,"w":6,"h":14},
	"sourceSize": {"w":6,"h":14}
},
"minimapIcon_jewelRed.png":
{
	"frame": {"x":265,"y":472,"w":14,"h":14},
	"rotated": false,
	"trimmed": false,
	"spriteSourceSize": {"x":0,"y":0,"w":14,"h":14},
	"sourceSize": {"w":14,"h":14}
},
"minimapIcon_jewelWhite.png":
{
	"frame": {"x":754,"y":439,"w":14,"h":14},
	"rotated": false,
	"trimmed": false,
	"spriteSourceSize": {"x":0,"y":0,"w":14,"h":14},
	"sourceSize": {"w":14,"h":14}
},
"minimapIcon_jewelYellow.png":
{
	"frame": {"x":773,"y":439,"w":14,"h":14},
	"rotated": false,
	"trimmed": false,
	"spriteSourceSize": {"x":0,"y":0,"w":14,"h":14},
	"sourceSize": {"w":14,"h":14}
},
"minimapIcon_starRed.png":
{
	"frame": {"x":813,"y":429,"w":14,"h":14},
	"rotated": false,
	"trimmed": false,
	"spriteSourceSize": {"x":0,"y":0,"w":14,"h":14},
	"sourceSize": {"w":14,"h":14}
},
"minimapIcon_starWhite.png":
{
	"frame": {"x":796,"y":454,"w":14,"h":14},
	"rotated": false,
	"trimmed": false,
	"spriteSourceSize": {"x":0,"y":0,"w":14,"h":14},
	"sourceSize": {"w":14,"h":14}
},
"minimapIcon_starYellow.png":
{
	"frame": {"x":815,"y":448,"w":14,"h":14},
	"rotated": false,
	"trimmed": false,
	"spriteSourceSize": {"x":0,"y":0,"w":14,"h":14},
	"sourceSize": {"w":14,"h":14}
},
"minimapMap_blank.png":
{
	"frame": {"x":146,"y":137,"w":128,"h":128},
	"rotated": false,
	"trimmed": false,
	"spriteSourceSize": {"x":0,"y":0,"w":128,"h":128},
	"sourceSize": {"w":128,"h":128}
},
"minimapMap_stone.png":
{
	"frame": {"x":5,"y":137,"w":136,"h":136},
	"rotated": false,
	"trimmed": false,
	"spriteSourceSize": {"x":0,"y":0,"w":136,"h":136},
	"sourceSize": {"w":136,"h":136}
},
"minimapMap_stoneRing.png":
{
	"frame": {"x":146,"y":270,"w":128,"h":128},
	"rotated": false,
	"trimmed": false,
	"spriteSourceSize": {"x":0,"y":0,"w":128,"h":128},
	"sourceSize": {"w":128,"h":128}
},
"minimapMap_wood.png":
{
	"frame": {"x":5,"y":278,"w":136,"h":136},
	"rotated": false,
	"trimmed": false,
	"spriteSourceSize": {"x":0,"y":0,"w":136,"h":136},
	"sourceSize": {"w":136,"h":136}
},
"minimapMap_woodRing.png":
{
	"frame": {"x":279,"y":60,"w":128,"h":128},
	"rotated": false,
	"trimmed": false,
	"spriteSourceSize": {"x":0,"y":0,"w":128,"h":128},
	"sourceSize": {"w":128,"h":128}
},
"panel_blueprintPaperWear.png":
{
	"frame": {"x":5,"y":419,"w":64,"h":64},
	"rotated": false,
	"trimmed": false,
	"spriteSourceSize": {"x":0,"y":0,"w":64,"h":64},
	"sourceSize": {"w":64,"h":64}
},
"panel_blueprintWear.png":
{
	"frame": {"x":279,"y":193,"w":64,"h":64},
	"rotated": false,
	"trimmed": false,
	"spriteSourceSize": {"x":0,"y":0,"w":64,"h":64},
	"sourceSize": {"w":64,"h":64}
},
"panel_boltsBlue.png":
{
	"frame": {"x":412,"y":60,"w":64,"h":64},
	"rotated": false,
	"trimmed": false,
	"spriteSourceSize": {"x":0,"y":0,"w":64,"h":64},
	"sourceSize": {"w":64,"h":64}
},
"panel_boltsDetail.png":
{
	"frame": {"x":74,"y":419,"w":64,"h":64},
	"rotated": false,
	"trimmed": false,
	"spriteSourceSize": {"x":0,"y":0,"w":64,"h":64},
	"sourceSize": {"w":64,"h":64}
},
"panel_boltsDetailSquare.png":
{
	"frame": {"x":279,"y":262,"w":64,"h":64},
	"rotated": false,
	"trimmed": false,
	"spriteSourceSize": {"x":0,"y":0,"w":64,"h":64},
	"sourceSize": {"w":64,"h":64}
},
"panel_boltsDetailSquare_blank.png":
{
	"frame": {"x":279,"y":331,"w":64,"h":64},
	"rotated": false,
	"trimmed": false,
	"spriteSourceSize": {"x":0,"y":0,"w":64,"h":64},
	"sourceSize": {"w":64,"h":64}
},
"panel_boltsGreen.png":
{
	"frame": {"x":481,"y":60,"w":64,"h":64},
	"rotated": false,
	"trimmed": false,
	"spriteSourceSize": {"x":0,"y":0,"w":64,"h":64},
	"sourceSize": {"w":64,"h":64}
},
"panel_boltsRed.png":
{
	"frame": {"x":348,"y":193,"w":64,"h":64},
	"rotated": false,
	"trimmed": false,
	"spriteSourceSize": {"x":0,"y":0,"w":64,"h":64},
	"sourceSize": {"w":64,"h":64}
},
"panel_metal.png":
{
	"frame": {"x":348,"y":262,"w":64,"h":64},
	"rotated": false,
	"trimmed": false,
	"spriteSourceSize": {"x":0,"y":0,"w":64,"h":64},
	"sourceSize": {"w":64,"h":64}
},
"panel_metalBlank.png":
{
	"frame": {"x":348,"y":331,"w":64,"h":64},
	"rotated": false,
	"trimmed": false,
	"spriteSourceSize": {"x":0,"y":0,"w":64,"h":64},
	"sourceSize": {"w":64,"h":64}
},
"panel_metalBlue.png":
{
	"frame": {"x":146,"y":403,"w":64,"h":64},
	"rotated": false,
	"trimmed": false,
	"spriteSourceSize": {"x":0,"y":0,"w":64,"h":64},
	"sourceSize": {"w":64,"h":64}
},
"panel_metalBolts.png":
{
	"frame": {"x":215,"y":403,"w":64,"h":64},
	"rotated": false,
	"trimmed": false,
	"spriteSourceSize": {"x":0,"y":0,"w":64,"h":64},
	"sourceSize": {"w":64,"h":64}
},
"panel_metalBoltsDark.png":
{
	"frame": {"x":284,"y":400,"w":64,"h":64},
	"rotated": false,
	"trimmed": false,
	"spriteSourceSize": {"x":0,"y":0,"w":64,"h":64},
	"sourceSize": {"w":64,"h":64}
},
"panel_metalDark.png":
{
	"frame": {"x":353,"y":400,"w":64,"h":64},
	"rotated": false,
	"trimmed": false,
	"spriteSourceSize": {"x":0,"y":0,"w":64,"h":64},
	"sourceSize": {"w":64,"h":64}
},
"panel_metalGreen.png":
{
	"frame": {"x":550,"y":5,"w":64,"h":64},
	"rotated": false,
	"trimmed": false,
	"spriteSourceSize": {"x":0,"y":0,"w":64,"h":64},
	"sourceSize": {"w":64,"h":64}
},
"panel_metalRed.png":
{
	"frame": {"x":619,"y":5,"w":64,"h":64},
	"rotated": false,
	"trimmed": false,
	"spriteSourceSize": {"x":0,"y":0,"w":64,"h":64},
	"sourceSize": {"w":64,"h":64}
},
"panel_wood.png":
{
	"frame": {"x":688,"y":5,"w":64,"h":64},
	"rotated": false,
	"trimmed": false,
	"spriteSourceSize": {"x":0,"y":0,"w":64,"h":64},
	"sourceSize": {"w":64,"h":64}
},
"panel_woodArrows.png":
{
	"frame": {"x":757,"y":5,"w":64,"h":64},
	"rotated": false,
	"trimmed": false,
	"spriteSourceSize": {"x":0,"y":0,"w":64,"h":64},
	"sourceSize": {"w":64,"h":64}
},
"panel_woodDetail.png":
{
	"frame": {"x":550,"y":74,"w":64,"h":64},
	"rotated": false,
	"trimmed": false,
	"spriteSourceSize": {"x":0,"y":0,"w":64,"h":64},
	"sourceSize": {"w":64,"h":64}
},
"panel_woodDetail_blank.png":
{
	"frame": {"x":757,"y":74,"w":64,"h":64},
	"rotated": false,
	"trimmed": false,
	"spriteSourceSize": {"x":0,"y":0,"w":64,"h":64},
	"sourceSize": {"w":64,"h":64}
},
"panel_woodDetailArrows.png":
{
	"frame": {"x":619,"y":74,"w":64,"h":64},
	"rotated": false,
	"trimmed": false,
	"spriteSourceSize": {"x":0,"y":0,"w":64,"h":64},
	"sourceSize": {"w":64,"h":64}
},
"panel_woodDetailSquare.png":
{
	"frame": {"x":688,"y":74,"w":64,"h":64},
	"rotated": false,
	"trimmed": false,
	"spriteSourceSize": {"x":0,"y":0,"w":64,"h":64},
	"sourceSize": {"w":64,"h":64}
},
"panel_woodPaper.png":
{
	"frame": {"x":417,"y":129,"w":64,"h":64},
	"rotated": false,
	"trimmed": false,
	"spriteSourceSize": {"x":0,"y":0,"w":64,"h":64},
	"sourceSize": {"w":64,"h":64}
},
"panel_woodPaperArrows.png":
{
	"frame": {"x":417,"y":198,"w":64,"h":64},
	"rotated": false,
	"trimmed": false,
	"spriteSourceSize": {"x":0,"y":0,"w":64,"h":64},
	"sourceSize": {"w":64,"h":64}
},
"panel_woodPaperDetail.png":
{
	"frame": {"x":417,"y":267,"w":64,"h":64},
	"rotated": false,
	"trimmed": false,
	"spriteSourceSize": {"x":0,"y":0,"w":64,"h":64},
	"sourceSize": {"w":64,"h":64}
},
"panel_woodPaperDetailArrows.png":
{
	"frame": {"x":543,"y":143,"w":64,"h":64},
	"rotated": false,
	"trimmed": false,
	"spriteSourceSize": {"x":0,"y":0,"w":64,"h":64},
	"sourceSize": {"w":64,"h":64}
},
"panel_woodPaperDetailSquare.png":
{
	"frame": {"x":612,"y":143,"w":64,"h":64},
	"rotated": false,
	"trimmed": false,
	"spriteSourceSize": {"x":0,"y":0,"w":64,"h":64},
	"sourceSize": {"w":64,"h":64}
},
"panel_woodPaperWear.png":
{
	"frame": {"x":681,"y":143,"w":64,"h":64},
	"rotated": false,
	"trimmed": false,
	"spriteSourceSize": {"x":0,"y":0,"w":64,"h":64},
	"sourceSize": {"w":64,"h":64}
},
"panel_woodWear.png":
{
	"frame": {"x":750,"y":143,"w":64,"h":64},
	"rotated": false,
	"trimmed": false,
	"spriteSourceSize": {"x":0,"y":0,"w":64,"h":64},
	"sourceSize": {"w":64,"h":64}
},
"panel_woodWear_blank.png":
{
	"frame": {"x":543,"y":212,"w":64,"h":64},
	"rotated": false,
	"trimmed": false,
	"spriteSourceSize": {"x":0,"y":0,"w":64,"h":64},
	"sourceSize": {"w":64,"h":64}
},
"pattern_blueprint.png":
{
	"frame": {"x":656,"y":452,"w":28,"h":28},
	"rotated": false,
	"trimmed": false,
	"spriteSourceSize": {"x":0,"y":0,"w":28,"h":28},
	"sourceSize": {"w":28,"h":28}
},
"pattern_blueprintPaper.png":
{
	"frame": {"x":689,"y":452,"w":28,"h":28},
	"rotated": false,
	"trimmed": false,
	"spriteSourceSize": {"x":0,"y":0,"w":28,"h":28},
	"sourceSize": {"w":28,"h":28}
},
"patternStripesMetal_large.png":
{
	"frame": {"x":773,"y":350,"w":28,"h":28},
	"rotated": false,
	"trimmed": false,
	"spriteSourceSize": {"x":0,"y":0,"w":28,"h":28},
	"sourceSize": {"w":28,"h":28}
},
"patternStripesMetal_small.png":
{
	"frame": {"x":806,"y":350,"w":28,"h":28},
	"rotated": false,
	"trimmed": false,
	"spriteSourceSize": {"x":0,"y":0,"w":28,"h":28},
	"sourceSize": {"w":28,"h":28}
},
"patternStripesRed_large.png":
{
	"frame": {"x":626,"y":419,"w":28,"h":28},
	"rotated": false,
	"trimmed": false,
	"spriteSourceSize": {"x":0,"y":0,"w":28,"h":28},
	"sourceSize": {"w":28,"h":28}
},
"patternStripesRed_small.png":
{
	"frame": {"x":659,"y":419,"w":28,"h":28},
	"rotated": false,
	"trimmed": false,
	"spriteSourceSize": {"x":0,"y":0,"w":28,"h":28},
	"sourceSize": {"w":28,"h":28}
},
"patternStripesShadow_large.png":
{
	"frame": {"x":692,"y":419,"w":28,"h":28},
	"rotated": false,
	"trimmed": false,
	"spriteSourceSize": {"x":0,"y":0,"w":28,"h":28},
	"sourceSize": {"w":28,"h":28}
},
"patternStripesShadow_small.png":
{
	"frame": {"x":623,"y":452,"w":28,"h":28},
	"rotated": false,
	"trimmed": false,
	"spriteSourceSize": {"x":0,"y":0,"w":28,"h":28},
	"sourceSize": {"w":28,"h":28}
},
"progress.png":
{
	"frame": {"x":757,"y":400,"w":16,"h":34},
	"rotated": false,
	"trimmed": false,
	"spriteSourceSize": {"x":0,"y":0,"w":16,"h":34},
	"sourceSize": {"w":16,"h":34}
},
"progress_blue.png":
{
	"frame": {"x":826,"y":5,"w":12,"h":30},
	"rotated": false,
	"trimmed": false,
	"spriteSourceSize": {"x":0,"y":0,"w":12,"h":30},
	"sourceSize": {"w":12,"h":30}
},
"progress_blueBorder.png":
{
	"frame": {"x":722,"y":458,"w":16,"h":34},
	"rotated": false,
	"trimmed": false,
	"spriteSourceSize": {"x":0,"y":0,"w":16,"h":34},
	"sourceSize": {"w":16,"h":34}
},
"progress_blueBorderSmall.png":
{
	"frame": {"x":485,"y":474,"w":16,"h":16},
	"rotated": false,
	"trimmed": false,
	"spriteSourceSize": {"x":0,"y":0,"w":16,"h":16},
	"sourceSize": {"w":16,"h":16}
},
"progress_blueSmall.png":
{
	"frame": {"x":773,"y":383,"w":12,"h":12},
	"rotated": false,
	"trimmed": false,
	"spriteSourceSize": {"x":0,"y":0,"w":12,"h":12},
	"sourceSize": {"w":12,"h":12}
},
"progress_green.png":
{
	"frame": {"x":826,"y":40,"w":12,"h":30},
	"rotated": false,
	"trimmed": false,
	"spriteSourceSize": {"x":0,"y":0,"w":12,"h":30},
	"sourceSize": {"w":12,"h":30}
},
"progress_greenBorder.png":
{
	"frame": {"x":743,"y":458,"w":16,"h":34},
	"rotated": false,
	"trimmed": false,
	"spriteSourceSize": {"x":0,"y":0,"w":16,"h":34},
	"sourceSize": {"w":16,"h":34}
},
"progress_greenBorderSmall.png":
{
	"frame": {"x":506,"y":474,"w":16,"h":16},
	"rotated": false,
	"trimmed": false,
	"spriteSourceSize": {"x":0,"y":0,"w":16,"h":16},
	"sourceSize": {"w":16,"h":16}
},
"progress_greenSmall.png":
{
	"frame": {"x":785,"y":477,"w":12,"h":12},
	"rotated": false,
	"trimmed": false,
	"spriteSourceSize": {"x":0,"y":0,"w":12,"h":12},
	"sourceSize": {"w":12,"h":12}
},
"progress_red.png":
{
	"frame": {"x":826,"y":75,"w":12,"h":30},
	"rotated": false,
	"trimmed": false,
	"spriteSourceSize": {"x":0,"y":0,"w":12,"h":30},
	"sourceSize": {"w":12,"h":30}
},
"progress_redBorder.png":
{
	"frame": {"x":764,"y":458,"w":16,"h":34},
	"rotated": false,
	"trimmed": false,
	"spriteSourceSize": {"x":0,"y":0,"w":16,"h":34},
	"sourceSize": {"w":16,"h":34}
},
"progress_redBorderSmall.png":
{
	"frame": {"x":790,"y":383,"w":16,"h":16},
	"rotated": false,
	"trimmed": false,
	"spriteSourceSize": {"x":0,"y":0,"w":16,"h":16},
	"sourceSize": {"w":16,"h":16}
},
"progress_redSmall.png":
{
	"frame": {"x":802,"y":473,"w":12,"h":12},
	"rotated": false,
	"trimmed": false,
	"spriteSourceSize": {"x":0,"y":0,"w":12,"h":12},
	"sourceSize": {"w":12,"h":12}
},
"progress_small.png":
{
	"frame": {"x":811,"y":383,"w":16,"h":16},
	"rotated": false,
	"trimmed": false,
	"spriteSourceSize": {"x":0,"y":0,"w":16,"h":16},
	"sourceSize": {"w":16,"h":16}
},
"round_metal.png":
{
	"frame": {"x":612,"y":212,"w":64,"h":64},
	"rotated": false,
	"trimmed": false,
	"spriteSourceSize": {"x":0,"y":0,"w":64,"h":64},
	"sourceSize": {"w":64,"h":64}
},
"round_metalDark.png":
{
	"frame": {"x":681,"y":212,"w":64,"h":64},
	"rotated": false,
	"trimmed": false,
	"spriteSourceSize": {"x":0,"y":0,"w":64,"h":64},
	"sourceSize": {"w":64,"h":64}
},
"round_metalGreen.png":
{
	"frame": {"x":750,"y":212,"w":64,"h":64},
	"rotated": false,
	"trimmed": false,
	"spriteSourceSize": {"x":0,"y":0,"w":64,"h":64},
	"sourceSize": {"w":64,"h":64}
},
"round_metalRed.png":
{
	"frame": {"x":543,"y":281,"w":64,"h":64},
	"rotated": false,
	"trimmed": false,
	"spriteSourceSize": {"x":0,"y":0,"w":64,"h":64},
	"sourceSize": {"w":64,"h":64}
},
"round_wood.png":
{
	"frame": {"x":612,"y":281,"w":64,"h":64},
	"rotated": false,
	"trimmed": false,
	"spriteSourceSize": {"x":0,"y":0,"w":64,"h":64},
	"sourceSize": {"w":64,"h":64}
},
"round_woodPaper.png":
{
	"frame": {"x":681,"y":281,"w":64,"h":64},
	"rotated": false,
	"trimmed": false,
	"spriteSourceSize": {"x":0,"y":0,"w":64,"h":64},
	"sourceSize": {"w":64,"h":64}
},
"round_woodPaperWear.png":
{
	"frame": {"x":750,"y":281,"w":64,"h":64},
	"rotated": false,
	"trimmed": false,
	"spriteSourceSize": {"x":0,"y":0,"w":64,"h":64},
	"sourceSize": {"w":64,"h":64}
},
"round_woodWear.png":
{
	"frame": {"x":422,"y":336,"w":64,"h":64},
	"rotated": false,
	"trimmed": false,
	"spriteSourceSize": {"x":0,"y":0,"w":64,"h":64},
	"sourceSize": {"w":64,"h":64}
},
"scrollbar_barPoint.png":
{
	"frame": {"x":819,"y":143,"w":16,"h":64},
	"rotated": false,
	"trimmed": false,
	"spriteSourceSize": {"x":0,"y":0,"w":16,"h":64},
	"sourceSize": {"w":16,"h":64}
},
"scrollbar_barPointSmall.png":
{
	"frame": {"x":581,"y":444,"w":16,"h":20},
	"rotated": false,
	"trimmed": false,
	"spriteSourceSize": {"x":0,"y":0,"w":16,"h":20},
	"sourceSize": {"w":16,"h":20}
},
"scrollbar_barRound.png":
{
	"frame": {"x":819,"y":212,"w":16,"h":64},
	"rotated": false,
	"trimmed": false,
	"spriteSourceSize": {"x":0,"y":0,"w":16,"h":64},
	"sourceSize": {"w":16,"h":64}
},
"scrollbar_barRoundSmall.png":
{
	"frame": {"x":602,"y":444,"w":16,"h":20},
	"rotated": false,
	"trimmed": false,
	"spriteSourceSize": {"x":0,"y":0,"w":16,"h":20},
	"sourceSize": {"w":16,"h":20}
},
"scrollbar_metal.png":
{
	"frame": {"x":819,"y":281,"w":16,"h":64},
	"rotated": false,
	"trimmed": false,
	"spriteSourceSize": {"x":0,"y":0,"w":16,"h":64},
	"sourceSize": {"w":16,"h":64}
},
"scrollbar_metalRed.png":
{
	"frame": {"x":491,"y":336,"w":16,"h":64},
	"rotated": false,
	"trimmed": false,
	"spriteSourceSize": {"x":0,"y":0,"w":16,"h":64},
	"sourceSize": {"w":16,"h":64}
},
"scrollbar_metalRedSmall.png":
{
	"frame": {"x":778,"y":404,"w":16,"h":20},
	"rotated": false,
	"trimmed": false,
	"spriteSourceSize": {"x":0,"y":0,"w":16,"h":20},
	"sourceSize": {"w":16,"h":20}
},
"scrollbar_metalSmall.png":
{
	"frame": {"x":799,"y":404,"w":16,"h":20},
	"rotated": false,
	"trimmed": false,
	"spriteSourceSize": {"x":0,"y":0,"w":16,"h":20},
	"sourceSize": {"w":16,"h":20}
},
"scrollbar_stone.png":
{
	"frame": {"x":512,"y":336,"w":16,"h":64},
	"rotated": false,
	"trimmed": false,
	"spriteSourceSize": {"x":0,"y":0,"w":16,"h":64},
	"sourceSize": {"w":16,"h":64}
},
"scrollbar_stoneSmall.png":
{
	"frame": {"x":820,"y":404,"w":16,"h":20},
	"rotated": false,
	"trimmed": false,
	"spriteSourceSize": {"x":0,"y":0,"w":16,"h":20},
	"sourceSize": {"w":16,"h":20}
},
"scrollbar_wood.png":
{
	"frame": {"x":707,"y":350,"w":16,"h":64},
	"rotated": false,
	"trimmed": false,
	"spriteSourceSize": {"x":0,"y":0,"w":16,"h":64},
	"sourceSize": {"w":16,"h":64}
},
"scrollbar_woodSmall.png":
{
	"frame": {"x":792,"y":429,"w":16,"h":20},
	"rotated": false,
	"trimmed": false,
	"spriteSourceSize": {"x":0,"y":0,"w":16,"h":20},
	"sourceSize": {"w":16,"h":20}
}},
"meta": {
	"app": "https://www.codeandweb.com/texturepacker",
	"version": "1.0",
	"image": "interface_pack.png",
	"format": "RGBA8888",
	"size": {"w":843,"h":498},
	"scale": "1",
	"smartupdate": "$TexturePacker:SmartUpdate:431b5d12cbc0e77ad5a3fdf322be4174:dd9c34eb696497c3136ab6325a9ae744:1324ca0634553d886210897e1e46e388$"
}
}
