^D:\LAILIA\STUDIOOPENGL\CAMERA.CPP
/c /ID:\LAILIA\STUDIOOPENGL\/LIBRARIES/GLEW/INCLUDE/GL /ID:\LAILIA\STUDIOOPENGL\/LIBRARIES/GLFX/INCLUDE/ /ID:\LAILIA\STUDIOOPENGL\/LIBRARIES/ASSIMP/INCLUDE /ID:\LAILIA\STUDIOOPENGL\/LIBRARIES/GLM /ZI /JMC /nologo /W3 /WX- /diagnostics:column /sdl /Od /D _DEBUG /D _CONSOLE /D _UNICODE /D UNICODE /Gm- /EHsc /RTC1 /MDd /GS /fp:precise /permissive- /Zc:wchar_t /Zc:forScope /Zc:inline /Fo"X64\DEBUG\\" /Fd"X64\DEBUG\VC142.PDB" /Gd /TP /FC D:\LAILIA\STUDIOOPENGL\CAMERA.CPP
^D:\LAILIA\STUDIOOPENGL\DIRECTIONALLIGHT.CPP
/c /ID:\LAILIA\STUDIOOPENGL\/LIBRARIES/GLEW/INCLUDE/GL /ID:\LAILIA\STUDIOOPENGL\/LIBRARIES/GLFX/INCLUDE/ /ID:\LAILIA\STUDIOOPENGL\/LIBRARIES/ASSIMP/INCLUDE /ID:\LAILIA\STUDIOOPENGL\/LIBRARIES/GLM /ZI /JMC /nologo /W3 /WX- /diagnostics:column /sdl /Od /D _DEBUG /D _CONSOLE /D _UNICODE /D UNICODE /Gm- /EHsc /RTC1 /MDd /GS /fp:precise /permissive- /Zc:wchar_t /Zc:forScope /Zc:inline /Fo"X64\DEBUG\\" /Fd"X64\DEBUG\VC142.PDB" /Gd /TP /FC D:\LAILIA\STUDIOOPENGL\DIRECTIONALLIGHT.CPP
^D:\LAILIA\STUDIOOPENGL\LIGHT.CPP
/c /ID:\LAILIA\STUDIOOPENGL\/LIBRARIES/GLEW/INCLUDE/GL /ID:\LAILIA\STUDIOOPENGL\/LIBRARIES/GLFX/INCLUDE/ /ID:\LAILIA\STUDIOOPENGL\/LIBRARIES/ASSIMP/INCLUDE /ID:\LAILIA\STUDIOOPENGL\/LIBRARIES/GLM /ZI /JMC /nologo /W3 /WX- /diagnostics:column /sdl /Od /D _DEBUG /D _CONSOLE /D _UNICODE /D UNICODE /Gm- /EHsc /RTC1 /MDd /GS /fp:precise /permissive- /Zc:wchar_t /Zc:forScope /Zc:inline /Fo"X64\DEBUG\\" /Fd"X64\DEBUG\VC142.PDB" /Gd /TP /FC D:\LAILIA\STUDIOOPENGL\LIGHT.CPP
^D:\LAILIA\STUDIOOPENGL\MAIN.CPP
/c /ID:\LAILIA\STUDIOOPENGL\/LIBRARIES/GLEW/INCLUDE/GL /ID:\LAILIA\STUDIOOPENGL\/LIBRARIES/GLFX/INCLUDE/ /ID:\LAILIA\STUDIOOPENGL\/LIBRARIES/ASSIMP/INCLUDE /ID:\LAILIA\STUDIOOPENGL\/LIBRARIES/GLM /ZI /JMC /nologo /W3 /WX- /diagnostics:column /sdl /Od /D _DEBUG /D _CONSOLE /D _UNICODE /D UNICODE /Gm- /EHsc /RTC1 /MDd /GS /fp:precise /permissive- /Zc:wchar_t /Zc:forScope /Zc:inline /Fo"X64\DEBUG\\" /Fd"X64\DEBUG\VC142.PDB" /Gd /TP /FC D:\LAILIA\STUDIOOPENGL\MAIN.CPP
^D:\LAILIA\STUDIOOPENGL\MATERIAL.CPP
/c /ID:\LAILIA\STUDIOOPENGL\/LIBRARIES/GLEW/INCLUDE/GL /ID:\LAILIA\STUDIOOPENGL\/LIBRARIES/GLFX/INCLUDE/ /ID:\LAILIA\STUDIOOPENGL\/LIBRARIES/ASSIMP/INCLUDE /ID:\LAILIA\STUDIOOPENGL\/LIBRARIES/GLM /ZI /JMC /nologo /W3 /WX- /diagnostics:column /sdl /Od /D _DEBUG /D _CONSOLE /D _UNICODE /D UNICODE /Gm- /EHsc /RTC1 /MDd /GS /fp:precise /permissive- /Zc:wchar_t /Zc:forScope /Zc:inline /Fo"X64\DEBUG\\" /Fd"X64\DEBUG\VC142.PDB" /Gd /TP /FC D:\LAILIA\STUDIOOPENGL\MATERIAL.CPP
^D:\LAILIA\STUDIOOPENGL\MESH.CPP
/c /ID:\LAILIA\STUDIOOPENGL\/LIBRARIES/GLEW/INCLUDE/GL /ID:\LAILIA\STUDIOOPENGL\/LIBRARIES/GLFX/INCLUDE/ /ID:\LAILIA\STUDIOOPENGL\/LIBRARIES/ASSIMP/INCLUDE /ID:\LAILIA\STUDIOOPENGL\/LIBRARIES/GLM /ZI /JMC /nologo /W3 /WX- /diagnostics:column /sdl /Od /D _DEBUG /D _CONSOLE /D _UNICODE /D UNICODE /Gm- /EHsc /RTC1 /MDd /GS /fp:precise /permissive- /Zc:wchar_t /Zc:forScope /Zc:inline /Fo"X64\DEBUG\\" /Fd"X64\DEBUG\VC142.PDB" /Gd /TP /FC D:\LAILIA\STUDIOOPENGL\MESH.CPP
^D:\LAILIA\STUDIOOPENGL\MODEL.CPP
/c /ID:\LAILIA\STUDIOOPENGL\/LIBRARIES/GLEW/INCLUDE/GL /ID:\LAILIA\STUDIOOPENGL\/LIBRARIES/GLFX/INCLUDE/ /ID:\LAILIA\STUDIOOPENGL\/LIBRARIES/ASSIMP/INCLUDE /ID:\LAILIA\STUDIOOPENGL\/LIBRARIES/GLM /ZI /JMC /nologo /W3 /WX- /diagnostics:column /sdl /Od /D _DEBUG /D _CONSOLE /D _UNICODE /D UNICODE /Gm- /EHsc /RTC1 /MDd /GS /fp:precise /permissive- /Zc:wchar_t /Zc:forScope /Zc:inline /Fo"X64\DEBUG\\" /Fd"X64\DEBUG\VC142.PDB" /Gd /TP /FC D:\LAILIA\STUDIOOPENGL\MODEL.CPP
^D:\LAILIA\STUDIOOPENGL\OMNISHADOWMAP.CPP
/c /ID:\LAILIA\STUDIOOPENGL\/LIBRARIES/GLEW/INCLUDE/GL /ID:\LAILIA\STUDIOOPENGL\/LIBRARIES/GLFX/INCLUDE/ /ID:\LAILIA\STUDIOOPENGL\/LIBRARIES/ASSIMP/INCLUDE /ID:\LAILIA\STUDIOOPENGL\/LIBRARIES/GLM /ZI /JMC /nologo /W3 /WX- /diagnostics:column /sdl /Od /D _DEBUG /D _CONSOLE /D _UNICODE /D UNICODE /Gm- /EHsc /RTC1 /MDd /GS /fp:precise /permissive- /Zc:wchar_t /Zc:forScope /Zc:inline /Fo"X64\DEBUG\\" /Fd"X64\DEBUG\VC142.PDB" /Gd /TP /FC D:\LAILIA\STUDIOOPENGL\OMNISHADOWMAP.CPP
^D:\LAILIA\STUDIOOPENGL\POINTLIGHT.CPP
/c /ID:\LAILIA\STUDIOOPENGL\/LIBRARIES/GLEW/INCLUDE/GL /ID:\LAILIA\STUDIOOPENGL\/LIBRARIES/GLFX/INCLUDE/ /ID:\LAILIA\STUDIOOPENGL\/LIBRARIES/ASSIMP/INCLUDE /ID:\LAILIA\STUDIOOPENGL\/LIBRARIES/GLM /ZI /JMC /nologo /W3 /WX- /diagnostics:column /sdl /Od /D _DEBUG /D _CONSOLE /D _UNICODE /D UNICODE /Gm- /EHsc /RTC1 /MDd /GS /fp:precise /permissive- /Zc:wchar_t /Zc:forScope /Zc:inline /Fo"X64\DEBUG\\" /Fd"X64\DEBUG\VC142.PDB" /Gd /TP /FC D:\LAILIA\STUDIOOPENGL\POINTLIGHT.CPP
^D:\LAILIA\STUDIOOPENGL\SHADER.CPP
/c /ID:\LAILIA\STUDIOOPENGL\/LIBRARIES/GLEW/INCLUDE/GL /ID:\LAILIA\STUDIOOPENGL\/LIBRARIES/GLFX/INCLUDE/ /ID:\LAILIA\STUDIOOPENGL\/LIBRARIES/ASSIMP/INCLUDE /ID:\LAILIA\STUDIOOPENGL\/LIBRARIES/GLM /ZI /JMC /nologo /W3 /WX- /diagnostics:column /sdl /Od /D _DEBUG /D _CONSOLE /D _UNICODE /D UNICODE /Gm- /EHsc /RTC1 /MDd /GS /fp:precise /permissive- /Zc:wchar_t /Zc:forScope /Zc:inline /Fo"X64\DEBUG\\" /Fd"X64\DEBUG\VC142.PDB" /Gd /TP /FC D:\LAILIA\STUDIOOPENGL\SHADER.CPP
^D:\LAILIA\STUDIOOPENGL\SHADOWMAP.CPP
/c /ID:\LAILIA\STUDIOOPENGL\/LIBRARIES/GLEW/INCLUDE/GL /ID:\LAILIA\STUDIOOPENGL\/LIBRARIES/GLFX/INCLUDE/ /ID:\LAILIA\STUDIOOPENGL\/LIBRARIES/ASSIMP/INCLUDE /ID:\LAILIA\STUDIOOPENGL\/LIBRARIES/GLM /ZI /JMC /nologo /W3 /WX- /diagnostics:column /sdl /Od /D _DEBUG /D _CONSOLE /D _UNICODE /D UNICODE /Gm- /EHsc /RTC1 /MDd /GS /fp:precise /permissive- /Zc:wchar_t /Zc:forScope /Zc:inline /Fo"X64\DEBUG\\" /Fd"X64\DEBUG\VC142.PDB" /Gd /TP /FC D:\LAILIA\STUDIOOPENGL\SHADOWMAP.CPP
^D:\LAILIA\STUDIOOPENGL\SKYBOX.CPP
/c /ID:\LAILIA\STUDIOOPENGL\/LIBRARIES/GLEW/INCLUDE/GL /ID:\LAILIA\STUDIOOPENGL\/LIBRARIES/GLFX/INCLUDE/ /ID:\LAILIA\STUDIOOPENGL\/LIBRARIES/ASSIMP/INCLUDE /ID:\LAILIA\STUDIOOPENGL\/LIBRARIES/GLM /ZI /JMC /nologo /W3 /WX- /diagnostics:column /sdl /Od /D _DEBUG /D _CONSOLE /D _UNICODE /D UNICODE /Gm- /EHsc /RTC1 /MDd /GS /fp:precise /permissive- /Zc:wchar_t /Zc:forScope /Zc:inline /Fo"X64\DEBUG\\" /Fd"X64\DEBUG\VC142.PDB" /Gd /TP /FC D:\LAILIA\STUDIOOPENGL\SKYBOX.CPP
^D:\LAILIA\STUDIOOPENGL\SPOTLIGHT.CPP
/c /ID:\LAILIA\STUDIOOPENGL\/LIBRARIES/GLEW/INCLUDE/GL /ID:\LAILIA\STUDIOOPENGL\/LIBRARIES/GLFX/INCLUDE/ /ID:\LAILIA\STUDIOOPENGL\/LIBRARIES/ASSIMP/INCLUDE /ID:\LAILIA\STUDIOOPENGL\/LIBRARIES/GLM /ZI /JMC /nologo /W3 /WX- /diagnostics:column /sdl /Od /D _DEBUG /D _CONSOLE /D _UNICODE /D UNICODE /Gm- /EHsc /RTC1 /MDd /GS /fp:precise /permissive- /Zc:wchar_t /Zc:forScope /Zc:inline /Fo"X64\DEBUG\\" /Fd"X64\DEBUG\VC142.PDB" /Gd /TP /FC D:\LAILIA\STUDIOOPENGL\SPOTLIGHT.CPP
^D:\LAILIA\STUDIOOPENGL\TEXTURE.CPP
/c /ID:\LAILIA\STUDIOOPENGL\/LIBRARIES/GLEW/INCLUDE/GL /ID:\LAILIA\STUDIOOPENGL\/LIBRARIES/GLFX/INCLUDE/ /ID:\LAILIA\STUDIOOPENGL\/LIBRARIES/ASSIMP/INCLUDE /ID:\LAILIA\STUDIOOPENGL\/LIBRARIES/GLM /ZI /JMC /nologo /W3 /WX- /diagnostics:column /sdl /Od /D _DEBUG /D _CONSOLE /D _UNICODE /D UNICODE /Gm- /EHsc /RTC1 /MDd /GS /fp:precise /permissive- /Zc:wchar_t /Zc:forScope /Zc:inline /Fo"X64\DEBUG\\" /Fd"X64\DEBUG\VC142.PDB" /Gd /TP /FC D:\LAILIA\STUDIOOPENGL\TEXTURE.CPP
^D:\LAILIA\STUDIOOPENGL\WINDOW.CPP
/c /ID:\LAILIA\STUDIOOPENGL\/LIBRARIES/GLEW/INCLUDE/GL /ID:\LAILIA\STUDIOOPENGL\/LIBRARIES/GLFX/INCLUDE/ /ID:\LAILIA\STUDIOOPENGL\/LIBRARIES/ASSIMP/INCLUDE /ID:\LAILIA\STUDIOOPENGL\/LIBRARIES/GLM /ZI /JMC /nologo /W3 /WX- /diagnostics:column /sdl /Od /D _DEBUG /D _CONSOLE /D _UNICODE /D UNICODE /Gm- /EHsc /RTC1 /MDd /GS /fp:precise /permissive- /Zc:wchar_t /Zc:forScope /Zc:inline /Fo"X64\DEBUG\\" /Fd"X64\DEBUG\VC142.PDB" /Gd /TP /FC D:\LAILIA\STUDIOOPENGL\WINDOW.CPP
