^D:\LAILIA\STUDIOOPENGL\CAMERA.CPP|D:\LAILIA\STUDIOOPENGL\DIRECTIONALLIGHT.CPP|D:\LAILIA\STUDIOOPENGL\LIGHT.CPP|D:\LAILIA\STUDIOOPENGL\MAIN.CPP|D:\LAILIA\STUDIOOPENGL\MATERIAL.CPP|D:\LAILIA\STUDIOOPENGL\MESH.CPP|D:\LAILIA\STUDIOOPENGL\MODEL.CPP|D:\LAILIA\STUDIOOPENGL\OMNISHADOWMAP.CPP|D:\LAILIA\STUDIOOPENGL\POINTLIGHT.CPP|D:\LAILIA\STUDIOOPENGL\SHADER.CPP|D:\LAILIA\STUDIOOPENGL\SHADOWMAP.CPP|D:\LAILIA\STUDIOOPENGL\SKYBOX.CPP|D:\LAILIA\STUDIOOPENGL\SPOTLIGHT.CPP|D:\LAILIA\STUDIOOPENGL\TEXTURE.CPP|D:\LAILIA\STUDIOOPENGL\WINDOW.CPP
D:\LAILIA\STUDIOOPENGL\X64\DEBUG\VC142.PDB
D:\LAILIA\STUDIOOPENGL\X64\DEBUG\VC142.IDB
D:\LAILIA\STUDIOOPENGL\X64\DEBUG\WINDOW.OBJ
D:\LAILIA\STUDIOOPENGL\X64\DEBUG\TEXTURE.OBJ
D:\LAILIA\STUDIOOPENGL\X64\DEBUG\SPOTLIGHT.OBJ
D:\LAILIA\STUDIOOPENGL\X64\DEBUG\SKYBOX.OBJ
D:\LAILIA\STUDIOOPENGL\X64\DEBUG\SHADOWMAP.OBJ
D:\LAILIA\STUDIOOPENGL\X64\DEBUG\SHADER.OBJ
D:\LAILIA\STUDIOOPENGL\X64\DEBUG\POINTLIGHT.OBJ
D:\LAILIA\STUDIOOPENGL\X64\DEBUG\OMNISHADOWMAP.OBJ
D:\LAILIA\STUDIOOPENGL\X64\DEBUG\MODEL.OBJ
D:\LAILIA\STUDIOOPENGL\X64\DEBUG\MESH.OBJ
D:\LAILIA\STUDIOOPENGL\X64\DEBUG\MATERIAL.OBJ
D:\LAILIA\STUDIOOPENGL\X64\DEBUG\MAIN.OBJ
D:\LAILIA\STUDIOOPENGL\X64\DEBUG\LIGHT.OBJ
D:\LAILIA\STUDIOOPENGL\X64\DEBUG\DIRECTIONALLIGHT.OBJ
D:\LAILIA\STUDIOOPENGL\X64\DEBUG\CAMERA.OBJ
^D:\LAILIA\STUDIOOPENGL\CAMERA.CPP
D:\LAILIA\STUDIOOPENGL\X64\DEBUG\VC142.PDB
^D:\LAILIA\STUDIOOPENGL\DIRECTIONALLIGHT.CPP
D:\LAILIA\STUDIOOPENGL\X64\DEBUG\VC142.PDB
^D:\LAILIA\STUDIOOPENGL\LIGHT.CPP
D:\LAILIA\STUDIOOPENGL\X64\DEBUG\VC142.PDB
^D:\LAILIA\STUDIOOPENGL\MAIN.CPP
D:\LAILIA\STUDIOOPENGL\X64\DEBUG\VC142.PDB
^D:\LAILIA\STUDIOOPENGL\MATERIAL.CPP
D:\LAILIA\STUDIOOPENGL\X64\DEBUG\VC142.PDB
^D:\LAILIA\STUDIOOPENGL\MESH.CPP
D:\LAILIA\STUDIOOPENGL\X64\DEBUG\VC142.PDB
^D:\LAILIA\STUDIOOPENGL\MODEL.CPP
D:\LAILIA\STUDIOOPENGL\X64\DEBUG\VC142.PDB
^D:\LAILIA\STUDIOOPENGL\OMNISHADOWMAP.CPP
D:\LAILIA\STUDIOOPENGL\X64\DEBUG\VC142.PDB
^D:\LAILIA\STUDIOOPENGL\POINTLIGHT.CPP
D:\LAILIA\STUDIOOPENGL\X64\DEBUG\VC142.PDB
^D:\LAILIA\STUDIOOPENGL\SHADER.CPP
D:\LAILIA\STUDIOOPENGL\X64\DEBUG\VC142.PDB
^D:\LAILIA\STUDIOOPENGL\SHADOWMAP.CPP
D:\LAILIA\STUDIOOPENGL\X64\DEBUG\VC142.PDB
^D:\LAILIA\STUDIOOPENGL\SKYBOX.CPP
D:\LAILIA\STUDIOOPENGL\X64\DEBUG\VC142.PDB
^D:\LAILIA\STUDIOOPENGL\SPOTLIGHT.CPP
D:\LAILIA\STUDIOOPENGL\X64\DEBUG\VC142.PDB
^D:\LAILIA\STUDIOOPENGL\TEXTURE.CPP
D:\LAILIA\STUDIOOPENGL\X64\DEBUG\VC142.PDB
^D:\LAILIA\STUDIOOPENGL\WINDOW.CPP
D:\LAILIA\STUDIOOPENGL\X64\DEBUG\VC142.PDB
