^D:\LAILIA\STUDIOOPENGL\DEBUG\CAMERA.OBJ|D:\LAILIA\STUDIOOPENGL\DEBUG\DIRECTIONALLIGHT.OBJ|D:\LAILIA\STUDIOOPENGL\DEBUG\LIGHT.OBJ|D:\LAILIA\STUDIOOPENGL\DEBUG\MAIN.OBJ|D:\LAILIA\STUDIOOPENGL\DEBUG\MATERIAL.OBJ|D:\LAILIA\STUDIOOPENGL\DEBUG\MESH.OBJ|D:\LAILIA\STUDIOOPENGL\DEBUG\MODEL.OBJ|D:\LAILIA\STUDIOOPENGL\DEBUG\OMNISHADOWMAP.OBJ|D:\LAILIA\STUDIOOPENGL\DEBUG\POINTLIGHT.OBJ|D:\LAILIA\STUDIOOPENGL\DEBUG\SHADER.OBJ|D:\LAILIA\STUDIOOPENGL\DEBUG\SHADOWMAP.OBJ|D:\LAILIA\STUDIOOPENGL\DEBUG\SKYBOX.OBJ|D:\LAILIA\STUDIOOPENGL\DEBUG\SPOTLIGHT.OBJ|D:\LAILIA\STUDIOOPENGL\DEBUG\TEXTURE.OBJ|D:\LAILIA\STUDIOOPENGL\DEBUG\WINDOW.OBJ
D:\LAILIA\STUDIOOPENGL\DEBUG\MINISTUDIO.EXE
D:\LAILIA\STUDIOOPENGL\DEBUG\MINISTUDIO.ILK
D:\LAILIA\STUDIOOPENGL\DEBUG\MINISTUDIO.PDB
