                      <svg width="48" height="48" viewBox="0 0 16 16" class="bi bi-arrow-up" fill="currentColor" xmlns="http://www.w3.org/2000/svg">
                        <path fill-rule="evenodd" d="M8 3.5a.5.5 0 0 1 .5.5v9a.5.5 0 0 1-1 0V4a.5.5 0 0 1 .5-.5z"/>
                        <path fill-rule="evenodd" d="M7.646 2.646a.5.5 0 0 1 .708 0l3 3a.5.5 0 0 1-.708.708L8 3.707 5.354 6.354a.5.5 0 1 1-.708-.708l3-3z"/>
                      </svg>
